##TITLE=1H_Pr NCO-1Bn
 200.13MHz, CDCl3,
 8 sc
 
 2.4.2025
##JCAMPDX= 6.0         $$ Bruker NMR JCAMP-DX V2.0
##DATA TYPE= NMR FID
##DATA CLASS= NTUPLES
##ORIGIN= UXNMR, Bruker Analytische Messtechnik GmbH
##OWNER= pz
$$ XWIN-NMR		Version 3.5
$$ Wed Apr  2 14:05:55 2025 Russian Standard Time (UT+4h)  she@DPX200
##.OBSERVE FREQUENCY= 200.1313
##.OBSERVE NUCLEUS= ^1H
##.DELAY= (6, 6)
##.ACQUISITION MODE= SIMULTANEOUS
##.ACQUISITION SCHEME= undefined
##.AVERAGES= 8
##.DIGITISER RES= 18
##SPECTROMETER/DATA SYSTEM= spect
##.PULSE SEQUENCE= zg30
##.SOLVENT NAME= CDCl3
##.SHIFT REFERENCE= (INTERNAL, CDCl3, 0, 14.3821)
##AUDIT TRAIL= $$ (NUMBER, WHEN, WHO, WHERE, WHAT)
$$ ##TITLE= Audit trail, XWIN-NMR		Version 3.5
$$ ##JCAMPDX= 5.01
$$ ##ORIGIN= Bruker BioSpin GmbH
$$ ##OWNER= she
$$ F:/spectra/data/she/nmr/H-C/1/audita.txt
$$ ##AUDIT TRAIL=  $$ (NUMBER, WHEN, WHO, WHERE, WHAT)
(   1,<2025-04-02 14:04:34.39 +0400>,<she>,<DPX200>,
      <created by zg, POWCHK disabled, PULCHK disabled
       configuration hash MD5:
       00 E9 B6 7A A2 85 ED C7 34 08 36 98 17 FE 4E 26
       data hash MD5: 16K
       B8 5B FD A0 4C 06 BC D4 4F 17 34 43 FD FF 62 E0>)
$$ ##END=
$$ 
$$ hash MD5
$$ 6D 72 CC D5 0B 36 C6 D8 DE 3C 04 4B 45 49 E4 48
##$RELAX= 
##$RELAX= 
##$RELAX= 
##$RELAX= 
##$RELAX= 
##$RELAX= 
$$ Bruker specific parameters
$$ --------------------------
##$DU= <F:/spectra>
##$EXPNO= 1
##$NAME= <H-C>
##$PROCNO= 1
##$TYPE= <nmr>
##$USER= <she>
##$AMP= (0..31)
100 100 100 100 100 100 100 100 100 100 100 100 100 100 100 100 100 100 
100 100 100 100 100 100 100 100 100 100 100 100 100 100 
##$AQSEQ= 0
##$AQ_mod= 1
##$AUNM= <au_zg>
##$AUTOPOS= <>
##$BF1= 200.13
##$BF2= 200.13
##$BF3= 200.13
##$BF4= 200.13
##$BF5= 200.13
##$BF6= 200.13
##$BF7= 200.13
##$BF8= 200.13
##$BYTORDA= 1
##$CFDGTYP= 0
##$CFRGTYP= 5
##$CHEMSTR= <none>
##$CNST= (0..31)
1 1 145 1 1 1 1 1 1 1 1 1 1 1 1 1 1 1 1 1 1 1 1 1 1 1 1 1 1 1 1 1 
##$CPDPRG= <>
##$CPDPRG1= <>
##$CPDPRG2= <>
##$CPDPRG3= <>
##$CPDPRG4= <mlev>
##$CPDPRG5= <mlev>
##$CPDPRG6= <mlev>
##$CPDPRG7= <mlev>
##$CPDPRG8= <mlev>
##$CPDPRGB= <>
##$CPDPRGT= <>
##$D= (0..31)
0 0.7 0 0 0 0 0 0 0 0 0 0.03 0 0 0 0 0 0 0 0 0 0 0 0 0 0 0 0 0 0 0 0 
##$DATE= 1743588273
##$DBL= (0..7)
120 120 120 120 120 120 120 120 
##$DBP= (0..7)
150 150 150 150 150 150 150 150 
##$DBP07= 0
##$DBPNAM0= <>
##$DBPNAM1= <>
##$DBPNAM2= <>
##$DBPNAM3= <>
##$DBPNAM4= <>
##$DBPNAM5= <>
##$DBPNAM6= <>
##$DBPNAM7= <>
##$DBPOAL= (0..7)
0.5 0.5 0.5 0.5 0.5 0.5 0.5 0.5 
##$DBPOFFS= (0..7)
0 0 0 0 0 0 0 0 
##$DE= 6
##$DECBNUC= <off>
##$DECIM= 32
##$DECNUC= <off>
##$DECSTAT= 4
##$DIGMOD= 1
##$DIGTYP= 9
##$DL= (0..7)
0 120 120 120 120 120 120 120 
##$DP= (0..7)
150 150 150 150 150 150 150 150 
##$DP07= 0
##$DPNAME0= <>
##$DPNAME1= <>
##$DPNAME2= <>
##$DPNAME3= <>
##$DPNAME4= <>
##$DPNAME5= <>
##$DPNAME6= <>
##$DPNAME7= <>
##$DPOAL= (0..7)
0.5 0.5 0.5 0.5 0.5 0.5 0.5 0.5 
##$DPOFFS= (0..7)
0 0 0 0 0 0 0 0 
##$DQDMODE= 0
##$DR= 18
##$DS= 0
##$DSLIST= <SSSSSSSSSSSSSSS>
$$ [...]
##$SUBNAM0= <"">
##$SUBNAM1= <"">
##$SUBNAM2= <"">
##$SUBNAM3= <"">
##$SUBNAM4= <"">
##$SUBNAM5= <"">
##$SUBNAM6= <"">
##$SUBNAM7= <"">
##$SUBNAM8= <"">
##$SUBNAM9= <"">
##$SW= 18.0517328524113
##$SWIBOX= (0..15)
0 0 2 0 0 0 0 0 0 0 0 0 0 0 0 0 
##$SW_h= 3612.71676300578
##$TD= 16384
##$TD0= 1
##$TE= 0
##$TE2= 300
##$TE3= 300
##$TEG= 300
##$TL= (0..7)
0 120 120 120 120 120 120 120 
##$TP= (0..7)
150 150 150 150 150 150 150 150 
##$TP07= 0
##$TPNAME0= <>
##$TPNAME1= <>
##$TPNAME2= <>
##$TPNAME3= <>
##$TPNAME4= <>
##$TPNAME5= <>
##$TPNAME6= <>
##$TPNAME7= <>
##$TPOAL= (0..7)
0.5 0.5 0.5 0.5 0.5 0.5 0.5 0.5 
##$TPOFFS= (0..7)
0 0 0 0 0 0 0 0 
##$TUNHIN= 0
##$TUNHOUT= 0
##$TUNXOUT= 0
##$USERA1= <user>
##$USERA2= <user>
##$USERA3= <user>
##$USERA4= <user>
##$USERA5= <user>
##$V9= 5
##$VALIST= <valist>
##$VCLIST= <CCCCCCCCCCCCCCC>
##$VD= 0
##$VDLIST= <DDDDDDDDDDDDDDD>
##$VPLIST= <PPPPPPPPPPPPPPP>
##$VTLIST= <TTTTTTTTTTTTTTT>
##$WBST= 1024
##$WBSW= 4
##$XGAIN= (0..3)
0 0 0 0 
##$XL= 0
##$YL= 0
##$YMAX_a= 128999
##$YMIN_a= -144517
##$ZGOPTNS= <>
##$ZL1= 120
##$ZL2= 120
##$ZL3= 120
##$ZL4= 120
##$ABSF1= 10
##$ABSF2= 0
##$ABSG= 5
##$ABSL= 3
##$ALPHA= 0
##$AQORDER= 0
##$ASSFAC= 0
##$ASSFACI= 0
##$ASSFACX= 0
##$ASSWID= 0
##$AUNMP= <proc_1d>
##$AZFE= 0.1
##$AZFW= 0.1
##$BCFW= 1
##$BC_mod= 2
##$BYTORDP= 1
##$COROFFS= 0
##$CY= -3
##$DATMOD= 1
##$DC= 2
##$DFILT= <>
##$DTYPP= 0
##$F1P= 0
##$F2P= 0
##$FCOR= 0.5
##$FTSIZE= 0
##$FT_mod= 4
##$GAMMA= 1
##$GB= 0.15
##$INTBC= 1
##$INTSCL= 1
##$ISEN= 128
##$LB= 0.25
##$LEV0= 0
##$LPBIN= 0
##$MAXI= 10000
##$MC2= 0
##$MEAN= 0
##$ME_mod= 0
##$MI= 1.114404
##$NCOEF= 0
##$NC_proc= 0
##$NLEV= 6
##$NOISF1= 3.799351
##$NOISF2= 2.8
##$NSP= 1
##$NTH_PI= 0
##$NZP= 0
##$OFFSET= 14.38212
##$PC= 1
##$PHC0= -626.7487
##$PHC1= 3.992206
##$PH_mod= 1
##$PKNL= yes
##$PPARMOD= 0
##$PSCAL= 0
##$PSIGN= 0
##$REVERSE= no
##$SF= 200.129724274929
##$SI= 16384
##$SIGF1= 3
##$SIGF2= 2
##$SINO= 400
##$SIOLD= 16384
##$SREGLST= <1H.CDCl3>
##$SSB= 0
##$STSI= 0
##$STSR= 0
##$SW_p= 3205.1282051282
##$SYMM= 0
##$S_DEV= 0
##$TDeff= 0
##$TDoff= 0
##$TI= <>
##$TILT= no
##$TM1= 0
##$TM2= 0
##$TOPLEV= 0
##$USERP1= <user>
##$USERP2= <user>
##$USERP3= <user>
##$USERP4= <user>
##$USERP5= <user>
##$WDW= 1
##$XDIM= 8192
##$YMAX_p= 0
##$YMIN_p= 0
$$ End of Bruker specific parameters
$$ ---------------------------------
##NTUPLES= NMR FID
##VAR_NAME=  TIME,          FID/REAL,        FID/IMAG
##SYMBOL=    X,             R,               I
##VAR_TYPE=  INDEPENDENT,   DEPENDENT,       DEPENDENT
##VAR_FORM=  AFFN,          ASDF,            ASDF
##VAR_DIM=   8192,          8192,            8192
##UNITS=     SECONDS,       ARBITRARY UNITS, ARBITRARY UNITS
##FACTOR=    0.0002768,     1,               1
##FIRST=     0,             0,               0
##LAST=      2.2672688,     0,               0
##MIN=       0,             -144517,         0
##MAX=       2.2672688,     128999,          0
$$ Real data points
##PAGE= N=1
##DATA TABLE= (X++(R..R)), XYDATA
0 0 0 0 0 0 0 0 0 0 0 0 0 0 0 0 0 0 0 0 0 -5 8 -8 8 -8 8 -8 11 -16 16 -16 20 -24 24 -29 32 -35 40 -44 49 -53 60
41 60 -66 72 -79 87 -95 107 -119 128 -143 157 -173 189 -211 234 -262 293 -330 374 -430 500 -589
62 -589 709 -877 1126 -1523 2230 -3726 8033 -42847 -144517 60405 1573 -134671 75523
75 75523 89564 -104582 13595 69686 -124632 -40916 108543 -38295 -19977 128999 -22329
86 -22329 -93121 58143 -19067 -93412 74573 59252 -64995 34533 40080 -103677 -26523 59409
98 59409 -45818 -3844 93737 -24419 -59038 36051 -33132 -68110 52948 39333 -29256 37239
110 37239 27048 -66529 -20304 27672 -26037 9419 63683 -4788 -27340 7019 -36161 -44801
122 -44801 16387 16453 -893 21171 3588 -38189 -28717 -10955 -14337 10141 33273 14924 -1492
135 -1492 -8038 -22348 -22243 -5443 15205 22019 9588 4551 -9928 -38440 -25835 563 -3797
148 -3797 12060 35099 3003 -22913 -2409 -14121 -27409 24297 36768 -2003 16559 13490
160 13490 -46390 -28881 9908 -17344 920 44232 725 -28182 4180 -20810 -41432 21055
172 21055 28725 -7647 26218 18876 -43546 -18489 9451 -23432 6987 47627 623 -15332
184 -15332 12882 -25015 -40666 19163 16876 -10303 30046 16575 -40941 -14666 2468 -28798
196 -28798 6551 42931 4221 -2785 16850 -20993 -31757 14157 11219 -233 32377 16118
208 16118 -25037 -10616 -9278 -27859 3072 25310 4007 4148 7631 -22640 -26082 1150 1554
221 1554 6564 30209 16202 -7794 -4351 -11252 -17337 4300 18846 14299 11672 4453 -14152 -22507
235 -22507 -12924 -3262 5719 16428 14096 1629 -10092 -16008 -11678 -3905 8605 21976 15980 3736
249 3736 -572 -12958 -17543 -745 9446 10459 16704 10406 -11036 -15909 -10265 -12744 398 19881
263 19881 11345 2337 3833 -13966 -21547 -1029 6347 6742 22328 17291 -7673 -8638 -5508 -16786
277 -16786 -1462 21168 9607 4222 9452 -13037 -24550 -5039 -453 -834 18376 17495 -5449
290 -5449 -6705 -4454 -17227 -4211 18142 10964 8688 13519 -7048 -18999 -5618 -3452 -1615 16199
304 16199 15884 -2044 -4725 -7369 -19477 -8487 10845 8264 9522 14653 -3404 -15865 -7044 -4988
318 -4988 -2805 14501 18321 3881 -784 -4176 -16802 -11683 5074 6973 8155 12383 -192 -13589
332 -13589 -11208 -8011 -4588 8736 15962 7879 1723 -2964 -12884 -10685 1717 6768 10682 13442
346 13442 3514 -8139 -10600 -10406 -6981 4284 11950 8532 3008 -3022 -12212 -12896 -3659 3531 9557
361 9557 13025 7226 -2290 -8730 -9835 -5392 2065 9716 12024 6026 -2491 -8454 -12165 -9713 440
376 440 8583 8579 7089 1724 -9642 -12338 -5420 -1172 5588 14293 9600 -849 -3708 -8592 -11860 -660
392 -660 8677 6819 8968 6128 -8979 -12160 -5578 -6533 827 13461 7815 -1014 51 -8017 -14412
407 -14412 -621 7539 3866 11432 10727 -7535 -9459 -3095 -9084 -1449 14448 7631 -108 3490
421 3490 -7951 -16663 -2613 3590 943 11857 11356 -5807 -6892 -3747 -11159 -2159 12808 7008
435 7008 3880 7233 -6360 -13774 -2248 -361 -200 12244 9811 -3953 -3982 -5695 -12977 -3439 8086
450 8086 5135 5848 7085 -4951 -10820 -4288 -2737 704 10913 9790 1523 -1526 -6552 -10812 -4536
465 -4536 2896 5592 7937 5458 -2430 -7393 -8264 -5784 826 6442 8092 6197 -229 -6256 -7105 -5689
481 -5689 -668 7144 8949 5035 2009 -4168 -10438 -5788 664 1519 7619 9487 -1690 -5702 -3726
496 -3726 -8940 -4524 8778 7326 3233 7358 -1753 -12644 -4088 -7 -3649 7748 12043 -2599
510 -2599 -3686 -169 -11725 -7194 9004 3933 1792 10769 -1314 -13139 -1862 -1990 -7221 9004
524 9004 12295 -2952 865 2096 -13309 -6077 8849 1144 3262 13822 -1020 -11324 -141
537 -141 -4528 -9355 8775 10739 -2699 3802 2512 -13568 -6134 5673 -1392 3563 13364 -8
551 -8 -7979 -64 -5829 -9117 6797 8292 -990 4635 2116 -11953 -6201 2185 -2565 3532 11659
566 11659 1219 -4882 -448 -6115 -7860 4765 7421 2415 6074 3089 -8097 -6434 -537 -2099
580 -2099 2563 9436 4016 -2461 -1892 -5057 -7274 218 5868 4130 4285 3203 -4106 -7525 -3361 -861
596 -861 629 6074 6755 -859 -3417 -2681 -6468 -3342 5839 5194 2470 4675 -903 -8581 -4169 -27
612 -27 -2133 4241 9258 52 -3352 68 -6617 -6328 5570 4970 1006 6693 1905 -8938 -3898 397
628 397 -4455 2894 10077 119 -2675 1805 -6652 -7989 4581 4059 91 7510 3388 -8595 -3509
643 -3509 181 -5845 2103 10029 624 -1289 3048 -6589 -8405 3341 2429 -281 7983 4300 -6855
658 -6855 -2832 -447 -6668 942 9060 1221 -40 3870 -5616 -8139 1440 1079 -536 7219 4629
673 4629 -4543 -2453 -1420 -6189 -209 7129 2380 1279 3607 -4019 -7456 -614 246 -175 6174 5305
689 5305 -2285 -2257 -1977 -5802 -1736 5038 3129 2195 3355 -2049 -6308 -2399 -428 -685 4173 5528
705 5528 -139 -2229 -1566 -4769 -3200 3411 3669 2207 3350 -416 -5215 -3629 -832 -532 2671 5649
721 5649 1647 -1875 -1457 -4159 -4298 1559 3634 2371 3440 1290 -4168 -4230 -1322 -1207 1321 5507
737 5507 2811 -1052 -868 -3210 -4987 179 3329 1846 3208 2401 -3196 -4228 -1369 -1841 321 5040
753 5040 3160 -661 -286 -2669 -5038 -898 2661 1722 3099 3238 -2000 -3982 -1653 -2079 -696 4359
769 4359 3556 267 527 -1849 -5004 -1610 1641 1252 3129 3700 -1007 -3353 -1703 -2528 -1370 3508
785 3508 3449 941 1102 -1460 -4759 -2046 730 756 3082 3903 -236 -2330 -1821 -3146 -1800 2701 3179
802 3179 1613 1777 -802 -4146 -2481 -467 45 2813 3818 577 -1332 -1608 -3418 -1919 1710 2198
818 2198 2062 2528 -511 -3242 -2214 -1398 -480 2618 3344 1079 -154 -1517 -3545 -2226 858 1560 2604
835 2604 2975 -222 -2313 -2103 -2622 -828 2352 2753 1721 1082 -1212 -3326 -1881 -369 602 2618 2930
852 2930 232 -1156 -1656 -2952 -1236 1803 1966 1921 1891 -889 -2978 -1888 -966 -179 2578 2850 682
869 682 -308 -1473 -3194 -1468 1143 1537 2355 2273 -406 -2332 -1813 -1804 -628 2249 2672 1054 568 -953
887 -953 -2993 -1793 235 941 2012 2558 143 -1667 -1834 -1907 -1076 1616 2461 1382 749 -736 -2605
904 -2605 -1960 -286 757 1960 2489 858 -1189 -1767 -2027 -1437 810 2308 1603 1120 -23 -2090 -2374
921 -2374 -592 340 1261 2476 1437 -736 -1321 -1648 -1936 13 2016 1686 1061 554 -1534 -2614 -1174
938 -1174 203 646 2452 2018 -596 -1306 -1288 -2312 -577 1948 1700 1202 1313 -1106 -2563 -1167 -309
955 -309 -52 2099 2421 -54 -730 -863 -2453 -1170 1639 1192 1221 1798 -468 -2447 -1003 -619 -629 1891
973 1891 2261 127 -373 -793 -2667 -1534 1175 979 1072 2110 -93 -2224 -1141 -976 -1018 1471 2467 560
991 560 264 -264 -2363 -1683 606 751 935 2264 563 -1690 -1068 -1094 -1515 857 2340 650 429 198
1009 198 -2088 -1964 365 396 870 2335 857 -1409 -1091 -999 -1574 431 2160 860 542 507 -1768 -2068
1027 -2068 -265 80 311 2253 1326 -737 -561 -956 -1889 60 1730 842 945 967 -1175 -2010 -441 -323
1045 -323 26 2055 1329 -505 -545 -795 -1959 -391 1342 903 1094 1149 -880 -1720 -600 -576 -170 1695
1063 1695 1507 45 -176 -845 -1998 -827 754 676 1108 1366 -399 -1284 -903 -909 -262 1286 1362 450 -29
1082 -29 -730 -1546 -1021 182 648 1019 1289 110 -1254 -1165 -917 -379 733 1448 899 119 -508 -1266 -1346 -128
1102 -128 849 1020 1229 671 -648 -1240 -742 -411 132 1550 1199 213 -25 -753 -1571 -463 681 564 1061
1121 1061 1068 -588 -1402 -540 -719 -223 1484 1266 94 306 -489 -1813 -512 613 294 1164 1429 -436
1139 -436 -980 -347 -1137 -695 1394 1088 292 763 -358 -1751 -692 371 -239 1101 1581 -383 -608 -342
1157 -342 -1228 -752 1214 727 305 1009 -263 -1608 -567 -215 -352 1132 1489 -75 -289 -241 -1422 -806
1175 -806 877 656 530 1089 -83 -1373 -514 -537 -531 925 1318 355 143 -226 -1177 -877 251 332 749 1161
1195 1161 105 -762 -629 -651 -407 691 973 529 307 -185 -1011 -844 39 218 784 976 361 -446 -876
1214 -876 -752 -501 274 952 856 388 -67 -614 -956 -506 348 611 840 716 -118 -591 -710 -548 -117 687
1234 687 908 197 127 -362 -1146 -591 218 361 695 843 -53 -739 -507 -697 -341 730 944 218 417 -265
1254 -265 -1176 -617 88 -8 679 959 -11 -474 -244 -807 -523 665 635 295 542 -36 -996 -544 -138 -94 669
1275 669 994 16 -170 -293 -934 -554 376 510 303 760 -77 -736 -462 -322 -239 462 924 273 181 -187 -832
1296 -832 -670 101 248 481 806 25 -480 -384 -417 -368 383 703 367 279 -119 -784 -648 -63 264 477 765
1317 765 165 -298 -438 -593 -358 289 702 494 396 -55 -619 -524 -222 -49 607 846 458 -61 -330 -551 -532
1338 -532 61 532 503 354 161 -532 -623 -252 -238 232 622 379 37 -224 -433 -577 -92 403 486 602 163
1359 163 -358 -505 -343 -259 176 754 411 62 -108 -543 -688 17 187 243 575 355 -399 -246 -265 -464 180
1380 180 509 344 230 245 -608 -647 -82 68 203 683 336 -401 -175 -290 -678 141 598 276 286 336 -505
1401 -505 -626 -82 -248 138 731 380 -201 99 -439 -794 21 379 119 493 432 -376 -385 -113 -425 34 715
1422 715 196 -129 164 -399 -634 60 249 71 723 328 -364 -323 -143 -493 67 575 200 197 296 -423 -659
1443 -659 -202 -13 49 586 358 -194 -63 -216 -382 31 359 290 259 215 -294 -415 -91 -139 157 513 283 -27
1465 -27 -181 -290 -358 -168 152 432 268 287 -20 -363 -379 -174 78 285 423 177 -194 -263 -264 -434 9 445
1487 445 174 217 74 -419 -495 -39 157 121 475 249 -370 -86 -149 -449 21 576 131 89 355 -264 -482 154
1509 154 -67 -86 710 310 -375 196 -69 -601 92 561 -175 289 390 -526 -459 232 -327 -185 674 150 -173
1530 -173 197 -224 -668 60 247 -114 260 518 -446 -229 120 -403 -36 627 205 -129 354 -407 -544 52
1550 52 50 -53 497 403 -417 -143 19 -391 -14 434 124 -33 290 -207 -502 39 -39 25 518 333 -273 47
1572 47 -72 -388 -139 286 123 204 196 -159 -341 -123 -51 -115 409 317 116 -22 -154 -410 -171 101 270 342 173
1595 173 -56 -274 -207 -146 -32 109 192 145 -64 -19 -71 -87 117 115 105 206 117 -274 -255 -109 -48 117 258 260 -166
1620 -166 39 -74 -278 -26 335 78 150 267 -251 -294 -7 -146 -101 389 237 -104 71 -3 -434 -71 186
1641 186 73 139 339 -187 -403 33 -189 -167 260 122 -20 80 -104 -488 50 237 -31 333 418 -102 -336
1662 -336 60 -313 -208 490 114 -67 254 3 -427 -32 100 29 122 276 -111 -195 38 -263 -53 300 245
1683 245 -68 233 33 -214 -13 35 -124 -37 278 -134 -177 9 -226 -249 163 132 69 111 8 -235 -76 7 -41
1706 -41 175 223 70 -32 130 -151 -220 152 60 59 67 45 -204 -85 -41 -97 -34 237 183 -32 -52 -144 -221 31 97 112
1732 112 105 48 -47 -54 -50 -139 -115 166 14 -44 -65 -84 -274 -66 -11 126 195 113 -47 -27 44 -39 19 55 175 -22 -33
1759 -33 -105 3 -114 75 65 217 6 -10 -153 -104 -71 -48 83 142 87 -8 -22 -67 -26 -52 43 85 56 125 -97 -57
1785 -57 -36 -97 48 204 65 -61 46 -51 -265 -170 139 64 209 135 -65 -68 63 15 85 180 118 17 41 -48 -203
1810 -203 -37 -71 -20 122 217 -114 115 -105 -175 78 171 -44 61 74 61 -68 167 -12 -60 223 139 -8 35
1833 35 -151 -150 137 148 -83 164 86 -126 -6 -129 -73 -57 163 12 78 97 -173 -155 63 88 51 141 32 -201
1857 -201 -52 -134 -120 63 181 -18 56 -32 -157 -73 -52 -35 71 190 21 19 6 -129 -169 114 43 12 80 89 -283
1882 -283 -34 -2 -85 121 87 -79 106 52 -138 72 85 89 140 178 32 -74 19 -214 -76 110 -50 -57 185 -179
1906 -179 -187 6 79 -110 181 123 43 64 -135 -106 159 148 -114 194 12 -92 -41 26 -127 -97 150 33 82 6
1930 6 33 -216 -24 90 -47 151 95 -17 48 92 -156 -25 205 25 -91 255 -150 -81 -1 -59 -265 136 88
1953 88 -86 41 49 -334 -44 270 10 132 154 -144 -85 100 -94 8 132 -102 42 8 -113 -244 62 -5
1975 -5 -78 108 149 -11 -19 10 -112 37 175 26 8 69 -29 -234 -22 13 -19 68 26 -78 -167 -111 54 -19 35 108
2001 108 107 51 21 38 25 37 68 152 50 106 -28 -111 -52 -12 -64 -64 32 72 -57 -21 9 -65 51 71 -25 77 68 2 46
2030 46 -62 -2 32 143 9 41 -31 -143 -171 9 -113 -6 11 -116 -47 -95 -101 -80 217 -49 -10 185 -80 -151 -9
2055 -9 68 -2 119 121 -44 67 26 -68 27 59 -36 8 23 -80 -110 25 94 -106 110 80 -80 22 -20 -73 -86 10 -51
2082 -51 73 98 -64 -128 -71 108 -93 96 -15 -55 -10 -1 13 36 143 -62 147 111 -24 -100 -40 33 48 182 -55
2107 -55 -108 86 -37 -39 30 -112 -127 86 -8 -12 -106 -21 -75 -32 15 57 79 54 -84 -7 87 53 -30 51 16 20 85 -3 -94
2136 -94 10 -65 8 116 65 -23 21 -59 16 -15 76 1 -13 98 -103 -13 77 -131 49 12 111 5 -179 -20 -77 -7
2162 -7 138 34 -72 -64 61 -84 62 -43 12 102 14 52 81 80 6 -33 2 -34 -9 78 -30 -45 5 -30 13 59 111 22
2190 22 28 65 -22 76 87 9 -54 97 -22 -9 67 6 -127 21 -107 -69 -67 4 -184 -65 -26 -32 96 23 -17 -8 38 -92
2218 -92 43 55 80 -88 -53 -62 -37 -58 37 -12 43 3 44 -9 -120 18 89 3 40 83 -135 37 -1 -16 -75 -89 63
2245 63 81 44 -83 1 33 42 -16 -32 87 -4 37 35 -85 8 -5 -23 -15 82 -25 -2 121 69 84 43 49 -43 19 49 28 -89
2275 -89 -91 -34 -47 -79 8 -63 14 -79 69 -8 -166 78 -39 -62 -23 -96 1 -44 14 51 -25 -38 -51 -44 -10 109 -35 -46
2303 -46 84 3 77 -22 49 -65 69 38 56 53 42 -132 146 -70 -8 36 18 -31 43 -26 -23 19 26 33 -95 113 -117 -177
2331 -177 83 27 -71 24 -90 74 -7 -71 -62 -20 -35 -2 -54 62 -59 -102 40 15 -32 73 98 15 91 -15 -29 -19
2357 -19 -115 -72 38 96 -27 -100 -22 -12 -59 161 50 16 102 -51 -47 29 29 -168 120 124 39 74 -137 -22 -81 90 15
2384 15 -34 -24 20 -107 14 101 -109 35 -37 -16 106 -34 -122 -81 66 -38 -49 121 -15 108 42 -74 52 9
2408 9 106 15 43 -3 -66 63 -148 -70 -16 -25 -66 -24 19 18 39 -42 76 16 -47 -88 48 -140 -86 4 -23 46 84 -23 33
2437 33 -26 119 7 -11 102 -138 15 14 -66 -40 -2 -14 8 -21 67 18 -30 -22 72 -41 119 -35 -141 -30 -23 18 10
2464 10 -1 18 35 -6 63 105 12 -28 8 23 138 21 -33 -36 39 -9 -6 7 79 -79 41 32 -43 -44 -75 -46 0 23 -41 -86
2494 -86 0 -44 -22 160 -82 100 -38 -123 33 60 -5 -1 -52 15 44 -4 25 17 -23 43 -68 77 14 -57 112 92 -23
2521 -23 21 52 107 -72 17 -17 -3 -15 125 22 -55 66 -58 35 70 -59 35 -43 -24 9 7 72 23 -21 49 -31 3 132
2549 132 -2 -24 69 -37 -11 48 -81 14 -104 82 -4 79 18 -94 48 -34 34 -86 -7 -82 35 -27 -29 -83 88
2574 88 -56 -25 51 -34 83 -63 -37 83 34 4 49 -15 9 -32 27 0 -60 -12 46 -52 -69 5 16 -50 -9 25 39 12
2602 12 -13 53 -27 123 -8 59 70 22 -39 -75 39 130 -100 98 14 -27 52 -32 -85 31 -24 -10 31 -40 -54 -74 -70 -3
2630 -3 -2 67 50 29 -18 91 -66 101 -1 39 -19 99 50 -109 22 -25 -39 50 -15 -53 6 -28 -130 -23 58 -82
2656 -82 56 -130 -3 23 -100 76 -82 -167 10 70 43 118 -36 -149 62 58 1 38 11 -90 37 -116 -43 23
2680 23 76 31 -43 88 -48 -18 0 39 -50 2 -68 86 18 25 -15 2 38 14 14 -22 -18 -92 75 1 -18 31 7 18 60 40
2710 40 -36 -41 21 -141 -86 13 14 -80 -194 13 30 -52 -19 -54 32 117 -67 123 -44 12 -89 -52 -20 77 32 59 80 43
2738 43 -86 77 -53 -22 -20 -46 -88 78 -93 64 -92 -6 -2 -111 30 26 3 -63 -32 40 161 31 38 26 -46 -13 -50
2765 -50 -41 24 -31 132 81 119 -5 -21 90 -38 -15 8 -104 -61 -25 103 42 -88 11 27 58 -7 -105 46 11 5 -43
2792 -43 -42 67 -52 37 61 34 -32 52 0 -31 -82 -65 77 -104 42 -31 51 24 -50 57 -7 -68 -48 -50 -23 -35 51 -37
2820 -37 29 66 121 -14 -144 22 -75 80 -43 10 82 116 -49 63 -14 -30 79 12 -43 -86 61 54 61 26 -9 -9 -15 20
2848 20 -25 86 35 -12 84 68 -7 44 54 35 -50 27 24 37 -17 68 28 25 -110 -5 -52 69 -46 -54 20 -11 25 60 20
2877 20 35 -73 30 40 13 36 -75 -71 28 -2 -3 -60 -6 116 25 -74 -119 -30 114 57 -11 -36 -50 33 80 -54 -69 3
2905 3 -46 -72 47 60 2 4 1 -31 37 -9 -83 -57 -20 32 -44 -17 127 7 3 -7 -3 11 -46 83 -36 10 -4 -143 -88 -20
2935 -20 -13 34 79 3 105 -27 25 32 -63 -72 19 45 60 -91 8 -56 58 76 29 -45 48 -33 42 -10 -34 31 -48 -58 49
2964 49 -43 21 48 -1 26 -23 -137 -57 -13 -82 57 -35 34 18 18 -17 -96 8 35 32 -100 -15 41 -72 90 -71 59
2991 59 -37 -35 31 -26 97 124 5 23 -32 14 6 -49 53 -112 -45 62 -129 54 40 141 71 -116 6 -1 -45 -2 -42
3018 -42 -24 39 -40 -25 -43 29 4 44 48 -65 -97 -32 -91 -18 31 3 29 38 67 85 -13 -37 35 -41 -28 18 -18 43 30 -51 55
3049 55 62 -100 24 -3 -67 -61 -32 -6 103 6 94 2 103 59 -43 115 -29 -127 41 -1 -107 93 18 -49 103 23
3075 23 -104 -140 105 7 -39 -58 -75 -120 -90 5 -60 12 -41 -30 -16 -20 -77 110 33 -14 -62 222 91 -89 69 79 -9
3102 -9 -50 36 -11 -58 18 -18 -13 36 70 158 -38 4 -21 -17 -14 9 48 -12 61 -115 1 32 -92 83 6 14 48 -10 4 50
3132 50 56 85 -37 30 -71 -14 4 -48 70 -44 38 -123 44 -14 -81 -99 -64 -120 3 -8 8 -27 98 -89 -19 -23 9
3159 9 18 -66 40 -128 109 101 -85 -79 -127 18 -5 80 -111 52 95 104 -44 -4 20 -50 -1 11 22 68 102 29 10 -76 95
3188 95 37 56 3 95 19 15 -9 -2 127 37 -83 -24 -5 -102 1 -49 -53 54 61 -37 -22 79 -2 -12 -29 49 16 71 -40
3217 -40 7 -9 38 -34 27 -74 39 -207 23 72 40 99 17 22 18 94 -84 95 149 -137 59 13 24 84 56 93 -88
3244 -88 3 25 -67 -25 104 -75 -14 -3 -62 -93 49 -39 -43 44 160 -2 -50 144 -44 93 69 -50 55 40 3 -152
3270 -152 44 -22 26 -44 17 -25 -30 55 -36 -36 85 -22 -113 -113 -46 -39 47 6 -9 5 71 47 -6 -27 74 46 91 -88 -60
3299 -60 -92 -55 -83 77 -8 -4 108 -102 -106 -13 -39 -47 -20 103 -87 45 11 6 69 9 -2 60 -74 9 16 -140 -15 71
3327 71 -11 -40 -87 -43 23 50 -100 74 -88 -78 60 -54 -30 -66 -8 33 -23 40 -59 -13 21 103 -20 -10 150 73 -25
3354 -25 74 42 -78 -19 -111 -59 -61 23 -92 -4 -14 66 -101 35 7 -65 -24 -5 -104 35 -16 -1 43 107 -56 -10 70 -124
3382 -124 -24 71 22 -15 -35 -45 -83 -34 -33 -38 -64 89 -68 66 -59 14 113 -15 21 -24 64 -25 -35 -5 36 51 13 -17
3410 -17 -92 -16 -51 24 -13 28 34 -79 28 -2 -76 38 34 -69 -7 -62 -98 92 -1 -19 50 7 55 -25 31 -54 -4 48 85
3439 85 18 71 -48 -24 -38 27 7 -50 78 -60 -64 -89 196 -84 24 42 -20 40 -52 77 -37 -14 -8 86 -29 58 -56
3466 -56 -25 -1 -62 -123 -37 -111 87 -28 92 14 -4 46 75 13 2 97 87 88 137 -93 -11 71 -15 -30 15 -28 34 -57 40
3495 40 -87 -10 83 -23 -14 -10 77 90 106 20 -30 143 -56 -35 -46 8 56 -43 -50 -13 -18 72 -71 -68 -15 67 5 19 -3 -77
3525 -77 10 86 -42 43 43 80 -30 49 -45 -157 -29 -48 -57 -8 1 -46 -21 -9 -84 -27 56 -75 -47 39 29 -53 -25 18 -27
3554 -27 -1 13 4 37 86 32 -11 -8 114 -67 58 -71 -29 161 64 -10 -12 -25 99 47 60 48 -85 -26 -7 15 -40 -18
3582 -18 -44 5 45 -104 34 83 -8 68 30 111 -35 76 -1 -92 163 25 31 43 -70 -22 -22 -54 119 -34 49 4 -14
3609 -14 136 -118 -202 46 18 5 -9 38 -38 -65 -31 -147 6 -14 99 40 51 -21 -60 -34 9 -141 71 19 -84 18
3635 18 -84 39 55 -13 32 -59 48 95 -66 -39 89 -22 -22 114 66 -71 -25 -115 -28 38 -65 7 -28 69 -95 154
3661 154 62 18 3 99 -67 30 49 -29 -88 101 68 -119 -128 12 -113 -118 -38 -50 -42 5 -52 -72 -33 30 -12 -6 40 33 131 47
3691 47 85 16 42 -57 7 101 33 -90 133 -18 -101 58 -77 -114 65 52 50 -187 134 5 -38 66 20 -5 -95 16
3717 16 115 99 -11 79 -5 -4 72 -131 -23 70 -63 -42 148 -69 -71 25 -70 -52 118 58 -100 -12 -25 42 110 -18 12
3744 12 -31 65 6 -8 158 -33 -33 -43 -3 -61 -9 7 -123 110 9 -56 -32 24 8 -84 49 -64 -67 -14 17 25 -32 58
3772 58 33 -13 35 39 -49 30 -27 -67 -13 -47 -12 46 105 -27 16 35 54 -82 119 28 -116 49 41 -17 130 54 91 13
3800 13 -33 -75 -77 39 -68 -31 119 20 -8 54 38 -20 23 36 -16 -12 -5 80 201 -1 30 39 -63 97 -18 89 72 -39
3828 -39 28 -56 -19 103 66 18 -44 79 85 -86 -95 -88 -84 -16 -56 -51 -40 28 -86 -197 30 -31 34 98 42 59 -12 -123 -7
3857 -7 -38 -106 28 -80 -7 1 40 22 20 44 41 -29 96 -52 37 -13 40 67 50 -36 -113 124 -25 -107 11 51 85 22 -40
3886 -40 62 23 11 24 -31 29 66 72 -2 -25 -72 78 143 26 -75 40 -8 76 -7 41 -39 11 40 -36 -24 48 20 -14
3914 -14 -81 -52 71 -207 28 40 -19 57 -18 46 -48 -1 -59 102 80 -6 36 42 -59 41 22 -20 -48 -3 -49 132 -94
3941 -94 68 -17 33 -5 -63 72 -16 54 35 -1 132 -89 24 -83 -32 28 61 -37 24 -65 -11 22 23 15 92 -71 82
3968 82 62 -29 23 53 -101 -69 49 30 -27 -111 25 23 12 -37 26 110 124 41 140 27 89 -52 154 37 -61 -29 95
3995 95 -62 25 -110 14 -62 -31 14 41 -60 -35 -38 -76 79 -98 -15 180 -6 -44 -27 31 -67 -52 53 26 61 69 -34
4022 -34 -41 -58 -45 87 49 51 -27 -57 57 -22 -3 -17 -13 51 48 -49 19 71 -18 -90 76 56 -52 8 14 62 -45 -73 -147 133
4052 133 31 -2 30 167 -41 1 109 8 -76 -31 129 34 -76 27 23 68 -31 -66 -32 91 68 12 -3 109 -18
4077 -18 -32 14 -19 -36 -57 16 7 41 -81 65 -32 -12 -100 45 -13 -29 23 -13 -39 38 61 -189 -123 -48 38 41 23 56 35
4106 35 128 14 -51 76 35 -61 -59 20 57 -79 2 91 -125 64 -22 -99 -22 -40 -5 -22 -43 31 6 49 154 -46 5
4133 5 -40 25 -99 21 42 34 53 52 -27 46 -27 -103 -1 -6 -31 54 28 39 6 36 7 73 152 3 -12 -18 6 144 -63 80
4163 80 -27 -5 -82 -12 68 53 -16 -1 8 -53 33 -24 -20 -40 107 83 28 -55 44 -103 61 52 3 0 -46 -75 -5 47 -46 64
4193 64 30 64 -47 29 106 73 118 -34 32 -24 -15 41 52 -73 -22 71 -20 -105 -71 -10 -26 49 7 113 24 -16 81 6 134
4222 134 16 6 -37 -8 -112 -8 52 -42 39 -48 20 -29 -50 -51 58 5 132 -48 -3 -16 -38 200 38 -53 -35 9
4248 9 -3 113 1 2 84 8 -46 67 -19 14 18 -15 150 4 -134 -77 8 -99 -30 -100 -47 -65 18 15 4 -2 11 39 17
4277 17 101 70 -104 129 -13 -1 129 -56 -35 17 4 117 79 -27 -9 -15 28 3 -56 -34 -13 -93 -22 -60 -46 34 10
4304 10 -63 65 -91 43 -15 -26 -21 -4 -18 -33 -82 -17 -22 -28 75 32 30 13 146 93 11 -81 -21 32 -128 49 -9 -69 -40
4333 -40 -2 -53 -1 21 42 -45 -67 -57 7 -23 64 21 -10 -83 44 -37 -13 37 8 -25 -32 134 4 25 -22 6 78 49 -4
4362 -4 -66 50 71 118 -95 11 -79 -72 13 -61 44 -13 -132 -25 -20 -94 -4 -22 32 -54 -12 13 0 -27 -11 38 -60 -4 91
4391 91 107 6 -114 47 -26 27 -113 15 -73 -11 27 25 -93 14 49 -59 -63 -23 120 39 51 35 -11 -49 20 75 -84
4418 -84 -61 20 -21 35 -23 13 5 23 -69 11 -26 -18 -63 20 -22 -93 -54 -18 -24 -15 24 15 -45 49 98 -45 -70 10 93 48 34 37 130
4451 130 97 26 -9 -38 80 -6 -19 44 -64 -20 85 -9 -16 -83 -64 -26 49 -47 -18 9 -74 60 50 -67 42 -2 -142
4478 -142 66 86 -47 29 -3 -95 4 -42 67 -5 64 57 19 -14 1 -63 23 32 10 23 -81 47 41 -48 -19 -18 51 26 -98
4507 -98 -78 -12 41 5 -30 114 41 85 -8 90 -85 -100 26 42 -145 117 108 3 3 80 -5 -60 -12 -51 -3 110 -44
4534 -44 43 15 55 66 -12 2 37 -19 -44 -45 -8 53 22 149 -24 24 -57 -4 6 -10 43 31 58 -13 -54 80 28 35 93 -17
4564 -17 -17 -38 -38 -26 -7 6 -41 5 -5 34 109 -76 120 -120 76 21 -4 105 -52 -9 -19 -12 -13 -32 195 -35 83 -50
4592 -50 -39 -81 -98 16 -12 7 72 -77 -129 40 -63 40 -96 -37 160 -32 47 1 -45 9 -66 -64 -2 52 0 -81 120
4619 120 27 -4 121 -22 128 56 27 -62 -25 20 58 65 81 -55 -94 -14 -64 64 -24 73 31 -101 -61 143 120 -81
4645 -81 25 -7 36 -48 17 54 -1 -19 89 31 -86 104 -3 39 -14 81 -74 -8 -8 101 -95 -96 22 27 -28 -19 -15 -90
4673 -90 31 29 -44 10 39 42 1 -7 31 -50 -63 19 -16 38 -111 15 91 80 68 -35 35 -37 39 14 -3 -25 -116 -55 43 32
4703 32 65 -36 85 14 61 110 6 18 -63 -86 -34 30 22 48 -34 70 106 80 26 -6 -41 83 -14 -55 8 20 72 21
4731 21 -109 -51 138 72 -16 31 -95 -35 85 13 111 84 9 -52 60 35 -92 40 -13 24 32 -48 -27 5 0 80 -23
4758 -23 -9 -10 -128 -48 -100 -27 -61 42 12 -76 -35 -41 86 59 22 -27 66 82 -2 6 120 15 -108 11 11 12 17 -51 11 52
4788 52 101 -79 97 84 -18 38 -14 -84 125 13 -99 -70 31 36 68 25 -77 23 82 -46 41 14 35 9 22 1
4814 1 140 15 39 117 -52 101 102 -2 50 50 -29 -51 -52 80 -117 -11 -34 -34 45 125 -28 -37 -46 -89 8 59 68 -92 83
4843 83 3 -68 49 7 -9 -29 21 115 -54 -42 -25 -74 30 -9 35 53 32 45 101 -6 -8 -88 -6 7 24 17 49 -53 173
4872 173 125 31 45 -11 -78 127 30 -110 -65 4 -9 69 56 -59 54 48 -121 40 -8 0 -47 -58 35 -135 -68 -38 -6
4899 -6 -23 -7 -44 88 67 19 39 45 40 46 21 -79 52 -53 -43 9 103 49 24 113 172 -74 -1 24 -54 123 91 67 16
4928 16 22 -13 129 36 -79 -6 13 9 50 -44 -11 11 35 66 -49 32 -137 90 70 56 -46 -56 -69 -44 127 28 -78
4955 -78 -54 55 -40 -62 58 -32 13 37 -92 41 -104 16 19 17 46 29 -20 -14 10 -140 -78 2 7 38 -64 18 1 13
4983 13 -1 -22 -24 -79 146 26 -46 74 27 -108 -20 -70 12 154 64 -37 82 22 43 -8 -6 -59 49 130 -103 -167 7
5010 7 -91 -56 64 54 -49 140 -8 85 33 66 -55 -55 -53 7 25 13 -25 118 57 108 74 -106 22 -44 21 27 -26 -5
5038 -5 21 -31 -49 -29 63 75 17 -42 -75 75 85 -13 -17 49 50 -84 68 24 -248 -72 1 -72 65 -73 76 -37 141
5065 141 15 71 -67 52 109 -40 -64 38 59 105 -4 13 106 -36 13 25 -25 143 44 44 104 134 12 29 -108
5090 -108 -93 64 -98 27 55 103 41 1 12 7 44 43 -55 17 -75 -129 -2 -71 33 79 -117 -75 -49 50 14 104 -20
5117 -20 -3 -99 86 61 13 41 16 32 64 -22 54 -49 -35 106 24 -114 -122 52 48 140 82 -54 -2 52 8 -17 -27 10
5145 10 53 -17 120 94 -66 -47 55 -27 3 36 14 113 -67 57 13 175 -58 -68 90 83 -27 -22 -65 111 -23 22
5171 22 -32 50 -34 -148 -107 37 6 1 -33 -3 -53 -18 58 82 31 54 116 -82 77 -16 90 -38 -47 25 -10 93 -76
5198 -76 34 -26 41 40 41 64 -64 1 -3 -6 -41 -69 -45 -5 81 4 55 69 50 -85 -70 115 9 -146 -36 46 76 -125
5226 -125 19 -9 30 7 32 30 13 -4 8 -24 58 -37 -30 19 -77 -40 -2 -79 3 25 32 77 20 91 -87 96 24 -85 14
5255 14 34 -79 5 -44 -28 67 -57 37 -7 -122 35 -30 28 -69 -43 -76 50 84 47 -19 -4 -36 -143 111 -5 -99
5281 -99 -43 12 -62 14 -10 -6 127 115 -3 -118 144 11 88 -43 110 -67 -9 -10 34 83 114 41 26 14 113 16 -55
5308 -55 52 63 21 42 115 6 -47 65 160 53 -36 -15 75 75 17 35 55 27 72 -120 -78 56 21 55 16 1 25 8
5336 8 15 -128 53 92 -18 -26 90 60 -116 -110 70 24 69 -73 -108 29 -9 -13 -71 5 -44 3 35 44 34 -29 42 -47 -62
5365 -62 -59 88 -14 74 31 -128 46 27 4 -23 -1 40 -39 17 -6 38 58 -69 26 -37 -120 -89 -44 -73 -40 -23 -24 -32 72
5394 72 19 -7 63 15 -21 70 32 -31 -62 62 -35 -11 145 -13 56 -9 16 21 77 -12 34 70 -125 -107 27 -6 120 -72
5422 -72 -97 -8 -83 73 0 75 -61 -54 5 43 -9 -14 88 -29 14 -68 -47 13 21 19 73 -59 -17 11 -24 86 100 -53 -53
5451 -53 2 -12 59 29 -90 54 -14 7 22 47 107 65 13 -27 109 78 -25 27 8 -49 -16 136 -71 -31 54 9 17 -26
5479 -26 -84 0 -45 -10 79 1 60 -69 38 -22 26 -104 28 6 26 18 34 93 46 41 33 83 -62 -31 9 56 39 77 58
5508 58 -34 14 -14 43 -67 39 -54 -59 71 24 10 64 -58 -34 -135 78 -11 87 -41 45 -25 68 61 79 41 -79 -79 -9
5536 -9 146 -82 -38 32 -67 -6 -59 -23 -8 15 -122 -2 -25 42 -60 74 -39 -52 -21 52 -29 140 54 14 109 -105
5562 -105 -124 -85 136 -3 22 22 93 -37 24 46 32 -67 69 46 84 -33 45 20 128 23 -9 9 -10 -17 25 -39 60
5589 60 -27 70 42 139 -55 5 -8 -47 -10 -46 57 -24 -37 58 32 37 87 9 -39 70 48 -7 22 21 -27 -51 39 10 -16 8
5619 8 50 44 -4 -94 -12 -25 29 56 124 40 -38 27 31 -72 -84 -20 -31 61 101 -23 -10 -65 20 8 -124 -186 -8 41 -51 -36
5649 -36 -21 36 60 3 -12 -42 11 -38 18 33 -67 132 88 28 102 -95 -57 -36 33 124 -31 -28 124 27 74 71 3 -100
5677 -100 -52 123 31 -45 -45 100 14 -24 65 7 26 -100 -151 -88 118 -72 -21 130 51 66 -4 6 22 11 17 24 14 15 96
5706 96 -75 -63 -50 -9 -73 -3 -11 -42 14 -57 49 -16 24 19 -64 -97 105 -66 76 -51 14 -30 7 0 -66 -67 7 48 -60
5735 -60 40 34 84 46 25 -53 -93 54 89 28 -89 -81 -50 -20 -98 -138 47 29 -137 82 -6 96 44 4 -10 81 23 63
5763 63 53 -7 91 -44 94 -5 24 -93 -22 -11 -121 11 -21 -90 72 9 -12 46 77 -13 47 34 -102 22 48 88
5789 88 -45 -8 -164 -86 97 -2 -102 -1 -55 49 37 -20 95 21 -17 -56 -103 -46 -73 -3 -32 -4 13 26 -45 -65 -34
5816 -34 -99 54 33 -6 -93 14 -17 -97 -64 57 169 54 28 66 -7 -71 63 33 28 -11 32 29 101 11 79 -24 -29 98
5844 98 -14 0 113 -4 26 -17 -44 27 -25 -33 39 -1 -36 -82 39 -79 -87 117 15 -31 27 -54 -16 45 -18 -18 -18 -68 -47
5873 -47 -57 52 76 77 90 47 53 58 -44 55 94 81 55 20 -71 30 -32 -33 0 -17 15 -54 2 39 -57 -44 51 -23 78 33
5903 33 -46 140 5 56 -93 -32 65 29 41 -64 -122 -70 8 -91 -48 -58 33 179 94 -29 -57 154 57 25 29 -44 -59
5930 -59 -55 1 -20 22 -64 -98 5 83 29 15 25 -18 76 137 35 41 -36 74 40 -114 24 129 129 89 -20 -20 26 -23 -9
5959 -9 -53 31 56 28 120 -106 20 42 101 45 64 64 29 15 9 -51 -20 -80 -7 -39 -91 -4 57 88 -116 -56 52 -24 65 -50
5989 -50 -26 25 49 -15 9 35 -1 64 47 98 39 -21 -99 31 -72 -117 64 107 105 34 75 26 -104 -3 70 7 26 153
6017 153 -23 -19 55 -3 27 -31 1 -90 16 86 41 -66 -6 60 41 -21 -11 95 29 108 -46 82 7 66 -43 30 41
6044 41 -70 97 -2 8 8 -9 56 -72 28 3 -56 -47 -87 52 73 -6 85 2 -51 -79 65 36 22 13 142 25 72 48
6072 48 107 8 -40 8 62 79 -18 -9 -20 166 65 -68 11 -26 84 173 11 18 -27 12 -64 -17 -22 29 19 -65 15 68 16
6101 16 12 -48 62 -35 -35 -24 64 69 -94 -55 35 -12 12 -10 -108 19 -41 21 1 29 16 64 -1 -102 57 86 41 -59 17
6130 17 -20 36 14 111 49 59 59 87 -53 28 -60 14 -8 -70 70 -52 17 19 -62 -24 -51 -152 -5 3 36 -63 -48 69 -87
6159 -87 -86 -121 84 -11 56 76 -24 -11 132 76 39 21 7 34 -64 -35 -61 63 28 34 23 -85 66 -69 57 29 37 -38
6187 -38 31 -46 49 96 44 1 90 29 -53 53 -11 -10 -14 75 22 60 -33 -106 -14 100 114 4 53 123 -10 -10 -11 -93 38 -7
6217 -7 -74 -25 44 82 -59 121 -49 15 17 -12 -33 -66 -20 14 67 -46 -47 -2 69 -72 -34 -1 102 32 52 -10 86 51 -19
6246 -19 -96 -67 50 -38 90 84 70 -48 60 -46 80 124 -33 32 37 23 32 28 -4 -93 21 -18 -22 60 52 -30 -8 -17 63 -17
6276 -17 -104 106 122 29 -44 180 24 -1 -1 31 12 13 -15 14 -91 40 -69 -1 95 -87 -19 -56 -40 51 16 36 84 -21
6304 -21 -22 -72 -57 79 -15 -47 -14 8 -49 -24 -54 -31 -153 15 -55 35 89 5 -25 33 12 3 -85 -116 -25 44 -19 -14 61 7
6334 7 85 -65 95 -39 -90 -49 21 23 7 41 -46 -17 44 28 -42 5 -69 85 0 3 -45 46 -63 -153 -12 -8 -32 -60 -119
6363 -119 14 -5 34 -59 52 71 -46 13 -130 10 -51 49 138 -15 13 -107 -28 -2 -6 -9 6 -86 -42 123 5 -65
6389 -65 -87 -24 -16 10 10 -15 10 -113 -27 44 -56 83 -20 -15 -20 39 36 -22 -82 -1 20 22 -77 46 -12 3 124 -86 -14 -66
6419 -66 -93 -23 72 4 -47 -21 81 -111 112 8 -82 -34 -52 -72 94 -29 -16 58 77 -70 82 -50 -35 65 -44
6444 -44 41 -18 -72 43 -53 -87 94 -44 62 30 -47 -14 32 -21 26 7 -24 -123 -5 -88 35 41 -20 35 -53 62 87
6471 87 -58 109 -57 99 2 56 -18 134 25 52 -16 22 77 28 21 -5 -33 30 21 75 77 14 78 -53 40 -56 -4 13
6499 13 -30 66 -59 31 -46 41 43 11 4 -14 -36 31 -51 31 18 46 -19 -102 19 -30 -10 -28 16 -76 61 21 65 61 7 171
6529 171 35 -55 65 -85 13 14 10 15 125 -8 -62 20 -36 9 28 54 -75 -30 -87 -7 47 -100 12 32 43 -30 6
6556 6 20 126 -76 -5 -11 21 -67 72 29 -42 -29 -105 3 57 -45 98 47 -33 -4 -9 25 41 -53 -33 105 105 -25 -117
6584 -117 72 -58 23 -28 68 37 -66 -174 -112 -95 -75 45 0 38 -20 -90 21 40 -36 -23 -80 -73 -48 109 186 -15
6610 -15 -29 -17 -53 17 40 -83 91 42 -39 -32 69 -160 -43 -55 3 52 3 -20 -2 -57 -9 70 6 -40 -132 -21 58 -159
6638 -159 17 1 82 14 72 55 9 57 -69 -31 49 -46 -70 84 -44 21 -5 21 90 -37 11 -43 -54 -36 -59 49 119
6665 119 45 -33 97 -52 10 -161 20 109 91 -90 145 -38 -22 97 -28 -77 80 -19 64 -36 -25 21 -86 -71
6689 -71 -111 -77 37 34 57 -40 -44 -81 -93 108 -13 61 4 51 63 59 -42 -4 -119 -30 -99 -139 74 61 -81 110 -24
6716 -24 -44 -69 92 78 4 -41 -13 -14 -3 28 -20 59 -118 14 97 -20 -8 11 58 37 -53 -110 -60 -4 -7 8 50 50 -45 -37
6746 -37 -26 -36 105 -49 3 98 7 -25 32 0 4 8 116 67 120 -63 100 62 41 -98 -12 3 81 9 -7 143 -90
6773 -90 25 -41 86 -123 -45 7 -46 -30 -14 89 34 51 64 -73 -43 6 -5 -92 -50 -43 -153 -83 -36 48 113 182 3
6800 3 -40 43 65 64 -36 75 50 20 -45 55 -8 -50 87 0 49 56 -8 -14 -104 -94 -82 -16 9 47 14 -18 -23 -14 -57 24 -78
6831 -78 37 -97 -21 51 -13 -53 -46 20 163 39 43 7 -58 3 106 -61 -86 47 24 -12 -40 38 3 27 -18 -10 44 145
6859 145 -19 -10 -42 -54 -10 44 10 -22 67 -75 -16 -24 104 44 -47 -108 63 144 -17 72 82 -21 72 31 52 1 -142
6886 -142 44 98 -12 83 3 22 66 -19 97 -72 -86 -63 -34 -10 25 45 23 48 -99 -40 4 -124 -64 109 -2 -26
6912 -26 148 30 22 -6 -28 32 23 -10 -35 112 -19 55 3 72 -28 -31 54 29 -49 6 84 -60 18 17 -6 -41 -15 7 52
6941 52 20 3 -44 7 68 42 -45 53 94 0 -50 33 -19 -20 72 -50 21 -59 4 -7 -37 -50 -9 -103 54 45 18 3 -9 -8 35
6972 35 -71 -12 101 -1 5 -10 -57 -48 -5 -57 -37 31 -35 -12 -4 -2 -34 -34 -90 40 52 51 -86 -35 -42 -31 56 -72 -51 39 18
7003 18 35 125 28 80 28 17 93 61 124 147 4 18 21 -24 0 -85 -59 -52 47 -125 -66 36 15 -62 21 -48 98 105 -19
7032 -19 -17 -23 67 -75 22 111 31 159 2 -52 3 18 107 23 -50 63 -15 59 43 -11 -24 -25 -46 14 -23 -27 7 -63 -61 -1 33
7063 33 38 19 0 95 -114 -9 34 -38 -79 19 23 -28 -66 -28 -64 31 57 -56 108 76 73 12 -64 152 -15 -62 6 -15 -1
7092 -1 -126 1 1 -13 -107 67 -31 28 45 -48 12 -20 37 23 74 116 29 -44 49 113 38 59 51 76 73 -48 28 -30 11 11 -33
7123 -33 21 85 -94 -81 -93 -45 -4 16 58 38 44 -100 -76 40 -21 -137 -89 69 -12 -73 -48 9 28 77 21 57 40 -52
7151 -52 81 135 -43 -77 -107 -124 23 25 -9 21 78 30 -17 34 50 18 73 -84 8 67 52 75 -2 -41 -32 -17 193 -59
7179 -59 -24 29 -76 20 -67 27 -16 10 -2 5 40 -60 -139 -36 -13 55 39 -27 26 -26 128 6 -118 -73 29 -2 37
7206 37 12 118 40 62 -28 78 -95 85 -100 -60 62 11 -129 -3 40 128 -28 32 52 2 -41 -49 64 59 -51 -38
7232 -38 14 -43 -108 -9 -12 -24 7 22 -4 68 86 -12 -86 158 -33 50 76 -49 10 -32 53 -1 -8 -47 -28 74 32 60 109
7261 109 -1 -69 -21 -46 30 9 93 -62 -33 28 9 79 109 26 -6 107 -57 -46 27 -17 -118 133 -24 -97 93 76
7287 76 -17 121 -54 52 44 -16 64 -66 -66 -106 130 -60 48 -19 66 -88 -89 2 -32 -50 18 -6 13 -56 -150 -18 30
7314 30 40 -5 -21 -121 -2 64 61 -66 -99 10 17 53 -81 -153 5 10 34 -16 119 37 42 -37 -4 -16 26 0 -29 -50 -1
7343 -1 8 -129 6 -14 -33 41 70 50 80 17 40 53 33 25 -67 -43 -105 3 -5 -140 80 -18 105 -64 82 -45 -52 -51 -125
7372 -125 53 -95 -20 47 3 89 77 41 -46 43 82 -8 68 -13 135 25 91 138 42 44 104 -32 -64 71 38 17 36
7399 36 -52 -105 101 -32 53 -20 -99 -18 36 10 31 -8 47 -15 -89 23 70 56 -22 83 12 8 49 15 32 -78 -13 -106
7427 -106 158 42 -24 4 -59 29 11 -113 68 80 85 -33 -19 66 -42 -88 -75 -21 53 44 84 -29 8 49 3 -54 25
7454 25 -19 130 -16 62 -62 -65 59 47 31 -141 5 -21 60 -45 -75 59 -26 81 -4 34 -60 2 -47 -101 -3 -11 -145
7481 -145 69 65 -33 41 17 -59 19 -71 -77 -7 -11 -20 -7 81 -63 -1 -28 9 56 -16 -38 -71 -97 36 59 -31 -61 -45 38 -80
7511 -80 -84 38 15 -86 -48 17 -55 -57 62 21 -97 -113 43 77 -11 -134 119 -13 47 -7 57 20 -113 63 -9 28
7537 28 1 39 -47 19 62 -39 26 -12 62 -21 -10 -50 105 25 -30 -27 -15 -86 20 27 -3 -76 -108 -23 -30 -11 0 2 -94 -135 25
7568 25 99 -1 107 38 -12 -7 16 38 85 114 65 -3 75 -44 37 42 26 -127 -73 -78 -62 56 16 46 -11 -2 51 -10 25 -31
7598 -31 -20 21 19 -58 -7 109 -37 68 -29 20 146 131 -122 2 45 -53 -7 -7 54 13 -7 153 24 31 65 -5 36 25
7626 25 -37 36 39 36 74 -71 60 -24 41 -12 -23 -2 -89 -42 -76 134 -125 38 49 108 93 106 -11 91 35 38 18 -99
7654 -99 -14 46 -73 46 -31 10 -23 36 24 -36 13 5 69 -66 -7 -37 18 -115 -7 45 46 37 37 -10 41 143 101 -86 5
7683 5 -14 130 17 15 -22 -8 2 67 -38 49 -15 -5 32 -26 112 -50 -15 -107 -66 -71 49 -28 1 -15 -13 126 130 -67 -39
7712 -39 -1 70 -9 -147 44 -57 -66 -78 -83 -80 -16 17 69 155 -27 110 -138 -20 59 62 97 -12 -86 43 87 -44 -11
7739 -11 -55 -14 -19 -26 -19 31 -67 -61 41 -59 -17 83 -41 -25 15 55 -41 17 -40 -17 88 -30 22 150 -42 47 12 29
7767 29 -115 60 -48 -96 4 -3 -53 1 11 88 10 -25 -47 -67 27 -24 -61 56 -1 155 -31 5 37 63 -40 100
7793 100 -5 -50 -39 101 97 -32 -65 16 -1 112 72 -24 -3 35 -38 14 -4 -96 -33 -30 128 -21 87 83 11 63 -31 28
7821 28 35 27 -11 -120 12 -50 96 2 83 4 28 -61 78 -27 85 -35 -32 27 -19 16 14 -55 -40 12 -43 76 -5 -21
7849 -21 21 62 26 8 4 26 -39 113 38 56 132 2 105 65 4 14 113 23 87 40 -26 72 23 20 69 -2 -56 -46 -25 64
7879 64 -76 32 -62 44 -87 63 86 36 -40 -30 42 22 60 71 -38 55 11 48 -14 -98 -30 15 -46 61 -28 35 96
7906 96 -22 -56 19 19 69 3 -3 -7 23 12 41 43 24 14 66 47 67 -34 -126 48 48 0 -21 219 56 -77 47 16 178
7935 178 -73 121 28 15 -54 -110 -90 -31 24 -131 -48 45 -22 -48 29 24 25 -31 -2 38 -86 -16 -14 70 39 -64 67 91
7963 91 -10 54 103 -8 104 83 -2 -6 143 -55 -5 -42 -92 -48 -16 36 15 32 -72 55 -20 -46 59 -25 -39 56 7
7990 7 9 23 70 49 -48 -21 -84 32 4 97 25 -1 81 93 -46 -9 109 16 79 19 78 -1 -69 -16 -87 99 -29 64 -13
8019 -13 12 -82 119 -70 -11 -20 -94 -128 -54 98 22 18 -34 -64 -7 3 -16 -16 113 80 -83 -38 -6 -74 54 -3 -61 4 68
8048 68 71 7 33 -84 1 2 -14 69 -87 -23 11 -61 73 25 -52 -49 -8 48 119 -16 -29 26 -67 -39 -3 -11 -4 69 -34 61
8078 61 78 -11 -30 -28 -43 -39 -33 27 24 -61 -1 -31 -73 -23 111 -16 45 -67 -103 38 55 -48 93 -13 104 5 -35 79
8106 79 -95 -45 11 -19 20 -10 19 -13 1 2 53 46 -44 6 19 -36 -90 90 -3 -84 -103 75 -22 -24 -66 41 -3 40 10 41
8136 41 1 25 51 -43 45 -91 82 -14 41 18 57 83 105 -25 -86 57 -22 64 -42 116 71 -70 -50 76 46 84
8162 84 104 -21 -111 -111 -86 56 20 35 52 19 50 -138 85 -84 95 15 -74 76 85 -18 -57 45 -48 53 56 0 -51
8189 -51 -1 -5
8191e
$$ Imaginary data points
##PAGE= N=2
##DATA TABLE= (X++(I..I)), XYDATA
0 0 0 0 0 0 0 0 0 0 0 0 0 0 -8 8 -8 8 -8 16 -16 17 -24 25 -32 40 -48 56 -64 72 -82 96 -112 124 -144 161
34 161 -183 203 -231 258 -289 322 -357 396 -442 490 -540 596 -659 726 -800 881 -971 1070
52 1070 -1179 1301 -1437 1591 -1764 1964 -2198 2469 -2797 3196 -3698 4350 -5229 6492 -8469
67 -8469 12016 -20337 82794 -3529 -81729 119529 -49358 -117129 95358 48893 -91822
78 -91822 81568 54891 -131510 -11247 65714 -93703 8855 128484 -35298 -36089 83508
89 83508 -55737 -83209 77625 19680 -48255 83509 38169 -89948 5614 30073 -76763
100 -76763 16928 90489 -25790 -9753 54863 -53728 -63431 41631 2587 -23060 64709 30717
112 30717 -49311 1632 6886 -49203 13302 58147 2979 13467 31178 -31035 -36100 6724
124 6724 -2901 1854 36770 19261 -16686 -14170 -20373 -32752 -4497 20864 16962 16260 8075 -12686
138 -12686 -24236 -18497 3296 15479 18004 29374 11146 -24402 -19558 -14015 -25950 3449 33148
151 33148 5949 -4706 10155 -25659 -40049 12511 14321 -2350 41035 27521 -30641 -9977
163 -9977 -328 -36887 -273 41163 573 -4266 20856 -29569 -46209 10478 618 -11757 42673
176 42673 23176 -29920 -1547 -4952 -43222 2746 36905 -1503 9068 29729 -27067 -36760
188 -36760 11196 -9337 -13544 41777 18830 -24794 3043 -10075 -46175 -3180 23420 -5349
200 -5349 11866 26230 -21769 -27727 4282 -12368 -5918 37220 19895 -5481 8841 -11174 -33728
213 -33728 -3476 10766 179 17109 18354 -16588 -21731 -10448 -21380 -7214 22514 14300 4722
226 4722 7522 -11279 -22932 -7379 4345 9309 19265 18334 134 -12862 -14665 -15189 -6415 8784
240 8784 14489 10707 -572 -11460 -16726 -18911 -6351 11357 12578 12615 10770 -7972 -17897 -8849
254 -8849 -4373 2672 19620 19199 2144 -2800 -9087 -22252 -9198 9357 5938 11091 14578 -9105
268 -9105 -19354 -8856 -11817 -5933 18611 17982 1785 4857 -3613 -22971 -7186 10551 3628 13779
282 13779 21371 -4318 -15586 -6501 -13893 -11029 14108 15847 1655 5360 -2802 -23097 -11337
295 -11337 4382 629 12979 21927 1501 -8307 -4267 -13007 -10076 11365 14365 6088 9220 -564
309 -564 -19663 -12726 -1497 -3420 9035 19035 3154 -6687 -4903 -13464 -12639 6897 13776 8683
323 8683 11668 4506 -13713 -12657 -3359 -2359 7443 17493 8259 -2865 -6018 -12952 -14520 -811
337 -811 8951 8494 10379 5040 -9166 -11842 -6858 -3776 6118 15265 11183 3118 -2474 -9953 -12246
352 -12246 -2972 5990 8525 10362 5817 -6369 -11941 -10625 -6871 1906 10601 11507 5743 -2058 -8395
367 -8395 -10350 -6441 3293 11162 11617 7943 1138 -8369 -12720 -6594 429 5123 11232 9073 -2543
382 -2543 -8257 -8842 -10696 -2767 9639 9832 6346 5093 -5306 -13204 -5416 175 2306 12719 12410
397 12410 -878 -4191 -5985 -13327 -4886 8697 6346 5695 8342 -5294 -14621 -5401 -3485 -2958 12603
412 12603 13832 -484 -83 -2255 -14672 -5997 8496 4294 6590 12228 -3304 -12896 -4431 -6084
426 -6084 -5730 11035 11879 -13 1962 -2897 -15603 -6762 4729 1410 8106 13376 -1814 -8671
440 -8671 -3166 -8395 -5444 10602 10185 3213 5839 -2323 -13801 -6910 147 -669 7501 11349 145
455 145 -5044 -4572 -9214 -5527 5974 8170 6607 6352 -1341 -8980 -7280 -3709 510 7342 8675 3911
471 3911 -1588 -7276 -9367 -5744 26 5846 8684 4834 -627 -5257 -9087 -6871 1166 5512 7410
486 7410 8954 1841 -6840 -5535 -5189 -4641 5815 10057 2630 2035 -378 -11570 -8206 2396 754
501 754 4452 12543 2157 -7472 -1854 -5654 -9268 6188 10112 58 4859 2902 -13295 -8194
515 -8194 2716 -3460 3331 14856 1378 -6450 1210 -8063 -12121 6219 7268 -1260 8701 4462
529 4462 -13098 -5687 2006 -6792 3705 15729 1212 -3147 4373 -8686 -12180 5915 4496 -1585
543 -1585 10427 4448 -11762 -4226 -419 -8336 3010 13346 1584 -349 4268 -8309 -10881 3660
557 3660 2439 -153 10715 5181 -8169 -3370 -2547 -8949 1500 9946 2101 1414 3737 -7085 -9861
572 -9861 299 830 679 9182 6058 -4157 -3312 -3218 -7046 -660 7360 4566 2357 2711 -4118 -8541
588 -8541 -3244 608 1708 6421 7101 220 -4289 -3526 -4941 -3672 4305 6907 2356 2254 -105 -7861
604 -7861 -5874 1089 796 3198 8431 2662 -4959 -2343 -3617 -6861 2322 7680 833 2002 2945 -7969
620 -7969 -7613 1803 -644 737 10026 4110 -5132 -712 -2612 -8681 1599 8020 532 3159 5417
635 5417 -6932 -7847 1457 -2050 -947 10007 5070 -4044 830 -2085 -9579 734 6748 -246 3770
650 3770 6342 -5871 -6983 813 -3456 -2097 8944 4775 -3183 1477 -1929 -9697 -655 5372 -265
665 -265 4164 7174 -4048 -5934 -237 -3913 -2625 7238 5107 -895 2016 -1293 -8300 -2186 3190
680 3190 85 4106 6809 -1739 -4561 -1258 -4005 -3028 5062 5051 575 2128 -693 -6736 -3450 1530
696 1530 426 3319 6261 437 -3861 -2122 -3508 -3738 2795 5144 1831 1895 394 -5306 -4625 -14
712 -14 305 2271 5692 2429 -2350 -2311 -2899 -3990 741 4780 2547 1771 1529 -3813 -5119 -824 145
729 145 1295 4907 3467 -1564 -2161 -2458 -4298 -834 4232 2832 1766 2213 -2650 -5351 -1661 -215
745 -215 341 4469 4514 -711 -1742 -1832 -4611 -1989 3464 2750 1920 2921 -1151 -4899 -2236 -627 -615 3434
763 3434 4537 161 -1277 -1183 -4256 -2663 2689 2379 1941 3426 -491 -4275 -2410 -1295 -1311 2935 4701
780 4701 956 -430 -827 -4356 -3396 1516 1793 1970 3928 573 -3435 -2288 -1990 -1963 2163 4095 1568
797 1568 554 -405 -3797 -3226 381 1059 1994 3807 899 -2392 -2141 -2430 -2321 1591 3409 1865 1650
814 1650 -96 -3501 -3106 -593 107 2079 3884 1450 -1095 -1479 -2961 -2623 758 2378 2075 2259 484
831 484 -2854 -2513 -1496 -811 2026 3525 1401 244 -999 -3209 -2403 258 1323 2315 2850 461 -1986
848 -1986 -2030 -2128 -1526 1720 2999 1657 1098 -466 -3159 -2478 -369 198 2161 3246 923 -1151 -1536
865 -1536 -2674 -1916 1107 2156 1742 1973 -114 -2850 -2171 -1020 -335 1899 3172 1189 -328 -939 -2736
882 -2736 -2166 857 1679 1823 2350 313 -2250 -2005 -1638 -857 1388 2727 1659 236 -752 -2379 -2515
899 -2515 -51 1152 1600 2468 1064 -1474 -1898 -1603 -1152 789 2496 1918 836 -161 -1850 -2489 -787
916 -787 801 1357 2105 1499 -789 -1954 -1625 -1441 101 2359 2200 815 148 -1368 -2816 -1296 501
933 501 923 2023 2076 -172 -1874 -1426 -1710 -824 1787 2267 865 693 -727 -2729 -1554 252 456 1678
951 1678 2472 206 -1450 -1095 -1628 -1384 1413 2134 855 1021 -179 -2628 -1771 36 -228 1372 2843
968 2843 586 -1106 -596 -1886 -1946 974 1807 927 1495 568 -2306 -1856 -302 -617 921 2837 928
985 928 -549 -126 -1628 -2228 506 1414 737 1787 826 -1906 -1748 -674 -958 575 2547 1358 -340
1002 -340 -108 -1495 -2522 -36 1241 681 1685 1289 -1417 -1713 -650 -1326 25 2357 1464 278 468
1019 468 -1070 -2328 -345 1013 384 1609 1738 -884 -1507 -576 -1435 -501 1907 1339 259 583 -857
1036 -857 -2435 -730 423 241 1443 1847 -461 -1171 -654 -1517 -903 1588 1437 412 869 -389 -2231
1053 -2231 -979 -24 -85 1472 1944 191 -741 -530 -1511 -1051 1035 1309 791 991 -131 -1716 -1151 -283
1071 -283 -286 1185 1643 490 -385 -687 -1581 -1228 385 887 1069 1073 202 -1231 -1525 -750 -377 677 1696
1090 1696 936 41 -547 -1103 -1228 -18 792 1088 973 571 -704 -1432 -813 -339 241 1307 1279 119 -589
1109 -589 -710 -1280 -661 891 984 802 890 -439 -1530 -947 -498 -188 1027 1608 154 -319 -362 -1352 -932
1128 -932 779 762 639 1327 51 -1369 -581 -470 -679 1110 1582 293 -15 -41 -1616 -1179 599 377
1146 377 567 1516 179 -1300 -509 -667 -930 798 1378 121 352 141 -1669 -1142 218 -58 525 1736
1164 1736 403 -890 -267 -786 -1166 793 1122 224 709 109 -1456 -888 138 -232 535 1463 364 -583
1182 -583 -262 -958 -1029 417 782 445 904 159 -889 -979 -354 -360 487 1208 536 15 -259 -1034 -919 -8 468
1203 468 605 748 617 -669 -714 -670 -367 278 862 769 291 -148 -640 -894 -339 387 558 817 457 -204 -865
1224 -865 -773 -380 51 652 982 464 -196 -514 -1029 -758 193 531 633 808 57 -850 -640 -419 -431 500 1083
1245 1083 445 -12 -126 -845 -857 160 421 446 837 284 -790 -568 -502 -564 536 1031 317 249 58 -922
1265 -922 -827 -12 99 573 1000 400 -562 -271 -548 -763 440 852 325 601 317 -802 -751 21 -200 444
1285 444 957 292 -205 -167 -600 -738 294 625 349 551 316 -599 -610 -284 -168 324 903 449 -56 -179
1305 -179 -729 -740 97 321 419 736 333 -348 -401 -514 -383 227 726 511 329 -38 -466 -620 -183 260 330
1326 330 619 358 -209 -486 -530 -404 83 641 583 249 0 -429 -696 -294 39 444 640 578 -96 -321 -456
1347 -456 -617 -181 353 497 306 262 -308 -584 -372 -97 108 755 575 -60 -143 -375 -705 -211 368 264 443
1368 443 294 -343 -592 -325 -285 -102 669 388 -31 19 -412 -646 -175 251 189 456 510 -368 -537 -251 -374
1389 -374 36 550 393 124 237 -332 -760 -73 26 -54 569 591 -284 -325 -119 -507 -119 550 271 122 396
1410 396 -379 -720 -27 -139 -186 682 496 -111 -149 -244 -635 -279 445 146 245 537 -302 -709 -22 -207 -107
1431 -107 608 450 -114 53 -137 -610 -63 295 -23 394 547 -266 -322 -108 -398 -196 522 302 102 142 -163
1452 -163 -472 -293 -78 59 340 516 -4 -250 -353 -459 -150 268 459 290 186 -56 -387 -415 -59 95
1472 95 272 400 136 -249 -362 -233 -183 94 456 281 -9 -6 -288 -508 -34 195 182 430 349 -364 -310 -76
1494 -76 -405 -162 446 386 -44 195 -215 -498 -30 103 -218 403 452 -291 -210 -43 -480 -182 532 188 -61
1515 -61 474 -149 -596 48 130 -300 459 616 -390 -96 101 -675 -108 508 112 21 393 -269 -629 57 -111
1536 -111 -180 488 355 -246 54 84 -560 -71 420 -99 98 553 -175 -360 123 -165 -210 509 474 -250 182
1557 182 60 -584 -109 248 -26 227 503 -227 -287 -54 -311 -300 397 341 -52 296 -65 -421 -171 -7 -92
1578 -92 133 354 -116 -69 17 -292 -177 204 118 -11 151 -36 -284 -145 -40 -11 304 245 153 -42 -169 -241 -233
1601 -233 15 370 188 94 35 -159 -363 -134 -36 94 136 225 53 -229 -85 -263 -161 235 208 32 112 -38
1623 -38 -340 -153 64 -17 169 321 -120 -177 41 -342 -163 283 175 130 331 -21 -420 -28 -9 -30 245 407
1645 407 -83 -37 76 -385 -343 240 142 69 316 -172 -347 -89 46 -216 115 372 -4 -154 97 -428 -287
1666 -287 152 64 45 255 30 -309 -84 -141 -97 87 355 11 -36 112 -376 -131 157 59 34 354 61 -151
1688 -151 -8 -67 -175 104 335 43 121 53 -88 -182 91 -43 -39 186 210 -269 -52 -93 -332 84 223 35 137
1711 137 228 -222 -304 18 -151 92 386 155 -69 -25 -5 -223 52 140 61 30 208 -106 -155 -77 -68 179 123 191
1735 191 50 -93 -128 -172 -26 165 109 81 2 -147 -168 -209 -41 32 135 96 -15 49 -88 -180 -59 52 13 122
1759 122 133 -16 17 17 -68 66 168 66 137 -26 -64 -167 -63 61 16 143 30 -85 -51 -113 47 176 13
1782 13 203 266 -15 -14 -15 -78 -112 132 59 89 111 -160 -234 -26 -165 -50 204 132 36 21 -4 -168 15 200 -13
1807 -13 -18 -6 -81 -58 83 39 -12 291 28 31 54 -130 -301 -95 -13 2 145 121 -116 -107 35 -141 -70 266 121 122
1833 122 176 -118 -181 122 23 -103 235 66 -228 1 -77 -134 17 119 11 -8 178 -131 -52 128 -94 24
1855 24 118 69 -39 -9 -107 -150 -59 21 4 88 73 12 67 -32 -23 161 255 11 3 -21 -130 -72 -38 -86 35 270 -59 -54
1883 -54 47 -166 -193 119 22 12 110 -51 7 14 56 -37 12 85 -69 63 -25 -145 -35 72 -135 -16 81 -25 -120
1908 -120 -74 -67 -65 132 122 131 56 -91 -229 -9 58 -49 239 216 8 98 48 -88 -100 123 -86 -92 63 -111 -178 75
1934 75 -11 -199 322 201 -171 69 40 -124 105 14 -52 76 211 14 -118 114 -126 -106 25 62 -82 14 -2
1957 -2 -291 -24 54 -166 168 166 -77 4 125 -91 -68 135 -55 127 212 -38 -160 26 -49 -67 -30 92 -36 79
1981 79 69 -126 -74 -2 -94 72 94 20 -1 74 -42 -32 174 83 -66 -3 -20 -85 -77 21 -8 3 78 -62 -26 73 34 15
2009 15 62 9 56 49 -3 78 -33 -68 77 56 22 21 -142 -160 3 -81 14 50 86 -114 -206 -64 -82 -36 123 -29 -5
2036 -5 -38 16 -67 17 24 -122 -19 -23 -22 -6 32 -96 -148 28 101 -61 130 -1 -5 -1 -155 -141 17 85 -40 111 -7
2063 -7 -142 -8 -84 -128 88 160 77 -63 51 -90 22 9 34 2 44 95 -85 78 34 -76 75 136 -61 -17 34
2088 34 -51 -43 144 35 13 115 -71 -105 61 6 -108 101 144 49 58 75 25 32 -2 -65 10 73 70 -5 -24 78 -69 44
2116 44 40 -32 -31 29 -111 3 -109 -71 -27 124 -97 100 28 -2 50 156 48 -50 31 -25 -24 -61 30 88 4 -29 -57 123
2144 123 14 -1 37 12 -49 42 75 -3 -62 -90 32 1 63 -1 -30 111 37 -157 38 -72 -49 -3 -90 56 -36 116
2170 116 56 -2 22 11 -44 40 103 -122 66 -51 -22 -60 85 93 103 -58 28 -55 -20 -81 -83 -65 114 -63 19 47 6
2197 6 -112 -16 -50 73 -37 -108 87 58 -54 33 77 -66 -33 66 -39 -43 -15 -7 -23 2 -43 -51 -43 -19 67 112 167 48 77
2226 77 -90 8 -6 12 39 -90 -34 -46 -9 -81 -4 26 109 38 -27 101 -37 -33 -111 -68 -111 -18 -58 -112 -8 51 -52 51
2254 51 67 -19 -36 22 -13 14 163 86 -11 88 -47 -53 -12 -156 111 109 27 67 92 41 -54 -65 -194 66 35 60 -87 -60
2282 -60 -57 -89 -173 55 33 33 -59 -64 103 -3 -28 -37 24 130 -20 -137 -54 -67 56 55 -19 94 85 56 27 76 -53 -56 6
2311 6 -32 -62 82 18 9 181 9 18 39 -68 -70 -16 25 -102 -25 47 17 53 107 11 -54 -31 97 -41 9 -35 -70 -11 -50
2340 -50 -70 -12 69 -21 41 83 -141 75 81 -33 -34 19 -20 39 20 33 -71 4 15 -94 -2 101 -58 -101 -18 -48 -87 -40
2368 -40 -83 2 -58 -68 -228 20 -17 -27 -15 12 -71 -66 31 -59 -7 99 122 -57 -9 -152 -40 14 45 14 49 17 -27 92
2396 92 -27 -29 -33 -6 -7 -52 -3 64 -6 -96 153 11 -46 82 119 -77 28 0 -94 -41 36 -61 -6 19 42 46 -62 52
2424 52 -41 -24 -13 50 -27 -8 -13 -7 21 68 -3 42 71 7 28 -56 -56 -73 29 -13 16 12 16 50 15 94 50 -35 95 -3 -120
2455 -120 -9 11 -21 -14 38 37 84 -188 -104 78 -65 7 3 76 -29 7 -23 -39 -29 -12 -150 63 -131 26 -22 -116 -34
2482 -34 85 -40 91 55 -67 -54 -76 140 -32 -67 -104 15 48 29 30 -74 -4 30 17 -32 -79 -30 -15 -60 9 1 -16
2509 -16 -70 -10 -129 23 -61 34 139 -96 -6 101 -30 -69 -122 -13 113 48 -99 84 58 -113 29 -8 -44 -16
2533 -16 121 -11 -55 86 18 -46 111 14 50 151 39 -26 -62 79 -8 -122 46 -50 -6 -75 -43 -102 14 107 -20
2558 -20 -6 -27 -94 -5 -25 -61 -6 69 -23 -27 1 -42 -21 -28 52 -10 106 37 -43 32 48 15 -12 -49 58 7 42 11 97 -127
2588 -127 -93 27 32 7 -32 -44 35 -43 82 -33 33 -55 -41 -12 81 13 77 173 -3 -69 -1 -88 71 -1 68 -55 34
2615 34 94 -66 229 -67 -46 -9 37 -47 -58 34 20 -90 15 -80 25 37 -50 63 29 37 -10 44 -21 -144 -41 59
2641 59 3 90 -65 -59 21 -116 24 -2 -8 84 -31 70 75 -15 -2 24 -45 -72 66 7 -5 -29 -47 -45 25 -89 -49 17 5
2670 5 103 15 88 -56 23 43 -78 28 72 73 92 -41 20 40 -81 -72 -105 102 31 -16 50 -47 28 3 -60 101 34 -21
2698 -21 -45 106 -25 -97 -17 -72 -22 18 104 56 13 -61 5 -22 -100 8 -19 112 147 -115 59 86 -41 -74 -71 68 -61
2725 -61 64 11 29 -18 72 -15 -26 6 37 47 -68 -12 -2 -41 53 -14 72 25 -4 -111 -9 9 25 71 63 -41 17 2
2753 2 -60 -50 -100 47 20 -62 50 -40 57 -60 -45 -44 -136 -55 31 132 -24 57 -84 -59 30 53 8 -86 72 37 -4 144
2781 144 -3 -23 90 36 25 -42 48 -102 45 86 -33 4 12 -54 146 32 -95 80 44 76 -122 99 -22 -2
2805 -2 71 -28 -28 6 68 -1 -11 -9 -62 84 -10 -80 -6 21 -39 1 87 -53 99 130 35 28 -37 -7 86 -113 -84 23 87 -10
2835 -10 29 -64 144 -51 28 58 -119 10 15 -77 -4 -18 75 46 159 -5 34 -48 20 -11 -91 4 -38 57 9 -41 -39 8
2863 8 28 77 -31 64 -59 -19 2 -52 46 -66 -25 -75 4 52 -216 -29 -107 -59 29 -31 14 -57 -108 84 -42 -12 114
2890 114 -12 -69 10 -9 24 -37 31 137 -45 41 91 66 9 13 34 73 -97 9 3 -11 102 112 48 -14 -75 -103 -64 19
2918 19 -52 -2 49 33 -88 35 -8 158 -22 99 88 106 -20 -67 28 89 8 -55 20 53 56 -4 11 -45 16 82 -5 32
2946 32 18 -34 -60 22 -28 27 167 34 3 50 34 61 104 -39 16 -64 -51 46 -7 -20 -51 125 74 -94 39 -46 131
2973 131 -26 -24 62 -5 -24 94 -28 128 -9 83 1 -26 68 -37 5 10 -48 -40 7 73 153 110 -34 -145 -25 -78 14
3000 14 -108 -65 0 44 -37 43 -13 -3 -138 -120 73 43 39 5 27 -39 16 39 -29 -29 178 13 67 40 16 -49 -2 16 -36
3029 -36 58 -133 -23 -12 -27 19 79 -64 -30 87 -43 1 5 -5 101 -49 21 61 52 73 83 -14 63 25 -19 91 86 -48
3057 -48 -99 69 81 10 -21 94 -60 32 40 -17 -28 76 -12 -98 132 -58 38 79 77 69 -73 186 108 -37 35 -2 6 58
3085 58 -40 17 117 -11 -12 72 71 -39 44 -28 -77 -124 -24 23 -4 -11 4 46 66 57 -73 -47 33 3 40 36 -137 -29 80
3114 80 31 -62 -14 -10 30 85 -2 -57 8 -53 -22 -140 -27 60 -44 83 -69 -83 62 21 -15 -79 30 124 -27 -20 8
3141 8 13 83 -75 -118 92 -46 -71 33 45 -51 12 119 36 26 -152 -76 10 84 96 28 23 44 18 -66 53 12 44 10
3169 10 20 -97 -70 10 26 -48 -6 -26 67 50 31 55 -1 -112 -44 82 15 4 31 -52 -209 37 23 -59 -49 127 -8
3196 -8 -7 100 -72 -73 39 -18 -69 42 61 19 113 -39 -32 -55 37 -83 6 -63 -25 -9 -90 -74 -46 117 18 -72 -11 44 -105
3225 -105 35 12 -4 49 46 -84 -62 32 -30 -19 -165 56 -111 36 82 -59 51 120 0 93 63 8 -7 29 53 -78
3251 -78 11 83 -94 -92 -44 40 18 12 -117 -101 -47 59 -18 -33 -19 5 -100 120 -56 -38 124 -23 3 192 -118 -93
3277 -93 10 21 -96 2 55 -64 -20 -19 -4 -43 -97 -89 -125 -1 7 -16 149 -42 -63 22 55 -57 115 3 -135 -94 14
3304 14 43 -6 5 -56 -85 54 17 -18 24 -7 57 17 36 73 -64 99 -31 -22 15 -120 19 -104 70 -7 105 23
3330 23 11 -35 14 -21 30 -61 -59 -22 -21 140 -47 -62 54 44 -45 -8 13 -59 39 18 59 -48 44 53 -48 46 16 -108 -14
3359 -14 7 28 78 7 -23 12 53 -146 -7 14 -72 -39 12 -19 -188 54 100 -75 140 -14 -77 -10 -3 -122 -72 38
3385 38 -55 20 38 -49 -44 -71 59 60 46 61 84 65 59 -22 -25 -25 41 8 -79 -17 74 67 -56 27 -89 46 12 -34 -10 19 -48
3416 -48 85 131 -89 -91 36 -42 51 59 -37 -27 66 24 3 -103 -55 118 121 80 24 27 15 -46 -23 -4 15 43 25 -1 59 67
3446 67 95 29 60 -40 -14 35 -82 -37 -117 -50 124 -127 -150 103 -30 30 -11 -14 55 48 7 -50 115 -110 -72 67 16
3473 16 -59 58 77 -60 8 116 60 -46 67 12 15 100 42 23 30 -94 -40 -21 13 -13 -107 -25 3 -95 -27 -17 15 4
3501 4 62 32 -18 -53 -27 18 -36 -135 6 77 -82 6 84 62 -46 29 99 -67 -49 65 23 115 -34 59 -127 47 -52
3528 -52 -125 48 34 -41 -28 47 -12 3 -59 -73 -30 110 79 -123 -32 11 -200 136 -3 49 -9 54 -26 -23 89 -35 -71
3555 -71 -16 -36 -100 -8 17 -2 -38 64 -202 30 95 103 -47 90 26 17 -85 29 41 -1 -13 -48 94 175 -58 52
3581 52 30 12 -37 143 -44 47 123 174 -35 93 6 -77 -50 -75 -23 -14 15 32 -161 74 22 -27 66 101 -29 -47 26
3608 26 -15 -30 91 27 -132 -25 -103 65 37 -12 -23 110 20 -84 -96 101 -46 87 40 -66 65 62 27 -33 -13
3633 -13 152 -80 40 111 -29 -70 45 -113 -113 30 -18 -129 -24 64 -77 -44 38 81 124 13 61 -71 -1 -84 12
3658 12 -1 139 4 133 -63 0 133 39 -15 -57 13 -85 -24 42 -74 -18 17 -44 -57 15 -87 -31 -31 35 -48 -47 65
3685 65 -28 -48 111 14 34 40 112 45 -49 110 -134 -126 112 -112 -3 110 -20 -44 -29 64 -169 82 113 34 56 30
3711 30 -34 12 58 74 -154 -58 86 12 55 85 -36 -80 60 1 27 7 -11 -63 -50 25 -94 24 -19 -30 -86 31 84
3738 84 32 14 -76 154 -6 -77 -99 11 22 -8 -63 47 -26 -73 17 -43 -101 -18 9 -45 99 49 -66 49 98 71 52
3765 52 39 -85 -16 -23 -140 31 103 142 -9 59 53 -159 -27 59 -17 25 33 -49 -59 57 -24 -114 47 -10 -65 -97 123
3792 123 -73 -82 -9 37 -13 73 -52 1 77 45 -28 -35 89 37 -26 22 -47 -22 -42 40 -119 48 34 -116 57 27 43
3819 43 -57 18 9 -3 110 -36 -44 -8 -78 19 85 -81 -29 7 -30 -77 -85 7 -20 -13 -125 15 10 -19 -28 -25 -19 61 -60 -48 128
3850 128 67 13 5 -56 -65 -103 14 -45 -18 -21 43 83 30 28 55 -51 -95 -142 71 -59 41 -120 -55 -87 -65 46 6 -91
3878 -91 63 -64 -57 -17 42 29 -73 42 -70 16 -73 -23 -63 -9 45 38 13 -37 -38 35 70 191 94 100 54 -20 63 -50 1
3907 1 81 -106 -5 -17 39 -41 103 4 31 76 3 110 82 36 7 -15 -20 98 -76 -12 14 66 55 112 38 32 54 27 140
3936 140 99 75 39 -68 30 -85 -35 -36 25 -77 -40 -2 -20 -117 -61 -9 37 -55 61 122 94 -7 51 -37 54 -10 103
3963 103 44 -93 -30 -41 -51 32 81 22 -50 57 -18 -32 -45 -11 61 38 47 28 39 -129 11 93 2 65 33 17 20 18 36
3992 36 14 -79 70 82 -151 2 25 27 -68 -57 -52 -4 -51 3 -67 -103 -6 71 -71 -75 -15 -77 -31 -9 9 111 68 -44 40
4021 40 -54 -72 3 14 14 -12 -29 -45 -77 147 32 8 -86 90 -93 -77 45 -64 -10 -122 -12 16 0 39 23 -42 -15
4048 -15 -68 36 91 -18 69 -38 38 82 60 20 -17 115 19 -62 -60 32 -82 6 -2 -51 57 -11 -20 -12 36 -39 -10 -17 5 -47
4078 -47 89 44 83 100 7 116 26 78 17 81 -44 128 12 72 16 -31 66 -20 79 3 -63 -101 48 0 -3 -1 -13 43
4106 43 -61 -58 -66 -95 102 22 -45 -63 -43 112 22 -49 113 -5 2 -26 -40 -28 -49 103 -4 13 93 60 -22 43 -36 29
4134 29 51 72 49 46 2 56 153 -84 -64 68 -49 -68 37 -1 67 100 130 -62 2 -77 -9 69 -67 -9 -2 24 24 155
4162 155 -11 63 60 56 -34 -65 -72 -101 5 14 12 8 26 128 18 -95 -58 -28 29 92 -54 64 -18 59 1 11 10 -81 22
4191 22 -37 46 61 133 -54 -70 -42 17 91 -4 90 -60 12 -67 -19 -87 2 43 -157 20 -20 -33 -26 -64 -66 47 22 -35 3
4220 3 22 -7 10 5 50 -123 -4 43 -32 -30 -46 -65 63 94 -30 -45 11 53 6 142 15 24 -70 -23 68 88 51 31 -75
4249 -75 56 -64 -22 2 69 -92 -40 32 87 15 67 -49 -60 -175 -43 -43 99 -44 -33 73 -76 101 -93 62
4273 62 -203 -7 -16 60 -34 110 10 2 -24 3 22 3 11 -12 -11 -49 -81 19 23 41 -15 -58 -86 8 59 -81 6 -24 -17 -73
4303 -73 -53 -25 63 9 -23 -73 77 -23 116 68 -14 -57 -60 41 -34 168 -92 -2 43 101 -169 48 21 75 73 -30 -18
4330 -18 -102 13 -40 38 -117 -43 -4 35 30 86 -18 -72 -92 5 -65 25 7 42 40 -30 67 -29 -57 6 23 -45 -77 -1 -23 2
4360 2 127 5 -53 42 7 79 50 67 -12 46 2 131 -47 -30 39 -80 59 119 25 -64 2 -21 34 -40 -38 79 -72
4387 -72 45 -57 -74 29 -100 -26 -63 1 87 46 -7 -57 -35 52 -21 108 0 49 157 28 11 105 -21 53 2 28
4413 28 4 -69 -36 -68 -60 -86 -84 -41 -21 58 -3 24 105 -35 -40 71 9 -35 -24 -45 -22 -30 -149 -41 -37 39 19 -34 77 -29
4443 -29 34 25 14 29 40 -59 -80 -5 56 12 -58 -19 30 -37 75 -119 65 -40 80 -85 76 -7 51 29 -164 -67 -37
4470 -37 -14 -2 19 -41 -28 11 59 -141 91 -148 46 -44 -40 -111 56 -78 12 -83 -17 2 -34 22 58 9 36 83 65 -3
4498 -3 -42 131 51 101 140 -21 20 83 9 -52 109 53 24 29 -50 -54 -13 42 -163 47 -22 32 -109 -67 -3 29 9 48 -3
4527 -3 -31 16 90 0 14 -16 -14 91 -10 -52 -22 49 6 98 26 -77 -54 -21 111 0 -94 64 52 -59 -25 61 -60
4554 -60 21 -154 13 -10 -86 -26 -32 -29 57 55 -66 -62 -3 -132 -62 -56 17 -55 -2 53 -47 84 37 40 -96 19 26 66 111 -30
4584 -30 -8 11 -55 82 -24 -42 -72 -12 86 40 2 -81 -64 -11 95 57 27 -2 29 45 -62 35 -5 -45 -22 66 -105 -19
4612 -19 -16 82 -6 -75 0 86 0 -54 57 -45 -64 -74 77 24 -38 10 28 18 -27 -28 -25 -33 22 -32 -29 -79 36 -10 -5 1 22 33
4644 33 -39 -133 115 12 -97 -64 0 64 -57 -73 87 94 0 -130 -33 -109 -15 -44 -15 59 -56 -28 -19 58 74 -51 37
4671 37 116 35 2 -13 -93 32 13 -121 -19 -132 -30 -20 32 133 -16 -90 14 -57 -25 -55 -91 -73 -14 -53 -34 -8
4697 -8 -89 -15 -23 33 2 -21 26 -44 28 75 -23 -79 -58 4 -103 40 -23 20 5 -2 -63 -29 52 -5 19 41 -32 87 87 55 -31
4728 -31 -102 -33 -31 14 6 2 107 49 -17 72 18 -28 20 134 -4 75 -133 -7 0 -68 88 41 16 41 -44 -25 -40 -44 -132 95
4758 95 -138 52 42 -44 -26 77 -84 -35 175 41 -24 -47 -2 -119 -5 -46 30 7 -38 -55 28 -30 15 -38 -16 -102
4784 -102 -80 61 -70 -76 93 -57 171 37 135 -40 26 35 67 -16 33 -36 -8 -8 76 -31 50 78 -144 70 15 54
4810 54 -8 -55 -35 -27 6 5 5 5 -38 -149 -153 -8 34 -44 42 8 7 142 15 23 -73 -69 -58 -11 -21 -111 -65 -124 16 -37 -9 126
4842 126 -5 40 111 -28 -17 58 -116 -19 -25 -34 45 39 45 22 -59 38 4 -20 -1 70 94 -91 -23 -81 43 -118 -61 4 -79
4871 -79 19 9 -22 -32 -109 -55 -6 65 71 4 35 79 -16 58 -95 -30 3 -33 117 82 -127 35 14 -106 16 78 4 -7
4899 -7 29 -45 1 -13 -37 82 90 -16 -66 -27 -42 -215 33 -124 53 -92 22 -79 19 61 -47 50 -85 18 -3
4924 -3 42 44 -26 34 93 -75 -33 39 -35 -6 81 45 -43 -101 65 -50 1 12 -59 -38 -26 -41 17 -15 47 -48 -44 82 64 8
4954 8 -52 72 -28 -28 -73 0 28 57 -4 -123 -17 25 72 18 79 -54 -17 67 83 -69 5 -48 9 10 25 34 -61 19 1
4983 1 -56 10 45 -4 -27 0 9 106 113 21 -51 11 18 -46 -56 -21 26 -48 -48 37 16 -34 -42 48 -13 -47 -62 -84 -16 31 11 -28 -86
5016 -86 49 54 -67 -74 -11 36 -3 115 0 52 -27 -43 -118 36 12 -43 79 -67 -8 87 113 50 -15 -96 12 -4 97
5043 97 -47 56 69 17 -1 20 83 -41 16 -42 66 -47 -11 -52 -13 76 -150 10 -39 -49 -4 -20 -65 27 -6 -97 -71
5070 -71 31 -66 -87 -115 -16 -19 -54 98 -53 -15 -30 57 29 32 11 -11 7 2 10 170 51 -45 15 19 -12 -70 52 25 1 61
5100 61 -44 -40 15 16 107 57 -75 83 6 37 100 -17 -44 -12 -62 -43 -75 -14 -30 -38 111 99 21 -37 -48 126 -6 -46
5128 -46 45 61 59 55 -57 76 -16 -122 -68 35 -7 56 17 74 -13 -41 -22 -69 124 -126 -38 -157 -64 -1 -83 -50 -71 44
5156 44 11 60 100 -23 -4 85 -86 -44 -140 47 43 -2 94 38 -2 -33 92 43 120 -34 13 51 116 16 -64 -81 -17 3
5184 3 5 -43 56 -45 -2 5 50 119 13 -44 85 22 36 44 20 35 -86 -16 -25 47 35 70 10 110 46 -2 -98 17 -29 -91
5214 -91 -5 66 57 94 -60 75 43 36 21 -25 -73 -127 36 -64 5 -46 -93 -15 -15 -60 78 41 90 8 -66 71 70 56 -18
5243 -18 -4 25 -28 -50 -5 -19 54 -27 -37 24 -13 64 -4 -32 -84 6 -12 33 14 32 12 59 -38 -39 -101 -124 -27 2 59 5 -8
5274 -8 -37 2 -9 -75 -64 -39 11 -52 38 53 66 37 118 23 118 -68 -1 14 64 71 -16 -39 -65 40 -28 -14 4 41 41 -102
5304 -102 -123 -42 -7 -47 49 53 -37 -77 -143 -96 -12 -3 -41 26 88 -55 22 -41 43 10 107 -40 21 -39 116 -13 -6 7 93
5333 93 -93 -120 56 102 33 51 30 -63 14 34 51 26 -122 87 -7 17 -51 97 -124 -9 -27 0 65 82 39 75 -211
5360 -211 17 47 -27 5 40 -69 32 19 27 28 54 -28 -58 -15 -33 -17 -69 108 45 -19 46 -61 63 18 93 13 -114
5387 -114 -38 -42 -137 -41 11 -75 -18 7 -56 -170 14 -22 -116 62 -46 -65 23 -4 -20 1 -26 -36 -47 49 71 12 -77 -40
5415 -40 -38 47 -2 -68 108 65 5 -42 21 39 -87 42 -16 -13 22 129 -17 54 25 23 30 27 77 -74 68 -26 -100 -22 -101
5444 -101 -29 151 -17 -7 -75 102 104 -43 -83 16 11 54 0 -1 -50 146 -42 -58 36 -10 81 161 48 96 -35 -21 9
5471 9 9 105 31 -99 27 -2 17 -33 114 23 -6 78 -149 -17 -5 -76 106 -108 -5 -59 -68 4 -45 -58 -20 -63 -77 23
5499 23 -43 -26 -21 4 7 122 51 -52 -7 54 -145 107 -14 -80 -45 -41 70 -29 5 50 45 2 -90 64 47 -54 4 27
5527 27 -14 -87 -11 109 43 -17 51 -129 -61 -44 2 74 26 13 82 -11 -16 34 3 -36 81 -67 102 69 50 -2 51 8
5555 8 26 23 -20 -26 -50 42 43 -16 -28 -105 69 156 24 101 22 55 -84 75 10 -86 -107 -90 56 4 14 81 -159 22 -1
5584 -1 -110 -35 63 13 50 -30 119 -32 -55 18 -41 33 -37 56 -53 -108 84 74 32 -77 23 70 -40 -65 -64 119 -2
5611 -2 49 -20 -91 7 -86 -54 -57 -89 -1 54 19 -2 70 -9 -23 73 36 -49 -97 45 -23 35 12 -7 -65 -23 24 116 -33 49
5641 49 3 89 13 -89 174 -31 -2 -87 71 -59 49 11 16 11 6 -78 -2 112 -18 44 51 -10 70 4 -84 53 10 60
5669 60 -70 42 37 10 37 -6 36 38 50 75 14 77 -112 57 55 -155 -20 134 -51 -80 -77 106 4 -12 26 -118 -66
5696 -66 -23 22 -80 -4 -23 103 57 81 25 4 17 0 26 -12 14 73 68 37 33 -3 9 -57 2 0 -10 -5 56 61 14 -27 -51 -40
5728 -40 -2 -85 69 -17 -101 -4 40 71 -120 -86 -4 41 87 172 67 -13 59 -14 47 -38 -20 -22 19 -47 96 33 14 86 43
5757 43 93 -32 -30 -13 -10 24 59 -57 -49 -5 27 51 -6 81 3 -80 3 85 -17 48 22 -36 -55 -88 78 39 41 94 78 -77
5787 -77 -22 26 64 -46 -7 -29 74 34 -22 -25 36 18 2 13 24 -76 13 -57 52 -35 -11 -45 -16 -95 45 64 -101 110
5815 110 8 -25 -5 73 -3 89 18 -12 12 50 -122 42 -180 110 -59 -12 -85 21 149 105 -39 112 -64 37
5839 37 8 2 24 64 23 -77 76 46 -40 81 69 -35 -38 -26 50 -24 32 -23 61 -134 78 85 67 21 42 -95 14 -4
5867 -4 23 88 22 18 -64 -2 42 41 -10 127 -121 -80 -18 32 -24 26 -54 -20 48 -46 -14 -32 -130 8 42 -86 35 118 -37
5896 -37 0 4 86 -25 -63 1 43 18 -85 -55 -42 47 -35 -46 -38 -57 11 -70 -113 -47 -96 71 -39 -4 11 29 -119 47
5924 47 -31 -23 -69 -62 -26 -77 -47 -21 36 27 -24 106 -21 66 23 -3 72 -7 -138 -48 116 110 28 117 -51 -79 -25 22 -12 -90
5954 -90 -3 41 56 9 25 36 -5 -5 -106 -16 56 9 -109 -25 18 18 -10 -101 100 48 -12 85 87 26 -1 13 1 79 -103 68
5984 68 -39 -139 -86 67 9 -39 -23 -72 13 67 133 -17 71 13 -9 16 26 56 -97 -36 -74 45 -28 117 32 -8 -20
6011 -20 -110 -3 8 0 -31 -13 49 26 21 -34 29 -67 14 55 -34 2 -140 -67 -15 9 -54 65 27 6 -71 1 0 64 -10 -15 33
6042 33 26 19 9 -7 -33 140 -98 -1 -71 -44 -19 -20 -48 65 95 1 4 14 55 86 -12 39 21 18 61 38 -28 -101 52 -13 21
6073 21 39 -116 -32 127 -4 -137 -89 37 26 130 70 -74 -25 -40 51 109 -52 39 85 45 40 -35 -8 51 -136 9
6099 9 38 -8 -6 94 40 -6 -56 -76 71 67 120 -23 91 136 26 -22 -61 27 48 96 -32 37 -15 93 -29 -102 -29 -90
6127 -90 -35 88 56 -19 79 25 -79 95 112 -3 31 -67 -64 -17 35 24 56 112 -15 -96 6 15 -33 45 5 -94 -37 -13
6155 -13 26 7 40 -139 22 -7 -39 -39 34 20 34 93 80 -10 -37 -43 46 143 16 49 15 -101 17 -97 -65 58 -3 15
6183 15 31 -26 1 4 -23 48 18 8 -42 -13 72 103 -7 91 0 -79 67 -46 32 -102 19 142 -4 56 3 30 98
6210 98 43 -68 -119 -29 22 -73 49 -120 -88 -28 -24 -36 -135 22 -172 34 44 -17 -18 72 -81 42 95 0 73 -8 -63
6237 -63 -106 72 -1 -136 31 -13 4 36 31 55 -61 13 79 -27 60 -39 23 79 -74 13 14 -32 -29 149 -45 -8 -12 152
6265 152 -19 74 17 -25 38 42 58 -88 -6 127 119 -116 -54 -45 7 44 22 -63 58 -55 -47 -70 -89 -129 -29 9 -128 -25
6293 -25 -22 -41 30 7 -53 -68 -1 -44 -27 47 -23 -12 18 -52 -85 -22 127 -5 27 4 -48 -156 94 40 17 52 -92 -36
6321 -36 -103 -13 28 -19 -43 31 -71 -16 -27 -68 23 -2 23 40 26 -15 37 22 92 64 -18 -38 -20 76 7 -33 30 -11 78 98
6351 98 140 -148 -52 27 -3 21 -33 9 62 36 -132 135 -28 -101 66 20 -135 -59 21 90 -14 13 -112 59 21 -73
6377 -73 17 -109 70 -36 -58 25 66 -43 0 -43 -2 -50 67 81 59 3 -94 78 95 1 67 -3 -27 43 -86 -9 -6
6404 -6 5 -43 -1 35 -35 9 -26 -45 -66 12 -74 62 -79 56 -157 55 116 15 -75 31 27 -51 -17 -57 24 -23 13 -27
6432 -27 24 58 6 -38 11 -116 -79 -170 -54 -133 -26 39 -51 104 -32 -49 -33 -51 -54 -47 -80 -31 -45 -35 -25 -12 162 -96
6460 -96 -46 -10 -62 -80 68 99 41 21 -43 -58 41 8 66 -10 -25 -18 -54 98 154 110 -127 29 -43 -49 -79 49 32 -71
6488 -71 -17 -41 -39 63 60 -117 -45 -144 88 124 77 -76 -43 28 -3 -8 -52 -101 17 1 -30 -40 13 169 -68 40 -35 -14
6516 -14 -7 114 53 -114 -21 -182 -68 -149 49 -97 63 18 -7 -52 -75 57 52 69 -46 -80 -78 -13 -80 -90 10 -15 -93
6543 -93 -37 -12 32 -41 0 -64 -8 -21 -132 -56 90 30 24 51 -16 115 36 114 5 -117 -55 -37 70 -140 35 7 -87
6570 -87 -14 68 -66 6 19 -11 -63 -20 -94 34 69 -19 58 -48 -18 -7 1 52 21 -2 37 48 -64 19 -107 15 -36 56
6598 56 2 -36 7 -54 14 34 -42 -15 26 -8 -39 -80 -144 -36 123 70 -41 -5 -58 21 73 -15 93 22 -145 -26 7
6625 7 -2 -1 15 80 55 -7 36 89 4 -45 -33 70 -73 -42 -10 -71 -36 -26 -46 -16 72 -9 -5 -90 -57 -59 -26 -76 53 54 -23 118
6657 118 -101 -32 19 -97 8 -69 27 33 -66 50 49 7 96 -80 -172 -53 -5 -47 -26 63 10 45 -65 -71 63 -6 74
6684 74 -119 -36 2 -12 44 -74 -2 103 48 -17 -104 -84 93 -4 -42 -10 25 36 1 -83 -19 -16 -65 -35 -39 -20 21 87 -27
6713 -27 -58 -28 14 49 -17 17 -97 -94 -58 54 103 36 140 -87 -23 87 -3 -85 22 -18 42 89 -32 -41 63 14 -64
6740 -64 -56 -18 -9 57 71 -59 70 17 76 -29 -62 26 -55 109 51 -29 117 -37 -11 69 -12 -18 -6 22 66 -94 88 -39
6768 -39 47 60 -2 -19 -139 -173 -19 -35 28 -83 77 6 69 -7 -80 56 -95 -138 -51 -132 -77 46 -30 34 -34 -75 49
6795 49 -18 -77 1 78 29 -93 -8 27 -29 45 154 -4 108 115 -61 9 -9 12 -18 79 -29 -81 5 -59 49 -15 -98
6822 -98 -73 34 -53 18 -81 -129 32 60 31 -25 -58 -73 -34 -35 13 -50 -29 87 33 73 87 -41 54 -16 111 -41 -8 115
6850 115 -127 -25 44 42 -6 9 -50 -63 -31 12 69 -48 -32 -20 -40 115 -94 -8 81 -53 -31 -38 49 -61 72 38 -38
6877 -38 55 -31 -20 -6 -35 138 22 41 11 -47 31 58 30 -42 47 66 26 16 -6 42 -2 48 -32 -95 -140 -116 47 -113
6905 -113 -17 28 55 33 87 -12 4 -58 -82 -55 -58 -10 6 32 -76 -15 95 -24 -27 -16 44 -83 75 -131 -35 -25 27 0
6933 0 -31 28 -130 20 79 163 13 -82 73 33 -80 61 18 4 7 -42 -110 -95 67 -12 -22 11 17 -20 -7 23 20 -41 -25
6962 -25 91 -59 -68 43 -15 -95 -66 69 85 120 1 -63 10 -22 95 51 65 74 -35 -24 43 30 27 86 58 93 39 -32
6990 -32 -68 60 -36 127 37 42 104 78 31 62 20 -159 19 43 2 -40 4 -87 -29 -34 43 20 39 34 162 104 -32 -46 -61
7019 -61 -4 -26 84 32 -37 59 -16 28 116 -26 10 82 -36 -19 16 -34 30 22 -47 58 2 31 -14 -118 30 72 -41
7046 -41 62 67 25 23 -55 -68 -114 52 95 43 0 64 81 98 24 -62 31 -63 -3 80 -29 19 56 13 8 -47 17 -8 -180 -126
7076 -126 -15 77 67 66 11 41 54 13 -65 -47 123 -105 13 33 -86 85 9 -27 87 -21 -83 22 -116 -39 129
7101 129 -43 56 31 -18 -96 -11 3 -27 55 -68 51 -39 16 -96 -42 -35 36 112 -21 -39 88 44 -8 1 104 28 45
7128 45 86 85 71 -101 -94 -5 38 84 82 6 139 -20 -57 93 -4 37 -47 -24 74 92 66 -30 24 -54 33 -33 44 41 -29 -56
7158 -56 -21 -65 38 -71 34 -82 9 8 58 -71 68 -7 36 120 -13 15 19 -80 -47 53 -48 113 -32 62 21 -46
7184 -46 -112 48 50 -12 -108 72 29 16 58 -51 -187 18 -47 -19 56 -27 30 65 26 -44 -25 -58 41 -59 45 18 23 -36
7212 -36 48 -51 -70 10 -52 4 41 172 0 41 40 -29 4 60 36 -2 -1 28 36 138 22 30 75 -32 -34 -34 -6 94 -52 30
7242 30 -79 67 44 -105 30 31 71 -47 93 23 -34 -84 30 3 -63 57 30 -74 -38 -5 -55 -26 70 12 53 -42
7268 -42 0 -131 22 -41 49 -47 -39 81 -28 -14 -46 29 33 -36 75 47 89 -47 -31 20 34 -51 -39 -56 -87 62 39 53
7296 53 -4 59 109 -38 -25 147 19 25 7 0 -7 115 27 -103 -143 57 -60 14 54 34 -61 21 -13 -75 11 -30 -52 11
7324 11 -26 -15 -3 9 23 -42 75 153 -21 -44 20 -60 -20 12 67 38 64 -16 47 -14 -31 35 32 -4 26 6 -4 35 27 -151
7354 -151 -41 63 46 -8 65 -108 24 34 -107 -51 -15 27 -67 6 -71 -60 8 115 -68 25 -32 -68 66 127 63 86
7380 86 69 -97 97 -48 7 52 -35 -48 -36 -44 -52 72 25 -37 53 -47 -23 2 87 -17 -8 -32 -24 -33 -73 52 52 28 -82
7409 -82 16 -6 55 -32 133 37 -2 -162 69 48 32 -92 -61 -11 16 62 -73 14 0 80 37 -145 -120 55 -35 7 58
7436 58 19 27 -13 -80 32 29 57 -24 -113 0 98 20 47 96 -12 12 16 23 80 30 -19 14 13 -53 12 22 -8 35 -29 50 -18
7467 -18 46 48 14 74 74 26 35 28 47 39 -87 57 16 51 14 51 23 158 -42 33 1 35 -30 -43 82 80 -54 -15 11 -46
7497 -46 32 -46 -26 -27 118 27 -1 51 -77 -16 14 87 -26 -67 95 -12 40 4 19 83 75 96 76 -55 -88 -80 -52 59
7525 59 33 -167 -56 107 26 -49 -204 -53 -49 -28 44 -87 -25 29 -44 129 23 -23 -102 -5 -43 15 -72 66 -65 88
7551 88 140 15 83 138 -24 22 -80 41 49 -31 13 -108 66 83 -76 -85 -35 1 -38 -46 8 -109 -9 137 78 47 38
7578 38 -62 64 -74 10 -38 0 33 24 -4 -68 104 -2 -22 -168 73 52 -33 81 -116 67 34 -28 -17 -84 -14 110
7604 110 -60 8 68 -78 116 -6 26 -87 85 -31 24 21 54 -83 -58 -84 93 118 106 59 -45 24 -48 -79 61
7629 61 -8 -14 -87 8 -23 75 129 43 42 30 -36 110 5 94 -64 64 126 94 -103 -74 134 -50 -1 16 -76 41 -72
7656 -72 27 -8 -11 9 52 66 -9 46 57 0 -104 -130 -95 -17 -90 -49 29 -108 47 59 95 -1 44 156 -81 7 -90 14
7684 14 -88 -57 44 20 -40 43 -32 -42 -69 -2 -6 13 -88 -16 -65 132 -33 -68 119 -75 74 14 136 -30 7 -16
7710 -16 -128 -9 93 75 -68 139 99 -26 -99 -5 -36 -14 47 -151 -71 -43 -34 80 -47 -8 81 -104 40 -98 -44
7735 -44 -50 -16 50 -12 61 -24 -5 -17 65 -8 59 -11 -24 -63 -16 22 -14 46 -40 -33 24 12 61 30 23 -5 -84 53 -57 11 -181
7766 -181 60 76 -20 -3 26 55 -37 107 -8 76 53 -65 22 -68 119 -152 -35 33 16 64 -1 -50 83 -3 -88 -6
7792 -6 -70 24 -6 33 -85 82 78 69 -12 66 -87 26 -43 -52 66 -13 -10 74 8 22 -109 -6 80 -70 -18 49 -52 -12
7820 -12 -25 -72 23 78 -4 -3 -43 -45 111 -62 -10 -60 -51 -48 28 17 -43 73 -42 -11 -5 -75 -4 -59 -3 27 -41 -107 11 -48
7850 -48 -46 -24 -33 119 52 12 57 2 -16 114 -18 -15 -40 15 50 128 -29 -75 70 -18 13 81 -79 -1 -29 -7 -31 -13 4
7879 4 86 12 -38 -78 71 -59 -1 8 -34 12 9 -21 61 52 -24 61 -22 55 86 26 -31 64 -67 26 -16 121 90 -36 -4 16
7909 16 -15 13 -44 7 -17 26 -52 1 -86 -31 37 4 12 -7 -21 -56 48 -31 17 -58 60 27 -82 -1 -38 88 48 -73
7937 -73 -6 -145 34 -172 -26 -52 -42 30 235 -43 -77 34 -1 -10 -133 3 89 174 -6 41 -55 -5 -30 -25 22 -16
7963 -16 46 -49 53 -70 5 72 108 20 2 85 -17 40 -44 -69 63 48 50 8 47 47 9 1 4 35 -105 -2 47 25 85
7992 85 32 7 30 -84 55 50 70 6 -41 28 50 -31 14 -69 -20 59 -22 92 -155 52 -71 69 -65 -101 -8 48 4
8019 4 52 51 -24 -57 62 7 -30 60 -53 80 4 -82 -11 63 -47 -25 67 -3 20 95 -21 -50 25 -21 46 -44 28 -101
8047 -101 -21 -80 -27 -58 -102 -61 14 65 16 -107 -75 55 16 0 -54 -30 3 16 -5 28 37 25 -30 62 22 59 -10 -33 68
8076 68 -12 59 8 -45 30 -51 34 24 46 -36 -93 55 -46 2 121 69 -18 148 62 20 47 27 -16 5 48 82 49 41 26
8105 26 -18 85 -43 125 -30 87 -75 -59 -86 -31 32 -43 7 119 66 -25 -55 94 -108 -31 -61 -64 -82 16 -57 19
8131 19 48 -44 13 29 117 -96 62 -63 50 -11 -60 -107 4 30 -46 99 -48 -49 14 68 -28 156 26 -82 37
8156 37 13 24 -9 -85 106 108 2 -94 -43 28 -40 1 -170 -31 -63 32 -20 -67 33 -126 -11 -23 53 -2 76 -1 25
8183 25 9 49 4 -55 125 -17 66 -29
8191b9
##END NTUPLES=NMR FID
##END=
