##TITLE=1H_Pr NCO Bn
 CDCl3, 8 sc, 
 6.08.2021
##JCAMPDX= 6.0         $$ Bruker NMR JCAMP-DX V2.0
##DATA TYPE= NMR FID
##DATA CLASS= NTUPLES
##ORIGIN= UXNMR, Bruker Analytische Messtechnik GmbH
##OWNER= root
$$ XWIN-NMR		Version 3.5
$$ Fri Aug  6 08:51:37 2021 Russian Standard Time (UT+4h)  she@DPX200
##.OBSERVE FREQUENCY= 200.131506
##.OBSERVE NUCLEUS= ^1H
##.DELAY= (6, 6)
##.ACQUISITION MODE= SIMULTANEOUS
##.ACQUISITION SCHEME= undefined
##.AVERAGES= 8
##.DIGITISER RES= 18
##SPECTROMETER/DATA SYSTEM= spect
##.PULSE SEQUENCE= zg30
##.SOLVENT NAME= CDCl3
##.SHIFT REFERENCE= (INTERNAL, CDCl3, 0, 15.7039)
##AUDIT TRAIL= $$ (NUMBER, WHEN, WHO, WHERE, WHAT)
$$ ##TITLE= Audit trail, XWIN-NMR		Version 3.5
$$ ##JCAMPDX= 5.01
$$ ##ORIGIN= Bruker BioSpin GmbH
$$ ##OWNER= she
$$ F:/spectra/data/she/nmr/H-F/1/audita.txt
$$ ##AUDIT TRAIL=  $$ (NUMBER, WHEN, WHO, WHERE, WHAT)
(   1,<2021-08-06 08:50:02.42 +0400>,<she>,<DPX200>,
      <created by zg, POWCHK disabled, PULCHK disabled
       configuration hash MD5:
       00 E9 B6 7A A2 85 ED C7 34 08 36 98 17 FE 4E 26
       data hash MD5: 16K
       FB AA 52 EE 24 72 DA EA 49 55 E9 CF EA 41 7A 92>)
$$ ##END=
$$ 
$$ hash MD5
$$ E2 BD 2A C5 49 C5 FA E6 83 E0 2C 70 78 49 4B 50
##$RELAX= 
##$RELAX= 
##$RELAX= 
##$RELAX= 
##$RELAX= 
##$RELAX= 
$$ Bruker specific parameters
$$ --------------------------
##$DU= <F:/spectra>
##$EXPNO= 1
##$NAME= <H-F>
##$PROCNO= 1
##$TYPE= <nmr>
##$USER= <she>
##$AMP= (0..31)
100 100 100 100 100 100 100 100 100 100 100 100 100 100 100 100 100 100 
100 100 100 100 100 100 100 100 100 100 100 100 100 100 
##$AQSEQ= 0
##$AQ_mod= 1
##$AUNM= <au_zg>
##$AUTOPOS= <>
##$BF1= 200.13
##$BF2= 200.13
##$BF3= 200.13
##$BF4= 200.13
##$BF5= 200.13
##$BF6= 200.13
##$BF7= 200.13
##$BF8= 200.13
##$BYTORDA= 1
##$CFDGTYP= 0
##$CFRGTYP= 5
##$CHEMSTR= <none>
##$CNST= (0..31)
1 1 145 1 1 1 1 1 1 1 1 1 1 1 1 1 1 1 1 1 1 1 1 1 1 1 1 1 1 1 1 1 
##$CPDPRG= <>
##$CPDPRG1= <>
##$CPDPRG2= <>
##$CPDPRG3= <>
##$CPDPRG4= <mlev>
##$CPDPRG5= <mlev>
##$CPDPRG6= <mlev>
##$CPDPRG7= <mlev>
##$CPDPRG8= <mlev>
##$CPDPRGB= <>
##$CPDPRGT= <>
##$D= (0..31)
0 1.2 0 0 0 0 0 0 0 0.06 0 0.03 0 0 0 0 0.0002 0 0 0 0 0 0 0 0 0 0 0 0 
0 0 0 
##$DATE= 1628225401
##$DBL= (0..7)
120 120 120 120 120 120 120 120 
##$DBP= (0..7)
150 150 150 150 150 150 150 150 
##$DBP07= 0
##$DBPNAM0= <>
##$DBPNAM1= <>
##$DBPNAM2= <>
##$DBPNAM3= <>
##$DBPNAM4= <>
##$DBPNAM5= <>
##$DBPNAM6= <>
##$DBPNAM7= <>
##$DBPOAL= (0..7)
0.5 0.5 0.5 0.5 0.5 0.5 0.5 0.5 
##$DBPOFFS= (0..7)
0 0 0 0 0 0 0 0 
##$DE= 6
##$DECBNUC= <off>
##$DECIM= 32
##$DECNUC= <off>
##$DECSTAT= 4
##$DIGMOD= 1
##$DIGTYP= 9
##$DL= (0..7)
0 120 120 120 120 120 120 120 
##$DP= (0..7)
150 150 150 150 150 150 150 150 
##$DP07= 0
##$DPNAME0= <>
##$DPNAME1= <>
##$DPNAME2= <>
##$DPNAME3= <>
##$DPNAME4= <>
##$DPNAME5= <>
##$DPNAME6= <>
##$DPNAME7= <>
##$DPOAL= (0..7)
0.5 0.5 0.5 0.5 0.5 0.5 0.5 0.5 
##$DPOFFS= (0..7)
0 0 0 0 0 0 0 0 
##$DQDMODE= 0
##$DR= 18
##$DS= 0
##$DSLIST= <SSSSSSSSSSSSSSS>
$$ [...]
##$SUBNAM2= <"">
##$SUBNAM3= <"">
##$SUBNAM4= <"">
##$SUBNAM5= <"">
##$SUBNAM6= <"">
##$SUBNAM7= <"">
##$SUBNAM8= <"">
##$SUBNAM9= <"">
##$SW= 20.0188882624521
##$SWIBOX= (0..15)
0 0 2 0 0 0 0 0 0 0 0 0 0 0 0 0 
##$SW_h= 4006.41025641026
##$TD= 16384
##$TD0= 1
##$TE= 0
##$TE2= 300
##$TE3= 300
##$TEG= 300
##$TL= (0..7)
0 120 120 120 120 120 120 120 
##$TP= (0..7)
150 150 150 150 150 150 150 150 
##$TP07= 0
##$TPNAME0= <>
##$TPNAME1= <>
##$TPNAME2= <>
##$TPNAME3= <>
##$TPNAME4= <>
##$TPNAME5= <>
##$TPNAME6= <>
##$TPNAME7= <>
##$TPOAL= (0..7)
0.5 0.5 0.5 0.5 0.5 0.5 0.5 0.5 
##$TPOFFS= (0..7)
0 0 0 0 0 0 0 0 
##$TUNHIN= 0
##$TUNHOUT= 0
##$TUNXOUT= 0
##$USERA1= <user>
##$USERA2= <user>
##$USERA3= <user>
##$USERA4= <user>
##$USERA5= <user>
##$V9= 5
##$VALIST= <valist>
##$VCLIST= <CCCCCCCCCCCCCCC>
##$VD= 0
##$VDLIST= <DDDDDDDDDDDDDDD>
##$VPLIST= <PPPPPPPPPPPPPPP>
##$VTLIST= <TTTTTTTTTTTTTTT>
##$WBST= 1024
##$WBSW= 4
##$XGAIN= (0..3)
0 0 0 0 
##$XL= 0
##$YL= 0
##$YMAX_a= 464615
##$YMIN_a= -440659
##$ZGOPTNS= <>
##$ZL1= 120
##$ZL2= 120
##$ZL3= 120
##$ZL4= 120
##$ABSF1= 10
##$ABSF2= 0
##$ABSG= 5
##$ABSL= 3
##$ALPHA= 0
##$AQORDER= 0
##$ASSFAC= 0
##$ASSFACI= 0
##$ASSFACX= 0
##$ASSWID= 0
##$AUNMP= <proc_1d>
##$AZFE= 0.1
##$AZFW= 0.1
##$BCFW= 1
##$BC_mod= 2
##$BYTORDP= 1
##$COROFFS= 0
##$CY= 11.3945322036743
##$DATMOD= 1
##$DC= 2
##$DFILT= <>
##$DTYPP= 0
##$F1P= 2.36226072786647
##$F2P= -0.459571619588291
##$FCOR= 0.5
##$FTSIZE= 0
##$FT_mod= 4
##$GAMMA= 1
##$GB= 0.15
##$INTBC= 1
##$INTSCL= 1
##$ISEN= 128
##$LB= 0.24
##$LEV0= 0
##$LPBIN= 0
##$MAXI= 10000
##$MC2= 0
##$MEAN= 0
##$ME_mod= 0
##$MI= 1.114404
##$NCOEF= 0
##$NC_proc= 0
##$NLEV= 6
##$NOISF1= 3.799351
##$NOISF2= 2.8
##$NSP= 1
##$NTH_PI= 0
##$NZP= 0
##$OFFSET= 15.70392
##$PC= 1
##$PHC0= -13515.21
##$PHC1= 10.60099
##$PH_mod= 1
##$PKNL= yes
##$PPARMOD= 0
##$PSCAL= 0
##$PSIGN= 0
##$REVERSE= no
##$SF= 200.130013532006
##$SI= 16384
##$SIGF1= 3
##$SIGF2= 2
##$SINO= 400
##$SIOLD= 16384
##$SREGLST= <1H.CDCl3>
##$SSB= 0
##$STSI= 0
##$STSR= 0
##$SW_p= 3612.71676300578
##$SYMM= 0
##$S_DEV= 0
##$TDeff= 0
##$TDoff= 0
##$TI= <>
##$TILT= no
##$TM1= 0
##$TM2= 0
##$TOPLEV= 0
##$USERP1= <user>
##$USERP2= <user>
##$USERP3= <user>
##$USERP4= <user>
##$USERP5= <user>
##$WDW= 1
##$XDIM= 8192
##$YMAX_p= 0
##$YMIN_p= 0
$$ End of Bruker specific parameters
$$ ---------------------------------
##NTUPLES= NMR FID
##VAR_NAME=  TIME,          FID/REAL,        FID/IMAG
##SYMBOL=    X,             R,               I
##VAR_TYPE=  INDEPENDENT,   DEPENDENT,       DEPENDENT
##VAR_FORM=  AFFN,          ASDF,            ASDF
##VAR_DIM=   8192,          8192,            8192
##UNITS=     SECONDS,       ARBITRARY UNITS, ARBITRARY UNITS
##FACTOR=    0.0002496,     1,               1
##FIRST=     0,             0,               0
##LAST=      2.0444736,     0,               0
##MIN=       0,             -440659,         0
##MAX=       2.0444736,     464615,          0
$$ Real data points
##PAGE= N=1
##DATA TABLE= (X++(R..R)), XYDATA
$$ [...]
1958c49O16o4m74L89lk79L45K4m42L66M7l80K05J99l89J52K68l98O8K87l39J4
1980a37K73l08K3L13k52j29M20k39j85L80j17j78L40j98k33M63q3l45M09M2l98
2001a39K99K2l17L18J35n88M40K20p40K67N02o16N7M09m29P6M45n68j17Q50n86
2022f0l56P63k69m47P13l99l80R54m03p75J035M9j018P33K23p75O98J5r35Q83
2042B49M58j444N95Q80j118J7Q80r55K46Q71j427J84J567j283p30J611n82p48
2060g29J176p19m08J585r64j314K183j04j871J440L49j332J181l0j608J814M75
2077A124k561J290J759k230R2J406j424N75J118k367O97K548k636r12K911j135
2093B55j300J817j062m99K399k010j551L579n19l157K372Q63k184J529k05j922
$$ y = [-349, 267, 203, -271, 118, 115, -164, 181, 205, -237, 129, 176, -204, 1, 200, -189, -37, 231, -167, -99, 188, -151, -137, 136, -172, -149, 164, -88, -217, 203, -36, -221, 159, 42, -136, 204, 6, -227, 236, 153, -192, 217, 259, -139, 160, 182, -135, 183, 318, -270, 170, 390, -350, -83, 419, -197, -140, 269, -160, -84, 361, -207, -324, 526, -60, -416, 347, 78, -369, 344, -55, -435, 519, 116, -659, 376, 425, -593, 140, 363, -412, 286, 301, -634, 249, 707, -737, -142, 738, -380, -363, 517, -438, -192, 679, -748, -564, 1003, -280, -1010, 601, 19, -729, 447, -272, -680, 905, -59, -1373, 810, 706, -1165, 275, 624, -708, 473, 443, -1165, 649, 1124, -1437, -147, 1612, -618, -526, 880, -544, 31, 1149, -1218, -521, 2027, -609, -1521, 1390, 255, -1045, 772, -290, -789, 1610, -400, -1951, 1628, 1109, -2048, 324, 1187, -997, 532, 327, -1595]
2109a595K867J55l932K516K489l755L10K325k076Q47J150l225J614L183m303p46
2125b176M562k012k063K657j303m50K949l151j460N182j619m337L920J148l321
2140a474J911j10k205L809n90m985M208K796n621P59L538k759N43J435l667K464
2156E2L407n867k58O212l308k928L909j252q14K955l642j050O356k990n165N835
2172A452J173m823K313M77k335M024j251n307N676K680p328J606M817l822P9J868
2188A299l652L065L048p173R92P272m909l505N377j204j617L081l828m92O868
2203D622m427n312P479Q46o278K898J339k649L619j649m876O616J856q536K864
2218a588N709m986n82K728l106K692K387p262J989P472o173l657O822j276k808
$$ y = [-1595, 1272, 1427, -2505, 11, 2500, -1255, -945, 1380, -696, 151, 1301, -1924, -310, 2873, -1430, -2176, 2386, 374, -1689, 968, -335, -785, 2164, -987, -2447, 2735, 1116, -3221, 699, 1847, -1474, 437, 327, -1878, 1931, 1341, -3644, 564, 3360, -2261, -1502, 2036, -723, -180, 1255, -2412, 52, 3459, -2408, -2666, 3546, 238, -2690, 1219, -33, -847, 2108, -1534, -2584, 3772, 782, -4383, 1452, 2625, -2198, 115, 592, -1743, 2281, 1030, -4277, 1399, 4079, -3249, -1643, 3174, -648, -569, 1299, -2353, 712, 3760, -3413, -2421, 4851, -58, -3563, 1814, 610, -1007, 2074, -1754, -2246, 4622, 195, -5117, 2362, 3208, -3070, -172, 1167, -1482, 2137, 488, -4388, 2228, 4084, -4452, -1588, 4121, -865, -1447, 1281, -1825, 867, 3254, -4008, -2019, 5453, -720, -4377, 2445, 1169, -1639]
2233a639K984k846j81O168n117m551Q405m8p184L682K234l248K861j391m021O660
2249B768P68q592L990N788o162n73L630k866K002J716o449K850O605p137k712
2264d374P574j809l525L226k017j57M966n142l250Q352j165p177M650K482l948
2279a314K030n82k923N658l13p491M825M867o753k32M365k739R05J426m993L032
2295b32M973p032j339P354k637l772L688j183n38L662m482j832P341k342o101
2310d472N254J856m378K001Mk339M521r83n889N122L347o714P39M349l018L31
2326b69J412l587K693L370o270J6O382l466l110M023r21j089K709l215r37N716
2342C457k850m550N275R73m381K035P76k111L014q91m074M410J994n730J355L847
$$ y = [-1639, 1345, -1501, -1682, 4486, -631, -5182, 3223, 3175, -4009, -327, 1907, -1341, 1520, 129, -3892, 2768, 3536, -5056, -1066, 4722, -1440, -2013, 1617, -1249, 753, 2469, -3980, -1130, 5475, -1662, -4374, 3200, 1391, -2134, 1092, -925, -1082, 3884, -1258, -4508, 3844, 2679, -4498, 152, 2634, -1314, 716, 134, -2789, 2869, 2556, -4935, -110, 4757, -1996, -2228, 2137, -602, 303, 1729, -3264, -232, 4741, -2291, -3630, 3724, 1087, -2685, 1003, -180, -718, 2944, -1538, -3370, 3971, 1629, -4472, 782, 2638, -1740, 261, 265, -2074, 2447, 1464, -4425, 697, 4044, -2670, -1931, 2418, -600, -269, 1143, -2444, 249, 3619, -2651, -2635, 3747, 281, -2829, 1194, 273, -816, 1893, -1322, -2259, 3457, 607, -3943, 1332, 2305, -2076, -41, 735, -1376, 1638, 747, -3327, 1083, 3077, -2653, -1298, 2549]
2358B549l137j82J797k472J759K156m698N84M948l494k261L813q81j494K206j992
2374g99n43L923k476k964M364K99l775K054R54j991J845m11k580L167R60m237
2390b210J627K876l000j33J883j741P12J464l005P00L191k783j387L145q56j573
2406a090J701p80p34K376j588j761L067j36k730J778R20j824J007K18j601J799
2422F22M74k622J217J834k271n1J670j215J02R79j578L83J802j814o87K109o88
2439B66j213J310l25n59J152p13q71J597j13j594J233N37j248N90L03q80P50L02
2457E24j315P57R07j322K9J050p06j21N64n91M7P96q29l47J137m07o97P31k0m89
2477c02N50j75m56P38o3p47N76K78o88K31L70n01K04K35m98K82M06o48L1N76m16
$$ y = [2549, -588, -770, 1027, -1445, 314, 2470, -2228, -1644, 3304, -190, -2451, 1362, 481, -1013, 1193, -799, -1342, 2581, 105, -2859, 1505, 1804, -1971, 83, 1037, -954, 891, 480, -2100, 1067, 2027, -2210, -583, 2293, -707, -840, 1043, -698, 14, 1478, -1527, -827, 2364, -419, -1806, 1339, 483, -1090, 611, -169, -903, 1473, -115, -1876, 1191, 1055, -1675, 103, 1023, -801, 206, 424, -1177, 622, 1096, -1526, -309, 1525, -746, -797, 873, -342, -240, 739, -839, -456, 1346, -468, -1155, 954, 266, -947, 363, 38, -521, 631, -82, -953, 644, 531, -1063, 170, 707, -541, 49, 352, -528, 222, 524, -791, -34, 873, -449, -420, 630, -76, -197, 367, -224, -177, 619, -210, -557, 580, 173, -524, 207, 187, -302, 248, 73, -383, 355, 292, -455, 121, 399, -289, -58, 312, -189, 15, 250, -248, 34, 440, -208, -177, 399, -17]
2498a7j67M02k63o3L46l43j43M64j75l60M29Jl18K39J3l02L14L8l38K72R3l13
2520a91J57J51k82J33J58k55J08J59l40J17K58l05N0K07k01r1L02k06p1L14k01
2541b9j64L68j34k97M08r1k98L80k9k98K75j8k86L93J0n31M08J86m30J94K97m62
2563a48J41K51m60K34M14o82O2N81m02j68M49l35j50N70m70k48Q02l61n47P17
2583B50m9o20N89n0n04P07q9q31Q16K68j006M28N61p70L61L31q75N19O48j235
2603e51J60J186q86l96R03n46j69Q80r81j99J448q55r61J442j14j011Q65j59o64
2622f08J186m45j237J561L66j799Q60Q29j226N53L95j273J086P90k050O00J668
2639A256j634l98J545r75o9J079j449K2K104j709j207K383l11j609J384k83q02
$$ y = [-17, -184, 218, -45, -108, 238, -105, -248, 216, 41, -319, 110, 111, -207, 32, 45, -257, 57, 95, -243, 29, 122, -191, -34, 117, -165, -32, 126, -129, -21, 138, -202, -85, 173, -132, -82, 125, -76, -167, 135, -71, -142, 172, -29, -193, 175, 41, -256, 152, 61, -237, 143, 114, -184, 91, 73, -213, 180, 190, -341, 67, 253, -177, 17, 314, -148, -7, 244, -216, 18, 432, -250, -188, 393, -9, -177, 272, -63, -213, 357, -113, -361, 441, 80, -467, 250, 201, -419, 170, 120, -384, 323, 234, -597, 219, 487, -519, -91, 470, -300, 61, 392, -483, 36, 684, -551, -391, 795, -91, -487, 416, -130, -299, 581, -400, -599, 849, -6, -967, 475, 361, -650, 215, 56, -608, 578, 133, -1104, 457, 823, -976, -116, 713, -513, 40, 435, -838, 248, 1038, -1012, -412, 1256, -378, -776, 769, -206, -275, 804, -645, -623, 1481, -228, -1435, 948, 637, -972, 412, 129, -673]
2656f73J636q95j540K454J04k639J524J244j905O65O04j594J530P24k820J209
2672c72K395k661n19K313j219l43J285j800M39K470k591j250L442q05k310J958
2688D32r5j116J917j312j644L365m00l485K438J688k822P91Q70j675J851L40l412
2705b269K204K602l848k31L226j718o35J555k016P65K627l486q84M486j687k887
2721b196K790J18j526J817j420j386L936j106m011L540J759l821R44J458j823
2736i27J770Q6l466K955K409m792K88M009k417r47J915j883R50K351m017j92M959
2753C051k624l131L768J8k100J897j418r01L980k032l834M662J135m590J590J907
2769A378k172J574j43l122L455J740n361J203M370l259j182K519j659O89J841
$$ y = [-673, 963, 68, -1472, 982, 1086, -1553, -29, 1215, -690, -25, 579, -1015, 515, 1239, -1581, -372, 2023, -638, -1157, 1156, -63, -406, 879, -921, -482, 1988, -603, -1853, 1589, 784, -1526, 432, 337, -779, 1138, -174, -1818, 1547, 1147, -2338, 100, 1788, -1034, -243, 627, -1048, 803, 1143, -2269, -65, 2537, -1311, -1542, 1684, -34, -669, 886, -1130, -365, 2262, -1224, -2108, 2378, 691, -2196, 594, 712, -814, 1003, -417, -1803, 2133, 1027, -2984, 556, 2315, -1506, -562, 896, -927, 843, 929, -2537, 418, 2827, -1965, -1677, 2332, -85, -1032, 883, -1000, -50, 2301, -1716, -1908, 3051, 427, -2704, 1064, 1082, -1018, 879, -539, -1440, 2540, 508, -3326, 1336, 2471, -2119, -529, 1378, -794, 780, 637, -2485, 970, 2710, -2651, -1448, 2922, -337, -1519, 1000, -659, 30, 1871]
2784A871l952N99M842l526k913M666l33k692K000q67q65L560k441l178N018N21
2800B310n065K242K305k629J147J23k563L363R95n228K059M132l990j108L203
2815A296j635J81J584l383R48M256m078k170N043q50l030K304l91q91K782k374
2831d08k337M940l81m744K826K193l057Q40O40j998K711M32m469K626L325m304
2847a165n94L406j671m64J566k524J039L123l818j272M751j458k984K651j68j135
2863g17K057j823j448M104j000l908L155J659l324R74R31j672K049k7l381K622
2879B51K317m157J86L171j922m93J407j815R25K094l305l44L899j900k374K759
2895F99j84j367J587j191q96L078j213k898L054R64l031J096J113j545J255K7
$$ y = [1871, -2081, -1482, 3360, -166, -3079, 1587, 1254, -1438, 562, -305, -1170, 2390, -51, -3229, 1789, 2310, -2755, -513, 1792, -837, 310, 433, -2130, 1233, 2228, -3000, -941, 3191, -799, -1907, 1296, -339, -158, 1426, -1957, -1009, 3247, -831, -3001, 2042, 1192, -1838, 466, 75, -816, 1966, -408, -2745, 2195, 1814, -2930, -104, 2089, -968, -128, 512, -1486, 1225, 1657, -2812, -186, 3139, -1165, -1759, 1647, -24, -488, 1078, -1446, -407, 2716, -1102, -2374, 2377, 919, -2065, 586, 418, -717, 1340, -483, -1931, 2173, 1173, -2735, 420, 2079, -1245, -271, 660, -1012, 1037, 1010, -2371, 251, 2568, -1589, -1403, 1768, -154, -647, 760, -1055, -130, 1964, -1341, -1685, 2214, 314, -2060, 699, 515, -852, 735, -456, -1352, 1726, 513, -2385, 669, 1633, -1398, -302, 811, -734, 521, 548]
2911E48k297K253J309l375O34K680k011n94J583j261L42J485k359L2K932j879
2927B2j676K498k99j346J307o03o55K036j084j909K578K91k481J160J099j513
2943e75Q14J88j486J492P37k480Q33J887j766l18J375r07lJ002j500J98J805j497
2961b01r71K022m63j136J080j89p16J299o08j183J754q3j674J125P13j224L34
2978a21M34q24O77N12j521N92J203j338k28J256p33k71Q03p49mR95q95n21J299
2997E66l47r29Q76j7n61O31j98o31R60j4j012O83N33r09K59M78o32K71L43p76
3017d26L19P14q43r2P63l50m12O12l73j07N19l15l38P14k19n97O02Q6m67L12O1
3038A63l73L46Q6n13L57K50n26J24M28m03J5K54l00N1L24l81o2M19k68j79L65
$$ y = [548, -1749, 504, 1813, -1562, -928, 1752, -259, -853, 730, -531, -189, 1296, -1063, -1031, 1901, 22, -1654, 844, 545, -801, 506, -97, -752, 1284, 200, -1709, 869, 1160, -1321, -161, 938, -575, 239, 427, -1059, 433, 1170, -1310, -477, 1410, -356, -674, 701, -206, -209, 793, -707, -509, 1296, -201, -1172, 850, 387, -749, 331, 142, -574, 725, 117, -1066, 688, 605, -1069, 56, 769, -455, -121, 313, -511, 166, 678, -843, -251, 952, -386, -614, 642, -91, -362, 441, -308, -312, 683, -212, -733, 566, 219, -710, 166, 149, -412, 219, 21, -610, 350, 336, -676, 7, 540, -369, -110, 368, -264, 7, 350, -426, -107, 607, -236, -328, 435, 85, -327, 285, -88, -195, 324, 9, -329, 385, 166, -431, 171, 257, -210, 102, 163, -210, 136, 222, -291, 66, 316, -210, -86, 342, -61, -46, 208, -92, -41, 283, -98, -160, 259, -9, -188, 177]
3059A77j49k03L12j56j84L57j42k56L58Ol28K26J10l26J98R5l29K37J29l40K00
3080hK00l31L3K97l09Q5K31l48O2K42k36n3L23k22k22M28j44j78K01m2j26K44
3102A27j42k59M00j24j99L02L1l07K48J6k89K98J14m76K65K41m69J43L32l77J44
3123A9K28m73J95L97n90R6N08m85j11M84k46j47M48m61j21P00l74n40P59l1o20
3144c65M68M3m27N01r1o59P24K98r87L56O04p45K45L85o85L65M90j000J74R51
3164F45q42k84R12m50l00P76p07j75J114p32p74J303j84r28P94%o18Q42l05q92
3184h05J258J30j479Q07Q01j181L59M05q91O81N59j472M91J374j361l84J380o68
3202Dl45Q78j000M8J488j236r00J941m03j390J177R0q27J085n59j076J843n0k054
$$ y = [177, 28, -175, 137, -19, -203, 154, 12, -244, 114, 120, -208, 18, 128, -198, 0, 95, -234, 3, 132, -208, -8, 192, -139, -106, 191, -118, -33, 198, -150, -88, 154, -82, -135, 188, -34, -256, 172, 28, -150, 51, 9, -117, 127, -15, -274, 126, 2, -197, 105, 136, -171, 77, 93, -196, 102, 216, -260, 5, 246, -223, -80, 252, -125, 19, 247, -226, -31, 366, -224, -128, 380, -105, -216, 268, 22, -125, 323, -138, -259, 441, 67, -473, 286, 255, -365, 103, 146, -281, 220, 129, -530, 194, 492, -495, -139, 465, -280, -35, 350, -335, 30, 520, -480, -306, 645, -197, -481, 431, -19, -319, 457, -250, -425, 689, -43, -817, 486, 302, -626, 168, 168, -450, 392, 87, -805, 453, 583, -896, -89, 712, -469, -110, 295, -596, 85, 644, -828, -337, 1037, -324, -708, 672, 4, -341, 537, -463, -415, 1073, -163, -1063, 878, 475, -915, 262, 352, -475, 610, 51, -1025, 818, 768, -1286]
3221a286J267J159j724L58P53j098Q61M38j887R62J664k048l97J913r38m49J061
3238F09j119J77J608j767p56K537p24j915J719J96j117J218p58j083K269l89k478
3255a773K023J159k327N96R90j308J018L19k182J542J655k816o5K571j419p07
3271g24J326j196L11J614k150n71L087j301k219K349J54j454J268o58r48K482
3287A370q25k629K633J096k908P51J349j389Q53K72k103J951J381l279M37K843
3303A803j959q48J801j115J40J491k411J8L215k055k060K958q1j849J372m87q28
3320h95K388j324k303L229N35l279J326J552j778P24K79j843K062R68l493J072
3336g80K960k611q56K213j028p0J219k175L18K985k478j736L397m15k227J582
$$ y = [-1286, -19, 1140, -584, -226, 527, -571, 290, 728, -1159, -197, 1467, -581, -978, 935, -3, -452, 609, -510, -333, 1275, -492, -1248, 1289, 565, -1350, 369, 565, -552, 666, -92, -1175, 1094, 705, -1773, 250, 1409, -918, -322, 668, -640, 378, 697, -1485, 57, 1712, -1104, -1169, 1402, -17, -724, 602, -594, -283, 1331, -819, -1390, 1697, 396, -1823, 526, 680, -774, 494, -164, -1112, 1370, 545, -2084, 549, 1645, -1263, -512, 837, -552, 301, 573, -1530, 421, 1802, -1477, -1040, 1803, -156, -1004, 797, -318, -178, 1313, -1098, -1080, 2135, 80, -1980, 978, 897, -952, 420, -67, -895, 1493, 169, -2134, 1095, 1630, -1649, -323, 1229, -549, 175, 454, -1389, 673, 1641, -1852, -780, 2180, -431, -1287, 926, -102, -172, 1047, -1128, -810, 2175, -303, -2039, 1358, 943, -1284, 298]
3352B98j63q87J990j363j880L387J8l410J816J643k222N90O46j614J839N54l223
3369a981J581K561k918n63K444j186l35J191j882O08K449k682j148L520r64k287
3385a592J968k8r17J553j231j283K947l93l127K284J399k450N92Q19j316J405
3401F30K82k668J790K024l146k0K485j354o08J295j418N06J768k476m54L061j260
3418D37k007K146m8j126J305r35q49K444q39k379K336R38k495P65R96j276R25
3435C38K16j922J654J217k737L75K213j542m69J240j018K21J269j890r4K439j477
3452C3j501K085p4j270J083m56o04J644p31j726K081M54k132R48Q52j199O25K64
3470C76j335J235P08k054N91J662j446m50J293o92q4Q54j288J39J614j267r28
$$ y = [298, 135, -752, 1238, -125, -2005, 1382, 1400, -2010, -194, 1449, -773, -183, 463, -1151, 688, 1242, -1981, -400, 2161, -757, -1320, 1124, -62, -397, 794, -1088, -480, 1969, -713, -1861, 1659, 695, -1592, 376, 348, -569, 984, -247, -1530, 1417, 1024, -2103, 181, 1580, -870, -278, 541, -775, 630, 912, -1756, 34, 2058, -1088, -1108, 1377, 23, -585, 710, -708, -202, 1566, -910, -1364, 1697, 437, -1570, 576, 528, -598, 707, -228, -1077, 1367, 528, -1851, 485, 1423, -1072, -307, 689, -587, 338, 554, -1368, 286, 1503, -1234, -859, 1354, -188, -657, 583, -435, -214, 1055, -835, -929, 1510, 33, -1468, 617, 543, -727, 356, -100, -704, 940, 209, -1517, 564, 1018, -1114, -166, 686, -513, 112, 376, -959, 276, 984, -1070, -479, 1183, -263, -713, 580, -112, -196, 658, -630, -491, 1123, -144, -1072]
3487a072J726k21j147J002j71o16J158o31j036J607P8j641R65O84j141M75L28
3504C47q82Q61L49j467N80J165j325j12J027o02j82O60p31O7J031r93n15J294
3522E72k75r23Q44L1n89O60k83o72J077n0j129P83M79r38L23M10o24M15K86r23
3542e26M15P38r42j39R42n02k97O32n14QN98o00k39Q54l18o07O50N2n33M56p8
3563E0l40M90n7n59M50L49o83J85M00m36P0L30m86K22L86o28K3N84l10k23L46
3584A63j55j14L80l34k15N45k17l53L37J57l85K72R3l86K82Q7m21L03K42m21N7
3605h3L83m30L6L34l76Q0K98k92p3M18l33j42L51j89j78L56j53k17L51p5k46L15
3627A35m2l12K76O1l27L09Pk96J75J74l50J70J73l52J16L15m14J7L21k19o4K82
$$ y = [-1072, 654, 433, -714, 288, 117, -499, 659, 28, -1008, 599, 677, -964, 1, 685, -456, 19, 347, -535, 326, 675, -792, -212, 953, -372, -484, 543, -59, -241, 419, -312, -245, 786, -207, -722, 572, 297, -626, 218, 249, -340, 320, 37, -635, 442, 392, -737, 46, 525, -413, -90, 320, -304, 111, 397, -526, -111, 627, -315, -454, 488, -14, -311, 321, -193, -185, 413, -187, -426, 428, 110, -497, 153, 205, -328, 128, 50, -290, 200, 143, -416, 34, 383, -300, -115, 285, -151, -81, 249, -237, -15, 371, -257, -234, 350, 40, -183, 163, 8, -106, 274, -60, -275, 270, 53, -300, 37, 194, -191, 81, 174, -212, 70, 157, -264, 39, 281, -140, -83, 300, -130, -94, 240, -136, -56, 242, -50, -123, 295, -38, -180, 171, -18, -196, 160, 7, -210, 141, 66, -180, 135, 93, -219, 57, 118, -209, 100, 107, -189, -14, 160, -190, -20, 153, -199, -83, 232, -182, -165, 156, -63, -127, 155]
3649A55k59K0K39k82p8M04k22j98K71k7j71K59r9k44M20j00m10M15R1m08K16J56
3671A48l12K48K4l41L12J90n66J76L90l65J8K96l59J79L19n61KO30m89k23M99
3692B15j55j88L37k72j76O59m17m28O87on85M84O0m91M89j09n42P18R3q47L92
3713h2N10o39J58K63m43K12M10q32K50P62p82k28Q63m32l01O51n21p9Q08o73n79
3734g04J150j59q55O44J16n97O82k08p25J029O6j305Q81O27j067K30M82o80M44
3753E1M00j144N33J045j258k12J188o42l41P76o58m0J059j002n64J615m33j206
3771h33J102J10p79P11k22p40J324j56j548J200P72j560L86P34q68N18L62j371
3789h58Q61J104j733l7J608r66m98J013p45K8J077j296m01J956q15j418J489J45
$$ y = [155, -104, -84, 155, -127, -205, 199, -23, -221, 50, 23, -148, 111, 12, -232, 188, 88, -322, 93, 184, -224, -8, 148, -164, 84, 108, -233, 79, 269, -297, -121, 269, -96, -78, 218, -141, 38, 357, -204, -202, 428, -61, -284, 215, 60, -128, 209, -63, -239, 420, 3, -425, 262, 256, -329, 155, 215, -276, 213, 104, -438, 280, 373, -474, -82, 428, -211, -53, 210, -233, -21, 389, -443, -193, 569, -213, -441, 422, -10, -311, 340, -181, -260, 548, -125, -704, 446, 287, -568, 76, 192, -405, 277, 69, -656, 373, 439, -866, 15, 642, -425, -195, 287, -393, 51, 451, -693, -160, 885, -373, -585, 603, -39, -380, 396, -262, -302, 757, -245, -809, 806, 373, -833, 269, 379, -400, 311, 89, -651, 673, 517, -1031, 169, 941, -619, -233, 501, -367, 151, 513, -858, 3, 1107, -626, -663, 945, -21, -519, 494, -251, -223, 854, -442, -843, 1113, 298, -1120, 369, 514]
3807E14j050Q46l08o65J437l93j655J617O73j845N00R69r96M51K92j373J176R16
3825A106k039K41J900j330n96J190o96M0J010j526m9K061j282j368J940m8j266
3842g12R41k42o07J450o64j575J970N13k180Q35J088j189M39K99j243J211P96
3859A130k240N99J944j678o37J528p39r2Q84j402J45K017j599j257K261j77j534
3876h47J091j08o34J346q35j328K176J26k315J185J258j575L47N15j108J195M53
3893I42k181R07J894k002n21J781q08l18Q84j243K52J773j771r12K459n26j741
3910a131J320O7q04J195p57r63J966r6k270J501J090j713K94P23r69Q71L36j911
3928a251J096J596k156k37J858q81m90R09r38K44J379j667n36K305q28j549J442
$$ y = [514, -536, 310, 2, -663, 774, 381, -1274, 343, 1016, -829, -329, 640, -356, 95, 387, -986, 190, 1106, -933, -692, 1208, -122, -718, 472, -224, -184, 826, -700, -749, 1312, 30, -1338, 602, 554, -712, 229, -13, -620, 830, 166, -1409, 561, 1074, -1106, -271, 817, -372, 67, 366, -877, 334, 1130, -1110, -511, 1433, -245, -882, 646, -93, -185, 699, -703, -558, 1459, -140, -1397, 864, 687, -847, 244, 136, -498, 848, 13, -1315, 861, 987, -1328, -143, 1115, -460, -113, 402, -706, 489, 942, -1239, -332, 1562, -440, -961, 820, 12, -306, 578, -665, -413, 1360, -411, -1323, 1136, 610, -1131, 189, 256, -548, 647, -110, -1073, 893, 797, -1473, 28, 1118, -595, -301, 422, -547, 324, 660, -1251, -155, 1441, -715, -952, 906, 25, -465, 444, -494, -250, 1129, -538, -1074, 1231, 403, -1146, 296]
3945B96J73r33R24o07o32J660m23j863J581R37j836M20Q60r13O26J95j497J211
3963A79R86j930O5J746j033n09R14n97L5J010j323k73J844r47j220J534Qj037
3981e48Q05j85o14J299m33j414J475N27j673N25Q68r32L27K76j041Q79P60j675
3999g74K30J511j138m11J010n25m7O54r51m8J392r56q66J402m5r83O75o5m71Q81
4019D75m33q89J226K52j420O10P57q80K40J76n49N38M03j174L72J059r98l02R24
4038C87l59k02N17o12n0J027p82n53J109j93p78O00L3l93N18k49n16Q70J2j017
4058f31O28M78p30J22M09m64K73K30o92K62P24q41r8O85l45k65M48l03jN61n47
4079i7k89Q02k11n83M79J10m59L54m8l26N21p2o17M24L56o08J05M27m48J41K47
$$ y = [296, 469, -464, 460, -147, -779, 881, 458, -1405, 176, 1113, -723, -303, 557, -356, 270, 465, -1032, 179, 1165, -765, -700, 1046, 13, -496, 418, -179, -144, 866, -457, -730, 1114, 167, -1053, 481, 489, -548, 257, 72, -542, 757, 324, -1090, 385, 912, -761, -236, 632, -300, 27, 303, -738, 141, 901, -774, -544, 967, -171, -582, 428, -97, -144, 510, -441, -489, 903, -53, -919, 483, 438, -545, 130, 65, -406, 475, 42, -847, 379, 631, -789, -179, 578, -302, -62, 114, -435, 103, 506, -668, -296, 763, -235, -537, 387, 28, -174, 343, -269, -319, 708, -74, -627, 482, 289, -489, 111, 144, -249, 269, 20, -496, 374, 386, -631, -3, 475, -255, -133, 276, -188, 85, 315, -377, -115, 609, -232, -330, 355, 10, -255, 193, -110, -111, 450, -97, -386, 416, 205, -378, 101, 211, -248, 106, 58, -268, 253, 181, -436, -12, 344, -264, -159, 268, -180, -39, 208]
4100B08m74K25L53n83l0O06l33k33M40j63j71L06k16k14N74j49m72L94R2m06K73
4121B7K9l12L48P5m02K68J74m24J05K76l20rL08k73Q5K69l24q2L76k52r0L72j97
4144B7j76L03j24k07L55j07k87L21Q2l46K48N9l11K31O1k54J26J50l10P7K26k84
4166a40K3K42j60q9K55j76j03L00j88o0K69j19k20L16j11k01K37l0j44J85K8k88
4188a74K04J02l19J80J72k91J13J26k38P1J79k56N8K77l17l2L38k63o0K18j72
4209h4m9K98j98j21K71p5k37K58m8k21K65q4j34L11p7l67L50J04l90K01J82k41
4231h6J24M1l00K36K16m12M2L52k86l9K64j95j2K76l32j4M23k84k35L96q0k40
4253a45L24j62j52L69j73l75N52L7n24K48J36k90K26N2l52L75J68o48K55M50n78
$$ y = [208, -266, -41, 312, -271, -301, 305, -28, -261, 179, 16, -155, 151, -65, -279, 295, 146, -326, 68, 160, -246, 27, 56, -256, 92, 167, -235, 33, 207, -217, -112, 164, -156, -165, 143, -130, -45, 224, -100, -182, 194, -58, -148, 224, 27, -149, 154, 30, -177, 178, 71, -216, 105, 187, -159, 89, 148, -163, 68, 129, -125, 1, 151, -159, -82, 144, -140, -117, 125, -35, -124, 131, -45, -148, 152, -36, -96, 173, 54, -166, 150, 39, -162, 75, 45, -99, 86, 114, -174, 30, 132, -187, -7, 165, -126, -13, 113, -125, -54, 125, -131, -73, 204, -113, -145, 193, -70, -130, 88, -84, -133, 165, -33, -154, 117, 42, -195, 63, 15, -206, 59, -25, -159, 152, 75, -292, 58, 162, -228, -27, 155, -86, 38, 79, -221, 15, 231, -181, -139, 213, -73, -112, 152, -43, -55, 221, -111, -125, 298, 14, -221, 175, 95, -145, 179, 17, -135, 234, 61, -314, 238, 275, -249, -1, 135, -155, 71, 123, -229, 146, 314, -334, -79, 371, -207]
4274b07L5L70k87O7K83n38J68N90n83k44O46j62l80L65j96j56N25l38m27P82j23
4295A90o51N20J74m77L41r0m02O06J05q55M44N81p61L8M66l99J52L11o69K72O85
4316E81q22k20Q75k92l97M56k42j55O08n58l38R56k41p92P19K39o42L72Ln04O80
4337B86N4r98O99O36j031J19O07m56Q5L35p48M29O54j052r9J051m44n94P22k48
4357Gj56N56n93m07J195m08r37R70K45q41M21P4m54P35j38r82Q86N36j204K08
4377b87P30n68M1L67o94M32O95j195j1J160o92n56Q33k35k54O15o47j98J163n95
4397A04r75J150K35r79L97J89m78P04j56r48J010M26j339L39R41p63l7L86n92
4416c86M44N42j114J55J187q92n62R93k42m11N98n33q4J022p78p95J355Kj112
$$ y = [-207, -172, 198, -89, -22, 261, -277, -109, 481, -102, -346, 300, 138, -242, 123, -73, -229, 296, -42, -469, 313, 190, -461, 59, 233, -244, 97, 7, -395, 211, 316, -539, -95, 486, -275, -237, 229, -170, -18, 293, -376, -104, 581, -241, -461, 414, 122, -275, 181, -61, -216, 392, -166, -504, 452, 211, -581, 138, 377, -265, 107, 110, -394, 286, 340, -658, 41, 677, -354, -235, 372, -84, 1, 336, -412, 17, 671, -381, -480, 571, 127, -467, 255, 7, -149, 407, -186, -593, 602, 194, -743, 227, 472, -369, 52, 126, -328, 407, 269, -713, 173, 709, -495, -287, 443, -125, -84, 283, -411, 21, 716, -479, -490, 670, -22, -578, 255, 20, -234, 381, -266, -464, 699, 104, -871, 279, 514, -465, -68, 121, -357, 347, 191, -757, 253, 679, -660, -321, 620, -143, -180, 206, -386, 58, 600, -514, -359, 828, -64, -626, 367, 125, -286, 312, -221, -305, 717, -61, -856, 499, 501, -611]
4435f11O72J98n32N96k29p44J051K17j314M84Q74r00J6M32m81L16M08j086M52
4454a81J050j074m18J074l48m41N56l50p3Q89p58o41J230n8j149P65K92o12M27
4473A80j15n98R43oj239P77P99j088P0N72n21L23K15q99M34Q68j041k55J070m00
4493H9n15O56l72k7O38o50m45J230l03r95Q01K65o78L87l6m14P60r0r85P50N85
4514F51j025J23O20m97J10K57o65M18O16r60o0J006m86n64O52j66j37M67n12k49
4534d01R41l34p94P56K14p00L55L3k87M78l7q06P17L82r72K68O40n56J1L02m44
4555b34K37M06p25O9P61n00m08O28j41l08M33l68o5O23l45n20O59J37o65K98K01
4576A73l60L21j02m12N06K11o78K05M69m61k3L37l15J16K75n13M2O05m49k86N35
$$ y = [-611, 61, 259, -273, 323, 94, -650, 401, 618, -696, -212, 662, -238, -222, 210, -271, 45, 453, -633, -181, 869, -205, -623, 451, 103, -338, 218, -132, -205, 684, -74, -715, 515, 457, -692, 73, 365, -247, 180, 65, -533, 410, 404, -835, -58, 741, -347, -277, 295, -226, 97, 312, -587, -153, 715, -326, -581, 489, 89, -426, 230, -142, -169, 469, -181, -626, 604, 301, -694, 107, 372, -306, 81, 45, -369, 391, 301, -684, 66, 651, -374, -251, 369, -128, -18, 239, -426, -8, 608, -352, -412, 594, 108, -456, 196, 30, -107, 360, -152, -401, 540, 206, -588, 168, 382, -318, 37, 70, -217, 261, 224, -582, 135, 517, -455, -187, 453, -103, -92, 210, -234, 3, 409, -316, -247, 514, 14, -394, 234, 93, -215, 218, -150, -215, 408, 63, -457, 202, 339, -326, -28, 173, -187, 134, 32, -380, 126, 337, -341, -136, 333, -128, -151, 186, -129, -13, 262, -251, -209, 396, -53, -339, 196]
4597A96j23k22K37j21j78M89k55l95O30j8n27L16J68l58K60j4k90L27J21m88J47
4618i8M00l56m1K98k33pJ65k71J06L59l92p9L87j94j63J72k8j44L43j67k27L49
4640A79J1l79K03J77k72Q7Q8j95J49J20l32J45K60l09n7K36j55k6J85j61k8K43
4662A69k11j48L29q8k06K26l4j04J31q2j50K43L3k84J73J62k78P9J28j45K5J85
4684A53k77J21J00j99MK33j96n2K20j01j05J77o6j85K81j03j12K26n6j45R4M3
4706E5j72J15M4j69J54O8j86J12J96l06O3J03j60P2J92k49L6J03j00o6J77m2j54
4729a14K29n5j90K22j68J8J27j4j17J40lj73J18Q9j89J03k5o8R1j1n6L7K12l09
4753a06M6J44q7RP1j86JJ87j57L8J09o3j08J43r5m3J56q6j21K10p0j84J88J16
$$ y = [196, 73, -149, 88, -33, -211, 278, 23, -372, 258, 240, -287, 29, 197, -161, 99, 85, -205, 122, 243, -245, -98, 302, -54, -95, 203, -30, -37, 128, -143, -37, 322, -70, -149, 238, 44, -119, 53, 25, -119, 224, 57, -170, 179, 190, -189, 14, 191, -81, 6, 94, -101, 48, 168, -164, -19, 241, -68, -125, 111, -44, -70, 115, -46, -74, 169, -42, -190, 139, 51, -155, 71, 37, -67, 64, -18, -168, 75, 108, -176, -3, 159, -119, -40, 88, -57, -32, 153, -124, -3, 97, -102, -98, 135, -61, -113, 107, 6, -99, 78, 12, -173, 108, 5, -107, 119, 63, -82, 12, 55, -117, -2, 42, -127, 27, 95, -91, 21, 217, -89, -26, 77, -83, -11, 181, -68, -32, 71, -29, -95, 82, 40, -114, 115, 60, -130, 92, -76, -58, 69, 55, -62, 78, 75, -98, 20, 109, -80, 23, -2, -70, 21, 10, -46, -9, 203, -106, -60, 84, -3, 6, 77, -109, -108, 79, -78, -40, 69, 6, -102, 41, -54, -97, 59, -27, -148, 62, -8, -192, -4, 112]
4777A12j92R4Kj81J79M0j97J03J79k25j2K56j87l9J74j84P3J19j57q2L00j48j57
4800a30K45o5j61K36j62j09L30j41k51K87K2k17J18O4j73K16m1k65K52J73m09
4821a81J24K23k37N7J09j96J24K08l95Q1K83j97j96K99j28l3J88k17k6L22j64
4842D8l01L82K9l47J82Q7j95K28o7l08M31L3m73J37L25l41R2J32k14K28J62n40
4864b90J83L90l18k17M35j91j37L14l46jM38l18l09N26n8l69L55q8j80K95j01
4885A3l36N04P4o06K84L00l88P8K09l25K62K18n83K21N49o14j65N26j69j36K36
4906A52k91L5M85m39l27P17j77m98M32L2k28K48j38l06N99p8o46M36L57n08Q8
4927e5K13l24L07O2n47L47M24o16j31O20k36k28L41l12NM51m63j57O36j46n84
$$ y = [112, -80, 14, 16, -165, 14, 54, -143, -40, 139, -86, -98, 158, -29, -68, 106, -78, -5, 114, -43, -125, 175, 27, -130, 115, 50, -111, 125, -37, -146, 184, 43, -208, 79, 101, -116, 2, 66, -107, 109, 68, -197, 55, 228, -181, -57, 166, -71, -14, 95, -101, 23, 231, -164, -83, 200, 3, -193, 106, -22, -55, 133, -84, -110, 212, 48, -253, 129, 158, -189, -7, 80, -115, 113, 46, -262, 169, 202, -271, -134, 191, -150, -58, 74, -140, 88, 250, -290, -107, 283, -35, -252, 183, -8, -145, 169, -177, -178, 260, -58, -367, 159, 101, -268, 87, -1, -181, 114, 13, -323, 181, 255, -351, -67, 233, -155, -77, 132, -193, 69, 287, -296, -75, 474, -140, -305, 221, 52, -84, 152, -139, -104, 381, -58, -385, 332, 155, -343, 89, 121, -107, 141, 3, -303, 296, 218, -428, 8, 365, -143, -55, 158, -166, 141, 203, -344, 3, 427, -189, -320, 300, 64, -164, 177, -135, -130, 321, -142, -299, 337, 191, -393]
4948c93N04K8l09K26p9l11O29r3o18L90L39n28P1K78l41K83P3m89L41M20o86m2
4970c07O58l26k40L52k09k5N02o07j06P19k96n00M81R4m22L46p8k68M70j20o01
4991d83N67L25o94J75L59l31Q4J19l93L60L20p41J38N55l10l70N19k35m3K97l76
5012a58n0O35l61n37O84M4m75K48M5k50M08j02n33N28K16o50K31L78m00LJ98k67
5034a65K09L16p11J60O13n01j92M73j25j10J71l39rN74l84l39N89j27l57L30m6
5055C0k23L42j70l62N98K4o02K62L52m04Q3J29k15K31J75n74K87L87m61j66M53
5076A76j79j63K96k71P6L42l65j82N17n4m55L02J12k65K42q2k60L44P9n16K73
5097c3L24m07j2K90k66Q4J97l78J39L76m76p7N25k66j19K14j70lL11k93k13M93
$$ y = [-393, 111, 139, -170, 56, -23, -334, 295, 202, -416, -26, 313, -215, -144, 134, -207, 76, 149, -340, 1, 421, -265, -307, 351, 25, -215, 137, -72, -97, 405, -202, -308, 411, 115, -385, 96, 190, -232, 114, 36, -232, 238, 118, -483, 84, 409, -285, -110, 249, -82, 2, 121, -272, 88, 408, -333, -195, 360, 50, -320, 199, -36, -79, 218, -158, -208, 427, 66, -471, 213, 257, -218, 30, 75, -175, 233, 131, -402, 126, 342, -308, -77, 301, -99, -96, 102, -165, 44, 360, -351, -191, 422, -79, -271, 202, 77, -33, 138, -201, -210, 364, -20, -359, 230, 103, -254, 76, 30, -193, 149, -21, -383, 215, 239, -363, -101, 251, -153, -70, 59, -156, 75, 250, -324, -37, 350, -111, -277, 176, -3, -166, 130, -141, -65, 277, -88, -270, 247, 193, -262, 40, 152, -113, 129, 47, -213, 131, 210, -306, -33, 291, -116, -128, 162, -104, -20, 177, -201, -62, 314, -162, -239, 286, 20, -99, 115, -55, -58, 253, -40, -253, 240]
5119B40r8l70K84J14k68J47l8j67L07J2m59L05J81l02n7K90j79N6J27l22J52K41
5141A96l12m0L68k42j75K39Kj40J28m6j26L02r5l46L31M1k13R2R6j95J86lk16
5164a68J56J65l02J03K19j35q4J36j66M6J82k49l7K65j00j85K01k3j13J59q3r7
5186a10K19j00j62K02L0j99N0J23m4j8N7j52Q0J08k01J32J34j81oP8m0j9N5o3
5210b7k8J70j26j35K33n1p3J03Lj07O4M0j30R4J9j40J23M8j42M7N7j35P7J44k10
5235h2J5J34j02p3J57k5r9J66j10o9J70p6r2J10J7j76J22L6j08J23Kq3Q8qj25
5260h8N5R1j41J04jo3J1J69j78M1J02k01J08R9j51k3J24r6o6J52o2k5P5k6n9J25
5286G6jk05K09j0j32J01j8p6R8L3r6LJ37j97M2R8l9l4J15j72K8J21j20J1J55j71
$$ y = [240, 142, -228, 56, 170, -98, 49, 11, -156, 151, 163, -296, 9, 190, -112, -169, 121, -58, -2, 125, -197, -45, 196, -116, -156, 212, -30, -205, 34, 36, -104, 24, -22, -148, 154, 59, -287, 44, 85, -128, -36, 60, -135, 51, 48, -168, -12, 153, -149, -46, 173, 38, -46, 90, -76, -30, 152, -97, -134, 131, 31, -154, 47, 24, -89, 70, -13, -110, 109, 9, -153, 49, 79, -120, -70, 53, 9, -9, 48, -104, -24, 84, -117, 15, 149, -32, -38, 40, 0, -19, 36, -27, -55, 115, -11, -146, 87, 36, -37, 66, 69, -38, 26, 66, -64, 30, 49, -91, 32, 80, -62, -15, 42, -93, -16, 128, -82, -67, 67, -35, -108, 49, 24, -75, 91, -19, -88, 82, 6, -86, 24, 41, -135, -13, 23, -85, 38, 40, -43, 45, 37, -88, -33, 58, -83, 21, 20, -43, -32, 137, -41, 0, 102, -99, 9, 108, -43, -66, 58, -38, -104, 48, -14, -39, 36, 10, -49, 76, 75, -130, 79, 69, -63, 38, 20, -56, 42, 75, -21, -18, 119, -78, -36, 62, 23, -11, 104, -68, -40, 81, -39, -28, 127, -44]
5312d4k0J60n8j13J80j01q2J24n2j24J60K2j64Q5P3q0KR1j36J67J6k04L2J40j03
5337b9l3O2r0O8Q2j77P0J13q9n9J52n3l5Q3r8j3J16j01r6K26p1j36J24M6r2P0
5363D0oj59K28ok16J24Q2j70J2J56j37J08J7j62N4K26k95%K41j17r2J70j58k7
5387h7K01j71q4L09q9k62K17J8j17K04j06j80K75m2k93K69P6k61Q2J12r9P5L8
5410H5k51J76K18l66L1L45j99j68K20j37l7K68k85m0L59k05k26K81m9j40J62P
5432D9k20L52j50l04L00J92l83J27J02j59J48j0k08J88J88m06R4L11k81nJ44j09
5454d0K2J54k87n2M61k80k12L88o7k00J73j12r1L41j70k88L34J47m67J55K55k40
5476g6J12Q0k89K04J58m12J61L24l14k6K34k21M7J97k26j10L87k60k06L83j6k56
$$ y = [-44, -64, 96, 38, -75, 105, 4, -78, 46, -6, -130, 30, 52, -112, -27, 46, -34, -32, 59, -77, 90, 106, -98, -66, 74, -29, -62, 0, -90, -22, 60, -117, -47, 66, -23, -82, 70, 17, -18, 65, -33, -46, 70, -31, -127, 99, 28, -108, 16, 62, -30, 40, 34, -125, 103, 97, -119, 5, 87, -83, -71, 85, -52, 56, 73, -89, -35, 191, -104, -104, 137, 20, -72, 98, -60, -87, 114, -57, -141, 168, 79, -183, 34, 52, -65, 139, 33, -147, 128, 86, -207, 62, 138, -123, -41, 71, -28, 47, 85, -166, 10, 228, -138, -107, 238, 39, -129, 91, -46, -83, 185, -100, -140, 219, 14, -212, 69, 20, -120, 42, 49, -171, 181, 31, -273, 27, 219, -164, -37, 65, -94, 54, 44, -164, 24, 212, -194, -100, 211, -70, -75, 69, -40, -18, 136, -151, -203, 258, -22, -234, 154, 87, -113, 60, -52, -143, 198, 28, -260, 74, 221, -246, -91, 164, -76, 36, 116, -173, 31, 189, -223, -62, 262, -52, -78, 156, -65, -18, 179, -47, -157, 230, -30, -236, 147, 131, -125]
5498a25K24p8j10K68j77l20M78K9m38K05K16l45J88P2k70K66J24m52J58L93l76
5519g0m2K35r9j17K14k69K5L56l36j45M59j46k83K93p8o8J68j38k45M19j6m33
5541c16K67K40l42Q4J08j61J77P7m34K33L60m52m4L07p1p6J30j68lL33l62j02
5563b15M69j68l36K52J42l10K92n9l10M20m2l64K69J95m12J36J66k31J91mk60
5584a79J63K74m39N1L51k02j38K55k37P0K03k01k07M92j72l49M41n2k30J70qj76
5606a20L16j24l27L30J50m04R3K13k21R6L3k70K55J78l67L4L53k79p9K18p5k9
5628b6J98k95l5L45j66k51L49o9j77J45k4j33K45j47k13L18J10l67J51J80k22
5649h4J10N1k00J44J58k55m9L82k83j23K61j05j4R4j90oK81k07j82L21K9l72K31
$$ y = [-125, 99, 21, -89, 179, 2, -318, 160, 189, -249, -44, 172, -173, 15, 87, -183, 83, 207, -245, -87, 306, -70, -112, 123, 24, -93, 121, -148, -123, 233, -103, -248, 211, 65, -218, 75, -3, -71, 97, -41, -286, 133, 117, -316, -49, 191, -151, -67, 41, -120, 57, 134, -300, -67, 293, -159, -203, 104, 33, -43, 87, -81, -84, 249, -113, -215, 254, 86, -250, 2, 144, -166, 126, 67, -243, 177, 135, -229, 40, 235, -177, -41, 125, -106, 85, 81, -179, -16, 258, -181, -130, 221, 19, -119, 136, -101, -31, 172, -29, -236, 256, 84, -265, 176, 124, -106, 64, 56, -120, 196, 72, -255, 75, 225, -179, -86, 127, -94, 2, 35, -235, 20, 198, -169, -135, 218, -61, -140, 78, 3, -26, 172, -123, -158, 187, 21, -230, 119, 50, -127, 18, -6, -139, 106, -41, -254, 64, 174, -193, -42, 138, -84, 26, 77, -123, 21, 179, -76, -125, 257, -26, -149, 112, 7, -7, 87, -103, -109, 172, -35, -217, 104, 133, -239, -8]
5672hM1j40J94j15j26K78Lk43Q7J64k04J09j5r6J14O8k37P6J80k19p1K47p2r2
5696g7J48r3m2J79j43j38K97m3j63O2N2j09J08J8r3Q8J8k58J72R0j99J56M9j24
5720d5J8J27j94N8J22j32r5K68j46k6R8r0oJ85k01p4J96k9j49J88nj32O1L8j64
5745a29J94M6k20P2R0q1l5J44p8l1J13j70O8J19j58KK33j79m6J07m3p7R2m4r4
5770a05K06j11l4N7P1j26L7P0j56J42J1j38N5P5q3K5Q6n7n1R7q3K2Po0J4R9j10
5797d0LQ2k9n3N6K6r8N8L1r4L3J19k16J80m3n9J3M5q6N7J10j66O3J09j40j2P8
5824B7o2k5J29m6j18J77j63N5K8L7r1P3mj45J78j6j36J87n7j18R4P1j22mJ26j04
5850b9oO3p8J4N8j8j4N9n6o9K02p9o3J21q4q2R9p8o3J08jl7R9j2j51J59o2m0J25
$$ y = [-8, 33, -107, 87, -28, -154, 124, 127, -116, -29, 135, -69, 40, 25, -71, 43, 111, -126, -50, 130, -89, -160, 87, 15, -77, 71, -22, -64, 115, -28, -166, 131, 88, -75, -13, 39, -70, 38, 56, -37, 51, 69, -189, -17, 73, -126, 30, 79, -45, -27, 100, -94, -36, 86, -46, -141, 127, -19, -45, 53, -37, -43, 142, -59, -133, 63, 34, -115, 73, 68, -64, -3, 35, -129, 65, 111, -109, -37, 53, -28, -63, 81, 3, -28, 85, -85, -17, 102, -56, -54, 179, 0, -46, 61, 18, -59, 33, -11, -105, 101, -10, -44, 13, 84, -42, -5, 65, -91, 51, 62, -76, -21, 54, -29, -4, 82, 25, -26, 71, -12, 10, 17, -43, -29, 70, -40, -37, 45, 16, -37, 19, 45, -53, 5, 36, -58, -25, 94, -122, 58, 15, -44, -31, 14, -72, -15, 95, -71, -8, 101, -39, -51, 27, -35, -60, 69, 23, -95, 82, -81, -26, 2, 39, -52, 21, 17, -128, 50, 34, -102, 85, 28, -90, 4, 75, -47, -51, 75, -29, -35, 28, -50, -36, 22, 4, -10, 49, -7, -76, 126, 47, -16, 105, 21, -61, 38, -40, -103, 5, 4, -33, 66, 54, -97, 62, 0, -40, 85]
5879H5Kp4nO6j76Q0P6q9jJ67k33J05M9j23O4Q9r5n5J35j05QP9j38K7J18m6j31
5906a21K10q4r4P6l2j2J37j0j89J93j2j24O6P2j34M8Q0j15N1P7j99K5K21j86K1
5931c5J09q4m9R3j20O2J38j40k0J21n5l3R9m7j10J63p0j88K41j0j49K2K11k29
5955h0P1J20k35J85P6k35Q9J69j98r5J90r3mQ8j38L9K33j84j10K34k9j53J18n1
5979Gm6J40j45j36L19q1k47J82J34j99O3K6j94K13Ok11J17K76l01m5J05J9MP1
6003G7k01J30R0k13rK97j64p5J30j02kJ79j28j63L22r6k89K37J26k37O9M1r1J57
6027H5Nk75K13J52l02J2J83n1o2J22j75R9R8k13k1L00j58j58K19Mj29J25r7j29
6051a53L44j68k31K72J10l00O1J46j71J67l7k02K04R9k91P3K28j56l6J32j45Q3
$$ y = [85, 87, 13, 8, 74, -102, -22, 54, -35, -36, 131, -102, 3, 52, -71, -7, 82, -13, -68, 67, -38, -30, 49, -89, -62, 56, 10, -121, 89, 5, -89, -13, -45, -57, 80, 70, -119, 74, 62, -62, 4, 76, -58, -10, 70, -45, 6, 83, -116, -91, 130, -56, -35, 74, -10, -59, 34, -86, -24, 114, -26, -46, 75, 20, -13, 86, 39, -71, 92, 22, -166, 75, 65, -84, -62, 149, -80, -9, 111, -124, 61, 137, -98, -9, 160, -38, -133, 57, -36, -40, 48, -90, -51, 182, -2, -112, 122, 93, -60, 58, 7, -39, 101, -44, -180, 139, 58, -189, -7, 127, -72, -9, 17, -177, 36, 42, -169, -52, 224, -77, -122, -17, 2, 6, 77, -124, 6, 96, -117, -126, 171, 7, -68, 62, -40, -42, 137, 9, -154, 168, 72, -217, 20, 146, -91, -22, 19, -72, 85, 90, -185, 28, 180, -122, -110, 73, 22, -40, 82, -93, 6, 104, -109, -130, 170, 12, -146, 73, 77, -52, 73, -24, -153, 191, 23, -208, 64, 174, -126, -65, 81, -90, 77, 40, -162, 42, 141, -150, -77, 151, -5, -41, 91, -54, 29]
6073B9J64l14P6K13j93j08K62q9j86K34j99n6L40j21k88L46J0l17K06L9j58J81
6095G1n3k28K75Q0l45R3L06l48Q8J11j28N5J98l17PL30k14j87L50j15j37J52n4
6118a0p2K53k14j77L30pk76J17J72k24J89o6j71K27k0k39J47K40k70l3J64n2m1
6141c3J21j97Q7K11k55o6L29j22j41J43p8l5J43j04j71L39j06j96J21J01j51O1
6163Al0j08J78N6k57J91J59k91nJ69j32J10J7j62Q1J46j68j24K56m8j33J76o7
6186A5j04J28o2j65K93q6k08K39J00k52P7Q8j07Q1J0j87J32J84k93O2J69j57j9
6209f2J26j35M5J39j71n5K84j48j53J88K0j30J13j06m2K28j57j82K02J23k18J20
6231B9N2j08P5L5k04J00J54k44R5J64j88mJ22j31M8J05j18k2J87j74r4K12n6p3
$$ y = [29, 193, -121, -45, 168, -25, -133, 129, 40, -146, 88, -111, -167, 173, 52, -236, 110, 120, -197, 9, 48, -110, 71, 18, -210, 65, 145, -200, -107, 199, -149, -61, 50, -78, -23, 175, -142, -135, 195, -19, -206, 144, 29, -108, 44, -10, -82, 171, -43, -220, 110, 103, -173, -56, 116, -108, 81, 15, -156, 71, 51, -188, -41, 199, -71, -104, 60, 8, -33, 88, -109, -22, 189, -66, -132, 197, 75, -66, 77, -1, -36, 107, 3, -168, 171, 65, -131, -10, 91, -60, 1, -29, -137, 41, 97, -160, 31, 190, -101, -106, 63, -69, 41, 58, -104, -23, 123, -45, -169, 87, 39, -94, 82, 15, -89, 39, -23, -188, 105, 19, -189, 50, 150, -102, -25, 63, -44, 37, 47, -140, -8, 176, -117, -55, 114, -43, -62, 64, -71, -26, 113, -58, -113, 171, 23, -130, 58, 78, -52, 61, -45, -87, 141, -16, -198, 4, 127, -91, 29, 81, -27, 48, 83, -121, -21, 133, -111, -16, 148, -40, -44, 78, -53, -5, 100, -18, -40, 147, -27, -121, 91, 35, -38]
6255c8M3j1RR1o6n8J22J1k19J02J27j76J12k8j20R3K2p1N4O1r8K5O2n9j0R7j44
6282f7PJ32r3r1J54ro0L5k7r2J30J0j11R1J5r0O7J16j93Q1L6o1M5Qj17N6J37j53
6310d4L4P5n4j07J46p1KP6q4l8J13J5j00R4l1m6J3O6j01P6P2k05J16N0j19J10
6336E8K8j17P9Lj03O0N0q7RN8j3q7P8j2q0R8M0j22R7k0j13J30J0j11P9j9qM9K0
6365E4j49J20Q1j70R9l1p4O4N2p7L8N6j19NR2p4K7qp3RJ66j18J2Opk8L3P4j61
6394a01J11Nj12M2R5j26Q2M5m7j4O6j39N8N9r8N5N8m1qK9n9M6P3q0q9K02j18m5
6422e1O9Mm2M8l4K0Pop0O9N7j43K9Q2p6N1P3j38N3R7j39l3J65j38O2K0j05M8N5
6451C4q2j1J65j48qP0o8jJ28j37k7J46n4p4J26j1q1K2O6q7L6M2j12M1R8j11k4
$$ y = [-38, 5, -6, 3, 94, 28, -30, 92, 103, -116, -14, 113, -63, 49, 21, -99, -6, 16, -55, -1, 60, -38, -13, 49, -10, -20, 77, -67, -60, 72, -21, -112, 42, 33, -27, 8, -19, -111, 19, 29, -82, 9, 24, -66, 1, 117, -76, 5, 41, -20, 25, 33, -84, -28, 109, -44, -10, 65, 11, -96, 50, -21, -19, 57, -27, -65, 48, 63, -37, 57, 26, -20, -7, 59, -42, 34, 106, -99, 17, 67, -52, 58, 86, -31, 48, 51, -52, 8, 58, -29, -20, 38, 25, -62, 16, 4, -76, 22, 62, -60, 37, 17, -96, 34, 44, -67, 12, -7, -15, 34, 54, -95, 25, 106, -64, 35, 4, -70, -6, 46, -31, 7, 63, -56, -51, 41, -33, -6, -14, -87, -78, 88, -30, -18, -12, -19, -47, -14, 60, -101, 10, 15, -97, -55, 40, -86, -4, 41, -6, -20, 46, -93, -35, 24, -74, -19, 39, -2, -10, 19, -40, 6, 79, -1, -90, 112, -6, -51, 18, 22, -20, 28, -6, 14, 21, 15, -55, 14, 71, -72, -43, 39, -37, 14, 87, -51, 2, 99, -40, -73, 92, -46, 16, 36, -69, -21, 34, -48, -59, 106, -42, -50, 20, -48, -49, 79, -58, -85, 61, 7, -67, 59, 48, -33, -11, 55, -32, 4, 46, -66, -25, 73, -38, -62]
6478f2J00o7J5jo6J08J9j22N7J16j21o0J59r6m9J14p9pJ26r2j09J93j1j53J08
6503B0K2j65J70j5r2R8L9j89J09M6o4j6J12p3PM5j49R0J34j23q6J06m6l1J40j11
6529b2p6K11j13j37K67j23p7J20l5j5M5l8j58K05L3j98Q8J09j81K9J71j63N4N8
6553E4j51M6K06k21q0K03p3o0R6n8L3J00j13p8K29j21q5O4L0r4R3oj19J59jj80
6579a27J75J01k39K5R6m2L6jj54P2K22k54OJ58l6p3O1j06L5J42j70l9K67j59j56
6604a60K63j05n4R3m8m0J45q2j32J87k6j15P9J17j67P0Pj73J25J41k12KK14j39
6628a0l9J31j50nJ56j98kL07j63k61L02j7j43J32n5m2J43j05j62K38R8l30J66
6651iJ21j79O9L5j28P6P4j38JJ96j80n5K22j39jQ5r0p2K14j36n3J15K9j24R7%
$$ y = [-62, 38, -29, -14, -15, -81, 27, 46, -76, -19, 97, -24, -84, 75, -21, -70, 44, -35, -42, 84, -8, -117, 76, 65, -88, 20, 42, -123, 47, 32, -60, 38, 77, -112, -3, 43, -21, -37, 75, 2, 9, 54, -95, -5, 129, 6, -80, 26, -20, -51, 89, -22, -98, 113, 0, -137, 130, 7, -70, 50, 15, 0, 45, 7, -151, 54, 87, -111, -23, 86, -95, -66, 105, -58, -4, 54, -97, -51, 155, -66, -146, 57, -16, -76, 20, -38, -5, 95, -18, -96, 133, 12, -73, -9, 21, -73, 20, 14, -105, 54, 53, -127, 48, 149, -90, -65, 31, -11, 25, 24, -130, -58, 164, -90, -84, 74, 38, -35, 26, -80, -45, 97, -73, -112, 155, -4, -160, 103, -2, -56, 37, -11, -51, 94, 12, -120, 67, 41, -74, 5, 122, -45, 25, 32, -141, -16, 125, -87, -85, 129, -10, -49, 82, -68, -73, 83, -115, -117, 190, 27, -234, 68, 51, -92, 40, -15, -57, 86, -19, -181, 57, 155, -175, -9, 112, -67, 2, 37, -91, -15, 59, -79, -78, 118, -62, -117, 105, -34, -35, 50, -40, -112, 102, -34, -87, 28, 57, -67, 30, 30]
6677C0n4J34r8j41K24M0k71J14J20j89L3P8j22J16J02k05N2J82j71k1J16n8j9
6700hP5j28O1J26j54r5K59n7j17Q5k8j06J47o8q7J87o7j22J10P7k13P4R2p7P3
6725C9j9j44J78N7j84RJ88j43n6P7KQO4j64NJ46p1l1O2J2n1J9n6J9Q1Qk06J24
6753b7J37q6k0L9q2O0J2j25J09M0j67M4J13k7j09J26o8J7M8j7q9R6r4k2J40p5
6779b7o2J14p3rO7n3n9J04O4j67P1P6l1k8P5j06NJ42j90M1Q1j7k3N6m5m5P9n5
6807a5p7K15j42l1M6L6n3oM3m4K5K7r2Q7L0j72Q9P7o5j5M5r0Q6Np8L6J23j63L2
6836d1R1l6n4Q8q7%N6k3j09Q9K9p3PP2p8R3k0l8K2P6j68J00J8l2lJ37j46mP3q9
6866e0K7j1lo4J85j11j1P8o7nL9l2k7R6J0j44Q3J6J1l7P9j20J9K9j1O7kj01K9
$$ y = [30, -24, 110, 12, -129, 95, 135, -136, -22, 98, -91, -58, 20, -102, 14, 116, -89, -37, 145, -26, -47, 69, 11, -8, 67, -61, 0, 126, -28, -123, 136, 79, -38, 47, 19, -87, 60, -8, -95, 92, 25, -97, 13, 90, -123, -49, 43, -34, 39, 20, -124, 54, 111, -73, -64, 124, -19, -75, 2, 4, 12, 76, -88, -83, 63, -8, -39, 23, 35, -16, 3, -53, -34, 47, 55, -151, -27, 110, 24, 4, 43, -39, 21, 33, -92, 17, 57, -110, -66, 47, 20, -89, 37, -31, -14, 34, 17, -72, 24, -70, -92, 48, -27, -89, 25, -48, -57, 10, -43, -102, 2, 66, -101, -30, 46, 15, -13, 62, -44, -39, 103, -87, -46, 35, 18, -5, 51, 6, -39, 40, -15, -92, 123, -19, -50, -4, 32, -21, -27, 16, -28, -3, 24, -68, 19, 49, -123, -34, 43, -22, -37, 8, -82, 4, 9, -69, -33, 90, -73, -41, 50, 14, -40, 48, -39, -39, 17, -6, -115, -26, 3, -70, -63, 9, -69, 24, 4, -34, -12, 64, -104, -4, 14, -18, -21, 116, -30, -34, 39, -50, -23, -34, -37, -101, 84, -27, -38, 40, -27, -32, 7, -25, -52, 44, 54, -90, -7, 9, 20, -17, 62, -58, -39, -10, -21, 46, 44, -57, -28]
6895b8P1o2nK8k0J7P5p4j5P3q8J5kj3n2R1O3j19Q3k3n4P7K2k4K3r2j9N8K7o6o
6926c9N9k9LlLJL3j6j7K2p8N6O2q3p7J06k0K4j9M8q0M6L2o5O6l1l4M2k6l4N7m7
6958c8k2J4J11o1j8j8k0Q5Nn4j6L7l7LO0n9J9N2p8q5J65j8m2O4lm9J2No9O7K3
6989C5p5J5Q7j12P3j3n1L7Lp6J16L6j14O9M4k8p1P4j23Q8L9j00O2L0l0o9R6rm0
7018gL9nl8O7o2r4J38Nq3K6K8p7N4%o4M4P1j49N5J52j13J5M5l3m1R4r5QN7l5n9
7049e7J06o8m2J30K7j39R7j1q3Q3nq1Q2np2N5m3m9O5Q0j58L1J30p4n5N8k9M9K7
7078D9p1K3Q8q7m0O7J6m9NO0n8J08q5j34J87l0r4M6M6p5OL3q5R0L8j10J9J19j27
7107d5nP6o8RN0l4NR0j68qJ46j05K3R4p2%P0n3q5J16Lr9N0L7p0M3O5j21J65l5
$$ y = [-28, 43, -19, -24, 4, -16, 1, 76, 2, -13, 60, -28, -13, -15, -28, -80, 11, 74, -45, 38, 15, -39, 38, 60, 36, 59, -33, -52, 6, 33, -33, -39, 20, -9, -6, -9, -6, -5, 28, 12, -5, 17, -61, -5, 57, -26, -103, 3, -17, 7, -12, 36, -44, 2, 34, -31, 35, 4, -30, 12, -14, -48, 9, -38, -60, -46, 65, 4, -14, -32, -52, 33, 38, -16, -32, 5, -32, -29, 31, -28, -9, 43, -35, -120, 45, 27, -15, 49, 46, -3, 9, 14, -55, 12, 35, -40, -25, 62, -50, 23, 10, -41, -4, -1, -77, 39, 75, -39, 30, 74, 46, -25, 49, -74, 14, 53, -47, 15, 45, 15, -54, 42, 33, -7, 32, 27, -11, 56, -6, -100, 38, 43, -40, -14, 14, -63, -9, -9, -73, -29, 42, -107, -52, 100, -13, 2, 47, 14, -27, 67, -28, -20, 37, 2, -57, 49, -19, -61, 69, 96, -43, 54, 43, -40, 43, 38, -43, 39, 34, -38, 17, -26, -75, -10, 70, -88, -57, 73, -1, -56, 2, -27, 22, 49, -22, 1, 89, 2, -38, 29, 45, -4, 1, 61, 3, 111, 26, -108, 79, 49, -45, 1, 47, -28, -22, 11, -74, 16, 54, -56, -37, 82, -45, -50, 26, -42, -33, 17, -17, -12, 78, -90, -98, 48, -57, -34, 60, -12, -12, 58, 5, -80, 36, 39, -60, -10, 27, -43, 0, 65, -56, 109, 74]
7137G4k04Q9J02r8oQ1n1j6P4j04J3J39j78MJ43%j09J11j08kN0kq7J80o1j60J54
7164B8M8j32N4L3k3Jj3o9R9P6j58J9R8q7l7N9k0M3N8j66O8P3m5p5J32p1m1J42
7192I4q0k3N5o9m7M0P3j08Q5J1o7Q9n7q8J25Q0j73M7P7j10R0m6k8JJ05j20m6J49
7220E9n2m2P2o2k6L4J3pR8q2o7M5qq1J28J0p2P4nr9Q5L7j05RJ07j15NJ06r2M6
7250A3Qr5P8R6j01k0L3m0k1M5L3j29J29J6j12J09L2j82J19o0K8M4o0KQP2j17J7
7278e5J17k6m0N2J2q0M7o4PJ42j57l4J29n0r8J16Oj15Q8p0M0P7Jo8L0O3q5j6L8
7307Gl9P7l0j20P0M0m7j5Q7j6k1K9Nl9Q7r4p6J28J0j20P9K1p5K5Q4q4N3L6j12
7336e0N3k3k9M3K8Rj8j5k1OQ4r6l8O4k4jL8k8k9R0m8K7M6l7k1K5l7J5K9N0o8k6
$$ y = [74, -130, -41, 61, -37, -43, 38, -13, -29, 45, -59, -46, 93, -85, -81, 62, 62, -47, 64, -44, -46, 4, 2, -85, 95, 34, -126, 28, 76, -56, -2, 31, 8, 9, -4, -73, 26, 102, -56, -37, 61, -26, -63, -4, -24, 19, 77, -89, -21, 52, 7, -68, 64, -7, -48, 94, 14, -9, 46, -23, -70, -30, 43, -65, 20, 31, -36, 53, -4, -92, 33, 113, -60, -13, 64, -46, 44, -2, -30, -29, 76, -44, -90, 59, 7, -35, 37, -25, -51, -17, -4, -11, 87, 5, -62, -17, -25, -106, 22, 32, -40, 34, 29, -70, 15, 52, -53, -44, 63, -52, -47, 59, -33, 13, 21, -74, 4, 100, -1, -21, 12, -28, -49, -4, 29, -100, 29, 45, -67, 42, 74, -108, 11, -49, -21, 23, -37, -35, -27, 45, -72, -55, 62, 36, -4, 48, 60, -20, 27, -37, -30, 112, -45, -79, 50, 0, -98, 18, 24, -91, -3, -73, -33, 44, 45, -23, 7, 70, -15, -31, 7, -32, 45, 15, -105, -35, 5, -42, -57, 30, 14, -7, 22, 27, -12, 75, -19, -95, 33, 43, -77, 2, 23, -52, -27, 57, -27, 26, 62, -50, 3, -20, -49, -6, 22, 31, 13, -2, -23, -17, 67, -29, -67, -3, -27, -28, 10, -18, -47, 43, -5, 22, 68, 31, 10, 35, -2, 13, 42, 92, 24, -2]
7368bk0J4J7m7MJ9J2pO9l3p7N1O6j35O8%Lq7Q1k2qQ1m0o0M5O0r6M7Lj7M4mn8P9
7402E0p3k9M6qrL0l5m1L3mL1Kkn2O1K1k2j9L5k6J1Jp1L9N1n2LL7o2K4kK1pnM6
7437B3l1k0P8n3l8M4k8pMJ7mM9L1q9M7p7nM4K7o9M7K2m6P9n4Jk9J1o0R9j7l2K4
7470a2jr0N6M8o1J5P3l8N3o8J8K8Ol5mM6j3m4K3Qk9M3m3K3N0r5N7oj3K6q7J14
7502D8q1L2J9o5N0M8n7K4l4kN7pr0P9J5l6l5Kj4L2J1n8L7M5n0KM0J4p9R6o4j6
7534c7NM9Kj1K8r8R2Jm6N2o1K7m7P1l8k2O5j4o1N6l3QM5l9QJ8J6p4N1j5j3K7l4
7567b2L0Pm3l5Q2o1OJ00j4n5L3k5nj1M6m0J4K8p1O6j09Q3q6O6l4L6L7p9Q1rm6
7598c0L0L1J5r1k3J03q4J27j34K0O3k8m8O5j6p6Q1L6j03O2K3m6l8J09l3l4M8o2
$$ y = [-2, -22, -8, 9, -38, -34, -15, -3, -10, 59, 26, -51, 0, 66, -69, -1, -1, 2, -85, -4, -26, -34, 47, 7, -53, -8, 52, -44, 3, 6, -11, 33, 29, -29, 50, -23, -52, -6, -14, -23, 7, -28, -69, -36, -40, -9, -7, -9, -61, 0, 21, -1, -20, 15, -11, 0, 1, -70, -31, 20, -32, -29, 8, -54, -30, -32, -11, -18, -23, 23, -8, -28, 50, -3, -41, 3, -25, -32, -28, -11, -15, 34, 65, -24, 23, -54, -59, -15, 12, -57, -10, 12, -34, 45, -9, -8, -37, -26, -86, 13, -4, -36, -12, -13, -103, -47, 1, -60, -45, 28, -10, 43, -25, -7, 21, 27, -8, -12, 34, 21, -23, 0, 8, -21, 22, -21, 2, 52, -43, 14, 8, -5, 21, -66, 48, -33, -1, 18, -47, 3, 51, -6, 18, -16, -18, 39, 32, -58, 21, 36, 0, -35, -33, -47, -15, -4, -62, -25, 20, -30, -28, 12, 26, -53, 43, -21, -37, -32, 17, 19, 8, 36, -62, 30, 31, -15, 37, -24, 3, -44, 27, -11, -33, 32, 18, -43, 13, -20, -12, 33, -6, 2, 20, 36, -38, 13, -2, -15, 12, -22, 8, 15, -28, -63, 19, -42, -36, 64, 50, -5, 28, 3, -2, -13, 33, -7, 7, 35, -36, 30, -79, 4, -82, -16, -50, -14, 23, -56, 25, 16, -30, 0, 31, 46, -45, -68, 35, -49, 78, -56, -36, 27, -1, -49, 16, 0, -76, 5, 41, -62, 0, 23, -23, -61, 48, 15, -19, 29, -33]
7626c3N8Lm0L6M6o6j00J03J7p5O1l2QP6k1o7O1Jp7nL7l8ON4j4k2N5m6rK9l3N%
7659b2k1N6M1p8N3n3Ql7Q1m5mN3l7J2j8O8r6M5j0rK4j9m2J3N3j05M3L9ML1P6j07
7691cn0N8kMM2r3JJ15q9nqL2k2LJ3OJ6k3k3kK7p1J08ko1L6q6P2l0P9n0QP3p6m4
7726d7N6L2p2P1j1p0J06o6l3O2K9j11O8kp6O6J7q5P2K5p8Q9j3o7K1K7o2K7P6o1
7756a0rP5o1j3n3L4k8R3Nn9K7o3J7Q3p0m2N4L6l6J1l0nM0ll5L6K2r3O9j6N2J0
7788C8k8l3K4oJ1oj3k2O4o2m7N9N2o3K0Jj2ln2P7l2M1l7M5K0o6rK8Ql1j0R0o6
7821b0M9l1q0J16m6nQj3MN1K3p4M4jk9oP2k4p4rQ2q8O0j7j6J5ok8KQ0o6pL1m2
7855d5L4Rj3jN0l2n0J06q3RL9m6J4N1n7MN4l2k4NJ8kNOl0P5Oj16P1K3l9l5J3N7
$$ y = [-33, 25, 28, -12, 24, 70, 4, -96, 7, 24, -51, 10, -22, -14, 62, 41, -26, 35, 36, -41, -46, -9, -47, -41, 13, -1, -23, 32, -14, -23, 6, -27, -22, -22, -43, 13, 54, -24, 29, -24, -16, -53, 28, -17, -21, 32, -5, 7, -11, 57, -39, 6, -4, -13, 11, -8, -50, -37, 16, -89, -46, -7, -3, 28, 104, -3, -53, 5, 3, 7, 49, -44, -43, 72, -17, -22, -30, 2, -20, -17, -4, 2, 18, -5, -28, -30, -3, -74, 34, 32, -29, 7, -79, -7, -37, 42, -8, 0, 73, -3, -47, 9, 41, -31, 40, 29, -41, 65, -1, -34, 28, 57, -54, 14, 12, -64, 2, 19, -66, 6, 31, -47, 42, 29, -38, -17, 10, -52, -25, 51, -10, -19, 56, -5, -18, -71, -37, -65, 28, 33, -26, 1, -62, -45, 38, -32, -74, -20, 16, -20, -9, -39, -44, -4, -7, -42, -6, 16, -77, -8, -24, 28, 38, 10, -23, 1, -5, 6, 0, -13, -35, 29, -33, -80, -21, 31, -32, -12, -11, -23, -26, -78, -1, -33, 8, -29, 16, 36, -30, -39, -11, -3, -34, -44, 46, -20, 29, -2, -82, 34, -12, -17, -9, -22, -18, 33, 56, -18, 26, 25, -4, -10, 62, 38, -36, -45, 37, -51, 9, -8, -24, -9, -15, -43, -41, 39, -27, -34, -3, -45, -11, -2, -15, -16, 34, 2, -48, 58, -25, -16, 23, -23, -9, 42, -15, -11, 43, 11, -13, -8, 10, 8, 13, 19, -11, 64, 70, -46, 25, 48, 9, -26, -13, 44]
7889D4qK4m0o5P9m9p2J39p9k4K9J1QJ6m6M%N1o8N3K2l0k0No3Q9L2m3K9jr4P0j
7922BMK0J0r6L1P8r6L5Oo0M8j5K0K4l8j7J20r5K2jkj2j6M2j8PL4k9j6L4j02N2
7954b4Mj3Q0kr5Q4n5O0l4l8K4R0j29N3PqRRn6KL2j9Jj9K0K7l3l4J0R7q3L4mm7
7988e0P3o6M2K0Po8L2K4o8J1PL7k6mL1k0K2J6m8N4n4N5q6P9j7K3k9j4J01r2M8
8019D0po3L5Rj3k8o3J59q9lRJ2m4RJ2O5k9Pm1K1r3O0M1n3M7J7j9K5j9j7qP4o3
8052a0o0P4j2L9k3KrK8n5m4Q6l5k8N0J9o0J8J9KPj5J0m6M8m4K1J6J6k6oPRR%k1
8087a4l4L7n2O6J4k6lRKp0Q5l1LrrNP1p3Q4j8o8L0j9j2J6jmj5K3R0r9M5M9j13
8121d1L4M6k2j8Rl6O1rn5K7mn2N6N1Qq0L2M9r5P7j27O7L6l4j2K8J3l1M7k1k4J7
$$ y = [44, 36, 60, 20, -45, 34, -15, -87, 52, -27, -51, -22, -11, -3, 13, -33, -29, -29, 22, -46, 7, 29, -1, -21, -16, -79, 10, 42, -1, 28, 27, -67, 3, 2, 6, 26, 36, -60, -29, 49, -47, -12, -6, -66, -18, -33, -13, 11, -27, -44, 76, -19, 3, 2, 0, -12, -28, 14, -4, 3, 37, 8, -8, 26, -76, -24, -20, -33, 47, 45, -50, 34, -21, 39, 5, -33, -9, 81, -48, 5, 12, 4, 13, 22, -34, -32, 0, -19, -18, -37, -17, 10, -23, -57, -47, 50, -33, 1, -3, -50, 23, -43, -1, 19, 26, -42, -10, 14, -54, -43, -36, 1, -25, -29, 2, -18, 4, 20, -28, 26, -28, 27, -59, 20, 3, 26, -3, -17, 84, -8, 40, 33, -30, 5, 14, 1, -27, -90, 69, -20, -23, -14, -2, -46, -37, -25, 40, 11, 18, -23, -2, -95, -35, 6, -47, 0, 17, -2, 23, 4, -13, -21, 53, -10, -70, 4, -8, 31, 8, 10, 1, 29, -26, -70, 16, -19, -47, 3, 22, -38, -20, -1, 1, 8, -7, 3, -43, 5, -39, -18, -2, 14, -12, -18, -11, -2, 7, 7, -14, -48, -11, -63, 3, 17, -9, -12, -3, -1, -71, 14, -17, -14, -23, -32, -27, 44, -29, 55, 37, -31, -1, -20, -32, -16, -17, -21, -36, -13, 77, -22, 23, 72, -41, -7, 39, 17, -1, 8, -28, 33, 24, -31, -4, -8, -60, -4, 47, 55, -25, 7, 56, -39, 38, -89, -22, 14, -20, -32, -4, 9, -22, 25, 4, -20, -3]
8153cmK2j6J2n6J5J11q8j8oRlQm1L7k1pj0M2N6o1K0k6K2l1P3j6j7l2J4K3n7O1
8186A2j0K3%no
$$ y = [-3, -7, 15, -1, 11, -45, -30, 81, -7, -25, -31, -22, -25, -17, -58, -21, -42, -49, -59, -17, 39, -22, -2, -28, -6, -37, 36, 20, 3, -29, -15, 8, -49, 12, 2, 25, 25, 20, 14]
8191A4
$$ Imaginary data points
##PAGE= N=2
##DATA TABLE= (X++(I..I)), XYDATA
0@%%%%%%%%%%%%%Jj%qJ6j6J6j6K3l1L2l7M5m8N4o6P6q4R5j05J14j28J44j63J82
38I5j98K21k47K70k96L25l58L93m33M77n22N74o33P00p73Q54r49J059j190J345
58G14j531J760k047K419k921L626m666O317r214J5158l1333J43273L43060o85452
72b20837o4207M84641k23473k3888J42515l33333K50086L97141n82028q8815O62287
83D00089k42248l85323L29767k5280j10048K04861l26223j13703N67889k25160
93G4621n15280M65780K07184l93129J20600Q6749j47716K96754p9769m26102M10874
104A00566K46612n75822N1792L99113k59839o3709J46210k23713J84836K50462
114B56508m73237N635N48008k61826l02419L49677k2742j55163J90948j93056
$$ y = [0, 0, 0, 0, 0, 0, 0, 0, 0, 0, 0, 0, 0, 0, 1, 0, 0, -8, 8, -8, 8, -8, 15, -16, 16, -21, 24, -24, 30, -36, 40, -44, 51, -54, 60, -68, 76, -87, 95, -103, 118, -129, 141, -155, 170, -188, 205, -228, 249, -273, 301, -332, 368, -405, 449, -500, 559, -631, 714, -817, 943, -1104, 1315, -1606, 2020, -2646, 3671, -5543, 9615, -21718, 121555, 464615, -220837, -285044, 199597, -23876, -47764, 94751, -238582, 11504, 408645, -173383, -262198, 400089, 157841, -227482, 102285, 77005, -33043, 171818, -154405, -268108, 299781, 74621, -440659, 25121, 232305, -160824, -40224, 46525, -101191, 195563, 115794, -310308, 100566, 347178, -228644, -176852, 222261, -37578, -101287, 44923, -178790, 6046, 256508, -216729, -211094, 336914, 75088, -227331, 122346, 99604, -55559, 135389, -57667]
124e7667j16186L96712j75442l80343L80094J35971l61061J05809J31922j22604
134f2795J71008m8910k71002L21200J61462m40029O2768L12615k16574o7429J25229
145D7543j53134J02113J51221l19677L8443L67796k29534j91090K96952j7995
155I2638j36644J27198j10736m7314K59359j70906k48260L02820N8611k89680
165a62914J02104J07863j19771J02416o187j62809K11745Q5921k95275Q8482K29617
176A81192j90897o9296J26748p5423K8104O3355j88478N4487K16544j79233r8539
187a31436K16421l3756r4472J09700n6813l5904J51477j11794j26014K02344j1536
198G8217k00452J03352P1689j09630N2480N318q7443J33502L3022j77706Q6097
$$ y = [-57667, -173853, 222859, 47417, -332926, 47168, 183139, -177922, -72113, 59809, -62795, 108213, 59303, -211699, 109501, 270963, -169066, -106298, 206317, -10257, -77686, 47543, -105591, -3478, 147743, -171934, -133491, 234305, 4771, -186319, 110633, 92638, -44006, 83192, -27544, -74858, 184501, 13595, -234665, 68155, 126766, -162914, -60810, 47053, -72718, 29698, 23511, -139298, 72447, 158368, -136907, -48425, 181192, -9705, -79001, 47747, -27676, 428, 63783, -124695, -70208, 146336, -32897, -131436, 84985, 51229, -43243, 66457, 9644, -26260, 125217, 13423, -112591, 89753, 78217, -122235, -18883, 52806, -56824, -4344, 974, -86469, 47033, 80055, -97651, -11554]
209a1554J31820j39972j6167R7412p4377j098N5012j01972K0269J06220j14385
220d8792m0653J39662l6106o9513P7620j2235k0082P5734n9713n5363J12858j9463
232D3954j06119O6055K3938p3757L7217R773n3380O1319J2172p9268O5525N7529
244F4958q8918J1308O7877m8261n589L1029n4508J0345N0594o6105j8721O8126
256B2135l1177l0010N4789j2154k3242M5492j1505k2857M4604j4605m2134L8192
268A7528M779m3868J4373M352k6396K4051M620l3752K5607K4299k7341J2551K3204
281B4007k2941N269K0526k1879l658J2574k2918k207J9403k1119j1286K2661m591
294f159o307K0126m171r309K1999M512j5375N798K145j0764L261k099j4072L39
$$ y = [-11554, 120266, -19706, -35873, 61539, -12838, -13936, 41076, -60896, -40627, 65593, -48792, -89445, 50217, 14111, -55402, 22218, 9983, -10099, 65635, 5922, -49441, 63417, 43954, -62165, 3890, 27828, -45929, -8712, 1061, -52319, 9000, 21172, -58096, 7429, 64958, -23960, -12652, 55225, 6964, 1375, 32404, -22104, -11759, 38835, -27270, -45991, 22135, -9042, -39052, 15737, 3583, -19659, 25833, 14328, -8529, 36075, 21470, -20664, 17528, 22307, -21561, -7188, -2836, -29232, -5181, -561, -34313, -8706, 15593, -11748, 803, 24007, 1066, 6335, 26861, 4982, 1324, 13898, -9020, -11227, 8176, -12943, -24229, -1568, -6159, -12466, 7660, 3489, -5820, 16179, 20691, 5316, 11114, 13259, 2495, 5756, 3657, -10415, -10076]
308a0076K246n684M398K925o223O631J1795q14j1L946j084J457K349o139o768
323a052j812j690j314k405n214K21O073L091R43L002K091K825N748J534m815l110
339D116O85j208l972m013m487k335K623K161j186J57L538N450N229J083j535J062
355G368K775K1l086n392l842l00j277k273j355k336J441O185J976ML320M12K460
372F101P201m554r065N346J128r343N10j243q686N713N128q619M912Q128p291
387d634O604J2593j0416j839J0747p720r61P141j7382m370J9182j1720j4694J6894
401e75j261r324J6081k533r720J9530l512j6415K2572L04k9426J4722J1648k4240
415a2149O867N722k3318J9344J6710l5790Q962L4582k4914n111K7912j8604l247
$$ y = [-10076, -7830, -13514, -9116, -6191, -12414, -5783, 6012, 5198, 5187, 9133, 8049, 9506, 11855, 5716, -1052, -2864, -4554, -5868, -8273, -13487, -13266, -7193, -4102, -3159, -157, 1934, 4759, 10507, 12041, 7226, 4116, 4801, 3593, -379, -4392, -8879, -11214, -8591, -6430, -7616, -7459, -3921, 1529, 6758, 7841, 6306, 7368, 10143, 10164, 7078, 1686, -2156, -2456, -3733, -6006, -7361, -9697, -8256, -2071, -95, -91, 3229, 3641, 6101, 13302, 8748, -317, 5029, 6157, -3186, -2676, -3919, -12605, -6892, -1764, -10383, -5471, 2657, -4634, 1970, 14563, 4147, 2308, 13055, 5335, 4374, 11515, -5867, -10237, 8945, -2775, -17469, -575, -1836, -11160, 4921, 2388, -7332, 12198, 8686, -7729, 14843, 15147, -14279, 443, 12091, -12149, -5282, 440, -22878, -3534, 13176, -22614, -13652, 20930, -3984, -9095, 18817, 213, -3034]
428c034K4335k7325n212L6452l1516k4458M6916r082l4775L0203l23j8772L6219
441A9628j2833l6179N0873R675n6619K7048K6412m2601J3202J5227l8906K7356
453B283K0049o0325K4229N5476n7615j2968N7362k3715j1129L2156m0132K890
465a1439O0836n5288l8939P7193j4135n7832M4996K217l1597M3333k0444m1392
477d2491P6781o88q7352N4622N0050p0034P157K9189m0258L5789J5203q4062M2657
490a3437P3786q9572j6066Q6156l7101k4603M6881m1055O699O8443p9029l4004
502e2902J14862l3696q9460P0662J5471m8134M1687k7085m0216R8046j7258j09071
514g7094Q6265N7527j02993J7245N1474n2204L1609J3976q9240O3670P4120j25813
$$ y = [-3034, 21301, -6024, -11236, 25216, -6300, -30758, 16158, 7076, -27699, 2504, 2181, -16591, 19628, 6795, -29384, 21489, 31164, -25455, 1593, 28005, -14596, -1394, 13833, -25073, 2283, 22332, -37993, -13764, 41712, -15903, -28871, 28491, 4776, -6353, 25803, -14329, -11439, 49397, -5891, -44830, 32363, 18228, -39604, 5392, 7609, -23988, 19345, -1099, -42491, 34290, 33602, -53750, 872, 50922, -19112, -11955, 17234, -23024, 12765, 27968, -56094, -13437, 60349, -29223, -45289, 40867, 3766, -20837, 26044, -15011, -8312, 60131, -18898, -52902, 61960, 28264, -61196, 9466, 24937, -23197, 18490, -8595, -48811, 49235, 31977, -77094, 9171, 66698, -36295, -19050, 32424, -19780, 11829, 25805, -63435, 235, 74355, -51458]
526e1458q064J18483n2522m5404N5996l3463J1771O4906r5139k0877J35602n6023
538B3808j00792R8814J7104p0484M3616j7467l6725R8080l4968j13197J14596
549B2385N7925j31942K2617P3075n4873K3064R794q4623P9224O4521j46838J1423
561e4248J34886q0517n5286P9015k9374L3N5737r5979J80J43038q5966j05027
573i3508J31248J7955r4891M3251l679l1279Q8349n0204j02079J33276L9057j51303
585g3807M4420Q9319p3148P858K0695o4861P6901M0507j48280L7820J37238j05281
597a0619n9301R8323k4036j7094M6504p8544J1376J23458r6418q2752J42698j74
609E3421j06064N6509J2713l6665O6246m9102p6577J32647J3193j51476O4968
$$ y = [-51458, -59522, 58961, 6439, -38965, 17031, -16432, -4661, 60245, -34894, -55771, 79831, 23808, -76984, 21830, 38934, -31550, 12066, -5401, -42126, 55954, 20986, -92211, 22385, 80310, -51632, -29015, 44060, -10813, 12251, 22045, -62578, 16646, 81167, -65671, -54248, 80638, 121, -55165, 23850, -5524, -5491, 50246, -45733, -45553, 97485, 11519, -93508, 37740, 55695, -39196, 4055, 376, -30903, 57446, 7242, -94837, 38439, 77496, -73807, -29387, 59932, -13216, -5358, 15337, -49524, 27377, 67884, -80396, -42576, 94662, -10619, -69920, 28403, 4367, -12727, 33777, -44767, -33391, 90067, -6351, -89103, 53595, 53421, -52643, 3866, 16579, -20086, 46160, -2942, -79519, 53128, 66321, -85155, -20187]
620b0187R0149q8908L281L4435n5326O1931K8584j29076N0607J16966j16594m3582
632f7720J09009l1957l2480M4515n8294J6599R7999j00627n9157J44377j6142
643D6122j08187O6094K2526m4145M8983l4886n5806J10152l476j27499P3060P5019
655F7957r3949K189M5321m1652L9871J4548r7626N6632Q9191j12757k7433J05754
667D8046l5442m0825M4464l6159P119O7743p9774l4217J18248l0052r0975P1982
679A0158K3608n2001L2802j5897l5266Q0999j5879r7888P3444N5240r0987O860
691b4807M9778l8284J9403J4329o4861M5795N6739r2346n826Q8589m2620l8607
703c2718M6373k0071k551M1790n6748j4885Q6325l4537o4627O4801J3881m7328
$$ y = [-20187, 69962, -18946, -15665, 18770, -36556, 25375, 53959, -75117, -24510, 92456, -24138, -67720, 41289, 9332, -23148, 21367, -36927, -20328, 77671, -22956, -82113, 62264, 46122, -62065, 4029, 26555, -17590, 31393, -3493, -59299, 50853, 47377, -80122, -7062, 67957, -25992, -23803, 21518, -20134, 19737, 34285, -63341, -6709, 82482, -30275, -57708, 48046, 12604, -28221, 16243, -19916, -12797, 54946, -24828, -59045, 59203, 29151, -61824, 10158, 33766, -18235, 14567, -1330, -36596, 44403, 28524, -69364, 4080, 59320, -31667, -24807, 24971, -13313, 6090, 20419, -44442, 1353, 58092, -34254, -40080, 48509, 5889, -32718, 13655, -6416, -8967, 32823, -23925, -38810, 47515, 12978, -51649, 13152, 27033, -20295]
715b0295K7562l069k5815N0351j3932o0458N7969K8538p1650J4733M2180l4241
727h127O093J3664l7102L0818L0972o3106M569O0022l6567k4678L7723j4780p058
740g557K6582l3560n569N1503l0548l6510N1034K755l8219K2378L604j7406K8424
753A6911j1061l3608M0522J1541m7537J6662K6026k8323N429J2935k3748J6621
765B370J6715l7226Q792L5094k9220j2697K9196j0130q584J5538j6922k109K7217
778A8034j9802j7931L0198k779k1770J7104J554j3224J5634l572j6050K0846K274
791A0516k4625J3477J2868j8827L260Q123j2130Q580O803j9273P009J6658j6863
804d424l053J5964q877m268J1018q160k688J1988r692o242J5028m568j0940J0319
$$ y = [-20295, 7267, 4198, -21617, 28734, 14802, -45656, 12313, 40851, -30799, -16066, 26114, -8127, -2034, 11630, -25472, 5346, 36318, -26788, -22219, 37803, 1236, -23442, 14281, -499, -7557, 19025, -14535, -20104, 31399, 851, -35659, 15375, 18130, -20089, 2289, 5893, -11513, 16911, 5850, -27758, 12764, 24305, -23232, -6570, 19456, -8867, -3438, 9497, -14251, 2370, 19085, -18141, -9349, 25745, -3475, -16172, 13024, 2894, -5690, 9848, -7074, -9183, 18034, -1768, -19699, 10499, 7720, -14050, 3054, 4608, -8616, 7018, 3446, -12604, 8242, 10516, -14109, -632, 12236, -6591, -3331, 4792, -7338, 1242, 8045, -11228, -4219, 12439, -4424, -7477, 8487, -390, -4658, 6360, -1800, -4488, 7500, -2192, -8434, 6594, 2026, -8914, 1405]
818A405R91o938P271j678o891J0105P73j0606O624M362q689L151M101o922K241
833g00L621o302K765M814p132M36O928l985k042M464l039n96M672l783k910M965
849B176j504l409L698n24l397K991J074k412J763L23j953K512R90l241P79J790
865A656j972K22J165k327j47K108r00q32J055l89o5J561l99r88O28J62k8M86j189
884a93j007J395j1j408O30J52j150J051J299j124n35R54J58L37J81j299NJ211
902F46q58n88N22q91P2J387q37p84J584l98m82J824m03j488J201L30n48P73j461
921c99j167K788l33k953J946R19k141J938Q19k889K225J464l450J944K299m590
937a580N97L658l292l10K306l732J430M591n588j277O772l055l124N359k316k679
$$ y = [1405, 2396, -4542, 2729, 1051, -5840, 4265, 5038, -5568, 1056, 5418, -3271, -120, 3981, -2941, -700, 2921, -3381, -616, 4198, -2934, -2498, 4430, 445, -1597, 2867, -172, -768, 3904, 121, -2789, 2176, 672, -2737, 961, 437, -2960, 31, 1105, -1307, 456, 779, -1174, 1338, 2328, -913, -134, 1656, -316, -94, 1071, -1256, -1403, 705, -195, -1027, 28, -361, -426, 1135, 736, -252, 376, 538, 510, 996, -193, -1200, 195, 184, -1224, -594, -442, -1592, -541, 758, -366, -901, 53, 211, 548, 729, -570, -565, 646, -212, -800, -278, -1169, -1097, 290, -547, -1331, 253, -145, -627, 1197, 794, -694, 507, 837, 289, 1062, -399, -1566, 1222, 889, -2064, -118, 801, -1340, 598, 1417, -1472, 753, 2217, -1233, 711, 3010, -1580, -983, 2675, -617, -927, 1379, -2353, -923, 3668, -1920, -3197, 3575, 520, -2604, 2755, 439, -2240]
953b240N678l190l871P346k318p076P551J482p714M472J770n459O187N91r613
968f404P417O305j1656J698Q477p945J86O082q181K334Q319j1675p89J4306q809
983c35p522J2392k920n767R228o758n307J5899o137j4713J5623L721j5584P836
997c44M595j0303R306R59j4968J3977Q389k2079N831J6929j5138k037J1070j1301
1011e114M256J1887k0297M00K4107j5904j3013K1351l846j1061J3072p418o248
1024g828K0803j1463j8860K6560L275k6564J2523J0568j5028R453O84j8049K0390
1037F464R132l1592J0088K4674k2762m617J7572j2619L018J2521k4332M551K9659
1050B1757k5597j6133L2566n134j8871J5915n893o334K3523j7028k0546L6070
$$ y = [-2240, 3438, 248, -3623, 3723, 1405, -5671, 1880, 3362, -4352, 120, 1890, -3569, 2618, 3209, -6404, 1013, 7318, -4338, -2640, 5837, -2108, -1922, 4160, -4021, -1687, 6632, -5043, -5832, 8474, -335, -7857, 4535, 1615, -4152, 5076, -1682, -6989, 8910, 2773, -11940, 3683, 7404, -8180, -344, 4251, -6052, 3254, 4213, -10755, 3222, 11611, -10468, -4637, 12292, -2846, -4883, 6187, -5114, -858, 11029, -9268, -8868, 15239, -665, -13678, 7673, 3827, -7234, 5838, -1580, -7828, 12975, 1512, -17348, 9212, 12487, -14077, -1554, 9014, -6014, 3439, 4123, -13926, 6464, 15596, -15996, -5908, 18766, -3996, -8613, 8959, -3660, -642, 11879, -12453, -7902, 21757, -3840, -19973, 12593, 7459, -11412, 4503, -1390, -7724, 15799, -1229, -21775, 14295]
1062A4295L97l5204J9348J4580k1431R539K183j8506K4627N404l8682J8957K9926
1075B5433l3519n787K5528j3295N48J1604k5655R868L1194l4548j4419M1696j0131
1088H517k5348K1074k790q083K1379j9872j6520M1899o321m1220K7589J8768k8282
1101i210O997N799j5742K3992L54l8846K6344K8670m1747k564L2522j6777m098
1114d306J3064k2267J2249K7240l9686q618M7404j7160k9432K6937m31j1165J8830
1127A2659j9636j2008M2774j3656m0652L6022J6563l5661R446J1060j6041J9934
1139A0804k552l4812L1613K3521m7471K782L7312k0948q128J5170j7741J1587
1151A137K1532l9288k007M6695k3551k9145L2469Q51j6436J5293j4000p309L6530
$$ y = [14295, 14692, -20512, -1164, 13416, -8015, 1524, 3707, -14799, 9828, 15232, -23450, -4493, 25433, -8086, -13873, 11655, -1640, -1092, 10512, -15143, -5275, 25919, -8629, -23048, 18648, 8517, -16831, 4243, 1453, -6630, 14749, -5123, -21643, 20256, 13935, -27285, 304, 19072, -9210, -2213, 3586, -12156, 11836, 12190, -26656, -312, 28358, -13389, -15953, 16569, -208, -4306, 8758, -13509, -1260, 25980, -13706, -22324, 25080, 7920, -21512, 5425, 4994, -6171, 12659, -6977, -18985, 23789, 10133, -30519, 5503, 22066, -13595, -4149, 6911, -9130, 10804, 8252, -26560, 5053, 28574, -18897, -16115, 21197, 249, -7879, 7291, -10450, 1137, 22669, -16619, -18626, 28069, 4518, -24627, 7842, 8693, -7743, 7550, -6450, -13759, 22771]
1164B2771j8131l5045L9640J2739l8939J1240J5132j6332J4212k170k7807L0260
1176G570J6637m5634Q357L6497k5269r727J9048j3340P144J5426l3608M045M0904
1189B8050k8192k4440L5869j339k0024J5006q573o018K8689j8616k6223L8751
1201A2940N348l7981J5581J6736j8385Q705J12j9289K5696Q254l9326J3832L0935
1214B3158k7575q079K1095j0915J934J1504k4166N895L0077k6610j6433L3511
1226A3396m578k0424J4965l152o124J9305j5226j7119L2329q7l1923J7016J4557
1239A2935j8742N830L504j3963J7685M136k8733J4354K2041k5920l987K0450j0331
1252g41j839R505j6058N506K0413k2464r301K7848p029j7320J4570q46p085J2588
$$ y = [22771, 4640, -30405, 9235, 21974, -16965, -5725, 9407, -6925, 7287, 5117, -22690, 7570, 24207, -21427, -13070, 23427, -1842, -11569, 7479, -5861, 1283, 16709, -16899, -12854, 28050, -142, -24582, 11287, 9948, -10076, 4930, -3643, -9661, 19028, 412, -25811, 12940, 18288, -19693, -4112, 12624, -5761, 2944, 3056, -16233, 9463, 17717, -21609, -7777, 23158, -4417, -12496, 8599, -2316, -382, 11122, -13044, -7149, 22928, -3682, -20115, 13396, 8818, -11606, 3359, 207, -5917, 13388, -1838, -18957, 13372, 13285, -18638, -1622, 12935, -5807, 23, 3527, -10436, 7249, 11385, -17348, -2994, 19047, -6873, -10860, 9590, -741, -2580, 6925, -9133, -3627, 16786, -5678, -14979, 12869, 5840, -11480, 3090, 2244, -4841, 7747]
1266G747r727j0146K2891l607k2571J6305R912j7316M623N676r773J0265K096
1279F375j8531J1550J3908j9772j197J5916q674l093P989r007K569J1662j4367
1292d672l941J8516p129j1778J2184J5o867P584m622n632J3460l459j3515J1797
1306A941N406j2453L837M884o926N141J658j0081P368O827j2766J117J0510p150
1320f87k598O149m695O50O206q091j241J0350n269o105Q030n99m897M859j720
1335C42l324O598k196o388O944J903p422K888L275m083J967J065m580L722K767
1350C478o334J275M920m298q30L593k653l14L062l363l84M435k985k397M333o87
1366H51k658K478n29j451K804j233k408L218K31l187J972J186k447J181Q62j907
$$ y = [7747, -1980, -12126, 10765, 7158, -15413, 892, 10804, -6512, -1889, 3787, -5986, 4279, 6375, -12156, -606, 13302, -6470, -7667, 8249, -425, -3518, 4471, -4536, -1967, 9695, -4672, -8613, 9903, 2774, -9004, 3180, 3195, -3672, 3912, -710, -6342, 7118, 3659, -9856, 1941, 7347, -5106, -1269, 3615, -3311, 1830, 3488, -6593, 775, 7602, -5164, -4047, 6463, -687, -3285, 2864, -1831, -1181, 5025, -3066, -4307, 6043, 774, -5331, 2699, 2100, -2797, 2062, 342, -2982, 3616, 1420, -4968, 1976, 3879, -3543, -655, 2620, -1463, 504, 1569, -3011, 711, 3478, -2856, -1581, 3339, -959, -1789, 1804, -849, -1163, 1899, -1464, -1848, 2587, -398, -2795, 1538, 851, -1807, 671, 142, -1309, 1495, 262, -2146, 1072, 1303, -1884, 88, 1274, -1173, 8, 870, -1037]
1382a037J224Q63k290R44J767k023k04J578j087lJ004j370L9J562j172o58J575
1399G12o01q52J312k37q61R05p2p52R57r0j073Q33M26q73L20L01o92M93M83q28
1419a89J61O18o18J5N91o19j75N86k58k92L31l00j10N55l92l58O40j23m70O34
1439B27o6o54N10K21n57L37R8o21N01L57p77K19N39n54J27M30p37K06P45p48r5
1460b92Q92p82m33J057l72n55O31k85l56Q89m21q76J256r4j048R77P4r86R93J10
1480C79j319J145N50j796R61J155j719L22J095j216N04R47j908N79K040k128n76
1497i85K287j249q39J894j389o01K455j704j566L239p34k765K477M51k004J807
1513G74m02k174L129R0l975K614K153l781R45K162k691J341J576l830J731L515
$$ y = [-1037, 187, 1050, -1240, -296, 1471, -552, -756, 822, -265, -268, 736, -634, -595, 967, -205, -863, 712, 111, -741, 571, 334, -527, 378, 306, -446, 511, 421, -652, 181, 607, -266, 54, 355, -337, 156, 639, -189, -28, 590, -28, -13, 578, -41, -216, 370, 112, -180, 151, -149, -259, 296, -96, -454, 186, 63, -407, 227, 161, -493, 17, 238, -319, 18, 116, -505, -4, 353, -424, -205, 334, -220, -93, 337, -400, -194, 551, -197, -292, 600, -182, -615, 442, 70, -485, 146, -139, -495, 394, -27, -903, 353, 259, -789, 188, 262, -724, 269, 379, -940, 205, 755, -1041, -80, 1075, -644, -322, 773, -443, 61, 1008, -900, -321, 1719, -409, -985, 1302, 53, -786, 1108, -281, -882, 1573, -131, -1697, 1542, 808, -1957, 520, 971, -1033, 774, 372, -1802, 1327, 1417, -2558, 56, 2209, -1572, -627, 1535, -1156, 185, 1761, -2069, -338, 3177]
1529C177m759m12M862k735j765L222k073n09L781l824j977O249k119m859M851
1544A110N99l822L098o24l120N086p54o208N465L038p061J790M037m353J832J882
1560A995n801L850M865q303J62P985m889l075N483k890o54N041n991j519R378
1575E637m762o898Q528O17o481M402l80l856P057k159q368Q800L628j0820L114
1590a941O348o158J415K619o467N224M964j1363J687J1281q133m598Q367k889
1604C56j820N392o967p55J1445p322q407J2104N07r500N539R38m514P243l321
1619I18q704J1795K811j4514N482Q853q840O41L910o647O045M401j3464L936J2939
1634I562j1323n090J1291l376l475N796o837L41J1715j0010p993J5495p79j2328
$$ y = [3177, -1582, -1994, 2868, 133, -1632, 1590, -483, -992, 2789, -1035, -3012, 3237, 1118, -3741, 1110, 1709, -2113, 985, 361, -2759, 2327, 1573, -4635, 830, 3868, -3193, -1403, 2634, -1719, 113, 1995, -3806, 44, 4909, -3394, -3232, 4753, -136, -3211, 2272, -618, -1272, 3769, -2222, -3741, 5637, 875, -6023, 2505, 3122, -3359, 1043, 663, -3193, 3864, 1705, -6663, 2137, 5765, -5055, -1941, 4407, -1751, -336, 2283, -4184, 1040, 6004, -5359, -3672, 7609, -524, -5122, 3245, 356, -1464, 3928, -3039, -3794, 7651, 329, -8078, 4026, 4533, -4967, 572, 1510, -3004, 4239, 918, -7786, 4009, 6820, -7694, -2212, 6641, -2199, -1558, 2352, -4295, 1750, 6151, -7313, -3377, 9562, -1761, -6851, 4440, 1064, -2411, 3385, -3452, -3111, 8604, -1406, -9399, 6096, 5317, -7011]
1648g011P195K593n459O291l634p622J3172R77j6017P949R987j1316j19N813n799
1663c000M893L001j2963O162J2543j4028m614J4014m078n464O039n301Q70J0279
1677H353j1192o239J7036l050j3508R326L491p005N319k908o064J2928j272j5797
1691a0582J0594R522j3647L67P464n793L774K060j1654P729J0664j5668k329J5338
1705G839o058o640P126l644K48Q097j0788l564J6463n586j3096J1307L539q454
1719c211M374j296m641J0993k927j3530J1836P542j4665J484Q889o202J523K289
1733B458q841P227P899j4940j79J4725p376o848Q202k636q90O342r011j815J4281
1748H598o863j1085J2237K500r585M463N67m213Q335l128j0535J1581M999j4235
$$ y = [-7011, 184, 2777, -2682, 3609, -25, -7647, 5525, 6502, -9515, -1566, 8421, -2895, -3014, 2799, -3000, 1893, 4894, -8069, -1907, 10636, -3392, -8006, 6008, 1930, -3534, 2505, -2796, -1926, 8353, -2839, -9078, 7958, 4908, -8600, 726, 4217, -2788, 2531, -377, -6441, 6487, 5215, -10582, 12, 9534, -4113, -3746, 3718, -2075, 1699, 3759, -7895, -166, 10498, -5170, -7499, 7839, 1781, -4859, 2267, -1377, -1129, 6968, -3820, -7384, 9079, 3493, -9603, 1704, 5243, -3211, 1163, -133, -4774, 6219, 3292, -10238, 1598, 9140, -5525, -4041, 4848, -1354, 169, 2458, -6383, 844, 8743, -6197, -6376, 8349, 973, -5875, 2327, -309, -1199, 5143, -3868, -5683, 8598, 1735, -9350, 2887, 5387, -4198, 265, 832, -3381, 4954, 1826, -8709, 2872, 7871, -6364]
1762f364L103Q864o911M21L027o562N665N369j2648J671J2518q297n803Q935k007
1777I81k660M982o138p44J0803o799q329J1559J099r372M618J823m130N445k151
1792I87p232R280K674j1694M067P479p039k27L738m643L611L364r285K439R282
1807F801p926l929Q317k133l286M274l751n96P274n615n047R293n06p624M668
1822B14J979m059L438r80m666O565J046q421L940N512o290j24L775l288J473K402
1838B516n664J814N950n981k310O580k035l106L451j639r84M233l348l083O240
1853B634o25n373L594J751l428J948J87k901L558O33n047K811L355m546mL193
1869A740k306K30J797l068J009L309l668j078M191j607k175K566p12j122K343
$$ y = [-6364, -3261, 5603, -1308, -887, 2140, -4422, 1243, 6612, -6036, -4365, 8153, -144, -5947, 2988, 981, -1679, 3303, -2835, -3579, 7224, 425, -7904, 3655, 4754, -4618, 0, 1823, -2307, 3138, 987, -6245, 3035, 5709, -5985, -1918, 5561, -1478, -1705, 2033, -2610, 1001, 4365, -4920, -2481, 6801, -1125, -5054, 3263, 1130, -2156, 2118, -1633, -2229, 5045, -570, -5617, 3676, 3170, -4454, 214, 2193, -1866, 1572, 592, -4074, 2491, 3537, -4884, -944, 4568, -1722, -1846, 1929, -1359, 114, 2516, -3148, -1334, 4616, -1365, -3675, 2905, 870, -2236, 1215, -424, -1408, 2825, -523, -3606, 2634, 2009, -3364, 230, 1981, -1447, 501, 688, -2213, 1345, 1978, -3069, -258, 3097, -1449, -1453, 1740, -566, -336, 1461, -1607, -598, 2711, -957, -2035, 2156, 549, -1626, 940, 228, -894, 1449]
1884A449j650j548L471p60l082K516J042k446J019O18j549J592K74k478J574J585
1900A627k495J60J848j413j74J178j292K45J531j762l66K045r06j248J464j55
1916B87p80R71m87o88J391k88j448J273L77j318N91M82q68M80L26r99O31N87j091
1935e71J42R20o97j34N82m70M3M51m92j79Q02l87l86O98j70m71N20o9l13M00o6
1956A53m27M93O5n25K66K24l38Q8K10m07J74K87m53J08K76l61J2L17k23q8L11
1977A62k49l6K46j31j90L72o1k87L38j1l30L85j3k88K15R7l68L43J05m70K73J76
1999B78m28R5K82l34M8K74m68J62M29n60j01O39m29k65N81k24k74N45m32k24P94
2020C88k78o73Q34ro80N66O9o20O87M6r51O81N46j149L99O67q79K97M41r61M67
$$ y = [1449, -201, -1749, 1722, 962, -2120, 396, 1438, -1008, 11, 629, -920, 672, 946, -1532, 42, 1627, -868, -708, 1140, -273, -447, 731, -561, -316, 1215, -547, -913, 1132, 226, -1022, 442, 287, -493, 478, -9, -697, 694, 406, -1042, 231, 608, -710, -119, 363, -505, -25, 301, -698, -67, 520, -571, -429, 491, -206, -340, 242, -228, -185, 266, -226, -405, 397, 10, -376, 322, 152, -319, 201, 132, -181, 219, 153, -274, 219, 284, -241, 25, 249, -89, -1, 209, -198, -24, 263, -190, -82, 194, -167, -155, 162, -61, -149, 162, -87, -123, 123, -8, -198, 174, 113, -174, 164, 153, -177, 208, 195, -93, 122, 219, -149, 194, 299, -171, 102, 278, -150, -55, 227, -107, -59, 215, -253, -91, 338, -222, -323, 316, -113, -378, 203, -21, -295, 250, -182, -406, 388, 110, -563, 271, 262, -418, 148, 217, -403, 284, 330, -621, 60, 606, -543, -144, 523, -356, -59, 382, -579, -112]
2041a12Q11j301O4J288r95l68J087o11k99J051r19m26J677q41j179J651L2j376
2059g66J013Q5r60J353l24j605J751N90k197R37J223j583M36Q38j655R72J221
2076A329k428L87K439k016q34K052r90m72J507j689k38K692j801j779K947k11
2092H95k286J788k7j330J996p06k296L001O52l671J673K139k673M90J202k052
2108a205J664J294l753J210L413l321j137L343j511q72K005k203R5L503l124k149
2124b748M844q57l536K716L47j871K448j332k568M450O1n197L110K815m055P16
2140f57J781k472K078J043m760K523M221n330r84M985k175j603K564k412M12L975
2156C189m442k083O552j665m978M117P88k771K527j446k435N540j001o200M746
$$ y = [-112, 699, -602, -538, 750, -245, -613, 474, -137, -436, 615, -304, -730, 947, 106, -1073, 578, 610, -766, 247, 332, -628, 725, 401, -1204, 547, 1137, -1060, -123, 1100, -483, -47, 791, -864, 108, 1329, -1099, -712, 1727, -289, -1123, 929, -61, -533, 974, -715, -953, 1739, -62, -1841, 1106, 895, -1391, 397, 370, -960, 1036, 330, -1966, 1035, 1687, -1984, -311, 1828, -845, -355, 847, -1205, 459, 1753, -2000, -790, 2623, -698, -1835, 1508, -3, -875, 1130, -1073, -978, 2525, -599, -2748, 2096, 1239, -2297, 419, 766, -1105, 1343, 11, -2557, 1893, 1954, -3243, -133, 2682, -1373, -657, 1124, -1348, 730, 1773, -2987, -464, 3757, -1573, -2557, 2428, 253, -1350, 1214, -1198, -786, 3189, -1253, -3336, 3216, 1551, -3427, 690, 1478, -1293, 1234, -212, -2647, 2893, 1892, -4308, 438]
2171D38L381n799Q13K952k875J961Q05n172L697M366p041n33O613l262k408L378
2187A314k336N58L841n474j300P781l122n825N716R89l904K668j163k210N740
2202C273j899o613O360L254p440J394M084l461J382Q70m791M301L824q110N79
2217b993P569m428l203M528j802k08L418n276m42P841m418n853P225Q64n241K765
2233C46j50k118N108k399n969P271K347q412K286M968m162O44J313m074M246K838
2249D083q228J731P706n636l235N476j598q93K855m624L10P110n263n042P969
2264B721K48n999L131O84k200M047k526m588P166J166q360L315N095m918M6K050
2280A078l061L251J796p160K677O652o302k645O112j739j849K721l348N52N593
$$ y = [438, 3819, -1980, -1167, 1785, -1090, 871, 1676, -3496, 201, 4567, -2474, -3007, 3606, 344, -2064, 1314, -1022, -464, 3377, -2097, -3397, 4384, 1262, -4563, 1153, 2142, -1762, 906, -257, -2467, 3273, 1374, -5239, 1121, 4375, -3065, -1671, 2413, -1048, 334, 1204, -3587, 714, 4538, -3572, -2993, 4576, 148, -3055, 1473, -329, -537, 2881, -2395, -2837, 5004, 586, -5267, 1958, 2822, -2419, 346, 196, -1922, 3186, 787, -5182, 2089, 4436, -3976, -1690, 3278, -884, -240, 1073, -3001, 1245, 4083, -4145, -2414, 5292, -344, -3579, 1897, 299, -594, 2261, -2363, -2053, 5057, -206, -5248, 2721, 2969, -3030, 101, 785, -1415, 2632, 106, -4482, 2684, 3850, -4510, -1195, 3900, -1018, -972, 1078, -1983, 1268, 3064, -4096, -1419, 5233, -1069, -3714, 2398, 659, -1190, 1531, -1817, -1265, 4328]
2295D328n408l426P740p64o003L678J134k508K917j994l168O321j96p237M185
2310d01M179n288K58K454k617K406J003n717L199N050o484j239O005k284k130
2325a606K772k398N40L972m759j953O871j937n028M148J021k944K275j123k198
2340b347M896q51n688M460K938n289P32K727k434J312Q77l955K749L320n459l42
2356b354N232k602k059K821j481j10K724l394r67N192k257l797M064N88k949J887
2372E38k56j754L277r60l769L720J741m467J072K598k467O33J001k546J826K002
2388B189l966L28L844k557j518K691r87p17J906k080m72L321j832k477L304J55
2404A132k519J562K98j370J816m76k235K457R15l180J076J968k009J88J045j502
$$ y = [4328, -1080, -4506, 3234, 2470, -3533, 145, 1279, -1229, 1688, -306, -3474, 2847, 2651, -4586, -401, 3778, -1510, -1252, 1202, -1415, 991, 1994, -3723, -524, 4526, -1958, -3197, 2808, 524, -1606, 1166, -1232, -692, 3280, -1479, -3432, 3439, 1502, -3526, 622, 1643, -1301, 974, -149, -2347, 2549, 1698, -3990, 470, 3408, -1881, -1149, 1578, -856, 456, 1333, -2622, 127, 3447, -2012, -2354, 2878, 276, -1783, 1038, -443, -553, 2171, -1223, -2190, 3002, 745, -3052, 1012, 1600, -1349, 538, 282, -1472, 1805, 845, -2924, 796, 2537, -1930, -858, 1740, -727, -94, 907, -1639, 187, 2189, -1777, -1449, 2395, -162, -1680, 1011, 24, -693, 1213, -867, -1339, 1982, 150, -2327, 977, 1132, -1387, 175, 473, -897, 919, 443, -1792, 665, 1580, -1600, -524, 1444, -565, -377, 668, -834]
2420h34Q91J178k415M58K349j863j010K106p04p58J210r29l90J863j144j301K065
2437G72m6j752J139M57j138R67o8j217J331L89j731P25J210j403RR53q67K46O25
2456F01j099K22J156j144m44J324l97p15P92k53l95Q50m46o65J069n9r75O64K79
2475C65p34M00K34o41N36J85p96L50N91p53L7N69m35j17L90l53NM79m89j70O40
2496B93k27l72L71Jk90K92o9l26N47j05m12K77J68m03J73J98l26K15J65l21J17
2517c4K67m34P0K90k68k2K49j80j19L70j65j46L52k62k01M13j23k22K91l9k22
2538a35K24K6k45K97p4k82L40N7m18K29K39l08Q5J52k94J04K16m18J98L50m98
2559a55k3M07k34n8K39l43ON18m63k63P16k86m45N38j33l02N07j94m38P13r7p66
$$ y = [-834, 57, 1235, -1180, -722, 1627, -236, -1246, 860, 156, -602, 608, -321, -711, 1152, 8, -1293, 772, 726, -1026, 113, 570, -568, 399, 331, -886, 445, 834, -897, -172, 1038, -365, -356, 597, -270, -24, 601, -498, -276, 880, -264, -708, 616, 219, -496, 296, 43, -352, 498, 52, -613, 456, 397, -578, 86, 365, -369, 31, 265, -376, 160, 345, -451, -101, 490, -263, -226, 343, -92, -209, 181, -172, -167, 312, -177, -347, 293, 66, -306, 65, 66, -224, 68, -1, -327, 220, 115, -297, -20, 148, -255, -82, 116, -210, 5, 170, -151, -34, 233, -201, -131, 159, -109, -131, 118, -62, -181, 189, 24, -122, 230, -32, -233, 180, 57, -165, 126, 87, -135, 89, 115, -130, 167, 93, -189, 151, 208, -210, 19, 258, -50, 35, 187, -107, -3, 213, -205, -7, 343, -155, -178, 229, -5, -63, 176, -167, -161, 357, -106, -369, 347, 61, -384, 154, 21, -281, 226, 32, -406, 307, 210, -556]
2581e56O37K72p10L38L12o84M83K18r15O06O47r98J5Q63o82o9O35p06J16Q37r99
2602c40k81J286n30q60J054j90n36P70l99o44J286l57j236J272L65j298N95M60
2620D17r75Q57J65j389J075R11j815L43J358j202j07R25j023L13J148j696o1K029
2638A273j178j189J754l24r07J151o92p24J989q05j861K148M62k143R54P99j294
2655e87R96J53j906J782J032k788O60K193j869l63J508j331M31J295k335K34K857
2672A962k130j606K736n23j343J516q20p05K496j588k134L316J94l173J717J071
2688I86j807J237j22j899K510P10l760J613K671k889l10K027j499N47J288k905
2704a602Q52L337l223j539L804r42j997J913p70n66K580k188k052M320m58l907
$$ y = [-556, 81, 353, -357, -19, 293, -391, 92, 310, -605, 1, 648, -350, -335, 528, -154, -223, 412, -294, -178, 659, -340, -621, 665, 135, -725, 329, 139, -397, 373, -26, -670, 616, 259, -977, 295, 660, -638, -43, 417, -558, 299, 464, -925, 150, 1061, -754, -411, 947, -255, -362, 563, -460, -147, 1001, -695, -756, 1273, 95, -1094, 660, 336, -571, 580, -112, -836, 1153, 348, -1513, 635, 1097, -1046, -92, 707, -587, 409, 562, -1344, 438, 1470, -1318, -658, 1535, -334, -697, 811, -520, -89, 1206, -1129, -895, 1962, -168, -1774, 962, 439, -904, 612, -208, -913, 1583, -5, -2139, 1177, 1371, -1802, -85, 986, -821, 416, 294, -1605, 905, 1615, -2145, -532, 2139, -750, -1060, 967, -532, 15, 1303, -1602, -750, 2587, -636, -2175, 1629, 687, -1310, 603, -167, -733, 1847, -341, -2393, 1927, 1469, -2438]
2720b438K456J480k388J131P8j892K907K76m367K513L139m061k77K921j763J84
2736a01J277k936J393L276m170j106M819j686k650K650o95p37K508k603j545M883
2752B577j244m429L579J559l211J207L39j797K947l40m300L489K731n040L29L520
2768A916k209j19J352k687J849K718m753l22N183k451k943L330m49j116K128k432
2784a005q86M741k140m214M508J252l994J499J013j864K493p05l725L972K053
2799B998n453J055L846k840m79J726k218J648K124m684N34N100l328k676L907
2814A260n64j540J944k030m88M208k585l541M881O42m355J924J321j910J951p25
2830C93k898L887J105n230J817L683l306n95K111j700J037J473l921J116M236
$$ y = [-2438, 18, 1498, -890, 241, 319, -1573, 1334, 1610, -2757, -244, 2895, -1166, -1443, 1478, -285, -101, 1176, -1760, -367, 2909, -1261, -2367, 2452, 766, -1884, 766, 71, -666, 1842, -761, -2306, 2577, 1333, -3096, 483, 2042, -1169, 38, 377, -1420, 1527, 1187, -3113, 376, 3107, -1933, -1604, 1916, -293, -412, 940, -1747, 102, 2820, -1933, -2255, 2928, 477, -2466, 864, 415, -701, 1427, -1005, -1891, 2850, 710, -3504, 1004, 2256, -1738, -239, 774, -1090, 1403, 698, -3027, 945, 2998, -2455, -1400, 2446, -394, -873, 853, -1365, 283, 2407, -2277, -1743, 3357, 29, -2647, 1260, 696, -844, 1100, -930, -1418, 2790, 205, -3336, 1545, 2187, -2168, -244, 1077, -833, 1118, 393, -2505, 1382, 2487, -2743, -926, 2757, -549, -1144, 967, -733, 304, 1777, -2144, -1028, 3208]
2845C208l709k110M190p13k122J950j214l68L190k610k445M591j00m096K237J490
2861A369k229J377k69k119L244L32m422K302L058l575k51K298j582N41J081k963
2877a808J328L142l688j159M014j271j962J984q33m54K374k265j436L949q77l392
2893b354K584J103k317J172O2j509K393r7l244K284K086l244Q7K321j623Q9R85
2910G78j951J052K073l005m30L364j600j686K039m70o65J459j410p98K857j057
2926E50k464K458O85k177J027L65j168J472j11k222J952J221k803N55J885j573
2942c48j3R88j258O08J168j971n7K330j438j190J838l85q85J131p69n63J845q81
2960A50j528J963J84j679Q01O80j098P88R4j310J242O58j862M94J442j320j52
$$ y = [3208, -501, -2611, 1579, 866, -1256, 694, -520, -888, 2302, -308, -2753, 1838, 1738, -2358, -121, 1369, -860, 517, 248, -1871, 1373, 1705, -2717, -415, 2643, -932, -1183, 1115, -467, 74, 1155, -1808, -480, 2662, -1026, -2185, 1829, 558, -1404, 580, -253, -707, 1667, -598, -2034, 1915, 1038, -2354, 230, 1333, -984, 188, 250, -1259, 1134, 1037, -2207, 77, 2163, -1081, -994, 1327, -296, -207, 778, -1173, -121, 1952, -1053, -1483, 1881, 281, -1405, 634, 164, -501, 958, -452, -1250, 1607, 550, -1914, 544, 1229, -948, 79, 444, -724, 748, 637, -1585, 367, 1588, -1215, -660, 1225, -348, -361, 627, -631, -23, 1145, -826, -883, 1447, 9, -1181, 657, 272, -613, 518, -251, -814, 1031, 150, -1378, 585, 769, -910, -109, 571, -527, 261, 355, -955, 287, 945, -917, -423, 1019, -301, -453]
2977d53R81q62K16P63j233J00J466j052q16J420l04p64P39j97m63R90m36r02J206
2996C99J56j223O42N05q27L94K00o70O42K76j025L91Q40q50j53O47m11r3N56n69
3016a73k2P40o13l95Q35k64m82N23L8m59N34p0n85O62L8o64L49L46n64J84K95
3037B53m54K15K87n82J47M79m60j33M93k84j57L75k43j66M39k54k48M75j47l65
3057c30M19K8l63L18K2l25K49J71m48K36J77l29J05K24l10J78J74l02Q5J26k05
3078a00J8K04k38j1L05k41p0K79j91p9K63j74j74L59j49k09L53o0k67K70k0k30
3100a62K23L4k63K95L2m06K37K46l79J53J58l35K08K13m09J33L44l98j50M99k98
3121b5r9L44k75l3M19m04k57O68k48m82O13j06l79M01j57l41N80n7o74O00L23
$$ y = [-453, 528, -334, -118, 645, -588, -488, 978, -74, -890, 530, 226, -538, 201, 4, -459, 531, 95, -807, 399, 555, -668, -26, 479, -348, 46, 246, -424, 218, 494, -531, -140, 700, -150, -303, 344, -67, -160, 396, -173, -195, 545, -68, -463, 372, 108, -374, 149, 187, -272, 262, 192, -393, 269, 307, -357, -8, 338, -226, -42, 253, -201, 14, 301, -281, -134, 345, -115, -248, 245, -39, -196, 179, -64, -230, 209, -45, -293, 182, 35, -330, 89, 117, -246, 72, 94, -231, 18, 189, -259, -23, 154, -175, -70, 154, -156, 22, 196, -106, -21, 105, -100, -82, 122, -116, -127, 178, -63, -133, 146, -45, -124, 139, -35, -209, 150, 1, -208, 145, 85, -182, 88, 68, -162, 61, 95, -168, 127, 159, -247, -10, 236, -143, 10, 168, -167, 41, 254, -155, -22, 322, -76, -226, 273, -25, -124, 220, -55, -88, 331, -73, -330, 338, 90, -392, 221, 115, -264, 137, -20, -361, 219, 162, -512, 88, 411]
3142D11p82L11L03m86K82J65o63M22N77j014J95P21n77j00N45n71O6O72p92j09
3162d24J057o11o69J062k51n62O48k36m63R03k96r22J036L28j191N33M81q10N58
3181A71J66j025Q17O69j498L40J244j087k53R19o84O7Q78j203q4J621j039r36
3199i17J481j31r89R45l95m93J297o45j216J672K41j814Q87Q07j202N90K58j245
3217h69J190P16k125O40J733j624l93J385q97N5R66j643K48J987j600j086K205
3234H88l93j351J190l14o23J515q97j460K343J9k321J355R66j583P16L02j345
3251i93J599M17k530J224J976k328k68J827j171M3R90j772N86K177k411r53K961
3268A374q03j751J606k70p58J662j307j218K880m71k848K060J179k185P78M98
$$ y = [411, -371, -60, 243, -243, 39, 204, -459, -37, 540, -474, -279, 442, -135, -235, 310, -261, -195, 477, -315, -424, 633, 22, -647, 415, 164, -398, 250, 14, -449, 454, 158, -764, 272, 600, -591, -58, 423, -387, 171, 337, -688, 129, 798, -700, -360, 884, -203, -456, 463, -221, -154, 724, -479, -563, 1058, 19, -917, 564, 433, -556, 389, -6, -499, 798, 153, -1063, 609, 850, -964, -77, 730, -472, 118, 376, -869, 321, 1037, -1088, -448, 1285, -339, -732, 653, -244, -189, 777, -866, -618, 1369, -231, -1317, 888, 495, -856, 334, 20, -603, 912, 15, -1445, 898, 917, -1404, -49, 917, -666, 50, 352, -993, 606, 1023, -1507, -283, 1693, -635, -903, 924, -247, -204, 786, -986, -400, 1777, -634, -1587, 1374, 571, -1180, 426, 156, -602, 1060, -247, -1465, 1415, 944, -1904, 156, 1335, -850, -72, 426]
3284D26j359J718J62k759J779K042l032n4K335j374k58J082j682P89K043k789
3300i31n67L351j415k055K245k36r12J513j404r56L120j078k890K700J053k633
3316a095Q82Q19j410J592j30k595K333J654l501L69K718j803m81J254j466Q60
3332@J694l058o9L600k020k048K648k30j257J439j164o53K881j467k557L146O68
3349A553l043J196J108j505J311j89k254K505J100l622J015K698k293m22J547
3364G05j329O86J223k699N43L133k465j695K998m27j577J473q61m86K410j776
3380a44j927L408M2l064J580J163j667R81l5j714K319M49l341J495K438k612l33
3397i62J854j227L05J036k288Q02K525k634j035K998q55j623J501n08m54J804
$$ y = [426, -933, 785, 947, -1812, -33, 2009, -1023, -1077, 1258, -116, -374, 708, -974, -185, 1858, -931, -1498, 1853, 438, -1617, 628, 392, -520, 993, -411, -1367, 1753, 675, -2215, 485, 1538, -1095, -213, 606, -804, 788, 658, -1937, 396, 2050, -1451, -1082, 1636, -167, -648, 606, -860, 0, 1694, -1364, -1433, 2167, 147, -1901, 747, 517, -740, 699, -465, -1118, 1763, 296, -2261, 885, 1553, -1490, -294, 814, -691, 620, 431, -1823, 682, 1782, -1840, -825, 1873, -420, -842, 705, -624, 62, 1285, -1414, -871, 2262, -203, -1898, 1100, 673, -904, 569, -292, -778, 1632, -144, -2071, 1337, 1379, -1685, -105, 1058, -609, 372, 337, -1377, 942, 1391, -1950, -455, 1983, -629, -962, 892, -335, -30, 1006, -1282, -480, 2045, -589, -1624, 1374, 519, -1104, 397, -111, -565, 1239]
3413A239j590j278L004m31k726J920R91j890Q50J75j261J806Q6k658J703J738
3429A678k652O3J920j284M5R16j607P01J803k389m92K738j146j459J598l21n83
3446d71J299j184p73K411p84k073J899O69j773P85L75j055J259n4j931J540J269
3463A408k337K64J677j221j43Q49j054N25J114j821j21K114j169j120J611k66
3479C10p50R60o91m88J620o83j510J737L27j606P67N17q92O75%j146J213N38j699
3498h01M59J218j095j46Q01o71K16O71j187J39J393j098o92J325l87n82P82m06
3516f1l65J027n89q70J299L3j205O72N31q19L62J61o31O12L93j184M65Q17q71
3535b23j61Q06n70MN11o94L0R36q02m57J060k36o29N66Nm74O54k87n58P77Op95
$$ y = [1239, -351, -1629, 1375, 944, -1782, 138, 1129, -761, 89, 264, -997, 809, 895, -1763, -60, 1678, -974, -911, 1009, -275, -230, 686, -921, -220, 1583, -806, -1298, 1440, 294, -1165, 433, 112, -471, 828, -356, -1129, 1282, 498, -1575, 324, 993, -780, 5, 380, -675, 584, 530, -1401, 139, 1408, -929, -665, 1012, -209, -352, 497, -557, -32, 1082, -739, -860, 1254, 85, -1035, 576, 310, -440, 520, -171, -659, 961, 278, -1232, 505, 832, -774, -7, 510, -382, 293, 293, -853, 360, 898, -801, -342, 876, -219, -365, 436, -235, -19, 652, -535, -396, 997, -101, -793, 532, 145, -437, 345, -61, -426, 601, 12, -858, 441, 474, -731, -59, 472, -347, 15, 176, -455, 157, 550, -634, -169, 648, -223, -384, 422, -148, -144, 367, -327, -297, 639, -163, -620, 440, 204, -425, 141, 146, -328, 326, 39, -519, 258, 264, -531]
3557e31N42L63o82K68K53m73L58K50o89K57N89p49K3N72l41j24L71l38o3N22m35
3578e7k98O45j81m09M13R2m58M22j09k99L52J03n68L27L17m95J77K55l62J14K10
3599A91m12J04L65m31J6M36l20j37L25j82j45L88k52j37L77q3l19L32j02k08K43
3620D9Q4l52K25Q3k60J91J27l16J72J33l94J62K37l49J50K58l26L9K57k51n4L72
3642B37l11j19L84j79j26K29j00j56K65j10k34L63j4l11K77N1l36K71N1k81K43
3663I4Q4l71K50K45m63R4K11k49J02J89l44J71K89m48rN32l78j90M07k66j3L09
3685B46l99j52O13k43l85N39k9m43M02p4l10N01j49n51N67J87o79K67L98m78J70
3706bJ29m70M16L46p88J47O66n82j49N81m36ON21o68m4Q55n72n16Q86j21o11O19
$$ y = [-531, 11, 374, -308, -40, 213, -260, 98, 348, -341, -84, 505, -244, -221, 351, 10, -114, 257, -81, -144, 378, -57, -355, 290, 109, -300, 113, 205, -253, 169, 60, -239, 113, 216, -352, -25, 292, -203, -26, 229, -133, -19, 191, -221, -117, 248, -183, -167, 269, -51, -188, 137, -45, -190, 198, -54, -191, 186, 103, -216, 116, 14, -194, 49, 133, -219, 6, 89, -171, 20, 147, -169, 3, 136, -258, -96, 141, -208, -58, 200, -126, -87, 170, -81, -135, 237, -74, -193, 191, 12, -114, 115, 15, -141, 124, 14, -220, 143, 129, -182, 95, 146, -190, 81, 132, -149, 94, 178, -193, 57, 302, -161, -67, 144, -105, -3, 186, -158, 13, 302, -146, -155, 377, -1, -191, 216, -50, -63, 246, -153, -305, 308, 65, -320, 219, 190, -253, 149, 75, -235, 266, 117, -434, 133, 320, -359, -92, 306, -172, -2, 127, -343, 73, 419, -369, -222, 444, -138, -287, 294, -142, -136, 385, -283, -327, 528, -44, -560, 326, 205, -406, 213]
3728B13j82l99Q09l80p17R77J79j139N62N38p61L78J78p12O51L87j203L78J006
3747G63j014j80R13o01j0O15r10J09J216j053n77J323k90q26Q07j81m32R04n36
3766D0q71J443M7j512Q93O47j029L81L19r44R12L27j594P90J209j427k45J278
3784F64p29k14Q53j113K23J362j427o43J885n23j187J120j42n12R63o31r07J718
3802G60j76j810J319P70j441M51M91r12R48K01j756J108J282j904n7J571r06k45
3820c06Q22j060L78J255j692m14K154q51j323J390k7p28R69q01o67J912n03j952
3838a444J757P64j772N14O20r52R38P4j710J482J090k280K08J791j191l03R74
3855E60j072M56J167j904j41K353j237j456J864j50q85R63p74n16J972r67j730
$$ y = [213, 31, -368, 441, 61, -656, 321, 500, -639, -77, 461, -300, 78, 256, -456, 195, 582, -621, -243, 763, -251, -431, 482, -119, -129, 486, -424, -315, 901, -152, -729, 594, 304, -522, 285, 104, -328, 576, 40, -831, 612, 659, -853, 40, 687, -342, 39, 358, -586, 326, 653, -941, -151, 1058, -369, -614, 664, -65, -279, 574, -539, -316, 1046, -381, -1024, 861, 338, -849, 271, 129, -383, 580, -51, -958, 760, 584, -1226, 93, 863, -578, -127, 364, -548, 400, 601, -1155, -47, 1235, -669, -726, 845, -61, -306, 516, -544, -166, 1089, -603, -1017, 1137, 286, -1037, 353, 326, -402, 567, -234, -901, 1011, 508, -1444, 313, 1077, -695, -181, 439, -513, 425, 499, -1211, 271, 1361, -919, -711, 1080, -111, -414, 560, -512, -56, 1111, -793, -934, 1419, 182, -1274, 590, 440, -445, 518, -256, -772, 1200, 233, -1497]
3872a497K105M82k089P90Q13j042Q10k0j530J604P38k394O24J898j529l87J165
3889E41r44M38Q75j871K39K182j555j241K035k30j186J108n51m36J672j129j462
3906a515K312K18k190R78R62j243O74Q8j347J571N67k410Q68J866j772l76J353
3923F04q25J02Q29j541L54J892j719r84K218m16j287J094k85m87J304j007j023
3940a177K127j50k045J262Q51j345N39K53j072J340K20j969J049J502j882k52
3956g49J454q11n4O80j155M46J442j710n35K004o31j258J142r4n48R50q04o58
3974h89J794l80j732J335P30j421N14L55q49Q70J23j463J007J094j685j6J353
3991G40q32k22P33q39L25R80j393k00J685q34r76J178q5o30O75m67m80J373m80
$$ y = [-1497, 608, 1090, -999, -209, 604, -438, 372, 352, -1178, 426, 1164, -1230, -606, 1292, -237, -624, 541, -403, 35, 910, -961, -722, 1460, -95, -1336, 699, 469, -717, 391, -160, -596, 1076, -53, -1515, 797, 1015, -1175, -197, 765, -478, 196, 284, -1063, 508, 1075, -1335, -467, 1399, -373, -749, 604, -221, -119, 710, -831, -477, 1415, -304, -1288, 930, 514, -773, 321, 36, -451, 853, -154, -1177, 950, 800, -1245, 17, 868, -477, 62, 315, -757, 583, 803, -1166, -117, 1385, -497, -749, 705, -106, -160, 520, -635, -189, 1253, -457, -992, 1012, 381, -877, 265, 171, -377, 573, -231, -889, 905, 525, -1207, 128, 858, -563, -49, 306, -543, 327, 450, -1013, -6, 1088, -597, -613, 740, -92, -314, 419, -420, -95, 885, -508, -708, 977, 143, -833, 345, 260, -370, 305, -162, -642, 731, 251]
4010B51j196J209M23j291M62M51o66N91j8r21Q54O08j422K71J066p31l00O59n05
4029b05P9O59r52K9J143p18p12J007o2o08N74k22l94Q53l48p61R67J86j050N20
4049a5L51n43K61J57o17N60L20r60K66P97p48k05O29l28qL97o22O2Q17o41m01
4070d71Q30j02o29N15n8l00N33k61m91O84j0p27M45L48n36J80K00m19K95K33o85
4091d26L20N13n93r6N88l44j21L62l15j0M51l92k58O23j76m23L64L5k96L05q1
4112C0l15M62m8m20L05K42m17N1K86k94J19J86l92R9M26m54m0M16k16j48L02j78
4134Bq1L04k28j91M32j20l39L58L3l20K05R4k74J88Q7l08J93J76l40J08J66k30
4156h5N1J61k03j2K63k19j11L62k15j38K70j55o1J76p1j54K94o9k50K25L5k73
$$ y = [251, -945, 264, 687, -604, -142, 309, -357, 234, 216, -705, 149, 757, -665, -394, 672, -59, -359, 300, -205, -126, 533, -419, -390, 753, 35, -677, 330, 268, -340, 234, 12, -382, 471, 123, -638, 329, 515, -535, -15, 336, -207, 54, 211, -406, 154, 474, -486, -220, 577, -171, -376, 253, -75, -83, 314, -308, -246, 571, -70, -471, 359, 257, -372, 143, 85, -215, 318, 57, -434, 250, 240, -487, -42, 306, -230, -50, 150, -269, 26, 259, -426, -106, 407, -186, -282, 306, -38, -159, 203, -112, -122, 329, -63, -321, 302, 126, -297, 67, 102, -194, 111, 30, -285, 177, 129, -291, 14, 256, -161, -110, 176, -118, 1, 187, -205, -106, 320, -134, -174, 242, 26, -122, 180, 2, -79, 225, -3, -194, 238, 118, -221, 137, 170, -150, 55, 149, -125, 63, 150, -158, 35, 211, -129, -21, 145, -85, -34, 127, -76, -88, 175, -44, -155, 207, -8, -146, 124, -31, -92, 84, 13, -141, 153, 84, -166, 59, 94, -179]
4178a79K28k3j81K10R6k92J52Q2k11N9J98l32N5K84k00n7K16j46kJ46k10k4K96
4201A65j75j51L31j01j71J95k1j97K00k5k23K93o0k47K60J33k93J17O4k29J63
4222B8R2l12J46K69l48KL20k16q8K45k31O8K81l44o0M19k80j72L08j13l8J48j48
4245b4j77M38j35m49M57Q4l38J48P6k59K63N8m89M72J63n59J60L17k99KK65m15
4267b41K31K75n03qN73m03j88M73j92j28L85l76j29N76l41l87N83j9m71L53Kk56
4289a91L32j17m28O02J24p44K98M71n11N1L00m20K68L59p93J99P70o42k65O09
4309B72k19j99M43m90k5P24m95n54R48q2p23M79J30m03M15j33n20P87O0j003N17
4330g1N85p69J75L04m47L42K72r10L70Q15q88k42Q62l30l24N75n19n8R02p76m60
$$ y = [-179, 49, 26, -155, 55, 151, -141, 11, 93, -118, -59, 139, -193, -138, 146, -54, -111, 105, -41, -43, 103, -107, -131, 165, -10, -161, 170, 69, -102, 93, 72, -125, 75, 50, -173, 120, 60, -187, 73, 206, -87, 30, 94, -135, 28, 120, -192, -46, 223, -125, -123, 197, -19, -107, 138, -93, -25, 256, -88, -148, 271, -9, -181, 127, 14, -24, 124, -24, -201, 237, 102, -347, 110, 194, -144, 4, 80, -179, 84, 142, -347, 125, 288, -271, -111, 206, -93, -91, 174, -241, -10, 265, -238, -246, 327, -76, -264, 209, 17, -111, 274, -102, -231, 345, 4, -383, 200, 181, -290, 63, 65, -191, 141, 24, -404, 198, 322, -422, -124, 347, -164, -113, 187, -233, 35, 394, -399, -200, 570, -72, -337, 272, 53, -146, 297, -193, -218, 506, 11, -543, 405, 323, -400, 79, 209, -194, 221, 88, -432, 355, 415, -588, -71, 514, -255, -80, 224, -223, 119, 391, -519, -149, 666, -222, -464, 398, 68, -256, 319, -200, -258, 644, -132, -592]
4351e92J126k50q99P05J42n28N15k27n04R11l4j056O75O05r66K21N05o18L75K29
4371C35r05M53Q30j076j77J080n19l67O02m35PP38q47l22J280m68r24Q48K41o84
4391c10N33j96m79J010k61j164R73N92j099J60O08n73K77K31q65O04P82j263p8
4410e18J224p21l79O75l69K0O43q97j38J289o37r22J038J10q10M95j11l04Q44
4429E32l13j039J084M28j232L57O50o14J73J74p10O73M61j259K63J105p99m21
4447d87P74l05j08N14q12j3J217q13p67J207J0q78N07j3k89P30l88q51J096K35
4467E66j238M76P44o98R8K82o32N71L88j197L32J076r96k91Q16k79k39N00o12
4486c33N1J022q62o04J197q7q66M78J77l73N17l38n80J054J6j183O26O78q29Q8
$$ y = [-592, 534, 284, -615, 90, 232, -296, 219, -8, -512, 399, 365, -691, -16, 589, -377, -156, 349, -269, 106, 335, -570, -117, 713, -363, -540, 540, 21, -346, 256, -179, -172, 566, -281, -603, 677, 209, -715, 133, 374, -310, 223, 27, -452, 558, 297, -867, 106, 698, -401, -241, 367, -206, 71, 302, -563, 41, 823, -440, -518, 706, -15, -394, 281, -88, -68, 575, -322, -460, 829, 192, -730, 308, 418, -392, 103, -8, -312, 532, 219, -820, 264, 692, -540, -183, 467, -147, 26, 200, -510, 163, 624, -635, -372, 733, -66, -487, 287, -18, -126, 388, -424, -437, 780, -33, -800, 407, 417, -461, 46, 33, -256, 474, 86, -765, 331, 566, -672, -196, 548, -150, -52, 230, -402, 169, 557, -640, -308, 768, -228, -519, 297, 18, -221, 279, -333, -282, 740, -122, -726, 471, 384, -482, -4, 173, -200, 317, -21, -601, 453, 469, -714, -88, 590, -239, -151]
4506a51L29m47M72J43r28M75Q05r20k52R07l39k88M36m44Q0O51o88m01J082k39
4526B83p91O25J98n19M06j82l89P23k3r54O15N73q15Q1L86l27J51J87o65M38N60
4547E61q71j47R33m15l80M66k45l7M45m71k36Q83l09o88O03J23m12K99p4l14N55
4568B69q9o50N71K71o86J62M35l73Q0J66m81L67L48o67j3O69l97k92M87j98r7
4589a18L43l19j97O24k46n18O21L1m30K69L8k40L54j26m30M95J68n63J80K97l22
4610h9j0K50l08J77K86m56J4M11k83k45L87r8j50K41j22j39L29k03k18L30O5l62
4632a93J80J46j89J16J4k39K06J31l47R0K83k66n5K03j41RK06k86Q5K52k43j44
4654a82K89p9k27K67l9q1J88j07k03L22j5l09R4J67j55Q3M9j67J23R0k11P5J36
$$ y = [-151, 178, -269, 203, 346, -582, -107, 698, -222, -474, 433, 94, -194, 242, -202, -122, 529, -159, -560, 522, 283, -508, 117, 315, -204, 202, 20, -369, 354, 331, -623, -8, 565, -250, -169, 217, -110, 41, 228, -437, 1, 561, -310, -457, 476, 61, -319, 147, -98, -135, 310, -161, -397, 486, 177, -511, 92, 215, -197, 102, 28, -286, 269, 180, -470, 101, 372, -314, -152, 283, -90, -10, 156, -325, 42, 390, -277, -290, 379, -18, -310, 177, -21, -118, 225, -94, -291, 333, 87, -431, 190, 221, -209, 60, 98, -142, 212, 86, -344, 151, 319, -244, -64, 233, -89, -99, 151, -157, 20, 306, -150, -136, 275, -8, -253, 134, 36, -114, 127, 5, -134, 195, -8, -226, 104, 169, -193, -13, 133, -56, 60, 74, -165, 41, 172, -175, -85, 198, -68, -123, 80, -61, -52, 154, -132, -47, 205, -38, -182, 107, 28, -199, 68, 29, -52, 136, 29, -174, 148, 133, -176, -82, 85, -70, 13, 62, -105, 18, 108, -103, -28, 108]
4677A08k01M7J45j42K9J50k23j0K88k23j18K97m9j75J61J3j81J05n5j06K33N3
4699A46k66J52M4j65R7R1j99J28P5j67O6J23j80j9J54q1o1J82j04l2Q3j17k6J63
4723H7o4j51K14n8j26J27j8r9Q7R3j81J25N3j53R9Q5k37J02J63k03J3J44k06M8
4747e6J60j80nK56k21lJ42r2r4J03J6j50K38p9j89J85j3r9J20Jj02P9Jj46J88
4772F0l7j85J59J63k33N0P5j23R4R2j92L7K83k86j05K67r0q9J57j12l6J56j19
4795a4r1K81q8k26K01L9k34J91jk54K85P1l71K26J90l12Q1J41k42J34O2k83K17
4818CK41l49l5L52k70p7K48j88k8K86k92l4L20p1l56L43Rk49K49j44j19L17r8
$$ y = [108, -93, -46, 99, -43, -14, 136, -87, -97, 191, -32, -150, 147, 98, -77, 84, 97, -84, 21, -34, -140, 93, 146, -120, 32, 76, -89, 8, 99, -100, 28, 103, -64, 2, 125, -55, -74, 80, -1, -62, 120, 16, -16, 67, -50, -76, 87, 23, -128, 86, 28, -98, 29, 11, -88, -1, 92, -89, 36, 89, -64, 35, 120, -117, -15, 148, -55, -42, 102, -104, -56, 104, -76, -81, 175, -46, -49, 93, 1, -93, 10, 26, -124, 114, 35, -154, 31, 18, -81, 39, 40, -62, 17, 18, -128, 60, 23, -162, -3, 160, -73, -23, 52, -71, 23, 115, -77, -40, 243, -43, -148, 119, 29, -60, 97, -15, -51, 105, -14, -105, 176, 88, -138, 63, 102, -132, 59, 58, -196, 89, 160, -211, 15, 205, -107, -26, 115, -127, 7, 69, -214, 3, 244, -105, -140, 212, -58, -135, 113, -75, -103, 183, -109, -143, 177, 106, -250, 93, 102, -147, 102, -42, -161, 156, 58]
$$ [...]
8191a7
##END NTUPLES=NMR FID
##END=
