##TITLE=1H_Pr NCO 5
 CDCl3
 8 sc, 
 5.11.2024
##JCAMPDX= 6.0         $$ Bruker NMR JCAMP-DX V2.0
##DATA TYPE= NMR FID
##DATA CLASS= NTUPLES
##ORIGIN= UXNMR, Bruker Analytische Messtechnik GmbH
##OWNER= root
$$ XWIN-NMR		Version 3.5
$$ Tue Nov  5 13:57:10 2024 Russian Standard Time (UT+4h)  she@DPX200
##.OBSERVE FREQUENCY= 200.1318
##.OBSERVE NUCLEUS= ^1H
##.DELAY= (6, 6)
##.ACQUISITION MODE= SIMULTANEOUS
##.ACQUISITION SCHEME= undefined
##.AVERAGES= 8
##.DIGITISER RES= 18
##SPECTROMETER/DATA SYSTEM= spect
##.PULSE SEQUENCE= zg30
##.SOLVENT NAME= CDCl3
##.SHIFT REFERENCE= (INTERNAL, CDCl3, 0, 15.7039)
##AUDIT TRAIL= $$ (NUMBER, WHEN, WHO, WHERE, WHAT)
$$ ##TITLE= Audit trail, XWIN-NMR		Version 3.5
$$ ##JCAMPDX= 5.01
$$ ##ORIGIN= Bruker BioSpin GmbH
$$ ##OWNER= she
$$ F:/spectra/data/she/nmr/H-F/1/audita.txt
$$ ##AUDIT TRAIL=  $$ (NUMBER, WHEN, WHO, WHERE, WHAT)
(   1,<2024-11-05 13:56:10.50 +0400>,<she>,<DPX200>,
      <created by zg, POWCHK disabled, PULCHK disabled
       configuration hash MD5:
       00 E9 B6 7A A2 85 ED C7 34 08 36 98 17 FE 4E 26
       data hash MD5: 16K
       B3 8F D0 9C 8D 28 1B 3A 75 4A 3E 77 3B 0F 93 11>)
$$ ##END=
$$ 
$$ hash MD5
$$ 00 12 87 E2 D7 94 FF 40 62 DC 20 81 AD CE 63 0D
##$RELAX= 
##$RELAX= 
##$RELAX= 
##$RELAX= 
##$RELAX= 
##$RELAX= 
$$ Bruker specific parameters
$$ --------------------------
##$DU= <F:/spectra>
##$EXPNO= 1
##$NAME= <H-F>
##$PROCNO= 1
##$TYPE= <nmr>
##$USER= <she>
##$AMP= (0..31)
100 100 100 100 100 100 100 100 100 100 100 100 100 100 100 100 100 100 
100 100 100 100 100 100 100 100 100 100 100 100 100 100 
##$AQSEQ= 0
##$AQ_mod= 1
##$AUNM= <au_zg>
##$AUTOPOS= <>
##$BF1= 200.13
##$BF2= 200.13
##$BF3= 200.13
##$BF4= 200.13
##$BF5= 200.13
##$BF6= 200.13
##$BF7= 200.13
##$BF8= 200.13
##$BYTORDA= 1
##$CFDGTYP= 0
##$CFRGTYP= 5
##$CHEMSTR= <none>
##$CNST= (0..31)
1 1 145 1 1 1 1 1 1 1 1 1 1 1 1 1 1 1 1 1 1 1 1 1 1 1 1 1 1 1 1 1 
##$CPDPRG= <>
##$CPDPRG1= <>
##$CPDPRG2= <>
##$CPDPRG3= <>
##$CPDPRG4= <mlev>
##$CPDPRG5= <mlev>
##$CPDPRG6= <mlev>
##$CPDPRG7= <mlev>
##$CPDPRG8= <mlev>
##$CPDPRGB= <>
##$CPDPRGT= <>
##$D= (0..31)
0 1.2 0 0 0 0 0 0 0 0.06 0 0.03 0 0 0 0 0.0002 0 0 0 0 0 0 0 0 0 0 0 0 
0 0 0 
##$DATE= 1730800569
##$DBL= (0..7)
120 120 120 120 120 120 120 120 
##$DBP= (0..7)
150 150 150 150 150 150 150 150 
##$DBP07= 0
##$DBPNAM0= <>
##$DBPNAM1= <>
##$DBPNAM2= <>
##$DBPNAM3= <>
##$DBPNAM4= <>
##$DBPNAM5= <>
##$DBPNAM6= <>
##$DBPNAM7= <>
##$DBPOAL= (0..7)
0.5 0.5 0.5 0.5 0.5 0.5 0.5 0.5 
##$DBPOFFS= (0..7)
0 0 0 0 0 0 0 0 
##$DE= 6
##$DECBNUC= <off>
##$DECIM= 24
##$DECNUC= <off>
##$DECSTAT= 4
##$DIGMOD= 1
##$DIGTYP= 9
##$DL= (0..7)
0 120 120 120 120 120 120 120 
##$DP= (0..7)
150 150 150 150 150 150 150 150 
##$DP07= 0
##$DPNAME0= <>
##$DPNAME1= <>
##$DPNAME2= <>
##$DPNAME3= <>
##$DPNAME4= <>
##$DPNAME5= <>
##$DPNAME6= <>
##$DPNAME7= <>
##$DPOAL= (0..7)
0.5 0.5 0.5 0.5 0.5 0.5 0.5 0.5 
##$DPOFFS= (0..7)
0 0 0 0 0 0 0 0 
##$DQDMODE= 0
##$DR= 18
##$DS= 0
##$DSLIST= <SSSSSSSSSSSSSSS>
$$ [...]
##$SUBNAM2= <"">
##$SUBNAM3= <"">
##$SUBNAM4= <"">
##$SUBNAM5= <"">
##$SUBNAM6= <"">
##$SUBNAM7= <"">
##$SUBNAM8= <"">
##$SUBNAM9= <"">
##$SW= 24.0689170037331
##$SWIBOX= (0..15)
0 0 2 0 0 0 0 0 0 0 0 0 0 0 0 0 
##$SW_h= 4816.95568400771
##$TD= 16384
##$TD0= 1
##$TE= 0
##$TE2= 300
##$TE3= 300
##$TEG= 300
##$TL= (0..7)
0 120 120 120 120 120 120 120 
##$TP= (0..7)
150 150 150 150 150 150 150 150 
##$TP07= 0
##$TPNAME0= <>
##$TPNAME1= <>
##$TPNAME2= <>
##$TPNAME3= <>
##$TPNAME4= <>
##$TPNAME5= <>
##$TPNAME6= <>
##$TPNAME7= <>
##$TPOAL= (0..7)
0.5 0.5 0.5 0.5 0.5 0.5 0.5 0.5 
##$TPOFFS= (0..7)
0 0 0 0 0 0 0 0 
##$TUNHIN= 0
##$TUNHOUT= 0
##$TUNXOUT= 0
##$USERA1= <user>
##$USERA2= <user>
##$USERA3= <user>
##$USERA4= <user>
##$USERA5= <user>
##$V9= 5
##$VALIST= <valist>
##$VCLIST= <CCCCCCCCCCCCCCC>
##$VD= 0
##$VDLIST= <DDDDDDDDDDDDDDD>
##$VPLIST= <PPPPPPPPPPPPPPP>
##$VTLIST= <TTTTTTTTTTTTTTT>
##$WBST= 1024
##$WBSW= 4
##$XGAIN= (0..3)
0 0 0 0 
##$XL= 0
##$YL= 0
##$YMAX_a= 349862
##$YMIN_a= -400830
##$ZGOPTNS= <>
##$ZL1= 120
##$ZL2= 120
##$ZL3= 120
##$ZL4= 120
##$ABSF1= 10
##$ABSF2= 0
##$ABSG= 5
##$ABSL= 3
##$ALPHA= 0
##$AQORDER= 0
##$ASSFAC= 0
##$ASSFACI= 0
##$ASSFACX= 0
##$ASSWID= 0
##$AUNMP= <proc_1d>
##$AZFE= 0.1
##$AZFW= 0.1
##$BCFW= 1
##$BC_mod= 2
##$BYTORDP= 1
##$COROFFS= 0
##$CY= 11.3945322036743
##$DATMOD= 1
##$DC= 2
##$DFILT= <>
##$DTYPP= 0
##$F1P= 15.6554695791079
##$F2P= 12.8336369535428
##$FCOR= 0.5
##$FTSIZE= 0
##$FT_mod= 4
##$GAMMA= 1
##$GB= 0.15
##$INTBC= 1
##$INTSCL= 1
##$ISEN= 128
##$LB= 0.24
##$LEV0= 0
##$LPBIN= 0
##$MAXI= 10000
##$MC2= 0
##$MEAN= 0
##$ME_mod= 0
##$MI= 1.114404
##$NCOEF= 0
##$NC_proc= 0
##$NLEV= 6
##$NOISF1= 3.799351
##$NOISF2= 2.8
##$NSP= 1
##$NTH_PI= 0
##$NZP= 0
##$OFFSET= 15.70392
##$PC= 1
##$PHC0= -26510.13
##$PHC1= 18.18743
##$PH_mod= 1
##$PKNL= yes
##$PPARMOD= 0
##$PSCAL= 0
##$PSIGN= 0
##$REVERSE= no
##$SF= 200.130013532006
##$SI= 16384
##$SIGF1= 3
##$SIGF2= 2
##$SINO= 400
##$SIOLD= 16384
##$SREGLST= <1H.CDCl3>
##$SSB= 0
##$STSI= 0
##$STSR= 0
##$SW_p= 3612.71676300578
##$SYMM= 0
##$S_DEV= 0
##$TDeff= 0
##$TDoff= 0
##$TI= <>
##$TILT= no
##$TM1= 0
##$TM2= 0
##$TOPLEV= 0
##$USERP1= <user>
##$USERP2= <user>
##$USERP3= <user>
##$USERP4= <user>
##$USERP5= <user>
##$WDW= 1
##$XDIM= 8192
##$YMAX_p= 0
##$YMIN_p= 0
$$ End of Bruker specific parameters
$$ ---------------------------------
##NTUPLES= NMR FID
##VAR_NAME=  TIME,          FID/REAL,        FID/IMAG
##SYMBOL=    X,             R,               I
##VAR_TYPE=  INDEPENDENT,   DEPENDENT,       DEPENDENT
##VAR_FORM=  AFFN,          ASDF,            ASDF
##VAR_DIM=   8192,          8192,            8192
##UNITS=     SECONDS,       ARBITRARY UNITS, ARBITRARY UNITS
##FACTOR=    0.0002076,     1,               1
##FIRST=     0,             0,               0
##LAST=      1.7004516,     0,               0
##MIN=       0,             -400830,         0
##MAX=       1.7004516,     349862,          0
$$ Real data points
##PAGE= N=1
##DATA TABLE= (X++(R..R)), XYDATA
0@%%%%Qj6J6j6K4l2M0n6P2q8J04j22J46j76K11k51K96l48M04m64N35o19P10q07
28d29R15j038J174j320J482j662J859k074K309k567K853l166L507l883M300m760
44b500N269n841O483p204Q024q970J0075j1380J2948j4881J7330k0547K4990l1566
58a7770M2414o4407J76040l69054p6143O58782k87579l24609K88549J22278k21736
69g3235M5389M0271J173M0276q4902m9004J97920m9955k13757J13786J75715j45971
81b294j16198J07195R1592j07876o9506J62624N0222k27057K8949K37748j27372
92B8027j95281J83946R9139j58161k2048N5164M300O3437o5074j02379J65496
103E6566M2268k16522P9814J74453j68881o8708J61668m0202q5943P3852o616
$$ y = [0, 0, 0, 0, 0, 8, -8, 8, -8, 16, -16, 24, -32, 40, -48, 56, -66, 80, -96, 115, -136, 160, -188, 216, -248, 287, -332, 378, -429, 486, -552, 622, -698, 784, -878, 981, -1093, 1216, -1351, 1502, -1664, 1843, -2040, 2260, -2500, 2769, -3072, 3411, -3793, 4231, -4739, 5336, -6044, 6904, -7977, 9353, -11194, 13796, -17770, 24644, -39763, 136277, -232777, -308920, 349862, 62283, -262326, 26223, 148501, -73235, -27846, 12425, 13598, 53874, -31028, -80032, 117888, 67933, -145824, -32038, 143677, -2294, -118492, -11297, 80295, -27581, -97087, 65537, 115759, -111298, -82349, 155399, 28027, -167254, 16692, 115831, -42330, -64378, -9214, -4914, 58523, -6551, -108930, 56566, 98834, -117688, -37874, 136579, -32302, -101010, 60658, 20456, -65487, 8365, 1749]
114A749j5610O8256p9244n6081J48594r843j39263Q2378O4657j12894J3837Q8653
126E5189n8158n1881O4946L8141n5509m2065N3776N0674m7269l6943L0588K499
138C988l460K0696l7477n355O9719n4868o0115J26566n81j54170Q8876J23512
150A17331j47453n6627J41309r235q3912M1065Q986l4799L8245J047l4131L5305
162A7131o096m1338M9804J3097o8865K2332O0007m1895m4278L7872K9226k8698
174a701j6854K8378Q301l6853o26M7362r917m9124K3289L3818l2539j2411K1012
187B135r5M877m420k3962J8065K1255k5941K14K3832k4306j3353L6959n418l4675
201b4833K4046J8786k9920N68J7558j1717L441J3642j5088r770J3807L120o597
$$ y = [1749, -13861, 54395, -24849, -80930, 67664, 57821, -81442, 936, 65593, -47301, -33464, 55189, -2969, -54850, 10096, 48237, -7272, -49337, 4439, 55113, 7844, -29099, 1489, 3988, 528, 21224, -16253, -21608, 48111, -6757, -66872, 59694, 59113, -95057, -6181, 117331, -30122, -86749, 54560, 45325, -38587, 2478, 11464, -23335, 14910, 15957, -18174, 17131, 11035, -30303, 19501, 32598, -36267, -13935, 46072, 4177, -40101, -2229, 26997, -1701, -18555, 9823, 18124, -18729, -19355, 28007, 18090, -31034, -7745, 26073, -6466, -18877, 2135, 2040, 6917, 2497, -21465, -3400, 17855, -8086, -7872, 15960, -8346, -21699, 15260, 9842, -24833, -787, 17999, -11921, -11353, 6205, -5512, -2071, 11571, -3517, -13287, 520, 3640, -2957]
214b957O820j477j6214J0564J7262j8785q312K1818n67j6256N466O462q490M880
228B14J2636j3755j2320J5075M594p435M160j874o364O138N046n775m422P787
242C705N481j0715m200Q846n23l156N673j147r678K146J0185l119l863M466n320
257a219l01Q703r629k469J5731q391j2280J3819R28j4049J0987J2126j8275o604
271a0923J8320k033j1631P568K632n614L63j769J212M960k595j947J673j178j638
286b600J383M563p78o734P52M246k140j977M324Q18o330K756N153q704K123J2021
302H876r929p073J0945k893o596R466J235r921K679O844n837q59P544l889l269
317b677M913m438j378P407k827m414M217L09m687J747P094j998p365M048M061
$$ y = [-2957, 3863, 2386, -13828, -3264, 13998, -4787, -13099, 8719, 8152, -8104, -2638, 3824, -4666, 214, 12850, -905, -13225, 1850, 6444, -991, 3169, 1295, -5069, 1069, 6115, 340, -4082, 3705, 9186, -1529, -5729, 3117, 2594, -562, 5111, 3964, -5714, -3568, 6617, 3498, -365, 4101, -1219, -1520, 7183, -2446, -4915, 10816, 2425, -9855, 3964, 4892, -9157, 1830, 13956, -4319, -10923, 7397, 5364, -6267, 1301, 3933, -1681, -1318, -3087, -1875, 3085, 490, -1457, 216, -962, -2600, -1217, 3346, 2568, -4166, -3414, 832, -1308, -3285, 1039, 1857, -4473, -1717, 3436, -5268, -3145, 8876, -1053, -8126, 2819, -74, -6670, 2796, 4031, -5890, -3211, 3633, -2204, -3063, 4481, 592, -2677, 2236, -2202, -3580, 3827, 1000, -3414, 803, 1112, -3575, -1828, 5266, 3268, -4097, -49, 4012]
332D012n706l98N258n46m070j91K248r24J250J919l291J803J550o752L604P393
348G159p771l465Q083j952p501N417O778o897l157O841k290m041M979K39k449
363b7O53j928m25K949O8k103R03K308l665k101O668o34n589L526J179n019J131
380b106M127j456k428K446j10l815L524K808m897J477K615m892k23M214o96k278
396a690J113J244k503M5L284j195o38J070k477L66K034j668L20J915j546k223
412b549J625L060k281j361L945j786l879L250J808k519p9J574q49j703J522J933
428A711j379L03J35j860J549L17j393J923K0k373R4J649K50j303J323J255l243
445a022o6K930j438o17J576j095j154N57J030j38l23J025j125q03J607j180J85
$$ y = [4012, -1694, -2092, 3166, 2620, -1450, -1641, 607, -317, 933, 2852, -439, 1364, 2914, -3838, -234, 7159, -612, -4077, 4006, 2054, -5447, -30, 6748, -149, -3306, 3535, 1245, -2796, 2183, 2422, -27, 626, -1302, -1727, 1222, 1290, -813, 90, 2398, -1267, -3368, 3300, 2666, -2923, 603, 1782, -3237, -2106, 2021, 565, -1863, 583, 473, -3342, 182, 2990, -1907, -430, 2185, -2707, -2930, 1284, 588, -1690, -577, 667, -1836, -1791, 1493, 298, -340, 730, -1747, -1381, 653, -1015, -695, 1220, -326, -2549, -924, 2136, -145, -1506, 2439, 653, -3226, 24, 1832, -687, -766, 808, -41, -1744, -222, 1711, 332, 635, 770, -1090, 459, 776, -617, 1306, 1326, -1047, -953, 696, 946, -357, 966, 2221, -1022, -1088, 1842, 404, -213, 1363, 268, -886, -329, 701, 563, 240, 1265, 140, -663, 944, -236, -51]
462e1K211k351j454K020m55l30J120Mj056k05J072n96l64J425r11o26L68j247
480a426J246R82j677J467M9k865J748K271j686j018P14K5l18J05n74N55K012k371
498g61j394L750j870k045N186j584m877L595J203k856J918M19k402K033Q41l448
514b292K391L026n225J026M833o064j146P172k891l409L491j496K8L034l497o05
530a624M974k739l882M736J15m239M132Q05n398L258J433l208M694j523o502O957
546A989K779q888K559N734n270o04M293l679r79M873k461p15K780n665J330Q414
562F490o866n014P859j075l484L797k566j136N363k892l125N172l073l776R394
577E068j287j1838O668P600q084k45L525k962L101k78n054N872N62q188O251N333
$$ y = [-51, 2160, -191, -1645, 375, -80, -410, 710, 714, -342, -547, 525, -71, -435, 990, 79, -547, -179, -1426, -180, 802, -875, 592, 641, -2224, -476, 1795, 109, -909, -195, -170, -488, -383, -957, -402, 1610, -761, -2155, 1595, -275, -2320, 2866, 1282, -3595, 0, 1203, -1653, 265, 684, -1718, 315, 1156, -2292, 99, 3125, -2100, -1074, 3759, -2305, -3451, 3721, 830, -2579, 912, -584, -556, 2478, -1019, -1624, 3350, 611, -3271, 1465, 1580, -2659, 1473, 2278, -3120, 138, 1571, -1637, 3057, 1534, -4968, 1989, 4768, -4120, -1561, 4173, -1097, -1701, 2592, -1087, -2066, 2807, 346, -369, 2411, -3254, -1924, 6490, -376, -5390, 2469, 1394, -2090, 1707, -859, -1995, 3368, 476, -2649, 2523, -550, -4326, 5068, 3781, -8057, -1389, 6211, -1873, -2118, 1407, -1555, 1546, 1268, -3786, 2086, 2648, -5540, 711, 6044]
593F044j0931j30J0384l769m445L067k512K985M814r888K06J1153p901n068J0913
608D922m423o858J0436o1r629M526M345l392J319j921l066P574j207q801P785
623A549L398j0698N163O871r295j79N994k452J838j167q576P973R887j3336n755
638h785J3667j042p775N696j139m389P022m74n914L250l02j231N398l268n845
653e131N960K189m644K923N37n877L580N116n116j592J415j327N739M14j1542
668g356L143J2372n003q978L996M721j587j772r04N94K145j288j856K674J20l085
684b064J777K468j605k331%L170J259m071j334K885R96l94q60j752M38L660Q94
701C136n616k177P006L293p366m278O689M215n542k526L812J33r72R02j008J99
$$ y = [6044, -4887, -5017, 5367, 1598, -2847, 220, -2292, 693, 5507, -4381, -4175, 6978, -923, -5991, 4922, 499, -6359, 4077, 4016, -5613, -1087, 3258, -134, 1185, -736, -3802, 3772, 2565, -6236, 1549, 4947, -5751, -588, 6283, -3012, -3191, 2803, 351, 2189, 1022, -7554, 419, 10306, -3030, -8785, 4882, 3840, -3935, 1761, 622, -3767, 3255, 2781, -3133, 117, -185, -1416, 3982, 714, -5131, 829, 3018, -1626, 1297, 1834, -4043, -463, 4653, -463, -2055, -640, -1967, 3772, 4186, -7356, -4213, 8159, 3156, -5822, -1826, 2895, 1308, -464, -1368, -774, 1371, 83, -1773, 901, 1021, -2064, -287, 2181, 576, -1755, -1755, 1415, 2674, -1397, -2731, 154, 1150, 756, -104, -1856, -1418, 2242, 3136, -2480, -4657, 2349, 5642, -1724, -6002, 687, 4902, -640, -3166, 646, 779, -193, 709, -299, -100]
717a00M89j986K279K276m808k035N524K160m063k543J328K842J812k713l577J479
733a636L076J801k536n962L483Q103n237o317N764J924l453J976j54k876K224
748A80P55j927K649p06n249M157N021n450k529L218Q52J305j899m423L955L582
764C491l985m36N46j783M288J431p588J661P181m817l041N071k515j267M851l949
780h61k169O109l415k789P071l005n883O529J495n067K111m44k365O465j593q601
796f412O622N101p998J810L605o645M017N529q732m64O974m026n30M167n486k27
812b695P264m408l670O157k720k955O757k551n460N195J93k222M017m349l269
827d716R163j162q453N391L038n936L183K316o559K922M751n696P75L585n317
$$ y = [-100, 389, -1597, 682, 2958, -1850, -3885, 1639, 3799, -264, -2807, -1479, 1363, 3175, 462, -3115, -1636, 1440, 3241, 705, -5257, -1774, 6329, 1092, -5225, 539, 2463, -990, 986, 832, -2044, 180, 935, -992, 1657, 951, -4298, -141, 4880, -570, -3099, 119, 971, 2276, 377, -4046, -91, 3491, -494, -930, -384, -2167, 2121, 3552, -4036, -2375, 4806, -11, -3052, 2019, -496, -1763, 3088, -861, -3030, 3079, -336, -3125, 3946, 941, -4942, 1587, 3082, -1985, 126, -318, -2683, 3782, 2189, -6412, 210, 5311, -2687, -877, 2728, -3917, 100, 5629, -3103, -3567, 3407, -619, -1149, 3018, -2468, -2695, 4569, 161, -3509, 2648, -72, -3027, 3730, 1179, -4281, 914, 1107, -1115, 2902, -1447, -4716, 4447, 3285, -5168, 223, 3261, -2675, 508, 2824, -3735, -813, 3938, -1758, -983, 2602, -2715]
842b715K104N270o685j013O413l247k377M102k119j785L992j385k369K973j268
857a09j180M035k688l601N419J86m507K751N97k486K741j97l146K829R09l029
873a476J967P95l569K309K624m204J94K861k257O59J871l657J101L477l421q42
889a568L246k130j009L272j531k293K491K34j265J574j372j402L393n34l103K266
905B69O45k113J656L34k154J258J169j406N41q3j218J827O73k898Q79K233k362
922g50j91K360j799o77K094r43p28J254r17j03J642j368j296K079J74j887J094
939C8O63j409P85O59j357O07O15j015M43K30q85P29N62j163J60Q32m44l28O50
958C72k07n01N60k29k74O05n54j21J015o87o32R72N6n73K79j7l42L25J78n38J43
$$ y = [-2715, -611, 4659, -2026, -3039, 3374, 127, -2250, 1852, -267, -2052, 1940, 555, -1814, 1159, -109, -1289, 2746, 58, -3543, 1876, 2062, -2445, 306, 903, -1583, 1158, 961, -2185, 644, 1553, -1476, 491, 1286, -2283, 26, 2650, -1554, -1360, 1501, -756, -97, 1774, -1883, -782, 2695, -726, -1568, 1678, -452, -1461, 1811, 280, -2013, 478, 712, -553, 1021, -351, -1753, 1640, 1106, -1997, 269, 914, -1199, 457, 791, -1363, -105, 1064, -342, 199, 116, -1102, 725, 1398, -1500, -621, 1612, -750, -941, 1419, -380, -1057, 1037, 94, -634, 620, -297, -400, 1242, -126, -1422, 657, 831, -1056, 38, 701, -708, 77, 736, -621, -14, 601, -414, 29, 259, -626, 103, 665, -498, -338, 494, 50, -278, 372, 165, -336, 224, -5, -279, 326, -228, -349, 666, -21, -653, 319, 375, -198, 81, 64, -278, 47, 225, -313, -170]
979a70M50m52j2M67m76P1N11m11j57K67j74kK31j30j88J32R5r1o2K18j58QJ64
1002A31j92o9N9R6Q2l35O8L55j24j95K15K5r4j10J56O6k44R0j1K2L1j86K09K20
1026B65l43M1J96j69o7J22L5j56q2J88O2k22J03J06q1Rm2P6K0j60J04K4j65P4
1050f2K0Q4K7k39K82k9j28R8ol7q5NJ38p0j58K62j34k7J59j30N0jlM9q3k6Mj7
1078e7R2n6j14J61l7o9J95j16l7J12j01PK4j02J00n9M5N9n2J06o2l9R4j24QQ3
1104F1j76J36k1r4J21mk3Q6j04P8l7j25J81j27P3n2J1N8p2o6J62j4r5J17r8k9
1130e3P7J2j0r8KO8M0j1j30P6N6p7k2J93o2j35J19m0k9m8J1J09pj21Q2J52m6j92
1158h4Q1J12j33J2L6r0L0l3N6J16k07j7K46q1j71J16M3l8l9O4k6j5J02j38Q3Q3
$$ y = [-170, 280, -172, -184, 283, -193, -122, 389, -22, -179, 88, -86, -88, 143, 13, -175, -43, 52, -39, -101, 117, -41, -33, 131, -61, -130, -71, 25, 107, -228, -160, 195, 71, -124, 91, 116, 22, -88, 68, 134, -110, -20, -31, -9, 22, -164, 45, 265, -78, -37, 159, -10, -77, 45, 80, -76, -158, 30, 92, -130, -27, 79, -2, 7, -35, 41, 61, -99, 5, 29, -136, -62, -42, 42, 69, -170, 112, 83, -45, 53, 47, 10, -75, -70, 68, -2, -160, 102, -32, -59, 100, -30, 20, 19, 16, 65, -18, -44, -40, -57, 35, -21, -135, 26, -11, -80, 115, -1, -38, 74, -27, -20, 4, -98, 2, -57, -12, 47, -5, 101, 39, 0, 94, -30, -22, 61, -115, 21, 0, -94, 27, 23, 0, 86, -18, 60, 23, -102, 79, -48, 25, -27, -16, 42, -30, -96, 66, 52, -43, 74, -24, -53, 24, 36, 26, -72, -70, -2, 38, 27, -103, -27, 29, -48, -70, 123, 61, -74, 45, 5, -24, -72, -61, 48, 41, -80, 2, 154, 108, -84, -3, 109, -24, -12, 24, -66, -36, -69, -13, 103, -104, -121, 125, 44, -127, -11, 32, -6, -45, 19, -7, -22, 80, -58, 25, 108]
1184A08j99J53J20k26p5J10O9r3p6N4N3j5K9o2R9o5j02J19N8k04J92O5j97P0J5
1209@%J54r6k56K57Ok7p8J3mj02K19k4j90J69k2pM9p8j22K58n8j91J25J6pO7k1
1237E0j16O6J53r8j27M7n5J25J13l06j3L89j73j46P7j0q6K15q1j42J49K5j83K22
1261I5N5l87K28J69k81J04J15k23J83Q7k84J5K48r9j14J30j85R5K12k51q7L68
1283A93j44j40K17j21j48L35j69k15K66l6k16K64N1k91J06K43k53N4K6k16L31
1304A37M3l74M3L23j12kJ2k04K09J63m00O1K45j95nK17k36o4K50j41o8K04j76
1327g0K6K75k63k04K74k2p4K28k37j13L30M5l89K43m9r3K42j78k12M51q4l96L40
1350G0L1k87K23Q8k87J59J24l06J91J12k92J42K55l35k3K55k31J07K19m16R4L66
$$ y = [108, -91, 62, 182, -44, -119, -9, 60, -33, -109, -55, -2, -17, 12, -50, 49, -16, -118, 1, 59, -145, 47, 112, -85, -15, 0, 0, 154, 58, -198, 59, 65, 38, -40, -27, -31, -133, 86, 62, -128, 41, 19, 12, 61, -17, -139, 119, 61, -130, -5, 11, 4, 71, 50, -66, 0, 153, 55, -72, -25, -80, 45, 158, -148, -161, 228, 55, -91, -14, -24, -110, 105, 24, -118, 31, 56, -127, 95, 150, -237, -9, 160, -121, -17, 98, -125, 58, 145, -139, -124, 124, 25, -89, 41, -144, -49, 163, -88, -175, 193, 49, -91, 126, 5, -143, 192, 23, -192, 74, 38, -178, 86, 137, -154, -48, 195, -58, -4, 22, -194, 137, 180, -194, -151, 172, 60, 58, 70, -134, 75, 238, -162, -101, 144, -51, -56, 161, -75, -139, 111, -30, -98, 106, -70, -44, 231, -32, -236, 38, 16, -58, 170, -67, -180, 150, 195, -194, 49, 0, -93, 149, -29, -241, 210, 126, -270, 70, 101, -186, 37, 125, -162, -3, 121, -185, 6, 118, -174, -32, 223, -112, -135, 120, -111, -4, 215, -201, -107, 259]
1372B59l38r9L59k50j9L30l73j68N96j50m81M85j34k11M56k45k75L91j7l16M88
1393B88j49m25K82K95m19lK07k80M35Pn89K83M05l59j23K82l29J35M30m92j52
1414b71N18k54j13K56k60j10M31j18k25K96j94j45M57j80l48K85L2n5J04k25j24
1435b43M90j3n41K52K31k55J09L6k87K18J69l57J37J73k31O7K39l29oK54j23l5
1457d5J41k13k2L24k07j10J93n9j9K96l62j26M04rl54R5R4rJ29k41j04L10Q0k46
1481f0O9pr2J58Q8k79qJ57j9J12n3k45J54K92k36j95J03K4R8J88k83k20L09P4
1505A29j61M2l9p6K81n5k10K3J56k8mk1j47J7K43o0k67J79J3J3N8j41j38K54j
1530F0j21oJ04j52J93J1j67K7K20j12j95J74j25L2L17k84k05L32l7j19Q9j4j84
$$ y = [259, -79, -178, 181, -69, -88, 242, -131, -299, 297, 147, -334, 151, 17, -194, 262, 17, -258, 133, 116, -200, 288, 139, -286, -4, 291, -128, -131, 76, -204, 231, 238, -351, -68, 337, -22, -145, 137, -192, -57, 373, -119, -271, 247, -7, -120, 136, -124, -234, 197, 79, -146, 150, -44, -189, 268, 88, -260, 25, 57, 2, 106, -119, -243, 247, 234, -307, -55, 176, -79, 30, 66, -221, -3, 166, -191, -54, 119, -112, -45, 194, -135, -141, 113, -10, -45, 96, -117, -139, 185, -22, -132, 61, 2, -17, 279, -83, -209, 195, 186, -168, -73, 21, 12, 141, -100, -204, 106, 186, -60, 9, 2, -90, 68, 156, -123, -131, 26, 7, 119, 66, -179, -25, 267, 31, -164, -61, -37, 61, 249, -34, -254, 55, 129, -32, 10, -29, -105, 176, 121, -89, -66, 90, 62, 58, 37, -110, -93, 150, 90, -177, 2, 15, 28, 86, -55, -193, 61, 60, -61, -67, 37, -115, 78, 89, -78, -51, 169, 57, -138, 36, -89, -57, 260, -24, -229, 103, 66, -53, 36, 22, -162]
1553a62L23nl05J13K05k02J20J6l75K58K47l44j8K26k35J34J92k24k04L76l2j97
1575i3O7p7j3L02r9l58K44J43k22K07r3k07J98J17k69J43J06j90Q3J26k09m8K81
1598A39j89l7J72k23P5K91k12j00J90j27P2J18j74j30K53j03j14J06Mn8J24j7
1620F0j62J71M8k45J11M7j59K22j8k33J52J17j46L3P5j31J4J43r9j0N2r7jK17
1644A61k29k9K21j17o0R6j28M6J23p7j25J21K5j34J77lk36K15O8j68P3P2j98J23
1668A7O4j77P4RJ2j0M8m9M8L0n1p8J48n7j11J74j04j13K39j04k4L9l4j8O4jl8
1695cN6j00m0J12m4k4J06n2q2L3J58j69j5J31Lj33N9J6k9M7o7M8p4J04%m3L1p5
1723d6L6J5m1LjK5O0p3K8L5p2J0L6l4m7J32p3J5m5N6l7N7%o1R3o4mK6J7n2k6m0
$$ y = [-162, 161, 156, -149, -36, 169, -33, 87, 103, -272, -14, 233, -111, -129, 97, -138, -4, 188, -36, -240, 136, 104, -93, -26, -103, -116, 186, 87, -271, -27, 116, -106, 101, 8, -199, -1, 116, -153, -10, 96, -94, -11, 115, -94, -142, 139, -50, -87, 85, -138, -63, 228, 16, -84, 106, -21, 51, 169, -5, -135, 118, 15, -99, 7, 11, -47, 77, 60, -102, 69, 117, -128, -17, 30, -129, 93, 75, -158, -6, 111, -35, -2, 73, -58, -44, 99, 0, -10, 42, -55, -56, 161, -68, -97, 124, 7, -53, 43, -85, -39, 84, 7, -118, 3, 28, -106, 71, 68, -168, 47, 115, -53, 20, 92, -106, 17, 81, -96, -22, -13, -1, -11, 37, -12, 36, 66, 15, -63, 85, 28, -83, 91, -13, -126, 113, 9, -15, 24, -10, -28, 36, 35, -3, 53, -47, -87, 25, -19, -43, 63, 11, -71, -38, 120, -49, -64, 67, 70, -63, -4, 12, -17, 30, -37, 11, -63, 41, 41, -2, 29, -46, -10, 5, -36, -33, -34, -9, 51, -22, 6, 41, -31, -21, 15, -19, -66, 66, -7, 8, -37, 19, -18, 39, 39, -22, 71, 7, 3, 29, 46, -6, -32, -72]
1755g2N7NMK2pj1O9r9L8k5K9l6kk0oK6Q0L3j11N5K6l7J7N5n0n5K5N2j01j3N2K1
1787B1q5J03k2N4Pj54J31m2J2l4Ol7J4j9J23r3R6Oj33M9J3l8MK4n1oJ21j01o3
1816i4J31M3j29J01j04k5J78m6j55J63k5j18O4M0n7M3j6p7J09K3j03M3O2j15M4
1841b0O9p0m3J39j04l6K63k35o8J68j48L6J81j38j18J41N2j87J03J23j29R7L2
1864A08k40Q9P4j25J09Oj24Q3J37j26j3J26j84K9R4r8j05K25n9j60J96j07l8K13
1888A10j44j24L27j08j10M4o2p4J82Nj73J24P8j32J12K4k33J15J97k69M6J94k36
1911a07J38J13l03K8K44q1j8Jj60J29K29k38k01L05l8r8J98j67j53K58L8k42J82
1934E7l6k10L82m3l53J24K00k27J46N2k95K19K73l92L1J50j53J4K33m08J79L28
$$ y = [-72, -15, -10, -6, 16, 9, -2, 67, -32, 6, -19, 10, -26, -28, -48, -54, -28, 52, 85, -26, 29, 55, 18, 35, 90, 40, -15, 10, 62, -39, -52, 0, 21, -64, 39, 17, 71, 78, -76, 55, 13, 25, -9, -3, -40, -26, -45, 78, -15, 81, 87, -46, 3, 16, -22, -18, 6, -45, -51, 70, -31, -94, 37, 80, -49, 52, -52, -77, 101, 55, -100, 63, 38, -80, -16, 24, -33, 10, -6, -83, 26, 49, -54, -11, 51, -64, -20, 49, -21, -64, 75, -29, -65, 198, -37, -105, 63, -85, -49, 132, -6, -124, 17, 69, -118, -15, 108, -21, 76, 108, -132, -43, 31, -94, 15, 21, -103, -20, 117, -9, -22, 104, -80, -51, 43, -55, -160, 65, 6, -154, 42, -65, -103, 110, -34, -158, 169, 61, -49, -5, -67, -141, 41, 46, -127, -3, 75, -57, 55, 79, -154, -39, 158, -111, -65, 129, -107, 31, 144, -159, -131, 113, 32, 14, 15, -145, -16, 213, -25, -226, 79, 41, -57, 141, -26, -179, 79, 117, -125, 57, 21, -189, 193, 150, -203, -79, 121, -106, 40, 92, -203, 16, 289, -103, -72, 78, -75, -61, 172, -236, -57, 271]
1956B71l24j59L48q7j54K73j24k13K28k2j96K44k5l35L71K04m21k1J73J2K1M3
1978A07l44J16M34l21k32K43N1p7K52l85n7M07q1k12Q3N0j41J98L2k80pK56j53
2001f1J11Q0l37J4M99j67l11m3K10J11R8l03j91M85O4l61m8K07q4O9J22l14R7
2024e3K76l54O7J91k52m0L84j87k01J85m6QK34l13k47M67J68n41J16J62m5J99
2046A78l9m76M16K49m33k4J96j20R4J29l78N7L32k08NK04l83L6M32k26k94L24
2068G1j52L5L92m96k79O44O4l67N5j66M9N83l64n44M15K90l63L08p5m75M76K20
2090C21n49J89J70m00L48L34p61N6O33l86j03L10m70J30P43n88l99N96j24k44
2110a94N58n48k25P76j33o75N74L4n02O45j1q38N21M85q22L49L63p74M40M96q04
$$ y = [271, -53, -212, 136, 49, -105, 168, 44, -169, 59, 37, -159, 85, 60, -275, 96, 300, -121, -142, 31, 43, 64, 107, -237, -121, 313, -8, -240, 3, 54, -23, 229, -156, -213, 194, 113, -99, -16, 34, -107, 91, 123, -157, -164, 92, -61, 50, 130, -207, -193, 306, 139, -172, -215, -5, 106, 204, -99, -290, 195, 259, -102, -150, 57, -27, 42, 164, -150, -53, 223, -131, -64, 127, -125, -165, 219, 32, -169, 16, -30, -22, 212, -101, -348, 119, 287, -254, -138, 24, -21, 178, 139, -337, 79, 328, -105, -129, 67, -53, 41, 170, -208, -151, 181, -27, -22, 182, -201, -165, 267, 41, -253, 71, -81, -46, 346, -150, -429, 215, 279, -88, -33, -199, -150, 433, 69, -475, -60, 230, -133, 175, 100, -375, 101, 321, -228, -39, 131, -269, 79, 413, -348, -292, 341, -45, -148, 162, -308, -178, 565, -23, -422, 174, 50, -194, 364, -184, -409, 367, 234, -441, 133, 167, -335, 310, 299, -539, -18, 467, -355, -6, 357, -417, 23, 519, -285]
2131b85O4O78n86O2M29o95J5R21n86m93Q47l60k69O73m23n89R75m8p54N73p6m74
2153d01O83O1r12N69L80n97K46K85p85M00N64p32j08N47m44K05N06p76k5P35l40
2174F1k50M25m27r7O59l12m95M85L9k68M20j83n18P01M9n88L69K1l19M14L5n58
2196c37K76L36m56K29J66l57K07K61m96oM33l86J45K77m59k6M99l23j89L09j60
2217e7l7L48l47k26M51P5l95K85n4k91M39j04l97L68L1l16M04p1l64K92J88l63
2239a41O1J49j40J36J88m27NM34k79n3J59k51O9L56k34k36L36r6k16L04r2k48
2261b16L50N2k99J09J13k67J77J57m43K50J98k32R0R5k13K8J95j94o3K31j26q9
2283i7K35j26k20L96j30k18K04O9j86J50m5j78Q2J60j81Q3PK0j4Q4j42j1J09q
$$ y = [-285, -221, 457, -129, -67, 362, -333, -318, 603, 17, -476, 371, 11, -258, 415, -8, -597, 378, 330, -424, 149, 73, -401, 282, 343, -569, 0, 380, -217, 29, 314, -471, -71, 493, -239, -347, 200, -244, -39, 467, -309, -334, 401, 61, -189, 236, -191, -288, 371, 59, -436, 49, 88, -180, 240, 57, -461, 240, 289, -299, 70, 91, -228, 186, 221, -337, -61, 275, -181, 48, 214, -143, 64, 325, -171, -177, 256, -130, 15, 292, -167, -193, 306, -17, -206, 103, -57, -94, 254, -93, -319, 132, 207, -188, 97, 43, -248, 191, 87, -310, 58, 89, -227, 177, 106, -258, 34, 222, -141, -80, 69, -71, 65, 253, -174, -169, 265, -14, -67, 92, -159, -90, 266, 32, -204, 132, 36, -180, 124, 32, -216, 134, 186, -113, -4, 109, -158, 19, 176, -267, -17, 181, -51, 39, 134, -79, -51, 144, -50, -113, 118, -8, -97, 138, 12, -208, 188, 58, -160, 44, 113, -73, 77, 32, -146, -64, 96, -85, -2, 5, 25, 11, 95, -47, -58, 51, 43]
2307D3j13P4k6j03K69j74n9Q4K5n8O0Oj55Q2J79j56K1P3j35K8M3n5LLK5O3Ln7
2335go0J10nj13J5Q3j15Q7N3p1M3J23j86K9K7o9O0k4l7Q2J7n6J8L0j7l6N6m3J4
2364HO3j25N0J8n8M0J06j93P3j0RM0P3j52L3M7n9p6Q8om0J02L2j20J44l4j05N6
2392Dl4n4L4L9l1L7J7l9kP0qk2J6k7J7r6P5nM0o1kJ12j16N7l1L5nJ5m0m0%L4p8
2425h9J1O5Oj4N5k4JN8o2L8p5K5%J8Mo2N3Q8j31K6%k7Q1l1n2J6J5n2O6Qk4JL4
2458B6J0r2Q3l2o5M9O7o5K1J1o4P7r3P9Jj8j8Q4l7m5L8J2q3P6k2n5J08j10K3L9
2488EK8q4P8p2K9R5m2n9N0qn5J1L7kn3N8K4r6J57j11o0J06j6p4R6p1n3J05ml3
2518a4j3M3j28J50Kr1j5J04m9m0P1k5K4N4j48K9P0k3l0OJ1n9J05N3j39J19J2j08
$$ y = [43, -70, 4, -22, -125, 144, -30, -89, -5, 20, -38, 22, 28, -127, -45, 134, -22, -1, 72, -63, -35, 8, -47, -44, -41, -16, 47, 50, -7, -67, 43, 38, -75, -60, 23, -92, -5, 48, -23, 20, 143, -43, -14, 13, -56, 4, -20, -57, 25, 42, -14, 4, 34, 17, -19, 37, -6, 8, 71, -54, -4, 14, -44, -4, 102, -91, -18, -28, -19, 21, 94, -58, -25, 22, -37, -113, -25, -31, -71, 31, 63, -57, 87, 53, -52, 4, -30, -84, -50, -11, -42, -5, 12, -27, -29, 41, 33, 11, 27, 0, 17, -79, -4, -9, 31, -30, -32, 80, -36, 21, -10, 25, 20, 35, -5, -45, -45, -11, -89, -78, -13, -7, -21, 34, 10, 11, 69, 7, 45, -30, -5, -5, 13, 17, -45, 8, 96, -35, -9, -9, -36, 45, 14, -38, -22, -7, -59, 7, 15, -9, -8, 26, 36, -56, 27, -5, -70, -21, 46, -19, 2, 13, -51, 26, -67, 12, 13, -5, -23, 61, 24, -21, 17, 29, -54, 22, 0, -55, 53, -57, -34, 5, 33, -51, 27, -45, -16, 79, 37, -22, 28, 20, -35, -24, 13, 11, -42, 16, 40, -56, 101, -10, -70, 36, 20, -54, 42, -29, -82, 23, 19, -14, -27, 16, -112, 38, 40, -51, -66, 38, -11, -51, 20, -5, 19, 73, -75, -46, 24, 1, -29, -23, -12, -71, 34, 87, -52, 67, 79, -29]
2546b9R8lj85J03N9j25K5M6p1J50Qr7p8J72j05L2J25k09N0P2q9q9K62r0j14J98
2572A16l2k65K35J9j26P1J6k05J94P9j94N0J65j07N6K0k37O8L43l45j00K67k14
2595a26Q0J11j28j11L08l8j83J86m5k42L18N3l62J43R0j41J93j5k45J94J79l21
2617a02KK27k08P3J42l14K4M08k80j37L73k73M3K45k56j52K51n4j25K26j03j79
2639a69L22qk78J55K4j84L59r7l92L11J86l34N6jn3J90J44m57J80K58k34KJ29
2662A09k38n5L76k45m0K52k76JL62k95k63M18M7l47L50k19j42L90l7m63K10L14
2684B09k95K52q4l41L49J87n14K04J97l36J34K37m50J38M09l99QL17m06K5M35
2705B76k75l22M10j0k82M38k36k88N32J9n88K89K07l56L37j0m37L01K93m53JL35
$$ y = [-29, 69, 66, -119, -16, 43, -82, -57, -11, -82, 68, 76, -21, -99, 73, -32, 0, 125, -84, -34, 38, -51, -140, 122, 32, -82, 116, 84, -181, 54, 73, -53, 18, 34, -171, 23, 102, -92, -42, 123, 16, 72, 92, -145, -77, 266, -79, -179, 88, -126, -46, 65, -63, -174, 134, 96, -87, 99, 54, -188, 130, 183, -179, -36, 54, -87, 106, 91, -154, 40, 219, -102, -100, 127, -81, -8, 134, -180, -156, 252, -28, -165, 208, -65, -22, 223, -33, -185, 66, 12, -113, 113, 10, -169, 153, 145, -133, 22, 46, -138, 221, 124, -268, 43, 229, -105, -49, -50, -103, 87, 231, -226, -46, 212, -22, -20, 109, -129, -184, 192, -53, -93, 159, -117, -116, 246, -49, -312, 106, 153, -194, 156, -63, -205, 185, 148, -315, -105, 209, -86, 166, 82, -259, 90, 277, -237, -33, 164, -172, -38, 199, -251, -113, 296, -103, -95, 222, -184, -159, 276, 1, -321, 89, 79, -203, 235, -1, -289, 243, 262, -326, -37, 170, -186, 151, 141, -296, 5, 298, -155, -154, 181]
2727A81l30J43L54m90p5M06k13n6K51k45p6N02k38l89L26L9j58K24p9l96M32J27
2749B40l33j4J09j48K97k8l22J76J17j05k2j1n7L1L13j52k71K15p1RK16k51j38
2772b00L14L6k20J32r0JJ78j01j75N6J88m2j00L1r0Q7P9j00m5J53m6j9L2j89Q9
2797d1J76m6j48j8L1P7J33j44j52J87m2Kjp6J7K67j56k00J06P1J9m8r5n6J52R5
2823A10r6j72J60KK1J81l14K1K05o4j10Q4j50O8J96q0j69K6J40n2J5K7k23K14
2847D0J81k95M3J20j52R7J44l10j4K26k6n6K7r6m7L32j14k86K21R3j58N7K0j64
2871a17K10J50l67P2K31k88J62Q2k52M1K04j10j55K83k17PK28j86k07L53q2k23
2893a81K06mj63K57k4l21K04K39k57N8M9k18Q0K64l28J7K68k50P8J95k19q2K31
$$ y = [181, -149, -6, 348, -142, -217, 189, -24, -80, 171, -74, -150, 352, 114, -275, 51, 90, -68, 156, 77, -319, 113, 240, -93, -107, 2, -146, 151, 123, -199, -23, 94, -11, -33, -44, -101, -70, 243, 91, -180, 35, -36, -27, 189, -62, -200, 114, 150, -70, 62, -28, -27, 151, 50, -125, -69, 119, 77, -23, 8, -82, 5, 84, -16, -61, 92, 46, 27, 59, -130, -41, 135, 89, -59, -77, -46, 31, 164, 20, -132, 55, 13, 15, 14, -62, -45, 222, 66, -134, -28, 43, 62, 14, -81, -137, 15, 110, 14, -158, 2, 4, 25, 206, -108, -87, 118, 54, -56, 28, -122, -54, 142, 62, -107, -81, 59, 7, 22, 49, -174, 40, 221, -74, -31, 89, -63, 34, 178, -132, -146, 80, 54, -2, 25, -71, -118, 214, 100, -186, 35, 128, -30, 27, 47, -117, 93, 243, -124, -52, 179, -109, 53, 135, -117, -76, 128, 18, -137, 146, -71, -64, 164, -22, -229, 124, 42, -181, 25, 21, -142, 115, 91, -230, -26, 213, -44, 14, 63, -155, -75, 189, -139, -122, 146, -104, -26, 169, -50, -132, 99]
2916I9r4r7J11n4p0J89k6k41K01Jj20J29j0j36K53n7k00J83l3j19J05N0j42J1
2940f7J12p7M3nj07J04J08j59PJ17j85J11M4q7m3J55j42N4Kk6rQ2Mr6R5n2m9M5
2968b1P8j68J00P9j11N0K0j74J77q1m0O2J03q8m3J16j00mJ10p4m0R5l6n6J31j57
2994g2N0M0j0o9J01l5m9Q1m9n7P7Q8j33O6K0j78J56m8m2N4L6n9J03Nj01j0N1k0
3022dn2R2K1j68J37j3j7N2m3k4L8k2m0P2l8m3N5loj3P2p3qM4K0n4K5K9m1k2M3
3053A6n9P2M5r3L8Nl1L1n8l6O2j2oj0P3l5j5L7j6rJ1pj0N8oq3M0l3L4K3K6m3k7
3086a8lm2M4J5J0lL0j7jk0K8j8n8N6N6j25M8RM8p1n6J35n2n5M6L1K5K6n9J0K2
3117D1o6oL2J1l9K8k7j6m3J18k2j1J3n6M4M8p8QK4j0K5m5K8L3L3m4mn7O2l9L1
$$ y = [99, 5, -92, 19, -35, -105, 84, 58, -183, 18, 19, -101, 28, 18, -118, 135, 78, -122, 61, 28, -91, 14, 64, -78, -67, 45, -32, 11, 6, -101, 3, 111, -48, -41, 76, -109, 2, 46, -41, -84, 71, -71, -17, -15, -41, -50, 32, 36, -60, 35, -17, -66, -21, 57, -111, -11, 68, -43, 7, 27, -147, 30, -51, -91, -29, 74, -14, -57, 59, -41, -45, 65, -9, -49, 46, 10, -46, 85, -72, -22, 18, 8, -61, 40, 5, -44, 37, -12, -69, 8, 96, -37, 29, 49, -129, 27, -21, -63, -9, 27, -32, 71, 76, -25, -35, 16, -4, -56, 36, 57, -111, 26, 13, -4, 48, 5, -19, 19, -3, -43, 29, -9, -52, 3, 0, -6, -19, 53, -20, -28, 16, 36, -18, 7, 36, -5, -27, 16, -43, 29, 74, -19, 19, 24, -7, 24, -34, -70, -8, -20, -26, -36, 37, 2, -13, 24, 8, -1, 10, 3, -7, 51, 45, -38, 2, -31, 3, 26, 52, 9, -18, -21, -63, -19, -4, 6, 3, 33, 16, 15, -5, 23, 5, -53, 3, 59, -66, -18, -9, 39, -32, -88, 47, -5, -60, -14, 17, 42, 68, 9, 19, 41, -25, -31, 1, 12, -27, 1, -26, -42, -85, 33, 11, 0, 13, -43, 1, 49, -29, -21, 3, -7, 18, -27, 1, 34, 67, 23, 19, -38, 24, -15, 16]
3148A6m5L8P2l2p0m0O5L1N4j11L3RJ2KQl4k4NO7p7M0j7L8K1j6p9j6L6qmL1nJ5
3181A5k2j8K3J8L6j34J27p3oJ09m3p7L4n9N9K0Rk2P2m0m4L0O6o7l3O8q5j6M3n7
3211f7mJ12j16J1J6N3m4N6J2K4%q3k6K0J9o0Q3j4k5L5K1o6J06j01k2O4M2q6J01
3240F1K2q5j3LN9l6N1j46%J45n8n1J11j24j0J82j09lmJ4j5k6o0LR3K0r1M4N4m9
3270a8K9J5m5j2N6n9O3rM1Kn4l3j4J05p5j1M8k6l5J06n0j10J27Jp8L6Q9j70J23
3299D2M3j29R5pr0J1J4j9J6P2j6k9K6o3J0R7q4p8J17K4q7N1N0j97J44O7j36L5
3327b1P9k3j0L9j55L9J92j47k3N9j06O5J53k01rJ55n5o3J5M0j19J34L8j43O1Q5
3353G9l4L5J4j86P3J70j47n8O3m3L5M2p2l4R9q2J5J23j06o4J14L7j36M5lj0R0
$$ y = [16, -29, 9, 81, 49, -21, -61, 4, 35, 89, -22, 11, 20, 32, 34, 42, 8, -16, -11, 56, -21, 19, 2, 40, 61, 45, -34, -50, -14, -22, -26, 5, 0, 15, -7, -25, -2, 16, 52, -82, 45, -28, -34, 75, 32, -45, -11, -70, -11, 9, 18, -4, 68, 28, -16, 14, 80, 13, -20, 48, -37, -53, -10, -67, -71, 41, -75, -64, -48, 5, -39, 17, 29, 53, 53, -30, -56, -36, -17, -77, 6, -8, -33, 2, 23, -43, 63, -38, -60, 4, 46, -40, 61, 83, -2, -15, -12, 47, 11, 62, -84, -84, 61, 3, -48, 63, -61, -71, 111, 2, -1, -5, 9, -6, -32, -92, -89, 4, 24, -67, -23, 31, -18, 11, 26, -19, -31, 25, -34, 29, 20, 61, 63, 9, -24, -38, 67, -8, -19, 29, 3, -32, 74, 24, -86, 41, 42, -36, 0, 89, -81, 42, 85, -44, 51, 44, -46, -35, -21, -40, -24, 48, 32, 3, 29, -34, -24, 73, -11, -89, 28, 52, -35, 16, 66, -131, 13, 80, -56, -21, 58, 35, 25, 64, -91, -52, 140, -7, -30, 29, -77, -12, 141, -60, -69, 86, 31, -32, -17, 23, -96, 38, 76, -67, -6, 79, 45, 80, 94, -92, -19, 151, 4, -54, 9, -34, 1, 43, -29, -63, 36, -46, -31, 92, -14, -78, 36, 73, -63, -18, -21, -31, 59]
3380E9j0r1J48m9j19L8R0j12R3Q7k26M1Q8n5l4R5m1l1J9m5j8J00o6K7P5p2j01
3407a10K03o9j05J33r5L7P8k6j64J98m9j02J08l7j15K03o6j68J46J14j61rJ64
3430A08j77J4J37j56lQ6p2L0J22j21p5J96j01m0J44n5j48J44k1j12J68r4r0J37
3454B1J5j54J17R3j76O7O5j35J25j9j03N7R3q6m6K12k15OK03j73o9J84o2m1Q0
3479E9m1q3R9N9j29lQ3j09J49m5j16J11mn7P7j5j01Q5N4q9l4O1l8K2J3Kj6M7p
3508C4q9P5J0k0N7k0j15J38l9K1k1o3j3J4J03j05N1JJ4m3J32j43N1M4j31M2k1
3535c6N0K0k2o4mJ21jpPj25M9R3r3j04J30j9K8K4l7k0mK5m1kQ0j03O9o2j9M3J28
3566A04r3RJ0o6L6P6j42K6P7q1N8P1r3QN8n8kk0O6J6ql5q8O7L6p5m1R2JMkl2K0
$$ y = [59, 49, -42, 106, 57, -62, -24, 66, -46, 47, 134, -92, -51, 37, -18, -52, 43, 2, -29, -10, -55, -73, 27, -39, -12, 63, -9, -110, 93, 24, -81, 52, -43, -6, 72, 46, -118, 80, 31, -71, 37, 0, -115, 88, 22, -146, 0, 114, -47, -56, 108, -69, -55, 82, -74, -77, 9, -63, -33, 89, -32, -107, 89, -12, -52, 92, 37, -111, 33, 12, -100, 68, -26, -116, 21, 36, -118, -1, 92, -84, -17, 48, -87, 38, 19, -84, -27, 66, -20, -66, 146, -69, -63, 140, -33, -102, 82, 20, -21, 59, 18, -65, 34, 93, -36, -39, 44, -65, 84, 39, -77, 34, 30, -27, 50, 35, -66, 19, 73, -16, -50, 11, -27, -5, 8, 10, -6, 41, 34, -55, 20, 30, 10, 67, 47, -68, 70, 31, 52, 31, -32, -45, -31, 72, -33, 18, 19, 33, -10, 122, -21, 30, 74, -57, -15, -36, 14, 34, 12, -52, -56, 65, 64, 57, 64, -61, -12, 81, -12, -116, 14, -5, 23, 47, 10, -10, -14, 11, -30, -32, 48, -55, 14, -48, -67, -24, 104, 11, 20, 30, -36, 0, 76, -66, -40, 37, -44, 14, 85, -8, 0, 58, 0, -2, -22, 44, 60, 52, 17, -71, -4, 32, -43, -84, 8, 9, 13, 11, -21, -1]
3599aP3j32Q7j3m7K9QP1n6No1L5P1j46M4N6m0K0m8J5mj1P5k8l1mL1O2k7k4p1N7
3631ej8OlJ7p2Q3K2p6Q1L2l1p6Q8p9QrMK4O0n8ql4K7K7m4M5l3P1r0J6Pk6J7K4
3665cN5n0Ok8j3M6o5M3k6LL5l2k9PN4O5j10R4n5k6N5J9o3l7P5m7P3l3k5rK1j5
3697a5J6mk7M3RL3j2m2l5J8Kj5kM5M5l5rk8k9O5m0j6qN0o0M7J0Qjoo8M9Rj4L7
3732B0m6j9K7J0o5Q4m4LMk6O6k8M3j3r2J34m5l4PJ9m0M2jn8K8N2j00R3pj2N8l1
3764B9p7L2j8K2J1l1K3kOJ5J7m9J01p2M0m4J2l0M0k7J8J6l0jK9%r0O0j7N8q9K5
3796b3LN9n0j7j6J39p1q7O2o4P1J5l5J4QL1q4J3L6M2m7K1L5q3J6n1L4j2N3n7N8
3827A3n5O8k3m1M1K4m0NQ%l1K6L9q2K3L3p5L4J8K6k7N8j36Q7N6o7L8p9L8Pj6K5
$$ y = [-1, 72, -60, 27, 14, -33, -4, 4, 75, 19, 24, -37, -2, 69, -77, -33, 23, -17, 3, -45, -30, -34, -45, 30, 2, -29, -33, -2, 60, 33, 9, -62, -5, -23, -17, -20, -3, -75, 8, 30, -46, 35, 67, 36, -40, 48, -31, -23, -32, -28, -4, 56, -2, -10, -44, -17, 10, -34, 11, -22, 49, -41, -25, -18, -44, -27, -3, 52, 2, 8, -20, -33, 13, -52, -9, -35, -32, 3, -29, -58, -51, 3, 68, -42, 52, -3, -29, 26, 45, -18, -55, 20, -27, 46, 13, -12, -21, 0, -15, 1, -3, -30, 13, 22, 55, 43, 1, -34, -16, -14, -29, -31, 14, 59, 24, 15, -13, -42, 23, -17, -33, -41, 9, -51, -4, 6, 14, 13, 7, -61, -12, -3, -17, 20, -26, -45, -18, -8, -73, 11, -33, -30, -26, -52, 14, -14, 29, 16, -76, 58, 13, -21, -14, 5, -35, 7, 6, -52, -24, 28, -72, 21, 14, 2, 60, 29, -48, -16, -34, -12, -1, -32, -9, -11, -5, 10, 27, -22, 79, 7, 47, 3, 15, -15, 25, -2, 16, 32, 2, 1, 30, 30, -60, 0, -17, 41, -48, -23, -20, 39, -11, -28, -44, 95, 24, -63, -1, -65, 6, 21, -14, 0, 8, 39, -45, -32, 4, 46, -1, 20, 55, -28, -12, -63, -29, -41, 12, -45, 13, -42, 26, 3, -38, 3, 27, -13, -8, 0, 0, -31, -5, 34, -48, -25, 8, -67, -33, -15, 11, -16, 42, -94, -7, 49, -18, 20, -59, -21, -14, -30, -5]
3859eK3j6m0N4j12R3M0k3n3M0m1M8l4k0J0K3QN9k9N1o7m3M2Nn8J14j12L2m5L6
3889b0L5M8r2n3M6J31j54M7J5O6p2k8M9j4l9L6P2q6L6o4O1l8k1Q1m8k7R8o5M2
3918D2q4J09l5j09R3o7J02k4l0lK5k5L0j1m2J4L3Ln9K0n3P1kn4O2K6l5M4n2nK8
3949A2Mm6N0m8Jk8P2k2LKJ1N1p6Q6m2o9J35j07k8M9Nk0jK8mp3R4q2N3ro2R8j0
3982B7m6L1N3n2l0ml8M2k7O6l2KJ8l6J9mn8P1K9nn5J8L1l2O4q5K1M3m7k4O0m8
4014b8K5J6QOm0J9L8m6j4kL7j3m2R6q3L5l0PqN9k0o3O1m0L2J3L7j36M7N4J2n1
4046a4Q5j15O1L1j20M6J4pM3oj3k8N3n4qP4k5n4N9k5n1N1JMrj9oj3Q6n3M1k6O
4079IL4q7K8n0O7l6jL3N9o4J3jOK5K0L3p9K5m6l7k1O4L6n1P2j19R6q8N4M2n6J
$$ y = [-5, 18, 2, -38, 16, -96, -3, 37, 14, -39, 1, -40, 8, -26, -46, -36, -13, -5, 54, 25, 76, 9, -34, 8, 13, -45, 69, -43, -11, -56, -20, 15, 63, -29, -82, -36, 95, -59, -12, 3, 69, -3, -31, 18, 4, -35, 1, 73, -13, 23, -41, 20, -18, -39, 42, -6, -33, 65, 0, 42, -42, 67, 32, -77, 16, -51, 51, 27, -3, -6, 19, -6, 24, 13, -29, -15, 18, 21, -38, -18, -71, 0, -2, -56, 6, 32, -3, 41, -11, -16, 12, 16, -30, 20, -28, -27, -55, 17, -5, -2, 0, 11, 62, -14, 72, 30, -39, 96, -11, -39, 10, 15, -5, -6, 22, 18, -55, 39, -43, 10, 1, -61, 37, 27, -19, 12, 65, 13, -17, -21, -59, -17, -44, 22, -10, -8, 10, -26, -7, -11, -69, 2, 31, 26, -29, -11, 20, -12, 52, -33, -12, 31, -16, -40, 20, -28, -3, 13, 21, 27, -13, 6, 44, -2, -16, -18, 19, 6, -36, 60, -23, 12, -18, -11, -19, 40, 20, -43, 18, -22, 10, 23, 60, -76, -29, 25, 37, -14, 71, -44, 17, 48, -72, -26, -12, -19, 24, 18, 5, -23, 30, -24, -32, 42, 17, -37, 22, -3, -54, -3, -2, 2, -7, -26, -32, -45, 41, -12, 29, 3, 9, 43, -44, -16, -66, 1, -35, -36, -3, 56, -8, 5, 4, 10, 35, 55, 88, 9, 34, -12, -49, -70, -6, 30, -21, 51, -68, 28, -60, -6, 36, -20, -19]
4111a9k7J4J4N5j03O1pK4M8o6L8m9O3l7n0M4l8L1O7p8l4O0n1M3k1pK5J11m4j33
4141f6Q8Qp6M2K1m8J7MM1qrl6j0n9N1MP2m7k2K2lk2M3K0j00P0J2n4J8P3q7J04
4173F3k5o6J7M4m3m2N7L1j27J48m0o4L6Jj2R0p3m8M0L1k6L7j3p9M1P5o2j%l2Q
4204c4L2n6M8Q0j08N4jQoL7p8K7M2j5m2O0l4j0L4m5rN0Jj39N9Q9m8j7Q8n0Kj0
4236Il5N8mn8j5J36j00kK5k2j6m5P1J4J0%j6N2m0j30J12M3Pm8N8m5J4k1o7P0L8
4267E3o4N8qp4O4Lo0k9L8K7j0K0p4j5J33k5p4J12p7L2m8M0p4oJ13m7kL6r4K2O0
4298C0o6P5j%r4N0nJ3pN8n2j2Qm8J09k4o4R1q3QJ4j8lL6pn3M0P1j02L9j2%M7J6
4332E4l2n5M3L4p1J17j08K4Jq0L5N8q6P8K4Lp2M7M2j11Q8n6Pk1L9m1M6rK6ro2
$$ y = [-19, -46, -32, -18, 37, -66, -5, -12, 12, 60, -6, 32, -17, 46, 9, -41, 3, -35, -4, 63, -15, -49, 11, -40, 3, -18, -25, 0, 111, 67, -66, 22, 30, -46, -4, 17, -31, -14, -10, 31, 23, 14, -22, -32, -91, -40, -36, 36, -11, -33, -11, -14, -36, 7, 27, -73, -3, 9, -45, -27, 46, -41, 63, 38, -28, -11, 33, -10, -52, 5, 36, -91, 57, 17, -47, -11, -10, -22, 68, -5, -53, -13, 18, -8, 29, 16, -63, -22, 53, -9, -10, -10, -42, -34, -2, -58, -10, 70, -38, 16, 15, 23, 17, 54, -24, 3, 45, 30, -12, 48, 14, 4, 38, -7, -16, 34, 35, -104, -45, 44, -4, -21, 67, 17, 19, 9, -26, 32, 28, -30, -45, 91, -9, -11, 14, -8, -24, -69, 2, 16, 26, 26, 10, 62, 22, -108, 4, 47, 54, 6, 64, 19, 33, 12, -55, 15, 53, -11, 47, 39, -35, 29, 32, -28, -57, -19, 8, -2, 18, -56, -71, 62, 37, -37, 75, -2, 30, -18, 22, -52, -58, 55, 8, 6, 42, -52, -30, 30, -36, 39, 38, 38, -56, -6, -11, 2, -5, 53, 1, -11, -3, -51, 58, 34, -30, 61, -22, -14, 0, -18, -21, 15, 8, -45, -5, 66, -36, 3, -9, -9, 38, 54, 22, -33, 10, 44, -27, 90, -18, 6, 7, -73, -38, 20, -66, 12, 36, 39, -33, 14, 56, -55, 33, -23, -16, -37, 2, -39, 7, -2, 24, 15, -47]
4363d7M2Qj2N1k0Pk2RL2j48R1J3m0j8J27l7l3p2R0n5lJ17r2L1j0J0rM4q8J8Nm4
4395e5Q8j0oK4m5Jj0qN1l3k6J4oK0L7q1N3o4KMJ6K7M5k8J8r9L2L1k0P6m7o3M7
4428a5J5j7R1n5K9l4o2Q0j01N5L5p9P0N3j5q1Q0l5m2pQ8n4m3L8O1r3M5nNk7%K6
4460Fl0Q8j03N2J7n4Qpk4J4J6MJ0m3NKJ42j97Q5J9l8P5l1L6l5n1Q5j7m3Q9j87
4491a07R4j3k4O1m3K3l4O2l8j7PO3L4p9Pl2O8l7kM3l9l9L5k9j6P4k6J0K2m6Pk
4523a3OK5o4J03l0K5m9L1k7k7J3n3O6qNJ1J0k7n7Q6l8O2l5j4K3J2o0pM9n6J1O9
4555D2r2J3O2J0m4J0L6p0rnP5n0L3m5J02r3K6L5q6P3J6p3K6K3P7r1j1J1k7J6P7
4586F7np2nj8M9k3K6m5L5lk9R4n2m1L0Jk8M0O5j09J0N0l5k5Q8r3On0N9Nj4m3K6
$$ y = [-47, -5, 3, -9, 42, 22, 29, 7, 16, 48, -100, -9, 4, -36, -54, 73, 36, 3, -69, 21, -34, -37, 80, -12, 19, 9, 19, 10, 54, -34, -16, -11, -55, 33, 23, 17, 41, -4, -3, -13, -21, 30, -3, -29, -15, -21, -1, 36, -45, 8, -56, -54, -50, -34, -7, 38, 10, 28, -71, -39, -8, -28, 48, 1, -62, -15, 0, -17, 74, 19, 48, 14, -48, 32, -69, -14, 21, -58, 12, 65, 50, -31, 49, 14, -28, -35, 53, -1, -44, -6, 55, -38, 7, 2, 7, -20, -20, 6, -24, 64, -39, 13, 30, -24, -16, -23, -47, -33, -17, -13, -3, -46, -41, -39, 103, -94, -9, 10, -28, 47, 16, 52, 17, -34, 51, 34, -9, 80, -107, -13, -26, -50, 11, -32, -9, -43, 19, -19, -36, -29, 34, 68, -11, -4, -36, 32, -5, -7, 36, -3, -42, -7, -36, -52, 22, -4, 6, 28, -18, -11, -13, -7, 18, -46, 57, 27, 52, 3, 34, 7, -20, -7, -60, 6, -2, 3, 14, 24, -3, -60, 26, -12, 50, 15, 1, 24, 36, -24, -31, 18, -38, -27, 42, -50, -37, 25, 35, -9, 1, 37, -33, -42, -47, 28, -22, 11, -34, 68, -25, 1, 36, -50, 23, 39, -34, -8, 15, 92, 1, -10, 1, -26, -10, 67, 62, -10, -15, -33, 16, -7, 19, -26, 9, 6, -23, 71, 19, -22, 8, 9, -19, 21, 86, -23, -13, 37, 2, -23, 65, -28, -22, -72, -13, -8, -22, -65, -39]
4619c9J3q3J06J9j33J40k0k4o6O0l7J18j3p3K9J4o6N0K8pn0N0J3q7R0j5k7L3k0
4648CM2PJ3p5%J05j15KJ2mj2N0n3QO7n7k0L5k8l6J15j8j15J20Lj54R2L9j6o7R0
4679C3p0K8N1o5l2R2m9n8J12q4O9J6p4m4N2P9q0NN3n9M8l1k4j2J01n1jjk5O5r
4710C5n0k6R0n5k0O6q1J2J12j52KR7n9O4%m2m5M6j2qM4o9nJ15k4r3P3k8j4L5m8
4741d0O8mk4m5J5K5l5P0l2k5K9O8o0qj2j06P1J49j74n8K30l8j14J63j22n3Q4l6
4769a4n0J00Qn0P7r1q3R3J9J2n5Kp2Q4L6o4oR9j4o8J01j21O1L5m1n5R0p1m9N5
4799c2mm3Q5Qm0N6Om7K2K7q8Q5mj09O1L9q1J16M8j56J2N1M9n5P4j14K0O1r7LL3
4830a4jqL1o9R9j7K3m7pJ2m4J7N0J4l6J1l5m7R6l6n1P2QK2n6m6O5k3J1j5L7k5
$$ y = [-39, -26, -109, -3, 16, -117, 23, 3, -21, -87, -27, -64, 54, 41, -32, -3, 11, -55, -5, 23, 16, -34, 16, 29, -58, 32, 17, -10, 23, 3, 45, 52, 65, -10, -10, 95, -20, -18, -6, -10, -22, 28, -25, -17, 50, -7, -27, 8, -20, -56, 59, 41, -74, 46, 49, -105, -13, 26, 10, -57, 33, -37, -9, 42, -23, -55, 37, -12, -70, 42, -42, 27, 43, -31, -75, -23, 56, -24, -19, 34, -25, 23, -8, -32, -44, 57, 6, 5, 4, -21, 44, 35, -15, -41, 49, -6, -26, 40, -41, -29, 83, -69, -67, 30, -29, 35, 35, -7, -52, -6, -18, -26, 18, -51, -56, 59, 35, -58, 15, -13, -27, 8, -40, 28, 24, 0, -45, -30, -5, -40, 30, -2, -27, 2, 70, 10, 2, -10, -116, -45, 104, -70, -128, 102, 64, -50, 113, -9, -62, 22, -14, -64, 36, 44, -6, 71, -20, -103, -10, 9, 21, -34, -32, -104, -20, 16, -48, -54, 45, 31, -37, 64, -57, 4, 39, -2, -57, 33, -38, -87, -32, -36, -79, 6, 14, -26, 30, 36, -11, 11, 38, -50, 35, 31, -78, -17, 22, -59, 57, 105, -51, -39, 12, 61, 6, 80, -34, -14, 47, -50, -47, -14, -15, -23, 8, -61, 38, 21, 44, -3, -10, 2, -42, -25, 25, 39, 3, 14, -21, -68, 28, -8, -59, 13, 21, 43, -13, -59, 6, -17, -6, -21, 16, -9]
4862iJ7l9O1q0k6R3K9n4M3n5O6j8j6J7K3j14R2l3m3L1L5q7Q9m6L9m8M4m4k3O9
4892A3lk6L1m4J2K2Qm3J3K5j4RJ0k1K6n2n0Q3M0oJ9Mj02K5N4m1m0P0k7k2J04m1
4924C6rJj8Mj2k6m4R8Jp9K0P2r5O9k7k3M3j5n0QK7KO6l9j9l3N6J1n5Q5r7o9J47
4957C6rj12P6j1N7k0k1j4JN2o4K2n9J1N9k2n6J8J19n4L8k3l1J0K6Op6m4P6m7P7
4988B1k6l9P6r1O1qN6r9L7J7ql0P1nm9L2l0J9K9J3j40R7kNR6p8K3J2l7j6j1J5
5020A1l1Q9r2oKK4J6l0N6o7L5K0m0M2rok9MPLk4K7K4l7M2j0J5Kmp9%N2Km8P0o3
5056c2P5l0k9M4o1%j4N2qq0R0m8M0j1j3K6J9j9J2p5O1k7nj4N0l1N1j9l7P0l0m6
5088c9M1j3J6nJ5M3n0k7K9j0J4l0N5q8N8J9p0O5Mn9oO0o8O7l4Rk7pl7O1N8LRk7
$$ y = [-9, 8, -31, 30, -50, -76, 17, 46, -8, 35, -20, 46, 28, 12, 29, 52, -62, 30, -3, -46, -15, 20, -67, 22, -24, 15, -33, 11, -33, -56, 13, 10, -16, 15, -29, -17, 5, 13, -30, -17, 8, -6, 3, 13, -8, 18, -34, -84, -1, 39, 33, 52, 56, -46, -21, 33, -8, -48, 22, -5, -27, 77, 36, 27, 28, 10, 14, 2, -24, -68, 30, 31, -48, -28, 44, -51, 18, -9, -32, 11, -4, -54, -46, -19, -17, 49, 10, -9, -42, 14, 25, -30, 55, -42, -111, 36, 27, -85, -9, -20, 37, 17, -4, -18, -17, 35, -29, -7, -66, -55, 4, -18, -74, -56, 63, 9, 47, 24, -7, 3, 29, 35, -41, -85, -9, -56, 21, -5, -44, 32, -59, 2, -6, 50, -49, -12, 5, -3, -33, 38, 33, -16, 16, -14, 5, 34, 47, -93, 4, 2, 7, 103, 25, 48, 60, 23, 7, -4, 11, -20, 69, -23, -29, -27, -3, 13, -17, 39, -28, 7, 27, -13, 29, 20, 14, -15, -11, -4, -1, -25, 2, 26, -11, 31, 21, 36, 38, 34, -45, -45, 7, 9, -39, 31, -32, 43, 13, -16, 28, -33, -33, -47, 5, -3, -83, 7, -41, -1, -12, -25, 1, 20, 1, 13, -62, -1, -28, -33, -47, 3, -28, 23, 4, -33, 37, 7, -39, 2, -11, 5, 0, 15, 58, 8, -19, 10, 0, 14, -16, 39, -49, 9, 28, -42, 23, 27, -32, -38, 22, -46, 21, -13, -4, -31, -38, -75, -14, 44, 47, 56, 29]
5122B9o8NM7n5L3L1L3j1q2nJ06j24J02j6Kn0P2Pm6k8M5L6m5mk2kN3n3L4k0J8p
5154A5m6N7l4K2J3Nk4j7k5R8r5L5p4M2N0k4J1k5K2l4j4J35p2n5M1Jm4Jk0M3M2
5185C0l0lMO5p5rM4j03Q7oK8j9k0j3m9K3N3l1P1j07O2mJ4l6OM2n6k4K5O9j6L5
5217E7p9OJj6RL1l1L2n6J12j39K5N2j1L2k1k3L3J5k1kOn5Q7p3O2Qj0o0L0m5QN2
5250A6J1k3k9K4m0LK1%m1R3o1L4n4Q7n7M4Qj1l9N5o1M0k2N0l9n3R9k2n8J0lo5
5282h3P0k8J14l8j5pm7R3p4P2m6o1N6j3m8M3P7n1O9j00QJ2J4k4m6K0L6K3o2N4
5312A8l1j0K5JJ9OK5o9J1L8l8J2j2K6k6K9J5n4O5j00J2L1M5n0J3M0n4k1K8J8q3
5343g1R9p9P1o0N3l2N9p0P0k4J6j2l4M1n9L5m4kJ02K1j08M0Mn7L2j9Nj0L4n0Q1
$$ y = [29, -39, -34, 13, -42, -9, 22, 55, 44, -38, -43, 63, -61, 41, 25, 27, -23, 49, 56, 10, -18, 27, 63, 18, 14, -8, -10, 43, -10, 24, 4, 22, 15, -31, 26, -8, 14, 27, 32, 8, -9, -34, 64, -31, 4, -70, -28, 22, -2, 9, -16, 6, -28, -42, 93, 21, -34, 7, 8, -36, -35, -55, -12, 30, 0, -3, 1, 66, -9, -18, 26, -77, 10, 4, 32, 13, -7, -20, -69, -46, 7, -24, 47, -60, 2, -2, 12, -24, -18, 24, -32, -56, -31, 38, 22, 57, -22, -16, -15, -31, -22, 9, -22, 10, -46, 66, -73, -48, 4, -7, 25, 4, -19, 14, 29, 8, 6, 12, -43, 44, -29, 33, 41, 31, -29, 1, -44, -36, 16, 27, 4, -25, -1, -41, -38, -17, -17, -58, 35, -26, 8, -46, 41, -16, 28, 36, 25, -14, 41, -20, 20, -2, 48, 9, -44, 55, 33, -25, -15, -18, -83, -13, -41, 73, 35, 20, 13, -34, 59, -15, 57, 11, -50, 6, -7, -55, -12, 65, 14, 83, -17, -9, 3, 17, -7, -53, -33, 3, 26, -36, 18, -13, -23, 2, 3, 22, 28, 53, -16, -5, 33, -5, 7, -5, 21, -5, 24, 39, -15, 50, -50, -38, -7, 38, -12, 1, 41, -13, -34, -6, 12, -71, 28, -51, 20, -40, 13, -19, 40, -30, 40, 16, 32, 20, -14, 27, -32, 3, -41, -43, 59, 80, -28, 12, 16, -41, -9, -28, -23, -33, 1, -49, 32]
5374C2K9n8p6J33m2k5L5j3m6J03r9LJ1L3ppm5j3Q0Rl1l5P0o7O8M7j66P6k1RRL4
5406C0nk6o4j7L5pN2l8M8l2l2J0Q2q7J51r1Kq5R8m7m7J33%j23O0p3N4MNo3R6j7
5438Fm2nP1n2Q5p0pj8Q4n0L0o5L8O2p2J2j3MkL5k6j08J10Mk9Rj2pk2J10j06M6
5470@L3m6K0N5o2O0q4j1m2J24k2j0M5Mj17QP8n5P2q6K6N1j9l9j6k9L7Q6K9n5p2
5501c7O1K4j5l2OJ3pk6l0M6Kp6N0K9qlNj7M2J1l4M9l0j12N9N8l4p6J66j15N7J1
5533C7m9j2K4pk0L4o7J4J41l1r5L2n4k0P4J2Mm1Pj5J2J9kQJ1m2O0Qm4k7M2J3J6
5566D2n4l4K1j5O9p6L1L4Ml9O5o8O2J8q3N0O8r6K6m4m2P5o2N2K8j0o9J3N5n6M5
5597A0k6J7NO9o0n2O7p0j6L7mk2N5J6o5N5k2p1J23p1j2J13j00QL9l8Ro1J01m6
$$ y = [32, 61, 3, -73, 60, 18, -7, 28, 15, -31, 72, -27, -24, -13, 20, 13, 6, -39, -52, 28, 37, 6, -29, 41, -26, 42, 89, -77, -1, -22, -13, -4, 30, 25, -1, -65, -82, -47, -54, -2, -40, 8, -24, -56, -46, 36, -51, 100, 9, 11, -74, 24, -23, -70, 63, 63, -60, 0, -73, -19, -15, -10, -73, 23, 6, -36, -41, 30, -22, 63, -7, -14, -32, 52, 2, 32, -33, 5, 67, -5, 7, -6, -2, -4, 31, 5, -103, 7, 11, -18, -9, -21, -28, -50, 60, -46, 0, 33, -13, 7, 62, 0, 60, -24, -35, -77, 47, 25, 15, 60, 64, -53, -45, 33, -22, 50, -36, -10, 41, 22, -17, -33, -62, -25, 61, 90, 35, -37, 24, 48, 33, 1, 7, 20, 13, -13, -43, 3, 5, -71, -21, 8, 0, -3, 2, -15, 27, 38, 4, 53, 23, -89, -30, 28, -6, -82, 84, -31, 26, 37, -12, -24, 0, -7, -27, 7, -60, -46, 95, 64, -31, 1, -53, -73, 1, 13, 17, -24, -17, -32, -20, -1, -3, 5, 16, -26, 34, 42, -2, -29, 13, 26, 42, -12, -46, -25, -40, 29, -47, -16, 18, 22, -17, 48, -20, 42, 60, -23, 27, 95, -1, 25, -19, -61, 14, -48, 4, 32, 22, -47, -34, 21, -35, 10, -16, 1, 6, 75, 15, -37, 30, -40, -56, -19, -23, -45, 10, 26, -39, 16, -6, -77, 46, -25, -37, 76, -24, -16, 23, -15, -6, -67, 34, -12]
5627a2K6qNJ0kNj0j18J28n0l9Q6m6L9R9j03M1J4p2K0j9J9m9m2L3P8l1j7J3M7m0
5658EL5l8k5L3j7j2N4n9Q5r9O2jk2jl8k6R1m3L4J9l2K2n3K3j6L8K0m4J9L8o4N6
5690D4J0j9r3M0m3L1o1R2K2J6j2o3P2p7K9RK6nk7K3J9%k4p4Q9M3j04j3O8p3O9
5721A4J3p3N6l0QK4pK9l1j7m0L8q0J33K4m6q2Q4r6Q8j6l1J5pM0kK7p8M7j9L2L7
5753E4o3l1O6j6l7%N0Mj4rl3N4qN1l1mq9J01m8m5M1N7l0J7k0j5Orrn3P4l9Q3p3
5787a8K6Ln7O8%K1p7L3Oj0K7l4j9N2Lpk5J7q2J05k6qJ3kJ0L9r5Q2m7L6N5o1kk6
5821@Nk2kP7j50R0K6N5n7L9m7QJ0k5K2o6nO9o4L5j5RN6j24M8Pj4N8j8k4M4k5o7
5854f7N2L2K5o7N1m7J5L6m4M1n3P6n1O6r7J4M9n5MqJ04nm0p5PJ9J3Jl1R8r7J4
$$ y = [-12, 14, 6, 11, 21, 19, 24, 14, -104, 24, -26, -65, 21, -25, 14, 113, 10, 51, 65, -7, 13, -6, 13, -36, -78, -45, 33, 2, -15, -2, 45, 5, 40, 2, -23, 10, -7, -19, 35, -24, 61, -38, 24, 23, 1, 0, -38, -64, 27, -16, 18, 37, 5, 27, -26, -3, -19, 19, 39, -5, 14, 52, -12, 44, 54, 35, -58, -18, -61, -30, -91, 1, 23, 39, 27, -36, 36, -41, -12, -3, 23, 18, -9, 14, 33, 33, 9, -65, 24, 67, -37, -50, 18, -55, 14, 27, -46, 10, -20, -12, 12, 5, 34, 3, -14, -54, -16, -96, 37, 61, 15, -67, 17, -79, 9, -7, -38, -23, -30, 10, 8, 35, -43, 4, -15, 17, 54, -9, -40, 26, 10, -27, -27, 23, 27, 13, 4, -29, 25, 17, 68, 37, 33, -56, 45, -3, -48, -7, 50, 20, 37, 17, 2, 8, -1, -10, -63, 11, -28, 55, -18, 8, 11, -46, 22, 22, 43, -34, -1, 5, -5, 22, -12, -31, 21, 24, 17, -8, 9, -73, 32, 6, -2, 11, 9, 19, 58, -37, 45, -2, 34, 89, 28, 26, 0, 5, -17, -19, 58, -92, -2, 24, 79, 22, 61, 14, 22, 32, 7, 29, -37, -42, 27, -37, -2, -17, -8, 48, -76, -28, -21, -35, 23, 5, -19, 25, 0, -67, -15, 17, 42, -25, 26, -21, -6, 30, -14, 27, -26, 50, -1, 65, -32, -18, 31, -24, -20, -28, 76, 71, 31, -44, -37, -18, -5, -4, -35, 63, -34, -20]
5886b0OQ5m9k0o0J7LN9k9J6j2J4m4P4n9N3n2j0O5q7j7N2J8j8J5J9j4J0m3O7m7
5917hj8J3K9K3k0m1R0j28O6K0o9J2M8k1N2r1N0n2M4Ro9K5K9R1j36N5m2K8N6j4
5947C1J2n4pj9%O7l0Nn1O4m4Q7r3N0o4J06Qq2pR7m8r%m5J23o2K4o2K6k9mJn1M6
5981a4m6J10j6o8o7J35K9k7j3m2q3J17o1J6O5j3rj0k9J3LN8o0PjK7m5JO6l9o7
6012f3L3M7k1L5n3M6M7o5p1P8Qj4L4p9LrJ12p7J9Qlj13P5L6k7m7Q9n4K1O7r7K4
6044a1L0k4QK2p5P8m3O7n2n8O2pJ6p3J01m0M0l8n0J8L5l3km0K4P6n5L9rL3l1O1
6076F9r3O3r8M3l1P0n5N6k6N8m0n5l5L6P9p7M6k1j5N1Mj39J44j9j7k4j3L9j1J2
6106Ao1N9M8o1k7M1PM1n0K0j2n1K8m6J06o8O2r2K2Q8rm9K1LLo5M8Lm4N4l4L7O
$$ y = [-20, -14, 71, 22, 2, -58, -41, -38, 21, -8, 8, -4, 10, -34, 40, -19, 34, -18, -28, 37, -50, -67, -15, 3, -15, 0, 19, 5, 15, -28, 39, -8, -26, -13, 16, 39, 19, -22, 68, -60, 6, 26, -43, -31, 17, -4, 48, -43, 7, -45, -1, 8, -61, -36, -7, 84, -52, 3, -39, -11, 45, 31, 43, -11, -18, -37, -37, 30, 0, 5, -46, 18, -26, 61, -32, 18, -46, 60, 68, -14, -21, 76, 28, 19, 19, -26, 97, 35, 59, -3, 23, -6, -10, -9, -60, -14, -60, 50, 34, -34, -101, 34, 63, 36, 23, -19, -102, 15, -46, -30, 35, 22, 13, 3, -26, -13, -10, 48, -12, -5, -6, 21, -24, -23, 43, 4, -63, -30, 17, -4, 31, -22, 24, 71, 6, -65, 13, 21, 7, 41, -38, -35, -44, 68, -9, 10, 18, 15, -98, -23, 13, -14, -61, 28, -26, -5, 62, -35, -11, 19, -5, 3, 25, -50, 28, -15, 52, 0, -58, 4, -3, 13, -60, 41, 1, 41, 3, -47, -29, 6, -27, -29, -69, -45, 31, -24, 15, 6, 39, 8, 69, -24, 39, -59, -16, -47, 23, -32, 24, -2, 56, 16, -39, -74, -38, 41, -36, 10, -11, -26, 25, 29, -110, 34, 15, -2, -26, -39, 0, -11, 1, -60, -1, 47, -14, -41, 0, 7, 48, -2, 18, 6, -45, -17, -63, 43, -25, 37, -55, -33, 55, 46, -3, 18, 21, 24, -41, 7, 10, -34, 20, -14, 23, 29]
6139B9Ml4n6J01j2l6J2nN8j1l7n9J00n6nj3J1K0L6n4J0MOll5M9k2J4pK0m0op8
6172i5J07l7l1P7m5M2o2mM4pJ6k8j5lM7L5r1N7j6j3j7M7j0qN9n8koJ4M5j7r6J15
6205D4K7r5K0J7k9N7j5O5n8j2l0O2n3L1l2M7l0m0OK7J8k6K0m9J1m9L5J3J0ll2
6236d3L5m9M5L1rJ7k3P2j30R5m4J3L1k5J4Kj3J2k9m2O7oj6JNRl3J2k1K8j0j3m1
6269e8M6k1J5J4j9O4p0K4k7j9L5Lk4M7l9K1M4n5O5o6O2jo1K5m0kK2N8mm3L3Jp8
6302d8NJ26p7k3O1m7Qk6l8m8J07m2O1Qm9J8K9K3k0j7l0O7rr4Q3k1m9Q5m3J1o7
6333e6K8L5m9J9K9k1K9pn3N9p0M8j0J7O4j03K6OKK9k4K4k3K3K8m1Kkl5L0n7O4
6365A1K3l3j7J3pOpN8r1PJ01l0q1O8p6J9N0j4lJ9j3j4rj0L0j7K7J1r3J09nl1j5
$$ y = [29, 33, -1, -57, 44, 32, -4, 8, 3, 61, 50, 13, -46, 54, -2, -7, -20, -9, 11, 47, -7, 3, 7, 13, 10, -25, 24, 2, 16, 9, 29, -11, -17, -95, 12, -25, -56, 21, -24, 18, -44, -48, -4, -11, 5, -23, -38, -41, 6, 41, -50, 7, -9, -22, -39, 8, -2, -10, 49, -9, -11, -17, -3, 42, 25, -71, 44, 71, -24, -4, 13, -16, 41, 26, 91, 33, 21, -9, 53, 0, 31, -1, 46, 16, -24, -18, 9, 27, 1, 21, -28, -17, -66, -31, -18, -8, -11, -43, -8, -57, -12, 19, 10, 27, 4, 76, -54, 41, -3, 10, 41, 16, 30, 32, 19, 31, 2, -40, 27, 21, 5, 6, 11, 20, -13, -1, -22, 6, -4, -17, -58, -12, -33, -18, -4, -23, 41, -29, -5, -32, -51, -16, -13, -37, 10, -29, -8, 36, -19, 46, -20, 42, 41, -20, 5, -35, -37, -15, 43, 39, -4, 29, 30, -48, -43, 83, 6, -17, 44, -3, 5, -21, -59, -107, 0, -42, 19, 27, -22, -4, 25, 48, 28, 11, -19, 48, 39, -55, 28, 7, -42, 43, 0, 11, -56, -28, 7, -42, -23, 6, -15, 14, 7, -46, 13, -57, -9, -19, -2, 62, -41, -15, -9, -7, 22, -2, 22, -1, 22, 50, 9, 11, 9, -26, 4, -53, 11, 34, 1, -16, -3, -10, -4, -11, 47, -44, -37, 64, 34, -47, 21, -55, -36, 14, 0, -3, 16, 3, -11, -20, -30, 0, -17, 10, 21, -72, 37, 32, 1, -14]
6398a4J1M8m6J1Ojp7P8j8m0L6J0M6q3J0j2JO3k0n7K1k0K8l6Q1j3M3m8o5P4m4N2
6430B5r8J25j23J18o1l7L1kl3M5K5q5J14J5m3j3k9Joj4P1rJ4l3l8L1O1J5k7j0
6460C0m7P9k3n4m0K1m7P8M4Lk8Jm8Q6%J3j05J8J04j01j9O3L7r2J9j1jk8L3K3R
6491A7O3j40P2m6N7q2O8P1q4J5k1L4j0qOl0K7L1k9m6K0kN1q6R7p7J0J9oNJn3J5
6524d1kjP7o0J2rK2n0N0lQm5L1n5R2p2J02n2k9L6n9O4k9K9n1pJ22j03M5j6L8p4
6556c0P2K2o0j14R7K0nK0m5OM7n4k2LQ0l6n2M4J4k5K6j6kl6N4J0Pk3p6J13n7K1
6588Cmj8N2Kj3K8o5K5k8M3p7L0P5r5P7m7Q0j03N9j8n1P0o9P8l7L4J6j7j7k2%j0
6620a9J7J9nl9oR1o5k3j3M9k4JjNK3l8J2mR1q9L4lK8q7J4Nm5J38j51K6N1NMj5
$$ y = [-14, -3, 45, -1, 10, 16, 15, -62, 16, -2, -42, -6, 4, 50, -33, -23, -35, -34, 29, 9, -48, -27, -47, -19, -55, 26, 13, 56, 8, -57, 17, -27, 25, -73, 52, -71, 47, -14, -51, -20, -22, -55, -10, 15, -70, 44, 59, 16, 3, -26, -25, -31, -45, 26, 17, 31, -2, -40, -9, 52, 67, 40, 30, -17, 62, 39, -15, -55, -34, -81, -3, 41, 44, 16, 17, -31, 55, 55, 68, -37, -19, 85, -16, -35, 28, 65, -27, -8, -19, -20, -48, -15, 8, 17, 80, -60, 12, -34, 23, -59, 9, 80, -4, 11, -10, 24, 14, 6, 12, -18, 9, 40, 11, -35, -15, -17, 34, -52, 45, -32, -22, -3, -9, -4, -3, -56, -41, -43, -44, 33, -27, -15, -24, -2, -52, -2, -5, 3, -42, -11, -66, 26, -46, 56, 4, -25, 11, -48, 16, -13, 16, -35, -42, 80, -23, 22, 6, 44, -30, 42, 64, 4, -110, -13, 7, 2, 22, -23, -17, 30, -24, -46, -43, 37, 1, -51, -7, 7, -18, 8, -8, -10, -46, 8, 18, 25, 2, -74, 39, -18, 3, -1, -19, 33, 35, 22, 50, -15, 10, -18, 25, -52, -22, 53, -42, 35, -12, 68, -35, 24, 6, -45, 25, -44, 34, -3, 31, 47, 30, 13, -9, -9, -19, -2, 17, 12, -27, -33, 58, -7, -30, -43, 6, -18, -17, -18, -13, 10, -28, -16, -20, 71, -18, 16, 13, 41, -46, -32, -27, -72, 66, -85, -59, -8, -3, 1, -14]
6654a4nL3n2O6k5NJ2j4l5Om4P9N7j01M1qPj1m5nL1PN1m6l0k3P2k4j6O0L2n8n9
6687e6K3P0J5j24Q7l9M6K3l4o9P5k5J18j07K5o9P6m4kJ0O4p3J1j7PQ6j37Q0l3
6716a3L2K0k9j2LM2p0K9J1J9k2m5P9m8n8K9K2k0k2Q9m0jj0pJ4k6Q8o2%M5q7J01
6748E1q1O8k2k2KOK0J2kq5lQ5L1l4Po6k0M2N2o1L9o8P1k2p3K5M0mNj1k3mN9Qj2
6783A0M0j9j4J3l9j7M5l1M1k6%K8j5j6M3q1J5k3M9l4P4l4j0L4l6O0r7M1nj0%N4
6815D0r2%N0l0M0K8q0M3J5N3o4k3M3k1J0Lk9m5N2J7LP3j00K4j8L2l9l0K0J1N9
6846D5l1m2k1R8j9o1M7n2%Q2ol8%l1K0k3J7k9O4o7M2Pn3M6J0Ok7K9Oj1K4Kp7l9
6880h2R8k3k7O0n1lN2m9K4Kj2PPJ9m1L5%K0o2J7l1J08o9M4q9M9o8P6J4jr3P2K8
$$ y = [-14, -19, 14, -38, 28, 3, 8, 20, 6, -29, -23, -67, 12, 69, -32, 9, 1, 8, -3, -48, -53, -22, -15, 36, -10, -40, -63, 9, -15, -31, 29, 61, 3, -56, -33, 37, 52, -72, 15, -24, 22, 45, 11, -58, 17, -8, 110, 3, 28, -41, 35, -9, -11, -1, 63, -10, 1, -16, -9, 77, -60, 20, -13, 19, 39, 10, -2, 1, 43, -27, 2, 13, 32, 10, -35, 44, -4, -62, -33, -11, -31, -53, 36, -4, -5, -15, -22, -8, -34, 54, -8, -8, 37, -50, 51, -30, 38, 16, -6, -4, 2, 22, 34, 32, -53, -56, 29, 60, 26, 33, -33, -53, -11, 41, -20, 19, -49, 22, 0, -73, -48, -8, -12, -7, -18, -41, -45, 14, 22, 10, 50, 31, 17, 30, -9, -26, 19, -12, 29, 3, 3, 31, 16, 0, 43, -38, -23, -46, 3, -31, 43, 9, -1, 33, -3, 57, -40, 1, -4, -14, -14, 40, -52, -52, -2, -32, 8, 36, -44, -1, 14, 67, 3, -20, 23, 2, 12, 15, -14, -59, -7, 10, 13, 86, -14, 10, -8, 24, -15, -45, -25, -14, 45, 14, -28, -49, 49, 30, -31, 16, -36, -36, 46, 40, 2, 2, -29, -9, -32, -15, -44, 20, -47, -5, 2, -51, -5, 5, 11, -16, 13, 19, 8, 32, 34, -43, -82, 16, -7, -34, 26, -25, -28, 24, -25, -1, 1, -11, -4, 3, 22, -19, 16, 16, 36, -26, -9, -40, 68, -1, 43, -46, 3, -65, 11, 25, 24, -69, 3, 31]
6913C1j0L3m2m0k0M6O0p8J0k4N6k6K4m3L5m2ON1Mj6k8J7j3M6n4K2lL7%k6N7l0
6945D0q4N1Ol6M0K6K4p5J7K5j26J17m5L1p7R6l4mJ7J4k7M7l2J1m4j3J3JR5p1l4
6976c1nM8oK1q1N3K3Lj7J9n%j6L8j01N4J8L9l7J1M1l2m0LJ0l6N8n0jj9J8J1N0
7009D1l4o5J06n9M6pll2M1o7M1k3oL9Mj1%o3P4j1L3o2o2J20j11M6P6n9L0j4L0
7040C8r2K5K1Q7n6J7k8k2RP4r3L3j3mL7n2JM8q2M8K4q4L8m6J11m6o1J19l2k8R
7071@Op2R6n2J4m6L7R9j09j1Q2r5L6N2j15N4l5J7J6K2QO9k1m4L8j23N2O1j9MP
7102B8l4K6%r0P8N5p1L4j8j6K6j6k5k7M0J6M6r4M3k7N3K6n2L4n0K2Lj3L1n4K7
7133ApJ2%mM8j8m1K3K6o2K6K4m8O9l4J4k4L8j26J3O2O6o3l1P1m6J8jnjJ6m0R1
$$ y = [31, 21, 54, 12, -28, -48, -2, 58, -20, -10, -34, 22, -4, 20, -23, 12, -30, -24, 27, 31, 15, -13, 4, -9, 37, -17, 5, 2, 39, 39, 13, 70, 40, -44, 7, 13, -23, 17, 43, 67, -8, 9, 34, -92, 25, -20, 11, -66, 30, -4, -8, 9, 23, -4, 43, 11, 22, -22, -35, -22, -21, 74, 3, -31, -36, 12, 6, 27, -54, -1, 22, 25, 8, 27, 22, 22, 6, 44, -57, -3, 15, 54, 17, 28, 69, 37, -3, 0, 10, -26, 32, -18, -19, -38, -20, -9, 41, 7, -58, 48, -11, 35, 28, 25, -7, 34, -33, 8, -15, -21, 18, 22, 11, 11, -52, 22, 11, 44, -18, -80, 40, -71, -25, 51, -8, 22, 8, 38, -54, -29, -8, 79, 23, 40, 12, -10, -1, 73, -20, 13, 0, -4, 33, -19, -18, 30, -52, -4, 20, -64, -26, -72, 39, -7, -68, 51, 19, -9, 0, 6, -66, 30, -22, -8, -54, -17, 82, -27, -38, 44, -51, -15, 37, -78, -24, -59, -42, -26, -4, 4, 73, 52, 8, 46, -77, -25, 36, 17, 21, 28, -6, 20, 20, -70, 8, 63, -8, 26, 8, -8, 18, 2, -23, -50, -10, 6, 52, -42, 1, -26, 27, 53, 1, 35, -15, 7, 10, -3, 28, -26, 1, -6, 6, 6, 2, 50, 32, -9, 14, 40, -22, 4, 28, -20, 49, 15, 29, 5, 43, -83, -70, -8, 58, -5, -36, 35, -11, 7, 6, 1, 0, 16, -24, 67]
7166F7l2r8R3L9n5Jl7rL3M5j7Kp9LK7Jj4mM6k0O4o9L5l2oO1l8j0l6J12m1o2mO7
7200C3m3P7o3m1j8J14p9m8O5k3L4j1mJ0k0lN6k6m6m1J00MpJ7k5Ok0k1J2%o5N1
7232b5RK1J7m9rQ1p3R3n5K7m4o4O9M3l6M8Nl1Kl2M5m3JJ6l9n4J13m4r3J34l8K4
7264A9k8J9nP5j38N0J7Nn9n9R1L3J7p9R5qrK7p6l2M5JL9j5m2JRkJ6pj5P8j5p5
7298b7j2NP6j9PJ7J2l5N8p8n5J5N2n8J9O3n1n1P7Rl2K8k9M5o9Q3j04M0J1l8M3
7329Bm2J12j00OOK9Mk5rJ3K8j7j9K7K1j0j01J09n0k5Q4m9jj0J7Qo2O3K9m5N7p9
7361b9L9K6n7L0k4J7N3q0N0n6pP3nk4J5j7M8k7q5P1J9ml4J3K6m4nM4m3k3j2N6
7393Do7J31m4K4o2k2J8jLJ6Q5j37M3j6L7k6nl0rrP0JM0p6M6k2L2o4J4MK2P6o4
$$ y = [67, 35, -63, 30, 69, 14, 15, -22, -31, 2, 47, 30, 32, -47, -44, -17, -16, -30, -34, 12, -8, 56, -13, 22, -10, -16, 45, 7, -3, -39, 73, 32, -30, -34, 33, -10, 67, 4, -37, -55, 59, -20, -68, -3, -26, 8, -3, -7, 3, -17, -20, 36, 10, -36, -77, 23, 27, 20, 37, 12, 18, -2, -23, -11, -11, -76, -25, -16, 5, 22, -27, -36, 45, -28, 65, 10, 37, -7, -71, -2, 41, 5, 53, 58, 27, 29, -3, 42, -1, 0, 16, -23, -77, 36, -8, -101, 33, -5, 19, -9, 10, 5, 80, -58, -8, 9, 14, -45, -104, -13, 20, 37, -42, 53, 45, 36, 63, -13, -45, 0, 1, 40, 25, -17, -16, -7, -9, 7, 0, -15, 63, 48, -27, -39, -34, 42, 23, 30, 47, 59, 24, 82, 4, -51, -36, 16, -42, -23, 40, -11, -62, 15, 24, -8, 20, -9, 36, -33, 50, -54, -14, -3, -41, 2, -40, 72, -28, -22, -16, 13, 17, -8, -17, -4, 24, 7, -12, 15, 36, 26, -75, 34, -16, -41, 43, -6, -7, -17, 0, 8, -54, 9, 38, -7, 50, -29, 10, 36, -21, 9, -15, 2, 55, -25, 25, -31, -38, 35, 30, 6, 21, 4, 52, 25, -60, 11, 30, 26, -8, 5, 31, -13, -18, 26, -17, -40, -52, 4, -63, 68, 24, 48, -14, -36, -18, -19, -16, 0, 85, -52, -9, -25, 12, -14, -19, -49, -58, -67, 3, 4, 44, -32, 14, -8, 24, -40, -26, -22, 0, 76, 12]
7426A2k2LQ3j63J09L5j2l3K6p6K9m0N3k2J3L9k8N7m8j2j1Nk0J1k9K3%o4P0k9L4
7457gm8N8q6L7N2k3P2p6M3K6rk7j9j2M9n5o2R5K6m3L4kk3pLpM2n9J00n8J9q3M1
7490iN1m7K8o3O0M8k0j6k4K3l0j0O8j1q2lQ9m8k9L2n0R4m9rl0L6N9r5M0k3k2j5
7522e7L8k9L8NN8j7j03N6K7L0j04Q6j7k3N8k3Jj1l5P5k6J7k7M5q1M5n5K5o4O2
7552fP4p3N3p6k8N2RO9j02L2j0N5p1M3n5M3l9RN8j18R0L9k6J1Jk2J7Mk9k1K3l6
7584c0m7O6pj9L6j9j0P7Lm8l1L0PJj6k0L2JN9r2N5q6K1J7j0J06j00K0l2ON1l2
7616a1k1N2m4K0K2Kj4M3q4O6l9n8J01n4N5m3RK2n5L0OL5kNKk9J4r2O8mP2o9l9
7649c4N4JM5o6j0NM3k8k1j6O7J0o6L8N4l5q7N1K1m2K1Nq9L9O0m3K9K6M1j23L5
$$ y = [12, -10, -7, 76, -87, 22, 57, 45, 12, 38, -38, -9, -49, 4, -18, -5, 34, 6, 63, 15, 3, -8, -3, -23, -12, -41, -18, -18, -82, -12, -41, -7, -55, 3, -83, -46, 6, -17, 55, -21, 22, 48, 39, 12, -7, -19, 30, -25, -87, 8, 34, -9, 25, 23, 0, -7, -4, -11, 31, -28, 72, 14, 33, -50, -9, 42, -5, 23, -40, 20, 68, 48, 32, 8, 31, 1, -9, 59, 48, -34, -37, 52, 4, -25, 7, -43, 51, 2, -7, -37, -1, 58, -37, 3, -20, -42, -57, -19, -48, -10, -5, 53, 36, -67, -11, 16, 46, -58, 28, 11, -12, 46, 23, 24, 13, -22, 53, 27, 44, 17, 62, -19, 26, -29, -4, -68, -6, 68, -5, 48, -28, -56, -4, 5, 74, -28, 4, -6, 49, -22, 21, -34, 9, -30, -21, 37, -81, 9, 48, 22, 33, 34, 12, 29, 33, 4, -17, 6, -30, -77, -11, -18, -37, -1, -20, -30, 47, 50, 2, -29, 1, 8, 9, -7, -27, 5, 6, 65, -27, 28, -58, -37, -20, -30, 76, -24, -4, -36, -30, 21, -11, -32, 20, -24, -4, 18, 20, 6, 49, -35, 31, -8, -66, 35, -19, 36, -7, 2, 24, -31, -1, 5, 40, 38, 43, 45, 16, 30, -62, 6, 2, 74, 5, -34, 20, 21, 66, 0, -10, -5, 38, 10, -11, -27, 40, 50, -16, 22, 76, 41, -46, 5, 26, -16, 5, 10, -79, -40, 20, -23, 6, 32, 73, -50, -15]
7680a5L3k6m1O1Rp7j9P4Kj7m7R8K6k0m3Pm1J1K1L8j9mjm9JoJ3O2L0n2l8L4L5n4
7714a4k8O1o1L8j0onL6jM0q4J3k4N5L2m4j0klQJ5N3k2p0%K0nN3o4P7nq5N2L2n9
7749a7k0M3l2L0J10r2l6lo5J09Qj1%q2O9j9J0j5lM9o8M7m9JJ29j21L6L2n3Qk1
7780b6N9m9NJ4nNJ9k0P4o2K0j6k7jJ2k3Ml0L6J9n9O0n1J2J5POM6n3M6n3J29j28
7813a5KL2J7n1L1p7M3P7o1m9J02m7rj3J8l4LN0j6J2j12PR5nN8m5ol4J16q2j9P
7845eJ0j8J1J5m4K5k5j6J12o3K7k4m1P0n2lM2M4q4L0P5r3J8J7k3k9O7l9k2L7n1
7876c2L6m2QL2o0O0k2L9K9l8M5p4k9P1m3O7k2%m7J11j42M5j4l1K9K8Kj9N3q2k
7907d4L3J0m4O1Om0K2j8J9J7Kk6k9K9j0jl0M3k2K1m5M4M2l1m7M6n3R5No9Qj6j1
$$ y = [-15, 18, -8, -49, 12, 21, -56, -75, -1, 1, -16, -63, 35, 61, 41, -2, 5, -36, -25, -4, 34, 15, 11, 10, -39, -38, -44, -31, 31, 61, 9, -29, 5, 40, -14, -42, 19, -42, -4, -14, -20, -25, 11, 10, 50, -34, -21, -45, 10, 42, -2, -12, -14, -17, -9, 6, 59, 37, -33, -33, -13, -18, 35, -29, 48, 43, -42, 10, 42, -17, -37, 6, -26, 4, 114, 22, -14, -17, -82, 27, 35, 24, 24, -58, 11, -8, 2, -13, -16, 33, -35, 12, -37, -36, 93, -28, 8, 40, -13, -5, -26, 33, -16, -11, 3, -2, 3, 22, 2, 76, 14, 34, 18, -9, -10, 2, -21, -17, -47, -11, 8, -51, 9, -42, -30, -15, -8, -2, 44, -9, 37, -16, 113, -15, -13, 19, 36, -15, 16, -61, -18, 59, -2, -51, 51, 4, -5, -18, 0, -34, -31, 19, 3, 15, -97, -90, 5, 0, 58, 13, 7, -27, 89, 7, -12, -5, 5, -13, -2, 13, -31, -6, -31, -47, 65, 2, 29, 5, -36, 34, -18, -21, 21, 65, -19, 11, 86, -7, 11, 28, 5, -24, 43, 4, -18, 19, -32, 4, -38, -30, 2, -58, 2, -20, 19, 48, 10, 55, -19, -48, 23, -20, 47, 25, 25, -22, 89, -53, -8, -22, -53, -24, 4, 6, -13, 40, -42, -44, -11, -1, -45, 16, 22, -18, 4, -14, 5, 22, 24, -2, -31, -2, -12, -13, -43, 0, -22, -1, -46, -2, 40, 9, -38, 8, -45, 50, 55, -14, -6, -22, -33]
7940c3PO2Mm6j2l3N5o0P2o7l4Q9rm0O4l3J4nl1N0l5mJ8nm3O8M2n1mK8o0n2O3L3
7974A2K9Pk2k9r0J22k1j2K7q9P0L9m1j2N1Lo4K8k0M9o2N1L7l7m9L8o9P7l0M0o7
8005c4O3l5m0L7l3J29lq4L3q9O4l0j3O6pm7L1qK4M4l7m3K6Lo1J8K8J7p3O4o2J4
8037c8J0O4j1m3kJ7j4%j0N4J4j1n5J07j03KO0m5njL3r6O5L8j1l4k9RP4n7m5N1
8069a2J7J4k0NJ6j0j1K1q3K9M4k8jM1k1J6kl7KnPN8r3L9J7K5m3L3J1l2q1O3K5
8102DOK8p6lP3K7q9K9J7j8j6l0J8O0r0Q0j4K6Lrj3j2j1pN7j8k4J6o2J6M1Ql7n0
8136g0J06N2j14R6j6j1J9j5K1q6K3j8mm4J4L1n2P2m5PmN1n5P0k0qRK9r4qK4O9
8168B9j5o6Q6l4M8j4o0kK0l3O6Kl0m7K6P2mq5R1r7O6p4P4
$$ y = [-33, -26, 36, 40, -6, -18, -51, 4, -56, 16, -51, -85, 4, -5, -45, 19, -14, 0, -5, -36, 14, -21, -25, -7, -12, -55, 13, 55, 4, 0, 28, -32, -84, -21, 12, 41, 48, 26, -3, -93, 29, 8, -4, 23, -66, 4, 43, 2, -10, 41, 44, -20, 8, -12, 37, -25, 26, 63, 26, -23, 15, -54, 23, -7, 33, -34, 29, -6, -46, -9, -42, 87, 84, 0, 33, -56, 8, -22, -35, 31, 24, -23, 8, 0, 24, 68, 31, -12, 14, 17, -44, -26, 2, 19, -54, 10, -52, -38, -28, 36, 25, -18, -20, -3, -17, -17, -27, 27, 41, 30, -25, 82, -21, -19, 41, -4, -9, -10, 23, -73, -8, 30, 19, -15, -44, -35, 39, -18, -63, -12, 5, 19, -1, 4, 20, 10, -1, 20, -63, -34, 10, -18, -19, 22, 1, 17, 15, -22, -20, -25, -18, 40, -53, -14, 3, 28, -15, 18, 29, -3, -84, -21, 4, 10, 38, -38, -41, 32, 59, -30, -1, 16, -2, -18, -48, -30, 30, -60, 20, 6, 32, 35, 26, 13, 1, -10, -17, 40, 22, -2, 14, -48, -32, 9, 17, -20, -70, 36, 88, -26, 70, 54, 43, 62, 47, 68, -18, 5, -13, -17, -61, -47, -16, -68, 4, -41, -34, -38, 13, -42, 28, 8, 0, 9, 38, -56, -64, -40, 29, 14, -52, 34, 0, 48, 34, -26, -28, -8, -41, 25, 27, -3, -50, -24, 48, 44, -41, 50, -47, 19, -55, 19]
8191A9
$$ Imaginary data points
##PAGE= N=2
##DATA TABLE= (X++(I..I)), XYDATA
0@%%%%qQqJ6k4L2l2M0n2O0p2Q8j05J29j52J76k08K43k83L25l73M28m88N53o25
29c32P05p93Q90r98J120j249J386j539J711j898K103k330K578k853L160l503L887
46B045m319M812n380O043o828P769q930J0405j2335J4981j8848K5026l6396O3719
60D1764k33644k08950P21358j63618m70925K95262K31110k80934p848J21090l0919
71A3746M461l3103o4495J51120j240k13593Q3256K03211j40966j40393J27735
82a0261J04073j00638p7034J28592O5524k00253j6790K38269p9055k25176J65170
93g579J49574j81203n4873J15083L867R734k5546r5241J15576Q4162k02169J6358
105g2257K06167j34307j26557J77482R595j28600P0004L9327n3268M5008l0907
$$ y = [0, 0, 0, 0, 0, -8, 0, -8, 8, -16, 16, -16, 24, -28, 32, -40, 48, -57, 72, -80, 96, -112, 131, -152, 173, -200, 228, -260, 293, -332, 373, -420, 470, -528, 592, -657, 729, -810, 901, -997, 1106, -1224, 1354, -1499, 1661, -1842, 2045, -2274, 2538, -2842, 3201, -3627, 4142, -4788, 5617, -6718, 8263, -10585, 14441, -21955, 41764, -191880, -400830, 320528, 156910, -314015, -18753, 212357, -68577, -76425, 44665, 13746, 18207, -14896, -79391, 71729, 70489, -143104, -59848, 143363, 2397, -137996, -10261, 93812, -6826, -83860, 44732, 110256, -89997, -106787, 131482, 52427, -172749, -7579, 141995, -39208, -94081, 21002, 24869, 34603, 9057, -86184, 29392, 113554, -88615, -72257, 133910, -397, -126954, 50528, 60123, -68477, 1527, 40854, -12414, 32594, 1687]
116A687p1422J21074K6995j54927M8483J06430j05105k2497J05815m1029o8442
127e2938O5621M1965o0029l8419N3820M7381n2147m7971L9864K0454j8986J2530
139A1145j6017j8819N6995k0227p1416R2868L5549j48242M4421J45118j25584
150a4209r2691J52246K0872j17244L0204M5769m2294K0474K0161m2512J8904J6418
162A6098m3433K9461K9927o3493N351O6662l5225n2129M2096L6572l2633k2562
174b3308K7208J2138l1894m605M2308m125n0231J6369M3315k9577k2713K9704
186D589M328q473l1j6628J1302K5602k3168j1823K6094j3025j9703L2594M736
199A6394l7624J5735K8112k9127q581K5932p367o876J3786j1110j2047J5816O763
$$ y = [1687, -69735, 51339, 78334, -76593, -28110, 78320, -26785, -49282, 56533, 15504, -52938, 12683, 54648, -5381, -43800, 10020, 57401, 5254, -42717, -2853, 17601, -1385, 11145, -4872, -23691, 33304, 13077, -58339, 34529, 70078, -78164, -33743, 111375, -14209, -106900, 45346, 66218, -51026, -20822, 24947, -17347, 3127, 23288, -19224, -320, 16098, -27335, 2126, 32053, -31440, -26089, 40573, 5348, -46781, -4685, 31887, -746, -23308, 3900, 16038, -15856, -20461, 21847, 17722, -32509, -16140, 27175, -2402, -25115, 4589, 8917, 444, 413, -16215, -4913, 20689, -2479, -14302, 11792, -1233, -20936, 11658, 16394, -21230, -5495, 22617, -6510, -15091, 10841, 3474, -3402, 10384, -726, -12773, 3043, 9806]
212I806j0457J546K718j1965O109J8171j5074j3355K1410L398k0005L530J1713
225G545p010q36J0713j0129j3359J5516R270j2058L32K395o078M810N840o140
239H11m702O226N015r595n503J0444J944o112L126N47p911J847J0484k392p938
254c709L918q51l531Q024m538o645J3642l155j5301J1913P273j4427N403J3300
268A1316j5362j0027J9220K449j5823N539O857p663k30K095J33M369k198l817
282c142K331O0j203J469K948j053o162N71N912j260k730L291J396n237N47O484
298D222n617k111J1253o590j0546J1372K220r133P132L841j0317R84Q871m198
312A383m045P247j949o279N040p46l514O823q97o336L877K221m275J142N812j766
$$ y = [9806, -651, 895, 3613, -8352, -2243, 15928, 854, -12501, 8909, 12307, -7698, -4168, 7545, 535, -301, 10412, 283, -13076, 2440, 11710, -348, -16, 2379, -3699, 1111, 6951, 811, -3891, 2335, 7350, -2245, -7748, 2696, 4640, -1472, 1654, 2201, -5710, -3863, 6621, 4229, -3709, 209, -642, -4173, 3851, -687, -7332, 6310, 3155, -12146, -233, 7040, -7387, -1984, 11316, -4046, -14073, 5147, 7596, -8227, -2688, 4169, -3494, -3724, -1629, -1496, 2873, 675, -3142, -811, -751, -1954, -485, 2463, 1410, -4752, -4181, 1731, 471, -2259, 1032, 2428, -2809, -2262, 4222, -1395, -3506, 7747, 1157, -9389, 1983, 4203, -4930, 2202, 6043, -4274, -3290, 5581, 1383, -2662, 4585, 2636, -3643, 1397, 651, -2863, 3960, 3063, -3273, 604, 2825, -1450, -308, 5504, 3738]
328C738p839K763O043n272j998N665m87m760L14L270p0o17J724k622p89K966m595
345b566P67P671o094n920Q257O95p675L893P315o258n422P093L38n872M166J930
361B318m363N27J65n30K880K51k533K66K094k100k455N469R48o809K110L437m478
378b803L56M731j263l310J858J400l295J865L790m700q87L993l554j123M924m05
394A577l131R26J778j779n89L282o77k301J227j118m61K758j201p90J994j143
410C52j900J636K794j726k687L187k25m356K913L016l197p37J910l41j518J174
426B95K201j631j100Q80j442Q19J294j764Q82P33k350J85K126J77j424L64J273
443A518k542p60L345q45j829J636n87j342J029J152j41p99M46m40j184J531j40
$$ y = [3738, -4101, -1338, 4705, -567, -2565, 3100, 2613, -2147, -1833, 1437, 1367, 750, 2474, -148, -937, 2029, -2566, -1799, 5872, -222, -6142, 2115, 2810, -4865, -972, 6343, 85, -5337, 1756, 2094, -3778, 388, 2318, -2045, -1518, -1353, -1883, 997, 1248, -1285, -1019, 1075, -1025, -3480, 1989, 2937, -3872, -1762, 1675, -2803, -2447, 2284, 1021, -2289, -431, 969, -2326, -461, 3329, -1371, -2258, 1735, -1819, -2942, 1982, 1577, -1554, -628, 1150, -629, -1218, 2064, 1387, -914, 313, -805, -1266, 1492, 291, -499, 1495, 352, -1548, 88, 2882, 1156, -1531, 1656, 1431, -2925, -12, 3004, -193, -930, 980, 639, -879, 295, 2496, 865, -235, 645, -797, 22, 1316, -448, 434, 1167, -1183, -998, 1128, 1305, -119, 245, 1518, -1024, -1784, 1561, 716, -1113, 523, -64, -1406, -377, 775, 634, -165, 281, -159, -1343, 188, 48]
460D8r91J996j522k009K473N47j035R02m7j169j40J135j48q95J192l89j342R37
478d57l72N40J425j625J14J044k354J023K748k002j572J074M65n56K66J26N6J408
496A351j261k129L231R7l338L819K91n650K988L200l542P20J769k483R12J750
512A725k857P91L495m014j489N525l645l385P408j163n684L800P49j964K844k076
528F0k088M478j129m729L937K170m872K185K893n445J514M029l993J770J251o443
544d412M528N087q564J02P601m357l195N255j812k753M804r68l357L051k473j327
560b790P831m242p468Q109J965o221L205K88k993M548q46m893M419K11m996O475
576B602J641j1522M306J0518q042l853O373k155o7K093m950L256L406p782K938
$$ y = [48, -943, 1053, -469, -2478, -5, 542, -493, 409, 362, -807, -947, 188, 40, -855, 337, -52, -1394, -457, -829, -289, 1136, -489, -375, 669, -1685, -662, 2086, 84, -1488, -414, 51, -505, -239, -113, -57, 1351, 90, -2039, 1192, 1289, -2049, 1770, 2061, -3589, -601, 2599, -943, -223, 1546, -937, -25, 1725, -1132, -341, 3154, -860, -2349, 3176, -469, -3854, 3554, 2391, -3293, 507, 1256, -708, 2136, 60, -2028, 2450, 1321, -3408, 529, 2699, -2173, 12, 2905, -2540, -1026, 3003, -990, 780, 2031, -4412, 116, 5203, -3361, -3259, 4342, -15, -3210, 2045, 233, -2520, 2284, 1316, -2041, 1010, -1463, -2790, 5041, 799, -6669, 1440, 3405, -2816, 389, 677, -2316, 2232, 1386, -3507, 912, 1123, -3873, 2602, 4243, -7279, -2973, 7545, -497, -4350, 2023, -132, -199, 1894, -3056, 200, 3606, -4176, -1238]
591a238P162r122k598J1451k170p933M091P68o19M630o747l197J1532m262q719
606f971J0285K11r577Q317L312j0812K928P253m727j222J177l085N063J586r073
621e335M709O871j0046J052R451q091l441Q435j912k323J179n510M441R895j1041
636a666q460J4487K359j1345L899L350n861M817K025p475K534K978k802L428j073
651A195o153N034M290n592K56K859m855J655O002m996l526L970k59K143J292r096
667e781J370J2597m419j1031M757O794k885l026J44J011J734p85k182K062J139
682A499l123J014K843j986k325R71K597P30l785j318L703J206j695r02p96P73
698e94K793R8m677j541O420K696p402l702P064M452o042l566M707J218k335O51
$$ y = [-1238, 5924, -3198, -5796, 5655, 3485, -4448, -357, 411, -208, 4422, -2325, -5522, 6010, 1748, -6971, 3314, 3525, -6052, 2265, 5577, -5235, -2307, 4946, 219, -1003, 174, -2911, 2152, 3738, -5335, -626, 6245, -3801, -2749, 6702, -1389, -4830, 3605, 1693, -630, 549, -4961, -520, 9375, -1666, -10126, 4361, 6720, -4625, -726, 2624, -3237, 1580, 3605, -3870, -1336, 1642, -1160, 2268, 1195, -4958, 76, 4366, -1226, -970, 1889, -2966, -1311, 4691, -305, -3831, 139, -120, 2023, 3315, -5781, -4411, 8186, 3767, -7264, -2507, 4287, 1402, -1624, -1480, -469, 1265, 480, -1702, 360, 1499, -1624, -610, 2233, 247, -2078, -1107, 1490, 2220, -1565, -2883, 820, 2026, 331, -571, -1367, -594, 2199, 2297, -2380, -3921, 2499, 5195, -2207, -5909, 1155, 5607, -435, -4001, 706, 1924, -411, 240]
714B40k67n27J021j177P51K319l636k274N504K109n018k312K818K661L21k957
730d24k940K277L509n2k782l813K783P499m373p702N768M189m764J94J589k766
746a808J361K183k466R48Q69m219K538N585n326l939M847J400j025j097l337L084
762d02M391m337k109K681r63J899K064o366j01P817l280n628N442K52l682M243
778A921j327m177N696m86n031N770j06p138N329L861o419M92K654k762L701Q63
794B841q290M412P474q020j673O291m812J96O871p111l172Q612k220l978M759
809B180k777k562P104k315o064N821M39n035N320K59o910M586L067m442K513j082
825A02m273P261J270r446L448O203o258K15M552n482M33O308m853k235N391l559
$$ y = [240, -27, -554, 467, -710, 41, 2360, -1276, -3550, 1954, 4063, -955, -3267, -449, 2212, 2533, -424, -3364, -1087, 2422, 2370, -412, -4225, -1442, 6057, 1684, -6018, -250, 3939, -825, -631, 958, -1808, -447, 1736, -730, 218, 1087, -3132, -594, 4991, -335, -4274, 573, 1973, 948, -149, -3486, -402, 3989, -348, -2457, 224, -739, 1160, 3224, -3142, -3243, 4574, 1294, -4334, 1108, 1360, -2322, 1921, 594, -3583, 2113, 1627, -3404, 2366, 2260, -4878, 451, 4312, -2107, -1615, 1039, -1723, 1978, 2841, -5449, -1037, 6437, -1583, -3256, 3035, -1777, -1581, 5290, -1821, -4993, 3619, 1399, -2579, 2180, -597, -3159, 3945, 1630, -4434, 1387, 1826, -3209, 2111, 2370, -4540, 46, 3113, -1329, 1184, 102, -4171, 3090, 4360, -5086, -1638, 4565, -1693, -1478, 3074, -2408, -1975, 4333, -520, -2755, 2636, -923]
841i23q83N914m854l594P217j241m725M128jl306L577J43l592K596N54k495L004
858A519p00m243M319K100n492J609K869l084J217J358l369J734K219l277N70K207
874A556l076P08L484l515j374L937j378j255K380k446n06M035k584k331L761r79
890D17k110K977l88k978K267J333k161Q86m0j750K584N29l592J562K146k638P03
907b53J433k231O23J827j521k88P70j073R72J122k568k8K830j634j364K561q74
924C04j633K248k48j623J296j73q25J505p32j537J844P60k110O10J281j389J58
941b64J107j312jJ231j010j50P98q22L16Q13j024k33J059k91o58O74q7m84L59
960B1Q8m53N08j27l99Q42k91r33R92K66q41K45K24m10K61K11l76q7N27k04k44
$$ y = [-923, -1806, 4108, -746, -4340, 2877, 1636, -3089, 1039, 1038, -2268, 1309, 1452, -2140, 456, 1010, -1485, 1519, 819, -3424, 895, 2995, -2497, -888, 1981, -1103, 114, 1472, -1897, -163, 2056, -1221, -651, 1556, -1520, -812, 2672, -843, -2217, 1720, 342, -913, 1467, -979, -1485, 2550, -34, -2365, 1396, 417, -1693, 1284, 896, -2082, 185, 1518, -643, 243, 203, -1547, 1037, 1566, -2026, -464, 1682, -956, -253, 1180, -1051, -428, 1399, -122, -410, 360, -713, 259, 1381, -1187, -1215, 1615, -19, -1383, 1178, 304, -1329, 919, 671, -952, 344, 171, -654, 851, 119, -1418, 426, 1186, -924, -314, 967, -422, -264, 843, -469, -470, 761, -249, -399, 399, -423, -107, 706, -318, -551, 508, 217, -441, 233, 146, -338, 21, 109, -344, 164, 37, -362, 480, 189, -744, 248, 514, -327, -82, 142, -268, -7, 204, -172, -259, 268, 64, -180]
981a80M89l70k30O24l38k76L48q1r9K25j22j37R2K18o2k19K84p3j76J90j44r2
1003a29J33LQ6j55j22L96r4l11K46M3j92K2J08n5o9kJ63o6M1j3rJ60k04j70L64
1028A74p2k45J92Q9k55l2J34J45k33J61J30j85m7J10k7Q8k53K3J83j25LM8nM5
1052D6j07N2J01j13L7Ro0j9k2P0O2j49J53qj15J42j3j09Q2lq4M1Kj01O0J3N2j7
1080BO7qj22J01J8j61J19k8J8k%jn2K8J21q5qN2j46Q2rj4Q0j24J08l0n4P4L0j1
1110D5KJ5p6J9j21R6R3j36Q0n6P4K9j88J93P8k45J61n7q4k6J02mk3j0M7N4m5r0
1138g3R8J23j38k10L62j41q4Q3k5j5j5j8J02K9j37j2J21nj74O2J90j14l0R6j32
1163e7M5J0N8j1o5m6J62p8j40O3J37q6o4Q8J8o0J5J2kJ1j03N3J24j50J2J39n6
$$ y = [-180, 309, -61, -291, 333, -5, -281, 67, -14, -113, 112, -10, -147, -55, 163, 101, -118, 166, 93, -83, 107, -37, -129, 4, 7, 93, -62, -184, 212, 118, -193, 53, 96, -96, -74, 34, -21, -90, -92, 71, 5, 46, 33, 24, 184, -20, -190, 174, 102, -143, 49, 138, -117, -149, -15, 130, -103, 58, 188, 3, -44, 66, 39, 127, -126, -103, 80, -45, -42, 6, 1, 46, -61, -9, 92, -21, 16, 25, -35, -54, -76, -6, 56, -93, 60, 52, -63, 79, 66, -43, 39, 36, -48, -7, -5, -106, -46, -33, 19, 2, 69, 61, -61, 40, 58, -103, 16, -12, 6, 4, 4, 3, -49, -21, 100, 15, 7, 59, -87, -5, -14, -28, 52, -72, 36, 6, -48, 26, 56, 45, 47, 62, -14, 5, -116, -20, 73, -63, 17, -39, 35, 64, -124, 69, 147, -98, 63, 6, -78, -104, -2, -6, -29, -39, 8, 62, 17, -73, 25, 148, 10, -200, 162, 21, -63, 20, -5, -20, -35, -53, 49, 78, -59, -71, 50, 45, -129, -67, 123, 9, -21, 75, -57, -12, -2, 56, 45, -20, -66, 96, 18, -122, -59, 78, -8, -72, 16, 34, -26, -11, 1, -1, 10, -93, -40, 84, -66, -54, 85, 29]
1190B9j9j3kO1nn0p0K0J12r3k6J04j49J20P0r0l2Q5l8Q8j03r7J24J04k22m6K44
1217A06j16j47K75p6q7K1J18j17N9r6k7J43Jj76M8J05q3J25l6r3q4K55n9j58P2
1242b7J4k4J70k88n6L68m3j92J04L1j12J18K2k46J04J88k83J29J41k74Q6L07l06
1265f9k9J73j68N1K11k40j39L53q7k49K09q5oK00j24j82L14Nl86K59%j75K36l2
1289D0k24J95J27l31K89O2l59J32K55k38rJ73k74J49J92l54M4L17p5j84P3j37
1311a37J55K62l36j82L79j31j33K78j67j79M10j82k04J82N7j89K92j61k45K43
1331A2J11j70J64p3k65L67K0l79J23J97j84J59l9k96L33J04m28J19L21k80N2K13
1353A81k71j5K85k78M7K02k85L7L64k97k08L60j40J2J18k85K0L46j59k52L21p1
$$ y = [29, 10, -3, -5, 56, 51, 1, -69, -49, 63, -30, -56, 48, -101, 19, 89, -1, -33, 52, 14, 102, -1, -98, 26, 130, -92, -138, 106, -10, -157, 118, 42, -45, -24, 94, -23, 36, -60, -87, 56, 57, -119, -71, 34, -49, 76, 40, -53, -137, 118, 59, -99, -27, -13, -37, 133, -155, -211, 157, 114, -78, 26, 57, -55, 63, 85, -161, -57, 131, -152, -23, 118, -156, -70, 237, -69, -98, 75, -93, -42, 169, -71, -210, 143, 56, -193, 16, -69, -75, 125, 1, -181, 133, 138, -248, 11, 11, -164, 72, 40, -184, 11, 138, -193, 96, 158, -201, -69, 186, -52, -61, 112, -162, -13, 179, -175, -131, 186, 111, -73, 0, -137, 18, 280, -56, -238, 141, 10, -123, 155, -12, -191, 219, 37, -167, 15, 72, -117, 175, 14, -231, 12, 123, -47, 117, 44, -221, 146, 166, -213, -90, 107, -77, 82, 43, -253, 80, 184, -244, -125, 196, -84, -32, 181, -90, -105, 180, -98, -51, 151, -134, -97, 267, -30, -238, 122, -18, -6, 112, -173, -153, 193, 34, -218, 103, 32]
1375C2j60K73j14k80M70n7m36K57K50m26L10kl60K94J21l03J76J98n52K34M07
1396C32m93j8K51j39J84R3n42R0O40m46j53L74k47j11M95m02k41N39j03k98K93
1417I8j07k42M48l2m33K89P8k70L68p9m23K67K69l29J08l4j35L14J27n38R3M25
1439B62k78j07K11k38J09K41k85k8K75k86LK51k36p8L46q0j49J23r3rK36j78j96
1462a84K24J2j08J66j34j11L10J6l63J01K21n3mj16k08L18J04k60PQ9o2KK16k29
1486d6j65L10q9j3K4j49R1K62j80k08J12O6O0L2j53p4K15R4k51LM9m5J50Rk47
1511a43N1K28m2j86R0o9J4J44l3k33J26J55r5j2k2q7J38J17k04m8J46j01J08%
1535D2j12j6K66j12j89J63p9O7J23k13j59K87J39l38N5J22j41J13J49l20J25K09
$$ y = [32, -128, 145, 31, -249, 221, 164, -272, -15, 235, -191, 119, 117, -243, 51, 172, -131, 45, 243, -309, -75, 332, -161, -179, 72, -67, 117, 210, -332, -242, 398, -48, -201, 173, -74, -185, 310, -92, -333, 206, 103, -195, 98, -9, -251, 197, 165, -268, 21, 99, -171, 197, 118, -305, -38, 231, -98, 10, -24, -159, 155, 282, -256, -163, 262, -16, -123, 88, -150, -41, 200, -85, -113, 162, -124, -121, 130, -106, -184, 162, 82, -67, 56, -37, -46, 190, 12, -184, 40, 52, -56, 110, -24, -135, 175, 191, -172, -71, 150, 97, 93, -23, -231, 87, 191, -69, -62, 27, -35, -33, 183, -46, -211, 99, 10, -3, 21, -128, -37, 225, 45, -163, -51, 15, 75, 107, -46, -120, 95, 189, -62, -59, -10, -55, 95, 104, -143, -92, 136, 94, -92, -2, -71, -57, 87, 54, -179, -53, 102, 7, -5, -27, -114, 24, 141, -63, -111, 35, -66, 42, 42, -70, -86, 180, 68, -121, 42, -37, 30, 153, -60, -219, 68, 207, -131, -76, 46, -95, 18, 167, -153, -28, 181]
1557A81j96k0J38k00j9L58k47k24L28r8o8J94j65j80K53M7j49J37m5j22J88P2
1579A63l97K17K83k75RNj68J98K13k97j3J50j23PJ58k51p2K78j03r0J93j08j21
1602a44K60q5j50K22r6p0J05l1j69K23N2k67J56Q8j12KP1j38P2J85k67N6J40j92
1626h9N6J30j41K7Q8j41P5Lj12J22P8p8j41J53m1JJ38j71r3K83o5j86J86q2q0
1651h0J87j08j41J86L4j36Q0J07k10P5J12j36J5R9j97O5J27j43J0J55j11mO5q9
1675c8M4K1oj11J37K1j88J78m1r3J41j7j06J63k7j68J90o5n9K6J7p7O6Qp4N5M9
1702D6n6k3J59j70p0J29Jj40J55p5o5J20k1MJ2P9j61J4O0m5l5P5l0K7oK7Kj7N
1731Am8Q7n8k4O2J7Oo4k6K6O7p3K4M9p5J1P0n0n7M2j5J13j20J20j51J12k1o0j6
$$ y = [181, -15, -35, 103, -97, -116, 242, -5, -229, 99, 1, -67, 127, -38, -218, 35, 82, -67, 70, 25, -97, 91, 163, -234, -17, 266, -9, 0, 5, -163, 35, 248, -49, -62, 88, -35, -28, 130, -121, -193, 85, -18, -108, 85, -23, -144, 116, 31, -119, 103, 7, -63, 42, 11, -158, 65, 117, -150, 6, 94, -18, -16, 55, -83, -11, 174, -93, -37, 103, -89, -33, 97, -44, -17, 71, -70, 5, 8, -104, 18, 96, 18, -123, 30, -11, -10, 128, -43, -136, 147, 82, -104, 82, 0, -80, 107, -1, -142, 44, 78, -58, 22, 129, -81, -6, 106, -30, -15, 84, -113, -48, 79, -64, -54, 101, -10, -14, 51, -38, 6, 27, 21, -90, 47, 68, -120, 58, 17, -76, 65, 48, -58, 105, 78, -90, 100, 35, -24, 2, 19, -58, 8, 16, -58, -3, 46, -10, -33, 126, -44, -114, 15, 16, -124, 31, -44, -109, 11, -10, -6, 6, 85, -76, -62, -2, -47, -82, -7, -37, -10, -16, 11, 13, -4, 1, -47, 40, -18, -42, 20, 37, 43, -21, -47, -21, 46, -27, -3, 46, -29, -18, 52, 2, -55, -13, -28, 85, -35, 85, -66, 46, 25, -35, -51]
1760e1R6o4J2N0q2L2L5j8rK4r4O6K1m4K3j2kJ8J1OO2o9j4J0JM0o0N5j2n3O1k6
1792A3r0M7J8P0j21N3J5m6J5J6j2J4k6LP1l0n2M7o2R7j4m1l3O5J4j3J1K7j39Q9
1822FKj45J19N5o7Q5j0j45O9R7j14K1Q1j39O9P4q1p5J51o9p7J83j00j08J88k4
1848D6j52R5Q4j78J41Oj61J11J49k09L2J51k26J19J60l06M8K13j81n9J46r1N6
1871fK05j96p8J49q7p8J31j04j10K37Lj49R2N6j11J39q0k33K88j2j58O7J5p2J37
1896D5Q4k54L2K29r8p9P8j48N9K55k87K1J54k06P1K52l05l7K64o2j48M4l2n4K24
1921A02m2l11L05O9k80K36o0l10L33O1k79K02m6k00L27P3l14ML26k41K5J47l04
1944a77J13M15m47j32L70j55l6R7j76j5M28k41k54L09L5k83K14k7k37K55M9k89
$$ y = [-51, 45, -19, -7, 43, -39, -7, 28, 10, 1, 25, -69, -3, 18, -26, -3, -15, -17, 1, 12, 18, 80, 11, -3, 7, 8, 48, -12, 43, 31, -22, 39, 13, -77, -30, -12, 58, -63, -10, 5, -41, -26, -10, -22, -8, -34, -31, 40, 10, -42, 5, -57, 40, 26, -15, -48, 17, 31, 18, 29, 56, -83, 6, 8, -137, -18, 37, -30, 55, 45, -100, -31, 66, -48, -27, 54, -85, -16, 58, -23, -98, 53, -16, -93, 90, -10, -118, 70, 46, -106, -11, 73, -105, 36, 42, -119, -8, 141, -68, -36, 115, -111, 8, 168, -138, -90, 123, -58, -117, 29, -62, -6, 199, 3, -75, 74, -13, -91, 40, -64, -174, 63, 66, -83, 9, 65, -46, 93, 13, -220, 68, 56, -102, -35, -20, -92, 45, 129, -125, -93, 136, 38, -41, 37, -111, -52, 203, -84, -63, 91, -115, -44, 208, -97, -134, 130, 68, -80, -36, -68, -122, 102, 60, -251, 54, 123, -157, 79, 19, -291, 42, 103, -176, 26, -20, -220, 107, 180, -134, -130, 196, -45, -20, 127, -177, -64, 351, -96, -228, 142, -13, -49, 48, -128, -143, 285, 44, -210, 99, 134, -149, 65, 38, -199, 56, 105, -184]
1966a84K05K9k36K43J94m00oL16o8j16P0j97O6L56k37l88L85J21j74J69k21k36
1988c09M14Q1m22J69J20j47J08J03k65k5K25pk0K9j63q5M94j96m75K62K46p1r
2011E7j33j39L65J77n00l4L07j34QJ20k35L1L11j66j59K96k31j39M16j70k42J89
2033eJ21j66J48l3m06M88J83m89q2L06J2%pl25L19L39n28p9K74j50J13J12k99
2056a54k6L81j62k08K82k39j22N23j44m67L37R0j47L03l49k96N71J85m81q1J50
2077e4l9L54p4o26K97N56m57j6J57l50K75L76n62r1M57l61O2M56o21j56P97j98
2099A82m24L60k19j57P06l26o64P11J22n02L78r9n33P66j1q03N53L12p01L32M05
2120C88q47L40O32q20O6P06p68J58P06p75k66J010m58l83O71n38k66R69l74p55
$$ y = [-184, 21, 50, -186, 57, 251, -149, -155, 161, 93, -23, 47, -150, -84, 272, 35, -353, 32, 153, -21, 148, -73, -309, 105, 186, -236, -67, 53, -94, 14, 117, -148, -173, 52, 45, 25, 54, -109, -194, 300, 104, -371, -109, 137, 66, 57, -76, -215, 150, 327, -173, -207, 100, -34, -26, 94, -141, -110, 201, 35, -124, 172, -59, -198, 218, 48, -194, -5, 116, -50, 98, 65, -341, 147, 330, -159, -241, 65, 77, 77, 70, -255, 64, 403, -125, -204, 70, -80, 33, 145, -154, -180, 201, 39, -169, 113, -126, -248, 275, 131, -336, 1, 91, -56, 247, -102, -398, 173, 358, -123, -204, -54, -93, 261, 187, -439, -142, 414, -43, -59, 98, -252, 23, 399, -163, -254, 203, -158, -96, 360, -261, -417, 380, 182, -242, 118, -101, -258, 448, 122, -542, 169, 291, -211, 167, 68, -465, 301, 290, -513, 40, 352, -349, -17, 388, -459, -119, 513, -307, -241, 465, -303, -145, 561, -214, -480, 530, 72, -311, 360, -178, -444, 525, 151, -604]
2140f04P67J58o48N68n5p55Q35K46q92K82L88o52N36K70r07K86O43n16j11N00
2160C39o45R3P46o50l41P41k17k77O05m87l09Q11k45n16N00k5m75P15k26o43N46
2181D0K55n26L21R5n53M90K96p45J82L59m07K37J96m46Q0M86m10o6L15k99pL61
2203B54m33j25N94k76j61L78l15j59N75l47k54M25o6k93L74j44m04N34L3m81K44
2224d7J88l44L10O6l57J49L48m66P7K16l63K02L05l82j46L45j40J7K66l16k14
2245b86N01j06k98K97j91j10M42j69l91L99M4k50J61K4k26J88J66l00K5L28l19
2266g1k0K38k45l1L43k11p6J64j49j9K02j51j75K47L7k17J48L9j15K00j0k94J08
2289e8J83j99NJ31j53J03R9j65N3K7N6j12Q5l3r1kO4p7J42q6o0J68J4j60R8j9
$$ y = [-604, 163, 321, -327, 241, 186, -569, 266, 512, -380, -98, 290, -362, 174, 444, -463, -177, 466, -50, -161, 339, -306, -213, 533, -117, -458, 283, 66, -211, 394, -93, -402, 409, 164, -352, 148, 123, -352, 363, 137, -506, 40, 295, -231, 90, 185, -368, 122, 418, -327, -145, 214, -193, 44, 240, -206, -126, 360, -50, -116, 199, -100, -107, 254, -179, -304, 290, 14, -147, 231, -84, -243, 332, -15, -269, 156, 90, -203, 171, 27, -377, 157, 190, -291, -47, 141, -203, 107, 173, -184, -35, 313, -153, -76, 140, -223, -21, 284, -98, -244, 101, -39, -22, 244, -72, -286, 215, 109, -189, 108, -83, -193, 249, 80, -311, 88, 132, -118, 43, 67, -159, 29, 195, -105, -80, 248, -71, -91, 147, -98, -129, 214, 3, -73, 91, -58, -77, 125, -26, -201, 46, 83, -134, 14, 53, -62, 138, 128, -166, -58, 125, -74, -69, 62, -91, 12, 111, -54, -1, 26, 82, -30, 55, 22, -69, -71, -7, -84, 58, -28, -88, 80, 94, -66, 32, 13]
2315A3j3j5K6n9j5R8m6j12J50Jk3R1j03k0J12n1r9J55q1p3P9k4J9OJ11q4r3P5
2343B5q0OJ31j55K1K9QO5n8p1R8J5l4jK7m5L0n2K8pM3Qr1J32j5r3N4mJ1j7poJ3
2376Hlk9L9P1o7L5L8j50L6P9n7k9M2m5R3l9m1J0Q3q9Kl9R2q4O1K5q4PJ14j89J49
2407C9q3%J26j11J8%K2k3Q9q2J0n3P2j16R4j2LmR3j28k9Q6Kn6N9q6M2Qk4P5L4
2438F5oq3P5k9p1k5R8p2lN2l4M1rr0J08jp0J04l6N0o8l9M9M4j1n7n5Q7k7J1k1
2469b3KkQ5n9l4O6k1o1k6K8Lj3J29p3l8N5o3k8R0p5L8N5n0J1m1l6M1M6kj2J22
2500A14o2n7J6j01M1P1K4j23Q1j8J1L4k1L6J2N9j04MJ1q4OL2j6k6J11j8r1M6j1
2529b3QO1o8j01J83q2pP5l5j32J68%j54J11Ro3P7om2J1P9j00J1J90k42J32N2j23
$$ y = [13, 0, -15, 11, -48, -63, 35, -11, -123, 27, 28, 5, 96, -7, -27, 85, 34, -65, 90, 9, -64, 15, -9, 10, 16, 127, 43, -50, 25, -55, -49, 82, -73, -52, -23, -15, 50, -8, -79, 19, 34, 0, -1, 26, -19, 11, -41, -13, -20, 23, 31, -60, 72, 57, -36, 18, 14, 25, 8, 1, -5, 8, 5, -24, 15, 86, 19, 54, 92, -58, -22, 57, 0, -29, 13, -32, 61, 22, -19, -9, 74, -15, -13, -52, 40, -44, 17, 42, -42, -35, 79, -110, 39, -44, -44, 82, -29, -11, -11, 11, -12, 77, -5, 5, -48, 24, -92, 2, -10, -7, -11, 82, -46, -75, 11, 13, -43, 16, -70, -28, -20, -44, 31, 65, 59, -24, 51, 22, -49, -74, 24, -48, -51, 1, -33, 8, -1, -91, 17, 16, -54, 50, 14, 64, -4, -43, 6, 50, 39, -18, -73, 14, -13, -2, -23, -21, -23, 62, 3, -31, 35, 14, -47, -73, -45, -42, -55, 74, 1, -37, 18, -45, -73, 17, -58, -20, 35, -15, -4, -45, -81, -40, 6, 4, -8, 114, 52, -5, 11, -90, -49, 22, 46, -77, 4, -14, -3, 31, 10, 46, 58, 117, 13, 17, 28, -56, -50, -18, -34, -60, 51, 33, -58, -12, -23, -15, 46, -22, -123, 60, -22, -29, 46, 11, -121, 47, 47, -107, 4, 13, -50, 27, 21, -21, -10, 69, -31, -20, 170, -72, 60, 112, -11]
2557a1l4J61j54J6L4n8p4J91p6j75K26J9j76J75l8j40J58k8j43N8J05j50J40J31
2581A57k57o8K68j03n5J52k03K5K91k64j18K54q5m8J65j33j47K03J02k68J97O4
2603A29k48K21Q2l80M6K75k26J44J12k65Q4K73k66j23K20r2n6J78j94p3L65j26
2625H0k70L33j14r0J27o6j28K57l0k24J62M1l12K70J53l54J51J45k20J34J03l68
2647b20J38L79l54q7K52j45J19R8l46j4M24k06k24K47j39p1L50k21k23L58q0k19
2669a84L56j72l12M20M2l03J43K7k33L69N9n02J45L87k69j1J31l22K40K67l82
2690a04j39M71l95R9K80l19r2M50k64k25M31k23j54L60p3m63M13K02m74L74n3
2711A02l65M57O7n35J66L46l53J00J78m16J94L59l30k27M84k61o8L38k49j87M22
$$ y = [-11, -45, 116, -38, -22, 12, -46, -120, 71, -5, -180, 46, 65, -111, 64, 26, -114, 44, 16, -127, -69, 36, -114, 26, 157, -100, -168, 100, -3, -58, 94, -109, -84, 207, -57, -175, 79, -6, -54, 111, -22, -169, 34, 136, -132, 65, 129, -119, 102, 184, -196, -150, 125, -101, 43, 155, -110, -26, 247, -19, -142, 78, -14, -70, 108, -86, -159, 206, 80, -190, 143, 29, -61, 66, 0, -128, 129, 99, -125, 37, 78, -234, 36, 189, -165, -14, 131, -89, 45, 148, -220, -82, 297, -57, -144, 108, -37, 82, 180, -166, -180, 244, 38, -186, 61, -78, -149, 201, -20, -243, 115, 35, -184, 172, 0, -312, 108, 150, -153, -10, 17, -216, 153, 212, -290, -145, 242, -27, -38, 93, -229, 11, 278, -104, -243, 228, -167, -68, 212, -107, -199, 251, -13, -238, 193, -30, -184, 176, 103, -360, 53, 255, -219, 155, 102, -263, 194, 261, -274, -108, 238, -115, -15, 163, -253, -59, 300, -30, -257, 227, -34, -102, 236, -13, -200, 222]
2732B22j59k62K64q7j51M05j14l63K50J76k24J21m8l47L67K56m54j7K18j22J13
2753D4R3l60J01L37j60j29J47k01K3K48r0k86J96J11j43J42j33j63K84J45k87
2774h1L3l6M0J81r8k17J47J09k3j00M8l3R6Q7k38PR0j9l9J16j69M4J59q4l7J0
2800gj0j1J17q8j53J71P2j14o1P7k6J29k7j98J13J02p3j1j16j8Q4J75j34j36J53
2825A0K0k1J00k12k7K34pj38L1j1J8O9K5k12J5K32j15j7L7j51P5K11j92j46K07
2850C5j7jJ25j59j82L73p9k28R6P0j57J80j1k44K33J32k38J24O9k36J25J50k32
2873g2l7K33j31m3K12k36p1K76q0k07K25k1k37K15L7k44K07R9l26J62J10j88J45
2896B8J23k04j7K39k64q3K84k22J1K94k50j29L68j15j67K42j76o9K08J6k20J60
$$ y = [222, 63, -199, 65, -22, -173, 232, 118, -245, 5, 181, -43, 78, 30, -317, 50, 306, -148, -165, 53, -69, 44, 137, -223, -122, 215, 55, -74, 73, -128, -105, 143, 53, -233, -37, 74, -69, 73, -60, -223, 61, 206, -81, -48, -84, -44, 137, 39, -178, -31, 78, 55, -45, 3, -30, 66, 153, -85, -78, 12, -7, -46, 70, -99, -55, 104, 20, -17, -7, -17, -28, 89, 1, -152, 19, 91, -23, -84, -7, -33, 96, 69, -129, -16, 86, 13, 2, -114, -132, -48, 127, -7, -143, 10, 30, 9, 109, -103, -130, 104, 97, -41, -10, -21, -3, 66, 91, -121, -106, 126, 11, -6, 31, -120, -45, 166, -26, -172, 35, 18, 17, 142, -17, -199, 174, 95, -133, -37, 33, -124, 56, 45, -199, 34, 166, -72, 52, 121, -115, 10, 160, -72, -109, 124, -7, -50, 162, -74, -145, 131, 51, -156, 69, 48, -189, 26, 63, -181, 26, 125, -201, -39, 71, -117, 28, 151, -53, -70, 169, -95, -178, 106, -116, -105, 189, -61, -190, 178, 63, -104, 138, -38, -107, 101, 117, -103, 57]
2918E7o9j51K49J1k86J60J74k85J15P9k24K27Q4k25M7J14j42J18k6j24J07J7K5
2941E2q2R7j34l2K35k01l8J80n9p9Q7r6k9K39q8j57J83q3q0J22l9r3P5R6j46J05
2967C5K1j49J11Q4j42R4K0j05j9N1mn9J89j67p3J66k8q4J28o6p7J56J5j77Q7m0
2993c3J1Q6mj00P6M7j25L7Qk9jP1r0k8Q5n5L1M4j06J6J42j57J4J11o1Ml5o9M4
3022f6L8K7m8P2jj18J11J0q0P9m7l4Q1J2j9LP6p9n2K3PkL8l0m4K4Ln2J09J1q8
3053c6L1J6r3P9J0n6j1M2J4J7k7Oj9Q0m2K4j0o4M4J6m6j7J4PL6j4n0j0L3L7J2
3084B3j8K3n5j1M2o9R2l9k6L5j8JK9k3N8n3J7o3O5J8m1j3O1p7OJ20j15J6j0L6
3114A1m5O4rj04O6k5O7lk4j6J3jqR4n6m2J8J8o8M7p6N4K2Pk3N3m1L0l0j1N1n5
$$ y = [57, -12, -163, 86, 97, -189, -29, 145, -140, -25, 54, -170, 57, 141, -84, -37, 77, -65, 53, 27, -97, 10, 27, 52, -30, 67, -67, -99, 136, -65, -103, 77, 18, -61, 26, -70, -99, 140, 52, -105, 78, -5, -85, 37, -2, -95, -20, 76, -70, 35, 56, -93, 18, 102, -40, 54, 74, -31, -50, 1, -3, -62, 127, -40, -113, 53, 25, -59, 69, 3, -74, 82, 97, -80, 7, -33, -22, 64, 60, -40, 36, 83, -42, -5, 3, -26, -27, 44, -46, -74, 11, -44, -13, 31, -75, -59, 83, -74, -60, 51, -10, -6, -41, -110, -66, -28, -1, -49, 23, 22, -96, 15, 25, -55, 24, -23, -57, 24, 36, 17, 20, 96, 17, -35, -12, -5, -7, 31, 1, -43, -19, -16, -68, 41, 52, -36, -5, 11, -82, -3, 7, -49, -60, -18, -4, 13, -14, -8, -27, 53, 11, 35, 25, -39, 5, 21, -25, -42, -28, -21, 15, 1, -49, -59, -26, 11, 23, 5, 28, -27, -38, 4, -65, 27, -12, -38, -3, -21, -20, 9, -14, 44, -9, 8, -55, 10, 28, -13, -26, 35, -42, -36, 84, -31, -15, -25, 11, -34, 30, 21, -83, -17, -42, 25, 22, -2, -18, -5, -6, -14, 80, 24, -18, 0, 18, -50, -3, -79, -25, -3, 4, -19, 34, -7, 23, -7, -18, 33, -22]
3146b2l1K9l0P6lr2P0j3M8Pl0o5K3P5p0j9L2J9n8P6j06M2O7l6MOK2o5K1l7N6O3
3178E9k8o8J9L4m1k4M1J1K5K2r3MM7n9P1N5j20P8Rn7kJ1L0m9K4J7j9J4n8j4PM6
3210hK8m4k5N1k8O2p5J27j32J6M1LJ6J1M9j58Q3J7k5N5p3j01R8jJ8K3j1j3K1O1
3240H6j05l1K1Mn3R2n9lO1m6Rj4N1m2R1p5q5R9J3n1L7k6n7R8KM0j09J37j56M4
3270b7L8m9j7J55j16J2L7p3P7L5r2q9J59mr6J05n8L3L7j4j30J01M4q7mJ48j72
3297d7L5P3j16L6R2j07RL4q5Q7K9kq6P1J3j8J0jn7j5J21j44M0j5j2R2J9r2k9J55
3327I0r2M2J2r8N5P8l7p9O8p6K5l0L2r9J82M2j90J02n4j7M1J36k72P8J34j15O7
3354B5J4j21Q7R4p9j11N0N2n5J20k7r9J40lj47J2N4j9P5n9o4O5P1j72J07RK1k1
$$ y = [-22, -53, -24, -54, 22, 19, -73, -3, -16, 32, 39, 9, -56, -33, 42, -28, -47, -15, 4, -54, 22, -84, -42, 25, -11, -7, -1, 21, -44, -23, -60, -4, 59, 31, -37, -18, 16, -25, -49, -8, 3, 28, 50, -43, -39, 8, -51, 20, 75, -45, 33, 42, -15, -17, -6, 24, -25, -1, 16, -3, 11, -47, -61, -54, -8, 20, -24, -49, 2, -26, 36, -39, 88, -44, -28, 13, 16, 32, 43, 92, -66, 17, 34, 9, 64, -9, -110, -12, -13, 5, 28, 17, 4, 25, 86, -19, -50, -29, -25, -78, 14, -45, -48, 13, -33, -24, -38, 13, -29, 62, -13, -98, 1, 14, -37, 0, -26, -83, 15, 17, 57, -52, 85, -71, -27, 11, -38, -55, 100, -16, -4, 33, -40, 37, 72, -20, -109, 50, 46, -50, 55, -3, 30, 67, 53, -77, 24, 68, -19, -23, 125, -47, -12, 61, -55, -19, 73, -34, -25, 9, -76, 11, 40, 38, -48, 23, 36, 18, 28, 27, -30, -45, 76, -68, -28, -43, -55, 37, 56, -36, -65, 90, -2, 40, 52, -46, 9, 87, 50, -29, 39, -37, -12, -42, -10, -109, 73, 115, -75, 27, -27, -44, -3, 133, -139, -61, 73, -42, 25, 39, -82, 5, 99, 20, -91, -41, 11, -44, 76, 49, -50, 90, 87, -60, -48, 6, -13, 62, 3, -61, 4, 75, -97, 10, 19, 40, 19]
3382A9P9j01l6J53j52P0oq5N7Ok5j5P2J6l4L1p1j5Q6o8PP4r2K2P8n4n2nJ09q6
3412a8M1M6k37J43J56j81Q2pj11J83N6k14J1J00m4j5J16j84M3J27j00j15J02L4
3436A4m5J21j25q5J88qj11J31ok02J67M3j96N4J37j33J04Jj27N5K01k63O2J25
3460A02p5k5J22j48l1J13o6j57K25n3j00J58p7r3K10n5r1O2kj23J41L8j43J08
3484D0j1p3M2N3j18Q7L6j07PJ17j04K3J09j32n2Q1J9o4N2n9pR5L5j22J00j0r7
3511f0J11m5p5P8J06j22K3j9j18J12N8l9PN2j27N2L5m7m4J06r4j7R9J1q0N0l1
3538a8m3Q9pk1J4J1p3K8K6m6nO1mN1o7j9R6j4j24J68j21k6M4P6q7QO0k4j8rm5
3569c9%P0r1Q1Lj4J3Rr0L5P0j0m3o1P6ooj9N0k7j5Qo2N6Ok6Q7j10j7Q4M5m3q3
$$ y = [19, 98, -3, -39, 114, -38, 32, 26, -59, -2, 4, -21, -36, 36, 52, 18, 49, -22, -37, 49, -19, -12, 62, -30, -8, 70, 16, -36, -41, 68, -18, 23, 69, -168, -25, 131, -50, 32, 25, -86, 97, 153, -61, -50, 50, 6, -9, 107, -77, -34, 93, -7, -122, -20, 14, -31, 90, -35, -120, 68, 60, -51, 80, 74, -128, 39, 82, -114, -60, 77, -56, 48, 49, -78, -23, 178, -85, -23, 102, 27, 2, 124, -24, -55, 58, -8, -165, 60, 7, -93, 65, -12, -105, 105, 50, -41, 21, 19, -104, 37, 75, -68, 40, 29, -44, -2, 51, -67, 20, 56, -51, -44, 73, -31, -8, 101, -31, -83, -2, 17, -47, 5, -54, -61, 34, 69, -53, 47, 37, -60, 51, 6, -69, 9, 115, -7, 16, -3, -121, -9, 49, 10, 17, 69, -58, -6, 29, -18, -62, 44, -50, -67, 32, 43, -37, 13, -18, -61, 28, 21, 0, 14, 25, -48, -20, 6, -40, -45, 16, 12, 63, -4, -23, 73, 59, -65, 103, -18, -44, 0, 76, -11, -3, 57, 33, 15, 6, -39, -39, 31, -60, 21, 24, 10, 23, 32, -58, -23, 47, 37, -6, -67, 9, 3, -3, -22, 28, 1, -14, -6, -68, -12, -6, -32, 55, -55, -72, 12, 57, 14, -69]
3602f9qK1J10r0JK7P1p4Mo1K3P2m8L1ol5L0j10J33j3n1L2M5p2N6j2l4N9l0P6k4
3633E4r2O4j8n3o7P8L3j1M4M5m6j7ol4J5J8n0oN3J4J6k3ml7k0N4rL0K0m9Ml%K4
3667B1K4o4L1n9J01m8M7k9j3ko0K9N0n1J0L6j0O4n7k2m3J4M3m1l7J04j08J30l7
3696B3o0J00q9pJ5J23r5l9l0P8Q6j07J4pL8j6m0N5lm5l6N4k1lJ4m8L9QJ0Nl3M6
3728B9m8l3P3l9L3Ok9LJ6K4j09O4qNM3L1k1L3m8q0O1m2O7m1j1l2P9m7k1J07j16
3759e1P0jn7O3pL4m6nL1j2J0n4J1j3LL2qJ9K5q4O7K9o2O3l9l9J6K2pk4%L6m4K3
3793Aqo3R4%Rk4l5L8n1l5N0M4qMj6k1M3p3Q9k3J9lr3O8m0K1rM9k0l6O3m1L4m7
3827b0K5o5QkKN8Qn3K3L0l7J01j00L7K5l5O3p0k2J10r2j4O5n5l1Nj5L4Mo8K8N1
$$ y = [-69, -77, -56, 54, -36, -35, -8, 63, -11, -7, -68, -45, 27, -21, 10, 4, -31, -1, -111, 22, 9, -42, -10, 35, -37, 19, 7, -27, 32, 2, 78, 54, -38, 26, 8, -45, -112, -34, -1, -12, 32, 77, 31, 14, 8, -26, -11, 7, -43, -49, 4, 18, 34, 11, 7, -30, -50, 4, -5, 25, 45, -4, 0, -3, -3, 21, 45, -19, 12, -47, 54, 6, 53, 24, 11, 9, -51, -22, 28, -23, -13, 23, 13, 77, 20, -2, -45, -31, 12, -29, -66, 38, -70, 60, 23, -37, 63, -26, -33, -18, 105, 10, -29, -59, 19, 105, -2, 12, 5, 43, 27, -13, 42, 39, -6, -42, 12, -9, -12, 2, -46, -7, 1, 11, 16, -17, 29, -19, -52, 21, -18, 15, 21, -8, -5, 11, 35, -74, -10, -18, -13, 30, 61, 40, 73, 25, -55, 6, -36, 31, -10, -21, -53, 26, -21, -42, 65, -51, 19, 18, -39, 24, 17, 51, 5, 0, 31, 19, 29, -25, -14, -27, -24, 8, 0, 19, 44, -40, 27, 56, -6, 57, 18, -21, -5, 17, 10, -14, -14, 22, -22, 1, -7, -70, 24, 24, 33, 9, -26, 12, -39, -74, -24, 20, 12, 16, 0, -21, 22, -51, 38, 15, 34, 31, -62, 6, -34, -13, -22, 27, 7, -29, 34, -7, 27, -20, 5, -60, -52, -54, -52, 6, 14, -39, -16, 14, -23, 78, -22, 15, 40, 5, 68, -2, -24, 86, -6, -20, 45, -10, -41, -36, -51, -17, -13, -81, -53, -2]
3859bL2n1j0N2q1%lR2k1m8R5r9L0P1k1m0L6n0j0J29j30J1k7P5o6j1L4NK0p3N8
3890cL0l7K9m6lN1J4l5m8K1M8o8Q2j2K9l2nrK1J4p4rN4m4L8Jj5J0%Qn1O9n5M4
3924A7K9Mk4l8l9N6K1p4P5rL1n4k8M2L4m3N9q3m6J08m9J2j3K1M8qk2p6M3j2K0
3955BP7p2J7k6L9n%l7K0M%o0O5rl7N7Pn8j9P6j02O6j9J4p2M8P6q6M2L8j3n8K9
3988DlK3M4j03J7K8j4L7m4qK2J0OmNj8O3qj14R3J6q7lM2L1M9o8l8lJ01p6k2K2
4021@m3J9O6j11J5j1O0L2M4l7o1J3N7k4j6J8kJ4j4q3O8j6k8rO1p9K6Q8p1L7j8
4052eJ3l0N9n7o9J38Mj9l6oM5m8rk1L5P1j02l2R0J1k6M2J0p1P0p9NN0l0l5L4J9
4084B1n5Qj3J1M2l6M1oL6m5J1k0m3O5m6J4NJ8%NJ4j23Q6ml6M1M7l9N1pl0k3jj
$$ y = [-2, 30, -21, -31, 21, -60, -60, -63, 29, 8, -40, 55, -44, -14, 57, 36, -4, 32, -18, -28, 101, -29, -18, -45, 30, -36, -47, -13, -8, 12, -61, -3, 27, -10, 19, -27, -30, 21, 35, 0, -48, -27, 21, -47, 35, 23, 52, 20, 15, 6, 27, 41, -33, -42, 12, -32, 6, 7, -8, 2, 2, 10, -41, 28, -27, 17, 46, 50, 26, -12, -51, 5, 26, -48, 27, 18, 49, -5, -33, 9, 43, 0, 59, -24, -70, 38, -11, 1, -12, 9, 57, 49, 27, -49, -6, -18, 2, 79, 7, 24, -2, 37, 32, 32, -5, 15, 19, 19, -41, 24, 15, -22, 35, 42, -16, -35, 41, -61, 5, -14, 0, -72, -24, 52, -34, 8, 46, 33, -25, 4, 1, 24, 68, -35, -18, 10, -4, 33, -11, -19, 3, 13, 19, 15, 20, 2, 65, 57, -57, 36, 52, -35, -38, 4, 35, 84, 16, -22, -25, 76, 0, -22, 0, -43, -24, 42, -69, -54, -65, -5, 27, 71, 34, -27, -14, 43, 19, 3, 21, 19, 33, 19, -64, 4, -12, -40, -49, 12, -67, -41, 47, -24, 13, -5, 8, -22, 37, -20, -89, 49, 53, 34, -2, -8, 37, -11, -20, -41, -6, 65, -37, -69, 21, 32, 6, 48, 58, -13, 57, -22, -17, 33, 3, -32, 2, 21, -34, -26, -39, -28, 14, -22, 19, 13, 49, 4, 15, -5, -48, 17, -29, -15, -10, 8, 8, 13, 27, -96, -10, -14, -50, -9, 38, -1, 50, 43, 13, -10, -11, -12]
4118a2N1k0m9k1K7O7m9J4J5n4PP0l9J1Nk5lj5o0J26o9J6K8J4o4O3qJ4m9K9M6j38
4150g2J01L4q5K7M8m8l8L8M2n1j7oN2J5j12O1K3P0k0p4J1M9l5j1l3P2l2OK6o3
4180b2M2J0M5q0lO5q4K7j2KK5L1p1J8K1o8K8J7l9K7Q3j8n4K2j00Q9N0q1K1L1m
4211A8J6Lm2n6M2K4l4J5K4m8RQ1n2K1L3p6K9K5j59O9J24r6J7L6m7l1L4P3o1N8
4241D9j6j3k5m5J5R9p3J4j2L5o1K0N0m6kR3r2M7j1Mo2M7l7QQ3l6q6P0J7j0J3p9
4273d2J5O4J3l1P2j41J1O7j4%o8M4pQL4nj5M5q2RPj6N1j0Oq6P2j5N2j5ok2K0m
4307A1m9N7k6K8l2rn5O1P5n8%lj0M6jl6l3j8kM5lJ7LM5j10N0L3j9l6L1l0J6K2
4340A0qk0K0rk2P8l1k0J0K5n8P0k6NK0J9o0NP0r2M6O8r4J4k2K9n5R1m5j00J09
$$ y = [-12, 39, 19, -30, -51, -24, 43, -6, 8, 23, -31, -24, 46, 7, 18, 23, -2, -5, -20, -80, 46, -23, -7, 21, 35, -29, 34, 26, 40, -9, 20, 66, -72, 29, 63, -22, 5, 53, 5, -33, 5, 47, -4, -21, -27, 25, 40, -72, -11, 12, 82, 62, -12, -1, 48, 13, 2, -31, 41, 9, 15, 41, -22, 20, 30, 75, -5, -8, 57, -27, 0, -12, -10, 15, 46, -25, -7, 14, -54, -26, -9, -48, -21, 62, 44, -10, 12, -88, 1, 51, -30, -9, 22, 18, 34, 37, -5, -61, -19, 5, -29, -14, 10, -38, -29, 52, 0, 21, 54, -22, 7, 32, -127, -58, 66, -30, -13, 23, -24, -55, -21, 52, -9, 49, 33, 20, -5, -50, -35, 64, -9, 5, -7, 28, -33, -13, 37, -9, -11, 82, -10, 37, 26, 30, -32, 15, -22, -14, 69, 33, -53, 17, 34, 24, 37, -42, -27, 37, 50, 19, 91, -50, -39, 28, 14, 14, -54, -10, -17, -9, 25, 20, 5, 50, -32, -23, -16, -32, 19, 9, 15, -71, 1, -14, 38, 23, 17, -5, 15, 11, -38, 19, -7, 21, -11, -20, -75, -14, 61, 3, 3, 0, -10, 36, 35, -1, -34, -52, -54, -9, -12, 5, 8, 53, -57, -7, 26, 7, -29, 2, -28, -12, 10, 2, -18, 2, -7, -29, 49, 18, -2, 8, 33, -25, 45, 19, 24, 44, 63, 3, 8, 78, -14, 32, 100, 6, 20, -2, 27, -28, 63, 18, -82, 27]
4371B7n5jl7J02l9j2qRl4P5n0J9O9j28O8J04j24l1O2n4k7R8l9n6P0k7N5j13J48
4400G1k7l8m6nM0K8n8jL2nm9M8N6r5K9l0K3J1LOJ8m5pLP5m6J4kj9Q4j03J0m2N4
4434a3l9K2MQ4l2kL0m2k3O0p5N1l9Lk7L7J4m1mk2P1L1K4j06J2Ok4L7N9l2q8O5
4466AKn0J2O2L1j5l6k9K4K4o4J1J6M2k0l6N7p8O4Q4j36mR4j1j6k8N3n7j6l6M7
4497hJ3j2j3L9J6q0O6K9r9J3L3Pj2M0j00N1l0jO2L9m0Rj7qN5r7K1k4P3k0n5O5
4529A5mll9P0l4N1k5j15N1Q9j03P2L1r2kN2k1LJ6m1J1M2l2l6K4K4J3k1j6j8N4
4560A6J0p9pJ9L1J2k0j9RP9ok9Jl3k9N3N0k6ln5rj0R3j0qm0J2k8J2K6Opk5pJ1
4595a0M2o0j0J2L6KK5L0n7l4M5MJ7l5J1m8Q5n5OM5l1l2M5k6j1ooqRJLk0k0O3q7
$$ y = [27, -28, -29, -66, 36, -3, -15, -23, -14, -48, 27, -23, -4, 65, -63, 5, 109, -15, -46, 16, -38, -65, 33, -6, -62, 8, -19, 36, -77, 71, 44, 6, -40, -45, -5, 23, -35, -36, -4, -9, -58, -10, 46, -49, -20, -50, -27, -16, -13, -7, 11, -34, -41, -38, 37, -9, 5, 3, -16, 68, -35, -25, -67, -13, -52, -30, -26, 58, 26, 24, 54, 12, -11, 49, -26, 25, -14, -11, -38, -1, 13, -28, -32, -54, 17, 48, 72, -34, -22, -16, -40, -3, 56, 24, -64, 1, 3, -47, -35, 27, 58, 43, 7, -22, 2, 26, -38, -27, -11, 31, 11, -25, 32, -46, 18, 102, -34, -38, 56, 45, 29, 1, 54, -3, -19, -55, -8, 5, -7, -20, 19, 35, -45, 21, 50, -49, -36, -3, 4, -8, 32, -68, -17, -47, -48, 14, 53, 13, 22, 5, -3, 52, -45, -24, -48, 25, 5, -50, 15, 11, 8, -31, 39, 5, 56, 31, -84, -33, 56, -47, 25, 56, -36, -38, 14, -7, -4, 12, -29, -18, 24, -8, -44, -20, 4, 17, -4, -20, -38, 16, 26, -53, -60, -41, -10, 2, -18, -37, -28, 51, 45, 16, 17, -16, -45, 8, 58, 32, 29, -26, -35, -45, 48, 38, 30, -10, 2, -26, -14, 12, 18, 11, -14, -21, -10, 32, -28, -38, -26, 10, 12, 37, 67, 10, -24, 21, 25, 42, 7, 18, -30, 55, 0, 6, 51, 20, -12, 33, 7, -4, -10, -16, -24, -15, -14, -11, -31, -51, 12, -75]
4630g5R9m3l3O5Qj41J16Rr7J70j45M2OOK9m0K3p8K9K2K4o4J40l4j2k6k9JM3k0
4660em7N5j1M1l0K2l4K3M1r2ON1m4P9rn7M7K8k2k7l8J7J8L4n5N9r6P8p2J0poR3
4693E0l2q1J5J54j48P2m9N6k9O5j04k6K9j7N2rQM3m9K0J6k5m8oJ32l3j21J23o4
4722foN7m6j7P4k2p7O9Mo3O3n2j18J48J2j6l3M5l4k2Q6o0PK4m8OJ5q9J44L3j22
4753d4L0K9j0m6R1n2l3O4k2L1K1k4j09J31k8p7O1J3pK8M6r5RK8n6MQ4q4N6k8j0
4784Ar4J15K7p2P4m7p4J10Nj29Q5jl8M5J5o6NP4p9O3J8q9P3O7j37Q4q1kK4L4J3
4815B3r6P8k4j6JRrrpN1o8J01k0N2j30Q8nl9k8O1J1p5O2m1RM2Q3j52MK4J8K6k0
4848Dk3m6J00Jp0K8j4O2pk5o9Q4p0J8P2k0n1P8r8J5P2n5J4J4M3o1J4m2mN5j5n0
$$ y = [-75, 24, -19, -52, 13, 21, -120, -4, 5, -92, 78, -67, -25, -19, -13, 16, -24, -1, -79, -50, -28, -4, -68, 72, 38, 26, 0, -29, -28, 15, -5, -52, 3, -8, 33, 3, 25, -9, 14, 55, -37, -31, 20, -24, 55, 46, -11, 36, 64, 42, 15, -23, -6, 12, 46, -9, 50, -46, 32, -40, -30, -37, -43, 50, 18, -63, -48, 106, -42, 30, -19, 37, 8, 73, -31, -57, -28, -45, 7, -2, 6, 49, 0, 20, 36, 11, -37, -43, 89, 56, -65, 58, -6, -12, 45, -1, -18, 56, 34, -43, 26, 30, -33, 30, -22, -140, 8, 20, 4, -29, 16, -18, -40, 46, -14, -7, 17, -31, -25, -10, -99, 45, 78, -44, -14, 15, 5, -41, 50, -2, -35, 29, 7, 38, 59, 35, -74, 57, 29, -48, 13, 26, 19, 47, 93, -2, 7, 35, -21, -17, 67, -17, 39, 11, 1, -93, 22, 49, -23, 51, 4, -70, 40, 45, -84, 1, 0, -38, 7, 22, -44, -39, 35, -44, 19, 37, -52, 21, 88, -49, 35, -46, -48, -24, 10, 23, -73, 5, -19, -35, -34, -25, -34, -43, -50, 1, -67, 34, 14, 66, -64, 24, 19, -20, -48, 13, 24, -51, 11, -30, -21, 21, 104, -48, -44, -20, -2, 24, 4, -19, -65, 35, 36, -34, -6, -20, 42, 35, 10, -59, 25, -45, -27, 45, 25, -26, 52, -46, -31, 41, -14, 0, 14, 57, -4, 10, -32, -36, 19, 4, -46]
4880d6J5K6r7J24j6K0j8j2Kl7J4N0n1N5o9l8R0k2pJ5L3n2L1L7j06L4LJ3jO5p6
4911b1K5J2M2q5Q6j50J07j3Oj1M8p7l5O2J7k8L1l5L8m1N8n1K0Q1j51O0j3J2rm
4941a9l0J3P4m0qJ01n0j02N1j3n0Q9l3J4J9rp2L9M0l1m0O0n9O6qk7N0l6O8j13
4971e6O9o5L9M3k5l5P3m2M0o5k5M4N8l9o2N0L9r2L8O7j01J3L1j1KK7nJ4km4J7
5002eL6l3oK9l1m0k5J28q9MJ6J7M0k7m9J6Qll4L6P9p0O3J6l2l3l4%O4j6m5O1o4
5035b3K3PJ4l2p7J01l5J00p0J8K6r2R3p1Pm3O4K1r2Q2l5J8M7m5j5n4N2L5j7n5
5065d8N2k4RJ3j4RK8j8N5n9ml7n1J00Qj9l3j9P9J6m3j9ON6k8rL2Ml6o8L4k9L7
5098b0J4j1j4j5J3L5jRm5pK6o7J13m0o7Q3M8m0O2o0Mp1P0p8N6J4j3M6pK2m1QM4
$$ y = [-46, -31, -5, -102, 22, 6, 26, 8, -4, -2, -39, -25, 25, -26, 29, -40, -78, 12, -10, -17, -2, 31, -21, 10, 47, -59, -25, -22, -9, -10, 55, -21, 4, 16, 58, -27, 59, -91, 16, 3, 9, -2, 46, -31, -66, -4, 13, -15, 16, -19, 19, -22, 36, -15, 5, 86, -65, -5, -18, -6, -15, -19, -49, -36, 38, -2, -10, 91, 41, -61, -10, -23, -73, 16, -17, -3, 16, 7, -65, -26, 14, -17, -57, 3, -56, 10, 2, -25, 25, -11, 57, -56, 13, -52, -13, 30, 5, -30, 43, 1, 41, -24, -49, -5, 53, 14, -48, 2, 41, -51, -13, 54, -47, -34, -3, -14, -12, 15, 10, 24, 22, -22, -5, 31, -2, -8, 21, -10, -50, -75, 53, -36, -32, -16, 1, 41, 14, -35, -19, -11, -14, -48, -12, 67, -3, 60, 76, 44, 11, -23, -23, 41, 25, -20, 41, -23, 0, 7, 21, -11, -88, 13, -22, 78, 8, 26, 52, -40, 53, -18, -11, -54, 10, 31, -61, 21, -14, 4, 51, 6, -9, -63, -11, 24, 7, -48, 4, -20, -11, 2, -12, -3, 25, 7, 62, 3, -1, -38, -89, 11, 19, 0, -33, -52, 27, 43, 0, -19, -13, 43, 15, 6, 38, 42, 6, -62, -28, -57, -20, -6, -17, -31, -46, -33, 2, 1, 10, -35, -42, -16, -83, 30, -10, -77, 6, 54, 14, 76, 16, 20, -51, 19, -59, -3, 11, -2, 44, 37, 59, 18, 26, 70]
5131G0r1L7kl9L4%l4K1k0k9P5L7p7K7j4kJ2K3pk5nk1M1k7j2pN8l9k1L9L6o1mp
5165c4OM1o1rM7J2k2n1J00j0p7R9o1LM4n0QLrM4k6K1j4K2l4K9J2N8r4j8J5O1j7
5198C8m6K2%k2l8K4n2J00Lp0k0P1J9oJ7M6p9oKKO1q4j8JQ5l4n5J23p4N1L4p1k2
5231Bj3N8l8k4L5m8L2j2l9M4K9l0m4O6q3O3O9r2N9O4j38P1l7K9k1J1n5P7kk1m9
5262c7M3K4m1K9J4l3N8l6l9R1n3m6L4l5k6J05M1j41J0M3o8L3N0j7l0Q4m3L6k0
5291C0l2mm8M6J17m3j57J22j0J1o7J00p2K0J0Mm4L7k7j4L9qk4N4p7K6l4L2qJ0
5321a1M0Ok9j8PJN3q8N6M4o6n8Q0n5P0l1N6m1l6j6P4J9p3j0j9kM1P7p1m1j9P7
5353A7m8m2J28l4rK1n7k0J4M0Q5j12%M9n0k8Q3o8J18r4QN2p4M9okrO5n8L6k7m9
$$ y = [70, -21, 16, 14, -25, 9, 9, -25, -4, -24, -53, 22, 59, -18, 9, -5, -7, 5, 28, 21, -4, -9, -30, 11, -16, -28, -35, 23, -16, -37, 2, 38, -23, -27, -34, -28, 13, -48, -57, -10, 2, -20, -71, 29, 19, -58, 41, -20, -17, 27, -23, -15, -12, -21, 23, -3, 18, 4, 26, -8, 21, 33, 91, -3, -21, -6, 55, 38, -8, 14, 14, -8, -46, -22, -74, 26, 29, -41, -61, 10, 29, 23, 40, 86, 7, 1, 3, 5, 66, -18, -36, -35, 50, 16, -39, 84, 10, 61, 95, 24, 2, -11, 47, 9, -15, 20, -28, 4, -8, -47, -3, 26, -4, -48, 18, -65, -2, 67, -25, 34, 98, -40, 31, -6, 23, 2, 13, -42, 35, 33, 12, -37, 6, 30, -11, 18, 32, -1, 57, 21, -18, 73, 20, -26, 8, -27, -53, 52, 93, -48, -38, 5, -63, -30, 20, 3, -27, 57, 14, 50, 30, -2, -6, -54, -8, 109, 66, -91, 31, 21, 32, -35, 65, -7, 13, 23, 27, -17, 20, -7, -21, 18, 10, -14, 40, -37, -11, -45, -13, -21, -11, 29, 35, 6, -12, -5, -4, 49, -39, 17, 61, -5, -63, 17, -38, 32, 1, 57, 16, -20, -36, 38, 57, -16, -26, -45, -47, -6, 71, 0, -41, -60, 17, -31, -73, 55, 21, 12, 33, -24, -44, -30, 10, 95, -17, -17, 32, -18, -46, 37, -31, 87, -7, 1, 53, -21, 28, 22, 20, 11, 76, 18, 54, 27, -22]
5385b2j3M7j6NM5k3N6o0r3L7K5ko4P9K2p1J14p5M9J9qm2j9k9J4N5J7n3l8O9q5
5416f0N2N9jn1M5j32Q3Kk3j9Q3k6q0P5L9o5Q2r6%M6l5O8l5l4M6j6l7k6kJ16p6
5447a8L1m4Jj7L6Kn9P3mKj4k3rL1P1p6K7J1q8J28n5j5J1K3n5M2L4q1N5k8j2N7
5479C7k0M6l8m9N4k7L8J0k6N1j16n8R2p1R4L4m1J7j2MK8l7Ro6Q0K2p1K3N4l7Q
5510C2K4j6m8L6o0M6Jr4J0Q4m8L3J0m8K3N7r4M7j1O2n4J0On1P0K8r1R8m2J0J9
5541D9k2p7J06r4MJ4Kj6L1j8j3Q7oj9p1P0r6P5P0r2j4J7K9K2n0L4k0NM4o1M9l6
5573Ck1J7N6j19R6l0k0Q5r8MM9oK4l7M3r0J07p2j2k5Q9n0o9P6k6M7K7r9J04m6
5603GJM0j8j4o4L0knRN8o9Q3k4p0O8m9J2Q8l1k6k8M0J1n3j9k9L4L4m9J6J7k0j1
$$ y = [-22, -35, 12, -4, 1, 46, 23, 79, 19, -74, -37, -12, -14, -78, 1, 23, -48, 66, -9, 40, 59, 51, 9, -10, -39, -25, 30, 47, -6, -44, 25, -60, -8, 51, 50, -1, 44, -88, -5, -3, -26, -45, 38, 12, -68, 7, 46, -19, 63, -33, -33, 13, -22, 46, 11, -23, 23, 7, -30, -56, -58, 58, -18, 13, -31, -30, -47, -11, -9, -68, 5, 1, 3, -11, -34, -43, -12, 59, -17, 10, 21, -67, 61, 6, -9, 2, 25, -30, 12, 46, -35, 20, -8, -20, 37, 17, 63, 25, -24, 30, 3, 41, 51, 25, 76, -40, -98, -6, -77, 17, 51, 10, 27, 15, 19, 47, 10, 19, -47, 33, 55, -16, 7, 61, 24, 32, 56, 40, -8, 28, -32, 14, 15, -79, -69, 15, -33, 0, 10, -38, -15, 42, -52, -5, -16, 46, -8, 2, 8, -43, 27, 55, -36, 62, 20, 30, 49, 27, -50, 56, -38, -34, -20, -18, -34, -3, -21, -34, 53, 47, 28, -43, 27, -69, 6, 76, -16, -30, -13, 16, 38, -12, 22, 2, 7, 51, -10, 39, 3, -18, -1, 55, -64, 32, 2, -18, 67, -31, -27, 22, 16, 40, 3, 46, -44, 63, -9, -21, -46, 43, -7, -76, 0, -26, 21, 48, -51, 53, 7, 8, 48, 30, 16, -48, -18, -20, -25, -16, 42, -27, 56, 32, -38, 30, -19, -7, 81, 50, 24, -4, 36, 47, -6, -25, -54, -20, 14, -35, -19, -2, -22, -33]
5636c3M0k1m3J08o5M6p3K5N6n7K0M3o2Q6k2j7k1K0j0O3j64J11L5m2Oj9o6nJ05
5665D4l6q0R9o4K6O3n4L8Rr5M0Ol9P3o6lK7n1Q5K3n9K1L2oo8O5n6M1l5NJ4M0o1
5698b2P2r6L7O9q1M6N2n2o3M1kL6k5j7%N2n9J9j9Q4j04K6K3K7j7n0N7r1j5O7J
5729dq9Q1j3Q0k8%n5M3l9J9j0RjM2l4l5L6k4K8m7M5l5M0j2Qj2mL1r6J09q1L4L1
$$ y = [-33, 7, -14, -57, 51, -14, 32, -41, -16, 40, -17, 3, 46, -16, 70, 48, 31, 10, 30, 20, 83, -81, 30, 65, 23, 29, 10, -56, -61, 44, 8, -72, 27, -37, -11, 52, -2, 36, 45, -50, -10, -4, -43, 30, -36, -39, -12, -63, 22, 45, -14, 7, 39, 33, -35, 30, -26, 15, -20, -15, -1, 39, -22, 50, -46, -9, 60, -21, 25, 77, 25, -38, 3, 1, 37, 12, -5, -5, 47, -12, 7, -12, 72, -32, -6, 17, 44, 27, -23, 34, -57, -72, -5, -4, -93, -12, -25, 55, 27, 27, -28, 15, -24, -5, -15, -6, -7, 35, 1, -34, 2, -22, 6, -41, 4, -31, 9, -3, 5, -7, -11, 20, -76, 33, -48, -14, 17]
$$ [...]
8191E6
##END NTUPLES=NMR FID
##END=
