##TITLE=1H_Pr N2
 200.13MHz, CDCl3,
 8 sc
 
 29.5.2025
##JCAMPDX= 6.0         $$ Bruker NMR JCAMP-DX V2.0
##DATA TYPE= NMR FID
##DATA CLASS= NTUPLES
##ORIGIN= UXNMR, Bruker Analytische Messtechnik GmbH
##OWNER= pz
$$ XWIN-NMR		Version 3.5
$$ Thu May 29 16:20:50 2025 Russian Standard Time (UT+4h)  she@DPX200
##.OBSERVE FREQUENCY= 200.1313
##.OBSERVE NUCLEUS= ^1H
##.DELAY= (6, 6)
##.ACQUISITION MODE= SIMULTANEOUS
##.ACQUISITION SCHEME= undefined
##.AVERAGES= 8
##.DIGITISER RES= 18
##SPECTROMETER/DATA SYSTEM= spect
##.PULSE SEQUENCE= zg30
##.SOLVENT NAME= CDCl3
##.SHIFT REFERENCE= (INTERNAL, CDCl3, 0, 14.3821)
##AUDIT TRAIL= $$ (NUMBER, WHEN, WHO, WHERE, WHAT)
$$ ##TITLE= Audit trail, XWIN-NMR		Version 3.5
$$ ##JCAMPDX= 5.01
$$ ##ORIGIN= Bruker BioSpin GmbH
$$ ##OWNER= she
$$ F:/spectra/data/she/nmr/H-C/1/audita.txt
$$ ##AUDIT TRAIL=  $$ (NUMBER, WHEN, WHO, WHERE, WHAT)
(   1,<2025-05-29 16:19:31.21 +0400>,<she>,<DPX200>,
      <created by zg, POWCHK disabled, PULCHK disabled
       configuration hash MD5:
       00 E9 B6 7A A2 85 ED C7 34 08 36 98 17 FE 4E 26
       data hash MD5: 16K
       37 3B F2 E7 F8 86 43 94 18 93 FF C2 EC 35 46 65>)
$$ ##END=
$$ 
$$ hash MD5
$$ 31 C0 98 BF 75 AF F1 20 8A 31 26 5D 2E CE 0C 70
##$RELAX= 
##$RELAX= 
##$RELAX= 
##$RELAX= 
##$RELAX= 
##$RELAX= 
$$ Bruker specific parameters
$$ --------------------------
##$DU= <F:/spectra>
##$EXPNO= 1
##$NAME= <H-C>
##$PROCNO= 1
##$TYPE= <nmr>
##$USER= <she>
##$AMP= (0..31)
100 100 100 100 100 100 100 100 100 100 100 100 100 100 100 100 100 100 
100 100 100 100 100 100 100 100 100 100 100 100 100 100 
##$AQSEQ= 0
##$AQ_mod= 1
##$AUNM= <au_zg>
##$AUTOPOS= <>
##$BF1= 200.13
##$BF2= 200.13
##$BF3= 200.13
##$BF4= 200.13
##$BF5= 200.13
##$BF6= 200.13
##$BF7= 200.13
##$BF8= 200.13
##$BYTORDA= 1
##$CFDGTYP= 0
##$CFRGTYP= 5
##$CHEMSTR= <none>
##$CNST= (0..31)
1 1 145 1 1 1 1 1 1 1 1 1 1 1 1 1 1 1 1 1 1 1 1 1 1 1 1 1 1 1 1 1 
##$CPDPRG= <>
##$CPDPRG1= <>
##$CPDPRG2= <>
##$CPDPRG3= <>
##$CPDPRG4= <mlev>
##$CPDPRG5= <mlev>
##$CPDPRG6= <mlev>
##$CPDPRG7= <mlev>
##$CPDPRG8= <mlev>
##$CPDPRGB= <>
##$CPDPRGT= <>
##$D= (0..31)
0 0.7 0 0 0 0 0 0 0 0 0 0.03 0 0 0 0 0 0 0 0 0 0 0 0 0 0 0 0 0 0 0 0 
##$DATE= 1748521170
##$DBL= (0..7)
120 120 120 120 120 120 120 120 
##$DBP= (0..7)
150 150 150 150 150 150 150 150 
##$DBP07= 0
##$DBPNAM0= <>
##$DBPNAM1= <>
##$DBPNAM2= <>
##$DBPNAM3= <>
##$DBPNAM4= <>
##$DBPNAM5= <>
##$DBPNAM6= <>
##$DBPNAM7= <>
##$DBPOAL= (0..7)
0.5 0.5 0.5 0.5 0.5 0.5 0.5 0.5 
##$DBPOFFS= (0..7)
0 0 0 0 0 0 0 0 
##$DE= 6
##$DECBNUC= <off>
##$DECIM= 32
##$DECNUC= <off>
##$DECSTAT= 4
##$DIGMOD= 1
##$DIGTYP= 9
##$DL= (0..7)
0 120 120 120 120 120 120 120 
##$DP= (0..7)
150 150 150 150 150 150 150 150 
##$DP07= 0
##$DPNAME0= <>
##$DPNAME1= <>
##$DPNAME2= <>
##$DPNAME3= <>
##$DPNAME4= <>
##$DPNAME5= <>
##$DPNAME6= <>
##$DPNAME7= <>
##$DPOAL= (0..7)
0.5 0.5 0.5 0.5 0.5 0.5 0.5 0.5 
##$DPOFFS= (0..7)
0 0 0 0 0 0 0 0 
##$DQDMODE= 0
##$DR= 18
##$DS= 0
##$DSLIST= <SSSSSSSSSSSSSSS>
$$ [...]
##$SUBNAM0= <"">
##$SUBNAM1= <"">
##$SUBNAM2= <"">
##$SUBNAM3= <"">
##$SUBNAM4= <"">
##$SUBNAM5= <"">
##$SUBNAM6= <"">
##$SUBNAM7= <"">
##$SUBNAM8= <"">
##$SUBNAM9= <"">
##$SW= 18.0517328524113
##$SWIBOX= (0..15)
0 0 2 0 0 0 0 0 0 0 0 0 0 0 0 0 
##$SW_h= 3612.71676300578
##$TD= 16384
##$TD0= 1
##$TE= 0
##$TE2= 300
##$TE3= 300
##$TEG= 300
##$TL= (0..7)
0 120 120 120 120 120 120 120 
##$TP= (0..7)
150 150 150 150 150 150 150 150 
##$TP07= 0
##$TPNAME0= <>
##$TPNAME1= <>
##$TPNAME2= <>
##$TPNAME3= <>
##$TPNAME4= <>
##$TPNAME5= <>
##$TPNAME6= <>
##$TPNAME7= <>
##$TPOAL= (0..7)
0.5 0.5 0.5 0.5 0.5 0.5 0.5 0.5 
##$TPOFFS= (0..7)
0 0 0 0 0 0 0 0 
##$TUNHIN= 0
##$TUNHOUT= 0
##$TUNXOUT= 0
##$USERA1= <user>
##$USERA2= <user>
##$USERA3= <user>
##$USERA4= <user>
##$USERA5= <user>
##$V9= 5
##$VALIST= <valist>
##$VCLIST= <CCCCCCCCCCCCCCC>
##$VD= 0
##$VDLIST= <DDDDDDDDDDDDDDD>
##$VPLIST= <PPPPPPPPPPPPPPP>
##$VTLIST= <TTTTTTTTTTTTTTT>
##$WBST= 1024
##$WBSW= 4
##$XGAIN= (0..3)
0 0 0 0 
##$XL= 0
##$YL= 0
##$YMAX_a= 331620
##$YMIN_a= -400762
##$ZGOPTNS= <>
##$ZL1= 120
##$ZL2= 120
##$ZL3= 120
##$ZL4= 120
##$ABSF1= 10
##$ABSF2= 0
##$ABSG= 5
##$ABSL= 3
##$ALPHA= 0
##$AQORDER= 0
##$ASSFAC= 0
##$ASSFACI= 0
##$ASSFACX= 0
##$ASSWID= 0
##$AUNMP= <proc_1d>
##$AZFE= 0.1
##$AZFW= 0.1
##$BCFW= 1
##$BC_mod= 2
##$BYTORDP= 1
##$COROFFS= 0
##$CY= -3
##$DATMOD= 1
##$DC= 2
##$DFILT= <>
##$DTYPP= 0
##$F1P= 0
##$F2P= 0
##$FCOR= 0.5
##$FTSIZE= 0
##$FT_mod= 4
##$GAMMA= 1
##$GB= 0.15
##$INTBC= 1
##$INTSCL= 1
##$ISEN= 128
##$LB= 0.25
##$LEV0= 0
##$LPBIN= 0
##$MAXI= 10000
##$MC2= 0
##$MEAN= 0
##$ME_mod= 0
##$MI= 1.114404
##$NCOEF= 0
##$NC_proc= 0
##$NLEV= 6
##$NOISF1= 3.799351
##$NOISF2= 2.8
##$NSP= 1
##$NTH_PI= 0
##$NZP= 0
##$OFFSET= 14.38212
##$PC= 1
##$PHC0= -1550.628
##$PHC1= 5.792201
##$PH_mod= 1
##$PKNL= yes
##$PPARMOD= 0
##$PSCAL= 0
##$PSIGN= 0
##$REVERSE= no
##$SF= 200.129724274929
##$SI= 16384
##$SIGF1= 3
##$SIGF2= 2
##$SINO= 400
##$SIOLD= 16384
##$SREGLST= <1H.CDCl3>
##$SSB= 0
##$STSI= 0
##$STSR= 0
##$SW_p= 3205.1282051282
##$SYMM= 0
##$S_DEV= 0
##$TDeff= 0
##$TDoff= 0
##$TI= <>
##$TILT= no
##$TM1= 0
##$TM2= 0
##$TOPLEV= 0
##$USERP1= <user>
##$USERP2= <user>
##$USERP3= <user>
##$USERP4= <user>
##$USERP5= <user>
##$WDW= 1
##$XDIM= 8192
##$YMAX_p= 0
##$YMIN_p= 0
$$ End of Bruker specific parameters
$$ ---------------------------------
##NTUPLES= NMR FID
##VAR_NAME=  TIME,          FID/REAL,        FID/IMAG
##SYMBOL=    X,             R,               I
##VAR_TYPE=  INDEPENDENT,   DEPENDENT,       DEPENDENT
##VAR_FORM=  AFFN,          ASDF,            ASDF
##VAR_DIM=   8192,          8192,            8192
##UNITS=     SECONDS,       ARBITRARY UNITS, ARBITRARY UNITS
##FACTOR=    0.0002768,     1,               1
##FIRST=     0,             0,               0
##LAST=      2.2672688,     0,               0
##MIN=       0,             -400762,         0
##MAX=       2.2672688,     331620,          0
$$ Real data points
##PAGE= N=1
##DATA TABLE= (X++(R..R)), XYDATA
0 0 0 0 0 0 0 0 0 0 0 0 0 0 0 0 8 -8 8 -8 8 -16 16 -16 24 -24 29 -32 40 -44 48 -56 64 -74 84 -93 105 -117
36 -117 133 -148 164 -183 203 -226 249 -276 307 -337 370 -408 448 -494 545 -601 663 -732 810
55 810 -901 1004 -1124 1265 -1437 1647 -1914 2259 -2729 3405 -4451 6258 -9975 20577 -112754
70 -112754 -400762 -1564 259209 43071 -102272 18190 85555 20034 -6401 18317 -33421
81 -33421 -31922 50956 60520 5919 -80354 -131307 22973 128385 -51039 -162192 -11999 93033
93 93033 19112 -40109 21164 26358 -39173 38850 101414 -40943 -75022 74262 86206 -29323
105 -29323 -56955 -9091 -7983 -33468 9423 14668 -71535 -50399 36904 11915 -22979 -22184 -21506
118 -21506 52997 92741 -9268 -59355 28723 65594 -18021 -32317 57022 13136 -87223 5077
130 5077 62369 -71418 -88767 35309 39543 -38092 -39633 7562 11956 -2343 18288 20951 5457
143 5457 25078 21124 9379 36783 -47 -53236 9104 51538 -27000 -66958 -179 28114
155 28114 -39971 -51254 20138 7328 -38848 15613 44045 -9902 -9165 33887 24224 -1458 12864
168 12864 25274 -517 -2436 22835 -2761 -32304 -17056 -21591 -20979 12012 -5089 -41059 -8378
181 -8378 23207 -12798 -25944 31515 41256 -13152 8511 55413 -122 -36975 22637 39679
193 39679 -10677 -24122 -2067 -4288 -14064 -2677 -11811 -36142 -13351 10601 -5303 -3105 2969
206 2969 -9700 13107 38767 6171 -21612 17402 53657 12076 -28604 749 9212 -16394
218 -16394 1856 5509 -35324 -27889 13770 6410 -30607 -27326 12217 19122 -166 3361 2647 6019
232 6019 31222 17045 -8490 12526 18761 -1735 961 5443 -11407 -24828 -7150 7646 -25426
245 -25426 -32925 10777 3584 -22066 3714 13435 -777 7907 19039 18485 8593 6045 17498 6158
259 6158 -3087 8067 -6099 -10271 4137 -16548 -22512 -675 -11504 -21216 -4748 3564 -1068
272 -1068 -8702 7979 25554 686 975 30299 12327 -923 15732 7379 -1708 -1921 -7749 -5564
286 -5564 -11913 -15758 -5692 -13422 -11854 -1999 -14745 -2447 13528 -5988 1786 21019 9806
299 9806 7601 12164 11597 11124 -401 4492 8674 -16131 -10956 3553 -17323 -17668 -7153 -13986 -6461
314 -6461 -4608 -8131 4117 2863 4879 13614 5048 11307 15306 1832 11783 11276 -8849 941 4596
329 4596 -10236 -9880 -11792 -9556 -5600 -16901 -9251 -552 -9247 2105 6679 -2504 9966 12961
343 12961 7077 14320 7391 4682 12182 824 -3071 -1097 -8090 -3622 -7758 -16991 -5365 -7352
357 -7352 -13466 -1156 -3390 -5309 3740 1744 7359 11117 3204 11172 14195 5477 7567 2479 -262
372 -262 5720 -5242 -9990 -4236 -13069 -10247 -4094 -12434 -9428 -3199 -1660 3606 -21 2241 11330
387 11330 6963 9211 13072 3316 7143 12130 652 -1555 -1075 -7389 -6554 -5799 -6825 -9928 -13953
402 -13953 -5766 -2137 -7458 1166 3172 -2953 10658 17019 4286 3005 10709 12777 7491 549
416 549 555 -2529 -3470 1801 -9228 -20021 -7377 -1568 -7532 -6182 -5345 -4385 2187 7750 6238 -851
432 -851 6071 19176 10858 1710 8009 4285 -3058 1364 1919 -6391 -11794 -7149 -3296 -9383 -9894 -7813
448 -7813 -11889 2267 16701 -971 -11078 8411 18825 8236 895 7125 9956 5766 8039
461 8039 -477 -14916 -2866 4369 -13917 -12240 92 -9378 -12848 763 4274 -8761 -8804 11420
475 11420 14937 3782 10447 9404 -1393 10007 11475 -4728 -1277 6164 -1193 -7908 -6437 -6073
489 -6073 -16816 -13919 8027 765 -18469 -1250 12460 4259 2694 -397 -719 11995 19063 11836
503 11836 -1901 -637 10944 -4776 -16048 4410 392 -15426 -1728 1452 -13934 -14780 -5769
516 -5769 2291 3471 5564 6535 -5157 4941 26056 3671 -13345 9947 13549 2007 5454 -1055
530 -1055 -12860 -9013 611 -2852 -19023 -10853 9967 -1212 -8925 70 -8095 -1000 20673 8350
544 8350 -4811 7666 14763 7313 -1321 4276 4181 -14785 -4679 15991 -6075 -19500 -4985 -6867
558 -6867 -8746 -2298 -6333 -4522 6781 14469 4143 -13077 2999 20146 3651 5447 15640
571 15640 -4582 -6826 9792 985 -13101 -10669 -2381 -1314 -7442 -4165 -7420 -14849 5653 10700
585 10700 -13352 -1847 21041 8387 1075 8185 4749 -575 3423 10989 3745 -9315 -2057 -2040
599 -2040 -11183 234 -4034 -23423 -5995 13842 -884 -11444 373 10897 3059 -4518 7901
612 7901 10932 4844 14930 8202 -11461 -2670 4244 -5292 -1589 3429 -6319 -14888 -8599 742 -7839
627 -7839 -9217 8213 4179 -5983 9178 8999 -5289 6474 16407 3449 -2181 6400 6441 -4866
641 -4866 -2795 3621 -12034 -14557 4761 -1597 -14403 -1744 1125 -8076 -318 7313 -271 -1905
655 -1905 12342 13561 -1242 3459 12877 -2743 -5341 10015 1156 -11856 -129 3812 -10880
668 -10880 -15244 -4254 -2049 -6579 4543 7411 -7756 -3260 10733 3020 -83 12346 11504 1966
682 1966 3798 5738 -5872 -7918 7057 2499 -14078 -5262 1791 -11926 -9891 3470 -2830 -8956
696 -8956 4240 10040 -2053 -463 13708 6048 -2866 9970 8373 -5755 2837 8508 -5377 -8221
710 -8221 793 -4012 -14037 -5344 3041 -8517 -7269 8824 -226 -9622 5997 8679 -1282 6579
724 6579 14408 4904 -2068 4782 4879 -6950 -2044 8051 -6413 -11014 1837 -6540 -14691 -1803
738 -1803 2376 -4606 -2383 5348 2801 -3629 6676 12203 -2099 2295 15010 1111 -5274 6785
752 6785 1583 -7657 -3465 -705 -6914 -9622 -650 -824 -12172 -1571 7680 -6810 -2430 11723
766 11723 2952 -83 9758 7409 531 1777 7469 1940 -7138 2675 3390 -12235 -5016 2429 -11290
781 -11290 -8032 2976 -2905 -5804 677 4472 937 -832 9169 7798 -1994 8935 10047 -5590
795 -5590 1404 7871 -4286 -5431 -292 -3466 -7882 -7040 -1117 -4670 -9059 3180 2232 -7717 4920
810 4920 8575 -2391 4828 10050 3275 1767 4565 5398 -1228 -4221 3613 -2702 -10899 -156 -2462
825 -2462 -12056 -1785 493 -6500 -1949 2608 2154 962 3094 8258 3082 1162 10578 3400 -4046
840 -4046 6044 2812 -6109 -1639 -1619 -6409 -5837 -3851 -2454 -6350 -4850 3771 -1575 -3634 6893
855 6893 3673 630 8400 5832 1680 4908 4237 1636 -1306 -254 1136 -6696 -6077 1466 -6766 -9424
871 -9424 -398 -2359 -3991 955 732 536 2995 5804 5858 1199 3956 8674 1567 60 3642 -2202
887 -2202 -2227 435 -5410 -6859 -3624 -3198 -4682 -4962 -1069 407 -3440 1675 6587 1243 2337 6704
903 6704 4880 4234 3632 1440 1103 292 536 -1583 -5819 -3721 -2858 -5991 -3998 -3269 -5325 -488 2790
920 2790 256 -796 2108 6475 5423 2198 4851 4502 1981 3482 1383 -2728 -2141 -2547 -4264 -4300
936 -4300 -3855 -3493 -4901 -3921 -67 -1484 -2297 2117 3547 5240 6128 1732 2023 5978 4785 1505 -1101
953 -1101 153 1819 -2956 -4622 -3961 -6197 -4656 -2304 -3531 -2073 -1723 -753 3877 1980 -650 3727
969 3727 6271 6672 4913 1843 2963 1749 -2189 -417 -974 -3471 -2947 -5582 -3998 -872 -6693 -6390
985 -6390 1041 1856 1135 315 1561 6814 4954 1944 3131 1481 4467 6373 -1203 -2114 -31 -4266
1001 -4266 -4524 -3859 -4412 -2015 -4383 -3882 1342 -2297 -2506 2442 1807 5057 5930 1362 4807 6605 1555
1018 1555 450 -1188 -280 1325 -3568 -758 -599 -10840 -7091 1145 -3507 -4403 -277 1273 2981
1033 2981 463 628 3951 2537 6615 6004 -1237 3908 5188 -4187 -768 541 -7051 -4888 -503
1048 -503 -934 -4096 -6357 -1830 -1853 -5074 4588 5551 -1854 5373 7981 -688 1662 4792 3633 2947
1064 2947 666 879 -2600 -5708 673 -2623 -9800 -2620 -1460 -5279 1952 1415 -4529 -181 4145
1079 4145 3153 746 4374 11380 2756 -3823 5877 2590 -7121 911 3387 -4256 -4761 -3770 -4305 -4823
1095 -4823 -2913 -449 -4698 -1397 8678 1349 -3526 7645 4791 -2034 5791 7208 876 1165 3870
1110 3870 -587 -8806 -4124 2895 -5824 -6167 4158 -4410 -10357 796 2316 -2587 1742 5805 3107
1125 3107 931 5726 5834 -2097 1994 7664 -2880 -3263 5708 -2075 -8893 -1841 -1863 -8743 -5071 4308
1141 4308 725 -7213 1339 5891 -4181 104 10535 2610 -936 7964 5818 -2429 -345 3091
1155 3091 -3318 -6465 1793 -168 -7887 -501 802 -10568 -6130 4459 -1065 -2728 8117 7799
1169 7799 -3549 -1173 9148 2759 -3123 7745 6685 -4855 -966 2767 -6378 -7349 778 -1603
1183 -1603 -8076 -1942 3402 -4914 -4747 5057 568 -3292 6875 7680 -958 3678 8443 -206 -4624
1198 -4624 4662 3818 -7703 -2774 6081 -5499 -10170 872 -2175 -8688 -291 3789 -1885 -1178 6250
1213 6250 2992 -3563 5067 8348 -1390 2596 9374 -1931 -5516 3267 -1143 -7878 -1177 2588 -5765
1228 -5765 -8811 1590 214 -8996 1227 8532 -2799 -766 8135 2460 -1072 5536 5768 -473
1242 -473 -542 4405 -829 -6626 1839 682 -10127 -2642 2144 -7514 -4631 4066 -164 -4241 1960
1257 1960 6132 -587 -1258 9678 5562 -4049 5801 6393 -6156 -1517 3857 -3696 -4915 59 -1217
1272 -1217 -6941 -5248 1451 -3640 -4722 6508 2281 -5336 5712 6577 -2916 3093 8780 2282 -2012
1287 -2012 2236 4001 -4718 -4878 4296 -3053 -9184 1110 -1421 -8427 -108 2701 -2766 -604 4051
1302 4051 2866 -787 3203 8322 85 8 8226 -124 -5096 4456 957 -7122 -1852 1023 -4932
1317 -4932 -6841 -1026 1447 -5518 -1726 6228 -1390 -2250 7802 2747 -1088 6483 5087 -760 595
1332 595 3357 -177 -4993 -124 1906 -7216 -4543 2126 -6126 -6055 3673 -279 -3800 2344 4180 229
1348 229 -33 5841 5111 -1146 3635 6075 -3492 -1675 4213 -3025 -5049 574 -2034 -5909 -3546 113
1364 113 -2459 -4564 2346 3118 -3227 2667 6593 -830 1431 7059 1878 -1194 2460 2798 -2078 -2787
1380 -2787 902 -2141 -6708 -683 -638 -7002 -1770 2450 -2826 -1730 3676 2357 28 3139 5828
1395 5828 1775 308 5488 2093 -2989 1817 864 -5178 -2511 561 -3822 -5500 -1385 -387 -3901
1410 -3901 -1649 3009 -390 -626 5671 3057 -882 3909 5213 1041 808 2723 650 -2907 -827
1425 -827 257 -4644 -3757 -108 -3670 -4068 567 -562 -2359 911 3176 1231 301 4288 4564 513
1441 513 2498 4118 -1191 -562 2259 -1608 -3607 -1310 -1463 -3678 -3721 -1373 -2305 -3473 1323 1977 -1589
1458 -1589 1926 4350 1129 1715 3450 2620 2007 1541 1033 -308 -2059 -737 -2206 -4511 -968 -1543
1474 -1543 -4815 -1855 -21 -1031 -985 -277 2408 3055 1510 3457 3130 1752 3220 922 -1339 1825
1490 1825 755 -1884 -1786 -2630 -2672 -3127 -3805 -586 -1028 -2298 620 590 198 3029 1427 1691 4213 2344
1508 2344 2234 2618 859 899 -1088 -2744 -448 -2277 -3060 -821 -2576 -3262 -1999 -3153 237 2050
1524 2050 -656 1667 3361 1634 2794 2004 1346 2982 1388 696 455 -1815 -201 -1644 -4939 -1614
1540 -1614 -1628 -4147 -546 -54 -1824 329 -240 341 2204 2670 4455 2600 340 3354 1748 -1529
1556 -1529 1210 344 -1750 -270 -2724 -3488 -2062 -2846 -1883 -2192 -1974 2109 841 -266 3162 1438
1572 1438 10 3266 2616 2277 3215 1674 236 -2055 -2144 164 -3088 -3603 1052 -1996 -4797 -846
1588 -846 -909 -2094 -326 892 1699 1989 3015 4294 1323 856 2761 -1030 201 4070 -429 -3335
1604 -3335 -365 -2565 -5093 -3537 -787 -408 -2388 -475 1364 -1462 697 3446 329 1549 5398
1619 5398 2514 1176 2885 1475 -1614 -2222 -185 -182 -2879 -768 -666 -5267 -3077 -334 -2736 -1094
1635 -1094 3312 2286 199 1163 3347 1852 180 3438 2837 -990 1293 1859 -2365 -2183 -904 -3188
1651 -3188 -3537 -778 28 -2309 -1951 738 -1361 -2013 3375 3408 799 3830 4100 -210 22 2736 946
1668 946 -1755 105 1229 -3101 -3460 -227 -3077 -4696 -268 -600 -1999 988 2443 -29 -242 2770
1684 2770 2196 -126 3231 5066 145 -537 2079 -1448 -3500 68 -389 -3338 -2391 -146 -2125 -3961
1700 -3961 249 761 -2193 1114 4468 759 1041 4096 1616 -452 1821 2680 -54 -690 1504 -1414
1716 -1414 -4863 -742 -669 -4927 -1225 1443 -2727 -2346 1789 910 -429 1493 4186 1502 -19 4564
1732 4564 2139 -1905 1876 1698 -3446 -998 1023 -2486 -3293 -1186 -1251 -3574 -2208 1920 -1070 -1741
1748 -1741 4336 1907 -1676 3278 4179 -338 874 3657 1318 -1585 -58 1396 -3388 -3467 1113 -2412
1764 -2412 -4471 1064 -991 -4177 241 1757 -542 737 3863 2820 -754 1686 4525 -1062 -674
1779 -674 4692 -650 -3877 915 -949 -4590 -2027 178 -2043 -3514 -96 1339 -3092 -9 4592
1794 4592 -535 52 5410 1404 -727 3730 2187 -1352 -676 1666 -1035 -4758 -340 1201 -5350
1809 -5350 -2741 1963 -2943 -2975 2432 863 -793 2367 3619 584 -225 3729 2977 -1822 1969 3302
1825 3302 -3625 -1840 1586 -3156 -3810 175 -760 -3601 -2044 1437 -872 -2589 3262 3028 -2090 2532
1841 2532 4791 -840 597 4410 963 -1706 662 938 -3036 -2949 857 -1721 -4562 837 -54 -4992
1857 -4992 -78 3075 -1249 -399 3855 2278 -644 1771 4030 133 -918 3645 -10 -3943 780
1872 780 687 -4486 -1710 821 -2600 -3542 52 746 -2069 -17 3953 132 -929 4189 2137 -1181
1888 -1181 3101 3630 -1016 -668 1885 -733 -3534 -532 703 -3953 -2611 1360 -2331 -3559 1843
1903 1843 1283 -1394 1430 3126 155 140 3966 2559 -1623 1338 2927 -2222 -1934 1672 -1800 -3650
1919 -3650 -150 -826 -3537 -1561 1072 -1237 -2182 2446 2159 -1501 1514 3889 232 635 3517 1157
1935 1157 -1072 866 1338 -2286 -2503 847 -1219 -4145 -523 -46 -3277 -800 1322 -611 -158 2770
1951 2770 2409 -339 1464 3906 286 -770 2989 778 -2725 354 441 -3178 -2165 -300 -1812 -2740
1967 -2740 -193 675 -2247 -462 3217 -75 -637 4151 1973 -270 2528 2580 -368 -358 951 -1 -2498
1984 -2498 -757 393 -3124 -2280 574 -2919 -2332 1723 385 -1187 1107 2539 1213 -29 2237
1999 2237 2710 -361 1083 2440 -1103 -473 1130 -2408 -2920 -306 -747 -2287 -1947 258 -354 -2443
2015 -2443 831 2257 -385 1905 3572 -173 956 2939 309 -433 700 680 -936 -1823 417 -771
2031 -771 -3979 -844 9 -3442 -653 1719 -526 456 1554 730 518 1296 2611 1416 188 2547
2047 2547 897 -2492 430 484 -2734 -1509 -374 -1635 -1452 -922 -609 -1137 -1473 1567 1229 85 3100
2064 3100 2275 -554 1399 1625 242 1013 1249 -108 -1125 -1516 -633 -2060 -2332 345 -996 -2673 739
2081 739 117 -1276 836 1152 480 1000 2198 2421 1159 433 1746 -675 -1761 555 -288 -1491 -357
2098 -357 -1444 -2439 -1580 -1405 -554 -496 128 1528 411 592 2460 585 623 1949 1088 480 1296 752 -284
2117 -284 -1643 -1812 -968 -1887 -1729 453 -1111 -1634 -408 -765 -119 1030 1181 1454 1227 1400 1727 334
2135 334 607 991 -349 -466 397 -1106 -1198 -1079 -2092 -2135 -1560 -428 58 -641 517 936 -329 457 1885
2154 1885 1636 1564 1549 1190 910 -545 -530 -183 -1059 -1029 -879 -1587 -1376 -896 -1612 -950 -723 117 592 580 1722
2175 1722 1533 299 1141 1551 421 1269 1506 151 -500 -809 -971 -1580 -1900 -518 -971 -2067 -201 8
2193 8 -975 209 856 394 1042 1664 1972 1321 718 1279 -67 -819 900 -90 -1288 -140 -882 -2540 -1783
2212 -1783 -837 -587 -927 -172 1358 -38 -237 2203 1136 251 2361 1560 484 1098 859 -161 -1011
2229 -1011 -831 -234 -1830 -1330 462 -2065 -2218 184 -899 -905 1318 1401 475 911 2072 1820 -106 847
2247 847 2118 -669 -256 1611 -1206 -1834 -154 -1500 -2262 -1055 -211 -737 -1298 435 813 -979 1067
2264 1067 2656 55 1148 3229 482 -142 1339 503 -929 -1032 369 -364 -2656 -401 40 -3117
2280 -3117 -1096 1005 -1294 -243 1961 823 189 1003 1812 753 325 2213 1092 -1585 1145 1022
2296 1022 -2763 -1121 570 -1724 -2134 -224 -424 -1603 -950 1189 18 -881 2386 2004 -965 1877
2312 1877 2452 -472 251 1676 -16 -685 -24 7 -2021 -1968 383 -1515 -2840 704 375 -2209 744
2329 744 1589 -227 499 2077 1355 -96 1088 2645 -271 -1258 1831 -371 -2709 107 -210 -2605
2345 -2605 -1360 5 -1148 -1504 338 854 -1008 441 2719 266 -231 2864 888 -736 1685 1418
2361 1418 -986 -747 492 -849 -2657 -746 450 -2404 -1258 1014 -1307 -1400 1889 829 -780 1530
2377 1530 2215 125 -165 2071 1399 -1263 720 1566 -1884 -1457 800 -1770 -2472 153 -219 -2105 -665
2394 -665 1279 -432 -1322 1912 2152 -524 1302 2727 -142 -111 2057 573 -1037 21 525 -2108
2410 -2108 -1961 412 -1116 -2675 619 341 -2311 -157 1770 -179 -89 2034 1426 -358 976 2332
2426 2332 -312 -486 1800 -198 -2405 290 67 -2387 -1225 470 -980 -1749 101 804 -1368 365
2442 365 2761 42 -399 2655 1112 -681 1233 1728 -480 -847 815 -233 -2461 -429 444 -2326
2458 -2326 -1459 1015 -1083 -1669 1119 924 -475 861 2166 493 -121 2134 1753 -1144 883 1992
2474 1992 -1817 -1428 754 -1249 -2048 -162 -114 -1885 -1382 836 -316 -1480 1784 1915 -871 847
2490 847 2465 -167 59 1917 571 -742 158 662 -1641 -2083 331 -900 -2639 -254 322 -1974
2506 -1974 -139 1414 -429 -19 1553 1454 82 615 2364 512 -767 1624 381 -2164 -72 65
2522 65 -1938 -1067 6 -1077 -1961 -726 742 -733 -681 2029 944 -560 1746 1435 -606 1335 1597
2539 1597 -492 -298 196 -105 -1611 -1085 157 -1739 -1859 782 -987 -1560 981 301 -635 453 1723
2556 1723 1127 163 1154 1595 -297 -295 1243 -848 -909 664 -885 -2231 -670 -534 -1189 -1223 68 499
2574 499 -597 457 1719 -127 438 2067 463 134 1843 651 -178 -145 152 -682 -1397 -555 9 -1671
2592 -1671 -1008 -49 -1551 -640 706 -67 -17 1325 893 727 525 1140 602 -308 865 948 -914 -291 230
2611 230 -1534 -1477 -722 -926 -766 -344 -272 -119 -526 738 566 219 1491 1584 307 988 983 218 198 -310 -509
2632 -509 -811 -750 -286 -1241 -1532 -358 -920 -1274 -80 620 416 663 562 700 527 353 1341 1070 439 655
2652 655 -159 -493 -140 -734 -1018 -496 -842 -888 -546 -477 -228 -390 16 868 502 1070 1571 850 422 528 -26
2673 -26 288 326 -75 -186 -535 -1050 -942 -1151 -602 -724 -984 -103 149 -277 460 597 325 741 818 946 1222
2694 1222 854 365 220 -522 -375 -409 -743 -189 -778 -1037 -516 -842 -798 150 86 597 526 665 1166 694 461
2715 461 1143 268 348 922 -132 -206 -263 -1222 -989 -774 -941 -476 -343 -527 -154 -702 -21 598 106 612 1438
2736 1438 495 698 947 118 314 -78 62 -124 -774 -319 -579 -1232 -965 -484 -1211 -337 391 50 592 739
2756 739 297 603 710 933 934 391 870 509 -893 -26 -149 -1376 -668 -525 -930 -362 -833 -481 -293 -436
2776 -436 975 720 108 1238 1193 267 871 637 137 400 349 -120 -145 -567 -418 -962 -1362 31 -584 -1226
2796 -1226 509 163 -595 507 646 225 653 811 1195 418 125 889 -286 -645 523 -776 -1206 -283
2814 -283 -1022 -1346 -584 -406 -620 -508 321 769 -64 427 1480 288 350 1564 289 -113 507 222 -525
2833 -525 -569 -385 -660 -1393 -717 25 -1299 -646 605 -483 128 1053 564 257 1116 1094 381 63 1261
2852 1261 628 -921 72 355 -1205 -836 -2 -1103 -1056 -235 -334 -817 -222 591 347 -51 1306 1110 -327
2871 -327 934 1568 -274 -70 1089 -169 -967 -46 -5 -1445 -1038 358 -732 -1449 207 174 -958 143
2889 143 1131 20 351 1424 870 -88 684 1284 -131 -585 813 -613 -1436 80 -481 -1717 -547
2906 -547 234 -578 -977 446 856 -500 353 1413 398 58 1570 448 -582 703 739 -731 -649 184
2924 184 -573 -1716 -577 263 -1475 -499 562 -693 -644 1164 707 -115 951 1681 348 -82 1232
2941 1232 759 -1023 270 752 -1387 -613 256 -1062 -1393 -51 306 -896 -329 839 88 -544 1447
2958 1447 907 -440 1209 1366 -215 -20 1047 240 -886 -171 215 -1183 -1306 334 -707 -1338 448
2975 448 111 -1327 180 1534 122 107 1101 1148 -31 424 1228 -314 -507 1201 -542 -1701 74
2992 74 -200 -1445 -823 102 -210 -984 135 662 -357 76 1737 -138 -116 1885 594 -693 876 507
3010 507 -346 -363 87 -508 -1260 -196 204 -1576 -748 874 -966 -1015 1083 794 92 829 1192 385 135
3029 135 715 733 -734 459 1091 -1329 -623 605 -1001 -1549 249 -321 -862 -400 666 -43 -786 1056
3047 1056 985 -317 1079 1788 -300 91 1156 -381 -650 -106 -126 -1226 -1141 260 -499 -1718 127 154
3065 154 -1181 228 1126 -224 441 1445 335 -76 428 1122 59 -384 1074 167 -1373 -55 27
3082 27 -1550 -181 229 -926 -845 234 433 -668 60 1437 382 -138 1782 918 -620 848 625
3099 625 -694 -301 225 -400 -1277 -596 -204 -1654 -733 444 -389 -646 992 509 -431 635 1275 21
3117 21 277 1343 698 -678 57 867 -1040 -923 410 -795 -1247 241 -299 -1150 -340 410 -556 -408
3135 -408 1125 1289 -99 474 1146 -385 93 1258 -16 -426 54 121 -896 -719 191 -793 -1392 51
3153 51 591 -816 151 1009 -331 -141 902 929 295 718 1380 143 -842 638 135 -900 217 212 -1187
3172 -1187 -751 38 -694 -1013 -44 132 -467 56 1237 165 -151 1239 642 -264 905 866 -250 -278 237
3191 237 -322 -1340 -429 32 -743 -736 410 -507 -903 492 249 -151 634 867 464 321 876 690 -299 165
3211 165 575 -726 -342 481 -748 -1312 -412 -502 -858 -446 374 136 -314 179 881 -183 179 1148 101
3230 101 348 907 326 -113 -88 -96 -459 -677 -155 -262 -1013 -391 186 -1111 -208 500 50 178 758 471 359
3251 359 210 481 355 -114 361 518 -517 -298 -64 -885 -650 -239 -822 -521 -149 -75 -8 -292 490 596
3271 596 -37 922 889 -74 486 482 -309 4 52 -93 -145 -564 -352 -318 -790 -395 -369 -446 -18 279 -39 493 429
3294 429 390 494 435 773 400 -52 350 -62 -551 -32 -461 -430 -72 -679 -577 -86 -497 236 -116 -277 579
3315 579 404 113 407 546 348 667 193 11 256 -191 -200 -153 -918 -499 -110 -733 -136 23 -341 44 -61
3336 -61 341 355 167 823 496 61 626 484 2 221 -137 -310 -332 -405 -408 -549 -816 -292 -492 -436 560 144
3358 144 -88 605 810 280 615 429 507 318 282 445 -281 -244 24 -650 -891 70 -306 -672 -413 -100 -208
3379 -208 -108 -7 294 225 372 724 202 245 1127 392 -152 259 53 -213 -351 -296 -570 -921 -84 -66 -726
3400 -726 42 302 -250 107 697 471 285 525 565 293 210 636 268 -864 -75 -189 -805 -446 -74 -530
3420 -530 -639 -320 -136 -89 20 534 150 -77 974 694 -111 563 736 -155 0 29 -219 -529 -378 -85
3440 -85 -798 -582 181 -723 -968 474 410 -324 226 546 182 310 800 450 -146 270 660 -281 -447 471
3460 471 -430 -960 -203 -648 -702 -478 75 -166 -369 367 642 -176 240 1290 59 93 818 86 -64 402
3480 402 186 -629 -211 106 -372 -1201 -267 66 -1163 -453 738 -362 -136 830 170 -56 671 1030 60
3499 60 -113 817 546 -700 256 342 -884 -544 297 -992 -717 128 -55 -615 -230 715 -144 -343 917
3518 917 749 -308 743 1034 -206 -244 810 -140 -505 -119 67 -714 -732 132 -339 -1020 508 463 -679
3537 -679 274 891 -176 1 1076 690 -53 176 878 75 -381 757 -237 -1087 463 1 -987 -336 530
3556 530 -360 -626 218 500 -189 121 1199 319 -83 1186 465 -719 507 469 -515 -171 399 -372 -1274
3575 -1274 -291 211 -844 -490 711 -399 -670 626 309 40 651 1153 388 -121 628 616 -815 126
3593 126 575 -786 -507 468 -407 -984 -177 -52 -606 -267 487 56 -316 722 714 -462 312 1099 -220
3612 -220 -124 803 93 -615 -158 247 -744 -1016 241 -32 -942 179 153 -669 -166 806 124 40 841 802 23
3633 23 209 764 -158 -306 456 273 -1022 34 261 -1047 -591 54 -250 -820 181 573 -313 -6 1082
3652 1082 403 -332 1053 659 -329 373 532 -450 -444 23 20 -902 -449 434 -824 -861 409 -187 -586 468
3672 468 693 176 523 1021 290 -191 418 583 -326 138 499 -615 -589 84 -534 -776 -257 1 -302 -319
3692 -319 220 115 -390 451 411 -6 508 888 -29 -29 633 173 -376 -393 115 -370 -459 85 -369 -1045 -215 332
3714 332 -299 109 436 250 170 394 209 141 221 586 48 -216 411 -57 -750 -158 -4 -887 -576 298 -219
3735 -219 -473 -40 120 29 137 675 407 -5 795 536 -345 113 545 -73 -121 -93 5 -311 -337 -147 -537 -399
3757 -399 425 -223 -351 571 226 -24 74 538 562 326 383 576 24 -166 231 -387 -476 189 -286 -779 -71
3778 -71 -256 -456 -282 112 131 8 272 650 -25 184 586 -16 -264 465 251 -49 15 -63 -329 -394 -183 -209
3800 -209 -403 -433 236 -499 -281 527 -235 244 745 300 406 384 334 204 -365 106 49 -518 -113 73 -619
3821 -619 -488 -220 -523 -141 14 60 21 -17 469 197 -110 468 584 16 252 322 -241 363 -54 -444 -281
3842 -281 -255 -231 -590 -611 -28 -232 -536 72 204 -49 417 278 119 388 291 433 50 63 214 30 -266 -113
3864 -113 -303 -465 -230 -542 -307 -49 -147 284 -84 55 277 217 162 234 387 410 380 44 174 -74 -104 -256
3886 -256 -426 -212 -39 -387 -400 -188 -95 -47 26 122 168 393 179 427 488 143 48 -28 161 -106 -71 -256 -273 -326
3910 -326 -30 -344 -312 -268 -363 -109 -39 -20 137 442 41 225 456 489 356 161 56 419 -467 -267 -254 -118
3932 -118 -369 -366 -315 -449 -162 -396 -128 -216 141 297 158 245 537 201 401 405 107 -81 206 -240 -259 -224 -307
3955 -307 -136 -356 -199 -197 -507 -45 217 -29 145 127 277 218 337 313 362 117 250 -74 -352 -128 -130 -590 -44
3978 -44 -308 -468 -78 -150 5 115 -18 441 471 -29 515 201 39 644 449 -86 -82 167 -246 -109 -324 -61
4000 -61 -387 -660 -199 -399 -228 363 -93 -46 314 382 164 258 337 354 312 35 380 -176 -75 321 -318 -705
4022 -705 -208 -271 -485 -294 -162 -42 -195 -123 501 -96 176 525 -19 31 630 263 -263 206 -25 -136 -184
4043 -184 -215 -217 -448 -243 -96 -712 -394 104 -419 -87 483 83 120 281 427 320 -27 315 39 -366 88
4064 88 244 -586 -181 170 -553 -468 -128 -162 -186 -92 198 303 -20 301 462 -327 408 671 -152 235 130 -106
4086 -106 -170 38 199 -507 -255 72 -121 -543 255 39 -459 251 698 -11 253 512 270 249 206 311 -80
4107 -80 -217 336 -97 -442 -83 -6 -642 -191 -109 -270 -295 199 54 -422 -67 554 147 170 757 372 -498 165
4129 165 59 -275 -53 74 -204 -481 -221 -48 -479 -2 98 -135 72 695 327 146 510 543 -40 80
4149 80 509 102 -243 161 261 -509 -187 18 -317 -399 33 -211 -560 -138 244 -38 -133 537 354 -64 496
4170 496 468 -307 -18 377 -86 -268 97 -54 -650 -500 296 -82 -442 304 48 -320 272 381 -219 20
4190 20 440 40 122 317 482 -150 -500 148 -152 -680 125 -181 -521 -314 -178 -386 -349 28 447 -176 159
4211 159 584 -63 -71 567 9 -140 368 138 -256 -146 90 -244 -708 63 -25 -538 -50 299 -381 -216 513
4232 513 16 147 325 652 25 78 187 196 -269 188 329 -478 -187 131 -630 -321 63 -11 -376 -31 346
4253 346 62 0 389 387 -73 588 748 -337 243 576 -90 -376 13 -161 -373 -477 52 -232 -575 301 54
4274 54 -182 62 329 -256 70 426 193 26 303 217 -214 -393 359 47 -405 68 71 -691 -341 44 -201
4295 -201 -234 257 196 -160 169 517 88 -177 524 151 -282 448 335 -380 -38 287 -228 -413 -86 -88 -314
4316 -314 -401 119 -255 -268 428 226 -143 263 369 -5 184 442 166 -27 -66 366 -206 -387 310 -417 -539
4337 -539 -101 -124 -474 -209 -100 -166 -249 451 462 -117 256 561 104 -76 325 -24 -43 159 136 -474 -307 77
4359 77 -404 -587 -65 58 -272 -144 169 -105 -9 351 177 114 212 460 33 -168 271 100 -394 -258 -111
4380 -111 -499 -225 -237 -313 -326 -246 133 -217 -7 292 241 2 486 183 -244 178 227 68 -156 291 -52 -98
4402 -98 -203 -239 -229 -355 -84 -155 -205 149 206 -234 247 184 231 255 -5 284 97 5 447 117 -97 -34 -247 -50
4426 -50 16 -334 -177 56 -229 -83 -67 58 300 9 141 378 127 -18 264 -78 23 -181 -237 -264 -173 -125
4448 -125 -123 -364 -244 21 -237 -63 318 252 75 243 56 253 133 38 334 -3 126 -198 -63 50 -129
4469 -129 -278 -173 -65 -229 100 -54 -66 164 -28 310 188 -103 148 273 95 226 74 -67 -62 -115 -104 -49
4491 -49 -193 -234 -158 -411 -85 -141 -481 -66 78 -84 35 -124 -18 260 104 -67 289 82 151 148 -195 56
4513 56 -229 -224 8 -598 85 -6 -248 251 -71 -25 308 323 -14 246 -33 198 124 139 107 55 -205 26 18 -447
4537 -447 -60 -216 -376 -77 -106 -103 -90 6 212 201 214 244 89 116 265 -15 -128 46 55 -210 -184 -447 -152 -56
4561 -56 -318 43 -186 -197 133 -27 -106 135 -2 -122 232 378 132 84 196 419 -96 36 176 -321 -558
4582 -558 51 -377 -309 -43 -150 -106 -153 230 365 6 45 290 43 -23 474 270 -117 363 92 -141 55 -159
4604 -159 -103 -369 -123 76 -339 117 233 -151 -59 329 -95 -60 525 305 -205 137 123 166 -568 159 105 -362
4626 -362 -68 -18 -164 -232 106 -228 -400 159 216 -13 155 254 104 -138 312 -30 -124 310 379 -52 -255 -115
4648 -115 136 -393 -318 40 -97 -461 315 79 -458 283 103 -146 173 526 317 40 480 342 -16 -174
4668 -174 235 -228 -317 56 -20 -504 -75 150 -305 -301 59 114 -373 105 513 -205 -68 709 -117 -246 255 99
4690 99 -333 23 -43 -3 -371 117 -96 -486 -82 198 -308 -81 463 217 -251 446 364 32 28 302 -24 -260
4712 -260 171 193 -275 -217 80 -369 -418 88 1 -173 -207 -11 -14 -233 466 148 -105 394 534 -233 136 422
4734 422 -23 -119 138 126 -303 -276 196 -396 -479 147 123 -249 218 437 120 89 332 186 68 72 251 -73 -25
4757 -25 235 -122 -406 116 -28 -406 1 110 -200 -85 169 62 -83 89 596 7 188 562 110 -320
4777 -320 161 309 -145 -55 159 -241 -456 159 161 -518 -179 359 -251 -217 347 66 -108 406 211 -178 107
4798 107 370 59 -194 123 76 -468 17 112 -432 -519 84 -205 -273 26 85 -117 -218 421 282 -40 349 182
4820 182 -71 71 474 -35 -105 17 106 -314 -185 201 -266 -295 169 -52 -263 224 273 -231 -10 371 171
4841 171 78 148 418 -63 -153 301 -116 -467 16 -114 -434 -217 270 -431 -166 183 80 -421 109 320 -18
4862 -18 -31 470 247 -67 345 179 -209 100 122 -114 -390 77 -15 -336 1 143 -178 -160 335 66 -248 220
4884 220 220 -124 -23 478 17 8 178 66 -210 -278 235 -263 -286 33 -169 -415 -81 -14 -145 -47 359 379 -245
4907 -245 375 388 39 116 278 -111 -268 46 86 -366 -250 169 -228 -393 215 19 -256 69 189 -183 -64
4928 -64 297 141 -255 226 473 87 -271 171 0 -433 48 -209 -274 -20 84 -243 9 -52 138 -24 -67
4949 -67 204 22 -8 427 203 -51 156 113 -262 173 0 -169 -313 -69 -161 -191 -270 86 -42 -324 136 -120
4971 -120 -48 303 175 109 196 466 181 -48 111 28 -155 -171 296 -384 -165 -73 -315 -171 108 94 -55 -27 -149
4994 -149 97 141 173 94 174 78 202 99 118 -9 -20 -152 -215 -28 -144 -429 -70 3 -163 -60 363 -136 -9
5017 -9 153 -17 120 122 -12 232 78 8 -19 -234 15 -175 -247 84 -1 -247 -344 -106 -96 95 -9 83 120 58
5041 58 263 84 117 280 149 -226 20 138 -241 -64 -106 -85 17 -315 -287 -4 -331 -125 -5 4 -76 59 216
5064 216 316 307 120 73 124 114 61 -107 48 -109 96 -79 -116 -59 -1 -81 -143 71 -57 106 242 69 29 -22
5088 -22 245 199 197 -17 202 -229 -86 21 -121 -288 -128 -435 -47 -122 -149 52 -69 69 118 -177 286 39
5110 39 1 183 96 144 -107 74 18 -22 -342 -178 -249 -185 39 -84 -217 56 -29 -22 16 347 19 137 97 309
5134 309 -112 100 281 -58 43 5 -118 -251 -254 -185 -255 37 124 -144 -137 131 183 -65 258 181 103 176 150 132 79
5159 79 202 -181 -202 -232 202 -154 -356 -73 -116 -334 -88 121 28 -32 -15 -74 -1 148 264 133 93 278 -47
5182 -47 -86 184 -118 -211 -138 -101 -324 -51 -227 -96 -120 191 175 123 148 107 196 -33 394 220 212 212 82 11 -17 -90
5208 -90 -119 -91 -301 -55 -299 -129 64 69 -52 -85 67 -225 66 98 129 -161 78 133 -248 -98 -102 -342 -172 18
5232 18 -217 -115 -31 -171 -179 -226 282 65 -146 408 174 130 234 350 38 -25 312 12 -93 -26 -238 -1 -112
5255 -112 -12 -229 -375 -39 53 -338 -30 -19 -155 243 260 90 171 180 168 147 -371 144 -27 -198 72 79 -117
5278 -117 -238 -62 -229 1 54 156 137 4 313 278 0 465 235 49 327 230 91 -40 -52 -221 -382 74
5300 74 11 -236 -247 -39 -106 -315 162 53 112 214 348 -57 150 291 242 -122 314 297 -260 -220 -73 -197 -324
5323 -324 -129 62 -187 -27 74 86 -62 68 404 -239 11 553 155 -102 225 156 -41 211 -85 -297 -247
5344 -247 177 139 -395 -33 86 -224 -71 265 -76 -39 492 194 -94 224 396 192 -129 311 -17 -555 -71
5365 -71 182 -301 -429 -131 -332 -214 166 104 -194 16 412 228 -218 399 347 -42 80 205 42 -78 272
5386 272 -54 -199 -95 101 -234 -172 76 -40 -229 -63 193 -240 105 378 -220 -29 187 360 16 -5 328
5407 328 -57 -157 164 -133 -345 90 0 -104 -258 77 -35 -207 -10 565 134 -146 362 22 -139 340
5427 340 94 -159 271 16 -54 -124 91 -86 -506 -176 127 -224 -38 268 -261 -70 349 118 144 146 127 -22
5449 -22 -146 246 172 -302 160 35 -390 -245 -144 -166 -153 21 64 192 -36 207 105 -87 367 233 -149 254
5471 254 216 118 -317 97 -146 -163 -104 66 -173 -387 37 -129 -344 163 55 54 86 57 190 89 169 175 -37 86
5495 86 387 -104 -224 227 29 -340 39 219 -121 -184 -46 -32 -59 -165 238 131 -7 522 165 6 112
5516 112 329 7 -98 246 -88 -50 -200 -36 -272 -29 -47 -116 83 257 -66 -190 184 88 47 142 285 159
5538 159 -18 135 194 -153 -96 169 -225 -87 -54 -113 -219 38 -22 -345 -74 141 -86 40 315 243 65 290
5560 290 149 235 -130 138 33 -309 -153 -10 -92 -349 91 -156 -148 -14 -6 -90 8 184 50 16 178 100 3 90
5584 90 213 -46 -21 336 -14 -350 -265 -128 -150 21 -134 -61 -76 -28 -18 86 -10 175 279 174 169 219 110 17
5608 17 15 32 -360 22 -103 -304 6 -1 -34 -209 158 125 -136 322 246 160 22 289 122 27 106 120 35 21 165
5633 165 -51 -277 79 -167 -210 -249 -188 -129 -99 -33 163 161 193 258 143 146 -101 40 120 50 -146 -253 -27 -76 54
5658 54 -294 -258 -55 -282 41 -5 53 -5 38 112 131 95 202 38 -94 193 212 87 -40 15 -232 44 32 -105
5682 -105 -309 -396 -69 -87 -153 -15 84 -204 -1 247 118 333 113 250 137 43 -89 -112 -322 -41 89 -324
5704 -324 -244 -180 -265 6 -278 -86 8 19 103 352 -140 -3 281 65 251 88 -119 -65 -150 -33 -200 -135 -51
5727 -51 -310 33 -205 4 -24 -36 95 44 127 219 61 -16 148 380 -14 52 121 -125 -210 -128 -127 -359 -147 -54 -221
5752 -221 -63 -92 356 -138 133 350 57 -80 595 169 47 199 -31 -227 -23 -109 -214 -280 -49 -127 -353
5773 -353 -174 142 -239 -339 241 -24 -90 61 198 32 130 80 120 -150 168 65 -245 -128 -125 -187 -112 -84 -379
5796 -379 -311 63 0 105 -167 257 322 -24 118 330 52 -153 236 92 -467 42 -192 -161 -172 176 -131 -197
5818 -197 -10 109 -406 29 118 188 -39 265 145 57 274 321 30 48 229 16 -376 -101 145 -390 -97 -286
5840 -286 25 -22 125 -20 91 -63 227 132 69 168 0 -288 72 206 -324 -78 82 94 -312 -39 -22 -209
5862 -209 -228 174 -358 -237 2 224 75 92 341 244 -31 257 73 -39 29 112 -119 -197 187 -162 -329 105
5884 105 -138 -62 -188 99 210 -242 369 336 163 85 277 114 81 217 8 -136 155 -42 -271 -385 -172
5905 -172 -95 -193 61 53 -204 -45 263 -44 41 340 160 -153 -79 190 82 -61 315 169 -303 15 332 -357
5927 -357 -283 -51 -210 -267 -206 140 -98 -5 373 -4 -349 266 153 -32 362 334 -142 -66 103 116 -249 -68
5949 -68 -52 -419 -219 165 -388 -274 -5 105 -168 34 349 351 206 179 279 -21 121 163 -228 -361 248 -209
5971 -209 -351 85 -218 -290 59 90 94 36 216 391 41 128 486 166 -24 353 251 -78 -156 47 -81 -95 99
5994 99 -6 -322 4 58 -306 -101 186 -73 -5 262 387 -77 173 87 62 -111 133 89 -350 80 235 -353
6016 -353 -118 -5 -104 -235 -217 -75 -95 -213 312 47 -72 150 297 -57 -42 152 173 68 44 -114 -163 -96 90
6039 90 -316 -237 -108 -17 -209 102 257 -190 144 155 56 30 234 251 90 90 385 -72 -42 68 -83 -344 128
6062 128 38 -384 -142 -29 -144 -172 194 78 -142 23 392 57 -162 297 130 -185 18 -53 44 -112 -80 194
6084 194 -108 -333 19 -146 -17 217 -67 -62 174 320 57 213 449 36 -34 94 309 -259 27 -36 -315
6105 -315 -47 -100 -276 -292 -47 -4 -289 -268 109 7 -130 2 265 -39 132 357 129 -39 121 -8 -149
6126 -149 -188 -40 -66 -181 -85 72 -153 74 -20 -143 276 162 -87 32 326 264 201 -15 148 -196 -148 -42
6148 -42 -233 -60 -22 -66 -71 -64 -69 -58 92 41 36 25 109 215 -85 10 260 -138 -196 31 3 129 -37 -129 -236 -377
6174 -377 -142 -78 -234 79 -46 -93 -121 -86 -79 -12 217 -24 288 300 26 252 260 -25 10 -356 -118 159 -157 -218
6198 -218 -113 -250 -185 -57 30 75 99 100 248 -158 166 219 152 279 363 -217 -41 -273 8 -134 -96 -118 -58 -302
6222 -302 126 -9 -89 117 -28 6 102 147 227 131 213 169 -78 80 -93 -181 -68 60 -255 -391 -158 -83 -164 86
6246 86 -251 115 75 -79 193 142 110 84 48 74 128 170 -2 83 91 -162 -56 -219 -64 2 -291 -256 -153 139 178
6271 178 128 -33 -54 -62 5 133 -69 99 19 150 -120 -187 -154 -234 -35 -104 99 -175 17 52 -131 -129 152 9
6295 9 122 431 61 149 96 158 72 -196 73 -106 -395 -311 -251 -129 11 -4 -71 8 -19 63 145 93 162 124 105 -110
6321 -110 -49 -86 306 144 136 -180 31 -271 -136 -191 -183 -323 -174 211 -3 -135 235 172 -19 426 199 176 -48
6344 -48 95 43 -46 -209 -50 -96 -259 1 -148 -303 -165 -198 60 -97 89 -71 65 154 157 149 85 161 -170 61
6368 61 111 -123 107 21 -79 4 -225 -101 -111 -292 63 27 14 58 10 100 14 241 4 212 -53 126 -1 92
6392 92 11 -74 -163 43 -127 -296 -214 -162 -175 -89 21 106 -85 262 182 71 66 305 167 9 241 55 -31 -127 -5
6417 -5 -170 -263 -161 99 -103 -150 -67 -115 -11 151 -108 23 228 195 118 101 10 164 -103 -56 309 -429 -60 -86
6441 -86 -270 -235 -203 138 -71 -48 383 4 -29 -63 150 34 155 244 -97 69 149 -106 -48 56 -27 319 -193
6464 -193 117 -245 -284 193 176 -115 193 163 -236 259 298 -20 -9 228 180 -149 -76 89 -86 -222 347 46
6486 46 -438 -221 89 -300 -139 205 63 -144 -114 405 -70 -423 261 154 97 210 136 -62 239 42 -37 -408
6508 -408 -26 -179 -427 -299 -12 -137 -416 221 -92 -250 -76 184 113 294 249 154 -210 123 159 -366 -309 -3
6530 -3 -218 -261 -84 143 -109 -171 -73 -120 -350 229 94 28 58 310 -17 60 307 8 -137 129 38 -191 -270 -159
6554 -159 -291 -177 -75 106 -285 33 243 -117 82 570 206 -79 183 305 146 64 300 175 -270 146
6574 146 163 -284 -301 3 -39 -350 180 -117 -153 45 234 275 58 226 82 -47 126 269 27 109 90 -83
6596 -83 -92 -17 35 -6 -198 -103 -8 -212 -164 262 -284 25 71 -173 107 160 109 155 2 170 -2 -106 55 -113
6620 -113 -225 54 -18 -215 34 -112 -31 -144 15 90 -38 38 386 47 28 90 -88 -131 44 56 1 -296 -9
6643 -9 27 -365 3 -28 -239 -149 79 44 -66 225 295 16 118 312 198 14 55 64 -137 -22 -173 -230 -86 99
6667 99 -140 -201 -17 52 26 83 102 43 260 262 42 8 97 94 -88 -28 124 -2 -320 -306 -6 -124 -8 15 -310
6692 -310 -47 106 190 34 -72 335 9 -89 156 214 -41 -127 122 -21 -320 231 -269 -410 47 6 -182 -127
6714 -127 -17 -57 -322 305 11 -75 -23 263 -98 -36 195 39 -44 19 100 -250 -157 -101 62 -223 -84 30 -370
6737 -370 -292 347 169 -120 182 246 177 8 319 -180 43 95 26 -21 -75 92 -258 -332 157 -95 -178 4 -15
6760 -15 -54 -107 155 263 73 51 171 -40 155 202 176 54 222 124 -88 -98 -274 -260 -341 -30 76 -155 198
6783 198 142 -81 -82 130 -61 167 279 116 189 -107 236 52 -23 -8 -32 -232 -93 -100 -3 -309 -29 -180 11
6806 11 -19 27 76 131 148 283 350 208 -133 51 69 60 -97 -221 -168 -51 -119 -46 32 -184 -176 62 -88 -37 171 94
6832 94 47 74 59 103 130 -78 206 -13 -283 -28 -177 -185 -196 -114 -98 -84 -114 -33 99 63 165 15 35 212 162 147
6858 147 -74 277 87 185 136 -162 139 -234 -114 -207 -41 68 -51 -181 -7 -264 -56 -39 129 303 74
6879 74 12 261 231 184 27 65 6 -248 -98 33 -80 -16 -199 -29 -107 28 69 -14 208 -22 19 284 275 64
6903 64 107 126 243 -48 -28 -13 -20 -141 -98 -250 -164 -240 -139 101 -211 49 88 -50 -61 176 187 154 229 115 31
6928 31 151 0 -8 -21 -181 -184 -369 17 -37 -66 76 66 -161 98 91 290 253 168 314 15 180 5 5 -83 -1 34
6954 34 -64 -74 21 -99 -163 -160 -133 -11 -155 71 141 76 155 174 -216 384 74 -137 -65 81 67 109 -163 15 -312
6979 -312 -150 189 -271 -131 35 -143 -106 127 74 -51 354 89 68 211 144 333 -32 118 124 -154 -241 -120
7001 -120 -204 -33 107 27 -178 24 149 25 -146 99 18 58 130 346 -206 -11 195 96 -163 103 -30 -183
7023 -183 -74 -174 -29 -251 23 7 -223 74 108 125 -99 198 8 39 231 97 149 -350 58 44 -159 23
7045 23 15 -361 -102 -129 -146 32 93 60 -127 -56 136 112 -90 59 -75 -55 -6 336 -231 7 34 34 -74 -169 85
7070 85 -206 -209 -68 -92 -145 149 93 -115 65 383 -25 -39 243 40 -115 140 1 82 -270 33 -302 -328 95
7093 95 -9 -32 8 96 52 115 201 206 -99 -36 296 86 -139 403 122 -51 70 79 -162 -41 -196 -203 -168 -70 53
7118 53 -80 -137 351 84 44 203 -8 -139 110 273 -138 -1 282 -199 -275 -52 59 -235 -102 86 -131
7139 -131 -225 -47 273 30 -292 148 149 -12 104 96 -138 149 103 24 -92 93 -86 -235 -177 -33 -108 -75 -32 -167
7163 -167 -241 114 -12 62 -22 437 192 26 229 266 -50 -139 60 -132 -288 2 -233 -344 -32 11 -243 -46
7185 -46 261 211 -90 -46 36 221 -42 319 -114 -68 192 54 -182 132 79 28 -271 149 -155 -202 -254 146 -173
7208 -173 -39 56 -134 197 121 65 146 201 257 224 -23 36 110 -378 -158 176 -92 -181 113 -28 116 24 11 -66
7232 -66 70 530 -37 111 122 215 -135 -8 189 11 83 -127 -6 -77 -254 -124 -194 -54 14 11 -16 109 189 -49
7256 -49 169 257 74 32 304 -47 165 45 59 57 -254 16 141 -340 117 -20 -137 -81 -28 15 171 174 242 184
7280 184 -85 281 20 -110 55 -24 -149 174 10 -12 -109 -152 -64 -123 -78 -139 -49 31 56 -89 153 169 116 28 42
7305 42 83 396 46 -130 -33 -202 -151 40 -150 -254 -118 4 -133 209 41 144 -37 105 38 -48 -46 -75 142
7328 142 78 2 3 53 37 -96 -129 -179 57 -165 -148 212 -80 -215 -16 14 -159 33 203 259 -130 351 -22 16
7352 16 329 84 107 -156 5 -9 -163 -49 12 -200 -58 36 -211 66 -88 176 303 29 206 110 -125 226
7374 226 -30 -134 -115 268 -53 40 -127 7 -143 41 -254 -175 -73 40 -121 -54 220 93 50 151 32 110
7396 110 -18 -17 227 -140 -68 25 37 -78 -90 -245 -67 -84 -3 -84 -36 98 269 -3 264 192 -90 197 10 -72
7420 -72 200 4 -23 -96 -58 -127 -165 -211 -38 -27 116 121 3 -123 111 255 28 127 -31 -3 12 22 6 23 -96
7445 -96 -145 65 -114 -141 -111 -140 73 42 24 -92 -63 269 145 101 123 34 9 331 86 -82 27 -57 -113 24 -14
7470 -14 -65 78 -202 51 74 56 8 84 -1 77 -98 95 207 85 162 121 -64 14 -112 103 23 103 104 -176 46
7495 46 -145 -38 -266 135 23 51 146 -11 114 162 -104 -62 321 63 113 -172 -99 11 27 -184 103 115 -75
7518 -75 108 21 -99 44 -34 -48 116 53 109 120 -7 191 101 41 121 178 -110 133 90 -160 -94 -134 43 -113 -83
7543 -83 122 11 85 433 60 -217 266 5 82 24 226 112 -101 -82 185 -158 -217 -106 -84 -188 135 174 -289
7566 -289 104 76 -139 -82 68 18 6 199 196 94 92 114 -103 20 -92 -148 -302 -101 -24 -91 -167 -61 -70 -33 101
7591 101 144 93 16 -36 92 -12 -149 22 50 -14 28 8 -156 -56 131 -154 -144 -146 -32 -148 -34 174 69 65
7615 65 120 1 -82 320 -143 88 98 59 -16 52 16 46 -122 -94 8 -134 -57 98 -240 -63 312 -38 -71 42
7639 42 22 12 140 65 74 132 -235 66 -32 -108 10 -144 -42 47 -62 -46 41 -36 -97 -104 320 -42 42 -89 338 159
7665 159 112 65 -43 -123 202 -208 -47 -68 47 13 -256 45 1 -276 114 -69 -259 124 217 144 -70 -27 139
7688 139 -29 32 -37 -50 -130 -72 -1 -187 -113 -39 -82 -168 100 122 -28 58 256 187 30 18 168 26 105 66 -38
7713 -38 -200 -25 -36 -170 3 71 -101 8 13 -97 -89 -84 160 -96 -73 269 -30 -156 223 208 -106 92 163 -178
7737 -178 -156 -13 -103 -37 38 26 -148 -239 126 246 254 56 292 -88 -11 284 -199 -12 128 -86 -80 73 -26 3
7761 3 -208 90 89 -50 144 33 -84 130 177 93 -22 244 -26 -118 129 79 33 -65 64 217 -311 -70 -29 -163
7785 -163 133 151 192 103 -155 -86 -179 -314 135 238 -253 129 188 -164 -17 44 -277 -34 -55 -143 -442 -90 -63
7808 -63 82 -236 -60 163 -166 47 254 34 147 141 -5 -16 196 218 -30 112 130 89 4 -382 -43 -64 -185
7831 -185 106 -198 20 -19 58 116 -96 64 -86 -118 168 42 -61 32 -26 -236 2 -56 -84 -32 -158 -71 -266
7854 -266 -54 -25 -5 -56 134 87 -18 63 118 -1 74 96 -34 91 -15 191 47 -67 -19 -177 -166 27 100 -50
7878 -50 16 91 -98 -17 108 140 -113 170 182 -326 -12 79 -196 -71 123 -22 -121 18 -62 -41 -176 -79 -211 -24
7902 -24 22 219 38 239 136 -131 14 17 148 148 72 -94 -37 -168 -12 -10 -103 60 -107 -121 -117 137 -125 128 -189
7927 -189 251 50 -5 171 52 -125 26 56 33 -167 178 -164 -92 28 72 -61 -218 -310 -249 -44 149 45
7949 45 170 308 -9 262 57 -41 -87 -168 -63 65 14 86 41 -95 -59 -101 -258 139 36 111 133 -162 266 -50
7973 -50 76 37 -78 -60 -6 119 -162 -113 -196 -12 -109 -101 53 -86 41 -2 19 -82 4 188 -91 122 115 80 119
7998 119 174 34 -15 163 49 -252 59 -81 -72 -41 -123 -258 -7 19 -134 -60 0 -151 149 92 32 140 184 142
8022 142 -47 97 -121 -96 -94 -236 86 49 -208 -290 -111 -91 100 37 -199 42 49 69 178 315 152 -173 81
8045 81 223 73 -210 -55 11 80 22 -44 -21 -145 -84 -136 68 -26 58 158 147 128 195 83 125 -57 -62 63 -129
8070 -129 25 79 2 -28 -234 -29 28 -206 -54 -68 40 25 65 66 -63 -125 78 399 49 48 355 156 65 -26 -112
8095 -112 -40 -81 89 -32 13 -60 -75 -57 350 -192 215 21 264 265 3 -80 10 115 60 230 -179 177 198 -239
8119 -239 64 -120 -57 -53 2 -236 -24 57 71 126 97 22 -84 -91 123 235 146 -110 -23 116 -239 -323 -82 28 -34
8144 -34 -123 -256 -122 -18 111 -128 106 -140 18 50 47 155 7 -117 64 -33 14 44 -26 -174 -55 -31 37 21
8168 21 16 83 -88 211 117 25 -184 232 12 132 104 15 153 8 206 -96 -117 -51 122 -238 -217 292 -31
8191c1
$$ Imaginary data points
##PAGE= N=2
##DATA TABLE= (X++(I..I)), XYDATA
0 0 0 0 0 0 0 0 0 0 0 0 8 -8 8 -8 16 -16 24 -25 32 -40 48 -57 72 -81 96 -112 129 -153 175 -201 230 -261
32 -261 296 -335 379 -427 480 -537 601 -670 747 -828 920 -1019 1126 -1244 1373 -1516 1670
49 1670 -1839 2027 -2234 2461 -2716 3000 -3321 3687 -4104 4590 -5163 5849 -6690 7745 -9119
64 -9119 10986 -13688 17953 -25735 44528 -190604 -48685 331620 -14158 -175901 -34469
75 -34469 93652 -3620 -28785 9002 11767 -4286 81703 71045 -3406 -57968 -56960 53581
87 53581 137052 -49304 -166058 -4591 103919 -11026 -91407 -29299 13078 -45877 -1721
98 -1721 73320 -32007 -76374 82011 102472 -31878 -50942 29325 44522 6612 18096 28289
110 28289 -46858 -46135 40351 8431 -57359 -36785 -18371 21674 46560 -43085 -83958 21018
122 21018 73512 -4498 -29409 58460 47637 -51747 14088 92135 -30860 -71442 57508 57907
134 57907 -51233 -58942 -1737 2935 -25358 -14617 -2345 -17721 -1115 13363 -1341 19295
146 19295 12655 -27342 27265 77043 1138 -43873 24378 53167 -18802 -46207 18946 14676
158 14676 -49663 -16175 21658 -35132 -45168 9609 9037 -17307 911 25414 10301 5136 33053
171 33053 20045 -11474 9143 19469 6894 22220 6164 -37421 -17055 13888 -22537 -44795
183 -44795 3488 18241 -35393 -26850 30204 -3632 -40059 25928 56864 2444 -11277 24233
195 24233 27885 8661 10245 4998 -19521 -7737 13682 -11544 -26714 -15382 -22907 -12406 10971
208 10971 -13559 -34552 8319 45725 9075 -28262 9756 38365 10224 14294 26425 -9881
220 -9881 -11886 25741 11644 -32327 -31117 4999 6624 -24358 -24307 -11767 -9802 9954 7295 -15688
234 -15688 8380 28550 8310 8749 20415 8486 -1337 11019 21646 -7672 -25027 10823 7338
247 7338 -33505 -16351 1335 -18981 -14921 45 -1967 -6548 -4100 11793 11394 2362 17480 15831
261 15831 5284 19783 7036 -9057 10762 3248 -17299 -5822 -2084 -14409 -21968 -12208 3413
274 3413 -15007 -21966 12452 6990 -11407 12196 15383 4141 11891 11554 11588 9714 1337 7616 1416
289 1416 -8945 -2167 -13794 -15936 303 -17367 -20959 2743 -5916 -11999 1915 4452 6987 4489
303 4489 7762 19721 4200 2282 22333 4318 -6242 7918 -1558 -6333 -4072 -14401 -9084
316 -9084 -7965 -14406 -6142 -10024 -8154 4742 -3140 3125 14870 -83 8436 21883 6456 4309
330 4309 8494 4812 6673 -4925 -7749 805 -11026 -11473 -4265 -16433 -10500 -1110 -9167 -1709 1432
345 1432 -1593 11228 8970 4370 14260 10894 10507 11155 -253 5142 5774 -8980 -3717 -4771 -14799
360 -14799 -8482 -9573 -11175 -4287 -9503 -3820 6525 111 4010 9468 7757 15838 11458 3502 11234
375 11234 6231 1428 6381 -4198 -9086 -3399 -7417 -8718 -11569 -13969 -4432 -5524 -6620 2271 -986
390 -986 2177 14216 7382 4943 12264 8231 8087 9689 4604 -105 -5423 -3308 -1190 -10816 -9651
405 -9651 -6039 -14000 -6426 2026 -9932 -9769 4129 8539 5783 3363 7468 10814 9593 12820 5971
420 5971 -5912 4135 9684 -3574 -8502 -7513 -9858 -7158 -5297 -8353 -12434 -6541 7205 2470
434 2470 -6617 3989 9283 3945 10254 14066 6638 2382 6084 8153 -537 -6271 -3965 -8052 -4246
449 -4246 4638 -12737 -25503 -4305 8069 -4237 -9816 1201 9817 6753 7991 7785 -1489 8711
463 8711 19962 1559 -3889 9529 95 -10667 -1419 -783 -14950 -16969 373 3875 -11363 -8092
477 -8092 166 -6497 3720 13246 699 3960 17486 10470 2455 4391 5380 -1819 -4154 10193
491 10193 2629 -21826 -10252 5917 -8438 -15143 -10922 -8124 4177 10329 2429 -5679 -836 14211
505 14211 7797 -3789 15285 17932 -3817 3333 9259 -10094 -13551 -2642 904 -3425 -8199 -8546
519 -8546 -13983 -8654 11408 -2149 -19868 7775 21127 4308 6234 7416 -1628 4120 12683 7610
533 7610 -7238 -5178 11831 -809 -18959 -8424 -9399 -10348 7744 -1580 -17763 -2243 9754
546 9754 2295 -2766 4678 11855 458 4850 25450 6575 -14148 2902 5422 -5443 -1760 -5223
560 -5223 -8324 -1488 -454 -10443 -22132 -6564 15446 954 -5261 11293 588 -4452 16710
573 16710 12248 -3430 2294 11185 8849 -1476 -4143 -4172 -11942 -1760 5289 -18786 -14897 11239
587 11239 -1001 -14408 -1564 1578 -731 6148 13707 9563 -1748 4952 11839 1031 4677 5999
601 5999 -13226 -3595 14986 -4474 -20903 -8320 1609 -6292 -13939 -1275 7145 -1117 4425 6182
615 6182 -8545 1513 17430 7817 6098 11615 1567 -7171 -1838 5295 -3355 -11061 1181 -511
629 -511 -16058 -5515 1002 -12775 -3508 11098 239 -5228 7057 11643 2321 2863 11734 2168
643 2168 -4678 12185 8026 -11685 -3399 2460 -10638 -8617 18 -7412 -10832 1396 4950 -8151
657 -8151 -4952 10231 1675 -3079 14934 11506 -3593 6448 12988 -2623 -8879 2541 4773 -4889
671 -4889 -2491 -243 -14843 -14154 2556 -2364 -9120 3763 6297 -3143 -264 6799 1700 1159 15025
686 15025 13422 -4666 -12 10381 -3880 -8239 4168 -2309 -13022 -3753 2133 -10274 -11707
699 -11707 3290 741 -9496 3575 9637 -2990 3951 14928 2880 -1693 8941 6182 -4643
712 -4643 110 8094 -4239 -10474 2679 -3948 -18082 -3704 3617 -8725 -3338 6943 -423 -5927
726 -5927 3559 9256 1208 3883 15690 4528 -5005 7410 3429 -9424 401 4727 -6949 -8560
740 -8560 -2353 -4513 -10928 -3865 4853 -5969 -5482 11133 2997 -5448 9724 10214 -486 4272 8753
755 8753 2541 -1786 3263 3091 -9654 -5903 4320 -9836 -12535 3702 -2744 -10337 1165 2547
769 2547 -3298 446 7962 6711 -526 6949 12275 -2267 -377 10686 -2770 -6425 5122 -2359
783 -2359 -10199 -4436 -2468 -6385 -8583 -819 1916 -7278 1007 9119 -3721 1032 13666 3652
797 3652 164 8340 5313 -82 -415 2711 -312 -8270 -1361 285 -12796 -5502 2665 -8943 -5160
812 -5160 4645 -1325 -2175 4197 6279 3162 1453 9031 7462 -2829 5185 6827 -6251 -608 3413
827 3413 -7766 -6702 -1510 -4391 -6601 -5111 -764 -2149 -4882 5015 4253 -3657 6812 10092 -235
842 -235 4400 7488 1321 986 2165 946 -3532 -5752 318 -4066 -10621 -1503 -1502 -8053 -240 1259
858 1259 -3320 1911 4903 3306 3316 4849 7498 2629 615 7733 1332 -5864 1753 247 -6694 -3661
874 -3661 -4042 -6475 -4293 -2305 -1577 -4056 -1394 5725 1778 -391 6694 4767 2883 7496 2884 -331
890 -331 3365 2306 -1406 -3389 -2615 -2387 -7400 -5580 -569 -5341 -6326 519 317 -635 1653 2013 4079
907 4079 5207 5575 4856 1877 2997 4282 -377 -1177 -558 -4531 -3112 -1438 -5734 -7500 -4601 -765
923 -765 -998 -3892 -235 3257 1649 4073 5220 2310 4159 5611 3437 2554 1854 416 -1822 -3250
939 -3250 -1902 -4082 -7210 -3582 -2155 -2974 -2195 -4022 -2717 3493 4076 1826 2040 4710 6965 3870
955 3870 1237 3035 1292 331 1676 -1735 -3704 -3793 -4965 -2770 -4239 -7655 -2700 1189 652 338
971 338 -653 2125 4541 2597 4692 6356 3516 3346 1656 146 2147 -3599 -6339 182 -985 -5160
987 -5160 -5851 -5179 -1008 -1206 -4601 -841 1578 3649 7406 2251 551 6154 3583 1947 3946 1734
1003 1734 1526 -1068 -3816 -1057 -4424 -7879 -2712 -3011 -3188 -705 -4093 -1137 4093 281 335 3356
1019 3356 4723 7181 3789 3112 4808 -3367 -2967 5832 -430 -5984 -2275 -2846 -3902 -5848 -6186 -1749
1035 -1749 -1218 344 3097 -2138 2001 7969 526 1843 7878 1400 1400 6415 3300 -1997 -4963 -2665
1051 -2665 -1436 -6603 -1365 1032 -8559 -3929 2541 -5363 -3538 4372 4026 3448 3566 3644 3465 1089
1067 1089 5564 5040 -3878 350 3738 -4000 -1786 -1135 -9277 -6099 -570 -2685 -4080 -1195 4711
1082 4711 379 -6106 4750 7762 -2086 4762 10931 1134 -745 2302 413 -998 -1542 -819 -4198
1097 -4198 -5710 1840 -3462 -11095 -293 1681 -6358 1271 6740 264 928 5872 3548 -1564 2327
1112 2327 10071 2097 -3428 5107 -852 -11034 -1083 2158 -6553 -4779 -151 -3177 -5362 -425 2282
1127 2282 -2954 152 8905 2125 -650 9811 5215 -4155 2816 4984 -2899 -2016 4675 -267 -10274
1142 -10274 -5037 1986 -7580 -7153 4877 -500 -6368 3940 5425 -2200 565 6999 3329 39
1156 39 6833 6970 -2700 311 3869 -7387 -6814 4134 -1489 -7902 129 889 -9741 -7773 5028
1171 5028 2545 -4483 5612 9199 -2475 606 8391 1088 -1441 6563 4229 -4356 -1198 3217
1185 3217 -5047 -8802 336 -1730 -8951 35 3263 -5713 -1876 5809 -303 -3381 6495 8897 -1472
1200 -1472 784 10875 1333 -6847 3744 3120 -7432 -2198 2643 -5023 -7169 -524 -2155 -8074
1214 -8074 -1146 5801 -2274 -1304 8850 1285 -3789 7372 6495 -1604 3686 7294 -1532 -6570 1707
1229 1707 1960 -9292 -3632 5036 -6472 -8967 2632 -872 -6270 2042 4724 -471 461 6755 4656
1244 4656 -1485 5340 7460 -3860 -641 6683 -3872 -5787 3150 -2018 -8676 -3282 1034 -4471
1258 -4471 -6283 3951 3538 -6128 2153 8749 -2589 199 9734 2939 -569 5047 3236 -3058 -2919
1273 -2919 2226 -1684 -7143 1153 -233 -10737 -1970 3351 -6669 -2075 6684 1161 -2575 3418
1287 3418 7081 958 -475 8494 4316 -5269 3063 3844 -7076 -1592 2338 -5530 -5470 -487 -2250
1302 -2250 -5413 -2362 3624 -1102 -3401 6452 3347 -3377 6692 7399 -2382 2421 6438 -615 -3697
1317 -3697 737 2040 -5395 -5542 2087 -4110 -8837 1807 299 -6148 2033 3655 -1815 778 5314
1332 5314 3640 161 3890 6882 -1066 -1994 5197 -1574 -6067 2622 -510 -7922 -2487 -79 -4376
1347 -4376 -4764 799 2266 -3240 678 6461 -606 -618 8255 3104 -1409 4971 3165 -2422 -961 1575
1363 1575 -1914 -5601 -1326 -53 -6853 -3764 2261 -3964 -3688 4423 1179 -2231 3494 5500 1768
1378 1768 913 5179 3538 -1928 2134 3431 -4517 -2540 2154 -4049 -6058 -539 -1601 -4961 -1826
1393 -1826 1433 -995 -2140 3607 3925 -987 3592 6042 -103 1523 5591 575 -2682 499 887
1408 887 -3801 -4013 -169 -2909 -5611 -294 -639 -5054 -121 3496 -369 88 4092 3459 1012 2844
1424 2844 5011 632 -404 3106 -18 -3429 -94 -1290 -5135 -2817 -1006 -3324 -4183 -74 1274
1439 1274 -2221 -138 3891 995 800 5188 3247 526 3108 3183 -47 -873 79 -972 -3670 -1198
1455 -1198 -727 -5021 -3582 432 -2743 -2768 1057 943 1115 2018 2610 2565 1993 3309 3178 219 2260 2162
1473 2162 -2839 -1406 575 -2750 -3994 -3366 -1849 -1006 -2936 -1398 162 -926 1435 2186 236 3959
1489 3959 4942 1301 1819 2282 1061 730 -733 126 -268 -4000 -2359 -1631 -3936 -2020 -2182 -2825 745
1506 745 411 111 2313 1685 1983 2391 1659 3616 3210 632 2282 437 -2146 -1320 -2636 -1902 -148
1523 -148 -4034 -3374 -836 -2592 -1334 -54 -216 2468 2401 1583 3073 2209 2612 3122 -419 1375 2778
1540 2778 -1699 -646 -297 -3669 -3084 -2701 -3466 -1256 -1161 -696 -643 -2203 1362 2828 -4 3248 4801
1557 4801 1631 3028 1812 -467 1164 48 -1035 -1186 -2448 -841 -1520 -4739 -2123 -1750 -3762 271
1573 271 1694 526 2213 2013 1148 1457 1655 4365 2588 -232 3381 1073 -4160 -1189 -383 -3451
1589 -3451 -2646 -2011 -2134 -1646 -1514 -172 -1556 -1622 2151 1388 1432 6087 2709 -1193 2497 2202 -1326 44
1607 44 1863 513 -2629 -2635 -1124 -4041 -3902 -6 -2341 -2561 2733 562 -1136 1985 2236 483 1195
1624 1195 3867 4171 1259 1163 1952 -2748 -2441 984 -2060 -2758 527 -1520 -4457 -3269 -208 -331 -1727
1641 -1727 1514 3222 251 1872 4434 559 592 3460 1130 -221 1856 1269 -1994 -3162 -1423 -2587
1657 -2587 -4412 -429 485 -3176 -999 1433 -1999 -1031 3355 3286 1007 2718 4394 813 -446 2719
1673 2719 764 -2722 176 466 -3350 -1866 -720 -3631 -4229 -879 212 -1855 629 3892 110
1688 110 -908 3430 2374 -37 3575 3943 -125 -211 1503 -794 -3763 -1118 -46 -3998 -3032 1298
1704 1298 -2414 -3488 598 -41 -1471 1683 3806 1747 1276 3434 2354 -1100 1906 3387 -2003
1719 -2003 -766 2408 -2836 -4308 -599 -1270 -3738 -2129 709 -1015 -2517 1728 2132 -1595 2331
1734 2331 4514 -106 1612 4608 838 -703 899 762 -2305 -2415 491 -1902 -4776 8 -481 -5384
1750 -5384 -471 2330 -1797 -207 3636 2420 -15 1950 4003 690 -554 3961 1447 -3184 1106
1765 1106 329 -5293 -1821 563 -2937 -2669 47 -448 -2877 -762 3440 68 -885 5724 2539 -1912
1781 -1912 3302 3495 -1384 677 2517 -590 -3046 -1023 335 -4017 -3385 1593 -2308 -4212 2075
1796 2075 386 -2862 2381 3096 -381 1208 3774 2317 -836 1884 4374 -2003 -2416 3147 -1864
1811 -1864 -4763 731 -671 -4110 -1246 190 -2102 -2631 1490 2488 -1317 1525 4949 -531 -230 4975
1827 4975 976 -1508 2791 1673 -2625 -2166 457 -1691 -4303 -353 839 -5035 -1775 2925 -2208
1842 -2208 -1536 4055 1967 -819 2229 3481 670 -28 3501 1767 -2529 791 1523 -4721 -1860 1741
1858 1741 -3273 -3998 731 -510 -3092 -1070 2665 508 -1254 3801 2757 -1504 2741 4567 -1022
1873 -1022 -136 3093 -766 -3031 -208 517 -3292 -2821 779 -2184 -4336 888 860 -2615 1396 3814
1889 3814 -169 116 3602 2287 -555 1800 3638 -1033 -1836 2362 -1021 -4437 38 253 -4177 -2175
1905 -2175 600 -1967 -2534 1452 1902 -1475 1412 4430 342 -81 4204 1836 -1457 1896 1794 -2249
1921 -2249 -1666 1050 -1762 -3788 -250 214 -4162 -1828 2082 -1290 -1603 2653 1768 -453 1645 3236
1937 3236 679 138 3156 1651 -2054 310 1518 -3044 -2039 384 -2178 -3008 -206 -354 -2688 -989
1953 -989 2196 -49 -1251 3172 2780 -764 1963 3537 -137 27 2108 166 -1658 -183 389 -2879
1969 -2879 -2858 749 -2066 -3896 1241 642 -2532 688 2337 -249 162 2699 2493 366 1201 2921
1985 2921 -716 -1405 1577 -1164 -2804 526 -814 -3748 -1640 -101 -1546 -2083 -107 1463 -556
2000 -556 323 3375 853 196 3396 807 -506 2619 1490 -953 -838 169 -804 -3222 -1602 440
2016 440 -2534 -1789 1296 -1788 -1350 2333 780 -36 2251 2691 1123 679 2334 1922 -1790 306 1698
2033 1698 -2297 -1695 1169 -2079 -2684 -948 -1672 -1591 -570 689 444 -430 1706 2023 -914 1878 3454
2050 3454 -40 584 2539 -133 -901 -524 -894 -1671 -2380 -586 -469 -2564 -122 240 -2828 -486 2053
2067 2053 176 1506 2516 1428 803 605 1666 839 -721 1640 524 -2907 -414 -74 -3274 -1843
2083 -1843 -473 -1546 -1080 319 734 -50 -487 1857 1089 -56 2934 2600 442 1286 703 -1086 -336
2100 -336 -432 -628 -880 -1498 -853 -1846 -2152 -155 -694 -1586 1081 1234 335 1773 1848 1299 295 667 1847
2119 1847 969 99 1142 -606 -2373 -1369 -1580 -1726 -540 -939 -1058 -735 -733 160 -80 354 1900 1126
2137 1126 1060 2270 1279 758 1015 -170 -506 -310 -292 -71 -1478 -1861 -1284 -2037 -1810 93 45 -7 424 603
2157 603 785 826 981 1997 1444 1089 1493 413 30 -116 -1234 -977 -753 -1082 -1115 -1393 -983 -982 -1872 -918
2177 -918 963 395 1064 1871 1257 691 713 1138 1011 420 948 643 -1364 -879 -478 -1961 -1729 -883 -1448
2196 -1448 -1108 -165 24 -157 -338 882 632 274 2315 2214 363 1572 1313 -822 -188 396 -200 -1123
2214 -1123 -1255 -553 -1730 -2578 -117 -430 -1690 549 1091 -377 927 1539 751 631 1311 1805 727
2231 727 170 1514 -700 -2072 39 -793 -2284 -306 -137 -2251 -1406 -209 176 -870 141 2463
2247 2463 730 53 2910 1031 -357 1729 1070 -611 372 720 -612 -1721 -1081 -735 -2392 -1389
2263 -1389 930 -1406 -1306 1667 -87 -923 1720 1653 371 978 2139 1631 -634 67 1499 -1772 -1298
2280 -1298 1092 -1552 -2251 47 -1325 -2077 -641 71 -238 -557 1404 1618 -526 1129 3086 -592
2296 -592 282 2919 155 -920 769 98 -1605 -1700 -126 -869 -2624 -296 773 -2498 -267 1614
2312 1614 -1017 -49 2476 1225 776 1587 1853 206 -181 1546 495 -2232 425 575 -3101 -1225
2328 -1225 297 -1913 -1598 75 -93 -1104 -187 2200 616 -634 2828 1870 -755 1617 2239 -973
2344 -973 -163 892 -681 -1827 -859 -320 -2053 -1724 611 -1151 -2361 1364 939 -1398 1340 2483
2360 2483 -65 581 2470 1402 -545 774 1837 -989 -1539 838 -1228 -2770 -67 -361 -2453 -642
2376 -642 593 -994 -1284 1274 1757 -464 1314 2874 -88 -166 2434 590 -1030 1025 877 -1764
2392 -1764 -1379 405 -998 -2765 -539 511 -2166 -985 1509 -671 -570 2402 1570 -192 1340 2219
2408 2219 357 -385 1852 515 -1960 267 938 -2650 -1582 775 -1123 -2153 2 190 -1547 -182
2424 -182 1784 229 -308 2531 1403 -955 1550 2422 -772 -212 1597 -308 -1959 -825 -82 -2083
2440 -2083 -1891 757 -1165 -2223 1048 831 -1217 832 2351 436 109 1903 1405 -688 605 2061
2456 2061 -1006 -1536 1220 -715 -2549 42 -239 -2097 -1218 341 -593 -1297 1099 1786 -881 480
2472 480 2793 -85 -449 2810 833 -572 595 842 -1428 -1359 110 -717 -2659 -220 712 -2462 -1292
2489 -1292 1418 -735 -728 2038 1083 193 1127 2103 551 -454 1468 1412 -1817 34 728 -2113 -1519 329
2507 329 -1623 -1708 -64 194 -1046 -535 1360 925 -1015 1632 2076 -806 1067 2339 -187 0 1362
2524 1362 -146 -1628 -853 586 -1281 -2024 535 -515 -2322 99 963 -1092 933 2042 58 141
2540 141 1605 1495 -64 154 1824 179 -1270 680 -93 -2417 -185 -204 -2286 -983 420 -484 -794
2557 -794 -94 1142 -223 80 2128 999 113 2001 873 -947 711 776 -766 -1090 -321 -390 -1582
2574 -1582 -1172 -12 -1298 -1703 786 -205 -480 1595 1131 -67 526 1338 959 616 768 1570 -402 -780
2592 -780 88 -1182 -1433 -18 -1024 -1471 -461 -611 -954 -432 171 501 -255 1087 2127 356 542 1678
2610 1678 151 -214 663 163 -210 -157 -600 -1116 -1450 -697 -563 -1187 -36 343 -388 6 849 328 867
2629 867 1405 889 875 883 790 189 -488 115 -158 -1285 -565 -73 -996 -850 -918 -772 -518 -332 432 711 446
2650 446 706 712 516 1299 827 388 645 146 -178 -320 -549 -705 -1311 -1046 -600 -604 -663 -18 -540 -489 348 299
2672 299 1036 1201 804 1086 738 87 235 168 176 9 -834 -624 -444 -1005 -1052 -587 -992 -464 -224 55 650
2693 650 368 434 660 599 839 1284 509 715 258 -482 41 -568 -1003 -509 -844 -976 -638 -778 -508 -618 -416
2714 -416 448 406 394 1480 916 529 952 330 148 571 172 274 -76 -536 -695 -1180 -1173 -152 -860 -622 256
2735 256 -533 -485 413 101 598 896 921 1287 654 594 1061 -473 -133 252 -859 -567 11 -986 -1089 -744
2755 -744 -1028 -429 -157 50 480 65 947 1231 69 867 1470 94 627 719 15 -186 -261 -696 -723 -1221
2775 -1221 -592 -242 -1401 -317 241 -854 -128 682 -28 1010 999 525 970 494 579 341 -460 746 95
2794 95 -1320 -189 -386 -1793 -917 -328 -713 -476 -17 503 224 119 1167 698 200 1650 1022 -138
2812 -138 1115 332 -680 -58 -256 -1067 -905 -825 -151 -1295 -1039 337 -479 -812 949 514 -294 974
2830 974 1127 460 537 1037 783 -161 -128 639 -805 -1073 38 -898 -1498 -174 -606 -1096 -241 117 4 -214
2850 -214 686 1001 65 733 1711 157 -147 1369 -154 -708 445 -113 -887 -801 -310 -775 -1419 -293 227
2869 227 -1254 -29 1206 -113 66 1566 675 124 1070 1004 -163 -267 807 78 -1392 -347 57
2886 57 -1693 -786 204 -986 -1027 235 187 -500 175 1139 249 11 1677 844 -531 1218 1128 -748 -116
2905 -116 640 -743 -1277 -345 -90 -1536 -1150 371 -481 -943 749 498 -487 976 1496 411 327 1270
2923 1270 808 -560 292 901 -603 -794 440 -903 -1418 229 -255 -1425 -571 811 -266 -587 870
2940 870 1039 -221 975 1673 -38 22 1443 97 -1116 472 369 -914 -1192 -152 -504 -1571 -189
2957 -189 13 -1316 -181 1194 -450 -73 1504 932 -21 740 1213 85 -474 1182 305 -1227 164
2974 164 131 -1790 -880 384 -1038 -970 -60 222 -601 -11 1074 347 -274 1968 1041 -721 817 1262
2992 1262 -909 -223 509 -529 -1047 -552 -123 -1274 -976 612 -587 -1427 1052 403 -818 612 1404
3009 1404 439 217 1056 820 -111 477 989 -825 -759 578 -803 -1753 96 12 -1371 -434 64 -374 -533
3028 -533 431 1027 -152 968 1696 -5 -85 1496 458 -605 584 316 -956 -559 -257 -653 -1389 -144
3046 -144 279 -1304 -263 1372 -488 -320 1469 380 91 874 933 261 95 907 271 -1154 85 617
3064 617 -1558 -956 462 -983 -1136 191 -313 -838 -49 1011 482 -161 1547 825 -513 487 1131
3081 1131 -369 159 862 -740 -1057 -170 -219 -906 -870 355 -312 -1243 326 500 -581 463 1191 50
3099 50 387 1437 566 -274 302 729 -604 -855 475 -29 -1359 -5 -2 -1571 -509 343 -558 -258 863
3118 863 742 -196 449 1447 58 -29 1367 529 -627 904 523 -1188 -749 192 -782 -1052 34 104 -870
3137 -870 -682 711 -367 -453 1373 822 23 877 1079 149 23 780 63 -778 256 449 -1086 -1068 248
3156 248 -927 -1312 56 278 -537 -288 607 -3 -337 966 1104 -115 848 1077 -545 -388 606 -360
3174 -360 -826 -56 -79 -822 -779 152 -509 -1318 328 273 -765 699 1106 283 52 1021 630 24 392 912
3194 912 46 -554 385 -497 -1255 -34 -94 -934 -557 -47 -500 -409 40 580 -239 169 1291 412 182 1080
3214 1080 746 -466 358 198 -361 -262 -22 -360 -905 -773 -102 -957 -511 560 -163 -343 686 364 94
3233 94 608 794 576 180 542 629 -168 -390 364 -1036 -964 229 -636 -943 -17 -97 -271 -350 242 542 16
3254 16 540 1042 -16 368 1026 -97 115 485 -87 -394 -211 -278 -445 -883 -277 -293 -903 -193 114 -168
3274 -168 223 763 149 529 823 543 367 241 394 332 -265 -113 -11 -568 -157 -390 -996 -187 -343 -581
3294 -581 20 -128 321 616 -73 718 696 236 614 472 108 282 87 -485 -85 -272 -398 -241 -622 -296
3314 -296 -215 -654 -254 8 -140 381 289 348 590 440 580 419 112 501 248 -434 -114 -148 -633 -386 -691
3335 -691 -497 -305 -695 -137 153 -417 318 463 9 519 673 282 533 203 176 33 -149 -77 -176 -608 -85
3356 -85 -365 -902 -375 -133 -601 -177 126 152 473 390 618 180 184 793 315 -215 439 198 -337 -166 -317 -279
3378 -279 -340 -498 -317 -465 -385 121 -385 -98 400 337 150 810 713 220 526 404 259 85 45 41 -605 -471
3400 -471 93 -731 -977 -18 -381 -377 -314 175 79 -50 668 584 34 594 896 90 288 737 -97 -200 -86 -369
3422 -369 -565 -488 -314 -546 -923 177 331 -710 67 607 -131 129 803 439 270 565 724 209 -164 318
3442 318 -162 -911 112 -151 -895 -451 15 -566 -294 231 -149 -174 231 991 362 -73 969 373 -131 654
3462 654 250 -377 -95 207 -480 -844 -314 -96 -985 -668 354 -307 -494 584 399 -137 669 761 9 353
3482 353 740 374 -174 179 627 -651 -646 285 -634 -1079 -37 -135 -831 -109 300 -31 -347 529 833 -484
3502 -484 513 1278 -215 72 947 9 -589 404 29 -757 -665 -37 -393 -1071 -82 394 -836 22 625 -300
3522 -300 -65 1160 391 102 670 670 120 -336 630 204 -765 -224 470 -1115 -448 297 -905 -598 230 261
3542 261 -226 -10 979 381 -343 889 808 -466 570 756 -682 -244 462 -404 -1050 -88 66 -814 -741
3561 -741 379 -230 -600 426 288 -531 697 1108 50 31 837 494 -541 -11 799 -322 -811 474
3579 474 -527 -1318 146 82 -824 -233 385 -233 -368 619 785 -271 287 909 129 -203 967 257 -721
3598 -721 176 91 -765 -483 -20 -147 -1002 -241 333 -845 -75 880 -248 -272 1077 460 -181 455 797 -43
3618 -43 -134 485 392 -790 -103 97 -1004 -813 290 -315 -872 193 228 -399 -374 541 211 -34 830 1006
3638 1006 -226 247 1045 -325 -436 499 -217 -564 -138 16 -835 -802 192 -29 -757 367 494 -291 352
3657 352 896 -28 -198 646 469 23 -89 398 -416 -752 45 -353 -1095 -118 -103 -682 -335 251 -170 -446
3677 -446 233 554 -123 240 1327 184 -256 719 313 -436 317 208 -457 -681 -382 -233 -823 -370 433
3696 433 -499 -221 486 -52 -308 662 260 29 486 944 261 -392 387 449 -542 -312 289 -629 -531 92 -518
3717 -518 -495 -99 59 -119 -124 341 307 61 521 709 -177 233 917 80 -34 298 -201 -573 -622 9 -362 -485
3739 -485 181 -121 -581 174 144 -456 202 608 175 101 410 226 0 -81 486 67 -583 338 -253 -751 -27
3760 -27 -194 -892 -374 -143 -119 -287 168 547 -104 49 750 181 39 680 508 -319 94 -285 -435 -150 -51
3781 -51 -115 -458 -447 -77 -452 -578 445 -135 -154 495 144 201 346 551 220 246 198 404 -158 -330 116 -392
3803 -392 -660 -86 -453 -465 45 -66 -250 51 117 309 319 628 584 46 422 631 137 -43 324 -362 -96
3824 -96 21 -328 -359 -378 -215 -161 -399 84 155 -196 112 476 282 322 534 239 485 343 327 69 -357 -164
3846 -164 -266 -643 -362 -321 -304 -150 -48 -187 14 95 38 291 255 412 441 81 326 257 64 15 50 20 -115
3869 -115 -287 -528 -492 -458 -412 -306 -280 125 37 -23 491 199 162 432 464 412 303 212 107 103 -150 -116 -136 -409 -318
3894 -318 -532 -521 -179 -375 -53 62 -180 349 36 359 584 236 107 470 185 326 324 15 -170 -135 -298
3915 -298 -528 -248 -366 -349 -377 -99 -71 -193 214 233 329 347 382 112 547 242 9 156 90 -123 -55 -248 -5
3938 -5 -329 -280 -312 -287 -271 244 -59 136 26 66 206 457 422 83 254 237 140 115 -71 2 -360 -145 -204 -590
3962 -590 -522 -173 -241 -306 118 207 125 -4 364 399 60 283 444 26 131 274 -249 -75 -19 -240 -239 -304 -242 -249
3986 -249 -457 -135 98 -336 212 288 -17 297 346 404 205 431 491 -52 -150 189 -61 -513 138 -332 -733 -373
4008 -373 58 -254 -201 69 -63 43 16 534 367 310 729 249 -181 397 426 -242 -133 128 -307 -471 -304
4029 -304 -128 -579 -332 149 -366 -245 456 235 6 489 422 97 272 336 450 -115 124 307 -443 -343 272
4050 272 -392 -556 35 18 -294 8 204 -151 35 324 438 3 471 774 -139 34 496 -45 -313 159
4070 159 -8 -361 -449 -148 -268 -646 -204 207 -447 90 438 -239 173 522 206 158 313 260 39 -183 165
4091 165 55 -572 19 159 -589 -387 245 -275 -241 -124 -56 -71 85 409 350 -174 480 465 -141 -182 160 -442
4113 -442 -51 232 -419 -469 -376 -283 -536 -294 123 -262 -190 398 337 -303 270 376 67 156 323 143 60 138 189
4136 189 -389 -356 85 -280 -547 41 -230 -509 -273 73 -143 50 484 335 39 449 714 -94 -2 293 20
4157 20 -316 229 7 -472 -292 -108 -358 -841 111 53 -464 -82 552 -366 -118 711 221 27 546 248 -182
4178 -182 -166 247 10 -344 210 54 -477 -355 91 -493 -207 53 -35 -180 10 468 94 -220 482 311 -205
4199 -205 299 312 -191 178 -31 -499 -568 12 -56 -572 -402 352 -442 -537 313 54 -124 368 264 -261 325
4220 325 318 -5 -78 106 216 -269 -303 174 -372 -660 32 -406 -707 -46 102 -284 -254 482 335 -161 207 525
4242 525 -37 -143 409 33 -532 215 149 -476 -379 -98 -316 -569 -193 80 -412 -128 420 -241 103 459 18
4263 18 -188 463 585 39 1 316 212 -407 -141 29 -645 -129 -4 -414 -392 173 19 -218 -96 355 28
4284 28 74 522 192 -253 242 328 -51 -38 330 -447 -504 -88 -31 -620 -234 190 -204 -431 383 191 -286 256
4306 256 594 -64 173 507 9 -73 221 215 -118 -289 89 -161 -415 70 -72 -596 -15 -67 -328 60 159 401
4328 401 -41 264 479 121 -128 583 77 -198 60 -30 -420 -241 88 -188 -242 174 133 -356 -262 54 -74
4349 -74 9 219 183 62 361 467 8 19 387 127 -141 -157 245 -448 -287 45 -376 -275 169 -171 -223 -36
4371 -36 350 85 -67 212 493 -69 544 339 106 -97 338 7 -271 -150 -113 -239 -350 69 -189 -479 -207
4392 -207 73 -130 154 177 45 274 357 375 125 -20 184 108 -215 81 -51 -269 82 79 -433 -424 -76 -198 -60
4415 -60 -58 -6 198 93 250 228 -185 279 -100 -291 28 83 -184 -89 60 -145 -100 -372 -171 -123 -318 -49 -224
4438 -224 -79 150 68 -112 277 259 202 182 185 150 -46 -83 139 -277 -78 -103 -310 -188 -54 -170 100 41 168
4461 168 277 171 153 378 -126 468 155 43 118 -51 -29 -44 -94 -29 -201 -161 -252 -22 -334 -243 193 -181 125
4484 125 55 346 189 213 125 178 112 70 305 20 -192 -116 -103 -112 -142 -81 -190 -214 -159 20 -85 -54 65 28 118 266
4510 266 238 271 306 96 178 -41 -119 17 -182 -71 194 -177 -176 -75 -306 -106 36 -84 5 207 74 221 2
4533 2 336 336 -127 91 86 -368 -161 -148 -429 -225 -285 -53 -211 -284 93 -12 -299 158 64 -225 173 184 -31 124
4557 124 85 294 256 -124 8 -211 -394 -101 -360 -631 -213 136 -413 -127 205 98 -34 145 438 66 187
4578 187 370 196 -13 132 -54 -135 25 -37 -266 -220 -183 23 -241 -161 129 -322 -155 257 -3 112 196 236
4600 236 -176 270 463 -92 56 157 118 -287 -60 205 -282 -224 -34 -254 -339 80 -20 -319 -125 228 133
4621 133 -90 421 368 -57 172 250 -63 -100 198 -171 -255 -245 113 -442 -407 111 121 -363 124 344 -108 181
4643 181 360 154 -2 257 384 -54 36 390 -96 -385 180 9 -470 -191 29 -400 -424 257 107 -271 98
4664 98 290 -109 -256 458 238 -188 285 186 -325 33 222 -189 -226 178 -75 -520 -79 117 -263 -269 290 -62
4686 -62 -139 453 406 -114 53 401 62 -41 90 331 -231 -246 275 -529 -289 125 -182 -301 45 84 -286 -201
4708 -201 274 115 -221 199 447 -110 133 486 -66 -154 157 161 -153 -251 55 -278 -396 149 40 -369 -104
4729 -104 308 -159 -228 503 69 203 465 177 175 -51 328 127 -232 35 -57 -580 -235 355 -307 -178 217
4750 217 -198 -409 42 348 123 88 268 109 -309 430 342 -159 219 185 -530 -377 -85 -45 -250 -78 90
4771 90 -288 -413 265 -102 -298 410 340 5 354 394 -112 -213 -88 41 -81 -369 249 31 -403 160 -278
4792 -278 -454 192 9 -167 -237 175 -51 -44 -19 375 -23 26 498 8 -158 12 254 -347 -185 -14 -108 -374
4814 -374 -66 54 -345 43 204 -156 121 504 155 -41 270 270 -207 265 233 306 -451 94 -42 -469 -291
4835 -291 107 -440 -385 304 -109 -251 -172 316 -5 152 435 316 -191 447 270 -272 -148 398 -331 -328 -136
4856 -136 -242 -442 -200 50 -280 -362 268 142 -241 160 351 -95 125 466 -59 5 90 146 -116 -58 133 -296
4878 -296 -437 103 -90 -429 -129 -48 -162 -118 319 43 -164 28 286 -53 -46 472 91 -206 212 -14 -151
4899 -151 56 78 -238 -305 -63 -139 -195 -154 238 -24 211 83 20 18 366 239 -149 6 362 4 -204 25 -10
4922 -10 -456 -252 -25 -153 -253 144 72 -313 187 68 -5 4 385 168 -65 75 297 124 208 275 110 -99
4944 -99 -128 -246 -125 -264 -118 -246 -322 26 45 13 144 185 -61 175 324 -22 98 71 252 -94 -45 241 -98
4967 -98 -140 -26 -50 -11 -104 -27 -398 -27 297 125 61 36 229 4 47 671 253 -120 305 12 -66 262 -233
4990 -233 -195 -205 -156 -207 -331 -112 6 -193 -253 190 130 132 42 93 202 -53 283 -132 -148 37 41 -217 -292 -5 -307
5015 -307 -68 140 -409 -38 317 -88 66 12 153 226 115 93 355 -119 241 104 -303 329 -176 -243 -149 -462
5037 -462 -53 -165 -357 -155 -120 -246 130 194 -170 205 239 86 265 76 100 108 192 36 -87 -214 -162 58 -79
5060 -79 -30 3 -246 44 -278 -148 123 -88 33 159 203 285 67 -122 53 86 126 -23 -169 -137 -125 -109 -57 -317
5084 -317 -245 17 -95 132 223 -8 -77 22 50 154 447 70 -85 7 -102 32 -151 84 73 -337 -293 -268 -380
5107 -380 -8 141 -126 191 355 -75 282 156 121 221 106 102 17 -21 71 -90 -168 113 -111 -107 -204 -119 -242 -240
5131 -240 -102 4 38 130 261 53 116 349 -90 -24 141 52 -128 15 -89 -43 -68 -424 -151 -241 -409 -156 89
5154 89 -19 213 46 46 -10 195 243 27 72 197 -95 -166 -164 -148 4 -92 -71 -173 -65 -178 -97 -76 67 -28 -6
5179 -6 147 206 8 300 127 -198 233 339 -28 67 246 16 -29 8 -26 -139 86 -205 0 -98 -74 -50 -177
5202 -177 183 128 156 180 260 141 4 -66 -18 -105 -408 -147 17 -155 19 -80 -311 -114 117 107 -24 2 122
5225 122 11 138 378 213 -25 62 133 21 -80 8 -185 -207 -285 -197 -302 -229 93 -209 -60 70 -48 -259
5247 -259 384 107 -24 78 127 32 -28 111 116 -175 72 177 -286 -241 -39 -164 -236 232 -128 -87 -149 5 83
5270 83 25 510 350 71 -46 406 -92 -217 35 41 -110 -159 -28 -125 -335 -21 -43 -252 64 210 -186 -90 370
5293 370 185 -13 170 203 -39 -25 227 -265 -484 -28 -6 -478 -228 -87 -286 -293 177 -244 -172 132 191 -106
5315 -106 65 400 206 -122 296 440 -22 153 322 -210 -143 26 -48 -474 -251 26 -387 -308 167 46 -45
5336 -45 210 146 -112 171 278 -45 -53 119 72 -174 -137 -88 -233 -139 178 -139 -139 143 33 -201 187 164 126 66
5360 66 370 235 -129 85 270 17 -78 357 -10 -308 -6 105 -480 -250 224 -41 -415 -1 259 -209 -49
5381 -49 231 385 -90 318 297 -55 103 153 61 -240 21 -187 -449 112 60 -167 -292 17 -89 -203 -68 172
5403 172 43 -79 392 278 17 378 432 -114 31 159 -6 -271 180 -8 -370 -172 -20 -226 -333 -53
5423 -53 36 -287 126 355 -59 210 283 293 -71 246 143 -57 176 47 -248 -367 98 -238 -470 -65 -8 -230
5445 -230 -150 128 72 -35 13 230 -16 150 400 -28 -13 -34 191 -62 -62 60 -53 -189 -248 -124 -322 50 249
5468 249 -328 -40 305 -11 54 254 164 -32 -145 207 140 -22 179 101 -387 -180 -11 -285 -42 30 -238 -356
5490 -356 54 104 -58 -31 417 7 -4 210 23 13 299 268 -233 -153 -225 -165 -139 -138 -21 -137 -312 182 76 -300
5514 -300 52 195 -4 146 85 109 32 146 176 -15 23 321 37 -226 -131 -205 -321 -118 -235 -222 -181 70 -35
5537 -35 -194 -155 108 121 56 333 -17 -172 220 99 -179 -85 -74 -245 -141 -16 44 -166 -15 81 -178 -193 231
5560 231 -63 46 232 82 33 118 192 -45 101 -180 -140 -218 -24 -58 -199 84 -204 -24 -151 -108 116 23 -296
5583 -296 253 213 -35 249 284 2 97 -14 -13 -147 177 -89 -385 -248 43 -112 -88 80 -81 -146 -77 206 -5
5606 -5 133 317 67 159 -37 7 44 -108 272 -77 -134 -273 78 -329 -52 39 -187 -365 -128 32 -66 222 189
5629 189 216 256 138 121 -38 188 -50 92 -69 -53 132 -320 -112 -2 -133 -282 21 66 -17 112 41 14 369
5652 369 235 271 350 188 236 -40 -1 75 -147 93 98 32 -220 -41 -249 -267 33 49 278 113 -102 202 110 24
5676 24 61 164 179 70 171 -119 -25 -214 114 -63 -221 -193 -114 -225 10 1 -45 30 138 138 50 116 136 192 -41
5701 -41 247 30 95 41 -12 -47 -88 -109 -169 -171 -64 -198 -120 2 -21 -153 -160 67 21 153 257 175 159 52 -96 65
5727 65 -143 -9 -287 -235 -189 -120 -220 120 -120 -188 -125 94 24 -94 38 317 -7 1 100 269 -39 17 98 -133
5751 -133 -264 -75 -121 -233 -126 9 -156 -137 252 -39 -76 -58 241 -24 240 197 261 -117 102 269 -348 -262
5773 -262 -5 -242 -392 -29 -116 -188 -71 -38 -160 62 177 18 38 -160 551 79 87 263 242 -146 16 128
5795 128 -251 -141 6 -187 -37 -18 -75 -265 -79 148 -283 -262 263 155 -167 140 146 -86 167 149 246 -348
5817 -348 -101 240 -480 -338 250 -275 -190 6 5 -276 92 168 201 -101 92 322 -259 155 515 61 61 181
5839 181 -126 -390 -262 -40 -564 -306 62 -87 -97 75 -182 -134 88 326 259 20 143 244 29 159 298
5860 298 75 -242 171 105 -177 39 -2 -272 -216 -23 -295 -403 212 90 -107 -97 301 -102 18 462 69
5881 69 -114 159 231 -276 27 3 -54 -229 -117 -95 -381 -300 433 -152 -47 219 329 66 26 393 -7 78 276
5904 276 -150 -116 58 78 -200 -334 66 -119 -291 -78 24 -339 -20 57 -27 -161 54 274 41 168 327
5925 327 68 154 72 -80 -210 77 122 -208 -257 -85 48 -184 -6 75 -219 -81 114 -4 101 292 128 -257
5947 -257 247 258 -82 -49 -99 -39 -418 -212 -65 -94 -133 140 -140 -36 -11 -10 -55 282 364 -83 -53 110 368 -59
5971 -59 107 161 -47 -35 -148 -15 -172 94 -81 -241 -354 28 -151 -233 378 246 -45 83 197 -119 -155 301
5993 301 334 -197 -90 95 -165 -248 57 -236 -55 77 41 -232 -138 224 -55 -298 -48 68 -145 45 245
6014 245 -80 93 343 38 -211 -76 54 -121 -116 -132 -33 -277 -170 251 -259 126 318 -77 187 364 208
6035 208 73 282 97 11 -89 76 133 -421 -16 -7 -108 -166 141 26 -121 52 157 -32 -46 213 183 -5
6057 -5 392 369 -295 -2 300 -96 -120 -79 -48 -285 -129 151 -80 -358 -39 -258 -152 222 372 -24 228 323
6079 323 15 196 309 259 -17 -110 164 -241 -100 93 -164 -161 -138 131 -270 -177 -97 24 -233 127 458 -52
6101 -52 136 340 197 -16 206 -149 -151 -242 28 -106 -310 -189 -131 -376 -152 49 -77 -38 136 -77 -5 262
6123 262 239 263 81 162 -96 -85 207 19 -190 64 -219 -335 -305 254 -117 -124 -8 -54 -49 56 -12 -17 -112 230 233
6148 233 29 94 127 -51 -76 -14 -17 -136 -120 -75 20 -151 -245 -84 -70 214 -2 157 342 297 111 61 120 56 77
6173 77 1 258 -299 -253 -117 -347 -365 -106 -277 -157 182 -48 -6 109 217 127 70 167 174 150 -2 184 23 -99
6197 -99 126 18 -213 -17 -156 -305 -169 -133 -4 -164 18 44 99 127 328 1 60 182 104 279 162 46
6219 46 39 -158 61 40 -226 -212 20 -213 -71 135 -108 24 -84 198 394 157 162 88 1 201 267 -90 -29 201
6243 201 -137 -220 41 -230 -311 -112 -242 -164 -199 -4 85 78 271 474 -21 225 148 171 172 130 -66 -53 -126 59 -9
6268 -9 -196 -182 -249 -69 73 -181 -62 12 245 121 199 -55 259 141 -191 162 -26 130 208 152 -207 -186 -123
6291 -123 -220 -107 -215 -246 11 62 -162 56 158 126 -51 283 16 43 332 208 -145 60 84 -187 -48 -133
6313 -133 -98 -81 -285 -42 -161 -2 135 139 -35 76 -40 229 48 60 -178 42 -12 44 45 -8 -23 -121 -41 -139 -175
6338 -175 -153 -145 -72 -53 161 150 80 226 146 204 315 -43 286 69 -316 1 57 13 -221 19 -81 -214 -125 -53
6362 -53 -456 -96 56 -28 151 188 85 150 187 -25 -78 72 71 139 -295 22 -101 -335 12 -20 -21 -217 77 103
6386 103 -179 -79 214 41 -11 239 102 46 208 256 -60 15 63 -248 -244 4 -19 -442 -156 -147 -101 -188 24 -115
6410 -115 -233 -164 112 81 -135 191 245 222 163 7 -55 -104 84 -124 -229 -6 -63 -363 -214 -247 -134 35 -1
6433 -1 69 -45 34 225 43 -144 98 262 -78 124 166 -451 -72 -70 -277 -286 -238 57 -352 -281 309 -164 -126 361
6457 361 133 -123 160 277 -126 -14 26 208 -226 -22 -3 -364 -233 21 -222 -301 84 45 -224 -207 177 8
6479 8 -21 169 22 -147 110 305 -97 -129 224 -164 -152 12 247 -431 -93 174 -77 -333 101 205 -152 179
6501 179 242 21 88 160 158 -66 240 125 103 -136 60 -148 -359 80 -42 -371 -308 -13 -117 -230 -47 -78 -74
6524 -74 45 322 -154 67 167 20 80 96 279 -315 -219 171 -139 -392 -126 131 -69 -177 35 -117 -161 212
6546 212 190 -126 237 164 -31 305 276 209 -185 -94 110 -223 -313 -45 -156 -315 21 137 -165 37 -31 4 -118
6569 -118 401 272 23 62 483 -29 -179 154 -152 -129 -220 -242 -383 -266 32 35 -307 0 29 -209 255 74
6591 74 -11 154 379 225 -121 91 246 -48 145 170 5 -296 -68 46 -272 -203 165 -176 -134 123 96 4
6613 4 192 260 -81 36 305 156 -303 118 87 -274 -60 84 0 -237 25 82 -267 -157 -100 -82 -135 384 323
6636 323 -22 199 259 -52 55 102 169 11 -168 140 -20 -139 -106 -91 -242 -12 -71 -187 -52 103 -150 -37
6658 -37 -39 166 240 223 194 52 -121 216 104 -65 73 6 -68 -59 62 -263 -311 -98 121 -201 92 342 -143 -4
6682 -4 97 174 -144 65 221 -156 126 227 -99 -201 -62 -32 -247 -41 83 130 -230 -110 75 -16 -166 265
6704 265 288 -16 26 68 -106 331 226 82 -117 -69 -68 -107 -95 -153 -196 -171 128 -37 71 -13 204 66 159 290
6728 290 252 3 219 386 -64 36 11 -98 -399 25 182 -520 1 81 -22 34 -97 63 -33 107 226 -14
6750 -14 -139 146 -4 -66 29 -52 -212 -19 -10 -326 -13 46 -68 -166 -99 -16 -72 -141 214 4 154 282 123 -34
6774 -34 16 115 -113 -149 65 141 -260 -57 -44 -108 -127 -163 -93 9 -106 -202 -12 115 0 143 -45 205 138 53
6798 53 -146 127 11 -227 -101 -93 -23 -272 44 -93 -172 -83 160 81 162 15 18 4 184 -124 202 -12 283 50
6822 50 -139 -90 -10 -171 2 -179 -310 84 -78 -6 28 50 -66 134 214 20 141 -167 171 219 150 25 142
6845 142 -32 167 -14 -409 -392 40 -214 132 34 -39 107 -74 192 126 20 -20 81 63 104 20 56 30 22 -80
6869 -80 -146 -29 -190 26 -65 -191 -106 66 75 -63 27 31 162 11 257 132 29 217 182 -31 242 32 28 -120
6893 -120 -103 -9 -130 -294 -2 -191 -29 44 -41 8 123 294 -101 116 215 119 15 239 -2 30 92 -33 -169
6916 -169 -213 -210 -110 -292 -125 -59 101 188 88 228 218 346 -101 -53 42 207 131 167 27 76 -54 226 39 -336
6940 -336 -46 -12 -161 -237 3 52 123 -30 107 49 196 193 66 78 75 234 -18 44 -4 -232 -445 130 -51 -316
6964 -316 -135 -204 -35 -142 52 170 -137 104 248 110 58 188 88 -89 225 -16 128 -51 -131 -7 -233
6985 -233 -80 -118 35 -164 89 -31 -195 29 -17 170 80 161 166 50 190 -31 9 -85 72 -96 113 35 146
7008 146 -96 -72 -37 -60 -130 289 131 -87 194 191 -87 88 13 -166 84 -55 191 -105 -67 -201 -76 -234 -24
7031 -24 -48 -191 79 13 22 278 129 -34 52 203 284 -108 199 218 -87 -44 3 -113 -300 -291 -47 -237 -236 0 119
7056 119 -268 25 -176 -188 -181 246 188 -117 -78 162 -392 -91 155 -25 -296 66 -48 -437 -100 -71 -326 -27
7078 -27 171 40 48 129 180 79 68 153 -14 78 81 -62 -185 -63 61 -248 -195 19 -201 -425 80 30 55 -142
7102 -142 98 23 -170 212 265 -117 132 81 9 109 0 -62 -219 -9 88 -112 143 -81 -320 -342 -3 201
7124 201 -73 -105 176 69 -161 108 195 130 206 231 -138 -63 22 -107 -302 -124 -207 -162 -383 -93 -124 -257 7
7147 7 6 -154 44 205 -173 -107 24 189 -156 123 314 50 69 124 -157 -294 -7 37 -108 -65 -36 -142 -127 -55
7171 -55 57 -206 -80 170 42 -31 202 123 15 167 131 -281 -66 39 -41 -162 -38 -15 -53 -9 147 37 -135
7194 -135 229 169 11 150 117 -9 -72 -11 -49 -141 -87 -72 -154 -283 -13 63 -217 -126 5 -88 7 -18 -127 134 281
7219 281 0 25 84 244 -170 -161 20 -27 -104 -45 129 86 -134 -36 30 5 90 99 -15 58 123 6 43 157 -53 -131
7245 -131 -68 13 184 -57 -81 -158 -182 -281 28 -355 -114 114 -179 -296 2 56 -109 -229 96 123 -40 300 278
7268 278 -141 148 251 -20 -136 -55 -233 -143 -109 -87 -27 -177 -10 70 99 129 65 -188 78 175 30 118 254 -151
7292 -151 12 -138 -10 92 -194 112 -173 -173 -88 107 -142 -20 -39 15 209 11 8 -31 356 224 -33 14 -32
7315 -32 -36 93 18 -153 -231 -83 -187 -256 28 -231 29 -27 24 70 -52 48 101 204 274 343 65 24 56 -92 227
7340 227 -530 -314 69 -307 -225 74 -82 -21 -88 -41 157 260 33 101 223 215 160 -135 400 191 -18 -173 0
7363 0 -91 18 125 -158 -36 62 51 39 -218 62 -45 -2 166 276 -166 36 168 -3 296 -152 185 -13
7385 -13 -73 62 82 -387 -141 -116 -150 -77 -172 -233 -104 281 251 108 39 139 -10 -5 -62 8 -104 16 -260 -13 -103
7410 -103 -57 -46 -171 -66 52 5 145 132 -127 33 312 137 -14 117 -8 63 8 10 -111 -119 -108 -175 -348 -124
7434 -124 -84 31 -46 -69 2 -52 -71 -1 145 65 357 137 -28 -19 -2 88 -47 -134 -155 15 -131 -145 -146 -163 -161 105 -9
7461 -9 84 -190 -10 151 306 -11 -156 147 167 378 -85 17 -30 63 -141 -176 -183 -56 145 -48 23 -74 65 106
7485 106 50 57 134 98 100 241 91 -43 5 4 53 -55 -96 11 -166 64 143 -194 -105 220 -68 30 32 94 106 125 73
7512 73 228 183 122 171 -55 83 -182 -23 -21 -25 94 -63 -76 -186 -63 -154 69 173 -4 133 196 84 -38 24
7536 24 102 192 16 -28 -15 -157 62 -60 -361 -129 -203 134 68 140 7 -169 107 64 148 158 182 63 -33 234
7560 234 259 -107 20 -26 -254 -130 30 -55 -48 32 92 49 -54 232 -7 -109 170 -54 128 225 186 -15 42 -141
7584 -141 -186 6 -12 -90 -187 -31 107 -95 -178 151 -21 -130 116 152 -52 185 167 168 -28 118 149 99 -206 -65
7608 -65 -21 -70 87 -39 -8 -123 29 -151 38 109 70 93 176 327 282 -21 4 21 -11 -33 -37 -224 -6 0 -264 -98
7634 -98 -111 176 -51 22 -24 56 29 19 295 -69 190 220 68 -190 110 194 -147 6 185 -237 -121 140 -199
7657 -199 -103 262 -48 -78 177 308 66 118 157 207 61 195 24 -266 -174 0 -92 -182 -84 21 -23 -173 -87 -147
7681 -147 32 -53 191 -138 20 15 -105 24 109 54 -99 146 195 -51 -51 139 -115 57 130 -46 93 53 112 -53
7705 -53 -177 115 265 -41 22 194 -162 -44 246 197 -222 -66 206 -61 -182 117 -20 -301 134 -14 -104
7726 -104 62 145 -34 -48 52 80 -123 107 -31 269 -51 -68 46 -115 81 -44 -34 55 44 -81 -209 -82
7748 -82 -118 -140 -91 287 133 155 127 128 250 -49 143 -97 -22 2 -168 -116 25 -55 -121 -316 156 3 -168 272
7772 272 76 -129 -59 243 35 194 125 188 40 133 74 -94 -33 26 -66 -121 -52 -161 -262 12 68 104 -151 89
7796 89 95 -28 56 330 -155 38 285 -136 -106 -37 -8 -71 -138 67 57 -224 118 -106 -197 3 -92 9 1 -19 38
7821 38 108 87 -31 360 -80 85 -55 -244 155 195 -145 -228 74 -281 -213 -182 -44 69 -60 100 -28 -260
7843 -260 -73 355 -197 223 217 98 16 121 77 111 29 79 -78 13 -23 2 -96 217 -26 39 49 174 245 -59 42
7868 42 144 -57 35 347 14 -45 174 -3 17 -125 -99 -26 -311 5 -124 -112 48 291 36 91 82 -5 -112 89
7892 89 157 -190 1 109 -20 -194 -72 67 29 30 102 -235 80 -45 54 -10 77 308 21 80 76 231 20 192
7916 192 184 -239 -53 91 69 -65 -98 22 -104 -106 -73 -166 -57 90 17 90 20 217 -65 -122 124 -25 131 145
7940 145 101 10 105 71 -213 -6 -243 216 -44 -70 168 46 187 132 71 227 167 -32 98 71 45 -50 -46 161
7964 161 -63 67 -38 -31 -32 166 -112 57 -213 -427 161 -90 -61 -158 -17 114 41 -192 168 184 -70 155 47
7987 47 -266 -149 -107 -153 -216 135 98 89 66 -142 155 45 200 14 215 212 123 32 -76 166 67 68 -53 -23 -204
8012 -204 20 -16 28 -24 -79 -40 -2 15 19 44 48 86 -19 -93 99 68 72 -94 291 -159 -238 209 -123 -179 200 -164
8038 -164 -229 -131 162 237 6 24 311 72 26 70 110 262 114 -219 59 154 -12 89 111 -52 74 -109 -6
8061 -6 347 142 125 15 -55 200 -149 326 197 24 45 0 -51 99 52 -25 186 109 -36 -166 -85 9 -13 100
8085 100 -190 -81 -41 1 -43 168 93 26 -21 243 -93 -139 22 -254 101 -182 -139 34 4 -134 0 -197 -261
8108 -261 -22 -204 24 -98 -71 83 240 315 177 -17 -91 114 83 -303 57 -82 -255 184 -14 -25 -39 173
8130 173 130 -121 -37 -127 116 120 166 103 -94 -53 -117 -125 -158 15 96 -208 8 -71 -73 -100 -39 -113 -167 25 -49 2 107
8157 107 215 187 63 -376 93 0 -164 159 38 87 256 -37 112 -54 -75 -129 101 47 -59 -92 137 74 -68
8180 -68 -88 112 151 146 150 -164 -97 87 18 -33 -42
8191d2
##END NTUPLES=NMR FID
##END=
