##TITLE=1H_Pr N-2
 CDCl3
 8 sc, 
 2.10.2024
##JCAMPDX= 6.0         $$ Bruker NMR JCAMP-DX V2.0
##DATA TYPE= NMR FID
##DATA CLASS= NTUPLES
##ORIGIN= UXNMR, Bruker Analytische Messtechnik GmbH
##OWNER= root
$$ XWIN-NMR		Version 3.5
$$ Wed Oct  2 15:42:38 2024 Russian Standard Time (UT+4h)  she@DPX200
##.OBSERVE FREQUENCY= 200.1318
##.OBSERVE NUCLEUS= ^1H
##.DELAY= (6, 6)
##.ACQUISITION MODE= SIMULTANEOUS
##.ACQUISITION SCHEME= undefined
##.AVERAGES= 8
##.DIGITISER RES= 18
##SPECTROMETER/DATA SYSTEM= spect
##.PULSE SEQUENCE= zg30
##.SOLVENT NAME= DMSO
##.SHIFT REFERENCE= (INTERNAL, DMSO, 0, 15.7039)
##AUDIT TRAIL= $$ (NUMBER, WHEN, WHO, WHERE, WHAT)
$$ ##TITLE= Audit trail, XWIN-NMR		Version 3.5
$$ ##JCAMPDX= 5.01
$$ ##ORIGIN= Bruker BioSpin GmbH
$$ ##OWNER= she
$$ F:/spectra/data/she/nmr/H-F/1/audita.txt
$$ ##AUDIT TRAIL=  $$ (NUMBER, WHEN, WHO, WHERE, WHAT)
(   1,<2024-10-02 15:41:26.84 +0400>,<she>,<DPX200>,
      <created by zg, POWCHK disabled, PULCHK disabled
       configuration hash MD5:
       00 E9 B6 7A A2 85 ED C7 34 08 36 98 17 FE 4E 26
       data hash MD5: 16K
       7B 15 D6 7F 2D EF A9 26 E8 73 C5 9A FC C0 31 E4>)
$$ ##END=
$$ 
$$ hash MD5
$$ E7 61 99 0A D5 4D C3 42 E3 6C 62 C9 C6 0A CC 51
##$RELAX= 
##$RELAX= 
##$RELAX= 
##$RELAX= 
##$RELAX= 
##$RELAX= 
$$ Bruker specific parameters
$$ --------------------------
##$DU= <F:/spectra>
##$EXPNO= 1
##$NAME= <H-F>
##$PROCNO= 1
##$TYPE= <nmr>
##$USER= <she>
##$AMP= (0..31)
100 100 100 100 100 100 100 100 100 100 100 100 100 100 100 100 100 100 
100 100 100 100 100 100 100 100 100 100 100 100 100 100 
##$AQSEQ= 0
##$AQ_mod= 1
##$AUNM= <au_zg>
##$AUTOPOS= <>
##$BF1= 200.13
##$BF2= 200.13
##$BF3= 200.13
##$BF4= 200.13
##$BF5= 200.13
##$BF6= 200.13
##$BF7= 200.13
##$BF8= 200.13
##$BYTORDA= 1
##$CFDGTYP= 0
##$CFRGTYP= 5
##$CHEMSTR= <none>
##$CNST= (0..31)
1 1 145 1 1 1 1 1 1 1 1 1 1 1 1 1 1 1 1 1 1 1 1 1 1 1 1 1 1 1 1 1 
##$CPDPRG= <>
##$CPDPRG1= <>
##$CPDPRG2= <>
##$CPDPRG3= <>
##$CPDPRG4= <mlev>
##$CPDPRG5= <mlev>
##$CPDPRG6= <mlev>
##$CPDPRG7= <mlev>
##$CPDPRG8= <mlev>
##$CPDPRGB= <>
##$CPDPRGT= <>
##$D= (0..31)
0 1.2 0 0 0 0 0 0 0 0.06 0 0.03 0 0 0 0 0.0002 0 0 0 0 0 0 0 0 0 0 0 0 
0 0 0 
##$DATE= 1727869286
##$DBL= (0..7)
120 120 120 120 120 120 120 120 
##$DBP= (0..7)
150 150 150 150 150 150 150 150 
##$DBP07= 0
##$DBPNAM0= <>
##$DBPNAM1= <>
##$DBPNAM2= <>
##$DBPNAM3= <>
##$DBPNAM4= <>
##$DBPNAM5= <>
##$DBPNAM6= <>
##$DBPNAM7= <>
##$DBPOAL= (0..7)
0.5 0.5 0.5 0.5 0.5 0.5 0.5 0.5 
##$DBPOFFS= (0..7)
0 0 0 0 0 0 0 0 
##$DE= 6
##$DECBNUC= <off>
##$DECIM= 24
##$DECNUC= <off>
##$DECSTAT= 4
##$DIGMOD= 1
##$DIGTYP= 9
##$DL= (0..7)
0 120 120 120 120 120 120 120 
##$DP= (0..7)
150 150 150 150 150 150 150 150 
##$DP07= 0
##$DPNAME0= <>
##$DPNAME1= <>
##$DPNAME2= <>
##$DPNAME3= <>
##$DPNAME4= <>
##$DPNAME5= <>
##$DPNAME6= <>
##$DPNAME7= <>
##$DPOAL= (0..7)
0.5 0.5 0.5 0.5 0.5 0.5 0.5 0.5 
##$DPOFFS= (0..7)
0 0 0 0 0 0 0 0 
##$DQDMODE= 0
##$DR= 18
##$DS= 0
##$DSLIST= <SSSSSSSSSSSSSSS>
##$DSPFIRM= 0
$$ [...]
##$SUBNAM2= <"">
##$SUBNAM3= <"">
##$SUBNAM4= <"">
##$SUBNAM5= <"">
##$SUBNAM6= <"">
##$SUBNAM7= <"">
##$SUBNAM8= <"">
##$SUBNAM9= <"">
##$SW= 24.0689170037331
##$SWIBOX= (0..15)
0 0 2 0 0 0 0 0 0 0 0 0 0 0 0 0 
##$SW_h= 4816.95568400771
##$TD= 16384
##$TD0= 1
##$TE= 0
##$TE2= 300
##$TE3= 300
##$TEG= 300
##$TL= (0..7)
0 120 120 120 120 120 120 120 
##$TP= (0..7)
150 150 150 150 150 150 150 150 
##$TP07= 0
##$TPNAME0= <>
##$TPNAME1= <>
##$TPNAME2= <>
##$TPNAME3= <>
##$TPNAME4= <>
##$TPNAME5= <>
##$TPNAME6= <>
##$TPNAME7= <>
##$TPOAL= (0..7)
0.5 0.5 0.5 0.5 0.5 0.5 0.5 0.5 
##$TPOFFS= (0..7)
0 0 0 0 0 0 0 0 
##$TUNHIN= 0
##$TUNHOUT= 0
##$TUNXOUT= 0
##$USERA1= <user>
##$USERA2= <user>
##$USERA3= <user>
##$USERA4= <user>
##$USERA5= <user>
##$V9= 5
##$VALIST= <valist>
##$VCLIST= <CCCCCCCCCCCCCCC>
##$VD= 0
##$VDLIST= <DDDDDDDDDDDDDDD>
##$VPLIST= <PPPPPPPPPPPPPPP>
##$VTLIST= <TTTTTTTTTTTTTTT>
##$WBST= 1024
##$WBSW= 4
##$XGAIN= (0..3)
0 0 0 0 
##$XL= 0
##$YL= 0
##$YMAX_a= 452150
##$YMIN_a= -496537
##$ZGOPTNS= <>
##$ZL1= 120
##$ZL2= 120
##$ZL3= 120
##$ZL4= 120
##$ABSF1= 10
##$ABSF2= 0
##$ABSG= 5
##$ABSL= 3
##$ALPHA= 0
##$AQORDER= 0
##$ASSFAC= 0
##$ASSFACI= 0
##$ASSFACX= 0
##$ASSWID= 0
##$AUNMP= <proc_1d>
##$AZFE= 0.1
##$AZFW= 0.1
##$BCFW= 1
##$BC_mod= 2
##$BYTORDP= 1
##$COROFFS= 0
##$CY= 11.3945322036743
##$DATMOD= 1
##$DC= 2
##$DFILT= <>
##$DTYPP= 0
##$F1P= 15.6554695791079
##$F2P= 12.8336369535428
##$FCOR= 0.5
##$FTSIZE= 0
##$FT_mod= 4
##$GAMMA= 1
##$GB= 0.15
##$INTBC= 1
##$INTSCL= 1
##$ISEN= 128
##$LB= 0.24
##$LEV0= 0
##$LPBIN= 0
##$MAXI= 10000
##$MC2= 0
##$MEAN= 0
##$ME_mod= 0
##$MI= 1.114404
##$NCOEF= 0
##$NC_proc= 0
##$NLEV= 6
##$NOISF1= 3.799351
##$NOISF2= 2.8
##$NSP= 1
##$NTH_PI= 0
##$NZP= 0
##$OFFSET= 15.70392
##$PC= 1
##$PHC0= -25999.31
##$PHC1= 13.38747
##$PH_mod= 1
##$PKNL= yes
##$PPARMOD= 0
##$PSCAL= 0
##$PSIGN= 0
##$REVERSE= no
##$SF= 200.130013532006
##$SI= 16384
##$SIGF1= 3
##$SIGF2= 2
##$SINO= 400
##$SIOLD= 16384
##$SREGLST= <1H.CDCl3>
##$SSB= 0
##$STSI= 0
##$STSR= 0
##$SW_p= 3612.71676300578
##$SYMM= 0
##$S_DEV= 0
##$TDeff= 0
##$TDoff= 0
##$TI= <>
##$TILT= no
##$TM1= 0
##$TM2= 0
##$TOPLEV= 0
##$USERP1= <user>
##$USERP2= <user>
##$USERP3= <user>
##$USERP4= <user>
##$USERP5= <user>
##$WDW= 1
##$XDIM= 8192
##$YMAX_p= 0
##$YMIN_p= 0
$$ End of Bruker specific parameters
$$ ---------------------------------
##NTUPLES= NMR FID
##VAR_NAME=  TIME,          FID/REAL,        FID/IMAG
##SYMBOL=    X,             R,               I
##VAR_TYPE=  INDEPENDENT,   DEPENDENT,       DEPENDENT
##VAR_FORM=  AFFN,          ASDF,            ASDF
##VAR_DIM=   8192,          8192,            8192
##UNITS=     SECONDS,       ARBITRARY UNITS, ARBITRARY UNITS
##FACTOR=    0.0002076,     1,               1
##FIRST=     0,             0,               0
##LAST=      1.7004516,     0,               0
##MIN=       0,             -496537,         0
##MAX=       1.7004516,     452150,          0
$$ Real data points
##PAGE= N=1
##DATA TABLE= (X++(R..R)), XYDATA
0@%%%%%Qq%qJ6j7K5l2M0m9N7p2Q8j04J21j44J73k01K30k66L10l57M05m60N27n97
31c15O68p52Q48r52J062j183J319j464J625j803J996k210K445k707L000l325L687
48A939m096M564n101N726o464P349q435R796j1552J3896j7092K1128k5642M66134
62D52150l40120n59222N02969K85556m12942j74979L63305M4713k58944J709J12467
73A6662L1257L6803j89559l6120L12690k6557l43373Q8271L39933j28688l71415
84b70096K22804L31289l34543k13410L49640R3290k59609m8732J93024M5218j45206
95c6331k1325P2608L0488l028j30810J6297K19828j22539k09982K05671J34835
106A55712j99895o4427J73944J0869j41646N7379N4733r2648O4545R725j31282
$$ y = [0, 0, 0, 0, 0, 0, 8, 0, 0, -8, 8, -9, 16, -16, 24, -25, 32, -40, 48, -56, 65, -79, 94, -107, 123, -143, 167, -190, 215, -245, 282, -315, 353, -399, 449, -503, 559, -624, 695, -769, 856, -947, 1049, -1161, 1284, -1423, 1577, -1748, 1939, -2157, 2407, -2694, 3032, -3432, 3917, -4518, 5278, -6274, 7622, -9470, 11658, -13984, 452150, 112030, -447192, 55777, 341333, -71609, -246588, 116717, 161430, -97514, -95805, 16662, 47919, 84722, -104837, -140957, 171733, 145176, -198197, -109926, 230007, 101319, -270096, -47292, 283997, -50546, -263956, 85684, 178974, -80635, -129367, 63657, 108875, -36331, -57656, 14952, 45440, 42412, -88398, -72101, 147727, 25188, -184794, 20877, 155712, -44183, -108610, 65334, 76203, -65443, -8064, 46669, -45979, 18566, 28291, -102991]
117a02991J27414R3314k06114j2057K22455l4609k20788Q9326K00823j70846j20536
128a34609K05556l462j55447P2369O3989p1012J0593O0101p3845l6149J59225
139I7309m1604k06372J58212J52858k45517m7499K53941m0239k28358J06292J94498
150A53521j59526j14404J77399L231j15813O6230Q035n8306O0945N800q4483M3414
162a3957R3537r5188p9125J55771K7410j74632M2102J31884q0938p3297P2738
173F305L5301n8756j2113M5559r166q086J4476l9708J9366O0636o3159m4871Q1160
186B6944J2698q1515J3979P7357m6368n7361P8753J4603p5324L4020L4130n7970
198b6054J4826N3868n6692l7266Q5097P217r4905L9500P4360p7278k5976Q2704
$$ y = [-102991, 24423, 117737, -88377, -100434, 122021, 87412, -133376, -44050, 156773, -14073, -134609, 70947, 67485, -87962, -15593, 48396, -22616, -12023, 48078, -25767, -61916, 97309, 55705, -150667, 7545, 160403, -85114, -132613, 121328, 81089, -147269, -40977, 153521, -6005, -120409, 56990, 60221, -55592, 10638, 18673, -39633, 21312, 27112, -57371, -13957, 79580, -15608, -94733, 61038, 88448, -86184, -44082, 87802, 6864, -66433, 6305, 41606, -17150, -29263, 16296, 7130, -956, 13520, -26188, -6822, 53814, -9345, -54216, 26944, 39642, -41873, -27894, 49463, 3095, -54266, 24487, 39090, -36234, -2214, 31916, -26054, -11228, 42640, -14052, -51318, 33779, 40996, -53909, -14409, 59951, -17327, -43303, 39401]
210C9401j9044n8384M2724J8135m8483K6027L3241o6814M659Q6893n1072p3167
222f5884Q8431M1086j06902q074J09819k6650r8954N4222O9386o0334l3542M5211
234G815J2717k0632q020O96J1008J7934k7076l5362N9855L0393r2217k934J02877
247E7054k3984r3182M4260P9123o1423o0195P3936K6181o6383M87L3590J764l691
260G537k2768n65L9256k457m8333N594O3738k4560p5704N7510N8509q0125k3565
273d5933P1908M570n3053J759M7097j2231l6378K5249O958j6886J1639j5457L38
286a0420L0480j9282k2774K3167K3700k2849l0896M2643J6229n9656J8662M0992
298B9996l9909j0972K8624K42j6003K373K0194j6872q426L3065k4895j6177L8778
$$ y = [39401, 20357, -38027, 4697, 22832, -25651, 376, 33617, -33197, -28538, 58355, 7283, -65884, 22547, 63633, -43269, -51343, 58476, 31826, -67128, -12906, 56480, -3854, -37396, 7815, 20532, -100, -8120, -7424, 3584, 21518, -5558, -40920, 18935, 49328, -42889, -45823, 57054, 33070, -60112, -15852, 63271, 1848, -58347, 15589, 41770, -24613, -24126, 9464, 11228, 7537, -15231, -15796, 23460, 21003, -27330, -21736, 42002, 17442, -58262, -752, 57757, -22368, -45933, 25975, 30545, -22508, -20749, 26348, 14117, -22261, 2988, 9946, -6940, 4699, -10758, -10420, 20060, 778, -21996, 1171, 24871, 2022, -28874, 13769, 29998, -29658, -10996, 29996, -9913, -20885, 7739, 7981, -8022, -5649, 14545, -2327, -10753, 22312, -2583, -18760, 20018]
311B0018k0709k0079K9067j781j5286N21J6688Q23k3811K1430R065l3691K2819
324E074J0254l1822J4001R638j2973j033N891J3283j9819l603L6004k5160j6802
337a7067L3306j3607j4191J3593j345j859p903J0017P660k1412J9267N776k8326
350a6091K6575K957k9961J8525O466j4640k690P899J3926k4199j487L5699k4745
363a766j0856K7757j4423m844O497n906P129r773J875Q800j3259J5092k109j9134
377a4920K9283m756k3670J8938K621r255o562M135J8242k4147n046L3480j9770
390a427q030K0069j1574L129J325q266R503p644J392J505j0044K0016q798j8561
404a7405K9938m422j8220J4720M52k757o987q77J7328j8098n470K1690j3231j58
$$ y = [20018, -691, -20770, 8297, 6516, -8770, -8249, 8439, 9262, -14549, 6881, 15946, -17745, 5074, 15328, -16494, -2493, 7145, -5828, -6861, -970, 12313, -7506, -11109, 24895, -265, -17067, 16239, 2632, -11559, 2034, 689, -1170, -9073, 944, 8604, -12808, 6459, 12235, -16091, 10484, 13441, -16520, 2005, 8471, -6169, -8859, -960, 12966, -11233, -12720, 22979, -1766, -12622, 15135, 712, -4132, 2365, -3541, 3588, -6185, -4310, 4490, -8769, 6323, 4214, -14920, 14363, 9607, -14063, 4875, 7496, -1759, -8321, -4186, 14056, -10091, -15137, 18343, -1427, -9457, 10612, -962, 2167, 3492, -4774, 4729, -2915, -1523, -18, -10062, 9954, 1156, -17405, 12533, 8111, -10109, 4611, 5063, 2306, -4681, -5558, 11770, -6328, -11798, 9892, -3339, -3497]
418c497R413j0542R611j617o717Q352o920K849j29j0668J7949p551j4795K2647
432H385l930j1376R884J50J417p524n73J3925j6127j941J4561j1583L550M468
446C286r664J1630k247o750Q037l908K264m416n347J6373r943j1336J6696k298
460B377n672L523o06P371p696m275J2474q781k066M969p696Q657M6j0813R719
475A531K685k851k971j326J1501o909j1367J3944j00r163K149N02O771k516q722
490f842R220L062n205j349j898R121l264j3939J0545P725q927m517L757J0535
504H024m034j2649R792P818q680n946K373J1057m947j6211J0875J3605j0931j0325
518a0179R644J3552j0735j4231J4440Q413j3290o815Q011R211p178j1954R933
$$ y = [-3497, 5916, -4626, 4985, 3368, -3349, 5003, -1917, 932, 803, -9865, 8084, 533, -14262, 8385, 4455, -6921, 2963, 3113, 4530, -2994, -3567, 10358, -5769, -7710, 6851, -4732, -1182, 3286, -6378, 5252, 3005, -3745, 4292, 384, 2648, -1768, -7115, 9258, -685, -12021, 4675, 2377, -3295, 228, -378, 6993, -703, -4978, 7496, -1285, -3351, 1618, -6078, 2579, 2625, -8188, 1531, 4216, 1365, -1606, -2932, 8569, 1660, -9707, 4237, 4137, -5026, -2877, -2375, 4396, 1880, -6842, 2378, 5440, 235, -1114, -3012, 6109, 2845, -11094, -549, 7176, -1751, -6268, -2511, 8024, 3990, -8659, 1133, 8951, 271, -5675, -3302, 7755, 2808, -13403, -2528, 11077, 146, -10179, -535, 13017, 2282, -11949, 2491, 10904, -2386, -9201, -1190, 8021, 843, -11111, -1178]
531a178J1118p324j1141N379J5441p147j8039R888J6145j0981j8568J1994K1464
544A7051j6263j9195K1719J3362j9131r631J5908R106j6768q007J4082N657q525
557f35r487N570J6860q058j6535J1096J3981q563j6149O387K1448j2899k2222
570a9206J6263J9635j4749k0257J6172K3236k1672j7452K5488N771j9048l820
582i639J0317Q847j1181j0270J2425P513n636q622M59J7248l569j9973Q682J3212
596I813m626j6477j019K8346o611l2829K0419K4590k0790j6593J6654J6152j9701
609b672j2265K2354j008j3301M738k359P697O208j7436J184J4384K272j1742j2494
623a4440K1983R037l2802L195K8720p517k4333M042L2957r015l6669K4036K2304
$$ y = [-1178, 9940, 2616, -8525, -3146, 12295, 5148, -12891, -3003, 13142, 2161, -16407, -4413, 17051, 788, -18407, 3312, 16674, -2457, -12088, 3820, 12926, -3842, -11849, 2233, 7890, -635, -10122, -4552, 12308, 4250, -12285, -1189, 12792, 4229, -11920, -5533, 15915, 3016, -19206, -2943, 16692, 1943, -18314, -2142, 21094, -578, -18030, 7458, 13229, -5819, -9639, 678, 9525, -1656, -11926, 499, 8012, 2376, -6246, -5787, 11461, 7892, -12081, -3399, 9813, 5187, -11290, -12309, 16037, 9426, -23403, -2984, 21606, 816, -15777, 877, 17029, -2672, -14937, 7417, 6409, -6892, -2154, -4513, 3184, 9392, -8044, -6860, 7524, 9796, -1946, -14440, 7543, 16580, -16222, -13027, 15693, 8176, -16157, -12115, 20842, 11827, -24842, -806, 21498]
636B1498k6406m255J0236K325n47j0241L200Q436l15m370j1625J5769J7042l0724
650i977n509K8118j236j9845q227K4538J1810l8205J599M0355j3291k7871R876
663g865K5093n958k9958J3667K1463k0336m223P414P10Q638j3483n989K0319R04
677A0396j3193r348J2346K0857k7074j6406L3256L429k6512k453K6441Q179l8944
690a9026L101M3905k0818k8222K1256J0123q385r689L281J0168p235P79m00m103
704e265J9437j0945k3723K7936J1867k6891j0332K0367J8190k8050j5796L8194
716A4989M98l2057R304K0907k602k2186n69K6965r598j7955J0630J157M698p10
730C471j5833J3536J2656j6544p303J1366J5413j8177k1469L0050J1172k9792
$$ y = [21498, -4908, -9163, 1073, 3398, 2851, -7390, -4190, 4246, 3931, -439, -12064, 3705, 20747, -9977, -15486, 12632, 11396, -8449, -16676, 7862, 19672, -18533, -16934, 23421, 10130, -17741, -7865, 17228, 11270, -18688, -5021, 16442, -3894, -8117, -703, 7, 8645, -4838, -10827, 9492, 10396, -2797, -12145, 201, 21058, -6016, -22422, 10834, 14263, -12249, -14702, 11739, 19918, -19026, -15925, 27980, 7162, -21060, 196, 10319, 1934, -7755, -4474, 5694, -1541, -762, -1162, -5265, 14172, 3227, -20496, 7440, 19307, -7584, -17916, 2451, 20641, -7409, -23205, 14989, 15487, -16570, -7266, 13641, 11039, -11147, -11716, 15249, 5651, -12304, -1674, -517, 4181, 3471, -12362, 1174, 13830, -2714, -10017, 1349, 16762, -1415, -22884, 7166, 18338, -11454]
742a1454k303J9132Q357j7432j3405K9321N511l3635N931K4411o031j9752o89
755a2038K1932k840j7612R006M923q93J758j2642R441J2957j9112o892J6296P231
769A1515j4700j4940K2906J2281k7187m33K1858k233j6030j050J9741l407k3917
782a5596J2721J3219j3658q88L543k46M801k351l714J236O231j739j3268R027
796f82J3143j9553l816J6723q78p447k570O838O171j0320j322Q877k398n433k031
811d698N207L816p949m99M817l59L994n153l902J0578k060q857L875N122l645
826B87o854M512Q432o048o889N305O886p32r918J498J1453p523p611R440J734
841C972p682p84N539J862k097k444o09M826M177r871l220J2484k862j1258N659
$$ y = [-11454, -13757, 5375, 13732, -3700, -17105, 12216, 17727, -15908, -9977, 14434, 8403, -11349, -12038, 9894, 7054, -10558, -1552, 3371, 2478, 4236, -8406, 1035, 13992, -5120, -12012, 4284, 11515, -3185, -18125, 4781, 17062, -10125, -10558, 11300, 9067, -6963, -8013, 11728, 8321, -15596, -2875, 10344, -3314, -4202, -659, -905, 3896, 1545, -2169, -933, 5298, 3559, -9709, -682, 12461, -7092, -10908, 5815, 4937, -2510, -5080, 1758, 7929, -2391, -3713, 5164, 2766, -2667, -4698, 509, 4325, -3624, -4123, 694, 335, 4329, -824, -4726, 5852, 3792, -5065, -1190, 3932, 287, -6567, -2055, 6377, 329, -6560, -1255, 5631, 4899, -5019, -3521, 7932, 409, -7202, 2238, 3972, -3710, -4494, 1045, 2907, 810, -1634, -2243, 2583, 6760, -3111, -6331, 6153, 3291, -7967, -2308]
856b308P955m969p448N917Q270o319n676M421N424l178p746M030N799o067k160
871d055M278J889p05l923R61O444k343n866P95O327j337q392M749O625q383r36
887c872N873j12p76l080J292M400k736l648J245K850j70n553L020N392o433N19
903a789M321k293J601k684j318N101l198j487R86q0K220k993l56N121l590N16
919G8J267j819L406l747l191P235l533k697L633j721K240j113j845M598k337j209
935g55J820k430M082l512m394Q760k875m837N422j121R85m68k698N712l083l611
951c003M493k180J582j188m111P893k232n203P138k415n77Q06l398N760k573n774
967d982P128j536k372K069k382N429k647m149P776l797k974M606l525K660j224
$$ y = [-2308, 5647, 678, -6770, -853, 7417, 1098, -4578, -157, 5267, 2089, -5657, -1627, 4172, -1895, -4055, 223, 2112, 1407, -2516, -1555, 4889, 2546, -3320, -2525, 3802, 2465, -5927, -1178, 5447, -2936, -3872, 2001, 1889, 1113, -1967, -675, 3725, 989, -2659, -1414, 1436, 1266, -4287, -1267, 4125, -2308, -1789, 2532, 239, 1840, -844, -2162, 2939, -259, -1746, -760, -840, 1380, -1613, -1969, 3152, -438, 78, 1345, -474, 2932, -815, -4006, 3229, -304, -3001, 632, -1089, 1151, 38, -1807, 2791, 454, -755, 1065, -1365, 2717, -795, -5189, 3571, 696, -4141, 1281, 160, 1145, 677, -2021, 3691, 608, -3003, 1490, -690, 892, -296, -4407, 3486, 1254, -3949, 3189, 774, 197, 1003, -2395, 3365, 792, -4982, 2146, 610, -1762, 307, -2075, 3354, 707, -3442, 4334, 537, -2437, 2169, -1356, 1304, 80]
982H0m932P249k067l642N593k724J908n6l815O285l119m811O699l642M5J911m463
999c501O142j678m452O722k805r19K613m014M475k252m957P251l164j897M079
1014A643l847M113l8m806O983l325k895N271m977J586R22n064O213j492k917N689
1030C059l987J656J861m819N280k257m329N628l491j35L005m949N111m70l584
1045b421N907l701o00L935n198K996lm689N324k713r66M217m287L089J334m652
1061b428N757k136l542M482l432Q25J151m436M832r89k865N648l605O43K653l995
1077a437L406o34m248M181k626J5K571m417L875R27m099M945j374j392K148l165
1093a324K187K34m077L568j176j197L555l951K797K237m949L593N72k508J135
$$ y = [80, -4852, 2397, 330, -3312, 2281, -443, 1465, 1409, -2406, 3879, 760, -4051, 2648, -994, -949, 962, -3501, 2641, 963, -3489, 3233, 428, -491, 2122, -1892, 2583, 331, -4626, 2625, -539, -2436, 1643, -2204, 1909, 1871, -2935, 4048, 723, -2172, 3099, -1878, -292, 630, -4434, 1779, 287, -2630, 3059, -928, 728, 2589, -2230, 3050, 793, -3536, 2092, -1399, -1534, 1471, -3478, 1633, 1163, -2421, 3486, -215, -815, 3120, -2078, 918, 915, -3774, 1550, -1163, -2129, 2088, -2199, 890, 2224, -2428, 3329, 1193, -2349, 2133, -1299, -474, 677, -3759, 1073, 84, -2781, 2867, -738, -95, 2558, -1437, 1969, 1335, -2913, 1268, -1358, -1343, 1228, -3189, 686, 1613, -2486, 2459, 1085, -307, 1841, -1324, 863, 1097, -2980, 588, -588, -1785, 1770, -2181, 616, 2853, -2096, 1497, 2069, -439, 696]
1108F96k486K257O95m786M345K06k487L056k029J294J636l489J536J055k341O95
1124a47k066J806K629n625K400L554k578l54Q68J302j58m038K771J517l423O57
1140h85n41J073K117l729R44M112k553j229O62J985m49m682K518K959m077j24
1156a899J821P53P62k062M79J958n84j176j223K050Q76m702M99M987j122m290
1172b873J382M908k210m271M664J389m206P5K088p47q09o01M4J139J983j608l216
1189b869M613K401o310MM954j644m210O99N092j419n275L633L280k226k050Q35
1205d92K977j150l770K034J279j446l4k033L409J965n100M81M745q74k257k335
1221b601L914J342n803J052L455j02k625k329O924J774r673K658P302m317m201
$$ y = [696, -1790, 467, 1162, -3624, 721, 927, -1560, 1496, -533, 761, 2397, -1092, 444, 1499, -842, -147, -2213, -407, 2222, -3403, -1003, 2551, -27, -381, 487, 1789, 1631, -2407, 364, 1881, -1542, -885, -1426, -353, 1764, -1965, -1021, 3091, 538, -691, -29, 1956, 1507, -3175, -657, 2302, -1775, -1899, -78, 675, 1437, -625, -146, 1812, 1228, 52, -1171, 879, 1755, -2947, -2448, 2539, 1417, -2873, -1491, 3417, 1207, -3064, 1600, 2989, -1217, -1142, 946, 199, -610, -1211, -1167, -28, 1955, 347, -2869, 1744, 4145, -2165, -2161, 2793, 1149, -3061, -2362, 2730, 1311, -3964, -331, 2949, 723, -1327, -492, 2485, 1335, -2435, -401, 878, -568, -602, -2635, 774, 2739, -2361, -1880, 2865, 1991, -266, -2601, 1313, 2655, -3148, -2096, 1359, 1257, -1368, -3697, 3227, 5001, -4672, -2014, 5288, 971, -3230]
1236c230K420K957j991m052N021M39l859L662j994j54N145m817k989N021J578
1251C157l337n245O377N050j1517J565J0739n506n446L602M988k583p110N730
1265D64L374p681L915J031m298N482j288l202L016J567j347m676L128P703j0166
1280b978k882J0658l742m435K344K551K125o745J104P462n340k604K701q37L260
1295B642m446j685O534l879mJ729k444M608k390m023O028q01k591j694k24P701
1311E061m842p209R877J180o708J163L405K219p438j222J1131n978o496P907j885
1326A65j322K323j942Q10k75K268l54o180Q026J22j2191Q820O967j1037j257O562
1342A505L146o208l402J0464k773q293Q212j43m298J710j858K498Q05k698J945
$$ y = [-3230, -810, 2147, 156, -3896, 1125, 1564, -2295, 1367, -627, -781, 4364, -453, -3442, 1579, 3157, -180, -5425, 952, 6002, -5515, -3950, 6789, 1283, -4163, -561, 4427, 1844, -5266, 464, 3838, -3843, 72, 1103, -3195, 2287, 999, -2203, 813, 2380, 1033, -3643, -515, 7188, -2978, -5860, 4798, 1056, -3379, -1035, 1516, 3641, -3104, -2000, 5462, 122, -2482, 219, -618, 2642, -1804, -3489, 3045, -834, -838, 891, -1553, 3055, 665, -3358, 2670, 1869, -722, -2416, -2640, 5061, 219, -6990, 2887, 4067, -2641, -1478, 1927, 4146, -3292, -4514, 6617, 639, -5857, 2050, 165, -1157, 1166, -776, 34, -241, 2027, 1673, -4507, 3519, 3641, -8550, 270, 7237, -3800, -5057, 1505, 4651, -1557, -4959, 5505, 2732, -5561, 2651, 2508, -1790, -80, -1938, 560, 1365, -1333, 612]
1357F12l130L533M047r045L372N926p389n35L036J914k657n254P203K481p547
1372c433L294J709j782K888m599K109L554p056J216M031j172j138l111M829J507
1387B846n041L617q00k726N374l613k689N768l212k693K569K929k89o964M233
1402f91P770q817j579O649k609k174j97L238k23n295M253J868m609M599m78n553
1418c848N890J292n222l56L704P16o877L084P713q426k325Q898k892k704K012
1433F59k89K01j312P70M14k051K401j332j979N813k136m486M095J377j670j774
1449a299K18K869k523j075L396k603j69J413n50K097n62k422N98J767P84k985
1465a046j830M668j704l024M615k23l665J967K224j170j649J328k92j960L219
$$ y = [612, -2518, 1015, 5062, -3983, -611, 5315, -2074, -2609, 427, 2341, -316, -5570, 1633, 4114, -3433, -139, 1570, -212, 2676, -1923, 186, 3740, -3316, -2100, 1931, 759, -379, -3490, 1339, 2846, -2195, 1422, 622, -2104, 3270, -343, -3032, 2736, -476, -3169, -600, 2329, 2040, -4924, -691, 7079, -1738, -3317, 3332, 723, -1451, -1648, 1590, 1367, -3928, 325, 2193, -2416, 2183, 1705, -3848, 2042, 3334, -1888, -2244, 1460, 2176, -4701, -1617, 6096, -2330, -4655, 4243, 1351, -1353, 659, 370, 571, -741, 29, 443, -1608, 793, -539, -2518, 3295, 1159, -3327, 768, 2145, 475, -1299, -1081, 1788, -735, -1810, 1586, -1017, -1186, 227, -323, 1774, 1212, -1210, -612, 1155, 1939, -1046, -2876, 1792, 88, -2936, 1679, 1456, -2209, -242, 1982, 812, -837, 491, 199, -1761, 1458]
1480A458l53m453L349K427m587R71L759j805l489L278K700m680j05L161k166r91
1496a526K586j172j240J433J106j234j92J851j766k240M066K6m089R79K479r70
1512I7j563J888J581l702J264L311l647J59K457l168k11K872p66k734J293L642
1528B773l736o51N028l183k459M257n37k863P53J059p58r38K230l05k696L328
1544A302N19l645K826J17k497P62J043L62j906r38L596k423m87M084k982p14K545
1561A564j344k28q1K48k61j870L068j29m175M659R16m746L825L48l160J190N90
1578D14O50k600M9L532m172J197M173n095R24L055k393J47L58j8l95k005L891
1595A712j037m302M874l73k835L211p09j011N16k51J923k837m36M128m959J085
$$ y = [1458, 1105, -3348, 1, 2428, -2159, -1188, 2571, 766, -2723, 555, 3255, -1425, -1530, 1631, -535, -1526, 1060, -112, -1352, 81, 1187, -47, -239, 1612, -154, -2394, 1672, 1698, -2391, -1412, 1067, 97, -1466, 422, 2003, -1699, -435, 2876, -771, -612, 1845, -1323, -1534, 1338, 572, -2162, -869, 2773, -963, -1614, 3414, 231, -2228, 2029, 1492, -1371, -618, 441, -317, -1255, 975, 670, -2026, 1302, 1821, -1824, 1002, 1119, -1378, -616, 427, 789, -1117, -2055, 1541, -882, -1369, 2715, -267, -981, 1564, 220, -8, -89, 159, -102, -1972, 1096, 967, -3208, 1451, 2367, -2379, 1446, 1794, -1366, -176, 414, 1064, -1536, -1487, 2045, -2127, -930, 3243, -1852, -928, 2127, -266, -119, 239, 221, -174, -2179, 1712, 675, -3627, 1247, 874, -1961, 1250, 541, -470, 46, -205, 1718, -1119, -1555, 2573, -2386, -1301]
1611a301L978m310R54K200j829J015r72J155l39l446M491j275l729N369j492k948
1627b479M409j920l5K02m20K102l151O41K733m693K087K947n001K607J287k299
1643i83J796r46J034j87k544L808j866k719M514k600j059L108j720P97q4o95K361
1660B015l189J133K225m838K506J980m309K569O56j472J239r87J849o26k607M349
1676B493l076j628M778l190j129K937j982J284p11J74K049l297J835J780m654
1691b337K797P82l470K917n34r20J143j044K098j018j964L891k344j544L227k344
1707f64m11J641j594J298o27M97J497l019K078J652m347K639M14k452J688j114
1723h24L13M60j226K085n55j157L011k598O3K388l054N94R89j066J006j057N92
$$ y = [-1301, 2677, -1633, -679, 1521, -308, 707, -265, 890, 551, -2895, 1596, 321, -3408, 1961, 469, -2479, 1930, 10, -25, 177, -243, 1859, -1292, -651, 2082, -2611, -524, 2423, -2578, 29, 1316, -983, 813, -133, 901, 714, -1830, 1978, 112, -2607, 1907, -693, -1752, 1356, -364, 433, 349, -346, 2015, -1174, -41, 2184, -2654, -148, 1832, -2477, 92, 748, -724, 515, -472, 1377, 751, -1856, 2493, -583, -2211, 2567, -623, -1752, 1185, -797, 487, -224, -50, 1999, -1298, 537, 2317, -2337, 460, 1242, -2228, 689, 155, -765, 378, -666, 1432, 414, -1550, 2341, -3, -1547, 1680, -664, -1075, 566, -1028, 270, -357, 140, 1637, -1382, 696, 2348, -1999, 640, 1054, -1398, 290, -824, -511, -51, -1277, 808, 253, -904, 2107, -491, -428, 1960, -1094, -500, 489, -577, 429, -628, -36]
1740c6J039k206J898P07k440K129r37j152J842j390%M42p53J623j564L00K364
1757A866k765N71K176k325J63L65j67M55j366J080J54j140J364K47j306J826o89
1774E09q08J029m86m22p21K30J100j351K35J722j532M10O92o12O44r04J97Q43
1792G75j103P7K2p02J333q21j76J309l81N3m7j36J89q81l34R07m38j95K72j87
1812d64J138n32j12O64l04lq51K68Q93j162n25J226l45Q5l93P95N67j046K53N05
1832F57n05j68l31k02P50q72M64J67J43N69j175K66J377j138j70J022p81J45j167
1851i49O52J307k152P89J457j274L68J54j58N78j456L87J162j505N60l81m15J851
1869I75r82l16R66m82R08j294j93J874j804r18K370j083n59n3K88J494j898N86
$$ y = [-36, 1003, -1203, 695, 1402, -1038, 1091, 154, -998, 844, -546, -546, -104, -857, 766, -798, -498, 1866, -899, -328, 1848, -477, -314, 51, -116, 339, -1027, 53, 207, -933, 431, 678, -628, 1198, 509, -299, 730, 244, -178, -899, -669, 431, -920, -685, 1037, -495, -85, 607, -5, 639, -265, -68, 775, -328, -251, -229, -931, 402, -419, -595, 714, 333, 386, 339, 203, 392, -489, -823, 84, -354, -549, -277, -464, 674, 142, 30, 694, 390, 387, -464, -196, 697, -465, -990, 236, -109, -24, -417, 378, 945, -101, 152, 657, 152, -16, -347, -549, 201, -671, -207, -40, 103, 672, -503, -237, 1140, 2, -168, 854, 73, 218, -949, -297, 1010, -1142, -353, 1104, -170, 198, 352, 194, 772, -684, -297, 865, -640, -80, -461, -876, 975, -7, -323, 643, 161, 1069, -225, -418, 1456, -348, -1266, 1104, 21, -538, -591, -303, 1191, -707, -121]
1887a21J705j984K96M58j141J202j163l97K020j435O87L84j564K301n23j509J337
1904E53o45M28p38r82K706j641j942L629q37r49R40r12J130n60j256K266j716
1921e26l78J839k268J247P61j474J485n39K19J095l393K792O44l922K734P37k272
1938a219Q08J82J615j517j586L581j161j958K672j605l25J202j554J393m17j161
1954a050K062j587O56J699l145J286J116j177M52j333J070J154l484K812J160
1969A691l391J898Q38j053J062k083J432N39j947J818q91r25J678j234Q96O88
1985A016k084K096r23q91K937k975r25K999j696O2K12N70N05k569K058J938l823
2002a493R96J817k098J269q04m75J195j804K107j94j989K353l34j161J964j018
$$ y = [-121, 1584, -400, -104, 354, -787, 415, -748, -1145, 875, -560, 127, 511, -1053, 1248, 725, -784, 553, -92, 336, -402, -1384, 1322, -319, -2261, 1368, 531, -418, 522, -390, 740, 180, -1076, 1190, -526, -904, 935, -1333, -86, 675, -799, 686, 147, 366, 1461, -1932, 860, 1504, -2418, 316, 1053, -1219, -411, -229, 1386, -131, -1717, 1864, 703, -1255, 1417, -188, -513, 689, -865, 528, 111, -1050, 1012, -575, 81, 1780, -1365, -79, 1037, -140, 312, -1021, 49, 1203, -2281, 531, 1691, -1700, 198, 1036, -17, 1045, -1038, 394, 933, -1014, 804, -87, -1012, 666, -568, 328, 1016, -1068, 1028, 105, -786, 2151, -824, -1749, 1250, -446, -384, -172, 398, 903, -1666, 392, 2330, -1493, -497, 1320, -778, 491, -313, -788, 407, -1397, 710, 516, -1473, 880, 546, -615, 1349, 331]
2018C31n83m45K47J859k344o19L361k281n23K729j585m88R5L10R13j614K08P97
2036C68j726J713J62j673J745o35m82J198o54L92p02j043K493j121j377J008l94
2053g28J201m50j045J866o34j170K213j245j33L19j125J397j66j118J177o33K09
2070f5J037q38L64k49j075J456j153O20L55k283J771J578k080P99P33q38K3J02
2088B57Q91j398r59K114r53r86J386j107m2J739m33q26J95M66K69j259R87J32
2106D73j962R44J333m64q26m2J297l49p04J348q16q00J239n84p85P57m0m39P6
2125c44J255o32j015J309M36j307M82N1o81M42Mk47K38k78K68p0Q73j98j216P09
2145G9L22o36L80o7m85j50K31N56k99m58J094j028O40Q11r00m29M86qJ6p51O50
$$ y = [331, -252, -697, -450, 1409, -935, -1554, 1807, -474, -997, 1732, 147, -341, -246, 64, 977, -637, -429, 368, -1358, 355, 517, -1156, 589, -46, -528, 670, 16, 408, -294, -1337, 1156, 35, -1342, -334, -728, 473, 23, -1022, 844, 210, -960, 1253, 8, -125, 194, -931, 466, 300, -818, 359, -274, -65, 972, 134, 498, 249, -826, 630, -523, 97, 452, -1831, -60, 1518, -562, 237, 970, 132, 155, 257, 1148, -250, -1209, 905, -48, -1034, 352, -755, -797, 942, 509, -317, -122, 344, 613, -646, 341, 473, -1489, -545, 788, 324, -502, -544, 753, 404, -300, 1048, 232, -568, 671, 87, -698, 59, 19, -420, -344, 911, 279, -736, 573, 1009, -298, 184, 235, -446, -4, 0, -247, -9, -287, -19, -89, 784, 586, -630, 79, 401, -235, 145, 78, -407, -557, -326, 230, -69, -527, 567, -461, 179, 990, 90, -339, 147, 139, 155, -596, 54]
2166E4j15p77J574L20j716O26P94n40O2l82J86p60L29J647j757j41J623j322R2
2185b03J239p20m22nQ34o23j187J523j04j627J634M7j063J156k50k48J69k58P41
2204F33j184k79J602j447J95J304j572P97P52o51K26r00J093n3j394J335n25j068
2222a136J875o29q04J195p21K37K67K2J63j217M22J389k046O88M91j328J133K37
2240B38k89N25j055J225m02r55J806j173j239K223p45q89J245j418J305n54L0
2257a22R42j471P46J138k466J740j47j459J303j9k51L94j018J612k43j509K115
2274A285j469q73J874j123k41N08n77J036q27N86P94j891Q94J438k476J488k95
2291A31j589J634m71j90Q11j103J346k90r00J905j259l13J301j695N03N30r89
$$ y = [54, -61, -838, 736, 1056, -660, -34, 760, 220, 282, -100, 86, -674, -345, 1302, -455, -596, 1027, -295, -203, 1036, 316, -106, -111, 723, 100, -1087, 436, 332, -1295, 339, 386, -677, 479, 229, -19, 150, -108, 633, -551, -830, 772, -675, -480, 824, -748, 49, 801, 150, 376, -524, 569, 516, -878, 457, -68, -1136, 739, 110, -694, 501, -220, 17, 284, 306, 469, -748, -326, 1063, -983, -295, 196, -1132, 1, 238, -51, 474, -581, 644, 242, -713, 1093, -80, -1319, 904, 159, -730, 515, -903, 402, -152, -122, 820, -651, 95, 1233, -1233, 507, 360, -1099, 204, 185, -66, 328, -690, 922, 679, -830, 1285, -184, -1057, 817, -306, -547, -39, -616, 420, -407, 179, 973, -918, -24, 1414, -1062, 426, 131, -1458, 176, -295, -485, 326, -777, 569, 279, -621, 1284, 25, -288, 1013, -682, -179, 351, -638]
2308f38P86o39O08Q79j758J124L70j312R39l19p69Q07j54oKp10J857j070p03J810
2328A104j629K04J166j280O14k02o65R33j074J017O96j707J326k7j335J551k31
2345D61j327J289q41O11j99q73J329j086L23J487j542J56J090j093L53j66j96
2362b24L12p01P62K50j752J869pj187J339p13j00K69l93M93p92Q5J015j459O00
2381c34J152j416M81J044p42L14l50k5J86j059Q51M7j214J535j78r76J241m01
2399A56j58K11o66R98q48j59Q55r29N22O27j326R49J99p40N96K0k33K2m74R76
2419E98o59q36J460r27j43P30Q2l41J24J21K88r45P74K33j412Q32J94j023N85
2438b65N75p1q8J09M77o43k30M65n79k23Q34o65n2K74J06K4m7J76K13o78P37k26
$$ y = [-638, 148, -491, 117, 996, -762, 362, 732, -580, 359, 40, -729, 78, -76, -82, -80, -790, 1067, -3, -706, 1104, -525, -321, 845, -435, 179, -23, -688, 245, -829, 188, 884, -823, 503, 476, -859, 692, 461, -866, 423, -418, 193, -6, -879, 450, -636, -313, 1174, -368, -212, 878, -215, 138, -28, -224, 88, -613, 149, 399, -1353, 516, 509, -678, 661, -52, -152, 117, -276, 217, -575, -490, 525, -934, -334, 818, -598, -117, 927, 185, 499, 149, 124, 310, -749, 102, 149, -1065, 470, 292, -684, 557, 156, -2, 209, -457, 541, -307, -466, 389, -540, -18, 609, -717, 232, 431, -309, 287, 307, 74, 96, -378, 598, -61, -897, 563, -364, -507, 223, 305, -36, 88, 209, 497, -448, 326, 559, -853, -21, 173, -850, -265, 310, 239, 151, 260, 737, 94, -136, 329, -250, -473, 361, -304, -356, -82, 24, 48, 1, 177, 390, -288, 449, 223]
2460B23m68L6K62m41M3N53K76r63K79J075r05j6M57l64j9m3j89J31n12O64m01
2481c22J15P68m34l9L43k87l49M26m79J56q0k23O04m32K47L66j029R38L94p24
2501d1J10J38l92n9j72R39j037j96J113j84l77N88k15L8k2l34J78o08L41N15j070
2522g47J293j24j055R36J57l98M34o77O84l12j166J187l42m73Q05p23R53j29n34
2541b31P72l62n84Q87p96K63L14r66R94m61K20N46j042O86M93j287O79K19q59
2560e15J176j227N22N12j146Q05O53j383J026k71K0L23j081P65K58j530J656r73
2578d10n8J099j041L36L57l55N42o74k5J224j689L00J383j330K69r0o4J121j574
2597f79P93Q56j751J072J21r16O46o44J22P47j098J268m15q16J555p21p61J216
$$ y = [223, -245, -209, 53, -388, -345, 208, 484, -479, -200, 875, -30, -46, 411, 47, 28, -15, -204, -73, -585, 79, -322, -207, 561, 127, 88, 431, 144, -205, 221, -258, -102, -182, -405, 199, -233, 14, 380, -649, 289, 683, -41, 69, 207, -185, -244, -416, 523, -514, -710, 403, 219, -158, 430, 215, 253, 231, -103, 75, -533, -192, 323, -747, 546, 422, -633, 303, 460, 62, 496, -181, 503, 191, -975, 212, -130, -603, 202, -521, 432, 303, -231, 541, 179, -405, 482, -314, -51, 263, -703, 291, -170, 50, 596, -446, 240, 733, -554, 125, 344, -515, 661, -566, -44, 468, -678, 127, 780, -603, 423, 152, 172, 495, -586, 179, 437, -1093, 563, -410, -468, 631, -410, -74, 283, -72, 470, -204, -229, 995, -694, -394, 989, -341, -72, -162, -226, 895, -679, 114, 970, -781, 291, 412, -504, 142, -502, -380, 367, -731, 537, 122, -694, 861, 140, -621, 595]
2615E95n47l02L67n38J001j272p8J771j729M17P75o33K87l84j33J177j625N37
2633c14P89j516J016K52q87J114k09l3J38q13R63l83j029J722j225l33J102q07
2651d53O87M8p68J099n80k66R92j003j24M69o57P23l66l04R87j066N34R14j594
2670g28J107j10m43M14o50K34K93p10J112m08r33J155l21K48M89q96P26m75q02
2689f98J364q91o31J364o09k61Q00j17k67m51P50L30j400J012O1j456J045N28
2707D73r31O10l28L04L56p45Q37n37l25N14l92K65O8m81L85l42L4N41o01J20R15
2728G40q86O2K89l79L33m8k13J58m63M93K68m34M85k04n69R74j027KO31m44J37
2749i5O9r1J6K37K08k33j12M85l67n08P63k81o30K78K56j04j31O85J37q80K16
$$ y = [595, 48, -254, 113, -425, 576, -696, -774, 997, -732, -315, 460, -173, 114, -270, -403, 774, -851, -314, 475, -1041, -25, 227, -660, 454, 245, 212, 350, -463, 500, 117, -912, 810, -415, -748, 354, -453, 234, 282, -486, 613, 33, -233, 759, -244, -368, 101, -556, 167, -199, -503, 484, -582, -48, 866, -728, 379, 269, -174, 240, -410, -176, 117, -593, 519, 111, -822, 333, 12, 260, 749, -147, 579, 104, -698, 666, -225, -856, 508, -101, -362, 438, 321, 54, -397, 353, 683, -717, 295, 356, -1100, -55, 473, -458, 152, -176, 128, 484, -261, 576, 39, -286, 228, -164, 101, 169, -312, 73, -269, -235, 306, -295, -175, 740, -146, -84, 205, -174, 159, 111, -102, 56, -407, 86, 354, -80, 405, 201, -368, 606, -421, -419, 212, -232, -95, -26, -117, -101, 136, 344, 111, -1, 484, 117, -391, 372, 91, -539, -261, -5, -109, -240, 445, 582, -298, -82]
2770h2M08l51j96J79r0j28mP23n47q15J370l39m84L03J9k39j21N22nn83P14J39
2792C93j065O95P67j501R58K58k93j17n41M96m43n9R39p16n3O03m54L76k4k88
2812f9K29k03J6M63q25O2M73p37P10l84R7M73m91L99n2l56O26r22M02K57p02L10
2834b24N93j090N46P29m08l27L9N71n04n27P53l33o83J150l37n53O71j00R1r1
2854c4J04O9m22K36O23j213N53k16j17O18m64K19K59n21P39l78k41R76q41m55
2874e06O28k26p2K94m14Q73o95pQ01j118O99J74j153O51J54n24N85n65K08J93
2894b0n97R53l10l52J113r39K32O42j196L22M10o50N93o72M32M14j189J136k3
2913B99p54O53L2p84N44l32M68j04o37J620j212k6J061j207J03J050q83M27m75
$$ y = [-82, 326, -25, -221, -42, -132, -260, -264, 459, -88, -903, 467, 128, -356, -53, -34, -273, -394, 128, 123, -460, 254, 393, -672, 23, 790, -711, 247, 505, 212, 95, -446, 50, -393, -452, 487, -229, -282, 321, -133, 243, 219, -69, 160, -43, -27, 436, -389, -327, 146, -591, 119, -265, -168, 305, -186, 213, 161, -195, 431, -491, -89, 168, -534, -224, 369, -721, -175, 554, 146, -181, -142, 429, -75, -602, 151, -182, -865, 285, -52, -605, 66, -34, 57, -34, 70, 139, -283, -47, 576, -637, -84, -300, -417, 201, -263, -44, 215, -306, 433, 55, -186, 790, -51, -506, 122, -104, -176, 118, -296, 577, -118, -125, 676, -442, 257, 431, -722, -71, 83, -441, 144, -421, -213, -20, -617, 336, 26, -326, 787, -152, 80, 722, -474, -152, 258, -392, 201, -471, -39, 375, -814, 322, 299, -455, 198, 230, -554, -10, -342, 126, 22, -615, 1005, -207, -233, 828, -379, -276, 774, -109, 318, -157]
2932a57J69l1o65R19L8j011J468o20o04J032m29m10M91k04K47l68n13J405j085
2951c28J69O33q43M15M58q99O69m70m9N52p32M15L86j183Q09J49l83R12n70j0
2971A00L5m12L56l45j02P57p57L23J069j647Q94K3n78L27j3P2J35q02P74n9j034
2992h84J197m3o20M40M9J57j01m66N79n82j14R90r15J11L73m32L94r6o8L84l66
3013a3L12j99l67P15j85j074R03l06k41J053o05O0j08L13J13o14K80K17o65L30
3033h1L87p95J99L73oN9j43N37p20j48Q92o10l96R61j111L91K69j19J06J82%J75
3055D02o32M25J7q25P82k18k52J34J15L7j29j90M78m30j3O61n29O4O87m69n7k30
3077a72m0N46m40L91L0r60J177l86o8NK84m13J19l47K8L17m0J76o62N46L24o33
$$ y = [-157, 12, -19, -684, 235, 273, -738, 730, 110, -494, 538, 109, -301, 190, -14, 233, -135, -648, 757, -328, -159, 474, -369, 46, 504, -395, 274, -196, -245, 307, -425, -10, 376, -807, 2, 151, -232, 680, 110, 100, 135, -277, 79, -266, -368, 389, -368, -45, 1024, -623, 271, 294, -284, 43, 30, 102, 237, -565, 209, 150, -884, 313, 270, -350, 90, 139, 296, 195, -271, 308, -274, -388, 602, -313, -202, 171, -261, 133, 37, -31, 353, -13, 299, 100, -267, 448, 263, -811, 92, -214, -455, 598, -7, 53, -55, 258, 371, -243, 37, 254, -411, -81, 306, -489, -290, 83, 77, 136, -7, 530, -190, -338, 554, -56, -452, 509, -602, -211, 58, -61, 45, 227, 227, 402, -230, 195, 212, -613, 169, -49, -301, -167, -52, -15, -144, -334, 144, -286, -299, 362, -167, -103, 584, 115, 58, -172, -212, 334, -106, 285, 315, -645, 532, 146, 78, 83, 367, -46, 73, -274, -246, 71, 31, 207, -455, 91, 415, -218]
3099b18J82L84o01K81k41P6p8j08M67j36j18O59p59j0Q49q49M15j59j66j9l24
3120d73L05L81m85L03K13m62M69o6J3k92l29M35j87L5J78k70L70K41o62N76m20
3141a27N2K87l59L16N0n35O53n60L35K44n76L80J36m04J08K5m72P33p66J55K29
3162i6JJ71l1k60M80l35L21m2m12K48K89p65P77n82l2N84m60J11N57o51L75l98
3184a50R9M61j068P54K17n20J81j10J26k8k40O53k6p37R00j89q07P21o63O3L43
3205b0k54L64k31j72N41l14p0O94q01K07P8m88L87l21L65N23r83M97L92n16K22
3226A00K2m20K38k87M73o4m87O54j24o78J162l46J04po27M59k40m25J035o60m67
3247e85P87l75K14k51k82J076n62l06P56m08n6J67n85N17m92j48O26k18M99j35
$$ y = [-218, -36, 348, -253, 28, -213, -137, -215, -323, 144, 8, -110, 549, -210, -220, 629, -220, 195, 36, -130, -149, -473, -168, 213, -272, 31, 244, -218, 251, 185, 198, -94, -423, 12, -175, -140, 38, -232, 138, 379, -283, 293, -127, -75, 212, -147, 169, 219, -316, 337, -223, 112, 356, -220, 160, 296, -108, 0, 25, -447, 286, -480, -325, -96, -95, 76, 45, -215, 265, -70, 251, 209, -203, 45, 334, -431, 346, -236, -268, 316, -144, -33, 524, -127, 248, -150, -51, 410, -658, 96, 313, -207, -26, -136, -10, -38, -278, 375, 349, -388, 512, 323, -484, 237, -426, -363, -20, -274, 90, -141, -313, 228, -86, -156, 538, -263, -56, 22, -466, -79, -400, -35, 488, -495, 2, 394, -122, 100, 122, -298, -60, -347, 126, 62, -425, 229, 105, -573, 589, 243, 347, 340, -287, 172, -68, -493, 542, -118, -585, 202, -173, 41, -210, -492, 584, 22, -284, 472, 64, 8, 175, -410, 107, -385, -533, 93, -125, 374, 239]
3267B39q08R10l55l69J030j031R00n54m55J006m71l85M74k8j44N92q03N64j05
3286B07j12p3l50j18P79o08K6N99n17M93m15P0M48q97Q41n5p67L59j33M38q0n49
3308d14R22m23n61R71m39l65K20k2l46L38l00O87k36j92N06l77q5J96k86K17M1
3329E2l85L94o02N23K26n39M09L24k74j35k58L29K10p79M97Q1l73M26k41lK83
3350A65K92k28o4n46M69r9j66J84j79N8o2o6L16k49P8K99o53Q31K5m48M0p2k68
3373c43L35j38p6L62l90N02J21n88N89l71k22M78j27q0k88l5O00l27l44M61r7
3394B2J00j01o3K17k84M5m7j21O8O9k68M09j45K16j13M4Q1J26k32N9l22n5N41
3417B46n11J62j67k81O23l19L68rk89K60l50K65j55j37J09J85j24O6M7m6K94k72
$$ y = [239, -569, 341, -14, -383, 647, -384, 516, -38, -493, 513, 42, -343, 131, 103, -41, 551, -252, 312, 207, 95, 22, -328, -446, 333, -275, -249, 350, -167, 326, -89, -19, 429, -468, 373, 318, -449, -90, -223, 215, 135, -414, 508, 85, -476, 495, 56, -309, -89, -111, -457, -119, -419, 268, 32, -160, 346, -31, -116, 80, -206, 11, 52, -333, 61, -541, -18, 208, -331, 78, 402, 128, -7, -265, 64, 274, -505, -8, 73, -300, 126, -115, -118, 165, 457, 229, 165, -381, 88, -11, -177, 7, -172, -114, -176, -242, 74, -175, -97, 202, -451, 380, 405, -43, -3, -75, -343, -8, -146, -222, 140, -250, 252, 373, -215, 374, 3, -219, 259, 132, 52, -236, -271, 329, 2, -342, 119, 22, 122, 21, -42, 175, -109, -64, -111, -232, -164, -95, -363, 46, -99, 117, 4, 48, 129, 255, 23, 82, -240, -295, 246, -265, -103, -270, -551, 72, -247, 121, 112, -177, 83, -267, -2, -157, -294, -185, 0, -124, -58, -11, -57, 237, -35]
3439c5K11Rn15N5k8j46N23j63j37jQ0R0k51N24M97r33L38P3m41K24O7n32M25K32
3463A66k79K38J0L0k87j74K63q7J77l4l56M7J02m7L31Pj97M65m94L71Po37O27
3486B49l09m4K73j07K13J67j97K81l09m15L38m66K95L24p78M14J31k05K02l62
3506c05K94J34n41N29L37n23L14j6n20J59j81M54k32m20J054r08J02P31m48j71
3526a57M81n10K27o9l25N34l84j99R26r00N11N0m58L39m38L32J20o77P59k37l16
3547c91R02r02M35L40n64L21J29n39J64Q9j02M74n27N2K22o75P25j76j77O64p51
3568b87J71P3K21k48j14J94N8j06O1J57k64L71j05Pp3l99M95j81n34Q21k13k68
3590a63M16q8n15K95k04O23l39l90O88n37K96L03o14J51K31j99M97l83k03n7k8
$$ y = [-35, 176, 185, -330, -275, -303, -449, 74, -89, -226, -227, -147, -57, -308, 216, 713, -220, 118, 191, -250, -26, 41, -491, -66, 166, -113, 125, 135, 165, -122, -296, -33, -120, 57, 23, -333, -286, -184, -231, 100, 107, -90, 375, -119, 252, 259, -378, 249, -60, -104, 169, 62, 275, 442, 245, 526, 217, -198, 140, -326, -31, 293, -485, -71, 60, -145, 57, -305, -11, 123, -418, 111, 448, -75, 239, 223, -297, -138, -319, 135, -97, -517, 537, -371, -269, 462, 14, -157, 324, -186, 41, -28, -353, 181, -203, -402, 524, -376, 135, 185, -273, 66, -372, -40, 80, -597, 162, -75, -391, 511, -391, 44, 384, -180, 141, 270, -269, -105, -16, -118, 356, -171, -119, 103, -572, 153, -23, -200, 464, -287, -116, -43, 178, -70, -184, 10, 68, -38, 23, 180, -84, 287, 182, 189, 116, -283, 212, 31, -503, 318, 105, -163, 253, 165, -350, -55, -259, 364, 25, -365, 323, -214, 82, 385, -229, -78, 153, -46, 451, 68, -135, -192, -220]
3611b20L40P9k04J86l50l82P87n32J11K11j69L18J08o58O36n08J18L08m06L49
3631A22J07k87j86J81j30M31m64K71O0n20Q83p1n65L89k48k36N52l61J62l54L63
3652I9K8k93K16L01o81M52J87q22O91O1j54j6o49R41j51k78L13l91l3J54l6n08
3674e69N50m2J5L0J96k6l90J79M40n57L39m75K93K03k56O6J84M7j48l04J13M38
3696C26l56K11r3m77O33k50p4J10o0K6Pm95P81o4j23j07K39m21nN0K44l8k5j7
3720B2l89L68J42j07k7J18j13j25J84j61n0J09J73k42j76Q59n09m43O55k64l3
3741ij48K92j90K03k84K28l94L60J66k54Q5k84L41j45j82M33j43p6M7k18J46L81
3763C55k69j76K45N7j8k85K20q6l52K60k43J19K32m4j87K69k88L03k91K14K7J96
$$ y = [-220, 120, 199, -5, 181, -169, -551, 236, -296, -185, 26, -143, 175, 283, -375, 261, -247, -129, 179, -227, 122, 229, -58, -244, -63, -193, 238, -226, 45, 105, -415, 468, 397, -168, 221, -27, -263, 289, -72, 90, -264, 99, 127, -166, 50, 351, -330, 122, 309, -513, 178, 239, 85, 69, -580, 361, 210, -68, 245, -146, -179, -25, -61, -569, -19, -61, -46, -16, 180, 154, -236, -57, 383, -174, 165, -310, -17, 186, -70, -4, 180, 227, 79, -225, -112, 326, -30, 181, 88, -389, 244, -6, -80, 30, -30, -4, 3, -492, 289, 225, 102, -5, 234, -187, -192, -142, 102, 64, 39, 22, -367, 1, 143, 36, 9, 127, 14, -111, 73, -88, -138, -29, 144, -98, -274, 585, 76, -367, 288, 24, -9, -157, 135, -55, 148, -136, 92, -302, 58, 224, -30, 55, -229, 112, -33, -215, 218, 75, -1, 46, -172, -26, 355, 86, -90, 155, 212, 194, -91, 129, 43, -309, -49, -292, -173, 59, 15, -172, 97, -191, 112, -179, 35, 62, 258]
3785B58k03Q9l96J05l1J95jk3J42P2l59L87P3p56O76o8l51J79J01j59Q8p3J6J4
3809b5m7K84m24J83j89M3M76n23K67k37P6P2J39m03O36j43j09M7k8m40K95j23
3831a73K61n0P8J34l20K09j20m42N13n3o13P41k26J78q1K7J14j62j77J27r0l08
3853d33N74m2j42J06j6k82K22j2K60m90O32nn47J10K08k27N0K53j90m58J30M40
3875A41k09j06L87j43l03Q2j27N50n89K26M51o30K9K62l09L11K36m95Q46o36L5
3896IK30k34m8Kk97L69L8o2L43o30L74K75n34L61k33L1M28n04n8L09m38K41L97
3919C69m05L52j42l5O2k16L90n94J95N2k94l0N54m89K43K52l37M1N2j77M74m83
3941a66Q6K74n65M25l25K7R6o3J9J94j97L28J4l62p7K34k60M04k53J98K53n12
$$ y = [258, 55, 144, -252, -147, -178, 17, 16, -7, 135, 207, -152, 235, 308, -448, 228, 160, -191, -12, 89, -70, 18, -55, -39, -25, -72, 212, -212, -29, -218, -175, 301, -222, 45, -192, -116, -44, 95, -308, 328, 185, 76, 123, 95, -345, -50, -173, 88, 38, 116, 250, -70, 139, 19, -423, 90, 37, -576, 165, -61, 117, 36, 63, 177, 15, -162, -35, -125, -433, 141, 99, -43, 63, 47, -235, -13, -25, 235, -255, 377, 372, -175, -65, 143, -84, -34, 219, 29, -429, -299, 141, -68, -174, 213, 70, -233, -151, -278, 272, -317, -91, 360, -270, -241, 21, -288, 23, 259, -236, 610, -26, 9, 239, 5, -43, -41, -338, 31, 69, 7, 350, -280, 94, 369, -165, 196, -37, -6, 422, -82, -140, 169, -269, -28, 369, -36, 316, 174, 139, 201, -15, 375, -219, -24, 28, -266, -296, 258, -231, 12, 264, -73, -32, 20, -157, 317, -166, -80, 194, -371, 54, -271, -244, -148, -211, -192, 2, -195, 133, 147, -215, -292, -58, -318, 86, -167, 31, 284, -228]
3963b28L68P0j6p8k06K39J63m54K55k79K80M17o94N29l65O2P3k45j29M20Q0k31
3985C1j11k59M08q9k51L62j20J64O7l09K28j84q7N18n43j63J46m0K58m4k94L73
4007F1J85n23r9J53L45p3q4O5O3j01k12r3M89M3k44K89j49k3Q3k21L8k1J43P1
4031A85m21L86q1j25J70k45k8K11J32j88R1k99P1J06lK2k9J05M5l5o8R1k44K48
4055I7j6M5j34K94k96j8O2K23n17K04J74r6J58k38j99L52l86K54J04j6K63o3l68
4078a17K91l24P3J60r6N4j14k21L13k1q1K15J34l26J84k19N77k98m19K72l79M95
4100A53k22pq5O8N4j20Q1j12M37j39m15N32j16R4k44J91j43k57Q35o68R0J5J45
4123A67k15J69M8l14J98j71L47m99M03N1l27J79J01j47J65j86j1Q3P6n2J88l30
$$ y = [-228, 140, 210, 194, 116, -90, 149, 312, -142, 113, -166, 114, 531, -163, 366, 1, 63, 136, -109, -238, 182, 262, 31, -80, -339, 69, -20, -271, 91, -29, 135, 202, -107, 121, -63, -150, 368, -175, -338, -192, -232, 26, -18, -312, 61, 246, -277, -376, -223, 122, 49, -35, 30, 93, -8, -220, -313, 176, 219, -25, 264, 115, 92, 175, -46, -8, -29, 114, 185, -236, 150, 69, -56, 114, -131, -159, 52, 184, -4, 87, -212, -141, -35, -38, -16, -45, 60, 105, 70, 2, 93, -151, 97, 81, 126, -8, 286, -10, -28, 34, 257, -260, -56, 118, 22, 180, -58, -257, 95, -291, -37, 67, 51, 314, 251, -117, 174, -150, -77, 83, -13, 41, -73, -294, 19, -2, -83, 132, 266, -60, 124, -95, 482, 184, -235, 37, -342, 153, -69, -76, -161, -93, -39, -159, -78, -190, 247, 108, -307, 225, 109, 203, -41, 150, 7, -250, 585, -83, 7, 22, 167, -48, 121, 169, -145, 53, -118, 229, -270, 133, 184, -143, 36, 137, -10, 155, -31, -42, 41, 117, 65, 253, -77]
4145g7L05l49N30m38j25J28O4j17QL1o5M67n09o7J69J21j29L2O1M7l18P32l45
4168A56p7J13l34Q3L23k96J63p1l71L70Q5m45K75j70L23j87l27M44Lm65N57n4
4190I8j77L78o41M07Q9m77M45q3k47L17l53N25M8l72K00j94n4N9J19l9l6l41L89
4213F0m84J70M06l54L03N4k7N7L5m10L04j51j79N20n62K16O1L6J00k17k18M41
4235A61r3qm36N19O7m31N9L11n34M38l1k48L87L5l63M47l35J8M79o26qK69j50
4258g3Q9k19K23K61n33N13j80j66N23k69n02N05r1j41n3n7L45R9m56O13l13q7
4280C1J85n02M44k42Q4j33j03J56J14n1J52m1r9K51k66p1n6k3N18n59J75n7K52
4303A59j52J87l45L96o9j10J60l95P4K3r3o6L62k00mQ7j62K13k97L77l04j76L68
$$ y = [-77, 228, -121, 409, -29, -154, -26, 38, -79, -71, -40, -105, 362, -147, -214, -45, 76, -53, -21, 40, 87, -231, 501, 156, 79, 192, -142, -59, 264, -32, 131, 60, -311, 59, 144, -301, -26, -196, 127, -60, -387, 57, 60, -405, 152, 98, -79, 299, -342, 65, 154, -323, 122, 39, -208, 109, -244, 281, 329, -43, 157, -37, -91, -32, 87, 48, 12, -329, 60, -424, -254, 152, -202, 101, 155, 128, 185, 220, -190, 114, -37, -216, 304, -258, -42, 19, 55, 155, -62, -280, 161, 68, 60, -376, 143, 210, -221, -162, 149, -385, 53, 22, -226, 161, 196, -167, 280, -55, -37, 442, -184, -192, 77, -73, 16, -203, 20, 281, -252, 261, 81, -85, 438, 169, -333, 172, 81, -60, -113, -170, 175, 274, -182, 431, 118, 31, 216, -286, 158, -84, 0, -133, -236, -80, 34, -17, 135, 94, -5, 246, -20, -91, -147, -170, 348, -211, -36, -93, 159, 7, 194, -151, 245, 176, 66, 226, -169, -95, -72, -165, -231, 131, -69, -73, 14, -148, 65, -232, 145, -159, -335, 33]
4326C3J4N2l48LL23k68K18Q2J13m80N47j7l11M2J11J28l14N4J73l90N5K38m7K28
4350B39m5k72K92l19M3l9j35J53K07j5l86M19l58N6j0K77j38J23k73K09j60j62
4372b94J34j06L61j51J02O6r6l06N2K82J35k06P0j37j06L81m00L52J0k65J79M5
4394A02L05n18p1L05m39M00j22j24J99r5j6J91n8q3P6j0j9N7j54J0l5R2j8p8O8
4419c5J52j33P9Q3r3j0jJ17J3k36O6R7k9J88k31j73J18O3p5L66l26j42r9K99k16
4444a58J00J36m9k6K23j03L0J8j52K89n43O2L45n68K34K49J39p2J17j16q1J2l83
4467b97L64l0p5j19P2k5K48k53K83R9j83J99n19K28R8j0l8j02K18M2k78p9LK4
4491a30L20k58r4J73l35L75K49m99M35n66J14J75J39j94K35j26L63j54n69J88
$$ y = [33, 47, 99, -249, -246, 77, -191, 27, 109, 222, -258, 289, 272, -39, 3, 114, 242, -72, -18, 155, -235, -180, 58, 11, 239, 194, -78, 214, -105, -62, -101, -236, -83, 124, 109, -277, 142, -216, -160, -170, 107, -31, 92, -181, 28, -132, -294, -160, -266, 95, -56, 46, 112, 16, -290, -238, 44, 179, -27, 43, -94, -200, 181, -219, 133, 143, -122, 57, 102, 407, -111, -182, 123, -316, 84, -38, -162, 37, -58, -74, 117, 59, -24, 52, 42, 23, 80, -74, -64, -99, -7, -25, -103, -35, 117, -16, 63, 146, 53, 43, 42, 159, 172, -64, 2, 99, 70, 258, 27, -146, -28, 35, -40, 326, 0, -142, -241, 58, -158, -58, 78, 29, 3, 226, 123, 153, 171, 19, 308, -235, -173, 172, -396, -162, 87, 226, 154, 271, 155, 74, 86, -297, 67, 37, -38, -157, -85, -110, 138, -115, 168, 267, 84, 283, -236, -8, 90, 80, 42, -60, 158, 200, -78, -157, -154, -130, 190, -68, -162, 11, -324, 51, 300, -199, 236, -330, -216, -41, 98, -96, 139, 13, 376, 222, -347, -159]
4511a59J44Q3K04nk97k8P0N9R6j65j83J90J27j43n08M05J80q0J34o9k38N9k08
4534c32M78j78j43J76l0j07O8k63O25r7l04K65m61J81P5j16L84j32k94L63m69
4555c11L16Qk11K5J60q1R6K23j05J16m54K81J70m66L62l7l10N43k76J3j41P8j9
4578b0q0J82j28O7l62N75l91J08M8j31L00k06j52J15Q2O8p0K0o9K52m93M77j58
4601C4J1k04N3L20m6k86j0oN5O1l3l1J26O8k04k1j45k2K45J25j93J07L2j67J36
4626EP4J25k29j1K7K90j96l12K74O2j13O6j33J11J30J49k64j67Rj03K30k38L92
4649A78P9l46J27l73L11Q5q4L79l19J65m72K81O6J41p4k5j74L50j89m16K33N0
4671b7N7l10N1L26j78R9k45k62L60j42N35n4m7j48l26L06J88J06k34r5j82M87
$$ y = [-159, -15, 68, 272, 267, -30, -58, 12, 71, 167, 2, -181, 9, 136, -7, -515, -110, 70, -10, 124, 55, -183, -124, -332, 146, -32, -175, 1, -29, -136, -68, -331, 294, 197, -107, 158, -303, -122, -47, -163, 221, 89, -205, 158, -311, 5, 13, -198, -173, -13, -94, 2, 225, 120, 236, -218, 63, 233, -233, 129, 92, -218, 325, 49, 62, -79, -1, -20, -100, 82, -46, 21, -341, 234, -157, -49, -1, -132, 168, -38, -190, -75, 7, 75, 5, 25, -44, 208, -285, 192, 34, 45, -159, -106, 214, 168, -118, -128, -134, -79, -18, -51, -82, 44, 112, -92, -113, -258, -280, -35, 90, -103, 4, 36, -131, 5, 79, 204, -25, -36, -9, 281, 85, -227, 47, 109, -4, 62, -71, 40, 170, 319, 55, -112, -103, -206, 24, -214, 178, 257, -89, 38, -335, -24, 61, -23, 356, 37, 202, -270, 11, 77, 218, 144, 119, -55, 295, 106, -310, -77, -27, 30, -280, -229, 97, -81, 18, -227, -489, -129, -271, 264, 210, 163, 15, -311, -5, 183, 289, 55, -40, -222, 265]
4693B65j95M4j13l40M48M0l55L8R9j15N39j90l73M03k35j92M97l11k1j22K80P1
4715A62k47k34N79k28m4J29q4K22n45M1J61R6L3o2k55L07L6l17K09R6J6K6k13
4738a16K14j72J28L2J06P0m97L59n7j21J81K2j90n6K34l45mJ81J47l07L43m2p0
4761D0O8q4j83O7J85p3K1R7k20j36L4N07k06J2J10Q8k14Q4k49l42N46k61J80J3
4785H4j50J22n6k70P54o81K74O5k84J92Nk89J63q2N3k3mK22p7k4P5l41J62L88
4809B78m96Q6J46j11J9M15k31l3j59k09P9j64M68n2j8L70p85O88l02l28K78p7
4831a38k15L37j78Q6K36k02L63q8n29L34J98n04J62k9J68K92l89J18j59K7N06
4852C96k92k71L38o99O66k74L41k71L06L4l43J69mj56r8K20j96J7Q6l35N85j58
$$ y = [265, 70, 114, 1, -339, 109, 149, -206, -168, -69, -184, 355, 165, -208, 195, -40, -232, 265, -46, -67, -189, 91, 162, -85, -319, 260, 32, -12, 117, 33, 255, -290, -249, -88, 8, 41, -21, -276, 31, 67, -250, -41, 55, 71, 97, -116, 98, -74, 54, 86, 192, 262, -235, 124, 67, -54, 127, 149, -41, -97, 137, -208, -212, -31, 116, -191, 152, 110, 40, 108, 24, -159, -92, 93, 20, 41, 138, -82, -218, -184, 323, 117, 129, 239, 327, 113, 197, -52, -394, 152, -109, 71, 84, -66, 56, 0, -270, 484, -197, 77, 142, -142, 50, 55, -234, -71, -153, -100, -123, -127, 95, 18, -6, 69, -272, -110, 278, -218, -132, 14, -97, -78, 337, 106, 73, -86, -295, -216, -380, 88, 36, 18, 388, -397, 291, -11, -339, -61, -138, -353, -16, -194, -108, 128, -74, 289, 201, -328, 6, 204, -300, -138, -167, 1, 293, -96, 22, -137, -110, 396, 104, -167, 171, -528, 138, -136, 205, -66, 240, 274, -69, 100, 96, -60, -158, 62, -134, -117, -31, -366, 219, 61]
4874F1j42L16j21k45L63n80P66l82q8J82n28K07L53m75J42L05l0%q8J13k63r7
4896b31J55r9k70P12m68j19L62M4Pl78P2M65m56p7K53k05J4K40l40N25m45L66
4918A27K75n06l8K06Rm5J03l68L81k17j75N96q03P34J10o23M68n06M18l80N51
4939C17j67Qn8k65J12%K37pk6k28K11j71K07m16N69k80j43J25j17Q3j2M9JK0j51
4964a02R0N2j17Lo0M05k44lJ0O6l19l7K57J89l16L17l00N1M28l14J94k25j27J46
4988D4j8k12J17J03j5k79K79J0O3m6L4l8j41q2K98k42m7j4L0J62j29J51N4k57
5012a75k0K34L2R4k74J51j7j07J87j6k23Q4K75m36N2p5L99l43L79j89J45P2m64
5035b35L88l89L81m01M06l22K63j92J09K4k01J45R0m13M49j08Q4p1o8j27K49k00
$$ y = [61, -81, 235, 114, -131, 232, -348, 418, 36, -52, 130, -398, -191, 162, -313, -171, 134, 104, 104, 16, 129, -134, -231, -76, -175, -445, 267, -201, -320, 42, 86, 93, -285, -213, 252, -204, -281, -28, -233, -219, 21, -319, 206, -239, 127, 402, -104, -142, 64, 73, 28, 131, -237, 144, -73, -248, 348, -455, 279, 389, -234, 234, -272, 146, -234, 317, 150, 158, 100, -165, -53, -53, 184, 177, 151, -77, 134, -37, 170, -246, 323, 43, -100, 25, -92, -9, -21, 28, 29, 49, -102, -12, 40, -77, -74, -134, 271, 27, 24, 34, 100, -219, -256, 1, 190, -126, 191, -109, -58, 370, 56, 250, 25, -102, 44, 26, -186, -69, 34, 19, -260, 19, 29, 92, 46, 80, 42, -99, -181, 117, -125, -172, -186, -156, 6, -123, 28, 82, -175, -195, 39, 71, 165, -109, 42, 25, -82, 105, 89, -134, -50, 225, -211, -159, -234, 165, -178, 201, 12, 157, 229, -235, 153, -236, 145, -256, 150, -172, 91, -101, 8, 32, -169, -24, 66, -347, 102, -6, 78, 7, -61, -188, 61, -139]
5057a39Q7j92M59k2m19M51r7m17N57l29M4J02k79J24K54m17NM17k91K55j54J79
5079A78k16j41J73K34l26K20J5J18k75J4J72p9m1O1j12j89N05n02K07L2q2K02
5101A68l03l23O26j78j23J27j46L41k80J51j2k07J81J09k34r1P01m08j38J95M9
5122B05j4l21J40J9k6J4j12O9N6O1J29k03N1k56Q9k86K87J10j38J58k62J70L47
5145B87M5m11J72Mk3j27J88l6n03M79j23k58K73J35k38j08L32J08l67j3N36p16
5167c64M70j86n1P7j35j8K68j78J69K14l40K65l55K34j04m8J80l2l51M47k67J48
5189D3O2%KL7k67r6M03k12j33K6o6J24j64L2L2k34N07q3k3J48k9j68J65k95Q4
5214a05J86J05j8k07J20j13J11Nk18j69L29j22m3M15k65J90j77l79O41m08R2j95
$$ y = [-139, -52, -244, 215, 193, -226, 225, 128, -289, 268, -61, -17, 85, -194, -70, 184, -233, -228, 189, -102, 153, -1, 178, -38, -179, -6, 228, -98, 122, 137, 255, -20, -6, 166, 87, 46, 107, -5, -194, 311, -191, 16, 48, -34, 168, -135, -458, 168, -10, -133, -6, -152, 189, -91, 60, 48, -159, 22, 131, -103, -194, 507, 99, -39, 156, 205, 191, -130, 10, 29, 3, 17, -95, -26, 30, 91, 220, 17, 68, -188, -99, -385, -98, 12, -126, 32, -230, -60, 287, 332, -79, 93, 97, 74, -53, 135, 99, -404, 75, -48, -306, -33, 102, -136, -244, 88, 196, -171, -184, 352, -364, 106, -80, -131, -54, -189, -207, 61, -117, 52, 266, -74, 191, -164, 70, -34, -82, 98, 66, -285, 162, -105, 43, 105, 105, 107, 144, -123, -219, 184, -28, -161, -135, -201, -77, -241, -209, -177, -411, 96, 13, -10, 138, 109, -59, 106, -189, -105, 81, 186, 168, -39, 81, -32, 79, 84, -134, -303, 26, -96, -139, 276, 11, 201, 24, -355, 286, -122, -30, -225]
5236b25M21J2j73L0j78j15l1J80j08K26K2l39N42j35m6J38j10j09J59l66J46J92
5258A33k42J84l67K34P9j76K44r0k41K26O1J51m12p9K11L05n30J47NO3k9K98k75
5281a00o1L18j36Jj4K97k89K44j08j7k75L32l51l8r1J60R5O2Q7r2j12L32r5j82
5305c3J01m9k92K22K78J30l35M1j06j5J98k05K69m6j21R7mq6%m72L07K90Q4l16
5329f3K02k94K93j99J27k79K19J85l1j09J46J4k94O9mN1J15k7M3k67J71J43n3
5352A58j65J87m29M99k11o5k5m1K79j72L2N3jj86J48k63K49J04l90j02J4P56k91
5375A38j76L12kp2j05l04K82M6k95K76l4pJN5j10R9l09J32j9o4k88L58O3K35m82
5400b70J08M00n02J91J81k25L69k88o9J75j87K78K26k33l7j64K07l8j96R2O2j59
$$ y = [-225, 196, 208, 35, 65, -113, -228, -259, -79, -187, 39, 61, -278, 264, 129, 83, 221, 111, 2, 161, -205, -59, 133, -109, 75, -292, -58, 21, -155, 89, -1, -242, -16, 45, 196, -216, -295, -84, 221, -309, -162, -157, -94, -123, 175, -100, -161, 157, 21, 22, 8, 305, 16, 260, 152, 135, -140, 192, -159, -197, -288, -128, -33, 29, 116, 24, -88, 244, 149, -33, 68, 19, -273, -51, 227, 357, 22, 63, -43, -58, 140, -65, 204, 158, 37, 134, 130, 44, 44, -428, -121, 169, 253, -63, 139, -155, 138, -61, 66, -213, 6, 191, 160, 51, 197, 211, -83, -14, -18, 33, 148, 121, 164, -103, 68, 211, 158, -7, 180, -249, 250, 39, -26, -51, -92, 187, 15, 47, 100, 99, -87, 61, -202, 47, 151, -239, -341, -327, 429, 138, -38, 274, 272, 200, 95, -209, 73, 119, -176, 100, 66, 59, 60, 115, 5, 104, -205, -73, -92, -156, -444, -86, -23, 212, -270, -162, 238, -264, -73, 108, -117, 252, -36, -105, 70, -117, 161, 387, 154, 117, -47, 160, 122, -74, 18, 80, -79]
5422g9R2M4j68J17j26o5K09j73J52j0%P1k03L34Ll52K03Q1Ok13j93J10K51K22
5446C13n86L99j92J80R4l51L76m43N67k66j08P7J7J80l39J35L29m00j26L28k74
5467i0R8P6l46O8qL73k2l62R2N0j31L23J62l79L43j15k94M73m90K48j1j89L09
5490A78j62KQj40R7K36m84L57l97p3L21l9Q7J29Q4q6M0L3k5j94m6j50j57J95L91
5515B05j99K59j94j61K38M5l27r7oj15K26L67k36k71J47J9m6J16K96j37k76p6
5537b23K86k52J8K62J94k32J53m39j5N47l52j56MK10J04j55N2r5k35J94J64p6
5559d2K04l5p2K17q0p7j64j82K63j29k5L16l53J09j24l4P7J99k77L41k11J96n7
5582F0k94L73j12n2K86m23K24P5l47J99m6K0J07l22M98n69L05P7l03R1%KK74O3
$$ y = [-79, 13, 57, -111, 6, -120, -185, 24, -149, 3, -7, -7, 64, -139, 195, 198, -154, 49, 130, 136, -77, -270, -160, 91, 313, -273, 126, -66, 114, 208, -143, 233, -210, 357, 91, -17, 60, 77, 257, -82, 53, 382, -18, -144, 184, -90, 8, 84, -262, -194, -202, 171, 149, -213, -121, -71, -202, 121, 283, -96, 247, 132, -162, 311, -179, 69, 58, -131, 178, 16, 18, 26, -114, -17, 219, -265, 92, -305, -378, -57, -96, -9, 120, 204, 118, 158, 191, 166, -28, -74, -224, -381, -186, 205, 6, 265, 71, -90, 148, 193, -134, -231, -237, -352, -126, 241, 5, -266, -119, -100, -146, -30, 266, 129, -147, -223, 63, -189, -171, 91, 285, 53, 206, -233, -248, 299, -53, -209, -205, 5, 109, -46, 6, -89, -324, -130, 34, -42, 162, 127, 55, 272, 192, 115, -49, -231, 32, -97, -122, 194, -159, -50, -174, -208, -131, 68, -209, 132, -79, 117, 60, -234, 139, 27, -25, 261, -162, 62, 137, -210, -11, -57, -37, 70, -252, 246, -323, -18, 59, -244, -153, -153, -151, 123, 186]
5606A86l96J54K00j38j3j7L0j96J0K94j59J27r1k45M49k53L39k36q4J78j55n8
5628g4L41p4p6o0J18k54J0K34j78J10J0J5m07n5K92%j4K33Q0k74k24J12j06L42
5652A01Mj01j61L41k98L74K1l55k38M28j32j13K10m6K8m73N28n3r9K8%k0M6M1
5676F1K17k35l2R6M9k17J59O3k76J33kk77L97j61R5j45L98k22m04J46M06o01J51
5699b01L98m20N38l85L35k84n3l39N92l51J51O6k66J77l8K16k28k18L07q3J74
5720H8k5K02l48j29O9k7J93K86l44l52L12pk27K70j03j40N99m57j20J73j53N03
5742B63l05J6l16L45J5K46o3j04k43r1L5L33j00L00n25K88k39J63k9J32N2k33
5764f0L51L6m69o2J69k4J16Q6l82M2M52k32J01J18j43Lj00R6k64K08j4j51K78
$$ y = [186, -210, -56, 144, 6, -7, -24, 6, -190, -180, 114, -45, 82, -9, -254, 195, -58, 281, 45, -39, 139, -16, -74, 267, 193, 117, 57, 175, -79, -69, 165, -13, 97, 107, 122, -285, -340, -48, -48, -62, 171, 251, -23, -247, -135, -241, 101, 105, 4, -157, 184, -114, 260, 281, -74, -312, 116, -16, -129, 81, 35, 63, -410, 118, 65, -34, -6, -6, -26, 20, 61, 278, 43, 11, 107, 156, -61, 98, 161, -115, 18, 16, -261, 136, -25, 70, -75, 323, 101, -303, -157, 249, -352, -201, 197, -223, 315, -70, 265, -19, -72, -411, 181, -170, -19, 47, -219, -42, -80, 136, -92, -310, -3, -86, 88, 63, 265, -83, -212, -143, -170, 23, 309, -35, -387, -75, -82, -309, -39, -142, -282, 317, -140, -260, -87, -240, 263, -42, -26, -342, 3, 18, 264, 201, 97, -146, -237, -202, 131, 31, 331, -194, 94, -145, 18, -11, 121, 173, -60, 291, 327, -142, -204, -35, -59, 57, 143, -239, -197, 255, 23, 124, 242, 99, 102, 2, 98, -166, 42, 28, -123, 155]
5787A55j8l38J97rk72L43j71O4p0O8k6M8n0L8o4L0j00M13k91J38k27J22l8m33
5811d91P26k87j97O1L9M10n9k88K57r0k51K45m68M07j08M1P6p8j85L63m07M50
5833A66l48K09K8l2j62m4K15l5r5M12j18m53Q0M36k46K21n2k18J12n8j88L0J62
5856B2l10P23l76k56K72m3n2K95j79q4k73K40K39m73P5J36k04K90q9k53L72K5
5878I7j09j69M00j88j62K03oj47J56k29K55j86R3M3J3K2m1pl36J16L22j65K76
5901B51k30L8K5l6Ok07m2O2J3k24J32J32om8KM53l46o3J69k29RJ83m40N84l77
5926a89L61j61j19K41l18K62k64J41j21M18m14O35l12j73j00J80r9P2R9L6J0l58
5948a73K65l0n2%j59J87j15k7J2j37K62L18j75k59J82j55L03J90n21l4L51k53
$$ y = [155, 137, -201, -4, -13, -285, 58, -113, -49, -119, -51, -77, -29, -79, -41, -105, -75, -175, 238, -53, 85, -142, -20, -58, -491, 235, -52, -249, -188, -149, 261, 202, -86, 171, 81, -170, 75, -393, 14, -94, -53, 23, -55, -240, 123, -284, 166, -182, 27, 55, 23, -139, -183, 32, -3, -98, 314, 196, -257, -177, 259, 13, 234, 182, -36, 76, 18, -170, -140, 22, -288, 435, 59, -197, 75, 32, -20, 275, 96, 12, -261, -21, 218, -255, -180, -44, -248, 42, -47, -300, 72, 97, -12, -181, 219, 31, -131, 72, 66, -81, 75, -154, 101, -85, 8, 51, 64, 86, 45, 38, -298, -182, 140, -25, 251, 21, 59, 84, 48, 54, -153, -195, -133, -120, -344, -212, -80, -86, -134, -132, 321, -25, -88, 81, -148, -139, 44, -396, 188, -189, 172, 11, -108, 133, -185, 77, -187, -46, -167, 251, -163, 472, 160, -13, -113, 67, -32, 40, 139, 175, 185, -173, 92, 62, 10, 10, -149, 38, -77, -104, -92, -229, 33, 351, 176, -83, 99, -56, 247, 437, -84, -118, 233, -20]
5970b0J26j15m9nQ6O3j89M1q2O8J25M4k40J24k42K67lK4j58J88o9R7l03J99n1
5995g4K66k93j8r2J17O5j3K99j81J4l62J79j11K62R8k19j46K72K85m09p9qJ25
6018b3M65m62K12o63N76k61K30p1j11J07p3K16j7j05j43J31L9k88N6K61k5m6L34
6041C39k89P2n2J26l01N11k95j85K92m22J67p1L74l70L51m85Q3J42ol4p2O4L26
6064B65k67R3j1k49K07J9k17L17k70J14N2L0Q0l4k93L33j70k15N07j90N0j87J03
6087F7o4n4k33L84j76J00J44m77K62k89L1n8K70M0N9j78J57J73k94L85l67j83
6109c01N71k76k05M55m29K04j40K00J01k69k3K87l50K34m8j23K60m00L54oK9j30
6131eP4L83k57m29J56L60n24Q1L9J09L53o17N91k36n49N47J97k29K8r4j76J28
$$ y = [-20, 106, -9, -58, -63, 23, 86, -103, -62, -144, -76, 49, 93, -147, -23, -265, 2, -1, 23, -135, 53, -16, 81, -222, -23, -74, 192, -101, -119, -211, -94, -29, -42, 257, 76, 90, -272, -93, -204, 58, 156, -63, -209, 63, 348, -61, -140, -148, -23, 442, -20, 192, -471, 105, -156, 74, 3, -108, -1, -74, 142, 125, 20, -123, 8, 47, -241, -185, 76, 51, 5, 339, 50, 122, 70, 196, -105, 406, 111, -74, 218, -204, -37, -108, 266, -104, 247, -238, -155, -13, -19, -53, -125, -61, 265, -2, 91, 80, -169, 38, 57, -160, 157, -113, 1, 53, 83, 163, 129, -164, 169, -1, -216, 291, 101, 151, -36, 67, 3, -51, -284, 100, -76, 24, 168, -309, -47, -336, -305, -363, -93, -53, 6, -172, -15, 158, -136, 249, -118, -301, 270, -6, -211, 244, -185, 19, -121, 79, 180, -89, -112, 175, -175, 59, 11, -112, 148, -252, 102, 96, 125, -5, 69, 452, 195, -234, -78, 282, -242, -161, -122, -13, 340, -277, 314, 78, -471, 76, 273, 44, 72, -22, -198, -70]
6153g0j40K37k3j02N01l32k16K55r6J43k43r6K56J01l67J39k15L34J35m08K17
6174A0oM1J12k63L7J79k04l4J95j21R6j65k07M03j36J78l72J11J08J7r9J26j31
6197a25P3L3l6J47n0K38k96l5O2J32n7l95J33k33O64L0k73M53l82N8k90J44J09
6220A04lK2r3p6JO0k6p3kR3R9o3l14L99P7j20K37m65J87j13j03J2K2J6j81J25
6246a78l8K52l11M98l30L43n62K06J02j26o3K7K9J84L22m37K81n41M90k7l61L67
6268A27j52r0L11k39j72M42n26J44J31K30k49L94m14k08L54j5j96L07P6k23k51
6289b19L93R3k78O4J49k6n7l72M92m30L83j5o9Q7k26j21N2q2k7O1L7K76k32j73
6313b40l6N7K54k76pL59k7j12j24L49n06L65j5J73m02p7O02m10K21k6OJ56n82
$$ y = [-70, -210, 27, 4, -98, 403, 71, -145, 110, 14, 157, -86, -182, 74, 175, -192, -53, -268, 66, 201, -207, 10, 4, 45, 157, -106, -69, 110, -94, -128, 67, -54, 42, -123, -330, 73, -63, 115, -257, -146, -38, -21, -120, 6, -125, -52, -19, -55, 92, 42, 280, -16, -51, 11, 143, 86, -309, -176, -409, 255, 285, 12, 465, 83, 141, -149, -5, 104, 101, 123, 30, -46, -45, 15, -11, -84, -86, 7, 106, 43, -271, 128, 205, 85, 322, -143, 44, -69, -172, -160, -138, -122, -303, -178, -216, 36, -275, 223, -107, 236, -326, -120, -18, -144, -207, -180, -151, 33, 355, -82, 199, -342, 148, 121, -240, 127, -25, -115, 196, -43, -215, 227, -299, -155, -24, 206, -43, 351, -63, -271, 83, 68, -128, 179, 255, 32, -219, 174, 267, -11, 53, 202, 176, 119, -253, 239, -191, 192, 177, 108, 195, -31, -152, -100, -182, -209, -148, -111, 165, -67, -240, -276, -219, 35, -241, -248, 111, 84, -28, -152, 197, -309, 56, 41, 214, -188, -265, 337, -73, 148, 122, 128, 284, -298]
6336b98L24k14L00j83J31Q3j91mq1L92k04k20KJ73q8J18l71O78m44P3K02k23J30
6359H5J51l97l5R2O3k06J14q7K11K21j95k08J5L46k54m0K23o3J58l49L65J14o42
6382c18L85l96K62L6J33l93N51j36o0NK1J40K38n61R0q5j55K61n7k48L30j10P
6405f0l9J25J16k55L35k79K68j48K9N1n3j93K69L5r3J67m63J43J89l85J50P1J97
6428A77k97j23M68j52J81j71j72k44M82l13J12k2k06J49L73l69K43J1o5O3n13
6449c88N81l01K11L4j76K2o7K13l47K16k19L39j51J05R7k94K09J2l49M68l30j0
6471a25M45l80PJ72j26K02l38p3L53p73N33L48k63L5k11L36K00l69n7J73j63L04
6493B30l02m51N69N4j98K38m1j48J88J23k67k52L89n5k13O4j34L71l78J31l8l14
$$ y = [-298, 26, -188, 112, -71, 60, 143, -48, -52, -133, 259, 55, -165, -163, 10, -78, 40, -331, 347, -97, -24, 178, -45, 85, 236, -161, -196, -104, -41, -247, -133, -220, -9, 212, 17, -191, -176, 170, -84, -124, 99, 36, 194, -155, 210, 324, -318, 67, -329, -67, -31, 102, -291, 260, 124, 64, 69, 90, 230, 468, -93, -3, -88, -243, 18, -39, -287, 43, -67, -60, -99, 26, 142, -113, 222, -57, 211, 63, 92, 143, 90, -103, 166, 201, 108, 275, -188, -45, 144, -241, -91, -20, 177, -120, -243, 225, 73, 254, 83, -89, -333, 149, -164, -52, -74, -280, -131, 242, -127, 116, 127, 62, 125, -388, 193, -108, 103, 137, -39, -17, -84, 129, -218, -2, -221, 118, -33, 72, 169, -125, 84, 96, -253, 215, -115, -125, 320, -60, -53, 119, -7, 195, -143, -216, 137, -636, -103, 245, -18, 17, -194, 142, 342, -27, -84, 89, -74, 230, -72, -523, 46, 100, -98, 140, 99, -49, 139, 262, -5, -257, 132, 77, -136, -72, -206, 165, -213, -82, -120, -434]
6515d34J36R5J80j30L72k46l22N75J3k60OK4J26o1j58o4L82k63K56l76K10j48
6537h7O2K06m16K34M12k91o8l9r2m2K81l12J83K60o19K47k1R8LL6k0O0K22j00
6561A97l33O04l95k43J76j82M1J28j69J10L25k84J82k46J3R4J78k61o3j94L10
6582a2Q6Qo3m75N10l2lL38l28j44J67J22k79J57jr8N7j80L72m24M75m97J87K59
6606B02n52N78m38J11K99J7l12M35l90m8K05J25n61j1M58j22k59L80J17k26n7
6627d9L22m10K56K13j70j20R6l8l0k06K25n7n5J95M2K6j59j5j42K26o8j28j08
6650a54L60j19k86K74k73K35l7j80J27m5K46k63L97j06l87J10J81N1n4o8L50m43
6672h4O9J68O1m10J18N43m69J5M07l88m10L02o2J70j89l9M05k07k42K78J02m36
$$ y = [-434, -298, -203, -23, -153, 219, -27, -349, 226, 239, -21, -15, 9, 135, 74, -84, -148, 234, -29, 227, -149, 61, -87, -25, 181, -235, -1, 411, 120, 52, 13, -79, -121, 160, -152, 31, 291, -328, -81, -102, -4, -1, 35, 15, 75, 297, 197, -136, 468, 73, -170, 6, -176, -135, -7, -176, -66, 259, -25, 157, -89, -76, 18, 196, -65, -128, -322, -12, 74, 82, 19, -456, 54, 22, 19, 357, 29, -115, 52, 174, -105, 52, 51, -47, 10, -170, 202, -222, 253, -244, -57, 202, -350, 228, -210, -99, 200, 217, -95, 340, -50, -98, 107, 232, -329, -340, 118, -4, -263, 117, 234, 8, -49, 273, -137, 119, 332, 162, 42, 138, 100, 70, -136, 89, 32, -23, 172, 214, 240, 81, 66, -76, 150, 82, -46, -154, 206, 87, -199, 75, -198, 37, 0, -180, -53, -98, 148, -115, 282, 176, -211, -101, 80, 131, 77, 9, 359, -84, -15, 153, 214, -196, -78, 465, -4, 11, 418, 30, -380, -78, -140, 30, -159, -198, 207, 0, -242, 36, 138, -298]
6694b98K62R0J25j6k6p0r7o9O3p0L81l78L1p1n0L07M6j75j02J48k19K81k03K84
6718A74K72l43J17l03J9R9l9J40j69Q2J55l44M00l48L36m34M5k21O79m88J08J53
6740I0j84J27Ll6o0Q8M6J9J05l12j43L07n4J01j98j12J85l66L92j06J52l19mK45
6764c4J59k39L17m63K09q3rL20j27p7O7R2k45q6J18P9k45R7P3K37l93M03m59L24
6788C5K62j71Nl2j07K29j47k40N66o11L41o1j54M12m48J69K2k12k0N0Q1J21Q0
6811A70m33K16j07L65n6K9r1m00J29N69n89j3K04J89Kq2J45J25o19K69R0j90q2
6834a60K70k41K31J31l46J63J19K1j27k22J98r2K85k02l01N76k99j37l66P17k75
6855e7Pm3k3P4j14K34k55K62O8k29qr1j36K61n5K29l6j5k98N5K56J10k26k19J97
$$ y = [-298, -36, 54, 179, 163, 137, 67, -30, -99, -36, -106, 275, -103, -72, -143, -193, 114, 160, -15, -117, 31, -188, 93, -110, 174, 446, 103, 220, -83, -64, 35, -4, 136, -33, 49, 204, -140, 260, -88, 248, -186, -141, -362, 317, -171, -63, 90, -94, 33, 36, 0, -60, 28, 74, 93, 198, -114, -257, 50, -4, 97, -101, -213, -28, -394, -2, -108, 44, -275, -279, -34, 125, -114, 203, -260, -51, -134, -143, 177, 50, -27, 40, 132, -113, -199, -81, -2, -247, -150, -77, 160, -233, 170, -289, 35, 297, 126, 131, 99, -8, 221, 74, -166, 400, -211, 130, 69, -85, 327, -121, 48, 70, -142, -162, -112, -31, 90, 170, -263, -47, -154, 211, 155, 184, 93, -307, -178, 391, -198, -211, -7, 182, 184, 102, 247, 372, -247, 22, 112, -78, -160, 110, -131, 100, 231, -115, 48, 167, 188, 61, -161, 37, -55, 230, 28, -273, 303, 4, -133, -499, 218, -57, -50, -93, -116, -42, -156, 78, -177, 85, 153, -76, -84, -175, -311, -50, -105, 124, 88, 73, -225, -170, 86, 196, -30, -249, -52]
6880e2ML62l73J30q5J7p3K14j73rQ9kR6l11J56j17j08J72L3Q8R5l22L00R0r8R2
6906B15n77L58K2J73r9p6L31l61N6L3j14J24j11J97j27k4q9j38L6R9K9q6p5j68
6930c72M22j67N2j70K21L8m0M3PJ8k40o0J66J26j10M3R3r9m2q9J51q2o1l3K59
6955G4J13p9k35Q4N7j67j53K98r7R7p0J2M2p5K12j44J13rK14o48J91K14O2j70
6979f4m13N84j93j1J87j47o8K21n0J1k49N64l28q6j66J42k61J23M53m30L0M0K19
7002A08J01l17L2P7n9k45J16K75o8K8j6R6k82K87Mk05Q2J27R9l68n1j7P1M76o06
7027b55J49R8j12J12j36L53l96J15p1N2r8K45k9R4n5K97m48j62L44p0J15j85J09
7050F6o6K21k34L97m81K83j3j31L7m01J32N34l17j38r0L7J66J46j17k93K15M3
$$ y = [-52, -48, 314, -59, 71, -14, 3, -70, 144, -29, -38, 51, 49, 145, -166, -10, -127, -235, -63, -30, 58, 153, -169, 131, 221, 123, 215, -362, -4, 18, 191, 92, 16, 347, -14, 42, 75, -39, 85, -26, 171, 44, 20, -69, -207, -171, -72, -43, -129, -204, -372, 50, -117, -65, -235, -14, 24, -16, 27, 34, 52, -188, -248, -82, 44, -66, -23, 70, -29, -71, -160, -9, -91, -152, -185, 74, 187, 108, -127, -43, 14, -153, -306, -8, -105, -8, -78, -66, -24, -99, 113, -31, 82, 73, 287, -361, -170, 44, 106, -64, -477, 107, -86, -97, 90, -57, -125, 96, 46, 57, -192, 372, 44, -42, -208, -66, -327, -204, 249, -181, -151, -111, 108, 209, -108, -76, 1, -58, -303, -187, 88, 20, 48, 32, 128, -154, 133, 137, -68, 14, 141, 240, -128, -179, -196, -125, 351, -255, -106, -8, -120, -8, -144, 209, -187, -72, -143, -91, -189, 56, 27, 121, 66, 363, -85, -247, 97, 27, 142, -43, 66, 0, 221, -13, 384, -97, 186, 173, 42, 79, -322, -190, 344, 27, -111, -201, -164, 2, 148, 31, -262, -47, -4]
7072dJ87j27l95M78m14L35l35K69K53k87k36M10k10j4p7p8L64k02J39k32j18K03
7094i1nJ34J47l37L98j45j54N14m06L9Q3k43o8K94j12L61o92qM81l27J20L87k63
7117A07N3n0k75K16K35l35M04o76N49m89J80M31j10j92L0j47n8j27J61K54j57
7138Djn5m0J43j41m4J23mk62K28Q2J69k40J05k71J42K51o3j42j17K10qk78K51
7162D2J54k95J83j02M7j1m4J4j06J39o7j05P7J06K8p6j59N22m24N6M07l59l1r9
7186a03J28J09j10j41M03m04J20J56l72K08j26J26K4K67k39j95k5J38O2m4K45
7207B27l5l99m2K95j9j46L70J5m61K21j26J60J04l93P4L94k74K6J52l61q6N13
7229B09n7j26k49J84M6J32k39lNK00m64J72j29L3N15O3k40K37n40J73J53k66K93
$$ y = [-4, 183, 56, -339, 139, -275, 60, -275, -6, 247, -40, -276, 134, -76, -90, -167, -245, 119, -83, 56, -176, -294, -91, -96, 38, 185, -152, 246, 101, -53, 461, 55, 94, 177, -66, -134, 160, 48, 409, -283, -291, 190, -137, -17, 370, 107, 160, 110, -165, 51, 286, -49, 355, -321, 228, -261, -81, 350, 240, 48, 78, -69, -127, -254, -93, 161, 4, 3, -52, -92, 51, -90, -134, -11, -15, -277, -49, 33, 202, -38, 67, -204, -62, 189, 126, -16, -133, 77, 69, -209, 42, 196, -99, 84, -18, 29, 18, -26, -12, -118, 21, -46, -151, -74, 32, 60, -16, -175, 347, -77, -21, 386, 27, -4, -103, 25, 134, 24, -117, 286, -118, 2, 158, -214, -6, -132, -6, 18, 285, 46, -149, -174, -36, 26, -18, 227, 192, -207, -249, 46, 27, -119, 251, 266, -195, 26, -100, 60, 164, -229, -155, 239, -35, -9, 143, -218, -304, 209, 152, 26, -223, -39, 7, 139, -100, -103, -98, 102, -362, -190, -319, -286, 229, 292, 52, 289, -251, -78, 75, -191, 102]
7252A02N8l04J17J1O1K41k59J00r3Qk05L89k8R3r0l39O4o5K48K04l08J89j01N4
7276A47J48l70k59L33O5l39L84j69N0j74J75k14J6J93J44l2O3l53K98r5p3j28
7298a90M31l39N9QJ89l12K17%j95l2J85j65K70m22R4L48N6k79K23N5J31m60L6
7321i2K91j85j13J90n3p3n5K06j62K17j86J74k67J73J07k29J29j14l6j12K03j54
7343a41M36l14j70M1J06L85k00K5Pm03L71j17r5K35q9j13QK5M0l15P9L01l3j86
7367a17K6m5j99O05m98K54l26K14J39j14J55m20K62J27p8P0k8n9O4j11kJ10j09
7390h0K62l08N5K7P4l90O32k80j39J19M4M8L18k66j34nJ24k12J25K18k05n7K67
7413B37k11k55K9k26K40K01l37J53K89k72J08L2k63K35J15p1j40l69M14j6M01
$$ y = [102, 160, -144, -27, -16, 45, 286, 27, 127, 34, 42, -163, 226, 198, 291, 201, -138, -74, -139, 109, 313, 5, 194, 93, 147, 295, -75, -334, -1, 64, -275, 109, -60, -10, -184, -9, -223, -207, -14, 130, 98, 161, -192, 106, 11, -62, -190, 241, -98, -39, -31, 158, -154, 63, 63, -132, -164, 21, -144, 126, -296, -202, 146, 202, -77, 146, 201, 332, -128, -92, 199, 14, -99, 91, 38, -35, -90, 116, -46, 171, -15, 159, -108, 65, 172, -57, 72, -42, -78, -190, 13, -141, 295, -19, -189, -148, -42, 343, 143, 168, 175, -228, 143, 26, -69, 166, 77, -36, -28, -3, 37, -278, -199, 102, 69, -117, -91, -136, -335, 270, -228, 26, -300, -86, 53, -61, 94, -326, -64, 63, -15, 55, 27, -32, 32, -79, -81, 29, -80, 182, -126, -71, -44, 30, -360, 272, -8, -147, -28, 16, 64, 382, 116, -18, -23, 101, -111, 14, 232, 27, -30, 237, 26, -229, -200, -426, -186, 15, -322, -169, 120, -152, -44, -12, -275, -40, 75, 4, -136, -505, -91, -107, 294]
7434B94k11k29q1K77j6L7j19r9J59O7k94J39j32J82m3j13o9L61k83K75m3j54J84
7457H9k34J59K7Q1Q0l69J02m06L72j67K28J66l87J38o5L07k42K41l5k85K69n9
7479A0o4R0k7p1L44j42L5k4j79J30L8N6J13l27K18j32o6J61j51j88P1J03J34k89
7503a57Q8K39j93J12N8j56l4N0K11k15J18k60K00j48Q9k16R1K79o3J2n0L0p8K12
7527B19j07j81Q3Q0P1o1o0M7K25n00J79Q6M76n87K00K29m28L08j53j15J63k35
7549f1N00k43k39K58j12O5M6p5L4j64o03P73m48N29n5j25J39j6k66j50K25J7J6
7572D5l38K66J81l55L0P7L9K75l47K56j83J74q4Lj88R6q2Q2j16L57l58J82J31
7595A43l81L61j72q9n6K93k61L05j94J9J81k75k9l8R2n4L25j63j65K50o2K15j85
$$ y = [294, 83, -146, -227, 50, 34, 71, -48, -147, 12, 79, -215, -76, -208, -26, -69, -182, -251, 110, -173, 102, 59, -95, 89, -145, 14, 41, 122, 202, -167, -65, -471, -99, -266, -38, 128, -259, -121, -186, 121, -121, 120, 85, -200, 69, 10, -54, 36, 9, -62, 282, 140, 175, 151, -28, 102, 140, 196, 309, -18, 200, 68, 2, 163, 12, -176, -105, -2, 132, -157, -69, 170, -23, 89, 147, -9, -43, 7, 218, 3, 121, -139, 61, -87, 2, -214, -123, 156, 93, 105, 55, 85, 7, 219, 112, -69, 14, 94, 165, 104, 44, 91, 316, -184, -5, 81, 557, -30, 170, 399, -29, 279, 126, 11, 174, -61, 439, 196, -43, 215, 103, 168, 214, 139, 173, 9, -594, 179, -269, 260, 205, 80, 219, 203, -63, -213, 12, 29, 45, -293, -27, 154, -201, -171, -94, -55, 220, -127, 129, -54, 120, 36, 39, -149, -53, -135, -53, -169, 188, -170, 12, 143, -238, 123, -49, -138, -194, 99, -162, 143, -51, -32, 149, -126, -155, -193, -101, -155, 170, 7, -158, 92, 30, 245, 60]
7618F0K54l10KJ35j29O6L2o7j08O06q58K28L16n07O76k9n20L62n07K13J08J0j66
7641a33K80j55J26Rl12L14PJ6k14J12j13j12J4L06k88p5K70j34O9J98j44j26J63
7664G8m45O51m97qN42j94k67r7N12l41j18J95j6J08r7j55L12r7l00K23K4Q0J37
7687B30k16j95J8L96r3j99j88K86N3J80n49K70k66J39l0M01ml49n1m1K87J5k47
7710a53Q8J80j1p6j71K06j01j94L77k2q0R0O2j70Ok93O2J37M47k91k20K82l39
7733a84R1N8qL27j19m52L14J44j22p4k94L31jk14M80l56o1J28J41k54L01j71j16
7756a11J45J17j10K28j18j35k11J30O8J2%k75J48KK04k86M77k86o7K4J46K52k17
7779A37j04j09q9K23k29kJ04M30n72L32j42j6K24Or3k48M26k45j54jJ63K83m59
$$ y = [60, 314, 4, 6, 141, 12, 78, 110, 43, -65, 541, -317, -89, 227, -280, 396, 367, -153, 209, -298, -85, 23, 33, -133, 147, -8, 118, 127, -185, 129, 136, 152, -62, 50, -63, -175, -161, 145, -143, -218, 52, -82, -13, 185, 41, -85, 78, -367, 284, -213, -221, 321, 127, -140, -237, 275, -66, -184, 11, -5, 103, 6, -149, 163, 66, -234, -11, 13, 93, 230, 14, -181, -163, 233, 140, -59, -247, 39, 92, 272, -277, -7, -273, -134, -164, 237, 233, -116, -167, -208, 79, 94, -153, -65, 115, 104, 28, -143, 63, -38, -232, 145, 123, 43, 133, 195, 25, 31, -262, -200, -63, 384, 93, -127, 155, -184, -93, -35, -43, 284, 165, -287, 27, 171, 49, -25, -319, 12, 11, -203, 277, -79, -140, -12, 129, -125, 176, 5, -111, 34, 151, 41, 269, 151, 16, -195, -65, 3, 15, 15, -260, -112, -110, 94, -192, 285, -1, -68, -44, 102, 354, 137, 33, -76, -165, 58, -171, -173, -69, 361, -211, 121, -21, -37, 187, 193, 100, -148, 278, 33, -121, -122, 41, 324, -135]
7802a35K02n1J39M4k01J51l82L53k72Q7m9K57k72J10k98K36M70m70M04m6n37N49
7824B89l88RM81p07N67k79L59m95Q6K7Qj57N5J85j12J38j54K93k18j65J74J62
7846A58k17J51n7J73l81KN5P1j7J23k86Q1K17k87K57L6r9Q3L38o17M03n0J20m4
7870B13n6k13J33k4J14k27J51K20k21j73R5l52L02j9k30K30j8m5L33j00m2J13
7892A84N7l83K7L12j67O7o5J49l28J98k25L23l06J93n5K7J95l15j47J68J62R9
7914A70j36j26J03r0K94m56N50k46J16j54K83m78N9L98l38L67m27o2J12Q2j66
7935a45M2K40k55N6K01p7q4l58N64k70K28k33L5J69l76K45pk4r9J69Q9L4j43j1
7959a0J42j72l27J95n2K93L5l66jL22L0l05L40K66k09k29M5R1k83J80J33j15j40
$$ y = [-135, 67, 16, 155, 199, -2, 149, -233, 120, -152, -65, -114, 143, -129, -19, -317, -81, 389, -81, 323, 277, -260, 289, -99, -90, 391, -316, 251, -28, 331, -164, -78, -51, -43, -200, -145, 40, -72, 66, -88, 205, -13, -178, -4, 158, -59, 92, 35, 208, -173, -171, -116, -45, -62, 61, -225, -144, 73, -214, 43, 79, -20, 63, 401, -216, 187, 137, 257, 213, 157, -56, 77, 53, 167, -60, 91, 311, 90, -83, 12, -340, -38, -57, -287, -57, -75, -120, 213, 113, 71, 184, 241, -142, -115, 197, 30, 97, 32, 181, -147, 51, -174, 149, -157, 36, -19, 8, 203, -112, -259, -91, 71, 170, 34, -92, 11, -79, 215, -241, 309, 63, 179, 25, 308, -170, -111, 287, -51, 316, -111, -173, -61, 21, -145, -103, 137, -118, -62, 139, 62, -22, -380, 184, -86, 142, -91, -56, 113, -263, -18, -25, -49, -148, 21, 110, 144, 1, -10, 132, -40, -367, -172, -224, 69, 104, -262, -263, 59, 89, -216, 124, 390, 181, -48, -3, 88, -195, -15, 118, 3, -137]
7982a37M3r7K74k6k0K3lk82L16j9qK85k46j21k0O7L66l73R8j37oK11l61L15k6
8007A16k01O17m73K51n10M8M03l46M29l20m60M30O5K57k23K03m52J17j26Q1L03
8028B09m83J61K59j67J73j81J03k3l44K34n1k9l10J50K42MJ21k5J69l72K70k3
8050H7l39L60J5Q8j41l0K9K16m08J66l6m9j07p0J60J27L5q7k52K5K78J44q7k29
8074a05n7j40M28k08K19j86J01r3j58K03J85Ok26JJ7K50n27L45J7k24J68m3p8
8097a05n0K37l0J04q0q2n5JJ43m31J27O21Pm28J91k41L74n33K55J26j24l26M7
8120b52J30R4J88Q6j18j53p3K17J05l66J30j79J2k2M34m56k33M98j81K43j05J02
8142A01j62r7n1K98l36J64N13n47J25k52OL14k16K92J83l66J68k20m4K00O9k09
$$ y = [-137, -94, -191, 83, 57, 37, 60, 57, -225, 91, 72, 64, 349, 103, -18, -38, 29, 395, 22, 120, -17, -23, 188, -173, 142, 116, -85, 532, 59, 310, -200, -152, 251, -95, 334, 14, -446, -16, 49, 306, 83, 286, -166, -49, -175, -94, 209, -274, -113, 146, -21, 152, -29, 74, 51, -293, -59, -110, -139, -449, -299, -57, -53, 68, 43, 212, -160, 110, 87, -252, 108, 123, 211, 70, 40, 69, 285, -123, 43, 7, -42, -149, -219, -59, 68, 103, 16, -236, -211, 67, 211, 124, -105, -162, -302, 126, -82, 137, -49, 52, -41, -199, 4, 189, 195, -31, -30, -13, 237, -290, 55, 72, -152, 16, -27, -105, -155, 82, 52, 156, 76, -6, -61, -60, 83, -348, -221, 400, 407, -21, 170, -71, 303, -230, 25, 151, 27, -299, -252, -122, -28, 160, 246, 128, -25, -98, 119, 224, -142, -12, -191, -179, -201, 233, -223, -456, 42, -139, 104, -1, 101, -61, -158, -209, 89, -247, -83, 430, -117, 8, -244, -238, 76, -140, 152, 335, -31, 137, -83, -127, 73, 142, -67]
8164f7M34m03M7k5LL76n65L3L06k9j20r1k6N9O6L12k36j52J01J00k27J82J50k35
8188gJ35l02R8
$$ y = [-67, 367, -36, 11, -14, -11, 365, -200, -167, 139, 110, -10, -101, -127, -68, -2, 310, 74, -78, 23, 123, -104, 78, 228, -7, 128, -174, -76]
8191g6
$$ Imaginary data points
##PAGE= N=2
##DATA TABLE= (X++(I..I)), XYDATA
0@%%%qJ6j6J6k4M0m8N6p2Q8j05J29j60J92k24K64l13L69m32M98n75O66p63Q68
27D62r88J124j271J428j605J804k019K253k511K796l108L448l822M234m690N192
43B727n745O364p058P837q720R735j0910J2286j3931J5935j8438K1665k6009L2199
57A7937m1780N8678r6913L25120l5922p23657N09661L66462m34092k50486M07989
68A02997Q8349l02326k6164K05716j1926j5713j11119m5225K55536J3946l44968
79a90897O6226L32367j01920l60434J71198L61272k80785k80157L61810J45596
89B24276l07029o2563K21504M5239j69114l6977J12879J4003l2189p3067m235
100f7273J84701o2801k27747J75629J75075k10865r5864J85310L7473j61940K1271
$$ y = [0, 0, 0, 0, -8, 8, -8, 8, -16, 24, -24, 32, -40, 48, -57, 72, -88, 104, -120, 144, -169, 200, -232, 266, -309, 357, -406, 462, -526, 598, -673, 755, -850, 954, -1065, 1188, -1323, 1473, -1635, 1813, -2009, 2225, -2465, 2727, -3018, 3346, -3712, 4125, -4595, 5140, -5770, 6516, -7415, 8520, -9918, 11747, -14262, 17937, -23843, 34835, -62078, 263042, 227120, -496537, 13124, 379586, -54506, -304992, 102997, 191346, -110980, -137144, 68572, 56646, 40933, -70186, -115411, 140125, 154071, -190897, -124671, 207696, 105776, -254658, -83460, 277812, -2973, -283130, 78680, 224276, -82753, -145316, 76188, 121427, -47687, -84664, 28215, 42218, 10029, -63038, -67273, 117428, 54627, -173120, 2509, 177584, -33281, -129145, 56165, 93638, -68302, -47031]
111d7031J06145q6425N905O5662j09477O0607J24350j76520n1110K19022j5216
122I5912k22301N7044K15512j30859j69927J98654N7991j89804M9088J10815p6291
133d166k3175O4755m0343n2539J14905M715j93632R8428J91013k10351j00829
144a51219K58308K00k41492P4756K14451j34418j61726J76682N8192j57399M0226
155b3439O1898p1168L3668L4448p6188K0383R0930o7713r0291J26405N7467j73324
167g6924P549J58843o7971j01035Q0576N1130o4265k2499N3809R33l0194J5774
179E726j6905j916N4823m2940n6700P5500K8950q2098J398Q0665k9153p0422O5322
192A2250L8531q3119J0533N7802m9724r361N8259l7178m7048P2823K5215r3002
$$ y = [-47031, 59114, -27311, -21406, 44256, -65221, -4614, 119736, -56784, -107894, 111128, 95912, -126389, -69345, 146167, 15308, -154619, 44035, 102026, -87778, -38690, 72125, -4166, -27341, 37414, -2929, -55468, 59437, 64152, -129480, -31052, 159961, -50390, -151219, 107089, 107289, -134203, -59447, 155004, 20586, -141140, 35542, 93734, -63665, -23439, 38459, -32709, 959, 35407, -40781, -20398, 70532, 2819, -87472, 38933, 96400, -76924, -69375, 89468, 21497, -79538, 1038, 52168, -12097, -34596, 19213, 20146, -10048, 5726, -11179, -13095, 41728, -1212, -57912, 17588, 46538, -35560, -34162, 46503, 17350, -53072, 12250, 50781, -32338, -21805, 35997, -13727, -23088, 35171, -2007, -49055, 23768, 48983, -44019]
204d4019J4897Q9138o1355n2258Q4300J244p3579L3904L8663m6979L692M3840
216C1488m7504j6769Q0997k8406q3643P1672N7805r9823k4679J09470q610j06472
228f4474M1978Q7068o0892n0651N5038K0025l2756q757R904Q094Q210j6793k7598
241c1604M2154L6434p7686j8051J01628j2069r9787L5146Q5417n3171p1033O9072
253F450M4097p3678r636N2026l108j5354j2027r80L2721j649m3876K966N4589
266C2541j2050p2400M0704P1255p2074m0499P9656J1024o1069j337M8490n608
278A8633m4958K0233K2731k5062N735J631q715K6980j0978k7357K3709K1071k1630
291B023k8416L0151K7112n4527O22N4731l3733k4492L7255K716j9509N89J7243
$$ y = [-44019, -29122, 60016, -1339, -53597, 30703, 31947, -41632, -7728, 30935, -16044, -12352, 31488, -16016, -32785, 48212, 19806, -63837, 7835, 65640, -34183, -58862, 50608, 41998, -64474, -22496, 64572, 3680, -46971, 8067, 28092, -4664, -13421, -3517, 4577, 12787, -4006, -31604, 10550, 46984, -30702, -48753, 52875, 40806, -58981, -23835, 61582, 8411, -62622, 6450, 50547, -23131, -32767, 19259, 16151, 797, -11230, -12210, 20511, 18862, -25014, -22048, 32541, 20491, -51909, -11205, 60050, -12024, -52523, 27133, 38157, -22912, -24249, 24241, 18633, -26325, -6092, 16639, -8423, -2688, -1057, -9772, 17208, 6230, -21127, 2582, 23653, 2023, -26393, 3758, 30870, -23657, -23035, 31696, -2037, -26529, 10726, 13442, -6067, -5478, 11765]
304A1765p660j8075K6700p532k9713L6011l338l1781K9983O656k1842L919J3297
317H390L094k1874Q500J9905l2036O544K5438l2285M549K1906j5388j750P892
330B885P048r771j2643L0579j0780l1434L3457n38k6165J8306K951n853j425L122
344b61J2045j7727M105J7878k8510J1090J8237l3710J0761J7784j8797k82Q745
357A358R875j3469j1455L3635j2372k6999L0321n602j7319J4494n388K287k84
370i18n351J3535r469L173R300k1846J7423R125l1848J5096J1640j5802j181L510
384c613J4397j1801j5360L3549q516k3765K4167n032r109Q915r705O324%o009
398e558Q290p923R719L712k3009K2316P546k8178J3347O716j0409k97k717J3871
$$ y = [11765, 4105, -13970, 12730, 5198, -24515, 11496, 8158, -23623, 6360, 13016, -8826, -4907, 8390, 11484, -10390, -1890, 18015, -14021, -7477, 17961, -14324, -9775, 12131, -3257, -5007, 2885, 9933, 162, -12481, 18098, 7318, -24116, 9341, 8803, -17362, 944, 3895, -1958, -3383, -261, 11784, -5943, -1838, 16040, -12470, -1380, 16857, -16853, -6092, 11692, -7105, -7387, 1358, 11233, -2236, -13691, 19944, 7572, -19427, 10894, 5292, -12027, 2467, -2921, -634, -918, -6269, 7266, -2203, 970, 10270, -11576, 5847, 14972, -16876, -1780, 9860, -5942, -7123, -3613, 10784, -1017, -16377, 17172, 8656, -15109, 9058, 4026, -5083, 3832, -5873, 451, 451, -5558, 2732, -5191, 4528, 8240, -14769, 7547, 15093, -13085, 262, 6978, -3431, -3728, -6445, 7426]
412G426p337j4427K4234n104j1909J4883q718N35O236j1450P233j690m367O895
426B440j0113J0607L747j9191J8240N804j9892R763L648n198j865m156J2924q458
440a700j0101J9465o394n881J1094r355M990M283j1580O992l88l832K065o544
454f886J1579p63j5971J6342L462j2298N419K58K346k611q516J2198l233q806
468g480R711m876K722N357j1531O454P275q224q63o91O462j168j3986J1609O279
483G050j3153L195M168K381K56r418O784N968q876j277J168M364p7j1975P066
498b376J1657j0507m771O108P253k947j2791P173J0307j0369o181N195P948k481
512C218j4269Q268J5865j1585j1162R847J1624r875j5138J2971J1292j4711o786
$$ y = [7426, 89, -14338, 9896, 4792, -7117, 7766, -952, -417, 5819, -5631, 1602, -88, -4455, 2440, -7673, 2934, 6681, -12510, 5730, 11534, -8358, 1405, 5053, -145, -2010, -6166, 6758, -1700, -11801, 7664, 1270, -4611, 6483, -2872, 2118, 6401, -5179, 1813, 1425, -2407, -342, -6886, 4693, 3930, -12041, 4301, 7763, -4535, 884, 1142, 3488, 877, -7639, 4559, 1326, -7480, 2231, -2645, 77, 5434, -6097, 357, 7632, -592, -1455, -2146, 4316, 3148, -10838, 771, 7050, -6103, -2908, 1260, 3641, 3897, -5521, 1263, 7231, -1645, -2922, -1754, 2610, 2533, -9442, -2376, 9281, -1226, -5997, 111, 7364, 4417, -8374, -1201, 9106, -1263, -7444, -2249, 5699, 3218, -11051, -2783, 13082, 1497, -9665, 182, 11806, 1931, -13207, -236, 11056, -3655, -10441]
525a0441J0570P695o482j0705Q550J1965r006j0212N622J2363n655j7635Q570
538d801J7579j0669j7020J1349K0189j3190k0569J8967J6365k1135j1156J6985
550B894R206j6154r278J6011P126j1743o276O582J3145n839j7866R658J5177j0476
564B167j4404O469J8804r122k2365J5338K1475j6141j8788J4833K2264j8794k1766
577b0030K4361J1175k3678l163J4142N787r679j0126J2651R281r772o914K049
590c916J2915j644k0086O881J6188p409j2970N95K2445p91l2247J4337L0008k2470
604A836j9838J8273J5300j6849j6094K2226N815j9646N177N438Q26N886j3755
617e405k407J6860j628j1787q412J5836J3009k8690l323L2372o714k5036N869
$$ y = [-10441, 129, 7824, 1342, -9363, -813, 11152, 2146, -8066, -2444, 9919, 4264, -13371, -4801, 12778, 2109, -14911, -3562, 16627, 3437, -17132, 1835, 18200, -2935, -14091, 2894, 12100, -4054, -13332, 2679, 9805, -1938, -8214, -1632, 11513, 5674, -12192, -2534, 12643, 2167, -12237, -5768, 13036, 3914, -18451, -3113, 18362, 2221, -16567, -1734, 20530, 1736, -20030, 4331, 15506, -8172, -11335, 2807, 8594, -1085, -11211, 1440, 10721, 949, -5965, -3916, 8999, 7355, -12731, -5850, 10338, 2929, -10041, -9446, 12999, 12208, -20039, -5702, 24306, 1836, -18002, 271, 15571, -1278, -17372, 4854, 10669, -8977, -3800, 1638, 2464, 8350, -5405, -7812, 9048, 7420, -4367, -12779, 3057, 16066, -12624, -15947, 16425, 9711, -15325, -9456]
630i456K7420m439l6523J6484L1081k8198j1830J8614Q33k867o651J455J1331
643G254l758m761n447P794J6548k4866j2748L2420r8k3813j938J9739J2891l1733
657a2516o351M1822r627l4239J3085K4251o521k8083Q499K7715j8799j2004J6257
670C489l40K431o553r547J9124K815j8194l338J0475J5861j9337k0600L2688R143
684A8117l0578n85K4255O500l1911n185M4145j2944l8438K3598J7828j5110p862
697h170L493J1731m964n287N365m807J0219j648k4740K0786J8348k9632r010K2819
711D503J3871k2001j9116L4641Q618l6716O438K5140p203j9934q52K5146l676
724H859k4406J2531R004l822J637j1832O967J5693j7227r176J4016R906j3301
$$ y = [-9456, 17964, 13525, -22998, -6514, 24567, -3631, -15461, 3153, 3986, 1119, -5532, -4077, 7254, 3496, -1265, -6712, 1082, 17630, -7236, -19984, 12436, 12338, -11475, -13413, 6326, 19217, -12516, -18867, 22955, 13328, -20911, -7826, 16425, 9904, -18179, -9680, 18035, -764, -12768, 3489, 3149, 5580, -973, -10520, 8604, 11419, -6775, -10113, 362, 16223, -3114, -23714, 8974, 18117, -12461, -13046, 11209, 17709, -14202, -19387, 24758, 11814, -26624, -3026, 14802, -308, -8170, -4677, 7054, 2090, -3197, 2168, -2639, 7580, 5932, -18808, 1978, 20326, -9306, -18316, 4503, 18374, -3627, -22743, 11898, 20516, -16200, -9762, 15378, 8175, -11759, -12611, 12535, 8859, -15547, -3016, 5988, 2166, 3803, -8029, -1062, 14631, -2596, -11772, 2244, 12150, -1151]
737a151j9776K4086J8462l1777n411K4717M086j5881j2788K3237J1196l4361P62
750a4599L0174q030k0266J668K0832R36k1353P002J1580o613N29o482K238J4108
764A1724j5542j0205J9111N700j4182j1460J8407J5517k6119o410K5263k739j7881
777h816N99J6600J58k3075Q448J9864j5089n740R328r63K028j617m742K297L453
792B733l69j0116M390J4683j5024q677J9809K39j1608J75N727N026q500m532R715
807C671j017p168P43M373M283p142j911P487q48k97k026m744Q364O45j0717L496
823b808O566l763n208L760Q252m845q341O127O703k745q363q1J0884m531j0388
838h781R485M546q658L2O195J448m154k276J213L064K418p503m410J1610L37j2155
$$ y = [-1151, -20927, 3159, 21621, -10156, -15567, 9150, 13236, -2645, -15433, 7804, 19000, -15361, -14599, 15575, 7545, -12721, -11053, 9779, 10715, -10638, -3636, 7944, 1331, 1860, -4622, -2384, 11724, -3818, -14023, 5088, 10788, -3394, -14854, 3553, 19070, -7049, -13459, 11804, 9065, -8816, -8217, 8383, 8541, -14534, -6086, 13778, -1311, -7051, 2277, 1314, 3342, 1725, -3017, -720, 2733, 2364, -7752, -3362, 11321, -3703, -12380, 7429, 7668, -3940, -3765, 1962, 6988, -1512, -6044, 3671, 2654, -4514, -3771, 602, 4885, -2257, -4168, 3319, 2471, 2174, 148, -4596, 3768, 4413, -6304, -2808, 3758, -5, -5213, -1453, 6799, 1954, -6387, -260, 6443, 3698, -4665, -4746, 6138, 1607, -8781, 704, 5250, -3408, -3376, 2819, 4267, 113, -2163, -950, 2114, 4532, -2971, -7381, 4229, 4566, -7589]
854g589N203R279n541p081N674P764o389p334N398N416l917o682L529O814m867
869c23m015O016J621k619j972K23N334j963o742J438N851p07p324K940Q129o904
885a017l613Q084k59l529j022K94M234k466m308J831L099r3l873J008O565n509
901e74j876N483k119r73l33k236M562j724l548L265K71J092r78j846M425j900
917I91k787L265j446P14p97m092O533n74n547M718J11p22Q86k722L194r5m143
934b513K937j478J334N99o027P150J221p728N408J089k181J180l147L674R0n766
950d158M549O16k343J985l723N161J397p745O505O15n036L043k692K660J004p129
966e291N960K083n866L748q11J828Q85o087N965L5o916O293k103j262K805n106
$$ y = [-7589, -2386, 6893, 1352, -5729, -55, 7709, 1320, -6014, -616, 4800, 883, -5799, -2270, 4544, -323, -4338, 1678, 3299, 680, -1292, -1069, 4265, 2302, -4440, -3002, 2849, 2142, -5182, -2242, 5887, -1017, -4630, 3454, 3195, -334, -1356, -1062, 3172, 706, -3602, -1771, 1328, 1235, -2638, -1630, 4935, -574, -2450, 3033, 914, -59, -392, -2628, 1934, 210, -3338, -73, 198, 1290, 312, -1534, 2891, 991, -1796, 1469, 23, 737, -60, -4152, 2381, 1807, -3740, 978, 1089, 367, 1253, -1469, 1725, 1630, -2513, 424, -1054, 280, 879, -5148, 2002, 3223, -4505, 903, 1992, -189, 991, -2156, 1518, 1608, -4158, 391, 1007, -1336, 649, -3074, 2087, 3484, -4261, 2244, 2859, -2177, 866, -1826, 834, 1838, -5291, 669, 2752, -3114, 634, -177, 1651, 2536, -3551, 2414, 2449, -4467, 1826, -277, -1539, 1266, -3840]
982c840N368K062p131N250j17k120K709m846L949M45p037O405J98m291M361l177
998a812K800K586p059N502M62n092L857k567O97K057o053N664J489n839N381j897
1014A76n6L186o139M299R82o947N879j613k242M091m445L336K790n865M742p89
1030A385k872M190m671J848K088o821N309K41l628N387l186Q20L423n676M217
1045B054j82n026N323l005r69L778n300L629J514m105M865k506k03L745n890L013
1061G35J891o237M282q63k080L666l691K355K715n008M476p06l153M035l809O45
1077g47K141m749L120P83k920M096k874Q33L803n357K946J062m132K768j511l41
1093a079K152m096K576J984l201L679k078l42M011n091Q31L267m501J152j79J13
$$ y = [-3840, 1528, 3590, -3541, 1709, 1592, -528, 2181, -2665, 1284, 1729, -5308, 1097, 1295, -2996, 1365, -1812, 988, 3574, -3485, 2017, 2479, -2613, 1244, -1323, -626, 1431, -4622, 1042, 2531, -3308, 2073, 176, 120, 3306, -2833, 1466, 2448, -4499, 1380, -233, -2475, 1616, -2829, 507, 3297, -2568, 2174, 1385, -1487, 2703, -1968, -120, 1968, -4853, 456, 697, -2931, 2456, -730, 90, 3513, -2163, 2054, 1872, -3154, 2169, -836, -1805, 1973, -3327, 302, 1816, -2289, 2576, 70, -133, 3612, -2278, 735, 2626, -3611, 671, -192, -2272, 1394, -2297, 58, 2773, -2235, 2241, 1535, -1618, 2417, -1392, -747, 1394, -3355, -235, 548, -2372, 1724, -1150, -317, 3486, -1871, 1075, 2137, -1995, 773, -738, -1079, 1073, -3023, -447, 1537, -1664, 2015, -63, -405, 3606, -1485, -654, 2613, -1888, -736, -915, -802]
1109h02K168l968K335L097l924J800M10j678K747l356k71L050l020M26L40N5L050
1126B459l863j25N651l486j306J087J93L71l225R35L566l972q3K188o05K080k530
1143f65o77M427j978k625J001J736n93l603J780L799l466o99K399N20K20k064
1159d88oK057j024j641j36J057J603l729k40N557j022m398J705M386j865m732
1175b916K976K818m845n91L579p68q05J09L12Q87Q40j038k674K745L087o183p70
1192c237N576j184m352J128M797p88n338K786M723l629k340J232K007j82m079
1207b880J814K465k015J08l64J679K348m744k50M630q05l488j039K715K137m626
1223b315j81M573m67k736j224M498K706q629L1R264m613n287L481L006j539l899
$$ y = [-802, 1366, -2602, -267, 2830, -1094, 706, 1116, -562, 2185, -1171, -1442, 1608, -1412, -986, -646, -591, 2459, -1404, -1529, 4122, 636, -670, 417, 610, 981, -2244, -1309, 2257, -1715, -1798, 390, -215, 1865, -665, -1342, 3085, 1107, -1518, -517, 1219, 626, -2977, -1197, 2602, -864, -1563, 836, 1356, 1576, -488, -494, 1563, 539, -1102, -1238, -181, 1422, -2307, -2547, 3010, 1988, -2410, -705, 3681, 1816, -2916, 60, 2878, -1967, -2558, 1021, 253, -552, -443, -131, 756, 1596, 558, -2116, 629, 3716, -2467, -3237, 2339, 1155, -3197, -2069, 2728, 1940, -3398, -612, 4111, 482, -1858, -626, 1381, 1199, -2880, -1066, 1399, -616, -508, -872, 807, 3155, -1589, -1839, 2791, 1986, -1502, -2541, 174, 2311, -2315, -2496, 2077, 1610, -1126, -2350, 2148, 4854, -3775, -3744, 5520, 907, -4380, -899, 2107, 568, -3331]
1239c331L987K756n321K382R59l096M702k919m668N326J985l738l363M228O281
1254F170r354k499J2472m242q041M993M833k670p093M177O386q108J024M827m793
1269a918L055J478n205L309J568k270k717J099P098p034n980J2199j225p903L882
1284e64K638O12m109j470P689l799n444M974k14P00j596l239O899j256m195M384
1300B010k160R66R60n406M965J209n302J371j91M926q33r094Q030M622r032J008
1316a951M224L92m654l302R958k066r875Q324K081m911L072j248j69Q45m15J441
1332A746n410L779M527j1379M833R851j0714k955Q896J668n564m397Q941M79j0684
1347f383O588M052p422K118N14N26K057l239J697j00o20M513o760r35Q409o690
$$ y = [-3331, 656, 3412, -1909, 473, 1432, -1664, 3038, 119, -4549, 777, 2762, -976, -4339, -111, 6170, -3184, -5683, 6789, 2547, -5494, -501, 4332, 1662, -5431, -1254, 5132, -2976, -1952, 2875, -1918, 1137, 2615, -2590, 719, 2287, 17, -2700, -1601, 5497, -1537, -7517, 4682, 3457, -4446, -564, 2074, 2686, -1423, -2893, 4796, 997, -4447, 527, 313, 1013, -583, -3822, 3077, 1821, -2374, 2010, -150, 816, 1776, -3630, 1335, 2544, -2758, -1387, -1578, 3348, 2515, -6579, 1451, 6073, -2959, -1951, 2273, 2665, -1989, -5291, 4667, 2601, -7274, 1050, 3131, -1780, 1292, 44, -125, 720, 305, 1746, -3664, 115, 4642, -6737, -1904, 7947, -2767, -5722, 3174, 4842, -722, -5119, 3822, 4301, -6383, 205, 4257, -3165, -1047, -533, -7, 2050, -1189, 508, 408, -212, 4301, -2459, -3394, 5015, -1675]
1363a675k719N812J58k188l596M966M847q432R67M616l416J989k469r46N269n408
1379b225q52O043k418j486m98K206L378n714Q24K767m572L904m66m923N719l96
1395A291m534L683K257j074m878J422Q443p024n128Q124j257l729J273J740J022
1410A631m080J760M646n669J744K604o031L850L245o348j49M190O99m928P53P818
1426E735n441n655R491q83o187K936N17n05n24j72J122j513J141J017k719L732
1442B092m4n539L635K749l328j573N94K599r37k269L447q60j494J934o17N80L39
1459A308l049N18K411m00j833j627M282j98l926L736J666m999J813K887j842k326
1475a579J336O90j862J643J211m117K261L643m351j94L964j741l417K538K502
$$ y = [-1675, -4394, 1418, 1576, -612, -4208, 758, 5605, -2827, -1860, 2756, -660, 1329, -1140, -2086, 3183, -2225, -3077, 2966, 548, -938, -1436, 770, 4148, -1566, -742, 2025, -2547, 1357, 891, -4032, 1687, 1291, -3243, 440, 2697, 1623, -3255, -1833, 6610, -414, -5542, 2582, 1325, -2404, -1131, 609, 1631, -2449, -689, 3957, -1712, 32, 2636, -3395, 455, 3700, -2648, -2797, 1393, 2092, -2836, -2083, 5735, 294, -5361, 4130, 3247, -2940, -4, 513, 8, -516, -688, 434, -1079, 62, 1079, -1640, 2092, 2048, -3491, 144, 2893, -435, -2008, -1414, 1185, 248, -2021, 1426, 566, -928, 1006, 389, 969, 1308, -1741, -1223, 1188, 788, -1045, -2672, 1610, 1412, -2514, 1222, 2888, -2111, -298, 2589, 747, -1579, -243, 447, -1415, 228, 1439, -2678, -417, 3226, -1125, -1319, 2645, 904, -2513, 25, 2527]
1490B527l606j849M321j109k124L116o65j658J629Q84j505l60J574j123k249K794
1506E97J203m147P35L533j013j981J849R84k847K92L270k891j633L082j209j363
1522a539K678l51k539J283L474k741k518M712j458m344M379L27l359J130J263
1537C97l57q55J125P63k240J517J700l948J810J740l246N12J499l71p54o01K877
1554A568n12k538L292r00k805K724k48j588J058j45J55j414J710J531m241K955
1570F02K705n175J736K264l627M33J401J51j591o24L856k489j516N108l501j583
1586a850M666k832j012J177n83L11j377J875J480m356L030K253m897K857O96k875
1602a437J433k35P35r30j839M464k680j885N354l553r40L702k131j64K33q76J507
$$ y = [2527, -1079, -2928, 1393, 284, -1840, 1276, 611, -1047, 582, 1466, -39, -399, 1175, 52, -2197, 597, 1800, -2347, -1612, 1921, 908, -1073, 776, 1760, -1087, -795, 2475, -416, -2049, 1033, -176, -1539, 1139, 788, -1751, -468, 3006, 265, -2253, 2459, 1001, -3343, 1036, 1363, -1996, -866, 397, 40, -815, 310, 1073, -1167, 350, 2050, -1898, -88, 1652, -1594, -1082, 417, 46, -708, -1309, 1568, 1056, -1482, 1810, 910, -1895, 829, 581, -1007, 51, -94, 61, -1353, 357, 1888, -2353, 602, 3307, -1868, -132, 2132, -1495, -1062, 339, 490, -1101, -1725, 2131, -358, -1874, 3234, -267, -1850, 2816, -16, -1028, 149, -434, -123, -1500, 375, 1855, -2501, 529, 2782, -2115, 742, 1438, -1437, -4, -239, 496, -434, -2273, 2191, -489, -2374, 2980, -573, -1513, 2189, 58, -106, 127, -749, 758]
1619G58l117K926J496n304L985J309m459L870J90k620J523r10J147j192j279L544
1635A867l047p74M997m257M85K994k987J236j89r27J266k597K500Q18m420L680
1651F45M42l346M061q43j614J585j615J919j646j037L013l142j29M281m264J025
1667f65K545k480J273l51q6J089l132K581M95m172M218q10k992L990j279r50J453
1684G27j114J614j815l67L112m179J128L364m292J196J607j659J332n76M03Q07
1700A288l007L226o81l312L423r43k214L471j378J59M57q84K008k163K83K610
1716B343l748N28K225k992J536L94j126J502q59O42Q14k416K308q93j632K379
1732A005j821q57K590j676N07L57n44J724j715O08J479l053J628K77k019J788
$$ y = [758, -2359, 567, 2063, -3241, 744, 2053, -2406, 1464, 1654, -966, 557, -353, 794, -398, -1677, 1867, -1180, -1954, 3043, -1214, -729, 2265, -722, 514, 325, -602, 664, -1933, 567, 1385, -3035, 645, 1087, -2259, 1802, 959, -655, 930, -685, 1234, -412, -1449, 1564, -1578, -1707, 2574, -1690, -665, 1880, -600, 673, 322, 236, 1325, -1807, 774, 1269, -2903, 1315, 505, -2487, 1503, 224, -726, 727, -387, 1227, -588, -955, 2157, -2022, -894, 2470, -1822, -626, 981, -678, 654, 78, 481, 1288, -1719, 1507, 826, -2486, 937, -6, -2220, 1251, -127, 32, 489, -395, 1613, -550, -267, 2343, -1405, -877, 1348, -1644, -108, 286, -840, 662, -197, 445, 1259, -1157, 1151, 258, -1374, 1005, -816, -1673, 917, -759, -252, 105, -439, 1285, -430, 178, 1657, -1396, 232, 509, -1510, 278]
1748B78l47j042J279l37L70J24p14J883j600q31K372j962q21J688n40M5o53K94
1766e14J715j713P29J022j975J028L29j617J201L7j068L59r4J196p00n75K083
1783A443j228o11R64n39j16k08n19J240o31l67O45n37Q41K05j096J301l53o05
1801a71L57m70M26o83m42J260n17r8M87j94O42r4q84O38j5o9p55P0R89j185m50
1822a158J581j35j82M41o9J78q03k71O19n99l25L76k84J012o40j92R57m54M65
1841E17j80l92R85q49j252J452m80j73m6K75J261j657K09J190n24m72P09q50O48
1860C71j001j7J230q74J61M28p97J510m68j194J270j96q9m14j058J653p48j736
1878a969K718m21j291J015r5J126r47j165K105j086j000J759j657P78L54j393
$$ y = [278, -69, -1111, 168, -169, 201, 325, -389, 1494, -106, -937, 1435, -527, -1348, 340, -200, -155, -808, -514, 1201, -512, 217, 1239, -736, 292, 621, -996, 205, 242, -826, -467, -561, 635, -65, -640, 1443, 215, -396, 568, 29, -87, -295, -814, 426, -205, -572, 73, -464, 377, 582, -514, 787, 434, -171, 186, -284, 142, -541, -983, 277, -240, -338, 149, -45, 597, 503, -381, 257, 242, 173, -582, -512, 477, -708, -1158, 423, 288, 106, 547, 478, 656, -147, -418, 201, -398, -723, -347, -631, 381, -259, -451, 506, 52, 517, 337, -55, 930, 81, -1171, 281, -199, -372, -418, -143, 1118, -539, -330, 860, 336, -136, 573, -277, 371, -630, -647, 583, -291, -130, 298, -499, 1011, 543, -651, 619, 423, 334, -80, -1138, 515, -233, -1969, 749, 328, -963, 52, -43, 1083, 136, -1029, 1076, -10, -1010, 749, -908, -130, 224, -1169]
1894a169K206o86p14J455j798J084O86k361J151P16r23P7q91J823O6k904L518
1911A336M29k834J614j22k02J03j541J531k11j694K624j297m77K097j913R99k5
1928D17q03J188k094Q36K144l542Q75K614k793O42R93O38l28k438K472Q72l865
1945b172K488k3j804K088j063P71M83j791J810m31p61J920k079m67K471j962P1
1962d51l26L06K328l048R00K858l927P06K166j639J68o64k28J848k124J016P79
1979F68j895K266n68p24J555j685J70R31k107K318r45k572L552j65j886J361q2
1996A92Q06j519o2L048l279p26K962k276J54Q78q58R05n05N7J937k764J006R95
2014I51k026J844k02j567O27j12J723j018k312L610p47k107K812q68j540J115
$$ y = [-1169, 1037, 351, -363, 1092, -706, 378, 1064, -1297, -146, 570, -353, -276, -1167, 656, 722, -2182, 1336, 1765, -1069, 545, 423, 221, 324, -1217, 314, 103, -1591, 1033, -264, -741, 1356, -557, 442, 417, -386, 802, -1292, -456, 1688, -1854, -979, 1635, -1158, -516, 477, 1115, 787, -1651, 821, 1693, -2172, 316, 293, -1511, 577, -486, 285, 768, -1023, 787, 356, -405, 1515, -564, -1031, 1440, -522, -451, -777, -471, 1857, -1191, -291, 2567, -1360, -654, 1512, -127, 41, -623, -851, 997, -1127, -111, 668, -1227, 1039, 471, -253, 1302, -383, -213, 718, -1389, 929, -16, -2588, 964, 799, -1087, 274, 192, 998, -521, -583, 2465, -814, -1540, 1422, -854, -700, 178, -680, 225, -280, -223, 1714, -1050, -44, 951, -1075, 769, 567, -1000, -373, -485, 1238, 220, -2092, 1518, 771, -1336, 1476, 608, -932, 183]
2030A83j89J61q74k28J567j284P60J573k933J634O98j604J185o35n19P24j082
2047h63J272L26k113J387K35j28O39j220Q95K59j851J660k21j153Q50m61J98J290
2065A001j491O74K55r62J634r48o54K61n37R58j44n29J028j784Q56K148k262J7
2083d79J508r07l59N06L2n18j273K088N4j944J638r0q55J597m31j189L28L55M61
2102E22j117L36Q94j857P57J517q42l71J04M98j11p13N12P2j161J167J31r81M40
2121b03N95l24j84R07l17j074P95J120j781L82L19r76L81N83R8n21J04N60j29
2140C35K11K44j316K28P76q22n7O17o97L15P0P73j74p19L38J14l90Q22o46q81
2160h59J053m31J41m62N80L04r52J292O30j976K0J609j016m83L44J03m67L81J191
$$ y = [183, -6, 155, -719, -947, 620, -664, 96, 1669, -1264, 370, 1068, -536, 649, 14, -505, 219, -863, 409, 735, -1378, 9, 244, 116, 755, -465, 430, 689, -1162, 498, 277, -876, -26, -487, -289, 1001, -490, 184, 439, -523, 1111, 163, -491, -230, -767, 191, 47, -482, 546, -1238, -382, 1766, -496, -479, 1029, 122, -237, 269, 301, -217, -1490, 598, 652, -1292, 346, 256, -599, 998, 567, -622, -294, 61, 522, -595, -259, 635, -1222, -465, 1052, 210, -161, -57, 441, 330, -383, 129, 201, -960, 207, 338, -643, -203, 392, 68, -116, 791, 474, -600, 195, 1315, -466, -84, 235, -741, -360, 223, 321, -200, -96, 464, 335, 546, 790, -526, -298, 478, -344, -401, 216, -481, -166, -96, 677, 503, -216, 122, 236, -154, 668, 22, -859, 194, -237, -96, -558, 22, 326, -626, 666, 1296, -680, -660, 949, -67, -550, -206, -103, -570, -189, 1002]
2179A002j180n52J691p90n84J804j184r95M02N70k15j017J022N42j401J272O09
2196I96j532N85K61n80O03p86N40m42n53J984q93q55J652j272K36P93o23j30k79
2215b95K08P28j390N72O03j253J297K77j185Q63p7l33M91o04N05r38m67J777j571
2234g92K12J283j213P26O57r38L34k8j47K96j413J253j5j756K499q6j700J604
2252G76p12L6O23r01P23r09l56J666j727O6J931k023P03R71j085P56j109O91K47
2271C67j641J756J76k311K136l0j466J605o48L39L09p72J088j253l14J971k188
2288h76O25R72j925J224O04p59M12o84O02L85j378J328n21j360K086r92o53J287
2306C77r20O24K67p02J661j741RJ854k367P63R30j811J187P0m71J028j574Q65
$$ y = [1002, -178, -730, 961, 171, -413, 1391, 207, -788, -386, 184, -31, -1048, -26, 516, -885, 387, 996, -536, 49, 310, -270, 333, -453, 87, -355, -908, 1076, 183, -672, 980, -292, -56, 737, 114, -16, -295, -87, 641, -749, -177, 426, -827, 470, 747, -438, 425, 348, 15, 506, -98, 407, -531, -998, 779, -792, -580, 703, -510, 216, 873, -65, 269, 241, 94, 390, -1023, 230, 215, -1541, 958, 872, -828, 776, 64, 100, 723, -178, 545, -364, -720, 946, -781, -715, 1216, -807, -104, 867, -218, 538, -571, 120, 367, -1274, 482, 658, -1653, 483, 453, -1013, 592, -56, 283, 592, -180, 908, -345, -659, 1312, -876, -251, 721, -1204, 20, 624, -135, 277, -407, 195, 580, -798, 530, 9, -1351, 735, -257, -910, 377, -543, 81, 348, -354, 1307, -434, -425, 1429, -938, -175, 755, -1056, 131, 201, -270, 758, -816, 49]
2324D9O53j565J600l99j349J797j177k94J130q76O92m09r7J230j497M42J272k196
2342i94J035M26j706J377l25J14M16r04J057l25r04J787q93r37J570j372J2R96
2360D30j178Q25o03M44J080j603Q65J91j335J130N16j856J435l35m39M28p26J380
2378F49o07n78J552j083m09J295j129K84K93o48M90n91M98N49j396Q99N89j364
2396g07J167J28m74l19k81M20r4p01J194n2o47Q29p06K68O09j002P21m31r1J39
2416c0l90N27K4o35O13j41m48J037k16m22J95m5rm03K61K77n40K02N82o41K92
2437I0N50n86J11l28N40m60n54R23k09o13O27L0l22L62J06l56J21K86j49k19K97
2458B47j76p04O18J89k48k17K03N92m48J63L34n00m06P91o72LL76m65j46N63L0
$$ y = [49, 702, -863, 737, 338, -1011, 786, -391, -685, 445, -431, 261, -148, -245, 985, -512, -70, 1202, -994, 41, 467, -1239, 138, -187, -73, 343, -561, 496, 171, -733, 1054, 161, -776, 794, -578, -566, 430, -748, 77, -526, -82, 998, -605, 260, 451, -884, 246, 762, -1094, 341, 6, -433, -5, -731, 649, 42, -536, 1016, -67, -476, 819, -310, -26, 267, -381, 109, -482, 16, 565, -831, 68, 657, -707, 460, 588, 114, -205, -486, -66, -160, -861, 333, 281, -366, 463, -243, 25, 634, -368, 353, -78, -169, -30, -420, 107, 131, -504, 109, -32, -480, 557, 341, -81, 114, 69, 60, -343, -82, 195, -345, -143, 439, -202, 90, 640, 54, 165, -163, 377, -83, -637, 286, 77, -536, 91, 121, -201, 161, 267, -89, 32, 318, 169, -50, 247, 71, -633, -15, 174, -74, -291, -88, 504, 56, 219, 553, 53, -353, 438, -234, -231, 145, -320, -466, 97, 127]
$$ [...]
8191a03
##END NTUPLES=NMR FID
##END=
