##TITLE=1H_Pr N-1
 200.13MHz, CDCl3,
 8 sc
 
 29.5.2025
##JCAMPDX= 6.0         $$ Bruker NMR JCAMP-DX V2.0
##DATA TYPE= NMR FID
##DATA CLASS= NTUPLES
##ORIGIN= UXNMR, Bruker Analytische Messtechnik GmbH
##OWNER= pz
$$ XWIN-NMR		Version 3.5
$$ Thu May 29 16:14:12 2025 Russian Standard Time (UT+4h)  she@DPX200
##.OBSERVE FREQUENCY= 200.1313
##.OBSERVE NUCLEUS= ^1H
##.DELAY= (6, 6)
##.ACQUISITION MODE= SIMULTANEOUS
##.ACQUISITION SCHEME= undefined
##.AVERAGES= 8
##.DIGITISER RES= 18
##SPECTROMETER/DATA SYSTEM= spect
##.PULSE SEQUENCE= zg30
##.SOLVENT NAME= CDCl3
##.SHIFT REFERENCE= (INTERNAL, CDCl3, 0, 14.3821)
##AUDIT TRAIL= $$ (NUMBER, WHEN, WHO, WHERE, WHAT)
$$ ##TITLE= Audit trail, XWIN-NMR		Version 3.5
$$ ##JCAMPDX= 5.01
$$ ##ORIGIN= Bruker BioSpin GmbH
$$ ##OWNER= she
$$ F:/spectra/data/she/nmr/H-C/1/audita.txt
$$ ##AUDIT TRAIL=  $$ (NUMBER, WHEN, WHO, WHERE, WHAT)
(   1,<2025-05-29 16:13:03.04 +0400>,<she>,<DPX200>,
      <created by zg, POWCHK disabled, PULCHK disabled
       configuration hash MD5:
       00 E9 B6 7A A2 85 ED C7 34 08 36 98 17 FE 4E 26
       data hash MD5: 16K
       30 87 BE A4 B8 08 00 BA 51 6C 97 B4 C0 45 A5 99>)
$$ ##END=
$$ 
$$ hash MD5
$$ D8 F7 50 8A 96 0C EF 40 54 20 22 BD 3D 34 D0 BA
##$RELAX= 
##$RELAX= 
##$RELAX= 
##$RELAX= 
##$RELAX= 
##$RELAX= 
$$ Bruker specific parameters
$$ --------------------------
##$DU= <F:/spectra>
##$EXPNO= 1
##$NAME= <H-C>
##$PROCNO= 1
##$TYPE= <nmr>
##$USER= <she>
##$AMP= (0..31)
100 100 100 100 100 100 100 100 100 100 100 100 100 100 100 100 100 100 
100 100 100 100 100 100 100 100 100 100 100 100 100 100 
##$AQSEQ= 0
##$AQ_mod= 1
##$AUNM= <au_zg>
##$AUTOPOS= <>
##$BF1= 200.13
##$BF2= 200.13
##$BF3= 200.13
##$BF4= 200.13
##$BF5= 200.13
##$BF6= 200.13
##$BF7= 200.13
##$BF8= 200.13
##$BYTORDA= 1
##$CFDGTYP= 0
##$CFRGTYP= 5
##$CHEMSTR= <none>
##$CNST= (0..31)
1 1 145 1 1 1 1 1 1 1 1 1 1 1 1 1 1 1 1 1 1 1 1 1 1 1 1 1 1 1 1 1 
##$CPDPRG= <>
##$CPDPRG1= <>
##$CPDPRG2= <>
##$CPDPRG3= <>
##$CPDPRG4= <mlev>
##$CPDPRG5= <mlev>
##$CPDPRG6= <mlev>
##$CPDPRG7= <mlev>
##$CPDPRG8= <mlev>
##$CPDPRGB= <>
##$CPDPRGT= <>
##$D= (0..31)
0 0.7 0 0 0 0 0 0 0 0 0 0.03 0 0 0 0 0 0 0 0 0 0 0 0 0 0 0 0 0 0 0 0 
##$DATE= 1748520782
##$DBL= (0..7)
120 120 120 120 120 120 120 120 
##$DBP= (0..7)
150 150 150 150 150 150 150 150 
##$DBP07= 0
##$DBPNAM0= <>
##$DBPNAM1= <>
##$DBPNAM2= <>
##$DBPNAM3= <>
##$DBPNAM4= <>
##$DBPNAM5= <>
##$DBPNAM6= <>
##$DBPNAM7= <>
##$DBPOAL= (0..7)
0.5 0.5 0.5 0.5 0.5 0.5 0.5 0.5 
##$DBPOFFS= (0..7)
0 0 0 0 0 0 0 0 
##$DE= 6
##$DECBNUC= <off>
##$DECIM= 32
##$DECNUC= <off>
##$DECSTAT= 4
##$DIGMOD= 1
##$DIGTYP= 9
##$DL= (0..7)
0 120 120 120 120 120 120 120 
##$DP= (0..7)
150 150 150 150 150 150 150 150 
##$DP07= 0
##$DPNAME0= <>
##$DPNAME1= <>
##$DPNAME2= <>
##$DPNAME3= <>
##$DPNAME4= <>
##$DPNAME5= <>
##$DPNAME6= <>
##$DPNAME7= <>
##$DPOAL= (0..7)
0.5 0.5 0.5 0.5 0.5 0.5 0.5 0.5 
##$DPOFFS= (0..7)
0 0 0 0 0 0 0 0 
##$DQDMODE= 0
##$DR= 18
##$DS= 0
##$DSLIST= <SSSSSSSSSSSSSSS>
$$ [...]
##$SUBNAM0= <"">
##$SUBNAM1= <"">
##$SUBNAM2= <"">
##$SUBNAM3= <"">
##$SUBNAM4= <"">
##$SUBNAM5= <"">
##$SUBNAM6= <"">
##$SUBNAM7= <"">
##$SUBNAM8= <"">
##$SUBNAM9= <"">
##$SW= 18.0517328524113
##$SWIBOX= (0..15)
0 0 2 0 0 0 0 0 0 0 0 0 0 0 0 0 
##$SW_h= 3612.71676300578
##$TD= 16384
##$TD0= 1
##$TE= 0
##$TE2= 300
##$TE3= 300
##$TEG= 300
##$TL= (0..7)
0 120 120 120 120 120 120 120 
##$TP= (0..7)
150 150 150 150 150 150 150 150 
##$TP07= 0
##$TPNAME0= <>
##$TPNAME1= <>
##$TPNAME2= <>
##$TPNAME3= <>
##$TPNAME4= <>
##$TPNAME5= <>
##$TPNAME6= <>
##$TPNAME7= <>
##$TPOAL= (0..7)
0.5 0.5 0.5 0.5 0.5 0.5 0.5 0.5 
##$TPOFFS= (0..7)
0 0 0 0 0 0 0 0 
##$TUNHIN= 0
##$TUNHOUT= 0
##$TUNXOUT= 0
##$USERA1= <user>
##$USERA2= <user>
##$USERA3= <user>
##$USERA4= <user>
##$USERA5= <user>
##$V9= 5
##$VALIST= <valist>
##$VCLIST= <CCCCCCCCCCCCCCC>
##$VD= 0
##$VDLIST= <DDDDDDDDDDDDDDD>
##$VPLIST= <PPPPPPPPPPPPPPP>
##$VTLIST= <TTTTTTTTTTTTTTT>
##$WBST= 1024
##$WBSW= 4
##$XGAIN= (0..3)
0 0 0 0 
##$XL= 0
##$YL= 0
##$YMAX_a= 336296
##$YMIN_a= -383421
##$ZGOPTNS= <>
##$ZL1= 120
##$ZL2= 120
##$ZL3= 120
##$ZL4= 120
##$ABSF1= 10
##$ABSF2= 0
##$ABSG= 5
##$ABSL= 3
##$ALPHA= 0
##$AQORDER= 0
##$ASSFAC= 0
##$ASSFACI= 0
##$ASSFACX= 0
##$ASSWID= 0
##$AUNMP= <proc_1d>
##$AZFE= 0.1
##$AZFW= 0.1
##$BCFW= 1
##$BC_mod= 2
##$BYTORDP= 1
##$COROFFS= 0
##$CY= -3
##$DATMOD= 1
##$DC= 2
##$DFILT= <>
##$DTYPP= 0
##$F1P= 0
##$F2P= 0
##$FCOR= 0.5
##$FTSIZE= 0
##$FT_mod= 4
##$GAMMA= 1
##$GB= 0.15
##$INTBC= 1
##$INTSCL= 1
##$ISEN= 128
##$LB= 0.25
##$LEV0= 0
##$LPBIN= 0
##$MAXI= 10000
##$MC2= 0
##$MEAN= 0
##$ME_mod= 0
##$MI= 1.114404
##$NCOEF= 0
##$NC_proc= 0
##$NLEV= 6
##$NOISF1= 3.799351
##$NOISF2= 2.8
##$NSP= 1
##$NTH_PI= 0
##$NZP= 0
##$OFFSET= 14.38212
##$PC= 1
##$PHC0= -1557.55
##$PHC1= 15.1922
##$PH_mod= 1
##$PKNL= yes
##$PPARMOD= 0
##$PSCAL= 0
##$PSIGN= 0
##$REVERSE= no
##$SF= 200.129724274929
##$SI= 16384
##$SIGF1= 3
##$SIGF2= 2
##$SINO= 400
##$SIOLD= 16384
##$SREGLST= <1H.CDCl3>
##$SSB= 0
##$STSI= 0
##$STSR= 0
##$SW_p= 3205.1282051282
##$SYMM= 0
##$S_DEV= 0
##$TDeff= 0
##$TDoff= 0
##$TI= <>
##$TILT= no
##$TM1= 0
##$TM2= 0
##$TOPLEV= 0
##$USERP1= <user>
##$USERP2= <user>
##$USERP3= <user>
##$USERP4= <user>
##$USERP5= <user>
##$WDW= 1
##$XDIM= 8192
##$YMAX_p= 0
##$YMIN_p= 0
$$ End of Bruker specific parameters
$$ ---------------------------------
##NTUPLES= NMR FID
##VAR_NAME=  TIME,          FID/REAL,        FID/IMAG
##SYMBOL=    X,             R,               I
##VAR_TYPE=  INDEPENDENT,   DEPENDENT,       DEPENDENT
##VAR_FORM=  AFFN,          ASDF,            ASDF
##VAR_DIM=   8192,          8192,            8192
##UNITS=     SECONDS,       ARBITRARY UNITS, ARBITRARY UNITS
##FACTOR=    0.0002768,     1,               1
##FIRST=     0,             0,               0
##LAST=      2.2672688,     0,               0
##MIN=       0,             -383421,         0
##MAX=       2.2672688,     336296,          0
$$ Real data points
##PAGE= N=1
##DATA TABLE= (X++(R..R)), XYDATA
$$ plain form
0 0 0 0 0 0 0 0 0 0 0 0 0 0 0 0 8 -8 8 -8 8 -8 16 -16 16 -24 24 -32 33 -40 45 -52 60 -68 76 -85 95 -108 120
37 120 -134 150 -167 185 -203 226 -249 275 -306 335 -369 409 -449 493 -545 601 -665 735 -818
56 -818 912 -1020 1150 -1306 1497 -1736 2049 -2477 3090 -4043 5685 -9076 18804 -104349 -383421
71 -383421 -24546 249912 56163 -131323 -29503 80023 26917 -28347 366 -25000 -47454
82 -47454 29152 98402 40243 -103302 -121341 73898 136236 -59429 -139395 -340 80290
93 80290 23951 -29309 -5477 -1883 -29077 27789 58168 -46541 -71553 44780 86187 -2888
105 -2888 -67527 -19494 23736 -8501 6628 30453 -41212 -56041 26685 42944 -13116 -53910
117 -53910 -20758 63223 55813 -36944 -51891 18374 42434 -16374 -27706 36964 4410 -62456
$$ packed form
0@%%%%%%%%%%%%%%Qj6J6j6J6j6K4l2L2m0M8n6O5p3Q5r7J12j28J44j61J80k03K28
37A20k54K84l17L52l88M29m75N24n81O41p04P78q58R42j038J146j266J400j553
56h18J730j932K170k456K803l233L785m526N567p133R728j4761K7880j23153k79072
71c83421L58875K74458j93749j87486J01820J09526n3106n5264K8713k5366k2454
82d7454P6606O9250n8159j43545j8039J95239O2338j95665p9966J39055Q0630
93H0290n6339n3260K3832L594k7194N6866L0379j04709k5012J16333M1407q9075
105b888o4639M8033M3230l2237J5129K3825p1665j4829Q2726J6259n6060m0794
117e3910L3152Q3981p410r2757j4947P0265K4060n8808j1332O4670l2554o6866
$$ plain form
129 -62456 20015 67202 -40383 -71943 21954 57019 -9394 -51900 -1016 31887 -7550 -15098
141 -15098 10438 11816 1736 -5757 17560 33539 -26765 -46759 27676 42730 -19842 -40109
153 -40109 3359 29608 -13860 -32440 14855 10663 -22578 8047 28217 -1875 -18395 -324
165 -324 21558 3393 -14850 11088 11769 -8773 8022 9953 -11668 -16874 -14131 9151 22175
178 22175 -13012 -23166 7535 13390 -8504 -16672 13195 23935 -14019 -2580 36241 -5005
190 -5005 -37080 7214 30311 3676 -23227 -12720 15689 8232 -5801 -1591 -12820 -10217 10695
203 10695 8357 1731 -11378 -17506 18909 28063 -15817 -25762 9791 33451 12023 -25634 -13233
216 -13233 10520 -66 5851 7482 -19916 -12218 16991 13856 -13028 -28108 2660 30623 1819
$$ packed form
129f2456Q2471M7187j07585l1560R3897L5065o6413m2506N0884L2903l9437p548
141a5098K5536J378j0080p493K3317J5979o0304j9994P4435J5054o2572k0267
153d0109M3468K6249m3468j8580M7295m192l3241L0625K0170l0092j6520J8071
165c24K1882j8165j8243K5938O81k0542J6795J931k1621n206K743K3282J3024
178B2175l5187j0154L0701N855k1894q168K9867J0740l7954J1439L8821m1246
190e005l2075M4294K3097k6635k6903J0507K8409p457j4033M210j1229K603K0912
203A0695k338o626j3109o128L6415R154m3880r945L5553K3660k1428l7657J2401
216a3233K3753j0586N917J631k7398P698K9209l135k6884j5080L0768K7963k8804
$$ plain form
229 1819 -18910 -5569 5220 14523 4581 -10391 4029 6866 -2047 8384 2939 -11287 -6784
242 -6784 3217 8507 -9327 -21056 8546 12805 -12549 -3932 6824 -600 1123 2611 8033 6274
256 6274 -7512 1953 9178 -4356 -2614 1503 826 4617 -8106 -8011 7462 -5406 -11847 3700
270 3700 2919 -2865 -4892 405 12065 -805 -7491 12146 7111 -4848 3314 2750 1201 -691 -7443
285 -7443 1846 880 -10159 116 2716 -4597 -3147 -5527 1151 5922 -8670 -2173 11205 164
299 164 -301 4127 1484 4230 -435 488 6299 -7122 -5933 5886 -3943 -6856 -3136 -5297 2801
314 2801 -946 -8038 3545 2936 -1943 4691 1385 1929 3713 -1702 5850 3400 -9019 2041 5701
329 5701 -4793 -2991 -3464 -1916 2005 -7011 -4297 1898 -3405 1990 2594 -3881 4453 3926 981 6930
$$ packed form
229A819k0729J3341J0789R303r942j4972J4420K837q913J0431n445j4226M503
242f784J0001N290j7834j1729K9602M259k5354Q617J0756p424J723J488N422j759
256F274j3786R465P225j3534J742M117o77L791j2723R5J5473j2868o441J5547
270C700p81n784k027N297J1660j2870o686J9637n035j1959Q162n64j549j892o752
285g443R289r66j1039J0275K600p313J450k380O678M771j4592O497J3378j1041
299A64m65M428k643K746m665R23N811j3421J189J1819r829k913L720k161Q098
314B801l747p092J1583o09m879O634l306N44J784n415P552k450j2419J1060L660
329E701j0494J802m73J548L921r016K714O195n303N395O04o475Q334n27k945N949
$$ plain form
345 6930 -645 -1890 7153 -86 -3922 -1245 -2563 3095 -1855 -7607 2734 -531 -5398 3628 -411
360 -411 -3273 2222 -65 3479 3308 -3123 4814 5582 -46 3188 -1850 -1335 6857 -1794 -4297 823
376 823 -4476 -1098 1998 -4175 -2108 -1628 1027 6002 -3318 -2709 7082 998 1726 5182 -2651 1665
392 1665 6270 540 703 -2214 -3525 2222 -1049 -386 63 -7808 -1210 3579 -3180 608 -478 -4209
408 -4209 6928 7830 -1352 -1981 -42 6930 7265 -4463 -3111 946 -74 5148 -2668 -10483 -1113
423 -1113 1802 1086 1290 -7198 -3687 5491 2353 649 -3094 -3420 9528 7638 -2367 -494 -1710
438 -1710 -613 3474 -477 -401 -3052 -6637 3289 2753 -7240 -5260 -4627 3011 13166 -1644 -12596
453 -12596 254 9307 7045 -3833 -6949 5822 7906 1881 -1027 -8822 -3465 6251 -3562 -4503
$$ packed form
345F930p575j245R043p239l836K677j318N658m950n752J0341l265m867R026m039
360d11k862N495k287L544j71o431P937P68n628L234n038N15Q192q651k503N120
376H23n299L378L096o173K067M80K655M975r320O09R791o084P28L456p833M316
392A665M605n730J63k917j311N747l271O63M49p871O598M789o759L788j086l731
408d209J1137R02r182o29J939O972L35j1728J352M057j020N222p816p815R370
423a113K915p16K04q488L511R178l138j704l743l26J2948j890j0005J873j216
438a710J097M087l951P6k651l585R926n36r993J980O33P638J0155j4810j0952
453a2596J2850R053k262j0878l116J2771K084o025k908p795N357R716r813r41
$$ plain form
467 -4503 2949 -4818 -4302 3432 1782 -4170 -8032 860 12186 4138 -1845 237 -1435 4736 3909
482 3909 -7052 -610 5028 -874 1712 304 -6649 -8057 -5094 6514 6772 -9538 -5979 7830
496 7830 6588 928 -9029 -7702 9692 10932 1741 -1007 -1995 3026 76 -8708 -134 2728 -5525
511 -5525 2562 6674 -3943 -8741 -8276 1303 9266 3154 -2238 -3536 1182 12679 1368 -13929
525 -13929 -257 8693 4421 4629 -3092 -8511 -1623 3187 1932 -7367 -9510 5974 9055 -393 -4967
540 -4967 -10594 -1007 14522 3133 -7468 2179 6236 3337 -545 -672 709 -7075 -3199 12368
554 12368 3446 -10962 -5943 -253 3762 1327 -9411 -4507 7237 9669 2980 -10015 -5759 9114
568 9114 3576 421 6155 -2487 -4162 5348 2805 -4962 -8844 -2936 7304 3810 -3223 -6038 -7554
$$ packed form
467d503P452p767N16P734j650n952l862Q892J1326q048n983K082j672O171q27
482C909j0961O442N638n902K586j408o953j408K963J1608K58j6310L559J3809
496G830j242n660r957J327J7394J240r191k748r88N021k950q784Q574K862q253
511e525Q087M112j0617m798M65R579P963o112n392j298M718J1497j1311j5297
525a3929J3672Q950m272K08p721n419O888M810j255r299k143J5484L081r448m574
540d967n627R587J5529j1389j0601R647M057k899l882j27J381p784L876J5567
554A2368q922j4408N019N690M015k435j0738M904J1744K432o689j2995M256J4873
568I114n538l155N734q642j675R510k543p767l882N908J0240l494p033k815j516
$$ plain form
583 -7554 5472 9093 -8966 -6071 9727 6677 1177 -508 -2605 -945 343 4394 5277 -3466 -3492
598 -3492 -645 -1793 4602 -2104 -14826 -501 12806 2610 -7736 -5451 5750 6467 -5316 -2987
612 -2987 4504 3141 6573 3552 -5659 -2610 -398 -1489 3081 1674 -1967 -3409 -3406 2222 -1549 -7593
628 -7593 3189 4811 -2209 3711 2556 -5229 7 5365 2973 -1228 -748 4154 -35 -2713 2808
643 2808 -4576 -8182 5020 3307 -4859 -407 -494 -2393 1214 1117 -1100 -1824 3775 7926 -1739 -2714
659 -2714 4644 -2975 -3414 7095 1442 -5798 -339 2744 -615 -6687 -5419 2471 384 1260 4798
674 4798 -3591 -3542 3975 428 -1211 2336 2317 3667 2609 -334 -2845 -6196 1581 6271 -4820 -3589
690 -3589 4108 -3100 -4410 1166 -1353 -2896 878 5015 1999 -4044 2166 5136 -3320 671 4462
$$ packed form
583g554J3026L621j8059K895J5798l050n500j685k097J660J288M051Q83q743k6
598c492K847j148O395o706j2722J4325J3307j0196j0346K285J1201P17j1783K329
612b987P491j363L432l021r211L049K212j091M570j407l641j442LN628l771o044
628g593J0782J622p020N920j155p785N236N358k392m201M80M902m189k678N521
643B808p384l606J3202j713q166M452q7j899L607r7k217p24N599M151r665r75
659b714P358p619m39J0509n653p240N459L083l359o072J268P890k087Q76L538
674D798q389M9P517l547j639L547j9J350j058k943k511l351P777M690j1091J231
690c589P697p208j310N576k519j543L774M137l016o043O210K970q456L991L791
$$ plain form
705 4462 -3733 453 5459 -1499 -2941 -279 -1251 -3201 -3080 2098 163 -4294 3914 3031 -6404 143
721 143 4335 -1684 1228 4810 2385 374 -1191 921 -1018 -3399 3249 1598 -4385 1698 241
736 241 -6916 -1490 1526 -394 666 758 1938 -270 -1118 4270 200 -3364 5861 2977 -3991 1505
752 1505 1485 -2534 -1282 -1050 -559 -1501 -1184 2136 -2767 -3336 4579 -438 -3699 4205 2209 -960 2486
769 2486 1502 50 -70 668 2277 -2201 -1746 3537 -2371 -3654 2702 -2446 -3437 1906 -88 -1306
785 -1306 82 873 1951 -1118 232 4149 -984 776 5266 -2329 -2104 3499 -689 -2075 -281 -827
801 -827 -288 -2674 -1164 752 -3231 394 3763 -2758 -86 4009 -1072 397 3140 635 744 230
817 230 1220 1303 -3100 228 1834 -4150 -813 834 -3797 -636 1193 -1994 -482 80 850 1885 -961
$$ packed form
705D462q195M186N006o958j442K662r72j950J21N178j935m457Q208q83r435O547
721A43M192o019K912L582k425k011j565K112j939k381O648j651n983O083j457
736B41p157N426L016j920J060R2J180k208q48N388m070l564R225k884o968N496
752A505k0m019J252K32M91r42L17L320m903n69P915n017l261P904j996l169L446
769B486r84j452j20P38J609m478M55N283n908j283O356n148r91N343j994j218
785a306J388P91J078l069J350L917n133J760M490p595K25N603m188j386J794n46
801h27N39k386J510J916l983L625L369o521K672M095n081J469K743k505J09n14
817B30R90Q3m403L328J606n984L337J647m631L161J829l187J512N62P70J035k846
$$ plain form
834 -961 1999 1931 -1558 3129 2362 -3389 948 1944 -1726 -440 -1396 -1310 -255 -2026 189 -520 -3384
851 -3384 2024 1483 -2926 1775 1365 -274 2890 836 -43 1721 222 778 -6 -1662 1386 -1336
867 -1336 -3096 2261 -1076 -4045 -62 -171 89 985 -1244 719 1428 313 2879 -140 -1212 3844
883 3844 1217 -877 720 -2040 73 1873 -2621 -2194 -757 -1145 559 -1576 -1071 2076 -1652 -614
899 -614 3562 -95 -452 1642 1155 2901 466 -2347 1050 208 -424 1029 -2392 -1551 233 -1972 200
916 200 -902 -3535 1393 2720 -94 -241 -1336 1779 4174 -1181 -502 2074 -82 1524 1013 -2505
932 -2505 -183 -1106 -1680 485 -1280 -1299 58 -1888 854 1310 -2951 54 1581 1794 3915 -808 -2695
949 -2695 3267 2292 -798 -1186 -1289 2115 939 -2780 -884 -2103 -2823 1513 173 -965 509 -1527
$$ packed form
834i61K960o8l489M687p67n751M337R96l670J286r56Q6J055j771K215p09k864
851c384N408n41m409M701m10j639L164k054q79J764j499N56p84j656L048k722
867a336j760N357l337k969L983j09K60Q96k229J963P09j115K566l019j072N056
883C844k627k094J597k760K113J800m494M27J437l88J704k135N05L147l728J038
899f14M176l657l57K094m87J746k435k813L397q42o32J453l421Q41J784k205K172
916B00j102k633M928J327k814j47j095L115K395n355O79K576k156J606n11l518
932b505K322r23n74K165j765j9J357j946K742M56m261L005J527K13K121m723j887
949b695N962r75l090l88j03L404j176l719J896j219p20M336j340j138J474k036
$$ plain form
965 -1527 2452 3486 -3260 -1689 2990 2839 2327 -943 -132 2436 -2018 -2166 1125 -1214 -723 -376 -1262
982 -1262 1900 -1568 -5739 881 3439 976 -28 -1707 2343 4479 -812 -1206 24 523 3845 231
998 231 -2748 717 -590 -2078 -332 -2101 -449 620 -1725 1618 1844 -3360 -1178 1420 2024 2623
1014 2623 -1424 295 4071 47 -1258 -502 -1627 890 -332 -1062 2522 -2817 -5772 1430 1775 -2214
1030 -2214 -1522 752 4188 1533 -3074 100 1171 913 3165 -706 -723 2864 -1370 -2030 1013 -2541
1046 -2541 -2808 838 1212 800 -2532 -2202 1120 -1687 -107 3292 -907 700 4369 -18 -1407 -448
1062 -448 -298 2899 886 -968 345 -2602 -1053 1342 -2559 -1935 176 -775 2327 1238 -3096 143
1078 143 1927 909 -189 -1001 3741 4097 -3137 35 2556 -3488 -2528 1827 1760 126 -2896 -1486
$$ packed form
965a527L979J034o746J571M679j51n12l270Q11K568m454j48L291k339M91L47q86
982a262L162l468m171O620K558k463j004j679M050K136n291l94J230M99L322l614
998B31k979L465j307j488J746j769J652J069k345L343K26n204K182K598O04N99
1014B623m047J719L776m024j305P56j125K517j222p30L584n339k955P202L45l989
1030b214O92K274L436k655m607L174J071k58K252l871j7L587m234o60L043l554
1046b541k67L646L74m12l332L30L322k807J580L399m199J607L669m387j389R59
1062d48J50L197k013j854J313k947J549K395l901O24K111r51L102j089m334L239
1078A43J784j018j098q12M742L56p234L172K521o044R60M355o7j634l022J410
$$ plain form
1094 -1486 575 -2018 -1086 30 -862 3873 2462 -3059 636 1859 -1173 1094 1808 527 557 225
1110 225 1317 -2214 -4790 1123 431 -2839 2747 1625 -3985 -1472 388 248 613 370 2896 2061
1126 2061 -559 1289 -1043 -2067 2694 37 -1843 2547 432 -2956 -915 -1059 -2364 -2826 904
1141 904 4263 -1382 -2358 3727 -220 -3092 2349 1883 -254 1630 2055 1338 -1602 -1764 725 -2175
1157 -2175 -1345 1834 -1461 -287 2579 -2957 -3331 838 -659 -916 2274 4282 1687 -3046 602 2897
1173 2897 -3135 -875 4508 295 -788 1039 -1384 -2582 -1759 -651 222 -1261 1372 2230 -2556 -299
1189 -299 1769 -2141 1088 3586 -671 558 2982 360 -2040 -1125 1866 -737 -4221 2373 2721 -4644
1205 -4644 -1592 1653 -1964 -1125 1241 1008 315 0 1666 470 -1469 2458 953 -1554 2967 1093
$$ packed form
1094a486K061k593R32J116q92M735j411n521L695J223l032K267P14j281L0l32
1110B25J092l531k576N913o92l270N586j122n610K513J860j40L65k43K526q35
1126B061k620J848k332j024M761k657j880M390k115l388K041j44j305m62L730
1141I04L359n645r76O085l947k872N441m66k137J884M25p17k940j62K489k900
1157b175Q30L179l295J174K866n536l74M169j497k57L190K008k595m733L648K295
1173B897o032K260N383m213j083J827k423j198Q23J108Q73j483K633Q58m786K257
1189b99K068l910L229K498m257J229K424k622k400R15K991k603l484O594L48p365
1205d644L052L245l617Q39K366k33o93l15J666j196j939L927j505k507M521j874
$$ plain form
1221 1093 -3191 847 561 -3461 -1047 1309 440 -2173 -1076 2521 -1860 -3761 3412 2253 -2085
1236 -2085 2067 2136 -866 142 147 801 127 -359 1317 -1275 -1555 1768 -2136 -3011 2186 -701 -2460
1253 -2460 2079 1377 -1310 -303 1550 1530 -1860 631 4553 -1377 -1838 3298 -503 -2532 974 -294
1269 -294 -1335 -442 -58 -41 -1920 -729 761 -2006 635 3186 -1727 127 3465 -973 -1381 2300
1285 2300 1705 -648 -1140 1552 889 -3781 -17 2415 -3049 -1162 1737 -1726 -1182 814 -250 272
1301 272 474 1033 1011 -864 1860 1485 -1972 1645 2051 -2624 228 1819 -2228 -1591 490 366 -1487
1318 -1487 -2040 1455 371 -2933 1747 2142 -2015 1267 2163 -638 919 1322 217 -70 -212 997
1334 997 -980 -2098 1496 -417 -2854 1462 -129 -2868 743 1293 -832 49 1210 1547 -599 -612
$$ packed form
1221A093m284M038k86m022K414K356q69k613J097L597m381j901P173j159m338
1236b085M152O9l002J008NO54o74m86J676k592k80L323l904q75N197k887j759
1253b460M539p02k687J007J853k0l390K491L922n930m61N136l801k029L506j268
1269b94j041Q93L84J7j879J191J490k767K641K551m913J854L338m438m08L681
1285B300n95k353m92K692o63m670L764K432n464J887K899l463N44J996j064N22
1301B72K02N59k2j875K724l75l457L617M06m675K852J591m047O37K081j24j853
1318a487n53L495j084l304M680L95m157L282Q96k801J557M03j105k87j42J209
1334I97j977j118L594j913k437M316j591k739L611N50k125Q81J161L37k146j3
$$ plain form
1350 -612 2894 85 -1302 2600 -14 -2345 964 -121 -1524 -211 -105 -285 -1093 -560 1260 -1350
1366 -1350 -799 2432 -179 -700 2519 256 -708 1409 815 -80 -483 267 1137 -1730 -1237 1330 -2041
1383 -2041 -1173 1530 -1318 -1415 1027 108 -456 427 875 1021 -626 1042 1757 -1362 452 2020 -1419
1400 -1419 -410 949 -1481 -1337 31 -248 -581 -1540 134 779 -1793 514 1152 -1130 1293 2189 -1088
1417 -1088 132 1337 477 172 -539 282 491 -1792 202 377 -2133 147 259 -1843 613 278 -734
1434 -734 468 711 793 13 -743 1758 1112 -997 1134 167 -1436 824 -33 -1226 -137 -393 -318 -342
1452 -342 -1241 129 -484 -756 1988 -58 -986 1825 764 -216 708 -194 792 995 -695 325 -73 -1030
1470 -1030 85 -1426 -841 1231 -1195 -1328 866 269 -164 -812 -525 1966 853 -503 1360 433 103
$$ packed form
1350f12L506k809j387L902k614k331L309j085j403J313J06j80q08N33J820k610
1366a350N51L231k611n21L219k263r64K117n94q95m03P50Q70k867M93K567l371
1383b041Q68K703k848r7K442r19n64Q83M48J46j647J668P15l119J814J568l439
1400a419J009J359k430J44J368k79l33r59J674O45k572K307O38k282K423Q96l277
1417a088J220J205q60l05p11Q21K09k283J994J75k510K280J12k102K456l35j012
1434g34J202K43Q2p80p56K501o46k109K131r67j603K260q57j193J089k56P5k4
1452c42q99J370o13k72K744k046r28K811j061r80R24r02R86K03j690J020l98r57
1470a030J115j511N85K072k426j33K194n97m33o48K87K491j113j356J863r27l30
$$ plain form
1487 103 772 -1496 -566 1236 -501 -357 -608 -969 -136 -1609 -718 1420 -583 -484 1535 -13 320 807
1505 807 -729 1284 1390 -651 613 304 -340 48 -1502 -478 197 -1559 -240 665 -761 -205 -959
1522 -959 -1103 1762 353 -748 1736 915 501 122 -708 801 1034 -318 289 -545 -712 433 -1758
1539 -1758 -1237 975 -1180 -845 1285 -355 20 242 -858 449 482 1134 1963 -42 3 1209 -1424
1556 -1424 -1156 155 -424 1074 215 -1657 -328 -1010 -1080 397 -769 640 1929 -75 372 808 -751
1573 -751 292 222 -127 1354 617 498 -56 -2243 -621 40 -2512 131 2099 -813 -829 103 -326 -44
1591 -44 -595 553 1656 177 1337 1228 -893 89 -470 -1615 1136 886 -1072 155 97 -1099 -1728
1608 -1728 -1515 701 504 -573 1577 715 -811 646 -136 -527 1647 650 481 828 -14 58 -1083 -1484
$$ packed form
1487A03O69k268R30J802j737J44k51l61Q33j473Q91K138k003R9K019j548L33M87
1505H07j536K013J06k041J264l09o44L88j550J024O75j756J319R05j426N56p54
1522i59j44K865j409j101K484q21m14l79q30J509K33j352O07q34j67J145k191
1539a758N21K212k155L35K130j640L75K22j100J307L3O52Q29k005M5J206k633
1556a424K68J311n79J498q59j872J329o82p0J477j166J409J289k004M47M36j559
1573g51J043p0l49J481p37j19n54k187J622O61k552K643J968k912j6R32m29K82
1591d4n51J148J103j479J160j09k121R82n59j145K751k50j958J227n8j196o29
1608a728K13K216j97j077K150q62j526J457p82l91K174r97j69L47q42P2j141m01
$$ plain form
1626 -1484 412 -134 -728 847 -558 -1285 -151 -1150 -988 832 1194 1403 -64 -292 1400 -452 -1046
1643 -1046 1502 252 -276 900 -472 -988 -766 -998 -289 -367 5 1090 -629 -294 731 -1009 -379
1660 -379 1433 -22 610 2045 268 -567 -363 117 -73 -1138 421 1161 -1559 -727 386 -1314 -633
1677 -633 527 -404 367 826 368 523 -138 750 363 -639 1350 1448 -1031 185 364 -1597 -368 -73
1695 -73 -516 -310 -309 289 -173 -1580 652 372 -1165 1148 1404 -366 488 660 -430 294 258 400 -16
1714 -16 -315 578 -1012 -1497 610 -535 -1776 962 564 -894 223 779 430 -194 107 1600 117
1731 117 -359 1540 -430 -1087 1169 -309 -1162 193 -374 -743 -399 -466 -112 -685 36 1282 -588 43
1749 43 2029 -456 -754 1589 269 -506 573 690 397 -930 -408 377 -1766 -779 1173 -1137 -529
$$ packed form
1626a484J896n46n94J575j405p27J134r99J62J820L62K09j467k28J692j852n94
1643a046K548j250n28J176j372n16K22k32P09p8L72J085j719L35J025j740O30
1660c79J812j455O32J435j777q35K04M80j90j065J559P40k720Q32J113j700O81
1677f33J160r31P71M59m58J55o61Q88l87j002J989R8k479J216J79j961J229K95
1695g3m43K06JN98m62j407K232k80j537K313K56j770Q54J72j090P24l6J42m16
1714a6k99Q93j590m85K107j145j241K738l98j458J117N56l49o24L01J493j483
1731A17m76J899j970o57K256j478q53J355n67l69L44o7L54n73P21J246j870O31
1749D3J986k485k98K343j320p75J079J17k93j327N22P85k143R87J952k310O08
$$ plain form
1766 -529 1163 -738 -426 657 64 152 540 1194 776 -868 414 954 -1883 175 1570 -768 -520
1783 -520 497 -985 -1237 -686 203 243 -773 1041 880 -1276 461 1181 -782 781 1280 -387 334
1800 334 769 -417 -585 -170 603 -650 -1786 1201 67 -2078 514 829 -1260 48 602 200 209 410
1818 410 1031 -224 -574 1573 95 -1294 1543 33 -1384 231 -44 -1241 -310 202 63 -653 -437
1835 -437 1268 -574 -535 2016 291 -1113 1761 639 -780 228 634 -116 -382 -38 835 -1016 -1131
1852 -1131 746 -1117 -715 1329 -728 -854 1088 441 -554 331 964 779 -470 363 1382 -956 -107
1869 -107 1382 -1151 -873 744 -417 -989 -407 -43 29 -888 371 810 -796 430 1435 -674 38
1886 38 1363 -364 -377 416 287 -494 -524 469 -37 -1646 502 279 -1928 280 1149 -1157 -422 964
$$ packed form
1766e29J692j901L12J083n93Q8L88O54m18j644J282N40k837K058J395k338K48
1783e20J017j482k52N51Q89M0j016J814j61k156J737P20j963J563M99j667P21
1800C34M35j186j68M15P73j253j136K987j134k145K592L15k089J308N54m02RK01
1818D10O21j255l50K147j478j389K837j510j417J615k75j197R31N12j39p16K16
1835d37J705j842L9K551j725j404K874j122j419J008M06p50k66L44Q73j851j15
1852a131J877j863M02K044k057j26J942o47r95Q85O33j85j249Q33J019k338Q49
1869a07J489k533K78J617j161n72N82L64P2r17J259M39j606J226J005k109P12
1886C8J325j727j3P93j29p81l0R93n06j609K148k23k207K208Q69k306P35J386
$$ plain form
1904 964 125 -222 446 1107 46 -298 1192 -61 -1353 1067 483 -1671 198 127 -1223 -430 108 -64
1922 -64 -517 -212 724 -286 -637 1595 460 -1004 1468 848 -511 471 319 295 -288 -411 139 -851 -837
1941 -837 951 -569 -1229 920 140 -753 398 194 68 413 745 770 -688 206 1283 -844 -832 1562
1959 1562 -281 -1031 562 -411 -595 -95 -195 -69 -407 324 587 -915 273 1405 -791 -463 1648
1976 1648 99 -387 824 234 -269 -461 -63 335 -997 -80 614 -886 -16 95 -1367 -102 1108
1993 1108 -313 -143 484 930 399 -608 526 935 -820 362 688 -853 161 -66 -1100 -401 -40
2010 -40 -142 -188 -443 825 423 -1380 507 753 -508 790 818 -455 725 399 -343 -351 -44 488 -621
2029 -621 -944 640 -536 -1507 549 -81 -1184 368 543 128 698 -45 193 256 -395 568 204 98 1236
$$ packed form
1904I64q39l47O68O61j061l44J490j253j292K420n84k154J869p1j350P93N38j72
1922f4m53L05R36j010l51K232j135j464K472o20j359R82j52k4n83j23N50r90J4
1941h37J788j520o60K149p80q93J151k04j26L45L32K5j458Q94J077k127J2K394
1959A562j843p50J593r73j84N00j00J26l38P31K63j502J188J132k196L28K111
1976A648j549m86J211n90n03j92L98L98j332R17O94j500Q70J11j462J265J210
1993A108j421J70O27M46n31j007J134M09j755J182L26j541J014k27j034O99L61
2010d0j02m6k55J268m02j803J887K46j261J298K8j273J180l26p42qL07N32j109
2029f21l23J584j176r71K056o30j103J552J75m15N70p43K38O3o51R63l64j06J138
$$ plain form
2048 1236 -472 -1143 329 -358 -1110 50 169 345 -394 -656 435 -556 -414 1010 119 -119 1285 325
2066 325 -165 85 -380 22 364 -128 376 -449 -494 137 -1505 -709 688 -648 -160 1025 -181 -72 158
2085 158 102 511 89 653 872 -420 35 762 -865 -684 229 -613 87 -161 -529 315 -723 -658 340 -229
2105 -229 490 997 -278 486 198 -701 269 293 -228 151 -303 354 288 -1400 -280 140 -826 -128 323 -149
2125 -149 162 -347 -376 654 -93 447 836 187 518 100 -732 119 20 -455 329 14 -457 25 -724 -442
2145 -442 -241 -411 624 394 -452 828 388 -624 343 229 177 497 -62 513 466 -1060 -181 133 -518
2164 -518 159 144 -203 144 -743 -348 315 -432 161 528 63 1019 423 -782 529 19 -387 377 85 267
2184 267 76 -742 -196 -551 -877 727 145 -473 479 169 -214 87 -49 324 579 48 748 360 -275 179
$$ packed form
2048A236j708o71J472o87p52J160J19J76p39k62J091r91J42J424q91k38J404r60
2066C25m90K50m65M02L42m92N04q25m5O31j642P96J397j336M88J185j206J09K30
2085A58n6M09m22N64K19j292M55P27j627J81R13q42P00k48l68Q44j038O5R98n69
2105b29P19N07j275P64k88q99R70K4n21L79m54O57o6j688J120M20r66O98M51m72
2125a49L11n09k9J030p47N40L89o49L31m18q32Q51r9m75P84l15m71M82p49K82
2145d42K01j70J035k30q46J280m40j012R67j14n2L20n59N75m7j526Q79L14o51
2164e18O77j5l47L47q87L95O63p47N93L67m65R56n96j205J311n10m06P64k92J82
2184B67j91q18N46l55l26J604n82o18R52l10l83L01j36L73K55n31P00l88o35M54
$$ plain form
2204 179 -655 -641 435 -569 -121 375 -432 -596 -235 -464 266 -115 284 1121 73 -412 769 -89 -208
2223 -208 484 227 72 283 -172 86 -809 -996 108 -467 -120 591 -818 -520 435 -703 -170 606 212
2242 212 252 84 623 800 -822 108 732 -668 -9 553 -756 -406 -102 -572 -389 -397 -16 360 -227 450
2262 450 519 -590 237 604 -536 603 1061 -240 62 318 134 -382 -1060 284 91 -1061 447 188
2280 188 -1114 4 438 -295 443 366 271 299 -127 422 201 -434 656 18 -694 372 156 -1055 -140
2299 -140 -145 -490 -325 -106 517 -267 -302 859 -20 -576 1047 297 -467 548 519 -219 35 -115 35 -314
2319 -314 -292 200 -628 -691 579 -628 -528 638 198 -363 375 362 60 -124 160 567 -595 -133 949
2338 949 -752 -539 718 -360 -800 199 -218 -281 -172 87 315 -464 -70 623 -542 229 851 -355 272
$$ packed form
2204A79q34J4J076j004M48M96q07j64L61k29P30l81L99Q37j048m85J181q58j19
2223b08O92k57j55K11m55K58q95j87J104n75L47P11j409K98R55j138N33P76l94
2242B12M0j68N39J77j622R30O24j400O59N62j309L50L04m70J83qL81L76n87O77
2262D50O9j109Q27L67j140J139M58j301L02K56j84n16o78J344j93j152J508k59
2280A88j302J118M34p33P38p7r5K8m26N49k21o35J090o38p12J066k16j211R15
2299a40nl45J65K19O23p84l5J161q79n56J623p50p64J015k9p38K54j50J50l49
2319c14K2M92q28o3J270j207J00J166m40n61P38j3l02j84K84M07j162M62J082
2338I49j701K13J257j078m40R99m17o3J09K59K28p79L94O93j165P71O22j206O27
$$ plain form
2357 272 754 -101 -278 158 123 -208 -547 115 278 -925 -22 517 -717 55 585 -369 195 525 -25 64
2377 64 121 333 102 -279 616 338 -1031 205 411 -832 -6 278 -475 -559 -153 315 -145 -102 925 110
2397 110 -1054 935 592 -378 370 617 -513 12 107 -249 -504 -209 356 -485 -617 681 -628 -944 827
2416 827 -66 -487 299 350 -69 106 262 679 -88 25 683 -338 -541 773 -428 -678 14 -66 -586 -214
2436 -214 52 316 -237 -145 697 -471 -43 707 -161 -256 738 -34 -422 -399 102 216 -555 204 159 -696 -134
2457 -134 684 -773 -486 720 -389 -171 403 191 12 -21 452 232 -287 741 512 -734 335 589
2475 589 -867 -240 225 -335 -167 -97 81 -74 -31 517 -132 -720 705 686 -442 532 394 -390 -188 125
2495 125 -92 38 -301 226 -179 -831 392 -29 -875 278 93 -165 272 334 60 115 33 611 171 -271
$$ packed form
2357B72M82q55j77M36l5l31l39O62J63j203R03N39j234P72N30r54N64L30n50Q9
2377F4N7K12k31l81Q95k78j369J236K06j243Q26K84p53q4M06M68m60M3J027q15
2397A10j164J989l43r70P48K47j130N25R5l56k55K95N65q41j32J298j309l16J771
2416H27q93m21P86N1m19J75J56M17p67J13O58j021k03J314j201k50O92q0n20L72
2436b14K66K64n53R2Q42j168M28P50q68r5R94p72l88K3N01J14p71P59m5q55N62
2457a34Q18j457K87J206j109K18N74k12j79l3M73k20n19J028k29j246J069K54
2475E89j456O27M65n60J68P0J78j55M3N48o49n88J425j9j128R74j38p84K02L13
2495A25k17J30l39N27m05o52J223m21q46J153j85k58M37O2k74N5q2N78m40m42
$$ plain form
2515 -271 797 -54 -612 416 186 -428 234 -68 -424 -35 117 -132 -431 -49 596 115 -224 936 365
2534 365 -224 690 98 -462 216 -10 -40 -237 24 146 -645 -676 119 -454 -310 655 -324 -368 250 -146 -294
2555 -294 -45 325 637 -112 215 593 -241 -284 272 -430 -274 440 -503 -333 -148 -215 -124 -279 137 785 -207
2576 -207 286 594 -152 124 528 -152 -19 341 -133 -109 -278 27 11 -775 9 401 -302 93 209 -520 112
2597 112 -1 173 112 370 303 294 -208 240 44 -321 289 173 -694 -101 -36 -323 -35 -339 -44 146 -22 496
2619 496 -59 -210 195 -210 -141 443 238 -53 386 -198 -158 -492 -411 106 134 -364 84 -269 -338 209 -162 -354
2641 -354 171 283 266 463 -27 439 14 -344 162 -36 140 371 -275 -155 77 -432 -369 94 -66 31 153
2662 153 -94 128 -183 48 372 -167 279 658 -19 308 -92 -373 -141 -343 140 198 -229 -259 -192 -569 -158
$$ packed form
2515b71J068q51n58J028k30o14O62l02l56L89J52k49k99L82O45m81l39J160n71
2534C65n89R14n92n60O78k26l0j97K61J22p91l1P95n73J44R65r79m4O18l96j48
2555b94K49L70L12p49L27L78q34m3N56p02J56P14r43J70J85o7R1j55M16O48r92
2576b07M93L08p46K76M04o80J33L60m74K4j69L05j6p86P84L92p03L95J16p29O32
2597A12j13J74o1K58o7rn02M48j96l65O10j16q67N93O5k87K88l04K95J90j68N18
2619D96n55j51M05m05O9N84k05k91M39n84M0l34Q1N17K8m98M48l53o9N47l71j92
2641c54N25J12j7J97m90M66m25l58N06j98J76K31o46J20K32n09O3M63j60R7J22
2662A53k47K22l11K31L24n39M46L79o77L27m00k81K32k02M83N8m27l0O7l77M11
$$ plain form
2683 -158 74 -195 563 343 52 329 139 -80 113 -239 194 371 -248 284 -79 -482 -99 -87 -223 209
2703 209 -52 -104 218 -303 -253 204 -25 248 390 247 390 204 -293 369 -87 -104 263 -202 59 48 -734
2724 -734 -169 -342 -341 286 25 161 404 -209 -63 451 -142 184 465 104 267 204 -385 -20 -225 -114 60
2745 60 -310 11 202 -584 -156 25 -337 78 271 7 183 49 132 6 -241 75 158 -258 300 242 -462
2766 -462 111 -2 -311 -66 -186 -68 207 -210 305 201 -246 326 74 11 434 114 3 404 67 -4 432
2787 432 -209 -65 -95 -277 136 -297 -397 396 -99 -283 490 89 -47 69 97 250 162 -250 439 -57 -374
2808 -374 480 -198 -266 99 -359 -121 147 -318 -83 -93 -99 300 -280 121 599 -227 30 541 -202 66 99 90
2830 90 217 -114 -3 -29 -418 -106 140 -432 -229 -34 -143 -91 220 -160 63 127 144 5 -93 286 58 -334
$$ packed form
2683a58K32k69P58k20k91K77j90k19J93l52M33J77o19N32l63m03L83J2j36M32
2703B09k61n2L22n21N0M57k29K73J42j43J43j86m97O62m56j7L67m65K61j1p82
2724g34N65j73JO27k61J36K43o13J46N14n93L26K81l61J63o3n89L65k05J11J74
2745F0l70L21J91p86M28J81l62M15J93k64J76j34Q3j26k47L16Q3m16N58n8p04
2766d62N73j13l09K45j20J18K75m17N15j04m47N72k52o3M23l20j11M01l37p1M36
2787D32o41J44l0j82M13m33j00P93m95j84P73m01j36J16K8J53q8m12O89m96l17
2808c74Q54o78o8L65m58K38K68m65K35j0oL99n80M01M78q26K57N11p43K68L3r
2830I0J27l31J11k6l89L12K46n72K03J95j09N2L11l80K23O4J7j39r8L79k28l92
$$ plain form
2852 -334 95 147 -717 -63 71 -347 -146 89 -318 82 -138 40 264 -223 291 198 -179 490 257 -325 362
2873 362 234 -120 24 -64 -204 -280 -299 28 -288 -522 334 208 -498 122 255 -210 227 -29 167 45 13
2894 13 324 -436 -249 466 -125 -423 34 -53 -227 117 -165 -320 -186 -74 300 -57 -101 562 -1 -340 632
2915 632 -106 -62 386 172 -126 -195 169 69 -189 -254 89 -541 -141 108 -321 -130 259 -46 114 238 121
2936 121 -31 -148 465 397 -309 203 252 -326 -406 360 -374 -161 210 -121 -531 -127 235 61 -118 285 381
2957 381 -131 287 359 -180 -5 302 -144 -58 104 -124 -269 -305 110 -88 -404 88 211 -478 214 320 -147
2978 -147 182 274 128 -297 31 348 21 -216 351 -136 -413 263 67 -487 66 252 -296 -89 -67 238 -233
2999 -233 -206 465 -74 -179 550 -157 -233 577 243 -310 71 -96 10 -171 -311 152 -241 -168 229 -112 -501
$$ packed form
2852c34M29N2q64O54J34m18K01K35m07M00k20J78K24m87N14r3l77O69k33n82O87
2873C62j28l54J44q8j40p6j9L27l16k34Q56j26p06O20J33m65M37k56J96j22l2
2894A3L11p60J87P15n91k98M57q7j74L44k82j55J34J12L74l57m4O63n63l39R72
2915F32p38M4M48k14k98o9L64j00k58o5L43o30M00K49m29J91L89l05J60J24j17
2936A21j52j17O13o8p06N12M9n78q0P66p34K13L71l31m10M04L62j74j79M03R6
2957C81n12M18P2n39J75L07m46Q6J62k28j45l6M15j98l16M92J23o89O92J06m67
2978a47L29R2j46m25L28L17l27k37N67m87k77O76j96n54N53J86n48K07K2L05m71
2999b33K7O71n39j05P29p07p6Q10l34n53L81j67J06j81j40M63l93P3L97l41l89
$$ plain form
3020 -501 345 92 -170 550 243 20 -79 114 267 -177 28 449 -477 -26 435 -288 -275 206 -179 -316 78
3041 78 -135 -5 -160 196 316 -430 58 332 -221 -10 442 -203 -18 77 -77 -279 -287 -19 -274 -445 141
3062 141 -81 -396 -116 87 -451 37 442 -186 17 96 92 -158 -287 207 -34 -278 382 213 -387 -45 -88
3083 -88 -435 -212 1 75 87 263 292 47 -400 442 225 -107 177 378 -140 200 -173 8 93 74 273 -46
3105 -46 -387 372 -325 -467 337 88 -109 402 175 110 -34 -96 65 -161 91 385 -291 -313 449 -315 -323 13
3127 13 -200 -181 -53 33 88 -212 52 197 -351 1 449 -148 -95 578 -254 -260 -48 83 35 -49 401 367 -402
3150 -402 -339 186 -324 -7 268 -279 -40 257 -12 71 -22 153 62 -240 379 286 -289 287 -166 -478 58 419
3172 419 -115 -14 8 -195 -422 -321 204 -136 -142 387 261 -227 5 199 -72 52 194 225 -101 -172 67 -174
$$ packed form
3020e01Q46k53k62P20l07k23r9J93J53m44K05M21r26M51M61p23J3M81l85j37L94
3041G8k13J30j55L56J20p46M88K74n53K11M52o45J85R5j54k02qK68k55j71N86
3062A41k22l15K80K03n38M88M05o28K03P9mk50j29M94k41k44O60j69o00L42m3
3083h8l47K23K13P4J2J76K9k45m47Q42k17l32K84K01n18L40l73J81Q5j9J99l19
3105d6l41P59o97j42Q04k49j97N11k27o5j44o2J61k26K52K94o76k2P62p64qL36
3127A3k13J9J28Q6N5l00K64J45n48L52M48n97N3O73q32oK12J31m8q4M50l4p69
3150d02O3N25n10L17K75n47K39K97k69Q3r3J75r1l02O19r3n75N76m53l12N36L61
3172D19n34J01K2k03k27J01N25l40oN29j26m88K32J94k71J24J42L1l26p1K39k41
$$ plain form
3194 -174 -396 258 100 -263 253 158 -303 149 162 216 278 242 273 133 101 153 -85 -473 253 -152 -255 255 103
3217 103 -148 -187 -190 -278 -216 -96 402 18 -147 167 188 -174 327 -68 -125 153 -92 189 -48 14 18 -118 -63 94
3241 94 -255 -415 24 -340 -290 95 52 -3 113 317 241 -222 -216 238 -119 -185 420 -333 -128 -15 -242 -12 71
3264 71 -47 232 92 55 136 -54 -92 293 -73 454 123 -106 32 38 -232 58 -50 18 24 -240 -5 104 -287
3287 -287 -51 149 -82 227 126 -181 381 119 -9 -23 162 432 115 -267 -40 162 -114 110 -133 -97 100
3308 100 10 -62 23 -225 183 121 -369 178 167 -27 23 7 -100 75 -268 -76 -105 -182 99 70 -64 189 -163
3331 -163 -102 79 -38 84 14 -2 169 131 21 193 158 39 19 69 -43 -70 5 -125 12 -272 -10 -59 -198
3354 -198 71 -183 212 95 -54 -41 347 -171 188 317 -115 -187 130 -9 151 -133 -173 81 -107 -124 -16
$$ packed form
3194a74k22O54j58l63N16r5m61M52J3N4O2l6L1j40l2N2k38l88P26m05j03N10j52
3217A03k51l9lq8O2J20M98l84j65L14K1l62N01l95n7K78k45K81k37O2Mj36N5J57
3241I4l49j60M39l64N0L85m3n5J16K04p6m63OM54l57o6O05p53K05J13k27K30Q3
3264G1j18K79j40l7Q1j90l8L85l66N27l31k29J38Ok70K90j08O8Ok64K35J09l91
3287b87K36K00k31L09j01l07N62k62j28j4J85K70l17l82K27K02k76K24k43L6J97
3308A00r0p2Q5k48M08o2m90N47j1j94N0j6j07J75l43J92k9p7K81k9j34K53l52
3331a63O1J81j17J22p0j6J71l8j10J72l5j19k0N0j12k7P5j30J37k84K62m9j39
3354a98K69k54L95j17j49J3L88n18L59J29m32p2L17j39J60k84m0K54j88j7J08
$$ plain form
3375 -16 -58 52 -94 -83 237 -170 -3 -30 117 108 343 95 73 235 -21 -274 -83 -61 -46 4 -190 103 -169
3398 -169 -2 -27 -154 -172 379 -2 -108 206 285 -42 -179 6 66 -170 -229 107 -175 -59 152 -86 -109 -61
3420 -61 -235 30 -297 -80 142 13 182 286 -132 296 125 -195 5 171 -36 39 -202 47 -209 -263 -21
3441 -21 69 -233 25 19 -168 -65 30 -66 43 8 15 92 1 -115 -2 -26 160 -71 -234 195 91 -168 89 -90
3465 -90 -84 -116 -169 74 182 5 183 122 16 268 -72 -231 205 -62 -275 83 -287 190 -51 -99 17 33 -185
3488 -185 147 -62 -49 138 64 48 216 263 -128 64 -77 18 -253 5 103 -116 -135 -116 -225 23 -45 -15 40 -13
3512 -13 -134 231 -77 -7 189 42 -55 227 -321 -6 153 -139 -88 -4 72 137 -218 5 73 -470 181 241 -239
3535 -239 127 174 -3 233 -52 208 -134 10 276 81 -278 9 19 -241 15 -163 -192 92 21 -16 16 -241
$$ packed form
3375a6m2J10j46J1L20m07J67k7J47rK35k48k2J62k56k53J91K2J5N0j94K93k72
3398a69J67k5j27j8N51l81j06L14P9l27j37J85O0k36n9L36k82J16K11k38k3M8
3420f1j74K65l27K17K22j29J69J04m18M28j71l20K00J66k07P5k41K49k56n4K42
3441b1R0l02K58oj87J03R5r6J09l5PP7r1j16J13k4J86k31j63M29j04k59K57j79
3465i0Ol2n3K43J08j77J78o1j06K52l40j59M36k67k13L58l70M77k41m8J16J6k18
3488a85L32k09J3J87p4j6J68M7l91J92j41R5k71K58R8k19j9J9j09K48o8L0N5n3
3512a3j21L65l08P0J96j47r7K82n48L15J59k92N1Q4P6O5l55K23O8n43O51O0m80
3535b39L66M7j77K36k85K60l42J44K66j95l59K87J0k60K56j78k9K84p1l7L2k57
$$ plain form
3557 -241 101 1 88 418 51 -66 213 157 -161 -30 -4 -83 -23 -3 10 -172 -69 287 17 -189 110 -23
3579 -23 -71 139 174 -10 240 303 243 20 -31 182 -76 77 191 -170 -318 224 24 -111 164 300 1 58
3601 58 82 -118 23 12 113 -228 115 -2 -177 -79 92 59 -46 -56 -32 -48 -62 260 253 -147 -60 259 -60 -17
3625 -17 138 -80 -33 79 283 25 85 209 -10 15 -135 113 -311 -160 -11 -30 205 -111 -6 -91 -29 -2 16
3648 16 -78 271 276 -37 253 185 -26 -18 118 -173 -90 -140 220 -46 -94 83 -110 54 105 -157 -131 -52 -167 -36
3672 -36 -21 68 269 -34 -47 20 45 -209 47 -39 -327 153 -25 0 55 75 9 -23 -112 179 7 59 341 60 149
3697 149 143 135 116 191 -171 78 -30 -63 -99 -258 -7 106 -57 43 -20 56 167 49 -39 72 176 -70 167 52
3721 52 125 -148 -107 190 107 -61 26 78 -57 -169 -7 88 -112 -88 -12 -46 -210 24 349 -141 200 135 -265 311
$$ packed form
3557b41L42j00Q7L30l67j17K79n6l18J31K6p9O0K0J3j82J03L56k70k06K99j33
3579b3m8K10L5j84K50O3o0k23n1K13k58J53J14l61j48N42k00j35K75J36k99N7
3601E8K4k00J41j1J01l41L43j17j75R8J71l3j05j0K4j6j4L22pm00Q7L19l19M3
3625a7J55k18M7J12K04k58O0J24k19K5j50K48m24J51J49j9K35l16J05q5O2K7J8
3648A6r4L49Nl13K90o8k11QJ36k91Q3n0L60k66m8J77j93J64N1k62K6P9j15J31
3672c6J5Q9K01l03j3O7K5k54K56q6k88M80j78K5N5K0o6l2q9K91j72N2K82k81Q9
3697A49oqj9P5l62K49j08l3l6j59K51J13j63J00o3P6J11j18q8J11J04k46K37j15
3721E2P3k73M1K97q3j68Q7N2j35j12J62R5k00K4P6l4j64K34L25m90L41o5m00N76
$$ plain form
3745 311 200 -45 183 176 -97 -211 -161 67 -151 -125 -255 -23 -286 -25 168 -179 92 -163 46 -52 21 170
3767 170 -113 -133 241 -22 42 -120 4 -341 -239 -89 24 199 -132 -21 -171 4 106 -156 224 187 -35
3788 -35 -75 229 39 -20 83 45 157 11 42 -35 86 53 -132 -14 323 1 -163 -165 -111 26 39 135 -32 -59
3812 -59 82 -107 -79 -131 -34 295 171 -132 131 28 -263 42 44 -42 134 59 286 49 89 104 -27 23 38 -89
3836 -89 -85 90 -104 124 18 -19 58 -120 -67 93 -170 -111 106 94 -111 -131 271 116 148 -4 7 -78 1 310
3860 310 -95 237 -53 -19 -238 60 57 -167 10 15 -96 69 -66 -23 20 -69 -92 -41 84 -51 -50 52 67 31 96
3885 96 -91 20 -305 -6 145 -32 -143 97 -49 46 29 46 199 78 -32 79 103 -45 108 -39 29 51
3907 51 52 124 159 3 -124 166 14 -84 -11 156 17 -30 98 -67 24 20 -95 -55 37 64 60 68 -5 -210 -27 -122 -104
$$ packed form
3745C11j11k45K28pk73j14N0K28k18K6j30K32k63K61J93l47K71k55K09r8P3J49
3767A70k83k0L74k63O4j62J24l45J02J50J13J75l31J11j50J75J02k62L80l7k22
3788c5m0L04j90n9J03l8J12j46L1p7J21l3j85J18L37l22j64kN4J37J3R6j67k7
3812e9J41j89K8n2R7L29j24l03K63j03k91L05Kq6J76p5K27k37M0J5j31N0J5j27
3836h9MJ75j94K28j06l7P7j78N3J60k63N9K17j2k05k0M02j55L2j52J1q5P9L09
3860C10m05L32k90L4k19K98lk24J77Nj11J65j35M3M3q9k3N1J25j35JJ02J5l6O5
3885I6j87J11l25K99J51j77j11K40j46R5j7J7J53j21j10J11K4j48J53j47O8K2
3907E1JP2L5j56j27K90j52r8P3J67j39m7J28j65R1mj15M0R2K7mQp3k05J83r5J8
$$ plain form
3934 -104 -51 -33 29 -100 41 155 88 109 104 74 18 -119 44 195 -34 -170 -223 91 -135 76 -58 -190 -187 32
3958 32 -29 -96 38 -172 61 -23 38 104 -180 101 -27 154 -75 -111 -142 -9 -153 -335 149 -112 -116 -247 -74
3981 -74 181 -67 -175 -51 103 -185 -110 -173 -80 -37 -78 -247 69 106 -47 -47 89 -96 -26 293 75 59 121 -116
4005 -116 -94 -56 -1 7 302 -40 -26 -21 4 15 19 -158 -47 42 -246 15 34 43 7 150 -59 60 62 -79 311 -55
4031 -55 91 -4 -11 105 18 -181 90 -41 -36 363 33 -56 -29 -154 -56 89 -256 51 115 -96 -162 35 27 -66 67
4056 67 133 17 107 106 249 89 18 -235 -105 -273 -149 24 314 93 -196 96 -138 25 76 -93 107 -132
4078 -132 -124 -59 -82 128 192 -147 120 -79 0 26 35 -59 1 -35 -167 -98 -52 -16 100 -59 -63 23 60 232 246 25 -59
4105 -59 -221 217 120 4 40 66 133 111 198 -38 -39 5 -46 196 -39 40 -31 98 -17 -17 68 244 123 2 -82 -69
$$ packed form
3934a04N3J8O2j29J41J14o7K1nl0n6j37J63J51k29j36n3L14k26K11j34j32LK19
3958C2o1o7J34k10K33q4O1O6k84K81j28J81k29l6l1J33j44j82M84k61mj31J73
3981g4K55k48j08J24J54k88P5o3R3M3m1j69L16L7j53%J36j85P0L19k18j6O2k37
4005a16K2L8N5QK95l42J4NK5J1Mj77J11Q9k88K61J9Rl6J43k09J19Kj41L90l66
4031e5J46r5pJ16q7j99K71j31NL99l30q9K7j25R8J45l45L07O4k11o6J97qr3J33
4056F7O6j16R0jJ43j60p1k53J30j68J24J73K90k21k89K92k34J63N1j69K00k39
4078a32QO5k3K10O4l39K67j99P9K6Rr4O0l6j32O9M6L6J16j59mQ6L7J72J4k21q4
4105e9j62M38r7j16L6K6O7k2Q7k36jM4n1K42k35P9p1J29j15%Q5J76j21j21q4J3
$$ plain form
4131 -69 3 3 18 99 81 -134 123 -220 -42 -24 188 49 260 64 23 -79 116 255 54 -27 -91 -180 -99 59
4155 59 -45 43 38 34 2 -87 40 -34 -59 75 138 -61 56 -121 114 137 102 -76 79 14 -84 -4 125 114 60 -83
4181 -83 -132 -114 -18 -14 61 -130 137 -172 70 -3 -68 174 -145 -22 66 169 -88 76 -56 -35 -23 51 83 107 4
4206 4 -73 -72 -157 55 -182 11 -15 323 -36 -91 41 175 -182 202 214 38 182 -109 17 -118 30 124 -39
4229 -39 94 24 -232 -117 70 0 119 73 -15 -25 -92 -234 134 -45 90 20 -15 -128 15 107 -9 95 24 -81
4253 -81 -12 90 -21 90 -113 150 113 24 -138 -4 -47 107 -26 -52 -140 -97 63 159 203 10 5 23 33 -161 -29
4278 -29 35 128 -45 169 13 -91 115 102 -90 251 178 -20 26 28 46 -89 153 43 -31 -48 10 215 83 -142
4302 -142 -148 -79 -25 122 -12 198 6 -71 49 -63 114 -62 -1 38 3 -44 46 -87 -130 111 -70 80 26 -79
$$ packed form
4131f9P2%J5Q1j8k15K57l43J78J8K12j39K11j96m1j02J95J39k01q1o4q9Q1J58
4155E9j04Q8nml2q9J27p4k5J34O3j99J17j77K35K3l5j78J55o5r8Q0J29j1n4j43
4181h3m9J8R6MP5j91K67l09K42p3o5K42l19J23Q8J03k57J64j32K1J2P4L2K4j03
4206Dp7Jq5K12k37J93k6L38l59n5J32J34l57L84J2j76J44k91J26j35J48R4j63
4229c9J33p0k56J15J87p0J19m6q8j0o7j42L68j79J35p0l5j13J43R2j16J04p1j05
4253h1O9J02j11J11k03K63l7q9j62J34m3J54j33k6q8M3J60R6M4j93nJ8J0j94J32
4278b9O4R3j73K14j56j04K06j3j92L41p3j98M6KJ8j35K42j10p4j7N8K05j32k25
4302a42oO9N4J47j34K10j92p7J20j12J77j76O1L9l5m7R0j33m3K41j81J50n4j05
$$ plain form
4326 -79 105 -75 -43 222 -43 -304 62 75 46 107 -33 19 -159 48 -79 63 35 248 -66 -58 212 23 -62
4349 -62 43 -108 28 49 -147 0 -120 6 -42 150 -14 -41 -220 47 46 72 32 -32 -13 -64 -11 155 122 -224
4373 -224 125 84 -108 -49 72 -167 -100 -137 -61 196 8 -38 -97 102 -176 29 -80 -234 76 72 55 209 -20
4396 -20 130 0 78 275 -71 286 -90 -32 -62 -117 -216 158 -193 -80 136 206 -43 93 -52 204 -83 6 17
4419 17 -132 165 37 126 -25 94 -118 137 -4 166 5 -95 -19 -20 -67 -280 189 83 239 68 154 26
4441 26 24 238 -141 109 -126 -30 -192 80 -97 33 -218 108 1 -143 -58 -49 -144 -37 53 -122 -195 -194 50 -42
4465 -42 81 -139 -82 158 33 -254 -7 75 123 -83 -38 150 -12 -86 -178 143 -104 -121 -38 -23 -59 132 208 -18
4489 -18 -89 -158 -26 -99 -138 -33 123 -2 181 103 148 -22 218 34 126 -77 157 -176 80 -294 -42 -116 -111 32
$$ packed form
4326g9J84j80L2K65k65k61L66J3k9O1j40N2j78K07j27J42k8K13l14QK70j89q5
4349f2J05j51J36K1j96J47j20J26m8J92j64k7j79K67jK6m0o4J9n1N3J66l3l46
4373b24L49m1j92N9J21k39O7l7P6K57j88m6n9J99k78K05j09j54L10mj7J54k29
4396b0J50j30P8J97l46L57l76N8l0n5r9L74l51J13K16P0k49J36j45K56k87Q9J1
4419A7j49K97j28Q9j51J19k12K55j41J70j61j00P6jm7k13M69j06J56j71Q6j28
4441B6kK14l79K50k35R6j62K72j77J30k51L26j07j44Q5Rr5J07R0j75p3JK44r2
4465d2J23k20N7K40j25k87K47Q2M8k06M5J88j62p4r2L21k47j7Q3J5l6J91P6k26
4489a8p1o9J32p3l9J05J56j25J83p8M5j70K40j84R2k03K34l33K56l74K52p4NJ43
$$ plain form
4513 32 -6 132 -92 152 -377 26 30 -8 28 8 120 -91 -92 193 -19 -24 126 61 3 60 -77 156 41 -126 185
4538 185 -77 97 42 12 -178 -28 6 -59 -7 -161 -95 60 102 155 97 -310 57 -88 -47 -129 152 72 -172 86
4562 86 -37 75 2 234 231 23 30 90 -32 -18 31 11 -36 159 181 195 0 -131 -55 -74 145 128 -51 -82 101 129
4588 129 141 22 -33 -110 -337 -139 68 -231 80 67 -214 -16 203 -38 -76 154 -58 73 18 -118 115 128
4610 128 -86 -22 -255 -280 144 -168 36 -148 -70 -71 -31 53 -287 -60 11 -74 -35 89 42 54 67 -67 -6 -97 150
4635 150 87 155 -134 -42 -104 1 -50 20 69 -29 73 13 -103 71 -50 45 -63 -162 205 3 -72 30 -85 88
4659 88 -214 63 -4 -6 -121 -137 60 -137 101 138 -52 -123 -184 -43 39 -82 36 -90 154 139 116 -71 -16 15
4683 15 169 25 -128 -35 -72 -39 0 112 -198 26 -38 73 154 51 193 -212 11 80 -93 -50 102 -76 -174
$$ packed form
4513C2l8J38k24K44n29M03Ml8L6k0J12k11jK85k12nJ50o5n8N7j37K33j15j67L11
4538A85k62J74n5l0j90J50L4o5N2j54O6J55M2N3n8m07L67j45M1q2K81q0k44K58
4562H6j23J12p3K32lk08PO0j22J4M9k0m7J95K2J4j95j31P6j9K19j7j79l1J83K8
4588A29J2j19n5p7k27J98K07k99L11j3k81J98K19k41l8K30k12J31n5j36K33J3
4610A28k14O4k33k5M24l12K04j84P8jM0Q4l40K27P1q5L9J24m7J2J3j34O1r1K47
4635A50o3O8k89R2o2J05n1P0M9r8J02o0j16J74j21R5j08r9L67k02p5J02j15J73
4659H8l02K77o7kj15j6J97j97K38L7j90p1o1J41Q2j21J18j26K44j5k3j87N5L1
4683A5J54j44j53R3l7L3L9J12l10K24o4J11Q1j03J42m05K23O9j73M3J52j78r8
$$ plain form
4706 -174 -46 -71 -68 89 7 -30 -168 165 -67 93 171 160 -136 -132 40 -149 -65 86 151 164 -88 -48 -169 79
4730 79 81 353 -92 141 106 -143 -123 103 210 74 54 183 2 149 -39 8 55 -170 83 79 -24 -20 -100 -65 -150
4755 -150 36 197 -78 7 50 19 -76 145 130 58 -157 -98 82 25 107 -70 56 204 -28 -6 -158 -276 -86
4778 -86 -131 -230 78 -26 34 135 -182 80 -22 -92 113 130 -127 -231 60 -72 4 62 -73 7 168 85 -46
4801 -46 -216 18 210 25 -120 -123 -175 44 22 -188 44 63 256 -19 12 190 -193 13 -149 93 -16 -154
4823 -154 -177 -115 -44 177 127 -20 -99 172 -88 91 21 -102 -135 -95 -66 -3 -140 53 64 -19 -83 -15 -10 36 43 60 8
4850 8 129 73 82 105 101 6 -167 -3 226 2 77 -70 102 -74 -108 139 181 -111 -135 -37 -29 -2 -138 162 -73 43
4876 43 -33 8 83 89 17 276 -24 -71 51 401 135 -36 -30 203 87 -65 125 34 -3 -210 -42 -116 19 -45 -63
$$ packed form
4706a74J28k5LJ57q2l7j38L33k32J60P8j1k96MJ72j89Q4J51O5J3k52M0j21K48
4730G9KK72m45K33l5k49K0K26J07j36k0J29j81J47j88M7M7k25K53mj03Mq0L5q5
4755a50J86J61k75Q5M3l1r5K21j5p2k15N9J80n7Q2j77J26J48k32K2j52j18J90
4778h6m5r9L08j04O0J01l17K62j02p0K05J7k57j04K91j32P6N8j35Q0J61q3j31
4801d6j70K34J92j85j45ln2K19k2k10K32J9J93k75L1J78l83K06j62K42j09j38
4823a54k3O2P1K21n0j47p9K71k60J79p0j23l3M0K9O3j37J93J1q3o4O8NM6PJ7n2
4850HJ21n6RK3mr5j73J64K29k24P5j47J72j76l4K47M2k92k4R8QK7j36L00k35J16
4876D3p6M1P5Op2K59l00m7J22L50k66j71OK33j16j52J90r1l7k07J68p4J35o4j8
$$ plain form
4901 -63 59 -158 -5 -160 -122 200 -73 92 208 -102 116 66 -74 22 -105 -20 23 -198 6 -124 -263 -77
4923 -77 -24 141 21 60 -171 -25 26 -90 -153 91 -122 245 -6 -74 -59 -19 -81 13 127 143 -198 7 239 61
4947 61 -102 65 -135 32 120 -45 16 -32 -128 -161 68 -141 -11 90 -44 54 0 -29 -148 83 183 111 -75
4970 -75 -3 119 -151 110 -12 -108 178 194 -157 -72 145 -129 -49 170 -58 -74 -172 13 -19 103 28 -60 -116 -100
4994 -100 -334 -38 -191 79 -92 11 -91 72 139 140 49 259 -30 -84 134 163 14 -160 104 -199 29 9
5016 9 -20 86 -152 -166 -83 51 74 152 114 -133 91 -102 176 -5 53 233 25 184 182 -173 112 -112 -296 54
5040 54 14 90 59 102 -39 150 -80 120 -50 -78 -70 -102 -85 27 88 -88 92 -37 -300 -46 105 -128 -19 -12
5064 -12 86 4 -189 93 66 38 7 43 -10 -64 -9 -28 -1 -156 -20 126 -13 238 -99 -27 -15 108 -19 164 60
$$ packed form
4901f3J22k17J53j55L8L22k73J65J16l10K18n0j40R6j27Q5M3k21K04j30j39J86
4923g7N3J65j20L9k31J46N1j16o3K44k13L67k51o8J5M0o2R4J14J6l41K05K32j78
4947F1j63J67k00J67Q8j65O1m8r6l3K29k09J30J01j34R8n4k9j19K31J00p2j86
4970g5P2J22k70K61j22r6K86J6l51Q5K17k74Q0K19k28j6r8J85l2J22p5q8n6J6
4994a00k34K96j53K70j71J03j02J63O7Jr1K10k89n4K18K9j49j74K64l03K28k0
5016Ik9J06k38j4Q3J34K3P8l8k47K24j93K78j81N8J80k08J59kl55K85k24j84L50
5040E4m0P6l1M3j41J89k30K00j70k8Ql2J7J12O1j76J80j29k63K54J51k33J09P
5064a2R8q2j93K82k7k8l1L6n3n4N5j9K7j55J36J46j39K51l37P2J2J23j27J83j04
$$ plain form
5089 60 -265 -193 5 -25 -59 105 52 91 -40 103 -7 -105 23 85 98 -173 -187 69 -130 -62 82 32 93 8 103
5114 103 13 -19 -13 90 -8 -76 149 65 -13 -6 -10 -116 -244 -65 148 -1 -15 14 -332 16 -9 -121 50 104 -96
5139 -96 -99 48 -9 33 -136 -79 -106 -25 -48 -121 40 -123 15 -25 -27 265 52 -107 75 10 -82 133 110 288 130
5164 130 -19 -186 9 117 -176 -40 -113 14 114 32 34 40 83 -11 73 -107 -40 308 -71 -27 180 182 6 -129
5188 -129 -64 -36 34 -391 4 -217 -103 219 -139 -237 263 48 10 55 -37 113 69 -202 34 99 61 103 -60 -97
5212 -97 138 -137 -55 191 25 93 198 -23 -82 -45 135 115 -92 25 11 43 -41 -11 4 49 40 6 -9 85 -90 -154
5238 -154 110 1 -204 -145 -108 -108 23 -12 151 -366 -191 -7 89 -62 -52 -112 -14 91 -26 153 -71 49 90
5261 90 28 -79 0 -44 221 91 99 12 113 -14 -67 -123 29 -21 -206 72 -49 55 -184 -62 11 -4 249 -19
$$ packed form
5089F0l25P2J98l0l4J64n3L9j31J43j10r8J28O2J3k71j4K56j99O8J44n0O1q5R5
5114A03r0l2OJ03r8o8K25q4p8Pmj06j28J79K13j49j4K9l46L48k5j12J71N4k00
5139i6lJ47n7M2j69N7k7Q1k3p3J61j63J38m0kK92k13j59J82o5r2K15k3J78j58
5164A30j49j67J95J08k93J36p3J27J00q2KOM3r4Q4j80O7L48l79M4K07Kj76j35
5188a29O5K8P0m25L95k21J14L22l58r8N00k15l8M5r2J50m4k71K36O5l8M2j63l7
5212i7K35k75Q2K46j66O8J05k21n9L7J80k0k07J17j4L2q4L0J5M5rl4j5R4j75o4
5238a54K64j09k05N9L7%J31l5J63n17J75J84R6j51J0o0R8J05j17J79k24J20M1
5261I0o2j07P9m4K65j30Qq7J01j27n3n6J52n0j85K78j21J04k39J22P3j5K53k68
$$ plain form
5285 -19 -113 -196 67 -35 124 110 9 237 329 11 191 -43 83 -45 -3 -133 28 -10 -59 13 -61 -113 0 -45
5309 -45 -59 -118 -27 151 149 -100 255 12 252 -126 -168 180 -170 -223 144 117 -80 120 -73 53 -137 -264 -107
5332 -107 38 -270 1 28 125 -185 112 81 -76 0 136 23 -178 99 15 -39 -92 70 137 -12 33 49 -44 26
5356 26 230 -31 -154 185 160 150 -79 17 -28 -22 150 60 -23 -207 215 -198 -80 96 153 -124 -170 261 -35 309
5380 309 66 38 -83 17 234 -44 32 52 53 90 213 18 -220 5 45 -142 -142 11 -85 -166 78 -105 -57 -5
5404 -5 114 104 -106 83 -29 -179 -148 -4 59 -56 -226 28 -4 78 41 -196 -20 2 -155 -146 258 68 -1 -39
5428 -39 74 152 -68 210 39 129 311 42 -61 3 340 -157 -386 93 -33 27 139 10 -14 1 24 208 -54
5451 -54 93 112 -76 -146 -6 -83 -28 -193 -35 -3 -23 10 -2 -166 53 196 -129 180 -8 -280 -183 196 -191
$$ packed form
5285a9r4q3K63j02J59j4j01K28R2l18J80k34J26j28M2j30J61l8m9P2p4n2J13m5
5309d5j4n9R1J78kk49L55k43K40l78m2L48l50n3L67k7j97K00j93J26j90j27J57
5332a07J45l08K71K7R7l10K97l1j57P6J36j13k01K77q4n4n3J62O7j49M5J6r3P0
5356B6K04k61j23L39k5j0k29R6m5OJ72r0q3j84M22m13J18J76N7k77m6M31k96L44
5380C09k43k8j21J00K17k78P6K0JL7J23j95k38K25M0j87%J53r6q1K44j83M8N2
5404eJ19j0k10J89j12j50L1J44O3j15j70K54l2Q2l7k37J76K2j57RM04j90o9l8
5428c9J13P8k20K78j71R0J82k69j03O4L37m97k29M79j26O0J12j29k4J5K3J84k62
5451e4J47J9j88p0J40p7N5j65J58L2k0L3j2j64K19J43l25L09j88k72R7L79l87
$$ plain form
5474 -191 -50 93 276 160 -190 19 52 -129 210 -25 84 -59 13 51 135 136 135 33 52 -192 -59 82 93
5497 93 -67 -224 162 -25 -76 123 57 127 14 -2 46 -256 -57 167 -20 49 49 -84 -69 -28 -66 -18 -87 -76 -6
5522 -6 -119 31 -30 -113 147 -38 -277 -333 85 98 -5 -125 2 172 10 -58 76 -78 74 157 -125 -172 -111
5545 -111 -35 60 140 66 13 -131 -147 -29 -41 142 -81 25 103 108 -113 -93 -148 127 -88 71 113 131 108 21 118 49
5571 49 -83 101 47 95 -212 -149 50 -23 228 174 69 69 110 -142 89 -26 -70 68 -14 -171 62 -61 1 21
5595 21 -33 87 34 36 -4 -78 123 174 227 15 -44 -148 209 15 -98 -150 -245 -157 80 22 -43 140 -146 -149 19 -192
5621 -192 -1 -11 2 -2 148 73 27 11 -87 19 -83 11 268 103 -91 108 0 51 36 23 -130 -230 -86 111
5645 111 -94 103 -9 117 204 217 124 18 185 109 262 -19 10 131 188 44 -79 55 -143 -93 135 298
$$ packed form
5474a91J41J43J83j16l50K09L3j81L39k35J09j43P2L8Q4Jjj02J9k44J33J41J1
5497I3j60j57L86j87n1J99o6P0j13j6M8l02J99K24j87O9%j33J5M1l8M8o9J1P0
5522fj13J50o1q3K60j85k39n6M18J3j03j20J27J70j62o8J34j54J52Q3k82m7O1
5545a11P6R5Q0p4n3j44j6J18j2J83k23J06P8Nk21K0n5K75k15J59M2J8k3q7R7o9
5571D9j32J84n4M8l07O3J99p3K51n4j05%M1k52K31j15m4J38q2j57K33j23O2K0
5595B1n4J20n3Km0p4K01N1N3k12n9j04L57j94j13n2r5Q8K37n8o5J83k86lJ68k11
5621a92J91j0J3mJ50p5m6j6r8J06j02R4K57j65j94J99j08N1j5j3j53j00J44J97
5645A11k05J97j12J26Q7J3r3j06J67p6J53k81K9J21N7j44j23J34j98N0K28J63
$$ plain form
5667 298 -52 235 -53 -245 1 81 -144 273 161 -246 -53 -47 -18 -28 -129 -76 175 -12 -58 50 -14 -155 -84
5690 -84 -219 69 27 -145 -75 63 -72 -61 -300 222 -49 -66 -33 -20 -64 96 -44 70 55 -215 20 -120 -151
5713 -151 36 120 27 77 179 45 -41 51 -51 -107 72 3 -25 16 -18 -25 -213 -22 -201 -249 16 -131 -69 133 -28
5738 -28 102 77 -90 129 -38 -70 192 37 -92 121 -34 -54 -29 -43 -105 7 -104 -68 14 2 209 -251 144
5761 144 174 -109 129 172 -56 178 -100 55 -13 56 -152 51 133 33 -78 -121 -191 6 59 29 47 171 48
5784 48 -181 33 150 -47 -25 164 -8 -129 23 -94 -161 -12 165 -54 -163 -229 -69 -60 -26 202 -16 8 65
5807 65 103 -146 56 132 -181 112 65 93 -274 -160 172 -138 -65 -218 -296 -269 165 -45 -27 -53 77 -54 -30 1
5831 1 92 73 -224 -25 -208 -108 -11 -63 136 53 -8 -88 -133 23 -168 28 -49 -79 -92 75 -75 77 83 11 116
$$ packed form
5667B98l50K87k88j92K46Q0k25M17j12m07J93OK9j0j01N3K51j87m6J08o4j41P1
5690h4j35K88m2j72P0J38j35J1k39N22k71j7L3J3m4J60j40J14j5k70K35j40l1
5713a51J87Q4r3N0J02j34q6R2j02n6J79o9k8M1l4pj88J91j79m8K65j47O2K02j61
5738b8J30k5j67K19j67l2K62j55j29K13j55k0K5j4o2J12j11L6Q2j2K07m60L95
5761A44L0k83K38M3k28K34k78J55o8O9k08K03Q2j00j11m3p0J97N3l0J8J24j23
5784D8k29K14J17j97K2J89j72j21J52j17o7J49J77k19j09o6J60RL4K28k18K4N7
5807F5L8k49K02P6l13K93m7K8l67J14L32l10P3j53p8K7M34k10J8k6J30j31K4L1
5831AR1j9k97J99j83J00R7n2J99q3o1q0m5J56j91J96p7l0j3J67j50J52Op2J05
$$ plain form
5856 116 -256 -50 30 -272 -119 41 -212 -26 38 225 -61 -3 220 187 -230 56 75 233 -52 207 17 -47
5878 -47 45 -105 -16 -10 11 -75 0 -20 -62 25 43 -35 -82 -116 243 -74 27 -43 54 99 28 -28 -23 35 -106 147 -30 113
5906 113 17 -233 29 162 53 -152 23 -63 -184 98 170 23 -66 209 138 -121 -132 92 -68 36 247 -142
5928 -142 -134 -30 -31 105 -57 158 58 -153 41 -14 -203 195 -39 53 -9 91 170 9 -266 -80 61 -129 211
5951 211 -53 -207 -20 111 -282 58 67 6 -41 -80 4 -59 40 86 -102 -165 21 90 154 63 15 -208 140 73 190
5976 190 -103 -94 131 41 65 17 195 85 -10 -137 -5 103 142 -25 -132 41 27 -22 41 291 -84 -140 130 -14
6000 -14 -79 19 67 59 1 183 73 -135 20 -11 33 -193 -92 -58 210 240 -156 149 -4 -41 87 3 2 -9 1 44
6026 44 -7 -57 23 98 155 15 -33 143 94 103 125 167 -62 -110 -29 -146 60 -1 33 23 21 -162 62 -8 -144 34 -103
$$ packed form
5856A16l72K06Q0l02J53J60k53J86O4J87k86N8K23l3m17K86J9J58k85K59j90o4
5878d7R2j50Q9OK1q6P5k0m2Q7J8p8m7l4L59l17J01p0R7M5p1n6NN8j41K53j77J43
5906A13r6k50K62J33j09k05J75q6j21K82P2j47q9K75p1k59j1K24j60J04K11l89
5928a42QJ04jJ36j62K15j00k11J94n5j89L98k34R2o2J00P9j61k75J86J41j90L40
5951B11k64j54J87J31l93L40Ro1m7l9Q4o3R9M6j88o3J86O9O4r1m8k23L48o7J17
5976A90k93RK25r0K4m8J78j10r5j27J32J08L9j67j07J73j4m9O3K50l75n6K70j44
6000a4o5R8M8qn8J82j10k08J55l1M4k26J01L4K68L0l96L05j53l7J28q4jj1J0M3
6026D4n1n0Q0P5N7j40m8J76m9RK2M2k29m8Q1j17K06o1L4j0kj83K24p0j36J78j37
$$ plain form
6053 -103 134 120 148 -93 -28 -173 124 72 143 -20 -202 -11 -99 -88 134 -213 -155 361 39 -16 135 89 -19
6076 -19 156 -112 148 67 -44 -103 -53 -123 18 -30 -102 148 3 -60 19 -71 50 97 72 87 -63 62 278 20
6100 20 -123 72 -20 30 202 -286 -14 -95 -30 -45 -90 134 88 -72 34 -45 53 -80 36 -160 8 121 -83
6123 -83 -181 -111 -76 -40 -272 -35 -100 -156 134 102 -62 -116 19 183 -104 57 -187 -251 68 -187 53 122 91 168
6147 168 -67 26 -144 59 257 100 42 -201 124 58 103 -60 146 59 -48 52 -10 178 96 -109 -13 65 -236
6170 -236 80 115 -129 205 53 17 70 48 0 -15 -139 -45 -66 19 194 -12 83 98 37 10 148 -207 -185 90 44
6195 44 -61 -10 60 -61 194 -165 -64 -366 50 -50 -56 -295 -11 33 -70 199 -7 -123 -136 -59 -87 -1 93 -106
6219 -106 -200 57 34 -69 -55 43 -75 -125 32 8 -54 215 36 7 -139 81 119 -54 68 152 119 151 139 65 122
$$ packed form
6053a03K37j4K8k41O5j45K97n2P1j63j82J91q8J1K22l47N8N16l22n5J51m6j08
6076a9J75k68K60q1j11n9N0p0J41m8p2K50j45o3P9r0J21M7k5J5j50J25K16k58
6100B0j43J95r2N0J72m88K72q1O5j5m5K24m6j60J06p9R8j33J16j96J68J13k04
6123h3r8P0L5L6k32K37o5n6K90l2j64n4J35J64k87J61k44o4L19k55K40O9l1P7
6147A68k35R3j70K03J98j57n8k43L25o6M5j63K06q7j07J00o2J88q2k05R6P8l01
6170b36L16L5k44L34j52l6N3k2m8j5j24R4k1Q5J75k06R5J5o1k7J38l55K2K75m6
6195D4j05N1P0j21K55l59J01l02M16j00ok39K84M4j03K69k06j16j3P7k8Q6R4j99
6219a06r4K57k3j03J4R8j18n0J57k4o2K69j79k9j46K20L8j73J22Q4l3L2j2p4N7
$$ plain form
6244 122 92 -200 -39 6 -21 -2 -166 19 -40 126 -147 253 -134 80 -23 87 93 -226 121 -124 -192 18 -11
6267 -11 -136 -131 -318 37 100 20 -215 45 47 -136 62 129 160 -173 92 -26 -136 14 -38 38 -159 -268 -123 83
6291 83 171 12 -293 55 -112 -37 -167 65 -20 -16 19 -70 -34 38 85 -1 -65 73 127 -331 81 52 77 -37 11 -31
6317 -31 12 -12 150 -39 -235 -171 -40 199 -173 192 18 -129 -157 -37 -35 -58 64 -42 -57 -116 -217 18 -9 -114
6341 -114 141 62 57 239 -45 12 -4 102 173 105 -26 -7 164 27 -272 -45 1 -95 -112 177 -109 85 23 133
6365 133 -103 -27 -2 74 -61 -125 -62 -43 -88 59 -169 -143 -59 -95 -60 112 -21 -45 209 103 -1 82 134 -24 -113
6390 -113 137 -7 -29 48 176 -150 -25 -51 -117 -152 32 50 -218 -276 12 151 -7 188 146 69 119 -35 -3 212
6414 212 -216 65 -65 115 75 -49 13 133 67 -20 -61 -6 77 -131 164 168 -147 100 -7 -55 -34 -89 38 -70
$$ packed form
6244A22l0k92J61M5k7J9j64J85n9J66k73M00l87K14j03J10Ol19L47k45o8K10k9
6267a1j25Nj87L55O3q0k35K60Kj83J98O7L1l33K65j18j10J50n2P6j97j09J45K06
6291H3Q8j59l05L48j67P5j30K32q5ML5q9L6P2M7q6o4J38N4m58M12k9K5j14M8m2
6317c1M3k4J62j89j96O4J31K39l72L65j74j47k8J20Kk3J22j06j5n9j01K35k7j05
6341a14K55p9nJ82k84N7j6J06P1o8j31J9J71j37k99K27M6r6j7K89k86J94o2J10
6365A33k36P6K5P6j35o4O3J9m5J47k28K6Q4l6L5J72j33k4K54j06j04Q3N2j58q9
6390a13K50j44k2P7J28l26J25k6o6l5J84J8k68n8K88J39j58J95m2p7N0j54L2K15
6414B12m28K81j30J80m0j24O2J20o6q7m1N5Q3k08K95Ml15K47j07m8K1n5J27j08
$$ plain form
6438 -70 -79 -24 -275 -20 24 -165 92 -209 -68 -267 175 186 25 -119 70 14 -25 -36 135 -26 75 156 4
6461 4 -234 -58 85 115 -291 -65 -99 -94 106 0 -184 -56 121 76 77 28 213 204 50 22 83 92 12 63 -279 110
6487 110 299 -95 -15 -126 -147 -209 78 -14 112 -121 96 45 -20 108 -43 208 -165 68 -167 -55 32 -109
6509 -109 8 -181 -23 -261 -55 113 -29 -51 -93 31 4 -63 194 236 -68 58 -41 -224 60 159 -202 -13
6531 -13 -87 94 -162 50 135 77 -88 45 -79 -109 75 -63 -105 281 1 -105 66 -61 -32 74 -216 46
6553 46 -131 -244 39 1 -30 34 210 -75 93 -73 101 -55 -104 1 -51 -185 33 161 -286 145 -75 -32
6575 -32 -56 115 55 -48 -109 -88 -23 -8 -106 -248 31 31 -89 -52 5 94 11 11 -136 -66 34 -81 -65 -91 -179 285 -188
6602 -188 -179 45 -181 -31 -244 211 -206 55 -9 4 73 2 117 -87 74 38 -139 -11 57 -21 32 74 -120 203
$$ packed form
6438g0rN5k51K55M4j89K57l01J41j99M42J1j61j44J89n6l9j1J71j61J01Q1j52
6461Dk38J76J43L0m06K26l4NK00j06j84J28J77m5Jm9J85rj54k8O1Rq0N1l42L89
6487A10J89l94Q0j11k1o2K87r2J26k33K17n1o5J28j51K51l73K33k35J12Q7j41
6509a09J17j89J58k38K06J68j42k2m2J24k7o7K57M2l04J26r9j83K84R9l61J89
6531a3p4J81k56K12Q5n8j65J33j24l0J84j38m2L86k80j06J71j27K9J06k90K62
6553D6j77j13K83l8l1O4J76k85J68j66J74j56m9J05n2j34K18J28m47M31k20M3
6575c2k4J71o0j03o1K1O5J5r8j42K79%j20L7N7Q9q3%j47P0J00j15J6k6q8M64m73
6602a88RK24k26J50k13M55m17K61o4J3O9p1J15k04J61l6j77J28O8p8N3M2j94L23
$$ plain form
6626 203 -347 49 83 -129 29 36 -159 211 121 -73 163 -68 -80 3 37 1 -89 -218 -35 -204 -81 -115 140
6649 140 -254 -86 71 114 -7 -54 71 13 57 72 -46 49 104 70 118 -203 -18 -37 31 189 -67 -53 -75 163
6673 163 -164 -87 227 -85 -103 123 72 -8 62 40 83 -5 -6 389 -189 -102 82 -96 193 104 152 -117 78 -61
6697 -61 -1 136 -25 109 -159 53 106 94 -10 97 -20 104 -60 -76 53 -14 -132 -246 56 22 107 99 48 -23
6721 -23 147 150 49 30 -294 284 61 28 -27 -226 72 -29 -67 105 107 -107 79 -74 124 10 11 -71 -110 -57 4
6746 4 -43 -72 1 -367 205 362 -130 62 -107 -349 179 121 -70 2 -94 121 -5 -112 55 -46 -52 167 -30
6769 -30 40 199 5 103 104 -100 -38 -55 -70 -51 -99 -170 111 15 -84 56 -28 -139 54 -36 -83 104 -164 39 -218
6794 -218 46 -76 16 -22 -17 -79 -98 212 -64 -21 0 -109 -37 -125 -33 12 29 138 18 -12 200 -26 -215 -48 -89
$$ packed form
6626B03n50L96L4k12J58Pj95L70r0j94K36k31j2Q3L4l6r0j29J83j69J23l4K55
6649A40l94J68J57M3j21m7J25n8M4J5j18R5N5l4M8l21J85j9O8J58k56J4k2K38
6673A63l27P7L14l12j8K26n1q0P0k2M3q8jL95n78Q7J84j78K89q9M8k69J95j39
6697f1O0J37j61J34k68K12N3j2j04J07j17J24j64j6J29o7j18j14L02l4Q5qn1p1
6721b3J70Lj01j9l24N78k23l3n5j99K98j01l8J72Kk14J86j53J98j14Jq2l9N3O1
6746Dm7k9P3l68N72J57m92J92j69k42N28n8j91P2r6K15j26j07J67j01oK19j97
6769c0P0J59j94R8Jk04O2j7j5J9m8p1K81r6r9J40q4j11J93r0m7J87k68K03k57
6794b18K64j22R2l8No2j9L10k76M3K1j09P2q8R2M5J7J09j20l0K12k26j89J67m1
$$ plain form
6819 -89 -157 -59 106 -125 -21 -77 190 76 -37 41 51 -268 -35 32 -84 160 -103 -42 261 -34 -8 30 -45 103
6843 103 -13 -68 47 -143 -139 -38 82 -133 273 -79 -3 -93 -80 8 81 176 14 -196 96 -69 -59 74 -101
6866 -101 -163 -3 -76 -95 188 -41 -145 21 -64 7 4 -7 115 120 -60 95 109 -62 0 106 -18 217 -24 45
6890 45 4 -40 42 -55 -165 -68 -210 -61 4 30 89 38 -31 207 -26 145 111 -5 -89 -91 167 -77 -98 -12 -53 15
6916 15 -25 -81 -1 -162 185 19 90 35 21 -236 133 54 -51 -120 -77 19 -260 -139 -49 -211 -239 167 49 -213
6940 -213 -206 -84 15 -67 101 -109 -65 -194 158 -68 54 -7 -110 55 14 38 149 -151 -15 48 -26 -38 77 2
6964 2 117 237 -107 82 127 123 31 5 13 30 27 103 -99 -225 102 94 -137 -208 228 -105 -130 182 -135 122 -55 -151
6990 -151 89 -218 -34 230 -169 187 23 -211 78 71 -45 134 -31 -166 -111 114 236 -5 -163 -163 45 -265
$$ packed form
6819h9o8R8J65k31J04n6K67j14j13P8J0l19K33O7j16K44k63O1L03k95K6L8p5J48
6843A03j16n5J15j90MJ01J20k15M06l52P6r0J3Q8P3R5j62k10K92j65J0J33j75
6866a01o2J60p3j9K83k29j04J66q5P1lj1J22Nj80J55J4j71O2J06j24K35k41O9
6890D5m1m4Q2r7j10R7j42J49O5K6N9n1o9K38k33J71l4j16q4kK58k44k1Q6m1O8
6916A5m0n6Q0j61L47j66P1n5j4k57L69p9j05o9M3R6k79J21R0j62k8M06j18k62
6940b13PJ22R9q2J68k10M4j29L52k26J22o1j03J65m1K4J11l00J36O3p4j2J15p5
6964BJ15J20l44J89M5mr2k6QJ7lP6k02j26L27qk31p1M36l33k5L12l17K57j77r6
6990a51K40l07J84K64l99L56j64k34K89pj16J79j65j35N5K25J22k41j58%K08l10
$$ plain form
7012 -265 62 116 -41 95 88 -137 -19 136 79 81 104 -59 -166 -130 -3 9 -66 117 13 13 127 183 -111 131
7036 131 -94 236 84 -155 91 67 67 -8 -12 -272 -46 43 -36 -211 -17 118 154 23 136 80 -148 272 190 -27
7060 -27 214 -39 -36 177 -71 37 41 -77 55 -29 87 81 81 -26 7 141 29 120 -24 -32 -124 34 211 42 31
7085 31 -136 -107 -160 90 -71 200 31 -29 -98 180 66 -9 -131 108 174 -356 116 114 -30 -101 52 223 -216
7108 -216 -74 179 -89 -130 -24 -137 -77 131 -21 -247 -72 73 -105 27 87 74 -22 -238 3 51 -134 -32
7130 -32 -97 -462 -43 -20 -52 -114 19 -174 -32 -98 30 74 -101 188 -35 -27 -92 4 -16 128 43 -107 -156 -130 42
7155 42 -75 15 -60 -167 -113 81 -115 -4 225 61 -102 142 -5 -21 49 -87 113 -98 164 -111 158 29
7177 29 52 -53 -43 -203 -30 -111 -119 210 -190 -91 -67 216 -91 67 185 174 -126 230 -177 -52 191 64 52
$$ packed form
7012b65L27N4j57J36pk25J18J55n7KK3j63j07L6J27J2p5J83j04%J14N6k94K42
7036A31k25L30j52k39K46k4%p5mk60K26Q9p9j75J94J35L6j31J13n6k28M20q2k17
7060b7K41k53LK13k48J08Mj18J32q4J16o%j07L3J34j12R1j44qr2J58J77j69j1
7085C1j67K9n3K50j61K71j69o0o9K78j14p5j22K39O6n30M72kj44p1J53J71m39
7108b16J42K53k68m1J06j13O0K08j52k26J75J45j78J32O0j3r6k16K41M8j85J02
7130c2o5l65M19K3l2o2J33j93J42o6J28M4j75K89k23Qo5R6k0J44q5j50m9K6J72
7155D2j17R0p5j07N4J94j96J11K29j64j63K44j47j6P0j36K00k11K62k75K69j29
7177B9K3j05J0j60J73q1qL29m00R9K4K83l07J58J18j1l00L56m07J25K43j27j2
$$ plain form
7200 52 48 -44 92 -156 78 102 -60 79 -33 52 -114 15 -16 -80 -3 -253 -57 -32 185 229 114 -115 12 -191
7224 -191 -86 -64 -86 294 115 46 -41 -57 -32 25 -92 256 159 -134 21 -1 -64 -2 72 -185 71 -18 -205 -57
7248 -57 41 91 203 -216 95 136 -88 58 159 -105 220 160 -17 -19 66 145 -72 -96 289 -134 -147 154 14 -1
7272 -1 118 -42 -284 -275 59 64 10 -155 191 -89 63 55 -30 69 41 55 -26 -91 -36 82 -189 -99 -106 -154 -35 268 -46
7299 -46 254 110 -31 47 -19 -77 24 -57 -54 -121 -157 -34 -193 -151 33 -72 -207 -185 97 -174 113 -7 -43 35
7323 35 -192 92 109 -153 44 56 55 36 109 56 -94 67 -73 -34 -222 -147 102 -249 -28 5 15 84 -95 -132 186
7348 186 66 155 -39 -145 171 49 -3 49 -73 -154 -75 -79 90 -103 -106 85 78 -49 2 -84 -25 -48 -175 -184 106 -76
7374 -76 60 85 -107 43 -42 116 231 -4 -143 195 -104 -115 237 -267 -242 -40 -60 26 154 -92 230 -95
$$ packed form
7200E2mr2J36k48K34K4j62J39j12Q5j66J29l1o4P7k50J96K5K17M4j15k29J27k03
7224a91J05K2k2L80j79o9q7j6K5N7j17L48r7k93J55k2o3O2P4k57K56q9j87J48
7248e7R8N0J12m19L11M1k24J46J01k64L25o0j77kQ5P9k17k4L85m23j3L01j40j5
7272aJ19j60k42RL34Nn4j65L46k80J52qq5R9k8J4q1o5N5J18k71R0pm8J19L03l14
7299d6L00j44j41P8o6n8J01q1Lo7l6J23j59M2J84j05j35K2K82k71K87j20l6P8
7323C5k27K84J7k62J97J2jj9P3n3j50J61j40L9j88P5K49l51K21L3J0O9j79l7L18
7348A86j20Q9j94j06L16j22n2N2j22q1P9mJ69j93lJ91pj27N1q6N9k3j27rK90j82
7374g6J36K5j92J50q5J58J15k35j39L38k99j1L52n04K5K02k0Q6J28k46L22l25
$$ plain form
7396 -95 83 326 -53 108 353 -210 52 94 -130 53 44 -158 -47 -106 -29 132 -173 129 -44 -131 -334 49
7418 49 2 235 28 -70 53 -128 60 24 -25 -7 176 37 148 -50 -105 80 -55 -118 70 129 -92 135 25
7441 25 105 -243 37 155 58 -98 33 21 -32 -49 -71 -9 29 148 -10 124 -55 63 161 26 71 41 -30 -73 -50
7466 -50 50 -1 -60 213 -10 -148 -5 220 -155 -120 -100 139 117 68 44 33 -119 -125 37 -12 107 72 79 -52 21
7491 21 124 -90 72 90 -60 -179 226 118 -273 34 77 -36 71 -94 -15 -123 -160 147 -6 -88 67 129
7513 129 15 -71 -11 2 -198 -54 85 -146 51 -21 27 -39 -178 141 -80 205 -27 13 38 -132 144 36 69
7536 69 209 -33 -41 116 -21 -29 0 -59 -161 70 82 384 119 96 247 55 181 178 123 5 176 219 71 72 -251
7561 -251 -18 -206 -86 -26 -219 -132 -1 -108 -167 193 14 277 -88 -222 156 125 8 -185 58 10 96 -367
$$ packed form
7396i5J78K43l79J61K45n63K62M2k24J83rk02J11n9P7J61l05L02j73q7k03L83
7418D9m7K33k07r8J23j81J88l6m9J8J83j39J11j98n5J85j35o3J88N9k21K27j10
7441B5Q0l48K80J18r7j56J31j2n3j7k2O2L8J19j58J34j79J18R8j35M5l0p1m3K3
7466e0J00n1n9K73k23j38J43K25l75L5K0K39k2m9k4j1j52oJ62m9J19l5Pj31P3
7491B1J03k14J62J8j50j19M05j08l91L07M3j13J07j65P9j08l7L07j53q2J55O2
7513A29j14q6O0J3k00J44J39k31J97p2M8o6j39L19k21K85k32M0K5j70K76j08L3
7536F9J40k42qJ57j37qK9n9j02K31J2L02k65k3J51j92J26ln5j18J71M3j48Jl23
7561b51K33j88J20O0j93Q7J31j07n9L60j79K63l65j34L78l1j17j93K43m8Q6m63
$$ plain form
7583 -367 12 34 -53 -38 -38 55 11 72 -75 78 275 28 174 -21 -185 158 -131 148 37 73 40 39 -66 -163
7607 -163 -108 -127 76 -275 182 199 21 187 -96 -59 28 40 -83 -61 -97 62 -80 -73 -271 144 32 189 -216
7630 -216 -245 168 -2 -35 -24 13 -201 232 67 214 94 -47 -8 151 -17 158 -221 -16 63 -137 -91 -11 -149
7653 -149 73 -233 -129 -66 -1 -32 134 -68 -118 55 -129 10 157 -157 -13 146 -15 22 12 177 -28 -119
7675 -119 -114 82 -207 -7 -86 -177 90 272 -183 126 -79 7 72 -146 -25 176 -60 11 344 137 68 48 -40
7698 -40 -85 53 -53 92 -222 -110 90 93 248 110 -37 -7 27 -37 173 31 184 67 -83 -1 -37 29 87 -104
7722 -104 -51 47 310 114 74 -103 -84 54 72 -22 62 4 269 -110 -326 -54 -130 -165 28 -44 -108 161 -100 65
7746 65 13 112 208 -17 60 66 107 -95 6 99 60 86 107 23 -46 -59 50 -54 -160 113 50 -87 32 -153 56
$$ packed form
7583c67L79K2q7J5%R3m4O1j47J53J97k47J46j95j64L43k89K79j11L6l3jj05r7
7607a63N5j9K03l51M57J7j78J66k83L7Q7J2j23K2l6J59j42Pj98M15j12J57m05
7630b16k9M13j70l3J1L7k14M33j65J47j20j41L9J59j68J75l79K05P9k00M6Q0j38
7653a49K22l06J04O3O5l1J66k02n0J73j84J39J47l14J44J59j61L7j0J65k05r1
7675a19NJ96k89K00p9r1K67J82m55L09k05Q6O5k18J21K01k36P1L33k07o9k0q8
7698d0m5J38j06J45l14J12K00LJ55j38j47L0L4o4K10j42J53j17j50Q2l6O6N8j91
7722a04N3R8K63j96m0j77J9J38J8r4Q4n8K65l79k16K72p6l5J93p2o4K69k61J65
7746F5n2R9R6k25P7OM1k02J01R3l9K6K1q4o9j3J09j04j06K73o3j37J19j85K09
$$ plain form
7771 56 -95 16 95 -128 -9 135 -112 -137 216 -256 -2 -20 -41 -144 60 109 13 -28 -16 38 -23 94 318 -144
7795 -144 124 72 -41 170 9 32 46 -90 95 -198 -74 76 -1 -176 -154 7 -117 262 179 -123 -314 237
7817 237 74 22 176 -4 -91 -88 -29 -30 -73 -140 -175 -26 76 -65 13 85 -53 52 66 -203 29 52 -224 128 -161
7842 -161 130 128 267 8 41 85 5 -39 -210 6 10 159 -72 -44 -87 112 23 63 292 326 83 -10 36 189 -32
7867 -32 -85 -230 -260 -6 76 -70 -186 -125 27 120 -28 -56 -101 -66 -155 196 70 9 321 -24 152 135 98 18 27
7892 27 -146 54 143 -140 104 -136 173 8 -76 40 127 209 -41 240 43 -4 -131 16 62 114 113 236 -174
7915 -174 15 -57 -256 247 -118 -147 49 5 163 -51 -114 -105 35 -73 -48 -55 -120 43 72 66 58 -14 306 173 -161
7940 -161 0 134 110 12 10 89 -95 -205 72 -70 163 -196 148 168 2 -57 67 -121 10 -48 133 -27 56
$$ packed form
7771E6j51J11P9k23J19J44k47k5L53m72K54j8k1j03K04M9r6m1J2N4o1J17K24m62
7795a44K68n2j13K11j61K3J4j36J85k93J24J50p7j75K2J61j24L79q3l02j91N51
7817B37j63n2J54j80q7LN9jm3o7l5J49J02j41P8P2j38J05J4k69K32K3k76L52k89
7842a61K91kJ39k59L3M4q0m4j71K16MJ49k31K8m3J99q9M0K29L4k43r3M6J53k21
7867c2n3j45l0K54Q2j46j16O1J52R3j48k8m5L5q9L51j26o1L12l45J76j7l7q0R
7892B7j73K00Q9k83K44k40L09j65q4J16Q7Q2k50K81j97m7j27J47M6N2jJ23m10
7915a74J89p2j99N03l65k9J96m4J58k14o3RJ40j08K5po5J63K9oqp2L20j33l34
7940a61J61J34k4r8kP9j84j10K77j42K33l59L44K0j66n9J24j88J31n8J81j60Q3
$$ plain form
7963 56 106 -127 -25 -32 -74 23 134 -199 -120 52 59 -108 53 -51 46 -74 56 -79 -141 54 -194 -199 26 -216
7987 -216 2 182 -96 22 189 63 -60 -33 110 42 -128 -145 105 -241 74 -82 32 -84 3 6 28 21 17 -43
8011 -43 47 263 -146 173 -20 75 -6 14 220 -152 24 -60 -32 133 -31 3 13 44 22 -84 -7 167 -38 -145
8035 -145 239 125 93 121 -74 13 -65 -179 -13 130 -87 -17 -54 -123 8 124 137 123 -167 -128 36 -16 92 175
8059 175 -152 -48 58 -57 221 -148 -97 11 24 -12 36 119 67 28 127 39 -34 49 -90 -156 -15 -182 152 18
8083 18 -137 -171 84 -17 -68 51 -78 20 -63 84 31 371 -15 16 53 -65 -212 -126 -365 90 -7 170 -40
8106 -40 -101 2 -3 -99 -56 49 40 -41 -54 117 87 -297 -149 -42 -76 145 -56 -117 58 -43 175 165 -74 78 61
8131 61 -241 9 392 -143 141 -2 -97 132 -156 138 -244 -12 -24 118 -217 80 -33 96 58 -169 4
$$ packed form
7963E6N0k33J02pm2R7J11l33P9J72Pj67J61j04R7j20J30j35o2J95k48nK25k42
7987b16K18J80k78J18J67j26j23K7J43o8j70j7K50l46L15j56J14j16Q7LK2pmo0
8011d3R0K16m09L19j93R5q1K0K06l72J76q4K8J65j64L4J0L1k2j06P7J74k05j07
8035a45L84j14l2K8j95Q7p8j14J66J43k17P0l7o9J31J16J3j4k90L9J64n2J08Q3
8059A75l27J04J06j15K78l69N1J08J3l6M8Q3n2l9R9q8p3Q3j39o6J41j67L34j34
8083A8j55l4K55j01n1J19j29R8q3J47n3L40l86L1L7j18j47Q6k39M55r7J77k10
8106d0o1J03nr6M3J05rq1j3J71l0l84J48J07l4K21k01o1J75j01K18j0k39J52j7
8131F1l02K50L83n35K84j43r5K29k88K94l82K32j2J42l35K97j13J29l8k27J73
$$ plain form
8152 4 113 120 -24 33 -91 62 103 -102 -235 -232 -60 119 -12 -28 8 -39 -38 176 -14 66 -144 -91 -80 297 -248
8177 -248 106 240 81 30 -6 176 -34 64 -165 -18 -177 -100 -23 -107
$$ packed form
8152DJ09Pj44N7j24J53M1k05j33LJ72J79j31j6L6m7JK14j90Q0k10N3J1L77n45
8177b48L54J34j59n1l6J82k10R8k29J47j59P7P7q4
8191a07
$$ Imaginary data points
##PAGE= N=2
##DATA TABLE= (X++(I..I)), XYDATA
$$ plain form
0 0 0 0 0 0 0 0 0 0 0 0 8 -8 8 -8 16 -16 24 -24 32 -40 48 -56 64 -73 88 -104 120 -137 161 -185 209 -239
32 -239 271 -306 346 -391 440 -492 551 -615 681 -758 840 -932 1031 -1138 1256 -1386 1527
49 1527 -1682 1853 -2043 2251 -2483 2743 -3036 3371 -3753 4198 -4722 5350 -6117 7086 -8343
64 -8343 10053 -12528 16442 -23588 40868 -175484 -40275 336296 25136 -172910 -54051
75 -54051 110985 24506 -44152 -16825 6922 -24579 42383 76935 7229 -104721 -80453 87337
87 87337 135919 -72549 -145311 21376 103923 6060 -59871 -26693 7972 -15554 15011 46888
99 46888 -33567 -60818 54998 83029 -22504 -77474 -8760 50794 12579 -5759 22222 -26208
111 -26208 -47105 32948 44232 -27479 -51209 -5940 58601 38221 -54495 -56437 28806 51421
$$ packed form
0@%%%%%%%%%%Qj6J6j6K4l2M0m8N6p2Q8j04J20j37J61j92K24k57K98l46L94m48
32b39N10n77O52p37Q31r32J043j166J296j439J598j772J963k169K394k642K913
49A527l209L535l896M294m734N226n779O407p124P951q920J0072j1467J3203j5429
64h343J8396k2581K8970m0030O4456k16352J35209L76571l11160j98046J18859
75e4051J65036q6479o8658K7327K3747l1501O6962L4552o9706j11950K4268J67790
87H7337M8582k08468p2762J66687Q2547r7863o5931L3178L4665k3526L0565L1877
99D6888q0455k7251J15816K8031j05533n4970O8714N9554l8215j8338K7981m8430
111b6208k0897Q0053J1284p1711k3730M5269O4541k0380r2716j942Q5243K2615
$$ plain form
123 51421 -9960 -31549 29525 22985 -45049 13314 70415 -30605 -68567 35235 64922 -17165
135 -17165 -59617 -3406 37388 -7094 -26267 7947 11218 -2632 -3587 9849 22467 -19310 -37845
148 -37845 34378 51763 -20002 -37987 12793 35945 -5854 -32404 12606 19708 -23287 -4394
160 -4394 21084 -12116 -28446 -3453 18027 4383 -15804 8012 19509 -6210 2897 13847
172 13847 -8973 -10344 2799 15341 21951 -10664 -25669 7436 13323 -12574 -18728 5609 17398
185 17398 -16485 -17840 23572 -2578 -36974 10666 38572 2475 -21037 -4118 24283 15565
197 15565 -9141 -4075 -4050 -6586 11573 5980 -10582 -14415 -15208 10297 20181 -21432 -28109 14974
211 14974 31759 4818 -27823 -11449 23375 11977 2126 8167 -12002 -9314 19915 11192 -17572
$$ packed form
123E1421o1381k1589O1074o540o8034N8363N7101j01020l7962J03802K9687q2087
135a7165m2452N6211M0794m4482j9173L4214L271j3850r55J3436J2618m1777j8535
148c7845P2223J7385p1765j7985N0780K3152m1799k6550M5010P102m2995J8893
160d394K5478l3200j6330K4993K1480j3644k0187K3816J1497k5719R107J0950
172A3847k2820j371J3143J2542O610l2615j5005L3105N887k5897o154K4337J1789
185A7398l3883j355M1412k6150l4396M7640K7906l6097k3512J6919K8401q718
197A5565k4706N066K5k536J8159n593j6562l833p93K5505R884m1613o677M3083
211A4974J6785k6941l2641J6374L4824j1398r851O041k0169K688K9229q723k8764
$$ plain form
224 -17572 -24239 2951 26293 -4428 -30293 -7076 8704 9171 2084 -11335 2492 13179 -59
237 -59 4996 6567 -7922 -2107 8561 7399 -5415 -16384 7303 15616 -15468 -12685 6325 -2871
251 -2871 -4868 -460 649 1735 -7394 -1088 11936 -672 -2391 7938 4347 4825 -2423 -7141 8293
266 8293 1060 -11850 3019 3507 -7887 -6887 -2513 5022 -3060 -13161 6118 8315 -7965 919
280 919 6194 925 2712 -1100 3773 7158 -5007 858 7701 -4114 -4399 -3395 -2554 3078 -8278
295 -8278 -7815 7967 -1683 -7169 3291 1391 1994 1871 237 7421 -516 -4339 9218 1837 -6151
310 -6151 2477 253 1788 1305 -8304 136 3640 -6441 -1882 -991 -3598 1928 -1377 1960 5411
325 5411 -5551 2756 11597 -1424 -1856 2831 1306 4824 -2157 -4521 3862 -1753 -2383 1866 -6317
$$ packed form
224a7572o667K7190K3342l0721k5865K3217J5780M67p087j3419J3827J0687j3238
237e9N055J571j4489N815J0668j162j2814j0969K3687Q313l1084K783J9010r196
251b871j997M408J109J086r129O306J3024j2608j719J0329l591M78p248m718J5434
266H293p233j2910J4869M88j1394J000M374P535q082j0101J9279K197j6280Q884
280I19N275n269J787l812M873L385j2165N865O843j1815k85J004Q41N632j1356
295h278M63J5782r650n486J0460j900O03j23j634P184p937l823J3557p381p988
310f151Q628k224J535m83r609Q440L504j0081M559Q91k607N526l305L337L451
325E411j0962Q307Q841j3021m32M687j525L518o981k364Q383n615o30M249q183
$$ plain form
340 -6317 -1821 2207 -3868 1495 -355 -4113 6110 3233 -3015 3852 3598 4727 3359 -4054 4007
355 4007 4646 -5257 1340 656 -6543 -587 -1713 -2887 -68 -5375 244 5262 -2122 877 1924 230
371 230 8898 3084 -3836 4234 1692 -140 4474 -2784 -3272 -50 -1362 1612 -5083 -8337 3074
386 3074 -244 -4668 2514 -2259 -866 7485 1782 74 1822 -386 4818 3479 -850 1136 -4877
401 -4877 -2611 4430 -3739 -4203 -847 -5944 1360 4125 -6936 -5793 467 4727 6068 -3949 -3434
416 -3434 5856 3617 4413 910 -7497 1199 6141 -312 -1484 -6978 -5615 4375 -110 -5519 -4456
431 -4456 -4165 5784 6085 -6384 -3087 1712 1684 6029 2627 -202 1081 -2522 3586 4912 -6929 -5043
447 -5043 263 1883 7109 -5039 -16562 -1120 9227 2247 -6591 -6800 6481 9695 -432 -1839
$$ packed form
340f317M496M028o075N363j850l758J0223k877o248O867k54J129j368p413Q061
355D007O39r903O597o84p199N956j126j174K819n307N619N018p384K999J047j694
371B30Q668n814o920Q070k542j832M614p258m88L222j312K974o695l254J1411
386C074l318m424P182m773J393Q351n703j708J748k208N204j339m329J986o013
401d877K266P041q169m64L356n097P304K765j1061J143O260M260J341j0017N15
416c434R290k239P96l503q407Q696M942o453j172n494J363R990m485n409J063
431d456K91R949L01j2469L297M799k8M345l402k829J283l603O108J326j1841J886
447e043N306J620N226j2148j1523J5442J0347o980q838k09J3281L214j0127j407
$$ plain form
461 -1839 -3323 378 10392 1907 -4925 4138 -661 -5040 2702 270 -6328 -6644 455 9244 422
476 422 -9080 -2179 -435 2470 4720 -4234 452 9906 2262 222 1756 -4410 -3360 1385 6835
491 6835 5833 -9989 -8643 7185 3070 -6470 -10139 -5920 10067 10814 -3298 -4852 -992 2708
505 2708 3661 -3524 2374 8963 -727 1314 6659 -5425 -9874 -3954 3644 8478 -681 -8021 -5197
520 -5197 -697 6601 -265 -14046 465 14273 4886 870 -1608 -5843 2399 7535 2867 -4244
534 -4244 -5846 6535 8877 -5950 -9748 -7638 -940 11762 1428 -12326 -434 6654 776 -1836
548 -1836 -992 2741 -45 259 13093 5290 -11701 -4369 4840 3502 20 -7986 -4336 7602 4903
563 4903 -4456 -12299 -6521 9732 5744 -3956 3101 -86 -3771 6514 4928 -3788 -3472 2394 9615
$$ packed form
461a839j484L701J0014q485o832R063m799m379P742k432o598l16P099Q789q822
476D22r502O901J744K905K250q954M686R454p644k040J534o166J050M745N450
491F835j002j5822J346J5828m115r540l669M219J5987P47j4112j554L860L700
505B708R53p185N898O589r690K041N345j2084m449N920P598M834r159p340K824
520e197M500P298o866j3781J4511J3808r387m016k478m235Q242N136m668p111
534d244j602J2381K342j4827l798K110O698J2702j0334j3754J1892P088n878k612
548a836Q44L733k786L04J2834p803j6991P332R209j338l482q006L650J1938k699
563D903r359p843N778J6253l988r700P057l187l685J0285j586q716L16N866P221
$$ plain form
578 9615 4100 -6745 -6259 -4259 3324 7202 -9172 -9733 8701 4980 -5245 -4135 -2876 552 3746
593 3746 4944 5088 -2207 -3136 3559 1875 2900 -14 -10500 551 13823 13 -12460 -6546
607 -6546 3768 4436 -6810 -5866 5253 3135 1797 1504 -5832 -1928 4991 2586 4786 3519 -2064
622 -2064 -2191 -1634 1658 350 -6335 971 5317 -5047 -2328 782 -6608 -1588 5651 1718 -1874
637 -1874 -806 4207 2513 -2467 2784 909 -4859 5931 6672 -5916 -2695 858 -3454 -630 89
652 89 -2887 -2160 1411 4209 -3098 -5922 3955 942 -2865 7549 4460 -5128 938 5138 104 -4546
668 -4546 -3085 4499 2524 -1987 719 -4695 -6733 2549 938 -3254 1650 2078 1585 1343 -1562 -1502
684 -1502 -1178 4216 9097 -1705 -4301 5452 -345 -5490 1229 303 -3293 -16 2353 -640 -5815
$$ packed form
578I615n515j0845M86K000P583L878j6374n61J8434l721j0225J110J259L428L194
593C746J198J44p295r29O695j684J025k914j0486J1051J3272j3810j2473N914
607f546J0314O68j1246R44J1119k118j338k93p336L904O919k405K200j267n583
622b064j27N57L292j308o685P306M346j0364K719L110p390N020P239l933l592
637a874J068N013j694m980N251j875n768J0790P41j2588L221L553m312K824P19
652H9k976P27L571K798p307k824R877l013l807J0414l089r588O066M200n034m650
668d546J461P584j975m511K706n414k038R282j611m192M904M28m93k42k905O0
684a502L24N394M881j0802k596R753n797n145O719r26l596L277K369k993n175
$$ plain form
699 -5815 -1321 4300 -3311 -2088 5359 -925 -343 6930 513 -2748 1951 1183 -622 -550 2576 1481
715 1481 -4445 119 2034 -7479 -3331 4508 -1835 -1434 3686 245 -1702 -1177 1084 2252 -671 4006
731 4006 4965 -3301 590 2717 -5396 -1425 3519 -610 -1375 -886 -1231 -1541 -2933 1503 674 -3830 3740
748 3740 4421 -4151 985 4569 -1010 467 2063 1093 572 -611 1197 -1498 -4285 2452 -44 -6172
764 -6172 1257 2159 -3824 183 1081 -1391 260 1415 2773 346 -905 4639 1058 -3170 3341 721
780 721 -4064 1693 536 -3233 -1517 -1017 -374 -2101 -2292 2353 -776 -1640 4170 -694 -2666 4817
796 4817 2107 -1297 2002 1245 709 -834 -1134 1444 -2071 -1941 2481 -3183 -3609 2437 -1859 -2466 2317
813 2317 -296 -676 756 1295 2006 -936 501 4321 -1147 -962 3270 -1895 -1168 2030 -2223 -1962 -432
$$ packed form
699e815M494N621p611J223P447o284N82P273o417l261M699p68j805P2L126j095
715A481n926M564J915r513M148P839o343M01N120l441j947N25K261J168k923M677
731D006R59q266L891K127q113L971M944m129p65M89l45l10j392M436q29m504P570
748C740O81q572N136L584n579J477J596r70n21j183J808k695k787O737k496o128
764f172P429R02n983M007Q98k472J651J155J358k427j251N544l581m228O511k620
780G21m785N757j157l769J716N00O43j727j91M645l129q64N810m864j972P483
796D817k710l404L299p57n36j543l00K578l515J30M422n664m26O046m296o07M783
813B317k613l80J432N39P11k942J437L820n468J85M232n165P27L198m253K61J530
$$ plain form
830 -432 -1293 -249 -2154 -1000 1341 -1765 700 2955 -2462 678 4715 -387 215 1516 114 1329
846 1329 -88 -101 592 -3131 -111 1155 -4294 -1107 1011 -2355 557 718 -1596 1374 859 655 1554
863 1554 -227 2269 1787 -1871 2657 1624 -3902 229 1043 -1469 -226 -1996 -1610 613 -1368 114
879 114 -430 -1973 2932 2273 -1838 1466 787 1029 3584 -695 -1544 1454 473 350 -756 -1945 738
896 738 -1636 -2946 1600 -1042 -2895 886 327 1008 369 -2259 1730 2990 99 1858 127 -918
912 -918 2236 -188 -634 240 -2890 -211 2209 -2223 -2796 -1951 -102 2666 -1571 -2383 2358 858 922
929 922 2224 -1378 709 2325 -98 1505 566 -1322 275 -1537 -858 225 -3713 -1556 1758 42
945 42 691 -1545 -3585 2777 3146 -1060 -126 993 3141 2451 -2099 -318 647 -1291 1714 1256 -2406
$$ packed form
830d32q61J044j905J154K341l106K465K255n417L140M037n102O02J301j402J215
846A329j417j3O93l723L020J266n449L187K118l366K912J61k314K970n15k04Q99
863A554j781K496m82l658M528j033n526M131Q14k512J243j770L86K223j981J482
879A14n44j543M905o59m111L304o79K42K555m279q49K998r81j23j106j189K683
896G38k374j310M546k642j853L781n59O81o39k628L989J260k891J759j731j045
912i18L154k424m46Q74l130K679K420m432n73Q45J849K768m237q12M741j500O4
929I22J302l602K087J616k423J603r39j888J597j812O79J083l938K157L314j716
945D2O49k236k040O362L69m206R34J119K148o90m550J781R65j938L005m58l662
$$ plain form
962 -2406 -747 -1663 -593 1571 -4063 -3354 2992 2275 344 -891 -612 2701 342 -1336 2903 1458
978 1458 -70 1132 -547 858 -782 -5382 234 3892 -1007 -2767 -2366 45 2574 -2019 -2995 1336
994 1336 1635 3158 1573 -2508 1499 2099 -1261 823 127 -199 1556 -1449 -763 615 -4458 -2681
1010 -2681 1619 592 539 -2024 -1307 3407 322 -1974 922 692 2004 2562 -329 1698 -768 -4819
1026 -4819 1810 3137 -2819 -2080 546 1707 -807 -5155 -1370 2170 108 1647 176 -1415 2705
1041 2705 686 -1806 2817 278 -1280 2731 2021 -268 -2598 -2908 925 -742 -1929 2128 -871
1056 -871 -2163 2335 -1182 -3314 496 1403 3205 2168 -886 907 211 -588 2280 -645 -1818 1552
1072 1552 -260 274 -93 -4466 -1914 1501 -354 -1026 -835 2111 3376 -3256 -1516 3978 -673 -1487
$$ packed form
962b406J659r16J070K164n634P09O346p17j931j235K79L313k359j678M239j445
978A458j528J202j679J405j640m600N616L658m899j760M01K411K529m593r76M331
994A336K99J523j585m081M007O00l360K084o96l26J755l005O86J378n073J777
1010b681M300j027n3k563P17M714l085k296K896k30J312N58k891K027k466m051
1026d819O629J327n956P39K626J161k514m348L785L540k062J539j471j591M120
1041B705k019k492M623k539j558M011p10k289k330l10L833j667j187M057k999
1056h71j292M498l517k132L810R07J802j037l054J793o96p99K868k925j173L370
1072A552j812N34l67m373K552L415j855o72J91K946J265o632J740N494m651q14
$$ plain form
1088 -1487 4155 2851 -298 -2269 -1313 1518 -899 -1766 746 -930 1127 1135 -5085 -1662 2359 -1267
1104 -1267 331 2408 617 561 930 951 -315 -2496 2531 3748 -1746 999 1489 -4631 -2352 903
1120 903 -466 -257 -383 882 487 -2503 -729 195 -1274 3072 2371 -1420 2570 2164 -2678 -530 590
1137 590 -789 -669 1133 3158 -2118 -5110 1407 -97 -4812 1055 2620 -963 841 1916 475
1152 475 -1045 -1236 2076 1062 -240 3442 391 -1642 1673 -2473 -4428 1110 474 -1607 1199 1776
1168 1776 -934 -4366 -1259 3280 -1160 -1248 5431 1938 -1973 1153 -124 -1358 443 1198 1394 -484
1184 -484 -346 711 -3277 -2463 1298 -1920 -938 3067 -890 -1098 2313 297 -1506 141 2875 1839
1200 1839 -2129 2301 4098 -3783 -2646 2778 -1143 -2030 1085 8 -1369 -1379 -450 -256 -1983 1112
$$ packed form
1088a487N642j304l149j971R56K831k417q67K512j676K057Qo220L423M021l626
1104a267J598K077j791n6L69K1j266k181N027J217n494K745M90o120K279L255
1120I03j369K09j26J265l95k990J774R24j469M346p01l791L990m06m842K148J120
1137E90j379J20J802K025n276k992O517j504m715N867J565l583J804J075j441
1152D75j520j91L312j014j302L682l051k033L315m146j955N538o36k081K806N77
1168A776k710l432L107M539m440q8O679l493l911L126j277j234J801P55J96j878
1184d84J38J057l988Q14L761l218R82M005l957k08L411k016j803J647K734j036
1200A839l968M430J797p881J137N424l921q87L115j077j377j0R29J94j727L095
$$ plain form
1216 1112 2013 -1527 1808 2455 -2577 853 2514 -1653 146 2846 642 -1863 -1510 1569 -1017 -4307
1232 -4307 1743 2386 -3772 -475 1669 -2062 -816 1110 906 891 328 1601 584 -845 1942 252
1248 252 -2493 2372 684 -3176 866 769 -2718 -1749 277 447 -1772 -786 3431 -482 -2625 3370
1264 3370 1803 -2476 1866 1776 -794 992 577 57 -1296 -1437 766 -1391 -1181 1874 -2155 -2698 2587
1281 2587 -977 -2496 2449 2071 -633 -206 1707 1818 -1755 15 3774 -1108 -1922 2312 -954 -2149
1297 -2149 754 -626 -1150 -444 -285 -181 -1106 43 1705 -1547 600 3298 -1520 51 3072 -714
1313 -714 -1112 1572 1043 -994 -1691 777 722 -3383 -146 1589 -2862 -967 1790 -1231 -379 1549 77
1330 77 81 283 1289 659 -989 1811 1378 -2410 883 1092 -3018 -221 1414 -2217 -978 133 139 -1077
$$ packed form
1216A112R01l540L335O47n032L430J661m167J799K700k204k505L53L079k586l290
1232d307O050O43o158L297K144l731J246J926k04j5n63J273j017j429K787j690
1248B52k745M865j688l860M042r7l487R69K026J70k219R86M217l913k143N995
1264C370j567m279M342r0k570J786m15n20j353j41K203k157K10L055m029n43N285
1281B587l564j519M945l78k704M27J913J11l573J770L759m882q14M234l266j195
1297b149K903j380n24P06J59J04r25J149J662l252K147K698m818J571L021l786
1313g14l98K684n29k037o97K468n5m105L237J735m451J895K757l021Q52J928j472
1330G7MK02J006o30j648K800m33l788L293K09m110K797J635l631J239J111Oj216
$$ plain form
1348 -1077 -1610 1743 781 -1346 2122 1326 -1994 1433 1748 -823 508 781 -248 -480 -718 365 -1067
1365 -1067 -2001 1313 -435 -2662 1019 14 -1980 1080 1106 -488 221 957 1733 -371 -747 2163 -188
1382 -188 -1400 1719 -498 -1954 982 -91 -1582 -650 -465 -80 -864 -211 1559 -869 -369 2682 -145
1399 -145 -726 2089 -242 -436 1505 546 -328 -999 -277 384 -1768 -991 1109 -1689 -632 1408 -1544
1416 -1544 -833 1516 564 373 333 970 1669 -615 491 1757 -1154 69 1364 -1482 -567 518 -1696
1433 -1696 -592 -146 -579 -390 -1219 762 1322 -1139 816 1458 -892 1356 1814 -652 526 641 -221
1450 -221 245 -1150 -584 -191 -1113 465 -174 -2235 636 712 -1472 336 312 485 1481 -56 454 1078
1468 1078 -509 559 355 -485 1602 -418 -2009 825 35 -1536 -674 -853 827 679 -1714 317
$$ packed form
1348a077n33L353r62k127L468p96l320L427L15k571J331K73j029k32k38J083j432
1365a067r34L314j748k227L681j005j994L060K6j594P09P36P76k104l76K910k351
1382a88j212L119k217j456K936j073j491R32J85L85p84O53J770k428N00L051k827
1399a45n81K815k331j94J941r59q74o71P22O61k152P77K100k798J057K040k952
1416a544P11K349r52j91m0O37O99k284J106J266k911J223J295k846R15J085k214
1433a696J104M46m33J89q29J981N60k461J955O42k350K248M58k466J178J15q62
1450b21M66j395N66L93r22J578o39k061K871P6k184J808k4J73R96j537N10O24
1468A078j587J068k04q40K087k020j591K834p90j571Q62j79J680j48k393K031
$$ plain form
1484 317 923 -415 709 75 -115 2217 665 -399 464 -268 -129 -394 -783 1121 -522 -1740 439
1501 439 -496 -1219 110 -929 160 1445 -480 70 1170 183 520 -146 157 1770 -221 59 1225
1518 1225 -975 -1128 -616 -1131 842 146 -2101 597 682 -1286 -234 -386 857 1807 270 679 657 -320
1536 -320 1035 -68 -671 1488 -166 -1198 1055 -639 -1403 -575 -1159 -175 562 283 1156 -429 -883
1553 -883 1183 -531 -480 1703 1223 1025 791 -1471 -287 122 -1186 -2 -176 -320 763 -918 -1312
1570 -1312 -275 -1263 -256 973 224 1329 1119 -155 187 -1097 -97 1581 -443 456 2412 -956
1586 -956 -2167 -451 -569 -697 -749 -82 1067 -452 -316 663 -1071 -287 881 -458 1832 2242 -700
1603 -700 62 499 -738 -1066 -552 951 912 -1327 -104 37 -2189 -775 -196 -1140 1114 1142 -89 365
$$ packed form
1484C17O06j338J124o34j90K332j552j064Q63p32J39k65l89J904j643j218K179
1501D39r35p23J329j039J089J285j925N50J100r87L37o66L03J613j991K80J166
1518A225k200j53N12n15J973o96k247K698Q5j968J052j52J243R50j537M09k2r77
1536c20J355j103o03K159j654j032K253j694p64Q28n84R84P37k79Q73j585m54
1553h83K066j714N1K183m80j98k34k262J184M09j308J184j74j44J083j681l94
1570a312J037r88J007J229p49J105k10j274L42j284J000J678k024Q99J956l368
1586i56j211J716j18j28n2O67J149j519J36R79j734P84J168j339K290M10k942
1603g00P62M37j237l28N14J503l9k239J223J41k226J414N79r44K254K8j231M54
$$ plain form
1621 365 123 54 27 -288 1427 1094 -287 701 -98 -1806 -158 -730 -1186 708 463 -186 -814 -1481 606
1640 606 103 -816 1753 1289 -501 1218 410 -631 252 173 225 318 -214 419 -622 -1424 109 -1334 -1152
1659 -1152 1234 74 -396 1174 21 -1161 120 535 857 238 817 1991 -679 -1058 953 -808
1675 -808 -1014 725 -376 -585 137 -1022 -773 -586 -384 357 -551 999 2021 -635 54 1084 -900
1692 -900 -149 1499 -52 234 33 -483 -313 -1841 -192 617 -1257 108 1109 -1186 -441 409 -397
1709 -397 193 842 787 850 172 530 219 -1225 552 416 -1571 542 614 -1797 -575 80 -705 -510 -408
1728 -408 982 -40 -1026 902 496 -1056 1224 802 -765 1133 736 -573 -3 -143 -208 -389 -448 729
1746 729 -763 -1167 940 -751 -1498 1136 456 -589 739 959 593 -478 -15 1067 -223 -479 1365
$$ packed form
1621C65k42o9k7l15J715l33j381R88p99j708J648n72m56J894k45o49o28o67K087
1640F06n03r19K569m64j790J719q08j041Q83p9N2R3n32O33j041q02J533j443J82
1659a152K386j160m70J570j153j182J281M15L22o19N79J174k670l79K011j761
1675h08k06J739j101k09P22j159K49J87K02P41r08J550J022k656O89J030j984
1692i00P51J648j551K86k01n16J70j528J649Q09j874J365J001k295P45Q50q06
1709c97N90O49n5O3o78L58l11j444J777j36j987K113P2k411J222O55p85J95J02
1728d08J390j022r86J928m06j552K280m22j567J898l97j309N70j40o5j81n9J177
1746G29j492m04K107j691p47K634o80j045J328K20l66j071M63J082j290k56J844
$$ plain form
1763 1365 -453 -1001 865 -771 -1486 235 -277 -390 84 302 179 -1057 105 1205 -830 254 2522
1780 2522 -116 -699 1006 -121 -978 154 260 -18 -1050 -329 270 -1697 -815 890 -1182 -170 1492
1797 1492 -255 -14 1010 60 -38 499 841 122 -996 785 982 -1743 -196 1040 -1536 -953 365
1814 365 -549 -545 -108 262 -218 -775 1122 832 -873 1263 1438 -1340 630 1111 -761 -69 538 236 -473
1833 -473 -839 509 -622 -1628 847 194 -1603 803 1040 -1065 393 1125 248 20 439 1034 -191
1850 -191 -936 1062 -22 -1022 854 -311 -1510 576 276 -1269 -9 740 500 -587 -300 1449
1866 1449 -403 -433 1719 -128 -853 1221 529 -524 94 197 -150 -722 -82 382 -973 -699 907 -901
1884 -901 -811 1232 -197 -572 1270 471 -182 17 602 575 -940 214 1320 -1261 -538 1183 -1420 -1314
$$ packed form
1763A365j818n48J866j636p15J721n12j13M74K18j23j236J162J100k035J084K268
1780B522k638n83J705j127q57J132J06k78j032P21N99j967Q82J705k072J012J662
1797A492j747K41J024r50r8N37L42p19j118J781J97k725J547J236k576N83J318
1814C65r14MM37L70m80n57J897k90j705K136J75k778J970M81j872O92O07l02p09
1833d73l66J348j131j006K475o53j797K406K37k105J458P32q77k28M19N95j225
1850a91p45J998j084j000J876j165j199K086l00j545J260P49k40j087K87J749
1866A449j852l0K152j847p25K074o92j053O18J03l47n72O40M64j355K74J606j808
1884i01R0K043j429l75J842p99o53J99N85k7j515J154J106k581P23J721k603J06
$$ plain form
1902 -1314 550 -327 -750 -266 229 -119 -648 742 702 -977 1095 1607 -1053 210 1185 -632 -119 418
1920 418 -182 -498 -460 345 -145 -1256 586 406 -1548 248 996 -779 136 810 158 446 163 646 102
1939 102 -647 1062 103 -1040 426 569 -1300 -291 225 -684 -288 157 9 -699 -312 1431 63 -586
1957 -586 1662 716 -841 1100 609 -650 169 26 -159 61 -295 239 -918 -805 929 -812 -1065 1423
1975 1423 -161 -666 781 624 -169 323 284 637 -311 -1 935 -575 -460 368 -1063 -661 784 -463
1993 -463 -908 234 179 -54 -895 -88 1183 -226 139 1394 -286 266 918 -753 3 705 20 -151
2011 -151 -620 -32 76 -1704 -447 846 -789 358 1006 -769 118 767 -237 124 650 537 371 -373
2029 -373 642 125 -1377 358 546 -1314 -10 272 -511 -145 -391 -385 155 -536 419 676 20 972 -170
$$ packed form
1902a314J864q77m23M84M95l48n29J390m0j679K072N12k660J263R75j817N13N37
1920D18o00l16L8Q05m90j111J842j80j954J796P48j775R15O74o52K88k83M83n44
1939A02p49J709r59j143J466J43j869J009N16r09L96M45j48p08L87J743j368o49
1957e86K248r46j557J941m91j259Q19j43j85K20l56N34j157J13J734j741k53K488
1975A423j584n05J447j57p93M92l9L53r48L10R36j510J15Q28j431M02J445j247
1993d63m45J142n5k33q41Q07J271j409L65J255j680N52O52j671P56P02o85j71
2011a51m69N88J08j780J257J293j635J147O48j775Q87O49j004L61N26j13j66p44
2029c73J015n17j502J735J88j860J304K82p83L66k46ON40o91R55K57o56R52j142
$$ plain form
2048 -170 -853 1106 690 -611 458 530 -225 -440 -886 12 -435 -958 427 212 -761 550 -3 -913 46
2067 46 150 303 871 480 735 180 -263 400 -504 -538 1057 -40 -754 589 -811 -1109 -11 -372 155
2086 155 208 161 852 -221 -237 834 -256 -339 872 234 298 316 -504 -261 -247 -783 24 -160 -420 350 -643
2107 -643 -363 358 -808 290 833 236 641 289 163 380 -439 -156 1017 -456 -34 742 -279 -550
2125 -550 -415 -816 237 -270 -106 616 -326 2 312 -340 325 790 -25 731 469 -268 474 -113 -490 67
2145 67 -540 -17 215 -716 -92 120 -870 45 414 86 473 194 164 276 -605 71 1231 217 371 491
2165 491 -310 134 -647 -702 425 -191 -218 336 -392 183 164 -880 46 657 -92 491 700 166 422 -312
2185 -312 83 70 -623 460 576 -594 -203 -153 -864 111 -216 -149 512 -118 203 334 -563 374 233 54
$$ packed form
2048a70o83J959m16j301J069P2p55k15m46Q98m47n23J385k15r73J311n53r10R59
2067D6J04J53N68l91K55n55m43O63r04l4J595j097p14J343j400k98J098l61N27
2086A55N3m7O91j073j6J071j090q3J211o38O4J8q20K43J4n36Q07j84k60P70r93
2107f43K80P21j166J098N43n97M05l52j26K17q19K83J173j473M22P76j021k71
2125e50J35m01J053n07J64P22r42L28L10o52O65M65q15P56k62p37P42n87l77N57
2145F7o07N23K32r31O24K12r90R15L69l28L87k79l0J12q81O76J160j014J54J20
2165D91q01M44p81n5J127o16k7N54p28N75j9j044R26O11p49N83K09n34K56p34
2185c12L95j3o93J083J16j170L91N0p11R75l27O7O61o30L21J31q97R37j41j79
$$ plain form
2205 54 926 533 -221 581 -132 -914 49 -361 51 -36 -327 336 -392 -1260 434 -98 -536 672 531 191
2225 191 373 -53 50 -101 -221 686 164 -217 483 -438 -900 159 -638 -550 414 149 -151 -113 -133 384 -599
2246 -599 -112 1275 129 -44 1280 -129 -329 265 -464 -170 175 -251 191 -453 -406 291 -801 -197 788
2265 788 -685 100 785 -288 138 297 -67 297 42 584 835 -710 -203 426 -1316 -441 346 -881
2283 -881 -369 187 -223 -324 -346 156 551 -372 828 634 -301 718 661 -664 167 534 -302 -43 -14 -15 -218
2304 -218 -577 253 101 -785 307 300 -832 326 673 -165 309 187 393 393 -87 474 32 -448 687 -248
2324 -248 -1114 434 -22 -1131 -97 96 -378 -303 9 392 -134 -308 948 -8 -439 1029 300 -814
2342 -814 372 251 -232 -329 -370 -103 -675 -400 385 -528 -631 780 -332 -382 1017 29 -242 416 247 174
$$ packed form
2205E4Q72l93p54Q02p13p82R63m10M12q7k91O63p28q68J694n32m38J208j41l40
2225A91J82m26J03j51j20R07n22l81P00r21m62J059p97Q8R64k65l00L8k0N17r83
2246e99M87J387j146j73J324j409k00N94p29K94L45m26M42o44M7O97j092O04R85
2265G88j473P85O85j073M26J59l64L64k55N42K51j545N07O29j742Q75P87j227
2283h81N12N56m10j01k2N02L95r23J200j94r35J019n7j325Q31L67q36K59K9jk03
2304b18l59Q30j52q86J092pj132J158L47q38M74j22K06%m80N61m42m80J135r35
2324b48q66J548m56j109J034J93m74P5L12L83n26j74J256r56m31J468p29j114
2342h14J186j21m83r7m1K67n72K75P85r13j03J411j112n0J399r88k71O58j69p3
$$ plain form
2362 174 96 155 830 -670 -192 842 -459 -320 558 -600 -584 85 -497 -225 47 399 57 -393 305 957
2382 957 -488 97 974 -420 -88 607 -265 -158 166 178 -170 -557 319 -60 -1127 23 684 -699 16
2401 16 536 -314 10 680 233 97 -45 663 -12 -735 501 75 -983 361 432 -1004 -26 117 -135
2420 -135 -189 3 412 -194 125 590 71 -386 810 258 -659 422 308 -632 -359 202 116 -471 -364 190
2440 190 -515 -676 821 34 -576 864 154 -514 470 405 227 -66 290 495 -539 -185 641 -303 -607
2459 -607 603 -248 -586 26 -67 -276 -163 -83 141 -131 418 683 -519 8 1192 -541 -467 722 -57
2478 -57 -243 64 -169 -41 -413 -104 130 -831 141 725 -595 -104 669 -596 40 687 291 140 298 329
2498 329 180 -637 241 206 -808 76 246 -604 -92 25 -643 -115 -65 379 -121 -149 621 385 -687 587
$$ packed form
2362A74p8N9O75j500M78J034j301J39Q78j158J6O69n82K72K72L52l42m50O98O52
2382I57j445N85Q77j394L32O95q72J07L24J2l48l87Q76l79j067J150O61j383P15
2401A6N20q50L24O70m47j36j42P08o75p23J236m26j058J344P1j436R78J43k52
2420a35n4J92M09o06L19M65n19m57J196n52r17J081j14r40K73N61q6n87J07N54
2440A90p05j61J497p87o10J440p10o68R84o5j78k93L56K05j034L54Q26r44l04
2459f07J210q51l38O12r3k09J13Q0K24k72N49K65j202N27J184j733P4J189p79
2478e7j86L07k33J28l72L09K34r61R72N84j320M91P73j265O36O47l96j51J58L1
2498C29j49q17Q78l5j014Q84J70q50N12J17o68N28N0M44n00k8P70k36j072J274
$$ plain form
2518 587 359 -618 345 332 -107 -34 -16 -116 -423 -426 388 -63 -933 454 187 -884 211 265 -450 535 619
2539 619 351 158 63 286 -101 -418 757 -44 -604 551 -222 -799 317 -89 -582 -84 545 633 25 -313
2559 -313 641 214 -169 406 5 198 760 -75 -379 36 -370 -199 -419 -199 381 -168 -585 272 -415 -206
2579 -206 645 142 15 587 111 -3 -57 82 620 -294 12 802 -185 -127 116 -699 -264 -30 -216 208 219
2600 219 -145 237 -306 -8 262 -217 503 604 -235 -15 279 -285 -145 -207 7 258 -114 -188 126 -404 -41
2621 -41 62 -183 446 372 -54 217 52 -176 -48 -27 424 580 94 79 -175 -567 225 -232 -651 63 81 -252
2643 -252 -69 -365 -142 -68 -29 367 283 173 291 -90 7 109 -168 -86 380 22 -59 231 -357 -293 -236 -334 529
2666 529 -85 -86 435 -217 -247 -45 -28 334 211 -19 437 44 -457 -177 -359 -218 477 -106 133 -19 -481
$$ packed form
2518E87k28r77R63j3m39P3J8j00l07lQ14m51q70J387k67j071J095N4p15R85Q4
2539F19k68j93r5K23l87l17J175q01n60J155p73n77J116m06m93M98O29Q8o08l38
2559c13R54m27l83N75m01J93N62q35l04M15m06J71k20K20N80n49m17Q57o87K09
2579b06Q51n03j27N72m76j14n4J39N38r14L06P90r87N8K43q15M35K34j86M24J1
2600B19l64L82n43K98K70m79P20J01q39K20K94n64J40o2K14K51l72p4L14n30L63
2621d1J03k45O29p4m26K71j65k28J28K1M51J56m86j5k54l92P92m57m19P14J8l33
2643b52J83k96K23P4L9L96q4j10J18l81R7J02k77Q2M66l58q1K90n88O4N7r8Q63
2666E29o14jN21o52l0K02J7L62j23k30M56l93n01K80j82J41O95n83K39j52m62
$$ plain form
2687 -481 -220 -100 -234 137 248 80 563 176 128 305 -198 36 304 -3 196 -101 -181 -10 -562 -645 33
2708 33 -159 70 255 -293 55 146 -390 61 261 -88 418 466 84 214 -73 -368 268 -216 14 -10 -309
2729 -309 159 -380 -455 107 -221 22 593 122 154 241 47 3 167 57 429 273 -253 121 -270 -83 250
2750 250 -435 -113 333 -188 -40 53 -332 123 69 135 163 105 297 310 -320 152 508 -344 182 356 -73 54
2772 54 -279 -298 178 -378 138 27 -345 28 293 -133 235 -38 -236 102 389 168 169 10 -15 59 -325 -10
2794 -10 -232 -481 83 -50 -427 7 -180 19 44 -101 404 309 -198 506 346 -178 332 81 -99 230 -288
2815 -288 -234 -8 -196 -128 -115 -84 263 -230 -472 373 100 -141 263 225 99 202 82 288 -199 32 212 -257
2837 -257 -102 141 -324 -327 198 -125 -172 -25 -56 159 16 189 382 -144 115 584 -228 -75 401 -271 -206 101
$$ packed form
2687d81K61J20j34L71J11j68M83l87m8J77n03K34K68l07J99k97q0J71n52q3O78
2708C3j92K29J85n48L48R1n36M51K00l49N06M8l82J30k87k95O36m84K30k4k99
2729c09M68n39p5N62l28K43N71m71L2Q7j94m4J64j10L72j56n26L74l91J87L33
2750B50o85L22M46n21J48R3l85M55n4O6K8n8J92J3o30M72L56q52N26J74m29J27
2772E4l33j9M76n56N16j11l72L73K65m26L68k73j98L38K87k21Jj59k5P4l84L15
2794a0k22k49N64j33l77M34j87J99K5j45N05r5n07P04j60n24N10k51j80L29n18
2815b88N4K26j88O8J3L1L47m93k42Q45k73k41M04l8j26J03j20K06m87K31J80m69
2837b57J55K43m65lN25l23m7J47l1K15j43J73J93n26K59M69q12J53M76o72O5L07
$$ plain form
2859 101 -90 -179 -290 -115 -59 -456 -243 229 -178 -156 360 -327 173 377 33 182 170 -37 132 290 79
2880 79 -162 -396 188 364 -402 34 197 -682 -99 341 -23 -94 -133 75 4 -308 402 210 -289 246 82
2901 82 -10 221 41 -297 12 -27 -11 -361 -236 464 -175 -339 324 154 -374 295 -92 121 413 290 260 -72
2923 -72 -9 296 33 -239 393 -237 -378 307 -338 -256 30 -191 -90 -47 377 167 -176 85 447 -224 -79
2944 -79 574 -23 81 294 98 -303 -165 35 -171 -275 43 35 -366 -77 265 -252 152 423 -146 -49 106
2965 106 106 -30 -155 150 215 -425 -7 119 -411 -25 474 -516 12 67 -67 -170 -201 298 171 6 365 93
2987 93 -124 540 540 -243 0 222 -240 -162 -97 -162 -87 -279 172 -19 -412 251 -62 -293 368 123 -135 65
3009 65 241 153 -152 -182 255 -112 -304 146 45 -353 400 -88 -534 73 193 -275 -12 101 264 14 -160
$$ packed form
2859A01j91q9j11J75N6l97K13M72m07K2N16o87N00K04l44J49j2k07J69J58k11
2880G9k41k34N84J76p66M36J63q79N83M40l64p1l9K08p1l12P10j92m99N35j64
2901H2r2K31j80l38L09l9J6l50J25P00o39j64O63j70n28O69l87K13K92j23l0l32
2923g2O3L05k63k72O32o30j41O85o45Q2K86k21J01M3M24k10l43K61L62o71J45
2944g9O53n97J04K13j96m01J38K00k06j04L18qm01K89L42n17M04K71n69R7J55
2965A06%j36j25L05O5o40M18J26n30L86M99r90N28N5j34j03l1M99j27j65L59k72
2987I3k17O64%p83K43K22m62P8O5o5P5j92M51j91l93O63l13k31O61k45k58K00
3009F5J76q8l05l0M37l67j92M50j01l98P53m88m46O07J20m68K63J13J63k50j74
$$ plain form
3030 -160 185 -201 -241 588 81 -353 251 43 -437 -190 253 1 -85 -182 173 -452 -64 271 -3 -62 572
3051 572 -16 -236 389 13 0 58 -2 72 -123 50 163 -533 -250 377 -238 -166 75 157 132 -107 128 263
3073 263 -92 233 264 -565 233 608 -180 -4 -10 -204 -46 153 -235 -107 -160 309 32 -486 153 346 -405
3094 -405 -16 319 -280 88 280 -152 113 77 212 -116 -171 157 -35 -527 176 36 -234 61 277 -347 5
3115 5 67 175 121 41 589 112 -153 248 163 -410 287 152 -335 54 -58 -83 -242 -79 160 -169 -3 395
$$ packed form
3030a60L45l86m0Q29n07m34O04k08m80K47M43k52q6r7L55o25L88L35k74n9O34
3051E72n88k20O25l76j3N8o0P4j95J73J13o96K83O27o15P2K41Q2k5k39K35J35
3073B63l55L25L1q29P98L75p88J76oj94J58J99l88J28n3M69k77n18O39J93p51
3094d05L89L35n99L68J92m32K65l6J35l28n5L28j92m92P03j40k70K95K16o24L52
3115EO2J08n4q0N48m77k65M01q5n73O97j35m87L89j12k5j59J63K39l29J66L98
$$ [...]
8191H1
##END NTUPLES=NMR FID
##END=
