##TITLE=1H_Pr Mem
 DMSO
 8 sc, 
 17.3.2023
##JCAMPDX= 6.0         $$ Bruker NMR JCAMP-DX V2.0
##DATA TYPE= NMR FID
##DATA CLASS= NTUPLES
##ORIGIN= UXNMR, Bruker Analytische Messtechnik GmbH
##OWNER= root
$$ XWIN-NMR		Version 3.5
$$ Mon Mar 20 14:54:48 2023 Russian Standard Time (UT+4h)  she@DPX200
##.OBSERVE FREQUENCY= 200.13135
##.OBSERVE NUCLEUS= ^1H
##.DELAY= (6, 6)
##.ACQUISITION MODE= SIMULTANEOUS
##.ACQUISITION SCHEME= undefined
##.AVERAGES= 8
##.DIGITISER RES= 18
##SPECTROMETER/DATA SYSTEM= spect
##.PULSE SEQUENCE= zg30
##.SOLVENT NAME= CDCl3
##.SHIFT REFERENCE= (INTERNAL, CDCl3, 0, 15.7039)
##AUDIT TRAIL= $$ (NUMBER, WHEN, WHO, WHERE, WHAT)
$$ ##TITLE= Audit trail, XWIN-NMR		Version 3.5
$$ ##JCAMPDX= 5.01
$$ ##ORIGIN= Bruker BioSpin GmbH
$$ ##OWNER= she
$$ F:/spectra/data/she/nmr/H-F/1/audita.txt
$$ ##AUDIT TRAIL=  $$ (NUMBER, WHEN, WHO, WHERE, WHAT)
(   1,<2023-03-20 14:54:06.65 +0400>,<she>,<DPX200>,
      <created by zg, POWCHK disabled, PULCHK disabled
       configuration hash MD5:
       00 E9 B6 7A A2 85 ED C7 34 08 36 98 17 FE 4E 26
       data hash MD5: 16K
       7C 3A F9 8C 18 BD DC 94 92 08 CE 2C 01 2E 3F E3>)
$$ ##END=
$$ 
$$ hash MD5
$$ 6B 53 B0 A1 05 9D D5 C4 ED 63 6C 1B FE C4 43 C9
##$RELAX= 
##$RELAX= 
##$RELAX= 
##$RELAX= 
##$RELAX= 
##$RELAX= 
$$ Bruker specific parameters
$$ --------------------------
##$DU= <F:/spectra>
##$EXPNO= 1
##$NAME= <H-F>
##$PROCNO= 1
##$TYPE= <nmr>
##$USER= <she>
##$AMP= (0..31)
100 100 100 100 100 100 100 100 100 100 100 100 100 100 100 100 100 100 
100 100 100 100 100 100 100 100 100 100 100 100 100 100 
##$AQSEQ= 0
##$AQ_mod= 1
##$AUNM= <au_zg>
##$AUTOPOS= <>
##$BF1= 200.13
##$BF2= 200.13
##$BF3= 200.13
##$BF4= 200.13
##$BF5= 200.13
##$BF6= 200.13
##$BF7= 200.13
##$BF8= 200.13
##$BYTORDA= 1
##$CFDGTYP= 0
##$CFRGTYP= 5
##$CHEMSTR= <none>
##$CNST= (0..31)
1 1 145 1 1 1 1 1 1 1 1 1 1 1 1 1 1 1 1 1 1 1 1 1 1 1 1 1 1 1 1 1 
##$CPDPRG= <>
##$CPDPRG1= <>
##$CPDPRG2= <>
##$CPDPRG3= <>
##$CPDPRG4= <mlev>
##$CPDPRG5= <mlev>
##$CPDPRG6= <mlev>
##$CPDPRG7= <mlev>
##$CPDPRG8= <mlev>
##$CPDPRGB= <>
##$CPDPRGT= <>
##$D= (0..31)
0 1.2 0 0 0 0 0 0 0 0.06 0 0.03 0 0 0 0 0.0002 0 0 0 0 0 0 0 0 0 0 0 0 
0 0 0 
##$DATE= 1679309646
##$DBL= (0..7)
120 120 120 120 120 120 120 120 
##$DBP= (0..7)
150 150 150 150 150 150 150 150 
##$DBP07= 0
##$DBPNAM0= <>
##$DBPNAM1= <>
##$DBPNAM2= <>
##$DBPNAM3= <>
##$DBPNAM4= <>
##$DBPNAM5= <>
##$DBPNAM6= <>
##$DBPNAM7= <>
##$DBPOAL= (0..7)
0.5 0.5 0.5 0.5 0.5 0.5 0.5 0.5 
##$DBPOFFS= (0..7)
0 0 0 0 0 0 0 0 
##$DE= 6
##$DECBNUC= <off>
##$DECIM= 32
##$DECNUC= <off>
##$DECSTAT= 4
##$DIGMOD= 1
##$DIGTYP= 9
##$DL= (0..7)
0 120 120 120 120 120 120 120 
##$DP= (0..7)
150 150 150 150 150 150 150 150 
##$DP07= 0
##$DPNAME0= <>
##$DPNAME1= <>
##$DPNAME2= <>
##$DPNAME3= <>
##$DPNAME4= <>
##$DPNAME5= <>
##$DPNAME6= <>
##$DPNAME7= <>
##$DPOAL= (0..7)
0.5 0.5 0.5 0.5 0.5 0.5 0.5 0.5 
##$DPOFFS= (0..7)
0 0 0 0 0 0 0 0 
##$DQDMODE= 0
##$DR= 18
##$DS= 0
##$DSLIST= <SSSSSSSSSSSSSSS>
$$ [...]
##$SUBNAM2= <"">
##$SUBNAM3= <"">
##$SUBNAM4= <"">
##$SUBNAM5= <"">
##$SUBNAM6= <"">
##$SUBNAM7= <"">
##$SUBNAM8= <"">
##$SUBNAM9= <"">
##$SW= 18.05172834244
##$SWIBOX= (0..15)
0 0 2 0 0 0 0 0 0 0 0 0 0 0 0 0 
##$SW_h= 3612.71676300578
##$TD= 16384
##$TD0= 1
##$TE= 0
##$TE2= 300
##$TE3= 300
##$TEG= 300
##$TL= (0..7)
0 120 120 120 120 120 120 120 
##$TP= (0..7)
150 150 150 150 150 150 150 150 
##$TP07= 0
##$TPNAME0= <>
##$TPNAME1= <>
##$TPNAME2= <>
##$TPNAME3= <>
##$TPNAME4= <>
##$TPNAME5= <>
##$TPNAME6= <>
##$TPNAME7= <>
##$TPOAL= (0..7)
0.5 0.5 0.5 0.5 0.5 0.5 0.5 0.5 
##$TPOFFS= (0..7)
0 0 0 0 0 0 0 0 
##$TUNHIN= 0
##$TUNHOUT= 0
##$TUNXOUT= 0
##$USERA1= <user>
##$USERA2= <user>
##$USERA3= <user>
##$USERA4= <user>
##$USERA5= <user>
##$V9= 5
##$VALIST= <valist>
##$VCLIST= <CCCCCCCCCCCCCCC>
##$VD= 0
##$VDLIST= <DDDDDDDDDDDDDDD>
##$VPLIST= <PPPPPPPPPPPPPPP>
##$VTLIST= <TTTTTTTTTTTTTTT>
##$WBST= 1024
##$WBSW= 4
##$XGAIN= (0..3)
0 0 0 0 
##$XL= 0
##$YL= 0
##$YMAX_a= 114417
##$YMIN_a= -242645
##$ZGOPTNS= <>
##$ZL1= 120
##$ZL2= 120
##$ZL3= 120
##$ZL4= 120
##$ABSF1= 10
##$ABSF2= 0
##$ABSG= 5
##$ABSL= 3
##$ALPHA= 0
##$AQORDER= 0
##$ASSFAC= 0
##$ASSFACI= 0
##$ASSFACX= 0
##$ASSWID= 0
##$AUNMP= <proc_1d>
##$AZFE= 0.1
##$AZFW= 0.1
##$BCFW= 1
##$BC_mod= 2
##$BYTORDP= 1
##$COROFFS= 0
##$CY= 11.3945322036743
##$DATMOD= 1
##$DC= 2
##$DFILT= <>
##$DTYPP= 0
##$F1P= 2.36226072786647
##$F2P= -0.459571619588291
##$FCOR= 0.5
##$FTSIZE= 0
##$FT_mod= 4
##$GAMMA= 1
##$GB= 0.15
##$INTBC= 1
##$INTSCL= 1
##$ISEN= 128
##$LB= 0.24
##$LEV0= 0
##$LPBIN= 0
##$MAXI= 10000
##$MC2= 0
##$MEAN= 0
##$ME_mod= 0
##$MI= 1.114404
##$NCOEF= 0
##$NC_proc= 0
##$NLEV= 6
##$NOISF1= 3.799351
##$NOISF2= 2.8
##$NSP= 1
##$NTH_PI= 0
##$NZP= 0
##$OFFSET= 15.70392
##$PC= 1
##$PHC0= -19107.94
##$PHC1= 10.20075
##$PH_mod= 1
##$PKNL= yes
##$PPARMOD= 0
##$PSCAL= 0
##$PSIGN= 0
##$REVERSE= no
##$SF= 200.130013532006
##$SI= 16384
##$SIGF1= 3
##$SIGF2= 2
##$SINO= 400
##$SIOLD= 16384
##$SREGLST= <1H.CDCl3>
##$SSB= 0
##$STSI= 0
##$STSR= 0
##$SW_p= 3612.71676300578
##$SYMM= 0
##$S_DEV= 0
##$TDeff= 0
##$TDoff= 0
##$TI= <>
##$TILT= no
##$TM1= 0
##$TM2= 0
##$TOPLEV= 0
##$USERP1= <user>
##$USERP2= <user>
##$USERP3= <user>
##$USERP4= <user>
##$USERP5= <user>
##$WDW= 1
##$XDIM= 8192
##$YMAX_p= 0
##$YMIN_p= 0
$$ End of Bruker specific parameters
$$ ---------------------------------
##NTUPLES= NMR FID
##VAR_NAME=  TIME,          FID/REAL,        FID/IMAG
##SYMBOL=    X,             R,               I
##VAR_TYPE=  INDEPENDENT,   DEPENDENT,       DEPENDENT
##VAR_FORM=  AFFN,          ASDF,            ASDF
##VAR_DIM=   8192,          8192,            8192
##UNITS=     SECONDS,       ARBITRARY UNITS, ARBITRARY UNITS
##FACTOR=    0.0002768,     1,               1
##FIRST=     0,             0,               0
##LAST=      2.2672688,     0,               0
##MIN=       0,             -242645,         0
##MAX=       2.2672688,     114417,          0
$$ Real data points
##PAGE= N=1
##DATA TABLE= (X++(R..R)), XYDATA
$$ [...]
1765A28QQ6k77n8l5J78J75q2j79K07k88J47P9N8j05P9J19l21N6j33J86K73j92
$$ 128 136 222 -55 -113 -148 30 205 123 -56 151 -137 10 89 147 42 121 240 -81 -25 -158 28 301 109
1788A09k32J90k7k2l5J27l8L9k93K34l9j00l5j02L25N4j13k56J10K71K3j56J72
$$ 109 -123 67 40 18 -17 110 72 111 -182 52 13 -87 -122 -224 101 155 42 -214 -104 167 190 34 206
1811B06m08Q1K42j82L11k13m33M67J28j26M0k77J32J53r1J16j19J29N4j05k19
$$ 206 -202 -121 121 -61 250 37 -396 71 199 73 113 -164 -32 121 30 146 27 156 210 105 -114
1832a14K43k79N1k2R0K19k53j32K88J64l34j07J26J41J17l54J41J05k7M6j73R5
$$ -114 129 -150 -99 -121 -31 188 -65 -197 91 255 -79 -186 -60 81 198 -156 -15 90 63 109 -64 31
1854C1m8l6k46M15J49j66k03K17J23q6k02J00L3M1n9j22k78M56k9P9l55K15k4
$$ 31 -17 -53 -299 116 265 99 -104 113 236 150 -52 48 81 122 63 -59 -337 119 90 169 -186 29 5
1877EL9o0J72p5l21j84M99k03O7J60p7j08L41l55m3J85N3q3K80m59k89P30l00
$$ 5 44 -16 156 81 -240 -424 75 -128 -61 99 22 -86 255 -100 -143 42 95 12 292 -167 -456 274 -26
1900b6J36q2L59n06M8K35m05kN1J85J59j23l9lk34K33k06j65N00l69L40K0r7P1
$$ -26 110 28 387 -119 -71 164 -241 -243 -192 -7 152 29 -10 -13 -247 -14 -220 -385 115 -254 86 106 9 80
1924H0q2P3l9Q5j15k84R0K29O4Q4m26J07N25o52N3J78P7j91K91k32K46m6k08K12
$$ 80 -2 71 32 117 2 -282 -192 37 101 185 -241 -134 391 -261 -208 -30 47 -144 147 -85 161 115 -93 119
1948A19l14L46l13LK41j06j27K43k78J76J17j99K10m8k15o0P28m53j40l7j89M56
$$ 119 -195 151 -162 -159 82 -24 -151 92 -186 -10 107 -92 118 70 -145 -205 523 70 -70 -107 -296 160
1970A60J03j65l76N32j02l0k25K99l0p7k94J44J75j12j18K98J1k21j5j32J93J50
$$ 160 263 98 -278 254 152 122 -103 196 166 89 -205 -61 114 2 -116 182 193 -28 -43 -175 18 168
1992A68k90j52M53k25J50j34qJ74k51L73j91k0j89J82k7R7o4K2l97K91L42m18
$$ 168 -122 -274 179 -46 104 -30 -38 136 -115 258 67 47 -142 40 13 110 46 68 -329 -38 304 -114
2014a14M4j56K16J10k1m8J13l3j01k65L18O2m00J93J28J57l31O5KJ12j87J87M9
$$ -114 -70 -226 -10 100 79 31 144 111 10 -255 63 125 -275 -82 46 203 -128 -63 -61 51 -136 51 100
2037A00K9p1K26j28k09L61k38L49n01J60J98m72L79l85L29j72J9K36j37j91L0
$$ 100 129 58 284 156 -53 308 70 419 -82 78 276 -196 183 -202 127 -45 -26 210 73 -118 -88
2058h8N3p3J96p9J23J81l23M1j24J91j37M3r7P5O5l82M57m54M36j07J17l04kK52
$$ -88 -35 -108 88 9 132 313 -10 31 -93 98 -39 4 -93 -18 47 -335 122 -332 104 -3 114 -190 -192 60
2082F0j41K0k1L35j35q2Mn3J00nO9o1m7j12J84J2Pj09k2J57k49rM1L8j40RJ52
$$ 60 -81 -61 -82 253 118 36 40 -13 87 82 151 90 43 -69 115 127 134 25 3 160 -89 -98 -57 -19 -159 -150 2
2109BK19k98K47j74J32N5J43m54R5j32J95K58l43l3l3J56m8O3j84M2k23J89L34
$$ 2 221 -77 170 -4 128 183 326 -128 -33 -165 30 288 -55 -88 -121 35 -13 50 -134 -92 -315 -126 208
2132B08J06k68LoL3o5M0k42K69Om9o4j9K1j77K10j82J55nJ6j4J53k94K48j88J40
$$ 208 314 46 49 43 76 11 51 -191 78 84 35 -29 -48 -27 -204 6 -176 -21 -26 -10 -24 129 -165 83 -105 35
2158C5j51Q2q4J42R2J86j59k31m9J79roL3p2K6Q6K2j16N7j84o5L20p8q6J64m48
$$ 35 -116 -34 -118 24 116 302 143 -88 -137 42 33 27 60 -12 14 100 122 6 63 -121 -186 134 56 -30 134 -314
2184c14N51k97j62J92J12J74l51k53L47l54M18j57J63k33L9J67j75J86K4k18k1
$$ -314 237 -60 -222 -30 82 256 -95 -348 -1 -355 63 -94 69 -164 -125 42 -133 53 77 -141 -162
2205a62J54j18M52m14m4M93k34q2j42j73L86L3r2j30J43M3M4j17j18J3J46k67
$$ -162 -8 -126 326 -88 -132 361 127 45 -97 -270 116 149 57 -73 70 113 157 40 -78 -65 81 -186
2227a86K92k47k82L18j48N80m14L9J1j39K35J18q6P5j29J12k9j94J78j33l1j8
$$ -186 106 -141 -423 -105 -253 327 -87 -48 -37 -176 59 177 91 166 37 149 120 -74 104 -29 -60 -78
2249g8K67l03J64m2j08j10J19l9q3L16m28M47n3Q4l71Q8L88J3m40J18K04q5L7
$$ -78 189 -114 50 8 -100 -210 -91 -130 -213 103 -325 122 69 153 -218 -130 258 271 -169 -51 153 68 105
2272A05j47K7j13O0r2m1J47j80L47j76k8M7Nj20M9j8L40k98J3J97J0p6K5j27n2
$$ 105 -42 -15 -128 -68 -160 -201 -54 -234 113 -63 -91 -44 -39 -159 -110 -128 212 -86 -73 124 134 58 83 -44 -96
2297i6q2L48j55n9j00L3J74J29k24J3J67j75jM4k55K40Q0J4p1p0K62k94o4j06
$$ -96 -178 170 15 -44 -144 -111 63 192 -32 -19 148 -27 -28 16 -239 1 81 95 24 -46 216 -78 -142 -248
2321b48R6Q8J85L4km0j35Q2%j9j80R0L52l86J66J20l69J69r3J92k02o7J48k90
$$ -248 -152 -64 121 155 153 113 -22 60 60 41 -139 -49 303 -83 83 203 -166 3 -90 102 -100 -167 -19 -309
2345c09M13k5k48K88l63K38J63k06j25K90k07K43L0k65P5J41N5k02k0K8L45l05
$$ -309 104 79 -169 119 -244 -6 157 -49 -174 116 -91 152 182 -83 -8 133 188 -14 -34 -6 339 34
2367C4j54P9J48Rj49j45J89j43K3J58J78k67n9L95o0k2m0j82J84k96j40P9K96
$$ 34 -120 -41 107 116 -33 -178 11 -132 -109 49 227 -40 -99 296 236 214 174 -8 176 -120 -260 -181 115
2390A15j74l1j89J44K07p0Q0j88J55r0n1PJ45Q9j26p2O0o0p3M5K5p6o0J99j82
$$ 115 -59 -90 -279 -135 72 2 82 -106 49 -41 -92 -85 60 149 23 -49 11 -49 -122 -77 -52 -128 -188 11 -171
2415a71J36m0K9j29k6K77K80n13K73j18l9K81k20n3j20M09k96j61K5L5L41j16
$$ -171 -35 -75 -46 -175 -201 76 356 -157 116 -2 -41 240 20 -33 -153 256 -40 -201 -176 -141 200 84
2437H4O3j96K82n46N71l27J25j93K68K4J13m53K24j99K05j33O8J54l29J24O6q
$$ 84 147 -49 233 -313 258 -69 56 -137 131 155 268 -185 39 -160 45 -88 -20 134 -195 -71 -5 -13
2459a3p1J13N1k4L6j12jN5k50K09k00r8L96j74k3K63j78%o7J06N0l15M18j88k8
$$ -13 -84 29 80 56 92 -20 -21 34 -216 -7 -207 -305 91 -83 -106 157 -21 -21 -88 18 68 -247 171 -17 -45
2484d5K38l91K96j47j4K15l0k86J76r6P3n0q9P9O9k8J13j59j28L38j29K2M4k53
$$ -45 193 -198 98 -49 -63 152 122 -164 12 -84 -11 -61 -150 -71 -2 -30 83 -76 -204 134 5 27 71 -182
2508a82J59j36P5Q2P7j8nk4K4N3l45K86M2j23M2J24j32K34r9J07l37K61k5k87
$$ -182 -23 -159 -84 -2 75 57 52 28 52 105 -240 46 88 -35 7 131 -1 233 134 241 -96 165 140 -147
2532a47J43j02j3R2r5o9K72J14j27l4p7J03r3J0j19J39r1K9j27K2L4k2L04l31
$$ -147 -4 -106 -119 -27 -122 -191 81 195 68 34 -43 60 -33 -23 -142 -3 -94 -65 -192 -170 -136 -158 146 -185
2556a85Q0M74n91K28o5KJ25j08Pk5j47K57j7j82J25J6K6r7O0R7k62J02J42j18
$$ -185 -105 369 -222 6 -59 -57 68 -40 -33 -58 -205 52 35 -147 -22 -6 20 -77 -17 80 -182 -80 62 -56
2580e6R9J27k40J1j8M8J71j67J62j07n6P6mj2j27L27o1j77l9N6M6j78K87O2l8
$$ -56 43 170 -70 -59 -77 -29 142 -25 137 30 -26 50 46 34 -93 234 173 -4 -43 13 59 -119 168 230 192
2605A92k54l8O3nM5Q4J3m51L98r8K15l06j30L65j80l2j55J42K20K1q0j96J31J6
$$ 192 -62 -100 -37 -42 3 87 100 -351 47 -51 164 -142 -272 93 -87 -119 -274 -132 88 109 29 -167 -36 -20
2629b0j30q6L10j0Q8n1j04L18l78J09l14K92q9LJ91j99j1r3L86J9k43k43J35j85
$$ -20 -150 -236 74 64 152 101 -3 315 -63 46 -268 24 -65 -62 129 -70 -81 -174 212 231 -12 -255 -120 -305
2653c05J71M4J02J85k21k6k15O5L34k36J42l1j04J7Lk39K86n3K77k88j4J0R5r6
$$ -305 -134 -90 12 197 -24 -50 -265 -200 134 -102 40 9 -95 -78 -75 -314 -28 -81 196 -92 -106 -96 -1 -97
2677i7q8K29p1j86Q7M59j17k82q8M2j8R4J27nq9L4J74k76j51J27K16j97J49l40
$$ -97 -185 44 -27 -213 -126 333 216 -66 -154 -112 -130 -36 91 86 -3 31 205 -71 -222 -95 121 -76 73 -267
2701b67L36J39l09K34m19L22k32L54k2K3l10j4K14j3k36K48K6j58Q2J80j74m4
$$ -267 69 208 -101 133 -286 36 -196 158 136 159 -151 -165 49 36 -200 48 74 -84 -2 178 4 -40
2723d0K38j33J7j15J66k80J01K95j63J93k13j9q3J97k1j50N9k50L30q8J12j26
$$ -40 198 65 82 -33 133 -147 -46 249 86 279 66 47 -36 161 140 -10 49 -201 129 41 153 27
2745B7k72L55l12J26O4J43j36o0m1M2N2k9J61l19K63j42j16J60J00j34j90K54
$$ 27 -245 110 -202 -76 -12 131 -5 -65 -106 -64 -12 -41 120 -199 64 -78 -194 -34 66 -68 -258 -4
2767dLP5j10J91k14P7R4K91n54K30j25K69m08L11l61J37J60j39K67k14p6K17m84
$$ -4 -1 74 -36 155 -59 18 112 403 -151 79 -46 223 -185 126 -235 -98 62 -77 190 -24 -100 117 -367
2790c67J40L05j21P7N3N2K7l27J75Kj07O9mP2r6j22k5J01J15n3J62j62j2m2J75
$$ -367 -227 78 -43 34 87 139 166 -161 14 16 -91 -22 -26 46 -50 -172 -197 -96 19 -34 128 -34 -46 -88 87
2815H7J36m06J68J43j83j42Q7j0p5J8K33l42K81R0m9Q4n8K5j75J12q3J83j40J83
$$ 87 223 -183 -15 128 -55 -197 -110 -120 -195 -177 56 -286 -5 85 36 120 62 87 -88 24 -59 124 -16 167
2839A67o1k54N01j29j21m8r8P3k72L30O1j66j1L2J62j74Q7j16L07k32j05O6j13
$$ 167 106 -148 353 224 103 55 -43 30 -242 88 149 -17 -28 4 166 -8 79 -37 270 38 -67 -1 -114
2862a14J01P8l7n1o3M3l7N6q2R2L3r6J58k80OK84l33L32J50p4k44r0m9O3R4L6
$$ -114 -13 65 28 -23 -86 -43 -80 -24 -106 -14 19 -77 81 -199 -193 91 -242 90 240 166 -78 -168 -217 -154 -60 -24
2888b4j10K13j37K76J8l25J80J54nk21k77Q5L79l01R1K4m0j6k30K67P7o5n7l20
$$ -24 -134 79 -58 218 236 -89 91 245 240 19 -258 -173 206 -95 -4 20 -20 -36 -266 1 78 13 -44 -364
2912c64N67l2k11j00J17O1J28k21p1K51k00K73j95j41N3k6j36L71l11K78nQ3j10
$$ -364 203 171 -40 -140 -23 38 166 -55 -126 125 -75 198 3 -138 -85 -111 -247 124 -187 91 86 169 59
2935E9J72k05K65l53J42j28R4Oj02K48m37K72L2l2N3P5N0r8j57j36J51o8K56j32
$$ 59 231 26 291 -62 80 -48 46 52 -50 198 -239 33 65 33 86 161 211 113 -44 -180 -29 -97 159 27
2959B7M8lP2j28K5o2N6J04M1m3j92k47M22j28P4l18M7N3J02J14k01J77Q6l06K47
$$ 27 75 72 144 16 41 -21 35 139 180 137 -55 -302 120 -8 66 -252 -205 -152 -50 64 -137 40 126 -180 67
2984F7j11lL8J13j0j58L3K6j00K74P1m10Q8J41j92Q4M9l33L28m12N16J16l4n66
$$ 67 -44 -47 -9 104 94 -64 -31 -5 -105 169 240 -170 -82 59 -133 -49 0 -333 -5 -417 99 215 181 -385
3008c85M45J50k89j59J23K84l48OK53j38L08k56l1J94k60k4J41jL4j56p7J85j9
$$ -385 60 210 -79 -238 -115 169 -179 -173 80 -58 250 -6 -37 157 -103 -127 14 13 47 -109 -186 -1 -20
3031b0N9l1K1o6j25K94j02j17M49l93j99K23P4p0j02K01r5q8j51O4J3L2L5J08
$$ -20 39 8 29 -37 -162 132 30 -87 362 -31 -230 -7 67 -3 -105 96 1 -87 -238 -174 -161 -129 -94 14
3055A4o3K92l38m9J41J15k5k30n5K08K57m19K28j35J7k04L10j83K07J22q4k89
$$ 14 -49 243 -95 -144 -3 112 87 -143 -198 10 267 -152 76 -59 -42 -246 64 -119 88 210 126 -163
3077a63J09kj15O6k22M81j31j11O6p6O1l03K19J19J00r9Kj12J61j57o2J41Q1j65
$$ -163 -54 -56 -171 -105 -327 154 23 -88 -22 -98 -37 -340 -121 -2 98 -1 1 -111 50 -107 -169 -28 53 -112
3101a12J69l55M37m22K40Q8K4M7r0qj70O5l3L62j26k29P4J07o3J71l00Q9J28J37
$$ -112 57 -298 139 -283 -43 45 69 116 26 18 -152 -87 -120 242 116 -113 -39 68 5 176 -124 -35 93 230
3125B30k33J06j41j21J19OO8j07J7P7p2j26J10j16L18j78j78K61lJ30k57J27k20
$$ 230 -3 103 -38 -159 -40 -34 34 -73 -56 21 -51 -177 -67 -183 135 -43 -221 40 37 167 -90 37 -183
3148a83L54m68K78K97l21J48j23P2p2j31J42K66j01j90K72k58J83j97j8J52j45
$$ -183 171 -297 -19 278 -43 105 -18 54 -18 -149 -7 259 158 -32 240 -18 165 -32 -50 102 -43
3169d3L6J21jk03J83k08Mm3J14J40j50M5J09l32L52J2l08K29M9k93J93N6K6k17
$$ -43 -7 114 113 -90 93 -115 -111 -154 -40 100 -50 -5 104 -228 124 136 -172 57 106 -187 6 62 88 -129
3193a29L93l93K59j20l00M36j3k33K72Q7j44l9j37K21k11n2L64k87j7o8J30k3
$$ -129 264 -129 130 10 -290 146 133 -100 172 259 115 76 -61 160 -51 -103 261 -26 -43 -111 19 -4
3215dj5M4J52j77J29k86K04J1Q0k52p0L92J3l66J56M8j42K54k72m1J15j24J60
$$ -4 -19 25 177 0 129 -157 47 58 138 -114 -184 208 221 -145 11 59 -83 171 -101 -142 -27 -151 9
3238IR3l25J05R0J99k21k25L62j55j96K13J73k15O5j63J16R9j1K79m56L68k73
$$ 9 102 -223 -118 -28 171 -50 -275 87 -68 -264 -51 122 -93 -28 -191 -75 24 13 292 -164 204 -69
3260f9m3J06qQ3r2j37J6K31j18K20m50J0K07p2j17J50L9K50j86j41L23j99k6J35
$$ -69 -112 -6 -14 69 -23 -160 -144 87 -31 189 -261 -251 -44 -116 -233 -83 -44 206 20 -121 202 3 -23 112
3284A12j7m3k71K62j43l3J4M29l06K10l3q6k57q5O30m88l7K58o5j40M6j28J59
$$ 112 95 52 -219 43 -100 -133 -119 310 4 214 181 95 -162 -247 383 -105 -142 116 51 -89 -43 -171 -12
3307a2k33K63K6j98K37j13j70M00k34J22P1j40J13r6l9K4l8j37K67j42P9J29K47
$$ -12 -245 18 44 -154 83 -30 -200 200 -34 88 159 19 132 36 -3 21 -17 -154 113 -29 50 179 426
3330D26m72J68m20M04p3m4M6j2K01l6j72J93l89K57j93K10k6r2J22n4j33J67K0
$$ 426 -46 122 -298 106 33 -11 35 23 224 188 16 209 -180 77 -116 94 68 -24 98 44 -89 78 98
3353I8k33q0L43L1o1j41O9J09j62n5P4K40j26j70j30j1K27o6J48j33L04k20m4
$$ 98 -135 -215 128 159 98 -43 26 135 -27 -82 -8 232 106 -64 -194 -205 22 -44 104 -29 275 55 11
3376A1j25p6J95O3k99M11k80j24L71j85J57j9J49k76j81N1p3L97J03o5k6k22o7
$$ 11 -114 -190 5 68 -231 180 -100 -224 147 -38 119 100 249 -27 -208 -157 -230 167 270 205 179 -43 -110
3399a10M8j12J5K04j38L05k32J72k33N6J17O5l90J84q5K24k69J78k9J08j40K08
$$ -110 -62 -174 -159 45 -93 212 -20 152 -81 -25 92 157 -233 -49 -134 90 -179 -1 -30 78 -62 146
3421A46j56k26J61J95k18J65M1Qk27K0R0j92nK77k6NR9j22R5k91J54o0qJ46O5
$$ 146 -10 -236 -75 120 -98 67 108 116 -111 -91 -1 -193 -198 79 53 58 157 35 130 -161 -7 -67 -75 71 136
3446A36o1l9q9OJ96r8J9l27L58j08PK3J70r2l05L16l16K93j28J9M3L6m7Nk4J09
$$ 136 75 36 -53 -47 149 51 70 -257 101 -7 0 23 193 101 -204 112 -204 89 -39 -20 23 59 12 17 -7 102
3472A02p7j86L01l44J7L57l20K40q5o1o4R7J09p9J28k09J56j9r5L6n9m6L78l53
$$ 102 25 -161 140 -204 -187 170 -150 90 5 -56 -120 -23 86 7 135 -74 82 63 -32 4 -55 -101 277 -76
3496g6J22k10L08j62k08K38N0j92K03J45o5j82k1J38k2P2l44K23RJ74k28L62k33
$$ -76 46 -164 144 -18 -226 12 62 -130 73 218 153 -29 -50 88 66 138 -206 17 26 200 -28 334 101
3519A01j61K38k93Q2P2N5j42P8J61j16o4J29j19ll2K51k48k3J72k58L31m00K84
$$ 101 -60 178 -115 -33 39 94 -48 30 191 75 11 140 21 18 -14 237 -11 -34 138 -120 211 -189 95
3542I5j44J23J42k88Q4m0L6Qj88L12k05n0K32k37L26l00J26j45M0K26k60K38j55
$$ 95 -49 74 216 -72 12 -28 8 16 -172 140 -65 -115 117 -120 206 -94 32 -113 -73 153 -107 131 -24
3565b4K94m9j93O3k33N9L3L77r4k85Q0l02L62L1lk42J95m26K38N95o23J93j73
$$ -24 270 221 28 91 -142 -83 -50 327 233 -52 28 -274 88 119 116 -126 69 -357 -119 476 -147 46 -127
3588a27L7n7J34L0R3k54J80P1K9j28j07j83L71j88O5J10l05J99K23l18k2M84n79
$$ -127 -90 -147 -13 17 110 -144 36 107 136 8 -99 -282 89 -99 -34 76 -229 -30 193 -125 -147 337 -242
3611b42K54k37L57j32J06k14J44j61L12k01J80j30J09l28K65k9k34J97N1j18j84
$$ -242 12 -225 132 0 106 -108 36 -125 187 -14 166 36 145 -183 82 53 -181 16 67 -51 -235
3632b35L85k08L3r7K86j46J84j88J78k68k06L53o6L9J58k70j7R8j04O5o0J69j58
$$ -235 150 -58 -25 -122 164 18 202 14 192 -76 -282 71 5 44 202 -68 -85 13 -91 -26 -86 83 -75
3655g5J15q6P5l4k06K74k65M44k74N1n9J08l3j33Q9J90j67n8J37J04l00J64j24
$$ -75 40 -46 29 -5 -211 63 -202 242 -32 19 -40 68 35 -98 -9 181 14 -44 93 197 -103 61 -63
3678f3Q1R4l16K80p3L0O3P9l26J50j11K08j95J11N1O3p0j43J24J13j61O4j33q0
$$ -63 18 112 -204 76 3 33 96 175 -151 -1 -112 96 -99 12 63 126 56 -87 37 150 -11 53 -80 -160
3702a60P7J01K3j02K73j44o4kJ00q5p8K25m02K72l2r4K09l5j00j48R5N5R3k91
$$ -160 -83 18 41 -61 212 68 4 2 102 17 -61 164 -238 34 2 -92 117 82 -18 -166 -71 -16 77 -214
3726b14J66R8k33J19N3j18K95l21K70j43j02K27Mp3K9l51K43R3q7Q2L4j48m4R7
$$ -214 -48 50 -183 -64 -11 -129 166 -155 115 -28 -130 97 101 28 57 -294 -51 42 -45 37 71 -77 -121 -24
3750b4l7k52K53O9m8N5J13k31K14J10j85n5J24j3l32J65m9J22k3J09K9K3m2k88
$$ -24 -61 -313 -60 9 -39 16 129 -102 112 222 37 -18 106 93 -239 -74 -123 -1 -24 85 114 137 95 -193
3774a93M78q7l33j24K41K69k64m3J91N2j95k00rK04l12R9J31K25k2o6L4j04R1
$$ -193 285 198 -135 -259 -18 251 -13 -56 135 187 -8 -208 -217 -13 -325 -226 -95 130 108 42 76 -28 63
3797F3j16J96j89J40q2k69L66q4k6J87j77Pp5K59k39j4j09K46k43K52k23L19m0
$$ 63 -53 143 -46 94 12 -257 109 25 -1 186 9 16 -59 200 -39 -53 -162 84 -159 93 -130 189 149
3820A49r3r1j18J59j27J93J4L03m73j3J7l6r0K65k76K70j1j75j50L39J13j10j86
$$ 149 56 -35 -153 6 -121 72 86 389 -84 -97 -80 -116 -206 59 -217 53 42 -133 -283 56 169 59 -127
3843a27NR9k7J5j27J9J21K90l40o3j82K66QJ92k32K49k95J06J10k1n0o0J72l6
$$ -127 -122 -23 -50 -35 -162 -143 -22 268 -72 -135 -317 -51 -43 149 -83 166 -129 -23 87 66 16 -44 128 92
3867I2J40l5p6j92K7j85J11R6J29k90J49o3K23j74p7Q9j31L14k26J40J08k76L5
$$ 92 232 197 121 -71 -44 -229 -118 -22 107 -183 -34 -97 126 -48 -125 -36 -167 147 -79 61 169 -107 -72
3890g2K23k05l4K82j92P9m0k38K73N7l01K19j65L45l14J71k90K06L6KJ8J6k37
$$ -72 151 -54 -88 194 2 81 41 -197 76 133 -168 51 -114 231 -83 88 -202 4 40 42 60 76 -161
3913a61K99n4K2k55M05k64M4p5j59L30j2k13J1j31k16N83j17L33m28K4j62J50
$$ -161 138 84 106 -149 256 -8 36 -39 -198 132 120 -93 -82 -213 -429 154 37 370 -58 -34 -196 -46
3935d6k15K02J06M4j77L13l21K81l08k2J14M4oJ14j56j18Q3j00M9j6J51J72m05
$$ -46 -261 -59 47 91 -86 227 -94 187 -121 -143 -29 15 9 123 -33 -151 -68 -168 -119 -135 16 188 -217
3958b17M41k09q9K51k23K12l92M6l9K80p7M3k83L69j3l19K84k03K23lp0O5k21
$$ -217 224 15 -74 177 -46 166 -226 -180 -219 61 -16 27 -256 113 100 -219 65 -138 85 82 12 77 -144
3981a44J90O2p5k13j20M01k37J60Nj04J1J21k2kP7O1m98J99J77k47J58n2J84j34
$$ -144 46 108 33 -180 -300 101 -136 24 29 -75 -64 57 35 33 110 171 -327 -128 49 -198 -40 -92 92 -42
4005d2J44j01K91k76j22R9j44K72j30j85L50M5l03K41k77J12K37j22k26r9K57
$$ -42 102 1 292 16 -106 -7 -151 121 -9 -194 156 201 -102 139 -138 -26 211 89 -137 -236 21
4026B1r8l0K77J9m9R4l77L67k95J68l47N28k34q8K45j19Jj03N4J78m63QL20l20
$$ 21 -77 -107 170 189 140 234 -143 224 -71 97 -250 278 44 -44 201 82 83 -20 34 212 -251 -243 77 -243
4050b43J7R6K83k27L41k61J12j13k27J11J52n0K55k30%l43N11j98J08n0M9J25
$$ -243 -226 -130 153 -74 267 6 118 5 -222 -111 41 -9 246 16 16 -327 184 -14 94 44 93 218
4072B18l06J26m8k91K55K25j40q1Q7K07l9j66J80k90J20J0j6k28K69j81J40J98
$$ 218 -88 38 -10 -301 -46 179 39 -42 45 252 213 47 227 -63 57 67 51 -177 92 -89 51 249
4094B49l54J83j73J11J32k97K63k20j66L07k41K74j39M0J20M1j05j53K4j6K01
$$ 249 -105 78 -95 16 148 -149 114 -106 -272 35 -206 68 -71 -31 89 130 25 -128 -104 -120 81
4115H1K85m18l58M39J41k05Q9j42J69n7m1J42k99k0K49j4J18j09mJ23n9K29l81
$$ 81 366 -52 -410 29 170 -35 54 -88 81 24 -17 125 -174 -194 55 41 159 50 46 169 110 339 -42
4138d2j08J10J97J30k16k83L76j79K5j85J78l8J73k80K71r9j48K31j34J32j48
$$ -42 -150 -40 157 287 71 -212 164 -15 10 -175 3 -35 138 -142 129 30 -118 113 -21 111 -37
4159c7J77j73k6J25r1J05p2l8J64j30j30J94l1j37k8M8P4q5K10j73K08j9J32o9
$$ -37 140 -33 -59 66 -25 80 8 -30 134 4 -126 68 37 -100 -128 -80 -6 -91 119 -54 154 135 267 198
4183A98k68M21k03r2k39J90j63j2J51J4L74k85Ql04J41K03J59k03l15L65m81N02
$$ 198 -70 351 148 56 -183 7 -156 -168 -17 -3 371 86 94 -210 -69 134 293 90 -225 140 -341 161
4205A61N0k39J63Nr3l13J41K98j57j03J74j71l0K24m06K68K86l95jO0j62J06M2
$$ 161 211 -28 135 140 47 -266 -125 173 16 -87 87 -84 -114 110 -296 -28 258 -137 -138 -78 -240 -134 -92
4228i2K97l53J0J00m4L96l47J83l00J26R8j1L5j34q7M50m06j7L30l36q9K50k59
$$ -92 205 -148 -138 -38 -82 314 -33 150 -150 -24 74 63 98 -36 -123 327 -79 -96 234 -102 -191 59 -200
4251b00K15k18J61J53j31l2J39j8j38J51K2R2j11k82J35J35o9P0l50O19n71J23
$$ -200 15 -203 -42 111 -20 -52 87 69 -69 82 104 196 85 -197 -62 73 4 74 -276 343 -228 -105
4273a05K16l0r1K6r7K77O8k11K4K1j32j80L62j67l6j00K01Oj03J42Lr6j15K79
$$ -105 111 81 -10 16 -81 196 264 53 77 98 -34 -214 148 -19 -55 -155 46 52 -51 91 94 -2 -117 162
4297A62m03K84J0M5k3k4J18m43K63N0k48L47m5J9k60L74l77j59J96l6K22j03n0
$$ 162 -241 43 53 98 75 51 169 -274 -11 39 -209 138 93 112 -148 226 -151 -310 -114 -150 72 -31 -81
4320h1J27J36m7j4q2J64j90j9J58j99J89j19l9N6j24J5qJ73k69O2L48j96j06J6
$$ -81 46 182 135 121 39 203 13 -6 152 -47 142 23 -16 40 -84 -69 -77 96 -173 -111 237 41 -65 -49
4344d9L71n01M4j09J64J85r3k29R1o8M33r1j28N4K7k8J8p9k39k59N21o8Q6K39
$$ -49 322 -179 -135 -244 -80 105 12 -217 -126 -194 239 148 20 74 101 73 91 12 -227 -486 35 -33 53 292
4368B92j59K26k67mM1J4j16k15M33J00l62lq2K38l3J39l12J72k5j68j6O5L03k11
$$ 292 133 359 92 88 129 143 27 -188 245 345 -17 -20 -102 136 103 242 -70 102 77 -91 -107 -42 261 50
4392E0n9pj67K96l47L73k16Q5p0P8L1j97q6O7K73m23M99j43l75M61L5K6j63J26
$$ 50 -9 -16 -183 113 -234 139 -77 8 -62 16 47 -150 -236 -169 104 -319 180 37 -338 123 158 184 21 147
4416A47l3k19j03M07n3k49J41j07M2j15J91nJ09l89M10l49J6M50j12j78Q0j03
$$ 147 114 -105 -208 199 146 -103 38 -69 -27 -142 49 44 153 -236 174 -175 -159 291 179 1 81 -22
4438b2L5J5q1k1K84k13j88K13R7l09K15j3M6r8j72K72j56J66l27J27M29j63j69
$$ -22 13 28 -53 -74 210 -3 -191 22 119 -190 25 12 58 -40 -212 60 -96 70 -257 -130 299 136 -33
4461c3J95j55K7j43Q5n8J1Or8K14j85J46J54k89j12M29J71m46L02J47k15k04K15
$$ -33 162 7 34 -109 -24 -82 -71 -65 -163 51 -134 12 166 -123 -235 194 365 -81 221 368 153 -51 164
4484A64m12J97Q0p3K74l68J70N1j32Q8O1l5J54j50j72j02J43K47m70L85k03L4
$$ 164 -248 -51 29 -44 230 -138 32 83 -49 39 100 65 219 69 -103 -205 -62 185 -285 100 -103 -69
4506f9K6L3J0Q4p2Pm9j77L40k83J02K39K42k27m1j6Q8j41j98n5L0J39K30l75P3
$$ -69 -43 -10 0 84 12 19 -30 -207 133 -150 -48 191 433 206 165 149 237 96 -102 -157 -127 12 242 -133 -60
4531f0K8Qk7n6K04k64L56j48o6K05j47K06k58Q2l14J43J56k00P9J96k54M45l46
$$ -60 -32 -24 -51 -107 97 -167 189 41 -25 180 33 239 -19 63 -251 -108 48 -152 -73 123 -131 314 -32
4554c2J64n4j56Q3J95j05m0m11L09k23M64l51M01j91k35K69o6J2J38j98K8r0O
$$ -32 132 78 -78 5 200 95 55 -356 -47 -270 194 -157 244 53 -182 87 21 33 171 -27 1 -89 -83
4577h3J74o1M9R1k29J07L24l71J62Qj66o8qK33j95K1O7K0m20J84kK33r5j30L20
$$ -83 91 30 79 170 -59 48 372 1 163 171 5 -63 -71 162 -33 -12 55 75 -345 -161 -163 70 -25 -155 165
4602A65Q4l89j6K92k93j2K20k18J90r4j03L17j27j51J91k17K70j01k30K92P6j18
$$ 165 249 -140 -156 136 -157 -169 51 -167 23 -71 -174 143 16 -135 56 -161 109 8 -222 70 146 28
4624B8M4J17j33J1q9K74Lk10M1j59J93l41K83m4n3l1k46L61j43K11l44J78K23
$$ 28 72 189 56 67 -22 252 255 45 86 -73 120 -221 62 18 -35 -66 -312 49 -94 117 -227 -49 174
4647A74m3P4k90J85n5K03K92q80L68K9mm0p2J0N4r6K52o8q8J25m1k53K19O8j96
$$ 174 131 205 -85 100 45 248 540 -340 28 57 53 13 -59 -49 5 -91 161 93 5 130 89 -164 55 123 -73
4672g3n8M7R8n0J66n8K09k06q6j14R4j34J58L78j74j62k53K43k05J6L6R6J02N8
$$ -73 -131 -84 14 -36 130 72 281 75 -11 -125 -31 -165 -7 371 197 35 -218 25 -180 -164 -128 -32 70 128
4696A28k5K4j81m9K86k07P3k52J77J12L2l48L94j45M9j05o0R8NJ66L1l73J30J84
$$ 128 103 127 -54 -103 183 -24 49 -203 -26 86 118 -230 164 19 68 -37 -97 1 6 172 203 -170 -40 144
4720A44o6k46J81K1k44L44j68j7p1L33j87n2j34L32J4j55lL2K16j97j68j8K63
$$ 144 78 -168 13 34 -210 134 -34 -51 -122 211 24 -28 -162 170 184 29 26 58 274 77 -91 -109 154
4743A54j35K1m6M6pJ22j57n8Pl5L3p6K19k97K09r4K34k05N2r2J20J17p3l6k53
$$ 154 19 40 -6 40 33 155 -2 -60 -53 -88 -55 -131 88 -209 0 -94 140 -65 -13 -105 15 132 59 23 -230
4768b30J45O1Q4j45L0K2J95k00kl9j83L19O1J5l24K59l29J08Q1J29%j63K51k74
$$ -230 -85 -24 60 -85 -55 -33 162 -38 -40 -79 -262 57 118 133 -191 68 -261 -153 -72 57 57 -106 145 -129
4792a29J13P9j94J62p2K7N1o6J77k56O7Q1K74l66j24K15Pj50L1J71ok71M08l30
$$ -129 -16 63 -131 31 -41 -14 37 -29 148 -108 -41 40 314 -52 -176 39 46 -104 -73 98 92 -179 229 -101
4816a01j02L19k06M4N5J29p7k2k43K09qj75mJ56jr4J71k23R5K36j21j55K1J74
$$ -101 -203 116 -90 -46 9 138 61 39 -204 5 -3 -178 -182 -26 -27 -121 50 -173 -78 158 37 -118 -97 77
4840G7K09j10k08K13k06O3k88K57l25O02k98J89l8l12l5J90l2j71N5o5o4L08R6
$$ 77 286 176 -32 181 -25 38 -250 7 -318 284 -14 175 137 -175 -210 -20 -52 -223 -168 -233 -297 11 107
4863A07Q4k31L0N9p4j02J62OJ52j11j57J20N0l65K52ok40L04o4k11K83R2j77J76
$$ 107 191 -40 -10 49 -25 -127 35 41 193 82 -75 45 95 -270 -18 -24 -264 40 -24 -235 48 140 -37 139
4887A39k28LQ3p7K53q4N4J17j39m9K79m47K91k24n2J71J6r8j49M5j6K20o6p6J31
$$ 139 -89 -86 -3 -80 173 89 143 260 121 72 351 -96 195 -29 -81 90 106 8 -141 -96 -112 108 42 -34 97
4912I7Rj00K45k30J60k43J27j77Q3k9K2j3j04Q6J36o3j06L88l32P7Q2J20l84O9
$$ 97 106 6 251 21 181 -62 65 -112 -29 -58 -36 -49 -153 -67 69 6 -100 288 -44 33 115 235 -149 -80
4936h0Rk0r7L48k4J53l73R5j7k89M62m5j11l48L33J28l09J75o7K04k21J81j58
$$ -80 -71 -91 -188 160 136 289 -84 11 -6 -295 167 122 11 -337 -4 124 -185 -10 -77 127 -94 87 -71
4959g1n2L64k19J1kP4m2k0k9J62k38O6j33J88l38L83k33J40j20K06J5j44M6L8
$$ -71 -123 241 22 33 31 105 63 43 14 176 -62 4 -129 59 -279 104 -129 11 -109 97 112 -32 14 52
4983E2J04k20NM2K5m9k7J26J8j44L38k61J20k22%r2J10Q9j16L9o5j68L35m9k20
$$ 52 156 -64 -59 -17 8 -41 -68 58 76 -68 270 9 129 -93 -93 -185 -75 14 -102 -63 -128 -296 39 -10 -230
5008b30K70j00R1k26J71p3K72j77K8n8J78j01M5J2m2J37Rm7l3l4M6J9k26q7K08
$$ -230 40 -60 31 -195 -24 -97 175 -2 26 -32 146 45 90 102 60 197 206 159 126 92 138 157 -69 -156 52
5033E2K17n78K16J3M9J41k98K43j59L76j66k51P3N1m9J79q6j9k13K39l9k75M40
$$ 52 269 -309 -93 -80 -31 110 -188 55 -104 272 106 -145 -72 -21 -70 109 23 4 -209 30 -9 -284 156
5056A56j22p3pL4qO5l61K93Q9k73M65n9j7j66k57K83k94R3J3P2L37m03J56J66
$$ 156 34 -39 -46 -12 -20 45 -316 -23 66 -207 258 199 182 16 -241 42 -252 -159 -146 -74 263 -140 16 182
5080A82j72l82L72j10p1jJ02Q3K62k58o0m3o1L38j48l2M0J77q2j64Q9l2l2j20
$$ 182 10 -372 0 -110 -181 -182 -80 3 265 7 -53 -96 -157 181 33 1 41 218 136 -28 61 29 -3 -123
5104a23L11j11Q6l80K84k73K07O4j53J69j44p3K39j89L78m49J44R1k91L50J44
$$ -123 188 77 163 -217 67 -206 1 65 -88 81 -63 -136 103 -86 292 -157 -13 78 -213 137 281
5125B81m48N3J29p0l7p3K73l21K37J35m08K37K02n0j11k0k16J38J61q1J20j71
$$ 281 -167 -114 15 -55 -92 -165 108 -213 24 159 -249 -12 190 140 29 9 -207 -69 92 11 131 -40
5147d0j45M12j33p3P0p4J63j90J1K22k24J24J96m46L16m12J00K21j68J5n2j24
$$ -40 -185 227 94 21 91 17 180 -10 1 223 -1 123 319 -127 189 -223 -123 98 -70 -55 -107 -231
5169b31J77J29K45l21O2M6o0n4q5K12k77K33k46J50M4J18j20lj08K27m18K28Q4
$$ -231 -54 75 320 -1 61 107 47 -7 -92 120 -157 76 -170 -20 24 142 22 19 -89 138 -280 -52 32
5192C2m7J39k80J81j27n4M03j86N9J25l56n5K89M8N6l37k4j4J11k6J32l94J37
$$ 32 -15 124 -156 25 -102 -156 247 61 120 245 -111 -166 123 171 227 -110 -134 -148 -37 -63 69 -325 -188
5215a88M03l11rK35j07o4o8J39j8K7k3r6j94K94j19K39l39K7J99j20K97l32J25
$$ -188 215 -96 -105 130 23 -41 -109 30 12 39 16 -80 -274 20 -99 140 -199 -172 27 -93 204 -128 -3
5238cj99M5J86J02k26R6j25l2R8J31n1j3jR4k77N3l7J06rNk2LP5K60n02K29J83
$$ -3 -202 -157 29 131 -95 1 -124 -156 -58 73 22 9 8 102 -175 -122 -159 -53 -62 -57 -79 -76 -1 259 -243 -14 169
5265A69l3j24jj81J13Q7R2k57J67o8j33K93r1O8P7m19M54m4j45l8P2p8J06M6m08
$$ 169 136 12 11 -170 -57 30 122 -135 32 -36 -169 124 33 101 178 -241 213 169 24 -14 58 -20 86 132 -276
5290b76M1L13o0k82J75M23j34k20J3k53K98L2j62J19Q7J67j50q8r9k03L1K92o7
$$ -276 -235 78 18 -264 -89 334 200 -20 -7 -260 38 70 -92 27 114 281 131 43 -56 -259 -228 64 -3
5313cK9Q1R5j18L3j70m3K26L6j48k4J18j35M7J22j76n4Mo0K78o2M3m29K22L41
$$ -3 26 107 202 84 117 -53 -96 130 166 18 -6 112 -23 24 146 -30 -84 -80 -140 138 76 119 -310 -88 253
5338B53l47j08J35Q5r8L82j73l45L01M0j19k5N4J02k99L23J7p9j23j65J43q5J89
$$ 253 -94 -202 -67 18 -80 302 129 -216 85 125 6 -19 35 137 -162 161 178 99 -24 -189 -46 -131 58
5361E8M2j95Kmp1N4P0J95r7j14J55J68m87L41PM2MK0k36L2Q9j96L0J65j94r3J49
$$ 58 100 -95 -93 -97 -168 -114 -44 151 54 -60 95 263 -224 117 124 166 170 190 -46 -14 75 -121 -91 74 -120 -213 -64
5388f4l2J85k18K43p2m00J66J84K2pl23L86j30n1J53n4k20L03j28k07J61l0K44
$$ -64 -96 89 -129 114 42 -358 -192 -8 14 7 -316 70 -60 -111 42 -12 -232 71 -57 -264 -103 -133 111
5411A11k1l6j49j02L09J91k99j03K25k65K35M8j53j31n9J77j14M7P2Lo7K95k07
$$ 111 90 54 -95 -197 112 303 4 -99 126 -139 96 144 -9 -140 -199 -22 -136 -89 -17 -14 -81 214 7
5434Gl5L50l18j3j7K54k04j5J25l7j24R1n2q7M1K64l17K59l05K28k98K01q6n4
$$ 7 -28 322 4 -9 -26 228 24 9 134 97 -27 64 12 -75 -34 230 -87 172 -133 95 -203 -2 -88 -142
5458a42R8J38r4O3j22J83M0j73J47j54o8M7q6j81J91K55n0J0m12L24j27K11k79
$$ -142 -44 94 0 63 -59 124 164 -9 138 -16 -84 -37 -123 -304 -113 142 92 102 -310 14 -113 98 -181
5481a81J03K22m54K96J76N4j92j45L6J96n8J78l07K03r4j16P9K19j38J9k21K51
$$ -181 -78 144 -310 -14 162 216 24 -121 -85 111 53 231 -76 127 33 -83 -4 215 77 96 -125 126
5503A26j20L5j30L0l03J34M0L47j44ok6K79k97P2L3L7j0p1r9L80m17J63J22o2
$$ 126 6 41 -89 -59 -362 -228 -188 159 15 9 -17 262 -35 37 70 107 97 26 -73 307 -110 53 175 113
5527A13j57j08J74J51k80K66q7l6L1n2j42K94j0l3j04k1M3m5l7l0O1P7j23j3Q0
$$ 113 -44 -152 22 173 -107 159 72 36 67 15 -127 167 157 124 20 -1 42 -3 -40 -70 -9 68 -55 -68 12
5552A2O7j84r6Q0O2J77R3k46j49L24k01J10j0J3k64J85R8o0J72j06m4m8L86m39
$$ 12 79 -105 -201 -121 -59 118 211 -35 -184 140 -61 49 39 52 -212 -27 71 11 183 77 33 -15 371 -68
5576f8k36M56j01j19M5K0j22J74K50j58k64L2r3L36j44N9mJ20l16J06Qj85N1O2
$$ -68 -304 152 51 -68 -23 -3 -125 49 299 141 -123 -91 -184 152 8 67 63 183 -133 -27 -19 -204 -153 -91
5600i1K47j71o5R1PQ1k67j40J13KJ77Q5j47j60J67J92Q6l31K58j73j55J50k6P5
$$ -91 156 -15 -80 11 18 99 -168 -308 -195 -193 -16 69 -78 -238 -71 121 207 -124 134 -39 -194 -44 -70 5
5624EJ12l4l9k69K94l2PNL5K1J26l64L9J12K57l18J68k73Q2K42j38K8j64K5N5
$$ 5 117 83 44 -225 69 37 44 49 84 105 231 -133 -94 18 275 -43 125 -148 -66 176 38 66 -98 -73 -18
5649a8j36jL28k34p7K57k00M6n7K11J3p4m4J94k09R7k82J97J74k2j86K11l60J62
$$ -18 -154 -155 173 -61 -138 119 -81 -35 -92 119 132 58 14 208 -1 96 -186 11 185 163 -23 188 -172 -10
5673a0j5k6J17p2%K15m32M44j47k8j83J72p5J09l4M2M8j70J04l0Q7k50o0N1K73
$$ -10 -25 -51 66 -6 -6 209 -223 221 74 46 -137 35 -40 69 35 77 125 -45 59 29 116 -134 -194 -143 130
5698A30p2m10L52r9L69j0m28J06p4J63O8k36J72k53L95J01n46K91Q3k1j90l2j4
$$ 130 58 -352 0 -99 270 260 -168 -62 -136 27 95 -141 31 -222 173 274 -272 19 102 81 -109 -141 -155
5721a55P2R4R6j29K9j62j48K97k9p3M31k54K43m47L4K95m0l15K7J10q2J97P2k95
$$ -155 -83 11 107 -22 7 -155 -303 -6 -35 -108 323 69 312 -135 -101 194 154 -161 -134 -24 -106 91 163 -132
5745a32L56j37j18O2J03k08q3L9P4J27l9j04P8J9P6jp5o2R4k98M84m52L17O8k13
$$ -132 224 87 -31 31 134 -74 -157 -118 -44 83 44 -60 18 37 113 112 37 -25 69 -229 255 -197 120 188 -25
5770b5L82l86M6l2P9r2J18m2J11l77J85j27N1j7k8Q6J24o9mj54J61Q1j15j29J22
$$ -25 357 -29 17 -15 64 -28 90 48 159 -218 -33 -160 -109 -126 -154 -68 56 -13 -17 -171 -10 71 -44 -173 -51
5795e1J86j24R3j67L25k42jm9k00L35j24k94J75K05j73L6j4J47k32J64K61l58
$$ -51 135 11 104 -63 262 20 19 -30 -230 105 -19 -313 -138 67 -106 -70 -84 63 -169 -5 256 -102
5817a02l4L7p3J90J9j43P7r2L05l70J15j2j08K41J30k76M8r3K10j5J32l54K89
$$ -102 -136 -99 -172 18 37 -106 -29 -121 184 -186 -71 -83 -191 50 180 -96 -48 -141 69 54 186 -168 121
5840A21j23q8J45N2j48Q1J24j5L4k06p9K15k70N0L41k35j45L32l0o3k48M8j1K67
$$ 121 -2 -90 55 107 -41 40 164 149 183 -23 -102 113 -157 -107 234 -1 -146 186 156 93 -155 -107 -118 149
5864A49j92m5j7qk03M66j24q0j91L75Q1k77l6L5J61o3J96j33j35o1J20J79j58
$$ 149 -43 -88 -105 -113 -316 150 26 -54 -245 130 211 -66 -102 -67 94 31 227 94 -41 -102 18 197 39
5887C9O7m29K19J66j97Q7K54j99L11k00j4O3j31J04k68J33k2j71o5J17L8P1K9
$$ 39 106 -323 -104 62 -135 -48 206 7 318 118 104 167 36 140 -128 5 -17 -188 -253 -136 -98 -27 2
5910Bo2J04j5j08o1J67K3k15J21K17l76K80K71l50J79k15P6n3j5n3l7m8K92l24
$$ 2 -60 44 29 -79 -140 27 50 -165 -44 173 -203 77 348 -2 177 -38 38 -15 -30 -83 -120 -168 124 -200
5934b00K70j20p7J92n0j40K48K0n22M50k68J09J46r0j93J77o4j41L83k71N1K31
$$ -200 70 -50 -127 65 15 -125 123 143 -379 71 -197 -88 58 -32 -225 -48 -112 -253 130 -141 -90 141
5956A41k27R4J6J4Q3l23J99K9J22k71J28M8N5j03M9l4N4o7n6J59j42O4p1P9k2
$$ 141 -86 8 24 38 121 -202 -3 26 148 -123 5 53 108 5 54 20 74 7 -49 110 -32 32 -39 40 18
5981A8k19K03Q7j65o8J64j5K58k18k53K20J0K27j25m11J02J04J43j70j32L36n9
$$ 18 -201 2 89 -76 -144 20 5 263 45 -208 12 22 249 124 -287 -185 -81 62 -108 -240 96 37
6003C7K5qk55J73J74oP0j78N1J9O5k14Q7J43k67J80j27J77k90J3L21j48J05j29
$$ 37 62 54 -201 -28 146 140 210 32 83 102 167 -47 40 183 -84 96 -31 146 -144 -131 190 42 147 18
6027A8K6K0l3k34L24l4o9J57k37J08n4k24K14K6K11k59J10l6K3k46J89K44m97
$$ 18 44 64 31 -203 121 87 18 175 -62 46 -8 -232 -18 8 219 -40 70 34 57 -189 0 244 -253
6050b53M85j35K4r0j09K40l38K58o6J22j80J34l8J9N1j32j7j94K74j85L35o3O5
$$ -253 232 97 121 31 -78 162 -176 82 16 138 -42 92 54 73 124 -8 -25 -219 55 -130 205 142 207
6073B07k74J75r1L4k78K09q2j54L49J73k58j21L4K46l18L36j48M0J42m44L51k03
$$ 207 -67 108 17 51 -227 -18 -100 -254 95 268 10 -111 -77 169 -149 187 39 79 221 -223 128 -75
6095g5r2J04J97r5k75J99l46M22O0l5k53j03M13j15K19l34K08L7j31J07k32P9
$$ -75 -167 -63 134 39 -236 -37 -383 39 99 64 -189 -292 121 6 225 -109 99 136 5 112 -120 -41
6117d1Q8j92J58R2k14j55L28J32j24n5oj35L04l15l5J99J16j77l9J10LJ77j05
$$ -41 47 -145 13 105 -109 -264 64 196 72 17 11 -124 180 -135 -170 29 145 -32 -71 39 42 219 114
6140A14l13L23j72n1K11l46M24j63o1N9j26J39j69J73L9J18j78j9on9J43j08N3
$$ 114 -199 124 -48 -99 112 -234 190 27 -34 25 -101 38 -131 42 81 199 21 2 -4 -63 80 -28 25
6163B5%K9L9J10Pk35rJ5M0n7K34k67J17J66j12j00M5j59K30q5o7j6J71j02K69
$$ 25 25 54 93 203 210 -25 -34 -19 21 -36 198 -69 48 214 102 2 47 -112 118 33 -34 -50 121 19 288
6188B88k47j28J29r9M93l76j25K18n0j37K9Ok6N4J35k37l01L34j3n5K69k14k01
$$ 288 41 -87 42 -57 436 60 -65 153 103 -34 -5 1 -25 29 164 -73 -374 -40 -53 -108 161 -53 -254
6211b54M21k11Q2j15J69k54L76j83K8J53l3k38P0j12J97p4k55L41L6k55J78r9
$$ -254 167 -44 38 -77 92 -162 214 31 59 212 179 -59 11 -101 96 22 -233 108 144 -111 67 -32
6233c2J02n1J41j20L8n8P0k08J52k28J40J1o2J55j34p6K39Oq6k71K43kN3O6j23
$$ -32 70 19 160 40 78 20 90 -118 34 -194 -54 -43 -105 50 -84 -160 79 85 -1 -272 -29 -31 22 88 -35
6258c5J29l60K80j18ljJN0R8q4j0J52j23j55K92l52J33J55j79P9J39j14K73Mk22
$$ -35 94 -266 14 -104 -107 -108 -107 -57 41 -43 -53 99 -24 -179 113 -239 -106 49 -130 -51 88 -26 247 251 29
6283B9k9j26M17k98K22j07o4J31l74M70l27j07l7K26J98j01j68K73j31k72l11
$$ 29 0 -126 291 -7 215 108 44 175 -199 271 -56 -163 -200 26 224 123 -45 228 97 -175 -486
6304d86L54K39k93L50r4j72P8J51k81L47k95O1j47L59j92o8L03l65k6J94J59k26
$$ -486 -132 107 -186 164 70 -102 -24 127 -154 193 -102 -41 -188 171 -21 -89 214 -151 -177 17 176 -50
6326e0J80Q6n7on6j60m2m7O3K45K06m51J11j69L12l54J02q3K42M6j49Q1j77K61
$$ -50 130 216 159 153 97 -63 -105 -152 -89 156 362 -89 22 -147 165 -189 -87 -170 72 118 -31 50 -127 134
6350A34j58r1L76j43k44o0K79J22j72J02p1Nj29o5jL26k35o5j4j58J90k3P5J9
$$ 134 -24 -115 261 118 -126 -186 93 215 43 145 74 79 -50 -115 -116 210 -25 -90 -104 -262 -72 -95 -20 -1
6374am9P1k9k16K2J02J85j09k1o8J7K20k24p1m7Q7L80j27j22K65j79L64l14j04
$$ -1 -50 21 -8 -224 -202 -100 85 -24 -45 -113 -96 124 -100 -171 -218 -131 249 122 0 265 86 450 136 32
6398C2J83M5l46J76J52l34K55k83J06j08J1K29k60R4R5j10J75q8j21J79p6J16
$$ 32 215 260 -86 90 242 -92 163 -120 -14 -122 -111 118 -142 -48 47 -63 112 24 -97 82 6 122
6420A22l6J82m1k0m25L73k29k3k4J25J10o4j76K23j2j22J79L3J3Po1l78k9O7L57
$$ 122 86 268 227 207 -218 155 -74 -97 -121 4 114 50 -126 97 85 -37 142 175 188 195 134 -244 -273 -206 151
6445A51j26J46q6J31j60l29K79L58j27k49J28j35k72L26k2k38M95k56j82P8L2
$$ 151 25 171 85 216 56 -273 6 364 237 -12 116 -19 -291 35 13 -225 270 14 -168 -90 -58
6466e8o6K31%N3l37L60j81m7J57kj93J17LO7m84K70K18j17K49j70l74K98j7J63
$$ -58 -124 107 107 160 -177 183 2 -45 112 110 -83 34 37 104 -380 -110 108 -9 240 70 -304 -6 -23 140
6490A40k25M52j96l18J04K02k77J67L07k64r5j41mM4J21J26j96q7J09P7j16J56
$$ 140 -85 367 171 -147 -43 159 -118 49 356 92 -3 -144 -148 -104 17 143 -53 -140 -31 46 -70 86
6512H6k88J96q9k35M57m1k01L51j67l25L85K8k67J54k36K34K82l30P3q4O1k6p6
$$ 86 -202 -6 -95 -330 127 86 -115 236 69 -256 129 157 -110 44 -192 42 324 -6 67 -17 44 18 -58
6535e8J16j07j67J02J96j65n8J34j56R8R2k71K72p7q4J39J83j65J23k22j24J02
$$ -58 58 -49 -216 -114 82 -83 -141 -7 -163 -65 27 -244 28 -49 -133 6 189 24 147 -75 -199 -97
6557i7J86l1k06J5K10m41K67J45j08Q8QO6j28L13l94j04L51j5r7k2p3K7nJ22j80
$$ -97 89 58 -148 -133 77 -364 -97 48 -60 28 36 102 -26 287 -107 -211 140 125 28 6 -67 -40 -45 77 -103
6582a03J97p0j59k6K01q6n4J5J38j9j09j51K39m1K01j84Q4r6K10p4l8Q4j46P2
$$ -103 94 24 -135 -161 40 -46 -100 -85 53 34 -75 -226 13 -28 173 -11 73 -23 187 113 75 159 13 85
6606H5j53M9Q2l2K5l23K66Q0j63K19J1m2k22K60jr1J64l17J55J07k36k9J21l12
$$ 85 -68 -19 63 31 56 -267 -1 79 -84 135 146 104 -118 142 141 50 214 -103 52 159 -77 -106 15 -297
6630b97K81P5j70P0Q8Kl0Q0k53K5J89K65l30l8J23j62J43k43Q0j57L62k7L1N7
$$ -297 -16 59 -111 -41 47 49 19 99 -154 -129 60 325 -5 -43 80 -82 61 -182 -102 -259 103 76 107 164
6654A64o0n8k2j5j39O21m96q9J2K6q3J53J6k12J56O9Q6l31L13j2L83l46k25J03
$$ 164 104 46 24 9 -130 491 -5 -94 -82 -56 -139 14 30 -182 -26 43 129 -202 111 99 482 136 -89 14
6678A4j53O8J75p1k18K08l%j96M68k38J56J83l98j8l5j9K66j64L2l8r0o7K46k23
$$ 14 -139 -71 104 33 -185 23 20 20 -176 292 54 210 393 -5 -23 -58 -77 189 25 57 19 -71 -138 108 -115
6703a15L21n0n0q0j38p7K38r0j38L64j20k3J43k66K00o2r9j74K31L24m21j95L45
$$ -115 206 156 106 26 -112 -189 49 -41 -179 185 65 42 185 -81 119 57 -42 -216 15 339 -82 -277 68
6726F8rk11j2N04m65J71l8J05o6M4l90J73K63j80K59k46J01K58k86k13K42k03
$$ 68 59 -152 -164 340 -125 46 8 113 47 91 -299 -126 137 -43 216 -30 71 329 43 -170 72 -131
6748a31J71J06o2o4J09o28M99N8j66Q0j81L60j03j8j20J43k0J77k58M41l90m4
$$ -131 40 146 84 20 129 -499 0 58 -108 -28 -209 151 48 30 -90 53 33 210 -48 393 3 -41
6770d1K4j33L68J1l00N1J6L25k33J63k38l6M4j74J01k00J22K97j92l2N1J1L57
$$ -41 -17 -150 218 229 -71 -20 -4 321 88 251 13 -23 21 -153 -52 -252 -130 167 -25 -57 -6 5 362
6793C62l97K0r3pK23qq8M9r9J59j24J19jj14L01l13J01n7k02J23j01N1J41j28
$$ 362 -35 -15 -108 -115 108 100 12 61 -38 121 -3 116 115 1 302 -11 90 33 -169 -46 -147 -96 45 -83
6817h3K26m70L70j35J43Q5J77j29l18M6M2j67J54N7O7L7n1j6R3P5j06n2k02K03
$$ -83 143 -327 43 -92 51 136 313 184 -134 -88 -46 -213 -59 -2 65 102 51 35 128 203 97 45 -157 46
6841D6p4K04k2p6m08K46K48n6l2O6J4j95K63l75J36k53M07J21l27K15l67N34o31
$$ 46 -28 176 154 78 -330 -84 164 108 76 142 156 -39 224 -151 -15 -268 139 260 -67 148 -219 315 -316
6864c16M73k77J89l0j17J81K2K1k67k0J4K01oj27n2nL19j9Lk95N1k01J7L60k36
$$ -316 157 -120 69 39 -78 103 125 146 -121 -141 -127 74 68 -59 -111 -116 203 184 187 -108 -57 -258 -241 119 -117
6889a17j19K97O9k71J69j64J03k0O8l27K38K68k80K56l75K96j46O7q9LJ70K34
$$ -117 -236 61 130 -141 28 -136 -33 -53 15 -312 -74 194 -86 170 -205 91 -55 12 -77 -74 96 330
6911C30n36J57K61j39o8o1K19q4m74M11q7L6j2j31K2J33r8K31j13pk54L85k21
$$ 330 -206 -49 212 73 5 -56 163 79 -395 16 -71 -35 -47 -178 -156 -23 -121 110 -3 -10 -264 121 -100
6934a00L8o5K79n7r8J5q6m8j43L87j00K41k10r7J64k08J89k18k6Q4R4k9J68o5
$$ -100 -62 -127 152 95 -3 12 -74 -122 -265 122 22 263 53 -44 120 -88 101 -117 -143 -59 35 6 174 109
6958A09k77J44J93j49j64K16m79M09m4P3J3K4j36kQ5J01q2j91K27J31k69J02k63
$$ 109 -168 -24 169 20 -144 72 -407 2 -42 31 44 68 -68 -70 15 116 34 -157 70 201 -68 34 -229
6981b29K62l8N5J5j98M7L02l65J45K03l25m2L20p9k3r7j18J15Q4j94K96k00J63
$$ -229 33 -5 50 65 -133 -86 216 -149 -4 199 -126 -168 152 73 50 -47 -165 -50 34 -160 136 -64 99
7004I9Pj68K3L4J90j85K55m26J59L13m23J45L8r3j44J32j08MJ98k38K25J48q3
$$ 99 106 -62 -39 -5 185 0 255 -171 -12 301 -122 23 61 -32 -176 -44 -152 -148 50 -188 37 185 102
7027A02k75L20j92k31N5K32j67K87k35M4K74l29L2j94N7M75k18Q9j76J31l08J78
$$ 102 -173 147 -45 -276 -221 11 -156 131 -104 -60 214 -115 -83 -277 -220 255 37 126 -50 81 -227 -49
7049d9MJ22R4k47Q9o8P1O0j90k0Q8k64M33k20J40j59K57j02j42J43N8j88j04L25
$$ -49 -45 77 171 -76 13 -55 16 76 -114 -134 -46 -310 123 -97 43 -116 141 39 -103 40 98 -90 -194 131
7073A31j20Q1k6k0K01l04j59L15j05J2J52L27o06J5R3m6Q2J36K7j25O1O3l98Q9
$$ 131 11 92 66 46 247 -57 -216 99 -6 6 158 485 -121 -106 -13 -59 23 159 186 61 122 185 -213 -124
7097a24N2K77j17r7J0p8K8J62Pk89K76J8n3l19M31n09M26k9q1p6N0J46j43j76
$$ -124 -72 205 88 -9 1 -77 -49 113 120 -169 107 125 72 -247 184 -325 101 72 -9 -85 -35 111 -32 -208
7121b08o0R8M98m58j68J93J17J11J71j86n3L5j67j18K99P6l44L69m08K54j72K21
$$ -208 -268 -170 328 -130 -298 -105 12 123 294 108 55 90 -77 -195 104 180 -164 205 -203 51 -121 100
7143A00l99N18j8k59o5J57J52q7K6k7k34K38j32J5J15j72l4M2K22k24J01o6K64
$$ 100 -299 219 201 -58 -123 34 186 99 125 98 -136 102 -30 -15 100 -72 -106 -64 158 -66 35 -31 233
7166B33m21L04J6k90K75j54J09L87o45M9K0K04j82L03k29J00j52O9r6N0m6K8J70
$$ 233 -188 116 132 -158 117 -37 72 459 -186 -137 -117 87 -95 208 -21 79 -73 -4 -100 -50 -96 -68 102
7189A02K4P9jo4o9k26J26j5l18L45K20q4l4p6K20l6k92L25k57K41j71K0j54J63
$$ 102 126 205 204 140 71 -155 -29 -44 -362 -17 203 119 85 9 229 193 -99 226 -31 210 39 59 -95 68
7213F8r0K88k96K0r3j09J91J69k27M98m07J31j23P1k29J73j46j78K05j56L16j67
$$ 68 -22 266 -30 -10 -103 -212 -21 148 -79 419 12 143 20 91 -138 35 -111 -289 -84 -240 76 -91
7235i1K25j74j54L71k87N7P5j83J28K12P8j02j26k26KQ4M11m14j17K47r5MK09
$$ -91 134 -40 -194 177 -110 -53 22 -161 -33 179 257 155 29 -197 -195 -111 300 -114 -231 16 -79 -75 134
7258A34L2J18l44Rj1J25o9J73j83nn9j3K37p1J56k89J78K1m3j41k07J11O4M0j5
$$ 134 166 284 -60 -51 -62 63 -6 167 -16 -21 -80 -93 144 73 229 -60 118 139 96 -45 -252 -141 -77 -37 -52
7283e2J25j7P7q1p6p2l52M34n4O6JJ34q9K7l6j32j19M37k30p2Q1J92k04p4M04
$$ -52 73 56 133 52 -24 -96 -448 -14 -68 -2 -1 133 44 71 35 -97 -216 221 -9 -81 0 192 -12 -86 318
7308C18n19L47l07L60l36P8J24k58P2J15k21K25r7L1l5Q9Q2q2r6K37j49Q6J6L4
$$ 318 -201 146 -161 199 -137 -59 65 -193 -121 -6 -227 -2 -99 -68 -103 -14 68 -14 -110 127 -22 64 80 114
7332A14J8j31j84K22O1j03q0J7J49j55J2j66K04o1J22M2m2j0l5j15l4P1%pk9P6
$$ 114 132 1 -183 39 100 -3 -83 -66 83 -72 -60 -226 -22 -83 39 81 39 29 -6 -121 -155 -84 -84 -91 -120 -44
7358d4J32m1k19L18k41L5J88l43J65J67k60J04J13k24J09j38L28n5J37l67K65
$$ -44 88 47 -172 146 -95 -60 128 -215 -50 117 -143 -39 74 -150 -41 -179 149 94 231 -136 129
7379A29j33J47j04Q3j02N7pk58Q3L20j34q9K99m02K68k61J24J66k33Q8j50J48
$$ 129 -4 143 39 122 20 77 70 -188 -105 215 81 -8 291 -111 157 -104 20 186 -47 41 -109 39
7401C9M7K69l32J93j07j83J21j26J08j14J0J25K2P8J90j63k22k25N60m78o8J39
$$ 39 86 355 23 216 109 -74 47 -79 29 -85 -75 50 72 150 340 177 -45 -270 290 -188 -256 -117
7423a17K30q7l2J72j79J9nJ4p9J45L9j45m2K9r1P7q1R0K66j73j5K66m44J99Q6
$$ -117 113 26 -6 166 -13 6 1 15 -64 81 120 -25 -67 -38 -129 -52 -133 -43 223 50 35 301 -143 56 142
7448A42k79J43J7j83q4N5J78PN6k22J23J13Q2j66Q3ql46N04k26r8K47l82M31m12
$$ 142 -137 6 23 -160 -244 -189 -11 -4 52 -170 -47 66 148 -18 65 57 -289 215 -11 -109 138 -244 187 -225
7472b25J50rJ64N8n1K2l15L19Rl11K01j25J60K9q6r3L49l36j15J77J6j55K02J52
$$ -225 -75 -84 80 138 87 109 -206 113 122 -189 12 -113 47 76 -10 -103 246 -90 -205 -28 -12 -167 35 187
7496A87k37j05J53k09K84M6k09J39j04jP4R5j2j83L07k51K87o4j43j38J41j83
$$ 187 -50 -155 -2 -211 73 119 -90 49 -55 -56 18 113 101 -82 225 -26 261 197 54 -84 57 -126
7518a26J29Q0k53J50L5k80J81p7P0j6K32J0j93l4J81k00m3R0O2j86J11J53j03
$$ -126 3 83 -170 -20 15 -265 -84 -161 -91 -107 125 135 -58 -92 89 -111 -154 -64 -2 -188 -77 76 -27
7541b7K83k73K62m78P0L69l66K03k7j8l8J28j88K08j61Q6J39k56J97M9p9q5q6
$$ -27 256 -17 245 -233 -163 206 -160 43 16 -2 -40 88 -100 108 -53 33 172 -84 113 162 83 -2 -88
7564h8n9J29P0l5L4j00o9R8oJ15k61J13J74k15L1P9j15q2K04k66L89l25K43R6
$$ -88 -147 -18 52 17 51 -49 -118 -20 -26 89 -172 -59 115 -100 -69 10 -105 -187 17 -249 140 -185 58 154
7588A54l8q5j50R6N1J23k76Q5O5j4K21k41m7k0J06R8j35n2J05J2J17J3q1l05L62
$$ 154 116 31 -119 -23 28 151 -125 -40 25 11 232 -9 -56 -76 30 128 -7 -59 46 58 175 188 107 -198 164
7613A64p0J7n9k34J84r3R4LP0j4L9l0k08J70j74K27k04J39J29p4l2N9j26k01J84
$$ 164 94 111 52 -182 2 -91 3 6 76 62 101 71 -137 33 -141 86 -118 21 150 76 44 103 -23 -224 -40
7638d0r1n6N5K53l13K59P6m05K00J70j84J61l67L52n2k52J06L9J32J2k08L05j83
$$ -40 -131 -187 -132 121 -192 67 143 -262 -62 108 -76 85 -282 70 18 -234 -128 -89 43 55 -153 152 -31
7661c1J7m6K10J33l93J79j23J09j76K12j91J66J6k78P2J64l8%o6K01j00p2k35
$$ -31 -14 -60 150 283 -110 69 -54 55 -121 91 -100 66 82 -196 -124 40 2 2 -64 137 37 -35 -270
7684b70O9L0J36L0n6K26l79J1J43j95J61K34j30O1j43K11j23L4j8KJ04k5jj5k24
$$ -270 -201 -171 -35 -5 -61 165 -214 -203 -60 -255 -94 140 10 71 -72 139 16 50 32 34 138 113 112 97 -127
7709a27J47j09j2J54k82K16p6J29k86K57K5J24j1j48o9M8m1j03K89k3k64J04O7
$$ -127 20 -89 -101 53 -229 -13 -89 40 -246 11 36 160 149 1 -68 -20 -61 -164 125 102 -162 -58 9
7732IN4j05J22Q6J2M1k37kJ70j57J23k48l7J21L83l08j43K19j82K9r2O8NJ44O3
$$ 9 63 -42 80 166 178 219 -18 -20 150 -7 116 -132 -169 -48 335 27 -116 103 -79 -50 -142 -74 -69 75 138
7757A38p4j64J69j72K05k12O2K4l0o0j73L81O8m15L04l10L04n2L08o7m31J70k65
$$ 138 64 -100 69 -103 102 -110 -48 -24 -54 -114 -287 94 162 -253 51 -259 45 -7 301 234 -197 -27 -292
7780b92N12k14J30j94r9N5q3L34l18L36j03K4k5q3j04R7j5J76k77J01J06n7J49
$$ -292 220 6 136 -58 -157 -102 -185 149 -169 167 64 88 63 -20 -124 -27 -42 134 -143 -42 64 7 156
7803A56j38l5p6K32j54j06m0K76l30L16j03K36l00J69l19N9J12j12J74K60m10
$$ 156 18 -17 -93 139 -15 -121 -161 115 -215 101 -2 234 -66 103 -216 -157 -45 -157 17 277 -133
7824a33J40n6p5J72Mk52M64l19K8J15Q9o3j41j63K87n9J44k74J96n5k40K93k92
$$ -133 7 -49 -124 48 52 -200 264 -55 -27 88 177 114 -27 -190 97 38 182 -92 104 49 -191 102 -190
7847a90K21o5j51K40N8j06k22K27N8p8P7O4%j0P1J21l12P4q9j04J11Q5o6O2k63
$$ -190 31 -34 -185 55 113 7 -215 12 70 -8 69 133 133 123 194 315 3 77 -12 -116 -5 80 14 76 -187
7872a87L34n4j24J20k02K21j39L41m27J84j29J38j94J28L3k60J78J93j99k84K80
$$ -187 147 93 -31 89 -113 108 -31 310 -117 67 -62 76 -118 10 43 -217 -39 154 -45 -329 -49
7893d9J77l0k22K48k36N1K15n30M05j32J55R1j31jk6j61m1M32k86N0K25j93J91
$$ -49 128 98 -124 124 -112 -61 154 -376 29 -103 52 143 12 11 -15 -176 -217 215 -71 -21 204 11 202
7916B02l42M8j48L63J04l03J26L4j77N3j49J40K08j72j49L22n2j50J72k18J74
$$ 202 -140 -92 -240 123 227 -76 50 84 -93 -40 -189 -49 159 -13 -162 160 108 -42 130 -88 86
7937H6N6k55K16J7M4k20k34K22k04L8K94j43K58j47j89K04k44l3L68J31j46j26
$$ 86 142 -113 103 120 164 -56 -290 -68 -272 -234 60 -83 175 28 -161 43 -201 -234 134 265 119 -7
7959gk87M1J50l9R8O6j0J80k05m3J78j49k90L57JJ36j82NL1j64K28M7k21j75K72
$$ -7 -294 -253 -103 -142 -44 22 12 192 -13 -56 122 -27 -317 40 41 177 -5 0 31 -133 95 142 -79 -254 18
7984A8nn1M1J00j15j04J61l0k23L14Lk65J45j91K56j43oJ69j58L14k79J63j28
$$ 18 13 -38 3 103 -12 -116 45 15 -208 106 109 -156 -11 -202 54 -89 -95 74 -84 230 -49 114 -14
8007a4q2j35R0j21L98J00l08Q8k0O5j46L30q0r8j36L09k70L04%l72p2J31K99j97
$$ -14 -96 -231 -141 -262 136 236 -72 16 -4 61 -85 245 165 67 -69 240 -30 274 274 -98 -170 -39 260 63
8031F3r2P9K15j70m7J68j89k8k1K37l34K01k51J8K37j48J68q3M5l2k90M16o5k49
$$ 63 -29 50 265 95 48 216 27 -1 -22 215 -119 82 -169 -151 86 -62 106 23 68 36 -254 162 97 -152
8055a52K16l0J5K5k63K52nr6P4k16R1j6J6r7J57O7r5M0QP1k05J91k59J16J88p8
$$ -152 64 34 49 74 -189 63 58 -38 36 -180 -89 -105 -89 -186 -29 38 -57 -17 -9 62 -143 48 -211 -95 93 15
8081A5p7l2J71l11K14q4k1J84k2L10n91J63K23k00J0J55m8N6k1p6k5j9K31l62
$$ 15 -62 -94 77 -234 -20 -104 -125 59 37 347 -244 -81 142 -58 -48 107 59 115 94 18 -7 -26 205 -157
8105a57ML12j46O4k36J16J1k14K59K9j26L43o1j14N1o4K49m22M1p1M60j32j53
$$ -157 -153 159 13 77 -159 -43 -32 -246 13 42 -84 259 198 84 135 71 320 -102 -61 -132 328 196 43
8128D3pK26q3l32K79j25l2Q1j11J26q9J2K65j98j76K03J96m42l8J5q7K46l1r7
$$ 43 36 262 179 -153 126 1 -31 50 -61 65 -24 -12 253 55 -121 82 278 -164 -202 -187 -274 -28 -59 -156
8152a56L23j91K53j30J68k98O2K79m62J06j5ko2J94R8j68j9p3L10o3l82J93J56
$$ -156 167 -24 229 99 267 -31 31 310 -152 -46 -61 -63 -125 69 167 -1 -20 -93 217 154 -228 -35 121
8175A21o3M2k44K8N2r0J44j37M95o35K93O9R0k60M2M6
$$ 121 58 100 -144 -116 -64 -154 -10 -147 348 -287 6 75 165 -95 -53 -7
8191g
$$ Imaginary data points
##PAGE= N=2
##DATA TABLE= (X++(I..I)), XYDATA
0@%%%%%%%%%%%%%%%%Qj6J6j6J6j6K4l2L2l8M6n2O0p0Q0q9J01j16J32j48J64j82
$$ 0 0 0 0 0 0 0 0 0 0 0 0 0 0 0 0 0 8 -8 8 -8 8 -8 16 -16 16 -22 24 -28 32 -38 42 -47 54 -62 70 -78 86 -96
38i6K02k26K54k82L12l46L83m22M63n11N64o21O86p55Q30r16J014j124J247j390
$$ -96 106 -120 134 -148 164 -182 201 -221 242 -269 295 -326 360 -395 435 -481 533 -591 656 -734
58g34J559j756J996k293K667l161L846m856O500r624J7581p3960j80410J14336
$$ -734 825 -931 1065 -1228 1439 -1722 2124 -2732 3768 -5856 11725 -62235 -242645 -128309
72a28309J75984O6742n5389q9014k6639P6178M1349n5894p6560k3927L9699J02443
$$ -128309 47675 114417 59028 -29986 -56625 19553 60902 5008 -71552 -95479 -55780 46663
84D6663O4700o3976j19327k3781Q5870P7616k5504p2632j5674M7634L4174j6578
$$ 46663 111363 47387 -71940 -95721 -9851 67765 42261 -30371 -46045 1589 35763 19185
96A9185l9507n806K8347J2933l650R246m638k9340m907K0250K441r193J085J6656
$$ 19185 -20322 -26128 2219 15152 11502 20748 16110 -13230 -18137 2113 4554 -4639 -3554 13102
110A3102K2696j6745n8556q274O1848K8781l8726l6992M377L1157J7844k1045
$$ 13102 35798 19053 -39503 -47777 14071 42852 4126 -32866 -28489 2668 20512 -533
122e33k0708J3617J3405m697J47m669k3013j0930K4338M0464J0188m2450l8344
$$ -533 -21241 -7624 5781 1084 1231 -3438 -26451 -37381 -13043 27421 37609 -4841 -43185
135d3185K4352M1057m073k7838j0254J0440J6358j46r922P584R022j2016l496
$$ -43185 -18833 22224 18151 -9687 -19941 -9501 6857 6711 -3211 4373 13395 1379 -2117
148b117J2123n763k1242m175K1919K7330m139l3707n838K9387L811k9230j3497
$$ -2117 10006 4243 -16999 -21174 745 28075 23936 -9771 -15609 13778 17589 -11641 -25138
161b5138J2641K0746Q219j4713j1804J0168J231j3790M549J1854r306r324J3896
$$ -25138 -12497 8249 16468 1755 -10049 119 1350 -12440 -7891 3963 -5343 -14667 -771
174g71J4871j0648k8882p362L3542L0564j1775l0320j1383J1961J2653n283o516
$$ -771 14100 3452 -25430 -32792 750 31314 19539 -10781 -22164 -10203 2450 -2833 -9349
187i349J2239Q118p577L666Q548j7726k2088O048K4607J8889q920l1076l469L1486
$$ -9349 2890 11008 3431 7097 15645 -2081 -24169 -18121 6486 25375 16455 -14621 -18090 13396
201A3396J2224k1434j6589n35O314J0975N200j277m551j2253p140J8066J3910
$$ 13396 25620 4186 -12403 -12938 -6624 4351 9551 8274 3723 -8530 -15670 2396 16306
214A6306j6742j8912Q654K3079N196k3663k1238J1024K2878M428m528k814n298
$$ 16306 -436 -19348 -10694 12385 17581 -6082 -27320 -16296 6582 11010 6482 3668 -1630
227a630n920k532K696P701j037r082J0979K3554n555k7449r440J1669J0727k536
$$ -1630 -7550 -10082 -7386 315 -722 -9804 1175 24729 19174 -8275 -17715 -6046 4681 2145
241B145j0055M623J9010M761j5364j1506K71L027K160J816L997m76r984O16J7261
$$ 2145 -7910 -3287 15723 20484 5120 -6386 -6115 -3088 -928 888 4885 4409 -5575 -4959 12302
256A2302K563j9378j0175Q995J2650J218j6732j1576J8055K1425p019j5557m608
$$ 12302 14865 -4513 -14688 -5693 6957 8175 -8557 -20133 -2078 19347 12328 -3229 -7837
269g837k874J219R548O786j961p370o245Q235J3569q021k0420J184K0890J1701
$$ -7837 -10711 -9492 56 6842 4881 -2489 -8734 -499 13070 5049 -15371 -14187 6703 18404
283A8404r906j7626l244J3199O433l537j015J00k503O59K942O88n420r451L566
$$ 18404 8498 -9128 -12372 827 7260 3723 2708 2808 305 964 3906 4594 -826 -10277 -6711
298f711J8287N035j6940j1014O750J0763J498r236q206P317Q909o076m959L651
$$ -6711 11576 16611 -329 -11343 -4593 6170 7668 -1568 -9774 -2457 6452 376 -4583 -932
312i32r7n29N608K657o231r916n289J0691J5205k869j2759N94R151Q97q666r577
$$ -932 -1029 -1558 4050 6707 476 -9440 -14729 -4038 11167 8298 -4461 -3867 5284 6181 -2485 -12062
328a2062L385J2977N568m915k991k466m926J567Q021K843o012o863L566J1330
$$ -12062 -8677 4300 9868 4953 1962 -504 -5430 -3863 4158 7001 989 -5874 -2308 9022
342I022p61j4496n485J0343J2146J220j1299j0432M560P460j664p53J436m954
$$ 9022 8261 -6235 -11720 -1377 10769 11989 690 -9742 -5182 2278 614 -139 1297 -3657
356c657L60R830K298r801r137j387J1019J2693n420j6700k89J3333N454m851p931
$$ -3657 -3297 6533 8831 -970 -10107 -11494 -475 12218 6798 -9902 -10191 3142 8596 3745 -4186
371d186k971M871M536M91j263l947k530N138P415j42r441q317N043J2860R92j1603
$$ -4186 -7157 -2286 2250 2741 1478 -2469 -4999 139 7554 7412 -2029 -10346 -5303 7557 8549 -3054
387c054m328P356O053n94o320n601M470O908k503l189m82l430J444R105J783r128
$$ -3054 -7382 -26 6027 5433 -887 -6488 -2018 4890 2387 -802 -1284 -4714 -3270 5835 7618 -1510
403a510n312K194P789M260q125j0374N801J2744J943r260p825J125P835N177l125
$$ -1510 -6822 -4628 3161 7421 -704 -11078 -5277 7467 9410 150 -7675 -6550 1285 6462 3337
418C337n346m251J427Q065M530n531p472q15Q068Q714o159j4508j316J2169Q163
$$ 3337 -2009 -6260 -4833 3232 7762 2231 -5241 -6056 2012 10726 4567 -9941 -11257 912 9075
433I075k057p428n470L959O298j973m732j644k89N456P575k531j0584m088M800
$$ 9075 7018 -410 -5880 -1921 4377 2404 -2328 -3972 -4261 1195 8770 6239 -4345 -8433 -3633
448c633P741L330p827p307N811Q542k389o610l565K586O583K881l599m794j553
$$ -3633 4108 7438 -389 -7696 -1885 6657 4268 -2342 -5907 -3321 3262 6143 2544 -2250 -3803
463c803P37M863K597l696m122J352N146L076n145p323Q99P559K404l130l346p48
$$ -3803 -3066 1797 4394 698 -3424 -2072 3074 6150 1005 -6318 -5419 2140 4544 1414 -1932 -2680
479b680L521L270k347l402q16q62K847M888j194m991j182K790K921K83n022l237
$$ -2680 841 4111 1764 -1638 -2454 -3316 -469 4419 3225 -1766 -2948 -158 2763 3046 -1976 -5213
495e213N175N246j815l760k314m89L464L329r29k096j787p11L088K190l474l663
$$ -5213 -38 5208 3393 -367 -2681 -3170 294 3623 2694 598 -1189 -1900 1188 3378 -96 -3759
511c759J652N084K808k577o884j325M879L030o51k289k316J660L608p8k766k854
$$ -3759 -2107 2977 5785 3208 -3676 -5001 -122 2908 2257 -32 -2348 -688 2920 2842 76 -2778
527b778j677L405O062k31o189k596K200M088J789m609m187L006M926P56j918m016
$$ -2778 -4455 -1050 5012 4781 -1408 -4004 -1804 2284 4073 -536 -4723 -1717 3209 3965 2047 -1969
543a969k297L424M726m07l034k450o51M881L526m397n346L43M577L924q17n428
$$ -1969 -4266 -842 3884 3477 443 -2007 -2658 2223 5749 1352 -3994 -3651 926 4850 4033 -1395
559a395k410L843K544o12j952k618P05M320J539k748l559j830L040M955o30m819
$$ -1395 -3805 38 2582 1970 18 -2600 -1895 2425 3964 1216 -2343 -4173 -1133 3822 3192 -1627
575a627j709K524L413L34m110l371K796M702N63k442k304j645K480L262j991k806
$$ -1627 -3336 -812 2601 2935 -1175 -4546 -1750 2952 3515 1073 -1231 -2876 -396 2866 875 -1931
591a931j94J946M091J246n554m548K092M562K353j406l916j148L551K140j948
$$ -1931 -2125 -179 3912 5158 -396 -4944 -2852 1710 4063 2657 -1259 -2407 1144 3284 1336
606A336l295j360K831M505O2m084l912j96M271M123j504m901r43K116K895K68
$$ 1336 -1959 -3319 -488 4017 4079 -5 -3917 -4113 158 4281 2777 -2124 -3067 -951 1944 2212
622B212l910k433K761L970j42k068k669j139L468K954k055k747k2P41L093J045
$$ 2212 -1698 -4131 -1370 2600 2458 390 -2279 -3418 50 3004 949 -1798 -1820 -1079 2014 3059
638C059l735k183K014K364J86j063k421J34L256J889k297k353j107R41L084O68
$$ 3059 -676 -2859 -845 1519 1705 642 -1779 -1645 1611 3500 1203 -1150 -2257 -1316 1768 2436
654B436k564j763J476K268P70k977l571P85L496K892p66l442k382J323K836j51
$$ 2436 -128 -1891 -415 1853 2623 -354 -3925 -3140 356 3248 2482 -960 -3342 -2019 817 666
670F66j696j316N56L493J190k889l310k13K225L193J368l461k079J307J264O16
$$ 666 -1030 -2346 -1790 1703 2893 4 -3306 -3519 -1294 1899 3267 -194 -2273 -966 298 914
686I14q43j974L21L446J570k000k577j540J074L129Q97j991j096R73N46R82k146
$$ 914 71 -1903 -1582 1864 3434 1434 -1143 -2683 -1609 1520 2417 426 -670 303 849 1831 -315
703c15k989N68L280K127m77k331k661R92K725o5j829j377L71K743K050k278l135
$$ -315 -3304 -2736 544 2671 2194 -137 -2798 -1806 919 854 -975 -2352 -1981 762 2812 534 -2601
720b601J7J461K571L71l259j666J998K379N80j109l015o00L499J812j485j772
$$ -2601 -2584 -1123 1448 1819 -1440 -3106 -1108 1271 1851 742 -2273 -2873 626 2438 953 -819
736h19j077R07L214M19k785j595Q41J683J780j303k915p00K071K311L08k095k299
$$ -819 -1896 -989 2225 2644 -141 -1736 -895 788 2568 1265 -1650 -2350 -279 2032 2340 245 -2054
753b054M31K109N70j265j601kK258J895j375k685p90O88K233J223j997j330J153
$$ -2054 -1623 486 1056 -209 -1810 -1812 446 2341 966 -1719 -2509 -1821 412 1635 -362 -1692 -539
770e39R35K98q85j725L5K596J494j564j248q01N78J865R9j992j28J026J661J13
$$ -539 396 694 -191 -1916 -1881 715 2209 645 -603 -1404 -826 1039 1138 -854 -982 44 1705 1818
788A818j409k196M24K446J023j101j942l47J161K409o71k475j460J181K070J012
$$ 1818 409 -1787 -1363 1083 2106 1005 -937 -1284 -123 2286 1615 -860 -2320 -1139 931 1943
804A943j689j910L90J656J595j037l145m38K009K044L84j497k178m2K211J132
$$ 1943 254 -1656 -1266 390 1985 948 -2197 -2635 -626 1418 1802 305 -1873 -1915 296 1428
820A428j502j098j50J280K082l99k772j340J746J830Q49p99j806l72K081J96p90
$$ 1428 -74 -1172 -1322 -42 2040 1641 -1131 -2471 -725 1105 1954 1155 -651 -1023 1058 1254 464
837D64j244j80J254J900o06j831j443M87J981J358j069j958m08R12J320o35r61
$$ 464 -780 -960 294 2194 1588 -243 -1686 -1199 782 2140 1071 -887 -1295 -383 937 302 -659
854f59o96J625J044m9j698k082J29J926J980p08p67r52K73J388m51j847l91J679
$$ -659 -1355 270 1314 1265 -433 -2515 -2386 -460 1520 812 45 -907 -634 754 303 -1544 -1935 -256
872b56J257O62o24j877o15J275J208j25q64o17O07J219k96j305m74N63J430P91
$$ -256 1001 1663 1039 -838 -1453 -178 1030 905 41 -576 31 1250 954 -351 -825 -262 1168 1959
890A959j486k097j16J315J408L03j248o54Q10L33l34j193o87N78J849R55r93j509
$$ 1959 473 -1624 -1740 -425 983 1286 38 -616 194 527 193 -1000 -1687 -1109 740 1695 702 -807
908h07n75N94J085L69j662j78J007J159K38j110j769K20J896P00n50j203m96R51
$$ -807 -1382 -788 297 666 -996 -1174 -167 992 1230 120 -1649 -1429 467 1167 617 -586 -1082 -131
926a31J377j57j748l29N44J418O06j116j756K68J653J180p52j865o30Q92J611
$$ -131 1246 1089 -659 -988 -444 974 1580 464 -1292 -1024 629 1809 1057 -808 -1438 -546 1065
943A065k70r93j030O29J277M21j304j065l7J395J219o11j419n02O90R93M04p72
$$ 1065 795 -198 -1228 -599 678 1099 -205 -1270 -1307 88 1307 696 -723 -1225 -535 458 862 90
961I0j294J76J668J23o38p60l27P55J042j26j224l49O53R75L52q30j205K77R86
$$ 90 -1204 -1028 640 763 125 -635 -962 -207 835 709 -515 -864 -211 764 1116 286 -919 -642 344
980C44N30p39p67l12J186O73k15q42o79M07Q36L22p31p30j2Q65N74l91j186k74
$$ 344 874 135 -632 -944 242 915 700 -142 -821 -414 422 744 13 -717 -729 136 710 319 -867 -1141
1000a141R90Q95K23j022r64j2J475m4n52k98n9N15J042k72j370k77N02P79N02
$$ -1141 -151 744 967 -55 -1019 -1031 444 400 -152 -450 -509 6 1048 776 -594 -871 -369 410 912
1019I12o92r18L76J051J82o57o06o34J062O93m58k45n63K36N94L53r52p31M74
$$ 912 220 -698 -322 729 911 254 -352 -986 76 769 311 66 -497 -261 333 686 -266 -997 -523
1038e23O96Q05o64p08o14R62P44o9q48l88L9O06N00p09l99k1N06Q73j43j064l30
$$ -523 173 978 314 -394 -1008 -46 698 629 -219 -607 -568 38 538 -171 -570 -591 -85 788 645 -419 -749
1059g49M49O30N56o02j157M28R44K36m19p86l94R47Q12l26o28k71rP88L82r64
$$ -749 -300 330 886 284 -873 -445 499 735 316 -470 -864 83 895 569 -59 -330 -339 449 831 -133
1079a33n94N02N41N68l94j020j51O20M68R1o80n71L24Q88K14q26l74M8J01J119
$$ -133 -727 -225 316 884 490 -530 -681 -61 407 498 -182 -753 -429 459 673 -153 -527 -479 -378 741
1099G41n61m86n38Q04L51N57p55r60M63Q06J78l42m34m22P12M01n62l23n8J61
$$ 741 180 -306 -844 -40 311 868 113 -847 -384 422 600 258 -176 -598 114 515 -47 -370 -428 -267
1119b67R17J17n62q25M55M10N22o13m24j34O97O15n90p43k92N10P25K76m33n95
$$ -267 650 767 205 -620 -165 245 767 154 -270 -404 293 908 318 -425 -717 -207 518 794 361 -234
1139b34k64M87P62p90j89l2N56L60k41o20r09N34J097p3j41m31l61O22J78k43
$$ -234 -498 -11 751 -39 -228 -260 296 656 415 -205 -1114 -580 517 444 303 -128 -489 133 311 68
1159F8n21K50L06N45L19p53p13L17K69L86j99k35l16N26M37o12j52o01M59Q54
$$ 68 -453 -203 103 648 967 214 -499 -182 87 473 274 39 -277 249 686 74 -78 -679 -220 634
1179F34q2o99m06R7K35N96J27q63L88J32L53k09l89l81J14J045l70n70J08l18
$$ 634 552 -147 -553 -456 -221 375 502 -361 27 159 512 303 -86 -467 -353 692 322 -248 -140 -458
1199d58Q64R6o14l6j01M37L5R6j96l69n2L56J66l24J18m60O75j44K36l15o01p1
$$ -458 406 502 -112 -148 -249 188 223 319 123 -246 -298 58 224 -100 18 -442 233 89 325 10 -591 -662
1221f62Q64K86m82j09j80N29j0p3o69J6L27N12M17n73n87L0K15L10j6l77j71L33
$$ -662 202 488 6 -103 -283 246 236 163 -506 -490 -163 349 766 193 -394 -364 -149 161 145 -232 -403 -70
1243g0M94k52o89K11N9N38M21m66o91J86J33M98m02l29q8O14L35l21p8o29J91
$$ -70 424 172 -517 -306 -247 291 712 246 -445 -259 -126 372 -30 -359 -447 167 502 181 103 -526 -335
1264c35O38K81m19o07K7J96N14j84l36j17P19l0J5n38k73M27M71k34j77k29q0
$$ -335 303 584 165 -442 -415 -219 295 111 -225 -342 377 347 362 -176 -449 -22 449 215 38 -191 -271
1285b71R4N52l74j94Q0J29M87j70l21n10J92M55j54K02p44L1R58J3k78n13Q8L34
$$ -271 -177 375 1 -193 -113 16 503 333 12 -498 -306 149 -5 197 -547 -516 442 455 177 -336 -248 86
1307H6Q6K69p89K05j97M65R7j0l56j38M70J14l66N0m05J05L81J21j61m61j04O93
$$ 86 172 441 -348 -143 -340 125 222 212 -144 -282 188 302 -64 -14 -419 -314 67 188 27 -434 -538 155
1329A55M72l89j68k18L25j08J32o49PJ49O71N9j62l19m20M42L21P3p07M8L25K61
$$ 155 627 238 70 -148 177 69 201 -448 -441 -292 379 438 276 -43 -463 -21 300 373 -334 -286 39 300
1351C00j85k18j43J42P4N44m50j62k24L40L77k1m40j46L9L72k57j31p3k37M39
$$ 300 115 -103 -246 -104 -30 514 64 -98 -322 18 395 374 -66 -212 -173 199 -58 -189 -262 -499 -60
1372f0M05n0m79l40J71M34K2j05j64J3M17j97M4n20l3L75L50l75J21n22L11M47
$$ -60 345 295 -184 -524 -353 81 103 -2 -166 -153 264 67 111 -409 -442 -67 283 -92 29 -493 -182 265
1394B65j74o8j80K08N3n4l2l66L16K0p1P3k42n6J23M56J91l44m01m7J50N40l51
$$ 265 91 23 -157 51 104 50 18 -348 -32 -12 -83 -10 -252 -308 -185 271 462 118 -283 -330 -180 360 9
1417Il34j87O96J74M2o25J2O0N76j92j13k03PJ04K24K5n18K17j29N62m79k63K72
$$ 9 -325 -512 184 358 400 -225 -213 -153 423 231 118 -85 -78 26 250 275 -243 -26 -155 407 -72 -335 -63
1440f3j3O5J55r4l35J38J07p0M18m02RL75Q3l41j17j12q7L84M5k8m88m4L58J69
$$ -63 -76 -11 144 50 -285 -147 -40 -110 308 -94 -85 290 373 32 -85 -197 -284 100 145 117 -371 -415 -57 112
1464A12Pk12j95L01K6j80J9l11J16N55Q2k88j53n6J36L74q9o45L48Q5M30m11j51
$$ 112 119 -93 -288 13 39 -141 -122 -433 -317 238 320 32 -121 -177 -41 333 244 -401 -53 32 462 51 -100
1487a00k8l8K66Q4j61j19P5K48j72K40l65j44K83k91M12P2n36j23L78P2J54j98
$$ -100 -128 -166 100 184 23 -96 -21 227 55 295 -70 -214 69 -222 190 262 -274 -397 -19 53 207 9
1509Il74J61K78J1o2R8k74K46J73k68J73j94J66q5K91n40N0J65K75j90nj71N1
$$ 9 -365 -204 74 85 23 121 -153 93 266 -2 171 -23 143 58 349 -191 -141 24 299 109 104 -67 -16
1532a6P6Q8O9m38P4p7K10K2q7j66j43L33n4J55o95N63J10L2j06l2r6J35L35k65
$$ -16 60 148 217 -221 -147 -224 -14 8 -79 -245 -388 -55 -109 46 -649 -86 24 56 -50 -82 -178 -43 292 27
1556B7J35j07j94K70q5j5L7k23K28J78P3l81j16J46L09k44j33p2K42J00n3p7n7
$$ 27 162 55 -139 131 46 31 68 -155 73 251 324 -57 -173 -27 282 38 -95 -167 75 175 122 45 -12
1579a2j17L06j48p7J6k37K52O2K10j57qj76K96o4j57j98R2r1M16j54p8n8q2K55
$$ -12 -129 177 29 -48 -32 -269 -17 45 255 98 90 -86 210 146 -11 -209 -117 -208 208 54 -24 -82 -164 91
1603I1J3J0l38O7O3K75J9m25q7K69m2R7q5k37L83J34lj12j94l32J94L32j34K34
$$ 91 104 114 -224 -157 -94 181 200 -225 -312 -43 -85 12 -73 -310 73 207 204 92 -102 -434 -240 92 -42 192
1627A92j76O0P9J6j65l77M71L5o5K18k63n17M97P9k44J15k65M50j8j8q1k52J50
$$ 192 16 76 155 171 6 -371 100 135 70 288 25 -492 5 84 -160 -45 -310 140 122 104 23 -229 -79
1650g9j71N23J86o20J18k4K8L1j72LK12KK1j00R3j56J68j48N14m09p0r1K57J8
$$ -79 -250 273 459 -161 -43 -67 -39 -8 -180 -177 35 37 58 -42 51 -105 63 -85 429 20 -50 -141 116 134
1674A34p1j89J0K08JQ0k34j59K54K06j71n9J48q2M9j12LK6K4qj27L59m54K31M7
$$ 134 63 -126 -116 92 93 173 -61 -220 34 240 69 10 158 76 125 13 16 42 66 58 -69 290 -164 67 114
1699A14qL5m15K78j04R0k8K60j83k04K52n3J33m25LP3K34J97l28n69O41J69J15
$$ 114 106 141 -274 4 -100 -10 -38 222 39 -165 87 34 167 -258 -255 -182 52 249 -79 -648 -7 162 277
1722B77j12k24rJ05p5n9nK46j93qJ30J10Q6j77j44K03j08j08J42J37j45J06m85
$$ 277 165 -59 -68 37 -38 -97 -102 144 -49 -57 73 183 269 92 -52 151 43 -65 77 214 69 175 -310
1745c10J19L74Q9k98l7J67k82L3K55O3m22P5J27L10k14N3m1Q5J71k69j49K37k62
$$ -310 -191 183 272 -26 -63 104 -178 -145 110 173 -249 -174 -47 263 49 102 61 146 317 48 -101 136 -126
1768a26J74N8k44K67j04l03pL19J63o13N14p3K64j53k32n4K80q5lj77J50J49J5
$$ -126 48 106 -138 129 25 -278 -285 34 197 -416 98 25 289 136 -96 -150 130 45 42 -135 15 164 179
1791A79l13J98k12p0K96r3K49p5m17K39l3K87j65k32K46k96K49l38N82k92N5r1
$$ 179 -134 64 -148 -218 78 -15 234 159 -258 -19 -52 235 70 -162 84 -212 37 -301 281 -11 44 -47
1813d7j62K73j87k6J70K00j24l15J57J71J38O9k12Qk00N28l67J63j48k51J26J63
$$ -47 -209 64 -123 -149 21 221 97 -218 -61 110 248 317 105 113 -87 441 74 237 89 -162 -36 127
1835A27k88K16k55K83j21L54l55j39J46K00n3o8j50mL37l9j67OM3n5j02J60J56
$$ 127 -161 55 -200 83 -38 316 -39 -178 -32 168 115 47 -103 -107 230 191 24 30 73 18 -84 76 232
1858B32m04q5J91K95q7l04J2J14K07l50J47K1K52p4k03K0J56k44l0M08m45J65
$$ 232 -172 -257 -66 229 142 -162 -150 -36 171 -179 -32 -11 241 167 -36 -16 140 -104 -134 274 -171 -6
1880fO5j62Q3J90l21o5R7L23l1j35J39k23k9M1k31L19p3q1Q2O3q6n7J43l0j53
$$ -6 59 -103 -20 170 -151 -216 -119 204 173 38 177 -46 -75 -34 -265 54 -19 -100 -18 45 -41 -98 45 15 -138
1905a38Q9k20K41J93p4l79K1N19k0k47k39J19J15q7n1K94p8K53k33N6J8M0k27
$$ -138 -49 -269 -28 165 91 -288 -267 252 232 -15 -254 -135 -20 -107 -158 136 58 311 78 134 152 192 -35
1928c5K4Mk62M09l46J77K34k22r2qN5l7J42k18K36P0q5j35o6M71m51J35Q4k12
$$ -35 -11 -7 -269 140 -206 -29 205 -17 -109 -117 -62 -99 43 -175 61 131 46 -89 -155 316 -135 0 84 -128
1952a28L33j43N8l12J55o1l3kK29M1j09K62m77O2m01P18k04K16k19l97N81j31
$$ -128 205 62 120 -192 -37 -98 -131 -133 96 137 28 290 -187 -125 -526 192 -12 204 -15 -412 169 38
1974C8n8p8J44m9J63k83Q3K44k74n6L12l70M18k73M8j28K54j2n30L62M3J0Q4j20
$$ 38 -20 -98 46 -3 160 -123 -40 204 -70 -126 186 -184 234 -39 9 -119 135 123 -407 -45 -2 8 92 -28
1998b8Q2O1J8j95K5n0P3l0l3o2L64j08K2j53K26j72rJ21N5l89J79J17j56K69k33
$$ -28 54 115 133 -62 -37 -87 -14 -44 -77 -139 225 117 139 -14 212 40 31 152 207 -182 -3 114 -42 227 -6
2023fJ98j14k36J67r1K85j70k29J65M13k43Q4l74r0K77j29j3O8K73p5j37m5J07
$$ -6 192 78 -158 9 -82 203 33 -196 -31 382 139 223 -151 -241 36 -93 -106 -38 235 160 23 -22 85
2046H5j38J78o3N4n3j40j35J82J33L25l74K10k86J91n0J23j35j75L6J12j49O6
$$ 85 -53 125 62 116 63 -77 -212 -30 103 428 54 264 -22 169 119 242 107 -68 -32 80 -69 -3
2068cj03K69n6O0l25l6K27n4k6n9J04N0Q0p4j11N4J88P2m88J03K37n1j68J41K4
$$ -3 -106 163 107 167 -158 -194 33 -21 -47 -106 -2 48 128 54 -57 -3 185 257 -231 -128 109 58 -110 31 55
2093E5rk24J18J43j14nr4k8M8J42j63J26M5PrQ6k94J13J17J79J09l5m61L59n1
$$ 55 46 -178 -60 83 -31 -36 -130 -158 -110 32 -131 -5 40 47 38 124 -170 -57 60 239 348 313 -148 211 160
2118A60n4rq0k77L20J30k95K5L15k43m0J40K38m36J31j0j2K10k71j35K02J49k97
$$ 160 106 97 17 -260 60 190 -105 -80 235 -8 -48 92 330 -106 25 15 3 213 -58 -193 9 158 -139
2141a39R5j16J68J42l55J98K3r7J5%j76O79n71q5K96m7j62K18k0m5n5L47n79L7
$$ -139 -44 -160 8 150 -205 -7 16 -81 -66 -66 -242 437 -134 -219 77 30 -132 86 66 21 -34 313 -266 -229
2165b29L80r8k20J68J00j14J39q2j03K49k10k11R1K2J33k8j9k5K4LK49l20K49
$$ -229 151 53 -167 1 101 -13 126 44 -59 190 -20 -231 -140 -118 15 -13 -32 -57 -33 -30 219 -101 148
2188A48Ql0k05J23J34J5k87j32K88k48K94Lk88J85PLK5R5l8q6k09J90lk54K30
$$ 148 156 126 -79 44 178 193 -94 -226 62 -186 108 111 -177 8 15 18 43 138 100 14 -195 -5 -8 -262 -32
2213c2J10J35m48L26j00O5j99m1L22o6j67L01l85L93j16n8k9R6q9j00L14k75M16
$$ -32 78 213 -235 91 -9 56 -143 -184 138 72 -95 206 -179 214 98 40 11 107 18 -82 232 -43 373
2236C73m14j63K28L4k81J21J15j2J82k86J3J08j54K08j54J00J24j4j85J47M8%
$$ 373 -41 -204 24 58 -223 -102 13 1 183 -103 -90 18 -136 72 -82 18 142 128 -57 90 138 138
2258A38l54K23j12N5p4Q5r0M52k21k62J67J58j37Q5ol49K25j56M8K50j97O5L96
$$ 138 -216 7 -105 -50 -124 -39 -129 323 102 -160 7 165 28 113 107 -242 -17 -173 -125 125 -72 -7 389
2281C89m23m2oP5K11l64oL17o8r2om48N82j88J26K04k48j31P6q2j54L25j26k6
$$ 389 -34 -76 -82 -7 204 -160 -166 151 83 -9 -15 -463 119 -69 57 261 13 -118 -42 -124 -278 47 -79 -105
2305a05m8p0K30r5J21p0K35j16rj82J10K90j43j8j66k59R6K68j59J51p9k59K86
$$ -105 -153 -223 7 -88 33 -37 198 82 73 -109 1 291 148 130 -36 -295 -199 69 -90 61 -18 -277 9
2328IL1L43m19n3K9J68l25J07K75k06j36P4m2K3K10j16K20j29m5j07N2l1J31l5
$$ 9 40 383 -36 -89 -60 108 -217 -110 165 -41 -177 -103 -145 -122 88 -28 192 63 18 -89 -37 -68 63 28
2352B8j01l6J13J12j97p5R4j1l7J75l3m3p0K85p0k94K41k2J24lj10j49J58N4k20
$$ 28 -73 -109 4 116 -81 -156 -62 -73 -110 65 32 -11 -81 204 134 -160 81 59 183 180 70 -79 79 133 -87
2377h7r6J03K72j88r3k49L53j43K41k09J22K1j47K06J43M2k84R6r6k82L57j80
$$ -87 -183 -80 192 4 -89 -338 15 -128 113 -96 26 47 -100 106 249 291 7 103 7 -275 82 -98
2399i8J76p5q7p3O7Q0k9R9j83l6R9J10p0p7J48R8m08L20P8j99J05p5k8q5M43l39
$$ -98 78 3 -84 -157 -90 -10 -39 60 -123 -159 -60 50 -20 -97 51 149 -259 61 139 -60 45 -30 -58 -143 300 -39
2425c9n8K23k06J74m4P3n8l53K60q2K34k56L81k55M0p7l24L03R1K75n02J38Q7
$$ -39 -97 126 -80 94 50 123 65 -288 -28 -110 124 -132 249 -6 34 -43 -367 -64 27 302 -200 -62 25
2448B5l2L6K54m70K37p0mj88l2K57J14o9j43L7M6L6l08L76k6j9l8l39O90m74J27
$$ 25 -7 29 283 -187 50 -20 -24 -212 -244 13 127 58 -85 -48 -2 34 -274 102 76 57 19 -320 370 -104 23
2473B3oj26J45P7R7j67K04l52K09p7k68L21m93M22P7k84L83k90L3k7K78j13k45
$$ 23 17 -109 36 113 210 43 247 -105 104 27 -241 80 -413 9 86 -198 185 -105 -72 -99 179 66 -179
2496a79J27K40k05K5l1Rq5J86N4j49J48j07j97J20j66K84K6O4o0kk7o6Q0N0M6
$$ -179 -52 188 -17 8 -23 -14 -99 87 141 -8 140 33 -164 -44 -210 74 100 164 104 102 75 9 89 139 185
2521A85m78J75J93k73O3J06m3L5q2L20m31L14m2O8j19OJ03r3j08L49l03L50j99
$$ 185 -293 -118 75 -198 -135 -29 -72 -37 -119 201 -230 84 42 110 -9 -3 100 7 -101 248 -55 295 96
2544I6k33R9j6J50Rk54R4K8J25k68K44k10K45k05J51J68j59J62j67j84J93j88
$$ 96 -137 -38 -54 96 105 -149 -55 -27 98 -170 74 -136 109 -96 55 223 64 226 59 -125 68 -120
2566a20n0N6M9j44L51j58J6j6m7Q7j67K17p6J24j19l01L12j14J08K16r2j58J7
$$ -120 -170 -114 -65 -209 142 -16 0 -16 -63 24 -143 74 -2 122 3 -298 14 -100 8 224 132 -26 -9
2589ij57K72j7n6k00p9K24j03M9J14j61J99j15K48l27RJ70O2m49M02j21j24J57
$$ -9 -166 106 89 33 -167 -246 -22 -125 -76 38 -123 76 -39 209 -118 -109 61 123 -326 76 -45 -169 -12
2612a2N8K18k70r7J95J12l75L60m43M15j22J58l42J06P8l2Q8k28J42kk32K98n7
$$ -12 46 264 -6 -103 92 204 -171 189 -254 161 39 197 -145 -39 39 7 95 -133 9 7 -225 73 16
2635A6l6J40n7q9J09j60o6J33j06L3j34j8L6M21j04p8O6o8o9L7M7j65j07K49K5
$$ 16 -20 120 63 -26 83 -77 -143 -10 -116 -83 -217 -235 -199 222 118 40 106 38 -31 6 53 -112 -219 30 55
2660E5j12K01k26o3M14Mk00j20J42r5J0j27K99l08J81J34k39K37k02n1N5R5pK16
$$ 55 -57 144 -82 -145 269 273 73 -47 95 0 10 -117 182 -126 55 189 -50 187 -15 -66 -11 84 77 293
2684B93k8r6l33J62L5J79k64J77j90K80m5j88Jm08L69P7o5j32R9M8O6N7l22M24
$$ 293 265 169 -164 -2 33 212 -52 125 -65 215 170 -18 -17 -425 -56 21 -44 -176 -77 -29 37 94 -228 196
2708A96k02j07J86J27l36K65%L18n36L07j16j90J60k67L82p8j80P8q5J25r5Q5
$$ 196 -6 -113 73 200 -136 129 129 447 -89 218 102 -88 72 -195 187 109 -71 7 -78 47 -48 37
2730C7L9l40L21k36oK10J1j55n5R1K46l03m3M94j76M0j5P7o9k21M8J31k86J68
$$ 37 76 -264 57 -179 -185 25 36 -119 -174 -83 163 -140 -183 311 135 175 160 237 168 -53 -5 126 -160 8
2754Hl0K8R1P4j02k88K21j43J10l8J54p7j45J52K01l50J02J20n5r5K42l51K18
$$ 8 -22 6 97 171 69 -219 2 -141 -31 -69 85 8 -137 15 216 -134 -32 88 33 -62 180 -171 47
2777D7L4k24K12pj16J61l5J48l05j28J63J10O6j25J11j95J72p8l8o0j92L89k33
$$ 47 81 -143 69 62 -54 107 72 220 -85 -213 -50 60 126 1 112 -83 89 11 -27 -87 -279 110 -123
2800a23k86K66K85k12k0Q1j64L7J38j89J51M9J51r5J3k9K9M4l56J31J37qP5n3
$$ -123 -409 -143 142 -70 -90 -9 -173 -136 2 -187 -36 13 164 69 82 53 82 126 -230 -99 38 30 105 52
2824E2j71M25j8k91j36J58j0j14K52k71J57j38M10m35K55k29j07K35R0j05j9J96
$$ 52 -119 306 288 -3 -139 19 9 -105 147 -124 33 -105 305 -130 125 -104 -211 24 114 9 -10 186
2846A86j68q3p0R8jK27l86M10m71J42J74r9J78j92L42m54J27j89P9J87j50J25
$$ 186 18 -65 -135 -37 -38 189 -197 213 -258 -116 58 -41 137 -55 287 -167 -40 -229 -150 37 -113 12
2868A2Q9j71P7J7k88M28j16n4o6J25k16q0J79k45M21j07k7J26p8j09K33l70M08
$$ 12 101 -70 7 24 -264 164 48 -6 -72 53 -163 -243 -64 -309 112 5 -22 104 26 -83 150 -220 188
2891A88r2j13Q6k66M38n38K24J44j76RQ8k22K09N0K34l11l84M50P0l45J98J70
$$ 188 96 -17 69 -197 241 -297 -73 71 -105 -96 -8 -230 -21 29 263 -48 -432 18 88 -257 -59 111
2913A11l12M90p6l14K23k85R4R7K12j52l45L49l23K08K11j82j81L7M7Jk50L85
$$ 111 -201 289 213 -101 122 -163 -69 28 240 88 -257 92 -231 -23 188 6 -175 -138 -91 -90 -340 45
2935D5j3O8j75k1q1J93j10n8K73j35N0lj01J06k01J52jJ5k02K92j36J2k38L35
$$ 45 32 100 -75 -96 -177 16 -94 -152 121 -14 36 33 -68 38 -163 -11 -12 3 -199 93 -43 -31 -269 66
2959F6nj62J25j6O6l32J32M1M38p87M74o2L47k55l03m3L10j75L11j58j17K37k99
$$ 66 61 -101 24 8 74 -258 -126 -85 353 -434 40 -22 325 70 -233 -276 34 -141 170 12 -105 132 -167
2982a67K42%j88J06J00O7k79L0J17J0j95K68j17K57l53J29R2j62q7M5p3L97l60
$$ -167 75 75 -113 -7 93 160 -119 -89 28 38 -157 111 -6 251 -102 27 119 -43 -130 -85 -158 239 -121
3005a21J74j1K24k24K3r9J3n3k01K30L3R1k4p5j6J23n9m5K04j63q3L35j36j79
$$ -121 53 42 266 42 65 -34 -21 -74 -275 -45 -12 79 55 -20 -36 87 28 -17 187 24 -59 276 140 -39
3029c9o0L1l6J72J34k16p8K38k54R8R3p7m8J08J93l57K43o8k62K27N3r3J45k99
$$ -39 -99 -68 -104 68 202 -14 -92 146 -108 -10 83 6 -42 66 259 -98 145 77 -185 42 95 2 147 -152
3053a52K0M3j07K88l74J35J5j88J46K77j14J28Lk19J82q0K9r0P1o6J46j17Q2j79
$$ -152 -132 -89 -196 92 -282 -147 -132 -320 -174 103 -11 117 120 -99 83 3 32 -58 13 -53 93 -24 58 -121
3077a21j72J34k7J66K16j38j59J10M7l08K89k43J47n4J96j01N1Q5k10Q8J4l7n1
$$ -121 -293 -159 -186 -20 196 58 -101 9 56 -252 37 -206 -59 -113 83 -18 33 118 -92 -4 10 -27 -78
3100g8K09k10J15J7k21L26k88m6K25J4n2m3q0K49p8j67L62n53M35Km6k32J45J3
$$ -78 131 -79 36 53 -168 158 -130 -176 49 63 11 -32 -112 137 59 -108 254 -299 136 138 92 -140 5 18
3124A8j38K43j76K78l6j73l4J45k33K43k78j37M13j45j88jK80k46N3K32ol3K61
$$ 18 -120 123 -53 225 189 16 -18 127 -106 137 -141 -278 135 -10 -198 -199 81 -165 -112 120 114 81 342
3147C42m60L37l15K81j26K1k7K31k85j27m3J42j81J37o4n9K39j71N6J86o2j64
$$ 342 -118 219 -96 185 59 80 53 284 -1 -128 -171 -29 -210 -73 -137 -196 43 -128 -72 114 52 -112
3169a12K31o6l0n8J6MJ2j0k06K06l0J00q1j12J54J67q7k47L12j03Q4q9o1o8M6
$$ -112 119 53 23 -35 -19 -15 -3 -13 -219 -13 -43 57 -24 -136 18 185 98 -149 163 60 144 55 -6 -74 -28
3194b8J62J13l10J01J71l54L6j52M46k40K1J00l01J24Q2j71L04j12MQ4lj81K0
$$ -28 134 247 -63 38 209 -145 -109 -261 185 -55 -34 66 -235 -111 -29 -200 104 -8 -4 80 77 -104 -84
3217h4J58J14m90K30O0JJ92k92K85l2l5k61Q4J76J83l84OR8P8M3k57L0J7R6j32
$$ -84 74 188 -302 -72 -12 -11 181 -111 174 142 107 -154 -70 106 289 -95 -89 9 87 130 -127 -97 -80 16 -116
3242a16j7K01m1k11L28j40P2k7j32J0J37m2j37O9j35L50j49j1QK21k68O6K9j02
$$ -116 -133 68 27 -184 144 4 76 49 -83 -73 64 22 -115 -46 -181 169 20 9 17 238 -30 36 65 -37
3266c7k64J97O6j40J08J66j08j07K53r8j19m3K81nQ6l47J43j1O1m0j31J24j62
$$ -37 -301 -104 -38 -178 -70 96 -12 -119 134 36 -83 -126 155 150 236 -111 32 21 82 42 -89 35 -127
3289a27K48j18J5K5M5N2K8P1k10l3O8p0j53J29j10K89j66q8J4K41k53j04K62j90
$$ -127 121 3 18 43 88 140 168 239 29 -4 64 -6 -159 -30 -140 149 -17 -105 -91 150 -103 -207 55 -135
3313a35J12L4PJ7J0k25J06J09j2j74J33M4l48L89R0j19O9k03N1J69K0k24K76j39
$$ -135 -23 11 18 35 45 -180 -74 35 23 -151 -18 26 -322 67 157 38 107 -96 -45 124 144 -80 196 57
3337E7j38Mn4J2P7L22l36l4N2j11Q8J1O0K53j66p1J63m32J82K76j72K07p9j42
$$ 57 -81 -77 -131 -119 -42 280 -56 -90 -38 -149 -61 -50 10 263 97 26 189 -243 -61 215 43 250 171 29
3361B9l9k97K92J09j81K57j82p8K29j29L1p1l14O6K72p2J58j61L54j00k47J40
$$ 29 -10 -307 -15 94 -87 170 -12 -90 139 10 41 -30 -344 -278 -6 -78 80 -81 273 173 -74 66
3383F6r4J43k69M9J18j37L6J6Q2p0J25k73L29k82M1M8K69k23N7j71J73n7j70j6
$$ 66 -28 115 -154 -105 13 -124 -88 -72 10 -60 65 -208 121 -161 -120 -72 197 -26 31 -140 33 -24 -194 -210
3407b10J98P7K21l43O1P6j80J0K6K45j66j1j55J48j70R9J58j18kQJ07k43K22k7
$$ -210 -12 65 286 -57 4 80 -100 -90 -64 181 15 4 -151 -3 -173 -74 84 -34 -36 -28 79 -164 58 31
3431C1L66m76K52k77j36M25j71K77k40J71k50J60m50K26o3M8l0J30K1n7j40L3
$$ 31 397 -79 173 -104 -240 185 14 291 51 222 -28 132 -318 -92 -155 -107 -137 -7 14 -43 -183 -150
3453a50K07K02mk97o1j47K60j13L69p1k49J75k39J34j50qJ25NJ76J4O7j86k50
$$ -150 57 259 255 -42 -103 -250 10 -103 266 195 -54 121 -118 16 -134 -142 -17 -12 164 178 245 59 -191
3476a91K12l6J71j42J29k01K42j09j71K97k10Q3K9l50L35m2MJ00k13N8k1J67j11
$$ -191 21 -15 156 14 143 -58 184 75 -96 201 -9 74 103 -247 88 46 50 150 -63 -5 -26 141 30
3499C0l32L55L4j28j53K46m2p5L69k94k11J44L37o3m38J81m6R9O9J87k13j19P1
$$ 30 -302 53 87 -41 -194 52 10 -65 304 10 -201 -57 280 217 -221 -40 -86 13 82 269 56 -63 8
3522HQ0Q7j93N4j57J07j25N0K02j17k60J32K25J38j40J47k25k21K42J46k1k20
$$ 8 88 175 -18 36 -121 -14 -139 -89 113 -4 -264 -132 93 231 91 238 13 -208 34 180 159 -61
3544f1K8l9J37l72K50k80J96K75kj12o9k03L65q0o1J8n1j7K40M2k30j7r5K52k91
$$ -61 -33 -72 65 -307 -57 -337 -141 134 132 20 -49 -252 113 33 -28 -10 -61 -78 162 204 -26 -43 -138 114 -177
3569a77L72k41q9K45k44J06j7J32P8o7n0Q6k17J79j15k00m0O03o08M17j59k32
$$ -177 195 -46 -135 110 -134 -28 -45 87 165 98 48 134 -83 96 -19 -219 -259 344 -264 153 -6 -238
3591b38K90j10o1J62Q5k47J49j04J9K7mk79K25j03J80J48j21j37J08O4Q3J16m43
$$ -238 52 -58 -119 43 128 -119 30 -74 -55 -28 -32 -311 -86 -189 -9 139 18 -119 -11 53 136 252 -191
3614a91L84q3k38J92O5j30j46K34j94J12l5Ln6R8j25J12p9j47K10j01m3O6J13
$$ -191 193 110 -128 64 129 -1 -147 87 -107 5 -30 -27 -83 15 -110 2 -77 -224 -14 -115 -158 -92 21
3637B1m1M5j43R6J57r1k54L33qJ12m1k4k1j68j64K94l62K95R2J58k49k9r0M36
$$ 21 -20 25 -118 -22 135 44 -210 123 115 227 186 162 141 -27 -191 103 -259 36 128 286 37 8 -82 354
3661C54o23L67j2j30K5j67J09J03K86j92k69K24J21n02K90l6r3J50p7P5lQ9j31
$$ 354 -269 98 86 -44 -19 -186 -77 26 312 120 -149 75 196 -306 -16 -52 -145 5 -72 3 0 89 -42
3684d2j87NL65j0J6o8r4K73j07k61l06N77k28n3j5J85j38K6j97J71mJ38O7m6j95
$$ -42 -229 -224 141 131 147 79 -15 258 151 -110 -416 161 -67 -120 -135 50 -88 -62 -259 -88 -92 46 113 67 -128
3709a28K45j14p5k29L68k34J12R2K09j93j2K3k12L53r5J16l63K19p4N2n4o7l22
$$ -128 117 3 -72 -301 67 -167 -55 37 246 53 41 64 -148 205 110 226 -137 82 8 60 6 -61 -383
3732c83L63L25m24j29J10L19k14O7J84r5J3j22J95J40k87o1K67j18l27R6K66p4
$$ -383 -20 305 -119 -248 -138 181 -33 34 218 123 136 14 209 349 62 1 268 150 -177 -81 185 111
3754A11p4lp7K80m30O7J44J22j64J21j81K57l56J70k40K29K50j25K6k94K26J90
$$ 111 37 34 -43 237 -193 -126 18 140 -24 97 -84 173 -183 -13 -253 -24 226 101 127 -167 59 249
3776B49k82J27J3K07k42P7j58j30L13m64N79k13j68O4k21K66J54k74kr1M09k18
$$ 249 -33 94 107 314 72 149 -9 -139 174 -290 289 76 -92 -28 -249 17 171 -103 -105 -196 213 -5
3798el4J37J01k46k67K83Qk6L3p2L31k09j64N4p2L8J7L07k78K32n15M14m6R9J98
$$ -5 -39 98 199 -47 -314 -31 -23 -49 -16 -88 243 34 -130 -76 -148 -110 -93 214 -64 168 -347 67 21 120 318
3823C18k99n8J09m43N07j93k23K74K5J94l47k5K23j33K1J42p4P0m9K59k25P5m04
$$ 318 19 -39 70 -373 134 -59 -282 -8 17 211 -136 -161 62 -71 -50 92 18 88 39 298 73 148 -256
3846b56P7Q9K58o5k46K13m6k00K39j20Kk5j4J03O3k36K15r6Pj24O8J28j12J58
$$ -256 -179 -90 168 103 -143 70 24 -176 63 -57 -55 -80 -94 9 72 -164 51 -45 -38 -162 -94 34 -78 80
3870H0N3mq5O3K2j73j30K13j63j9R4L3o4j07L32j61J89l53K86r0k12L75j39J5
$$ 80 133 129 44 107 129 -44 -174 39 -124 -143 -49 -16 -80 -187 145 -16 173 -180 106 16 -196 179 40 55
3894E5j77J09j41Q1J32n3O1m3L5J3M0j83P3l26M90O1l66K24j31L08j95o7j69O9
$$ 55 -122 -13 -154 -73 59 6 67 24 59 72 112 -71 2 -324 166 227 -139 85 -46 262 67 0 -169 -100
3918a00n3J85Qrj2m3O7R8k15J38j38OK19j27P5ko2J08j63N1qk33J62m9J02K14
$$ -100 -153 32 40 31 19 -24 43 141 -74 64 -74 -68 151 24 99 97 35 143 -20 31 23 -210 -48 -97 5 219
3944B19o3j62j94K37Mk1J2nk5j74m9L08L8o2m7m1O5J5j39l3J20L2M7j61j36N5
$$ 219 156 -6 -200 37 41 20 32 27 2 -172 -221 87 125 63 16 -25 40 55 -84 -117 3 35 82 -79 -215 -160
3970a60L46j3k03J50l01r1J57K18J30l7k37K0j5J78j99j46L55m64K48J87K8k61
$$ -160 186 173 -30 120 -181 -272 -115 103 233 196 -41 -21 -36 142 -57 -203 152 -312 -64 123 151 -110
3992a10J71K89m33K3L03k18O4p7o4J55O1p0J73k76k78M02j98L48o0n8j81j12M
$$ -110 61 350 -83 -60 243 25 89 12 -52 103 164 94 267 -9 -287 115 -83 265 205 147 -34 -146 -142
4015a42J80j77P1j73j8M12l50L4OL21j82m4j10O37n41j97K54J67N7l07J16N3Q2
$$ -142 38 -139 -68 -241 -259 153 -197 -163 -157 164 -18 -62 -172 465 -76 -273 -19 148 205 -102 14 67 149
4038A49J17k32J14m20J53K20J10o7k42K25n3P9k36j62K30J2J8J51j84n5K23r2
$$ 149 266 34 148 -272 -119 101 211 144 -98 127 74 153 -83 -245 -15 -3 15 166 -18 -73 150 58
4060E8n3k31K74k7k21J76j39L3M3J03r9K96k94J24j45N6n3R4pJ21J3j7j27j52
$$ 58 5 -226 48 21 -200 -24 -163 -130 -87 16 -83 213 -81 43 -102 -46 -99 -5 -12 109 122 105 -22 -174
4084a74J77k13L25l32J32M3J52l30K92n7Q6j42j94K84p5o0j01J75j50R8r7J20
$$ -174 3 -210 115 -217 -85 -42 110 -220 72 15 101 -41 -235 49 -26 -86 -187 -12 -162 -64 -161 -41
4106d1J30r6P9P4N3k62P1p3j17K14J76k43J59J47j16m1j37P9l50L09j42L02k78
$$ -41 89 -7 72 146 199 -63 8 -65 -182 32 208 -35 124 271 155 114 -23 56 -294 15 -127 175 -103
4129a03K11j39LQ9N2o3p9r2L8k9J16j39K06j99J27M8l53M59j44o8j98K18Q5k5
$$ -103 108 -31 -28 61 113 50 -29 -121 -83 -112 4 -135 71 -128 -1 47 -306 153 9 -59 -257 -39 46 21
4153B1o1K54j30oj73J92k20K1K0K40j5j31j53K96k58L26k42N3j1L2j50J20j22
$$ 21 -40 214 84 78 -95 97 -123 -102 -82 158 143 12 -141 155 -103 223 -19 34 23 55 -95 25 -97
4176i7j49NJ25M61m63N3J42o3j27K7J55Q3J28l61m8J91j80J23J0j70l0L22j37
$$ -97 -246 -241 -116 345 -118 -65 77 14 -113 -86 69 152 280 -81 -129 62 -118 5 15 -155 -185 137 0
4199@l09L10J85k65NM1M9O5j98N2J41l79K41n6K9J72o2j7O7k00J4k77M53j4m17
$$ 0 -309 1 186 -79 -74 -33 16 81 -117 -65 76 -303 -62 -118 -89 83 21 4 71 -129 -115 -392 61 47 -370
4224c70M74n6k4pp1j09J27j4L12m38K25j2j06k44L56jK5j06qj12L45j75j63J72
$$ -370 104 48 24 17 -54 -163 -36 -50 262 -176 49 37 -69 -313 43 42 67 -39 -47 -159 186 11 -152 20
4248B0M8j54J57K5jj4l1j46R0k4p3J51o1n0Q1M1o6j06N3N4k73J78k3K29j12K64
$$ 20 68 -86 71 96 95 81 50 -96 -6 -30 -103 48 -13 -63 18 59 -7 -113 -60 -6 -279 -101 -124 105 -7 257
4274B57m17K50j16p5J87j3k69K84k58K26j4L05l25k60M62l34J44M7k86J46q6L51
$$ 257 -160 90 -26 -101 86 73 -196 88 -170 56 42 347 22 -238 224 -110 34 81 -205 -59 -145 206
4296B06r9j14J70k29n2J45j2K76o32N95k21j97L45l03L32o7j99k0j36M89j21q8
$$ 206 107 -7 163 -66 -118 27 15 291 -341 254 33 -164 181 -122 210 143 -56 -76 -212 277 156 68
4318F8r6k48M90m17L58p0k93J95K60n4m78M47o1p5n1k8J79j86Q8o9M2j76N3J17
$$ 68 -28 -276 214 -203 155 85 -208 -13 247 193 -285 162 101 26 -25 -53 126 -60 28 -41 1 -175 -122 -5
4342eJ62j98j24O2J21j58j7N9Rj7NM3o9L96k87L0K6j26K37O3j12n9J81j16k01
$$ -5 157 -41 -165 -103 18 -140 -157 -98 -89 -106 -101 -58 -127 269 -18 12 38 -88 149 212 100 41 222 106 -95
4367i5j5J14q7J07o0L32m46L2K46r6Q6j98j4n3M7M85m77J74L39m77j08J04m3P1
$$ -95 -110 4 -83 24 -36 296 -150 -118 128 32 118 -80 -94 -147 -100 385 -92 82 421 -56 -164 -60 -103 -32
4391c2O4k06J54Lr5R2R5k28J24j17M8N9K2k3N6N4j5j72M00k68l0J42j88p6j52
$$ -32 32 -174 -20 -17 -112 -20 75 -153 -29 -146 -98 -39 -17 -40 16 70 55 -117 283 15 -15 127 -61 -137 -289
4416b89K36K61j90j49L8j26N37k72k07J61P7j19j42j79K83O5K6J8K43n7j66J68
$$ -289 -53 208 18 -131 -93 -219 318 46 -161 0 77 -42 -184 -363 -80 -15 11 29 272 215 49 217
4438B17j08j01J4k47J91j45L8J56q9Q3j56J25m9K87j55p4J3J01j00m0j8m5oJ85
$$ 217 109 8 22 -225 -34 -179 -141 15 -74 9 -147 -22 -71 216 61 -13 0 101 1 -39 -57 -102 -108 77
4462G7j23K65m49M01r8j81j3R4J94k3l16J12K1j0R8j93J30j18P2Q7N1l62N49m81
$$ 77 -46 219 -230 171 73 -108 -121 -27 167 144 -172 -60 -39 -49 49 -144 -14 -132 -60 27 78 -284 265 -216
4486b16L29j56PJ83k22K06R8j37j38q9K01p4K24m72m4M32l75L49q4J0l9j16K98
$$ -216 113 -43 -36 147 -75 131 229 92 -46 -135 66 -8 216 -256 -300 132 -243 106 22 32 -7 -123 175
4509A75K0k21J98k75j80L35j02m8P7n4L76k31k42J69K74m58o0J96j32Q2MR0j66
$$ 175 195 -26 172 -103 -283 52 -50 -98 -21 -75 301 70 -172 -3 271 -187 -247 -51 -183 -101 -97 -7 -173
4532a73L12l11P9K37j85N6o1R8j20M2q2J5K8j75L05M2L1nk70K52j87k42J61K02
$$ -173 139 -172 -93 144 -41 15 -46 52 -68 -26 -108 -93 -65 -240 65 107 138 133 -137 115 -72 -314 -153 49
4556D9P2j56J74m00N78j57Q4m14N0M18l32L09o13L37NO2k07J60M2R6J60m09J68
$$ 49 121 -35 139 -261 317 160 244 -170 -120 298 -34 275 -338 -1 4 66 -141 19 61 157 317 -92 76
4579G6j11j08L73j69j31OJ21K85k73k91k45M83p8o6K17O9j40j89K59l71L78k99
$$ 76 -35 -143 230 61 -70 -64 57 342 69 -222 -467 16 -62 -128 89 158 18 -171 88 -283 95 -204
4601b04J02j38M37j61L5M5j85q4O8R9j41J80m1r0J19K08n6j24k15K39j93o8J67
$$ -204 -102 -240 197 36 71 116 -69 -153 -85 14 -127 53 12 -78 41 249 193 69 -146 93 -100 -168 -1
4624al0j55N18k65j37j27J44j02J4J12L3Q8r2N8P4p9L1Q5j20p6P8p5K33j63L0
$$ -1 -31 -186 332 67 -70 -197 -53 -155 -141 -29 4 92 0 58 132 53 84 169 49 -27 51 -24 209 46 76
4649G6j46j4J0J32K3l4q8j61K07N5j13J52k50N6L9j18J95n9m4J61r8l7J94j86
$$ 76 -70 -84 -74 58 81 47 -41 -202 5 60 -53 99 -151 -95 -56 -174 21 -38 -82 79 -19 -56 138 -48
4673d8q1J23P4K6l1J28j68K5j27j08J46M2p9O8n4J71j95K88J26m70J29k0J9qj60
$$ -48 -129 -6 68 94 63 191 23 48 -79 -187 -41 1 -78 -10 -64 107 -88 200 326 -144 -15 -35 -16 -24 -184
4698a84J97N0m65K12K35k2j62J59J21p1l7j6o7J66Ml7M2k73J98Q5k35K03k11J43
$$ -184 13 63 -402 -190 45 23 -139 20 141 70 33 17 -50 116 120 83 125 -148 50 135 -100 103 -108 35
4722C5P8j04JJ0K02j28n3Q3j55q2K73l06M32k11m14L78k67J51J49m35N03pm15
$$ 35 113 9 10 20 222 94 41 124 -31 -113 160 -146 286 75 -339 39 -228 -77 72 -363 140 133 -282
4745b82K72L07k61l50L93j92J77P1m9n4n4J70Mm24J74J96j14M7K07l11k4Q9K04
$$ -282 -10 297 36 -314 79 -113 64 135 86 32 -22 148 152 -272 -98 98 -16 31 238 -73 -97 -8 196
4768A96q0k89M84n1m13r0J3N9J69J08k33p4J03J97L1k59Q3nL6J6O1O0m05L55j15
$$ 196 116 -173 311 260 -153 -243 -230 -171 -2 106 -127 -201 -98 99 130 -129 -46 -51 -15 1 62 122 -283 72 -43
4793d3L53k56o9M4O5j24o6J16j8qj05J72N1l51K59M9P5j52k62q7M11p0N9n8k2
$$ -43 310 54 -15 29 94 -30 -96 20 2 -6 -111 61 112 -239 20 69 144 -8 -270 -357 54 -16 43 -15 -37
4818c7q5nR9R7m69L97J32m16K16K79L3k2j12k54J18m4Q7q5R3O8k05j17K44j37
$$ -37 -122 -127 -28 69 -400 -3 129 -287 -71 208 241 219 107 -147 -29 -73 14 -71 22 90 -115 -232 12 -125
4842a25L0P3K04N1j67q6J24k6k91J34N2j0rRK8K56k40k49J85O2k5M7Qn4J10j83
$$ -125 -95 -22 182 233 66 -20 104 78 -213 -79 -27 -37 -46 -37 -9 247 7 -242 -57 5 -20 27 35 -19 91 -92
4868i2M55n98J45K05k68J13k01J38R2q2k10L04K29l85J84k18K39K9k43Q0K8J03
$$ -92 363 -235 -90 115 -153 -40 -241 -103 -11 -93 -303 1 230 -155 29 -189 50 79 -164 -84 -56 47
4890D7j14P8l1j22P5K13j48q6m7L29l61J57K31j47J01q5Q6j31J1K22l77K14k29
$$ 47 -67 11 -20 -142 -67 146 -2 -88 -135 194 -167 -10 221 74 175 90 176 45 56 278 -99 115 -114
4913a14P0O1m44Q11m38j89M6J78j48J91j37J45j14m6J11J31j54K16q9r5m8k5j11
$$ -114 -44 17 -427 384 -54 -243 -197 -19 -167 24 -113 32 -82 -128 -17 114 -40 176 87 -8 -56 -81 -192
4936a92K7K15p1K2j33r4O35l63j74J98J56j77J77j30j31P1K28N9l58J27k75j2
$$ -192 -165 50 -21 1 -132 -226 409 46 -128 70 226 49 226 96 -35 36 264 323 -35 92 -183 -195
4958a95J28lK5K1N8j28J25l33L71j24K13l7k98M19l90J13J70j50J09m8J5k73J15
$$ -195 -67 -70 -45 -24 34 -94 31 -302 69 -55 158 121 -177 242 -148 -35 135 -15 94 46 61 -212 -97
4981i7kR7o9n4K81l89L79q5Kpj9l6o2r0J50j11J20p3L2J28M2j13j87J27J9J24
$$ -97 -99 -2 -71 -125 156 -233 146 61 63 56 37 1 -61 -151 -1 -112 8 -65 -33 95 137 24 -163 -36 -17 107
5007A07Q9q7l88O6J81J73k28j10L78j91j4k78L81p7k6j15L8K15j16J42l37K04
$$ 107 196 109 -279 -213 -32 141 -87 -197 181 -10 -24 -302 79 2 -24 -139 -101 114 -2 140 -197 7
5029Gq2J49l18M59m4l75L9k9K12j19K25P2l4k59l36O12l81J52KL15k00j73K58
$$ 7 -75 74 -244 215 171 -204 -165 -194 18 -101 124 196 162 -97 -433 179 -202 -50 -48 267 67 -106 152
5052A52j86J2p5L5K76j76J68k24K06M4m61P6J17J7P2j61K84p4k90L57k20n3j51
$$ 152 -34 -22 -97 -62 214 38 206 -18 188 232 -229 -153 -36 -19 53 -108 176 102 -188 169 -51 -104 -255
5075b55M20j58j11MK73o4k79K76n7Lj3l7q2m6j8J28K40q9l4k19M2J35J41j72M7
$$ -255 165 7 -104 -100 173 109 -170 106 49 52 39 2 -80 -126 -144 -16 224 135 101 -118 -76 59 200 28 75
5100G5k13K87l9j10J25k71K2L91k90Q3J59k9o6j41q4J48K5q5R1j7k12j14L26N7
$$ 75 -138 149 110 0 125 -146 -124 267 -23 60 219 190 124 -17 -101 47 72 -13 78 61 -151 -265 61 118
5124A18j43k22N48nl27J01k39J70J86m27J94K14j33K55k46J61j20JJ21n6j97L76
$$ 118 -25 -247 301 296 -31 70 -169 1 187 -240 -46 168 35 290 44 205 85 86 207 151 -46 330
5146C30k12k98J81j52J42N1L7k3k2j94M5p5N1J24q0J72r4K33m49L3J99Kj12K52
$$ 330 118 -180 1 -151 -9 42 79 56 34 -160 -115 -190 -139 -15 -95 77 -17 216 -233 -200 -1 1 -111 141
5170A41N7m45K66Q5l2o9J12j62j06J14J9J05r7J90k86j4j61M49m35L87j46j35
$$ 141 198 -247 19 104 72 3 115 -47 -153 -39 -20 85 -12 178 -108 -122 -283 166 -269 118 -28 -163
5192a63K37k46K66n6j74P3K15j39L3%k54L49l23K02j14J04J3q3K56l64K23k4M6
$$ -163 74 -172 94 38 -136 -63 152 13 46 46 -208 141 -182 20 -94 10 23 -60 196 -168 55 31 77
5215G7j66jR2L0L25l61L7k22K34J7j59q8L33l37K99N8j11K25m98L04o3J29l09
$$ 77 -89 -90 2 32 357 -4 33 -189 45 62 -97 -185 148 -189 110 168 57 282 -216 88 25 154 -155
5238a55k9J95k9j61oK09k7O1k38K14k33l9J35J86P0J37o7k88L11l89K07P8l32
$$ -155 -184 11 -18 -179 -185 24 -3 58 -180 34 -199 -238 -103 83 153 290 223 -65 246 -143 64 142 -190
5261a90J64K8j02J31o5j02K08l2l0R3k99M51l14J03P7q0J23k14q7K5k4K24J66
$$ -190 -26 2 -100 31 -34 -136 72 40 10 103 -196 255 -59 44 121 41 164 -50 -137 -112 -136 88 254
5284B54k39l6lj2r5K68N3j13k68K84l38rL86j23KK4j16L8k7K0J7M6j67J29j13
$$ 254 15 -21 -24 -36 -131 137 190 77 -191 93 -245 -254 132 9 11 35 -81 -43 -70 -50 -33 13 -154 -25 -138
5309a38K25j45J85j20J34k54J31J77l64K29k92K23j87R9NJ19K8r1K6Q9k4k2j36
$$ -138 87 -58 127 7 141 -113 18 195 -169 60 -232 -9 -196 -97 -92 27 55 -36 -10 79 55 33 -103
5332a03J11K26j68k01L23j91J36j61p1J02j00m1J99k12J19K00j01j02r1N5K09
$$ -103 8 234 66 -135 188 -3 133 -28 -99 3 -97 -138 61 -151 -32 168 67 -35 -126 -71 138
5353A38K7j91K30K22n19K52l5k88P4K8mJ9k46J06J83j3q1j4J60J43k27J5L01j41
$$ 138 165 -26 204 426 -93 159 124 -164 -90 -62 -66 -47 -293 -187 -4 -17 -98 -112 48 191 -36 -21 280 139
5377A39k32O5K56k35j85R2N6O0O1l86M57k84L52k96J59j51n2J78l57K35p0K73
$$ 139 -93 -28 228 -7 -192 -100 -44 16 77 -309 148 -136 216 -80 79 -72 -124 54 -303 -68 -138 135
5399A35l3m8j36K97n87N92j47m63M31k33M69j96pK4Np1j07J71r0K31m49J05K09
$$ 135 102 54 -82 215 -372 220 73 -390 41 -192 277 81 74 98 103 32 -75 96 6 237 -212 -107 102
5422A02n0k32J68K77m06L73l17Q1K27J13k41jo7J30j70O3j49L2K1J79j32L1n3
$$ 102 52 -180 -12 265 -141 232 -85 -4 223 336 95 94 27 157 -13 50 -99 -67 -46 133 1 32 -21
5445b1K27l81J58M13n49M65m29J40q7J17lj57J45K8j64J68j86K5K56l68J79n3
$$ -21 206 -175 -17 396 -153 312 -117 23 -64 53 50 -107 38 66 -98 70 -116 -91 165 -203 -24 -77
5467g7Q8j26K81l7J6o1N8o3J03J07l57j7J41R9O6j04k8o8j85J12o3l7j7O2J44
$$ -77 11 -115 166 129 145 84 142 79 182 289 -68 -85 56 155 221 117 89 21 -164 -52 -115 -152 -169 -107 37
5492C7m8m4K43j24j86J84P4j76l8j8j14J54K39L8l57K82ok26m2K49l53J90l5p3
$$ 37 -11 -55 188 64 -122 62 136 -40 -78 -96 -210 -56 183 221 -136 146 140 -86 -128 121 -232 -42 -77 -150
5516a50K35p1J06l11M49l16K98k51J95l58r0N18k69R6m6K9l22J7K96o8J90q3l80
$$ -150 85 14 120 -191 258 -58 240 -11 184 -174 -264 254 -15 81 35 64 -258 -241 55 -13 177 94 -286
5539b86K68P1K92l99J37J06N6r5j72n4l4o4q8J63L9K28k57n6J88k8J24m8n39L73
$$ -286 -18 53 345 -54 83 189 245 150 -22 -76 -110 -174 -262 -99 -60 168 -89 -145 43 15 139 91 -448 -75
5563g5k3R1j08M0J24k7k67K95J80l08o7J36M7N1J9K53k89mj07k68J73L3J43k6
$$ -75 -98 -7 -115 -75 49 22 -245 50 230 -78 -145 -9 38 89 108 361 72 68 -39 -307 -134 -101 42 16
5587A6R7j55K40j76K5J45k42qQ2OJ81N6j00j34L8j32J23K89o59K72%J52k53K27
$$ 16 113 -42 198 22 47 192 -50 -58 24 30 211 267 167 33 71 -61 62 351 -308 -36 -36 116 -137 90
5611I0J55n7P3m38O7J47J05l66L23q3J29j49q9K36k03k0k26L74k72L83j20K25
$$ 90 245 188 261 -177 -110 37 142 -224 99 16 145 -4 -93 143 -60 -80 -306 68 -204 179 59 284
5633B84m76M60l46N3n3R6q8r3Q6rK32k69J32lP6J22l29J83r1j65J66N0j14J21
$$ 284 -192 268 -78 -25 -78 18 -70 -163 -77 -86 146 -123 9 6 82 204 -125 58 -33 -198 -32 18 -96 25
5657B5r5M4J29k49Q6O1J4L4p9l4m6L18l1j87k1J84k90J93j81K62l2j62j5j22j82
$$ 25 -70 -26 103 -146 -60 1 15 49 -30 -64 -110 208 177 -10 -31 153 -137 56 -125 137 105 -57 -72 -194 -376
5682c76K29L20On9k3j12K08j31j76N5M0r0K69l21K40k86J47o1k2J35J37L7l87
$$ -376 -147 173 179 120 97 -15 193 62 -114 -59 -19 -109 160 -161 79 -207 -60 -121 -143 -8 129 166 -221
5705b21M23Q1l09j19O8J36P1j00j34kn3N6RJ86r8M9j30J03n3p5L57m25L87j78
$$ -221 202 283 -26 -145 -77 59 130 30 -104 -106 -159 -103 -94 92 -6 43 -87 16 -37 -112 245 -180 207 29
5729B9J00n3l4n0o8K87j55P2j03N9k3k77k0J14K4J00J68k64J36l0R5J51j19k99
$$ 29 129 76 42 -8 -76 211 56 128 25 84 61 -216 -236 -122 -98 2 170 -94 42 12 107 258 139 -160
5753a60P4J45l7r3Q1O4l1k7k45L66p2J05k34O0kj21M8K09j96PP4M5j43K36j53
$$ -160 -86 59 22 -71 10 74 43 16 -229 137 65 170 -64 -4 -6 -127 -79 130 -66 -59 15 60 -83 153 0
5778@o0K79m2l04J00j00J3K64l52K89N5k30J94j03j91K36Rk36K12J14N6l00N8
$$ 0 -60 219 177 -127 -27 -127 -114 150 -202 87 142 -88 106 3 -188 48 57 -179 33 147 203 -97 -39
5801c9L6k8l2pJ29j01K87k68PL4J7O6Nk97J07J08k9o0J27j55J32K4k6j58P1o6
$$ -39 -3 -31 -63 -70 59 -42 245 -23 -16 18 35 101 106 -191 -84 24 -5 -65 62 -93 39 63 37 -121 -50 -116
5827a16J03K29k05j33k5K32k5lq5P1j50L79l96J21r6J02J2k87L61l70K35K56q4
$$ -116 -13 216 11 -122 -147 85 60 57 -28 43 -107 272 -124 -3 -99 3 15 -272 89 -281 -46 210 126
5850A26o4q6O4k03K1R7K77k79M2J98k47j12L29j31m8M0J2p7K84j01j85K79l71
$$ 126 62 -24 40 -163 -142 -45 232 -47 -5 193 -54 -166 163 32 -16 24 36 -41 243 142 -43 236 -135
5873a35K60k37J30K21m60J38j0J54m54M87J7J12o8m2k58K75n8K36j19j22q8N3
$$ -135 125 -112 18 239 -221 -83 -93 61 -393 94 111 223 155 113 -145 130 72 308 189 67 -21 32
5895C2J39r7r1j84Q0L0J18Q4o6k38M23k16j05J94J29j11j09j82J82k20K7R0L5
$$ 32 171 74 -17 -201 -121 -91 27 111 45 -193 230 14 -91 103 232 121 12 -170 12 -208 -181 -91 -56
5918e6J38l63RK90k5J22J3r1l5lM0J84k12j64K76j20K4K46k63j51J01j99O82l99
$$ -56 82 -281 -272 18 -7 115 128 37 2 -1 39 223 11 -153 123 3 27 273 10 -141 -40 -239 443 44
5942D4r7J96J76k13k46J64j34K03j2k60J91Q2j34J28j34L37l55K78l99J93j70
$$ 44 -53 143 319 106 -140 24 -110 93 81 -179 12 94 -40 88 -46 291 -64 214 -185 8 -162
5963a62J47j35NJ23Q7k21K11J87k73k4L2j66J8J76n4J25k29J36J76l6l89J68K53
$$ -162 -15 -150 -145 -22 65 -156 55 242 -31 -55 -23 -189 -171 5 -49 76 -153 -17 159 123 -266 -98 155
5986A55l95K47q8J97l15Q9K5J40r4Q4m4j2J57L6l30N7J36m9nQ8J60k35R0j7J43
$$ 155 -240 7 -81 116 -199 -110 -85 55 -39 45 1 -11 146 182 -148 -91 45 -4 -9 79 239 4 94 77 220
6011B20l14J97p6k14j1M89n68K65n2j45J25J02K33l22j90L53k15Q7p7K6J78P3
$$ 220 -94 103 27 -187 -198 291 -277 -12 -64 -209 -84 18 251 -71 -261 92 -123 -36 -113 -87 91 164
6033A64k54J86k21K27%J8k51J76j12j05L06j08P0M6m5o3J07k14O8J87j30j17J33
$$ 164 -90 96 -125 102 102 120 -131 45 -67 -172 134 26 96 142 97 34 141 -73 -5 182 52 -65 68
6056F8l15J78J21j23J30k65L07j37O1J99j44q1m9J77j32L9M0q3P4nL2p0J20j14
$$ 68 -247 -69 52 -71 59 -206 101 -36 25 224 80 -1 -50 127 -5 34 74 -9 65 60 92 22 142 28
6080B8j20J68j62J35k81K02M06l70J8J03k58K41k02J08j65M61m12l52M82j97K09
$$ 28 -92 76 -86 49 -232 -30 376 6 24 127 -131 110 -92 16 -149 312 -100 -452 30 -167 42
6101D2k2l6k37L67j59p0J17K72l49n7J60Q6p8k0l7J23Lk50K21p0M1j13J55k62
$$ 42 20 -16 -253 114 -45 -115 2 274 -75 -132 28 114 36 16 -21 102 105 -145 76 6 47 -66 89 -173
6125a73M09k02J3k35L9J17j16K21L3K4k59O6m9P7J60l99J91K38k60K9M4J18rj2
$$ -173 236 34 47 -188 -149 -32 -148 73 106 130 -129 -63 -112 -35 125 -274 -83 155 -105 -76 -32 86 77 65
6149F5r3k49L28J42j53k40J31K5J31j90J72J48j09j08n7L7J38k29J91j50K0p1
$$ 65 -28 -277 51 193 40 -200 -69 -44 87 -103 69 217 108 0 -57 -20 118 -111 80 -70 -50 -121
$$ [...]
8191A24
##END NTUPLES=NMR FID
##END=
