##TITLE=1H_MeSO4
 CDCl3
 8 sc, 
 12.3.2024
##JCAMPDX= 6.0         $$ Bruker NMR JCAMP-DX V2.0
##DATA TYPE= NMR FID
##DATA CLASS= NTUPLES
##ORIGIN= UXNMR, Bruker Analytische Messtechnik GmbH
##OWNER= root
$$ XWIN-NMR		Version 3.5
$$ Tue Mar 12 16:26:53 2024 Russian Standard Time (UT+4h)  she@DPX200
##.OBSERVE FREQUENCY= 200.1313
##.OBSERVE NUCLEUS= ^1H
##.DELAY= (6, 6)
##.ACQUISITION MODE= SIMULTANEOUS
##.ACQUISITION SCHEME= undefined
##.AVERAGES= 8
##.DIGITISER RES= 18
##SPECTROMETER/DATA SYSTEM= spect
##.PULSE SEQUENCE= zg30
##.SOLVENT NAME= D2O
##.SHIFT REFERENCE= (INTERNAL, D2O, 0, 15.7039)
##AUDIT TRAIL= $$ (NUMBER, WHEN, WHO, WHERE, WHAT)
$$ ##TITLE= Audit trail, XWIN-NMR		Version 3.5
$$ ##JCAMPDX= 5.01
$$ ##ORIGIN= Bruker BioSpin GmbH
$$ ##OWNER= she
$$ F:/spectra/data/she/nmr/H-F/1/audita.txt
$$ ##AUDIT TRAIL=  $$ (NUMBER, WHEN, WHO, WHERE, WHAT)
(   1,<2024-03-12 16:25:51.34 +0400>,<she>,<DPX200>,
      <created by zg, POWCHK disabled, PULCHK disabled
       configuration hash MD5:
       00 E9 B6 7A A2 85 ED C7 34 08 36 98 17 FE 4E 26
       data hash MD5: 16K
       32 4D 92 FD 7F 51 33 65 15 39 2D 09 A4 FB 40 1C>)
$$ ##END=
$$ 
$$ hash MD5
$$ 1A 43 F1 59 5C 1E E5 1D F4 24 D1 67 65 C3 AB 1A
##$RELAX= 
##$RELAX= 
##$RELAX= 
##$RELAX= 
##$RELAX= 
##$RELAX= 
$$ Bruker specific parameters
$$ --------------------------
##$DU= <F:/spectra>
##$EXPNO= 1
##$NAME= <H-F>
##$PROCNO= 1
##$TYPE= <nmr>
##$USER= <she>
##$AMP= (0..31)
100 100 100 100 100 100 100 100 100 100 100 100 100 100 100 100 100 100 
100 100 100 100 100 100 100 100 100 100 100 100 100 100 
##$AQSEQ= 0
##$AQ_mod= 1
##$AUNM= <au_zg>
##$AUTOPOS= <>
##$BF1= 200.13
##$BF2= 200.13
##$BF3= 200.13
##$BF4= 200.13
##$BF5= 200.13
##$BF6= 200.13
##$BF7= 200.13
##$BF8= 200.13
##$BYTORDA= 1
##$CFDGTYP= 0
##$CFRGTYP= 5
##$CHEMSTR= <none>
##$CNST= (0..31)
1 1 145 1 1 1 1 1 1 1 1 1 1 1 1 1 1 1 1 1 1 1 1 1 1 1 1 1 1 1 1 1 
##$CPDPRG= <>
##$CPDPRG1= <>
##$CPDPRG2= <>
##$CPDPRG3= <>
##$CPDPRG4= <mlev>
##$CPDPRG5= <mlev>
##$CPDPRG6= <mlev>
##$CPDPRG7= <mlev>
##$CPDPRG8= <mlev>
##$CPDPRGB= <>
##$CPDPRGT= <>
##$D= (0..31)
0 1.2 0 0 0 0 0 0 0 0.06 0 0.03 0 0 0 0 0.0002 0 0 0 0 0 0 0 0 0 0 0 0 
0 0 0 
##$DATE= 1710246350
##$DBL= (0..7)
120 120 120 120 120 120 120 120 
##$DBP= (0..7)
150 150 150 150 150 150 150 150 
##$DBP07= 0
##$DBPNAM0= <>
##$DBPNAM1= <>
##$DBPNAM2= <>
##$DBPNAM3= <>
##$DBPNAM4= <>
##$DBPNAM5= <>
##$DBPNAM6= <>
##$DBPNAM7= <>
##$DBPOAL= (0..7)
0.5 0.5 0.5 0.5 0.5 0.5 0.5 0.5 
##$DBPOFFS= (0..7)
0 0 0 0 0 0 0 0 
##$DE= 6
##$DECBNUC= <off>
##$DECIM= 32
##$DECNUC= <off>
##$DECSTAT= 4
##$DIGMOD= 1
##$DIGTYP= 9
##$DL= (0..7)
0 120 120 120 120 120 120 120 
##$DP= (0..7)
150 150 150 150 150 150 150 150 
##$DP07= 0
##$DPNAME0= <>
##$DPNAME1= <>
##$DPNAME2= <>
##$DPNAME3= <>
##$DPNAME4= <>
##$DPNAME5= <>
##$DPNAME6= <>
##$DPNAME7= <>
##$DPOAL= (0..7)
0.5 0.5 0.5 0.5 0.5 0.5 0.5 0.5 
##$DPOFFS= (0..7)
0 0 0 0 0 0 0 0 
##$DQDMODE= 0
##$DR= 18
##$DS= 0
##$DSLIST= <SSSSSSSSSSSSSSS>
##$DSPFIRM= 0
$$ [...]
##$SUBNAM2= <"">
##$SUBNAM3= <"">
##$SUBNAM4= <"">
##$SUBNAM5= <"">
##$SUBNAM6= <"">
##$SUBNAM7= <"">
##$SUBNAM8= <"">
##$SUBNAM9= <"">
##$SW= 18.0517328524113
##$SWIBOX= (0..15)
0 0 2 0 0 0 0 0 0 0 0 0 0 0 0 0 
##$SW_h= 3612.71676300578
##$TD= 16384
##$TD0= 1
##$TE= 0
##$TE2= 300
##$TE3= 300
##$TEG= 300
##$TL= (0..7)
0 120 120 120 120 120 120 120 
##$TP= (0..7)
150 150 150 150 150 150 150 150 
##$TP07= 0
##$TPNAME0= <>
##$TPNAME1= <>
##$TPNAME2= <>
##$TPNAME3= <>
##$TPNAME4= <>
##$TPNAME5= <>
##$TPNAME6= <>
##$TPNAME7= <>
##$TPOAL= (0..7)
0.5 0.5 0.5 0.5 0.5 0.5 0.5 0.5 
##$TPOFFS= (0..7)
0 0 0 0 0 0 0 0 
##$TUNHIN= 0
##$TUNHOUT= 0
##$TUNXOUT= 0
##$USERA1= <user>
##$USERA2= <user>
##$USERA3= <user>
##$USERA4= <user>
##$USERA5= <user>
##$V9= 5
##$VALIST= <valist>
##$VCLIST= <CCCCCCCCCCCCCCC>
##$VD= 0
##$VDLIST= <DDDDDDDDDDDDDDD>
##$VPLIST= <PPPPPPPPPPPPPPP>
##$VTLIST= <TTTTTTTTTTTTTTT>
##$WBST= 1024
##$WBSW= 4
##$XGAIN= (0..3)
0 0 0 0 
##$XL= 0
##$YL= 0
##$YMAX_a= 34868
##$YMIN_a= -55197
##$ZGOPTNS= <>
##$ZL1= 120
##$ZL2= 120
##$ZL3= 120
##$ZL4= 120
##$ABSF1= 10
##$ABSF2= 0
##$ABSG= 5
##$ABSL= 3
##$ALPHA= 0
##$AQORDER= 0
##$ASSFAC= 0
##$ASSFACI= 0
##$ASSFACX= 0
##$ASSWID= 0
##$AUNMP= <proc_1d>
##$AZFE= 0.1
##$AZFW= 0.1
##$BCFW= 1
##$BC_mod= 2
##$BYTORDP= 1
##$COROFFS= 0
##$CY= 11.3945322036743
##$DATMOD= 1
##$DC= 2
##$DFILT= <>
##$DTYPP= 0
##$F1P= 15.7292609196834
##$F2P= 12.9074282941183
##$FCOR= 0.5
##$FTSIZE= 0
##$FT_mod= 4
##$GAMMA= 1
##$GB= 0.15
##$INTBC= 1
##$INTSCL= 1
##$ISEN= 128
##$LB= 0.24
##$LEV0= 0
##$LPBIN= 0
##$MAXI= 10000
##$MC2= 0
##$MEAN= 0
##$ME_mod= 0
##$MI= 1.114404
##$NCOEF= 0
##$NC_proc= 0
##$NLEV= 6
##$NOISF1= 3.799351
##$NOISF2= 2.8
##$NSP= 1
##$NTH_PI= 0
##$NZP= 0
##$OFFSET= 15.70392
##$PC= 1
##$PHC0= -25306.73
##$PHC1= 16.78731
##$PH_mod= 1
##$PKNL= yes
##$PPARMOD= 0
##$PSCAL= 0
##$PSIGN= 0
##$REVERSE= no
##$SF= 200.130013532006
##$SI= 16384
##$SIGF1= 3
##$SIGF2= 2
##$SINO= 400
##$SIOLD= 16384
##$SREGLST= <1H.CDCl3>
##$SSB= 0
##$STSI= 0
##$STSR= 0
##$SW_p= 3612.71676300578
##$SYMM= 0
##$S_DEV= 0
##$TDeff= 0
##$TDoff= 0
##$TI= <>
##$TILT= no
##$TM1= 0
##$TM2= 0
##$TOPLEV= 0
##$USERP1= <user>
##$USERP2= <user>
##$USERP3= <user>
##$USERP4= <user>
##$USERP5= <user>
##$WDW= 1
##$XDIM= 8192
##$YMAX_p= 0
##$YMIN_p= 0
$$ End of Bruker specific parameters
$$ ---------------------------------
##NTUPLES= NMR FID
##VAR_NAME=  TIME,          FID/REAL,        FID/IMAG
##SYMBOL=    X,             R,               I
##VAR_TYPE=  INDEPENDENT,   DEPENDENT,       DEPENDENT
##VAR_FORM=  AFFN,          ASDF,            ASDF
##VAR_DIM=   8192,          8192,            8192
##UNITS=     SECONDS,       ARBITRARY UNITS, ARBITRARY UNITS
##FACTOR=    0.0002768,     1,               1
##FIRST=     0,             0,               0
##LAST=      2.2672688,     0,               0
##MIN=       0,             -55197,          0
##MAX=       2.2672688,     34868,           0
$$ Real data points
##PAGE= N=1
##DATA TABLE= (X++(R..R)), XYDATA
$$ plain form
0 0 0 0 0 0 0 0 0 0 0 0 0 0 0 0 0 0 0 0 0 0 0 0 0 0 0 0 0 0 0 0 0 -1 1 -3 4 -4 5 -7 7 -7 7 -8 8 -9 10 -11 12 -13 15 -18 19
51 19 -19 21 -24 29 -31 34 -39 43 -50 60 -70 82 -104 133 -181 269 -455 1017 -4878 -28461 -5019 20405
73 20405 30280 34868 26023 15607 7721 2530 6019 -382 -10105 -11533 -20432 -21507 -8005 -9837 -11866
88 -11866 -964 2464 4005 8438 12905 19055 13200 6590 12840 8894 1879 3521 -4436 -10827 -7859
103 -7859 -11392 -11754 -8069 -7461 -4774 -4471 96 10736 6441 2744 11339 8539 5673 10469 6106 15
119 15 -2760 -6013 -3162 -3945 -6412 -5030 -10665 -9903 875 -512 -944 5877 3376 2321 6848 7617
135 7617 8112 3193 -790 2193 -1975 -3581 1137 -5021 -8504 -4144 -6579 -4980 560 549 1617 1304
151 1304 2067 7607 4831 4113 8065 1473 -2163 1577 -2130 -3954 -3171 -6100 -5405 -4577 -3369 278
$$ packed form
0@%%%%%%%%%%%%%%%%%%%%%%%%%%%%%%%jKmPqRj2J4j4J4j5J6j7J9k1K3k5K8l3L7
51A9l8M0m5N3o0O5p3Q2r3J10j30J52j86K37l14M50p24J472n895k3583K3442K5424
73B0405R875M588q845j0416p886n191L489o401r723j428q899j075J3502j832k029
88a1866J0902L428J541M433M467O150n855o610O250l946p015J642p957o391K968
103g859l533l62L685O08K687L03M567J0640m295l697Q595k800k866M796m363o091
119A5k775l253K851p83k467J382n635P62J0778j387m32O821k501j055M527P69
135G617M95m919l983K983m168j606M718o158l483M360k435J599N540j1J068l13
151A304P63N540k776p18L952o592l636L740l707j824P83k929O95Q28J208L647
$$ plain form
167 278 -2412 -1406 5101 3108 4756 9476 4031 1964 3961 1771 1508 -1408 -5388 -5313 -8056 -6094
183 -6094 -1414 -5055 -4990 -68 -1453 1785 7517 5904 5977 5273 4416 6494 3259 1739 1895 -5415 -7559
200 -7559 -4458 -8015 -6483 -3727 -6253 -4722 -1675 971 5918 5351 6015 8791 4712 6159 9225 3163
216 3163 542 -403 -5437 -5445 -5501 -7374 -7306 -9220 -6906 -1515 -2202 1191 5887 3060 5975 10004 7402
233 7402 7362 5852 2282 2022 -1176 -2649 -3361 -8902 -9060 -6646 -8700 -5299 -1359 -3246 -110 3143
249 3143 4803 8608 8101 7409 7274 2296 3166 4354 -1134 -2541 -3777 -8796 -7245 -5493 -5848 -4076
265 -4076 -4927 -3154 884 1747 5771 8354 4166 5182 6388 3423 4560 3103 -1404 -2642 -4972 -4799
281 -4799 -3486 -6523 -5196 -3571 -5432 -567 2680 641 3595 4194 3677 5593 5183 4020 2685 -1178
$$ packed form
167B78k690J006O507j993J648M720n445k067J997k190k63k916l980P5k743J962
183f094M680l641O5M922j385L238N732j613P3p04q57K078l235j520J56p310k144
200g559L101l557J532K756k526J531L047K646M947n67O64K776m079J447L066o062
216C163k621r45n034qn6j873O8j914K314N391o87L393M696k827K915M029k602
233G402m0j510l570k60l198j473p12n541j58K414k054L401L940j887L136L253
249C143J660L805n07o92j35m978Q70J188n488j407j236n019J551J752l55J772
265d076q51J773M038Q63M024K583m188J016J206k965J137j457m507j238k330J73
281d799J313l037J327J625j861M865L247k039K954N99n17J916m10j163j335l863
$$ plain form
297 -1178 -586 -100 -4038 -3040 -3249 -6725 -3919 -1741 -1955 627 117 684 2739 2419 5127 5632 1355
314 1355 2145 1606 -1529 410 -130 -3859 -3945 -4680 -3525 -1011 -1860 155 472 -1689 2344 4742 2714
331 2714 4540 3154 262 1716 918 -129 -835 -4073 -3928 -3560 -4898 -1476 -684 -2903 517 1810
347 1810 1234 4450 4236 3129 3584 1548 2429 1982 -1511 -1064 -2852 -5843 -3064 -3031 -4927 -2739 -2300
364 -2300 -1479 1839 2390 4594 4754 2548 5186 4961 2542 3623 969 -3391 -2613 -3569 -4511 -3605 -5468
381 -5468 -5083 -3796 -3306 1443 2841 1406 4548 4585 3709 6643 5851 3490 2321 -1122 -1805 -2081 -4550
398 -4550 -3522 -5540 -7550 -4165 -3150 -2752 1082 1227 1469 4301 4777 6308 6522 3864 4285 2005 -841
415 -841 529 -2122 -5614 -4530 -5774 -5928 -3484 -3599 -2141 -1135 -330 3487 4561 3919 6253 4587
$$ packed form
297a178N92M86l938R98k09l476K806K178k14K582n10N67K055l20K708N05m277
314A355P90n39l135J939n40l729q6p35J155K514q49K015L17k161M033K398k028
331B714J826j386k892J454p98j047p06l238J45L68j338L422P92k219L420J293
347A810n76L216k14j107M55k036Q81m47l493M47j788k991K779L3j896K188M39
364b300Q21L318N51K204J60k206K638k25k419J081k654m360P78r56r42R06j863
381e468L85J287M90M749J398j435L142L7q76K934p92k361j169l443o83k76k469
398d550J028k018k010L385J015L98L834J45K42K832M76J531K14k658M21k280k846
415h41J370k651l492J084j244j54K444j15J458J006Q05L817J074o42K334j666
$$ plain form
431 4587 2724 4759 3020 632 -161 -3612 -4422 -4360 -4761 -2942 -4218 -5162 -1740 -808 0 4086 3351
448 3351 2741 4220 3748 4492 4404 1942 1250 -1455 -3412 -1262 -3113 -4766 -2812 -4254 -4140 -826 -24
465 -24 1190 1995 1361 3221 3447 2932 4841 1933 -131 1047 -1167 -1961 -1114 -3423 -4031 -3252 -2869 -804
483 -804 -511 -894 1601 934 1456 4710 2778 1851 2582 295 190 798 -1090 -1412 -3062 -4113 -1582 -2164
501 -2164 -1768 422 -1200 -752 2728 2369 3398 3686 1603 1679 979 292 1356 -1591 -3365 -2332 -3827
518 -3827 -3082 -675 -2150 -1845 -285 -319 2239 3316 3240 4075 2111 1840 3260 661 -304 -198 -3622 -3676
536 -3676 -2776 -3527 -2713 -2822 -2638 -281 -225 1324 4062 2623 2735 4644 3208 3121 3051 231 -895 -1932
554 -1932 -3050 -2560 -4028 -4625 -3237 -4385 -2389 812 310 1534 2898 2333 4376 5068 4231 3997 1269
$$ packed form
431D587j863K035j739k388p93l451q10O2m01J819j276r44L422R32Q08M086p35
448C351o10J479m72P44q8k462o92k705j957K150j851j653J954j442J14L314Q02
465b4J214Q05o34J860K26n15J909k908k064J178k214p94Q47k309o08P79L83K065
483h04K93l83K495o67N22L254j932r27P31k287j05O08j888l22j650j051K531n82
501b164L96K190j622M48L480l59J029K88k083P6p00o87J064k947j774J033j495
518c827P45K407j475L05J560l4K558J077p6Q35j964k71J420k599r65J06l424n4
536c676R00p51Q14j09J84K357N6J549K738j439J12J909j436q7p0k820j126j037
554a932j118M90j468n97J388j148J996L201n02J224J364n65K043O92q37k34k728
$$ plain form
571 1269 40 425 -2138 -2365 -2189 -5264 -5278 -3916 -3545 -1524 -505 -534 1430 1822 3540 5757 4184
588 4184 4111 3702 1124 1150 1273 -1376 -2504 -3621 -4974 -3692 -4166 -3067 -1457 -2579 -603 2258 1871
605 1871 3672 4470 2834 3524 3631 2216 2167 -89 -1519 -1804 -3898 -3105 -2458 -4736 -3549 -2028 -2057 344
623 344 1430 1614 2779 2236 3072 4472 2469 2251 1502 -1317 -838 -504 -2568 -2344 -3117 -3968 -2423 -1858
641 -1858 -464 1055 152 1140 2637 1807 3562 3680 1133 1108 406 -550 -199 -1384 -2331 -2306 -3422 -1988
659 -1988 -746 -1635 -47 680 -171 2012 2934 2339 2699 1473 758 1147 -383 -408 -795 -3237 -2350 -1626
677 -1626 -2365 -706 -395 -1082 626 1080 1906 3178 1867 2058 1950 126 1401 709 -1726 -1668 -2209 -3421
695 -3421 -1937 -1643 -1812 -1083 -1671 366 2119 1774 3175 2955 1158 2609 2196 979 1270 -796 -2255
$$ packed form
571A269j229L85k563k27J76l075j4J362L71K021J019k9J964L92J718K217j573
588D184p3m09k578K6J23k649j128j117j353J282m74J099J610j122J976K861l87
605A871J801P98j636O90J07j415m9k256j430k85k094P93O47k278J187J521k9K401
623C44J086J84J165n43Q36J400k003k18p49k819M79L34k064K24p73q51J545N65
641a858J394J519r03R88J497q30J755J18k547k5p02r56L51j185r47K5j116J434
659a988J242q89J588P27q51K183R22n95L60j226p15L89j530k5l87k442Q87P24
677a626p39J659L11o87J708M54Q26J272j311J91j08j824J275o92k435N8n41j212
695c421J484K94j69P29n88K037J753l45J401k20j797J451m13j217K91k066j459
$$ plain form
712 -2255 -2299 -3230 -2118 -2074 -3491 -2221 -1173 -942 1698 2453 1867 3091 2876 2847 3673 2161 1342 443 -1779
731 -1779 -1182 -2044 -3585 -2811 -3529 -4261 -1855 -1168 -249 1174 750 2330 3714 3176 4500 3536 1072 1669
749 1669 772 -1126 -548 -2676 -3922 -3703 -4156 -2757 -1755 -2036 -457 331 473 3415 3871 3270 3867 2505
767 2505 1760 2393 871 -122 -1175 -3800 -3035 -3010 -3946 -2066 -2309 -2790 -297 324 1477 3077 2660 2730
785 2730 3073 2251 3241 2218 159 41 -1497 -2897 -1886 -2685 -3100 -2421 -2903 -1395 5 385 1828
802 1828 1620 1228 3393 3005 1968 2544 746 -462 26 -1213 -1363 -1865 -3176 -2324 -2004 -2013 207 -116
820 -116 -401 1430 1386 1818 3216 1968 1770 1006 -239 659 -37 -1374 -1174 -2352 -3047 -963 -1027 -761 172
839 172 -322 503 1765 1725 2565 1993 834 1486 182 -342 569 -1435 -2198 -1564 -2229 -1698 -945 -1542 -382
$$ packed form
712b255m4r31J112M4j417J270J048K31K640P55n86J224k15k9Q26j512q19q99k222
731a779N97q62j541P74p18p32K406O87R19J423m24J580J384n38J324r64k464N97
749A669q97j898N78k128j246K19m53J399J002k81J579P88J42K942M56o01N97j362
767B505p45O33j522r93j053k625P65K5r36J880k43m81K493O21J153J600m17P0
785B730L43q22R90j023k059j18j538j400J011p99m15O79m82J508J400L80J443
802A828k08l92K165l88j037N76j798j208M88j239j50n02j311Q52L20rK220l23
820a16k85J831m4M32J398j248j98p64j245Q98o96j337K00j178o95K084o4K66R33
839A72m94Q25J262m0Q40n72j159O52j304n24R11k004p63O34o65N31P53n97J160
$$ plain form
858 -382 -136 395 2256 1952 1589 2461 964 1038 1636 84 -342 -970 -2599 -1913 -1965 -2134 -938 -1919 -1724
877 -1724 389 567 1616 2705 1677 1826 2432 1906 2173 1196 -558 -659 -2214 -2541 -1220 -2737 -2742 -1824
895 -1824 -2497 -626 783 989 1932 1894 1873 3488 2773 2090 2367 -102 -768 -618 -2186 -2128 -2421 -3622 -2882
914 -2882 -2479 -1819 -157 -57 168 2094 2121 2944 4090 2622 2207 1913 407 519 -345 -1879 -2217 -3572
932 -3572 -3601 -2012 -2495 -1770 -571 -1083 646 2298 2330 2976 2790 1929 2398 1930 1226 1095 -1411 -2266 -1927
951 -1927 -2966 -2303 -1965 -2998 -1916 -1379 -496 1496 1570 1670 2488 1867 2439 3219 1318 1002 384 -1426
969 -1426 -873 -1437 -2327 -1758 -2591 -2610 -1068 -1142 48 1382 308 1571 2560 2069 2669 1875 510 596 -449
988 -449 -546 -170 -1988 -2071 -1620 -2383 -1240 -169 -799 340 611 783 2054 1911 1756 1812 210 546 921
$$ packed form
858c82K46N31J861l04l63Q72j497P4N98j552m26o28j629O86n2j69J196r81J95
877a724K113J78J049J089j028J49O06n26K67r77j754j01j555l27J321j517nR18
895a824o73J871J409K06R43l8k1J615p15o83K77k469o66J50j568N8k93j201P40
914b882M03O60J662J00K25J926K7Q23J146j468m15k94j506J12q64j534l38j355
932c572k9J589m83P25J199n12J729J652L2O46j86q61M69m68p04j31k506q55L39
951a927j039O63L38j033J082N37Q83J992P4J00Q18o21N72P80j901l16o18j810
969a426N53n64q90N69q33j9J542p4J190J334j074J263R89m91O00p94j365Q6j045
988d49r7L76j818q3M51p63J143J071o30J139K71J72J271j43j55N6j602L36L75
$$ plain form
1007 921 -402 -466 -996 -2342 -1784 -1294 -1111 -167 -794 -440 705 522 1907 2295 925 1229 1359 77
1025 77 595 155 -1188 -1190 -1984 -1993 -677 -1500 -1067 -295 -847 870 1493 1194 2207 1720 911 1619 906 454
1045 454 382 -1337 -1393 -1628 -2522 -1429 -1470 -2316 -1001 -261 42 1784 1510 1518 2146 1693 2193 2256 431 503 -486
1066 -486 -1987 -1209 -1572 -2512 -2089 -2380 -2246 -626 -472 908 1355 871 2429 2703 2086 2779 1954 459
1084 459 483 -468 -822 -1141 -2340 -2596 -2442 -2978 -1232 -685 -877 473 718 1127 2937 2602 2551 2634 1367
1103 1367 1181 965 -404 -407 -1628 -3171 -2117 -2551 -2350 -1399 -1750 -1145 350 656 1916 2396 1811 2490
1121 2490 2302 1665 2043 721 -734 -875 -1798 -2148 -1618 -2411 -2170 -1850 -2049 -285 422 607 1505 1371 1341
1140 1341 2734 2155 1749 1552 -47 -210 -488 -1468 -932 -1617 -2678 -1611 -1536 -1123 404 42 232 1345
$$ packed form
1007I21j323o4n30j346N58M90J83R44o27L54J145j83J385L88j370L04J30j282
1025G7N18m40j343kp94rJ316q23M33P72n52J717O23k99J013m87q09P08p13m52
1045D54p2j719n6k35q94J093m1q46J315P40L03J742k74QO28m53N00O3j825P2r89
1066d86j501P78l63r40M23k91J34J620J54J380M47m84J558K74o17O93q25j495
1084D59K4r51l54l19j199k56J54n36J746N47j92J350K45M09J810l35n1Q3j267
1103A367j86k16j369lj221j543J054m34K01R51l51O05J495L06J260M80n85O79
1121B490j88o37L78j322j455j41r23l50N30p93K41L20j99J764P07J85Q98j34l0
1140A341J393n79m06j97j599j63k78r80N36o85j061J067P5M13J527l62J90J113
$$ plain form
1158 1345 1209 1877 2260 1227 1294 537 -384 499 -204 -1443 -1082 -2072 -1898 -859 -1078 -351 35 -246 1061
1177 1061 1353 1250 1952 1271 512 1066 393 -19 -29 -1471 -1623 -1193 -1586 -766 -636 -1165 171 170 387 1748
1197 1748 1353 1120 1477 540 704 890 -129 -275 -1016 -2167 -913 -1268 -1466 -651 -1133 -518 705 655 1484
1216 1484 1691 973 1648 1237 848 1453 325 -847 -651 -1768 -1636 -1203 -1910 -1500 -903 -991 227 737 784
1235 784 1495 1233 1661 2441 1630 1099 809 -700 -662 -989 -1626 -1540 -2089 -2636 -1367 -1396 -935 503 165 736
1255 736 1874 1713 2390 2595 1352 1244 440 -87 -30 -1262 -1884 -1814 -2565 -2355 -1161 -1634 -776 -217 -307 1288
1275 1288 1678 1847 2574 1849 1349 1740 722 551 172 -1608 -1805 -1899 -2297 -1614 -1714 -1705 -807 -689 184 1657
1295 1657 1097 1252 2004 1363 1886 1952 752 408 -466 -1267 -713 -1502 -1682 -1431 -2131 -1674 -316 -487 366
$$ packed form
1158A345j36O68L83j033O7p57r21Q83p03j239L61r90J74J039k19P27L86k81J307
1177A061K92j03P02o81p59N54o73m12j0j442j52M30l93Q20J30n29J336jK17J361
1197A748l95k33L57r37J64J86j019j46p41j151J254l55j98Q15m82O15J223n0Q29
1216A484K07p18O75m11l89O05j128j172J96j117J32M33p07M10N97q8J218N10M7
1235G84P11k62M28P80q11n31k90j509L8l27o37Q6n49n47J269k9M61J438l38N71
1255G36J138j61O77K05j243j08q04n27N7j232o22P0p51K10J194m73Q58N59r0J595
1275A288L90J69P27p25n00L91j018j71l79j780j97r4l98O83j00RQ98J18Q73J473
1295A657n60J55P52o41N23O6j200l44q74q01N54p89j80K51p00M57J358j71Q53
$$ plain form
1314 366 684 631 1288 1621 1614 1884 1122 347 659 -324 -260 -502 -1665 -1555 -1534 -1602 -539 -524 -394 306 -38 795
1336 795 1819 1188 1448 1121 286 635 449 -386 -391 -1142 -1724 -1005 -1154 -973 -180 -819 -42 638 703 1509 1460
1357 1460 603 985 554 181 742 -435 -807 -932 -1308 -1030 -421 -933 -578 -340 -544 638 1014 951 1354
1376 1354 567 823 1149 243 152 -87 -1234 -983 -992 -1435 -762 -1132 -1277 -157 118 502 1335 929 1287 1599
1396 1599 883 1257 1119 181 -30 -668 -1088 -821 -1351 -1476 -1176 -1688 -830 -49 -43 797 1205 774 1715 1667 1327
1417 1327 1658 745 242 -57 -909 -848 -1081 -2156 -1596 -1550 -1736 -438 -95 -225 742 807 1623 2237 1664 1588
1437 1588 1317 490 835 336 -644 -763 -1705 -2150 -1625 -1666 -1267 -717 -998 -279 729 848 1845 1748 1175 1810
1457 1810 1219 1055 1147 20 -743 -942 -1504 -1334 -1256 -2114 -1080 -1457 -916 412 425 569 1264 1140 1324 1734
$$ packed form
1314C66L18n3O57L33pK70p62p75L12r83O4k42j163J10K1o8J063J5J30P00l44Q33
1336G95J024o31K60l27q35L49j86q35np51n82P19j49J81P93o39P77O80O5Q06m9
1357A460q57L82m31l73N61j177l72j25l76K78O09n12L55K38k04J182L76o3M03
1376A354p87K56L26r06r1k39j147K51rm43O73l70j45J120K75L84Q33m06L58L12
1396A599p16L74j38r38k11o38m20K67n30j25L00n12Q58P81OQ40M08m31R41m8l40
1417A327L31r13n03k99q52O1k33j075N60M6j86J298L43j30R67O5Q16O14n73p6
1437A588k71q27L45m99r80j19r42m45N25m1L99N50k81P19J008J19R97r7n73O35
1457A810n91j64R2j127p63j99n62J70P8q58J034l77N41J328J3J44O95j24J84M10
$$ plain form
1477 1734 1082 1302 763 -322 -83 -357 -1226 -1056 -1549 -1684 -983 -1038 -488 191 93 569 903 1077 1638 1408
1497 1408 702 927 236 -106 207 -555 -1119 -1306 -1729 -1181 -679 -851 -105 -87 -228 992 775 870 1207 671
1517 671 656 757 -22 320 -339 -1188 -912 -1126 -1056 -238 -564 -703 176 -269 510 1083 632 853 794 166 779
1538 779 565 -339 -414 -935 -1083 -625 -1084 -844 -691 -656 -103 536 622 1297 877 647 1053 818 696 577 -481
1559 -481 -659 -552 -1075 -927 -724 -1273 -738 -576 -377 529 616 511 1224 781 1205 1612 974 469 116 -633
1579 -633 -459 -632 -1179 -1052 -1721 -1391 -569 -594 -122 470 15 841 1372 1177 1867 1260 765 693 -5 -271 -361
1600 -361 -1076 -1322 -1238 -1808 -1113 -789 -878 -108 12 310 1231 1154 1561 1660 978 824 1054 46 181 -364 -1434
1621 -1434 -1276 -1315 -1408 -965 -1353 -1075 -274 -219 664 1390 796 1223 1328 1038 1331 982 124 6 -679 -1018 -766
$$ packed form
1477A734o52K20n39j085K39k74q69J70m93j35P01n5N50O79r8M76L34J74N61k30
1497A408p06K25o91l42L13p62n64j87m23N48N02j72P46J8j41J220k17R5L37n36
1517F71j5J01p79L42o59q49K76k14P0Q18l26j39Q79m45P79N73m51K21n9o28O13
1538G79k14r04p5n21j48M58m59K40J53L5N53O39Q6O75m20k30M06k35j22j19j058
1559d81j78J07n23J48K03n49N35J62J99R06Q7j05P13m43M24M07o38n05l53p49
1579f33J74j73n47J27o69L30Q22k5M72N92m55Q26N31j95O90o07m95p2o98k66r0
1600c61p15k46Q4n70O95L24q9P70J20K98R21p7M07R9o82j54K30j008J35n45j070
1621a434J58l9r3M43l88K78Q01N5Q83P26n94M27J05k90K93l49q58j18o85l39K52
$$ plain form
1642 -766 -1387 -1334 -1279 -1392 -843 3 -134 730 529 655 1318 1362 1264 1222 256 11 -50 -621 -329 -760 -1304 -1287
1664 -1287 -1008 -974 -133 -327 -68 455 425 878 1403 857 992 610 121 382 16 -354 -462 -1075 -1008 -477 -864
1685 -864 -409 -120 -512 309 606 505 1060 849 436 624 361 131 406 -588 -585 -781 -988 -465 -310 -716 -553
1706 -553 -77 212 752 444 681 1029 431 700 766 179 156 -170 -912 -547 -680 -837 -433 -794 -473 -127 -42
1727 -42 512 1119 553 754 806 512 1003 787 -38 -68 -814 -873 -507 -1046 -683 -756 -968 -198 261 178 688 741
1749 741 866 1207 924 768 995 30 55 87 -833 -512 -855 -1525 -974 -1098 -719 -112 74 168 578 743 1176
1770 1176 1407 867 979 675 123 360 -165 -760 -670 -1510 -1282 -825 -988 -648 -337 -592 259 774 814 1371
1790 1371 1245 802 1101 686 589 509 -558 -385 -714 -1282 -898 -1025 -1433 -918 -519 -333 662 807 610 1114
$$ packed form
1642g66o21N3N5j13N49Q46j37Q64k01J26O63M4r8m2r66k45o1n71K92m31n44J7
1664a287K79L4Q41j94K59N23l0M53N25n46J35l82m89K61l66l70j08o13O7N31l87
1685h64M55K89l92Q21K97j01N55k11m13J88k63k30K75r94Lj96k07N23J55m06J63
1706e53M76K89N40l08K37L48n98K69O6n87k3l26p42L65j33j57M04l61L21L46Q5
1727d2N54O07n66K01N2k94M91k16q25l0p46n9L66n39L63p3k12P70M59q3N10N3
1749G41J25L41k83j56K27r65K5L2r20L21l43o70N51j24L79O07J86R4M10J65M33
1770A176K31n40J12l04n52K37n25n95R0q40K28M57j63L40L11k55Q51N15M0N57
1790A371j26m43K99m15r7q0j067J73l29n68L84j27m08N15L99J86R95J45j97N04
$$ plain form
1810 1114 861 1115 1317 719 637 72 -359 -350 -910 -954 -941 -1400 -1231 -762 -535 36 204 277 777 1121 640 1432
1832 1432 899 275 533 -146 -206 -137 -647 -851 -1022 -1153 -500 -199 -357 177 -183 214 944 947 977 971 385 270
1854 270 419 -49 58 -248 -799 -678 -683 -553 -213 -389 -249 -16 -75 674 769 523 731 406 99 506 202
1875 202 -423 -254 -875 -747 -608 -630 -400 -311 -450 280 324 542 850 379 442 901 477 338 241 -344 -332 -421
1897 -421 -746 -550 -550 -933 -317 -424 26 423 355 519 747 575 887 791 264 230 43 -686 -476 -693 -782 -679
1919 -679 -1084 -833 -346 -254 219 637 492 776 975 828 1121 655 114 214 -300 -422 -360 -899 -1092 -837 -1078
1940 -1078 -245 -369 -361 463 326 574 1190 1008 1158 1145 632 416 391 -96 -299 -833 -1348 -873 -1002 -677 -283
1961 -283 -663 -414 142 357 805 936 821 1035 793 754 816 489 -235 -158 -749 -914 -619 -1122 -995 -959 -848
$$ packed form
1810A114k53K54K02n98q2n65m31Rn60m4J3m59J69M69K27N71J68P3N00L44m81P92
1832A432n33o24K58o79o0O9n10k04j71j31O53L01j58N34l60L97P30LL0on86j15
1854B70J49m68J07l06n51J21nJ30L40j76J40K33n9P49R5k46K08l25l07M07l04
1875B02o25J69o21J28J39k2K30Q9j39P30M4K18L08m71O3M59m24j39r7n85J2q9
1897d21l25J96%l83O16j07M50L97o8J64K28j72L12r6n27l4j87p29K10k17q9J03
1919f79m05K51M87R2M73M18j45K84J99j47K93m66n41J00n14j22O2n39j93K55k41
1940a078Q33j24QQ24j37K48O16j82J50j3n13k16k5m87k03n34n15M75j29L25L94
1961b83l80K49N56K15M48J31j15K14k42l9O2l27p24P7n91j65K95n03J27L6J11
$$ plain form
1982 -848 43 306 254 757 508 745 1233 943 873 822 -149 -215 -119 -673 -374 -790 -1183 -877 -740 -555 -29 -102
2004 -102 222 652 496 711 1127 430 528 263 109 283 6 -420 -465 -986 -648 -604 -555 -138 76 -201 402
2025 402 605 469 957 527 564 607 332 29 44 -512 -409 -540 -717 -315 -511 -521 -7 -266 216 617 408
2046 408 553 594 83 264 348 -22 170 -441 -779 -462 -608 -740 -254 -563 -183 198 181 570 517 259 589
2067 589 544 297 644 -80 -396 -383 -684 -477 -594 -726 -537 -385 -480 235 430 440 619 446 731 950 752
2088 752 523 367 -488 -377 -421 -507 -616 -922 -832 -360 -287 -10 235 260 441 444 754 975 861 501 465 80 -3
2111 -3 17 -639 -630 -736 -1081 -1012 -416 -390 -148 -71 -21 585 688 613 1023 665 521 652 197 193 -3 -651 -670 -682 -929
2136 -929 -552 -910 -572 -370 -86 261 618 493 699 802 605 835 634 130 8 -338 -543 -253 -609 -833
$$ packed form
1982h48Q91K63n2N03k49K37M88k90p0n1r71o6R6n54K99m16l93L06J37J85N26p3
2004a02L24M30j56K15M16o97R8k65j54J74k77m26m5n21L38M4M9M17K14k77O03
2025D02K03j36M88m30L7M3k75l03J5n56J03j31j77M02j96j0N14k59M82M01k09
2046D08J45M1n11J81Q4l70J92o11l38L17j46j32M86l09L80L81j7L89n3k58L30
2067E89m5k47L47p24l16J3l01K07j17j32J89J52r5P15J95J0J79j73K85K19j98
2088G52k29j56q55J11m4q6j09l06R0M72P3K77K45K5J81LL10K21j14l60l6l85q3
2111cK0o56Rj06l45O9N96K6K42P7N0O06J03p5M10l58j44J31m55mj96o48j9j2k47
2136i29L77l58L38K02K84L47L57j25K06J03j97K30k01n04j22l46k05K90l56k24
$$ plain form
2156 -833 -634 -1030 -797 -193 -201 236 307 371 781 649 691 757 334 79 143 -291 -349 -253 -553 -659 -786 -768 -125
2179 -125 -187 -310 381 130 337 793 502 786 690 96 343 154 -128 -122 -742 -699 -339 -529 -403 -234 -243 -112
2201 -112 172 187 492 423 261 354 394 159 261 94 -346 -292 -603 -336 -278 -594 -77 -32 -56 307 221 413 655
2224 655 113 365 639 186 182 -170 -421 -317 -517 -638 -343 -476 -355 -104 -206 289 510 334 583 711 354
2245 354 447 538 239 118 -308 -433 -185 -434 -333 -397 -575 -368 13 -180 407 253 340 704 511 571 646 282
2267 282 -9 42 -459 -335 -544 -497 -596 -552 -596 -176 41 -90 215 222 438 807 693 558 721 228 281 83 -374
2290 -374 -262 -524 -816 -716 -835 -590 -38 -95 -118 323 406 899 719 429 856 474 314 272 -16 -320 -349 -922
2312 -922 -605 -663 -715 -429 -406 -247 116 349 225 490 382 546 618 505 380 229 -338 -134 -329 -696 -605 -783
$$ packed form
2156h33J99l96K33O04qM37P1O4M10j32M2O6m23k55O4m34n8R6l00j06j27J8O43
2179a25o2j23O91k51K07M56k91K84r6n94K47j89k82Oo20M3L60j90J26J69rJ31
2201a12K84J5L05o9j62R3M0k35J02j67m40N4l11K67N8l16N17M5k4L63q6J92K42
2224F55n42K52K74m53ml52k51J04k00j21K95j33J21K51j02M95K21j76K49J28l57
2245C54R3R1k99j21m26j25K48k49J01o4j78K07L81j93N87j54Q7L64j93O0P5l64
2267B82k91N1n01J24k09M7r9M4m4M20K17j31L05PK16L69j14j35J63m93N3j98m57
2290c74J12k62k92J00j19K45N52n7k3M41Q3M93j80k90M27l82j60m2k88l04k9n73
2312i22L17n8n2K86K3J59L63K33j24K65j08J64P2j13j25j51n67K04j95l67R1j78
$$ plain form
2334 -783 -825 -299 -544 -277 265 84 244 444 478 755 549 276 653 -153 171 60 -338 -543 -330 -532 -391
2355 -391 -371 -398 69 -49 26 359 482 364 739 249 43 518 143 124 -64 -479 -422 -242 -352 -239 -309 -119
2377 -119 -17 -27 150 459 161 159 556 298 319 53 -72 157 -511 -404 -259 -343 -61 -73 -410 -152 141 250
2399 250 348 384 420 491 257 116 30 -291 -137 -122 -558 -352 -283 -441 -366 -306 -34 68 75 178 563 147 408 682
2423 682 290 182 128 -343 7 -179 -456 -362 -606 -499 -117 -199 144 343 108 315 456 295 371 532 206
2444 206 135 122 -26 -271 -448 -541 -416 -635 -303 -204 -508 33 146 218 630 416 695 626 175 202 252 -79 0
2467 0 -286 -676 -524 -567 -523 -206 -430 -209 -26 -46 462 586 712 515 558 345 611 391 22 8 -342 -238
2489 -238 -319 -565 -515 -422 -576 -226 -98 223 380 262 346 491 402 415 422 226 9 -245 -288 -175 -418 -644 -487
$$ packed form
2334g83m2N26k45K67N42j81J60K00L4K77k06k73L77q06L24j11l98k05K13k02J41
2355c91K0k7M67j18P5L33J23j18L75m90k06M75l75j9j88m15N7J80j10J13p0J90
2377a19J02j0J77L09k98kL97k58K1k66j25K29o68J07J45q4K82j2l37K58K93J09
2399B50R8L6L6P1k34j41q6l21J54J5m36K06O9j58P5O0K72J02PJ03L85m16K61K74
2423F82l92j08n4m71L50j86k77R4k44J07L82q2L43J99k35K07J41j61P6J61l26
2444B06p1j3j48k45j77r3J25k19L32R9l04N41J13P2M12k14K79o9m51K7N0l31P9
2467@k86l90J52m3M4L17k24K21J83k0N08J24J26j97M3k13K66k20l69j4l50J04
2489b38q1k46N0R3j54L50J28L21J57j18Q4J45q9J3Pj96k17k54m3J13k43k26J57
$$ plain form
2512 -487 -591 -452 -48 -114 84 137 250 505 693 418 591 349 99 88 181 -40 -141 -382 -394 -214 -365 -209
2534 -209 7 -137 131 345 228 222 252 329 312 250 216 116 15 -214 -583 -555 -141 -56 -381 -75 -147 -180 183 351
2558 351 337 475 211 310 292 10 201 -71 -406 -241 -456 -358 -89 -250 -271 -93 -145 248 474 227 353 381
2580 381 336 381 74 -234 45 -333 -424 -86 -157 -239 -400 -288 -158 248 74 392 181 139 451 329 169 207
2602 207 123 89 -101 -8 -229 -280 -391 -469 -363 -301 87 105 103 309 254 291 405 514 502 -21 -79 18 -198 -383 -435
2627 -435 -643 -514 -437 -500 -146 105 167 440 477 381 515 376 357 346 226 311 5 -300 -421 -497 -577 -254 -195 -341
2651 -341 -331 -336 -192 267 247 421 606 435 587 289 248 178 144 -451 -223 -147 -326 -517 -572 -410 -146 -200 -184 101
2675 101 155 457 353 454 506 234 287 99 90 -152 -111 -132 -352 -439 -380 8 -78 -103 48 -1 237 427 330 240 522
$$ packed form
2512d87j04J39M04o6J98N3J13K55J88k75J73k42k50j1R3k21j01k41j2J80j51J56
2534b09K16j44K68K14j17oL0P7j7o2l4j00j01k29l69K8M14Q5l25L06p2l3L63J68
2558C51j4J38k64R9j8k82J91k72l35J65k15R8K69j61k1J78n2L93K26k47J26K8
2580C81m5M5l07l08K79l78r1L38p1q2j61J12J30M06j74L18k11m2L12j22j60L8
2602B07q4l4j90R3k21n1j11p8J06O2L88J8kK06n5L7J14J09j2n23n8R7k16j85n2
2627d35k08J29P7o3L54K51O2K73L7r6J34j39j9j1j20Q5l06l05j21p6q0L23N9j46
2651c41J0nJ44M59k0J74J85j71J52k98m1p0l4n95K28P6j79j91n5J62K64n4J6K85
2675A01N4L02j04J01N2k72N3j88rk42M1k1k20q7N9L88q6k5J51m9K38J90r7r0K82
$$ plain form
2700 522 -11 41 118 274 -127 -318 -182 -258 -226 -232 -109 -260 -157 -31 -46 297 331 22 218 84 119 146 40
2723 40 30 -224 -226 -210 -32 -400 -233 -128 -192 128 217 222 379 297 145 353 65 216 199 -86 -150 -64 -113 -203 -232
2748 -232 -137 -175 -23 -6 238 176 132 484 118 206 186 17 58 -16 -12 -62 -219 -237 -157 -264 -273 -100 -321 302 271 172
2774 172 514 271 294 294 128 61 81 -206 -65 -16 -315 -173 -445 -587 -176 -182 -95 197 54 200 385 213 335
2797 335 444 -22 169 -6 -223 -201 -290 -467 -226 -187 -288 -102 -170 -92 7 142 443 412 305 468 284 292 238
2820 238 -131 13 -96 -375 -335 -242 -360 -414 -314 -488 52 64 266 180 151 307 392 441 399 245 87 191 -113
2843 -113 -291 -154 -368 -461 -306 -216 -248 82 -133 183 309 76 333 491 66 238 64 144 210 -192 -39 -186
2865 -186 -382 -330 -273 -333 -88 7 22 241 230 350 390 204 257 244 -201 -30 -257 -279 -240 -346 -450 -52 -290 -218
$$ packed form
2700E22n33N2P7J56m01j91J36p6L2oJ23j51J03J26j5L43L4l09J96j34L5K7j06
2723D0j0k54kJ6J78l68J67J05o4L20Q9NJ57q2j52K08k88J51j7k85o4Q6m9r0k9
2748b32R5l8J52J7K44o2m4L52l66Q8k0j69M1p4Mn0j57j8Q0j07rJ73k21O23l1r9
2774A72L42k43K3%j66o7K0k87J41M9k99J42k72j42M11oQ7K92j43J46J85j72J22
2797C35J09m66J91j75k17K2q9j77K41L9j01J86o8P8R9J35L01l1j07J63j84Qn4
2820B38l69J44j09k79M0R3j18n4J00j74N40J2K02q6k9J56Q5M9m2j54j58J04l04
2843a13j78J37k14r3J55R0l2L30k15L16J26k33K57J58m25J72j74Q0O6m02J53j47
2865a86j96N2N7o0K45R5J5K19j1J20M0j86N3j3m45J71k27k2L9j06j04L98k38P2
$$ plain form
2889 -218 -263 218 -113 60 46 244 86 257 191 227 64 27 -179 -291 -79 -282 -78 -107 -268 -220 -46 65
2911 65 106 232 320 324 100 275 251 -74 54 -192 -252 -20 -241 -310 -366 -371 -258 34 239 128 114 150 122 394 87
2936 87 192 126 -176 28 -225 -160 -98 -139 -304 -79 -159 -31 85 -61 80 327 57 409 520 191 357 32
2958 32 -135 -15 -279 -263 -287 -300 -93 -318 -304 -144 50 -13 140 96 418 436 447 143 125 121 72 219 -284 -197 -410
2983 -410 -230 -179 -367 -190 -17 -48 -82 233 159 197 379 270 442 270 108 -32 -129 -134 -290 -176 -217 -187 -351
3006 -351 -357 -250 -82 -99 275 245 196 319 230 214 35 200 282 -259 -34 -185 -85 -189 -228 -275 -141 -52 -17 166
3030 166 -58 181 261 101 372 118 26 167 16 -145 -116 -218 -209 -334 -278 -102 8 -78 -203 69 30 39 384
3053 384 218 220 186 114 34 -57 82 -115 -253 -21 -181 -149 39 -79 -163 176 199 212 218 100 275 106 -44 50
$$ packed form
2889b18m5M81l31J73j4J98j58J71o6L6j63l7k06j12K12k03K04k9j61M8J74J11
2911F5M1J26Q8Mk24J75k4l25J28k46o0K32k21o9n6nJ13K92K05j11j4L6k8K72l07
2936H7J05o6l02K04k53O5O2m1j65K25q0J28J16j46J41K47k70L52J11l29J66l25
2958C2j67J20k64J6k4j3K07k25J4J60J94o3J53m4L22J8J1l04j8mm9J47n03Q7k13
2983d10J80N1j88J77J73l1l4L15p4L8J82j09J72j72j62j40r7nj56J14m1L0j64
3006c51oJ07J68j7L74l0m9J23q9j6j79J65Q2n41K25j51J00j04l9m7J34Q9L5J83
3030A66k24K39Q0j60K71k54r2J41j51j61K9j02Rj25N6J76J10q6j25K72l9RL45
3053C84j66Kl4p2q0r1J39j97j38K32j60L2J88j18q4L39K3J3Oj18J75j69j50R4
$$ plain form
3077 50 57 -123 18 -196 -283 -119 -190 -233 -4 -41 115 75 74 39 116 -8 222 70 76 99 -59 59 -44 -210 -201 50
3103 50 -150 3 40 -127 103 155 35 207 392 255 192 106 239 26 193 -30 -237 -200 -305 -335 -535 -66
3125 -66 -151 74 126 71 116 455 11 472 292 123 43 -29 -33 -46 -375 -251 -198 -242 58 12 -72 -131 146 181 146 187
3151 187 219 171 283 152 80 85 -137 -184 -211 -211 -148 -239 -269 -27 -189 134 32 221 134 175 326 261 318 130 -109
3176 -109 -119 -173 -270 -258 -116 -306 -306 -174 -152 2 -79 70 140 113 161 281 300 192 42 -12 211 -17 25 -330 -186
3201 -186 -226 -75 -265 -245 42 -116 136 213 -46 196 273 142 157 -2 -107 45 -141 -102 -256 -44 -379 -20
3223 -20 -43 -262 -143 -68 40 300 167 152 390 -117 94 196 53 3 -317 24 171 -221 -11 -81 -210 -297
3245 -297 69 184 295 156 109 -5 72 65 61 -157 -245 110 -239 -106 -195 -108 -77 -29 70 193 -72 137 374 -30
$$ packed form
3077E0Pj80J41k14q7J64p1m3K29l7J56m0jl5P7j24K30j52OK3j58J18j03j66RK51
3103E0k00J53L7j67K30N2j20J72J85j37o3q6J33k13J67k23k07L7j05l0k00M69
3125f6q5K25N2n5M5L39m44M61j80j69q0p2mj3l29J24N3m4L00m6q4n9K77L5l5M1
3151A87L2m8J12j31p2Nk22m7k7%O3r1l0K42j62L23j02J89q7M1J51o5N7j88k39
3176a09j0n4r7J2J42j90%J32K2J54q1J49P0k7M8J20J9j08j50n4K23k28M2l55J44
3201a86m0J51j90K0K87j58K52P7k59K42P7j31J5j59j05J52j86L9j54K12l35L59
3223b0k3k19J19P5J08K60j33j5K38n07K11J02j43n0l20L41J47l92K10p0j29q7
3245b97L66J15J11j39m7j14P7pmk18q8L55l49J33q9Q7L1M8R9J23k65K09K37m04
$$ plain form
3269 -30 110 73 82 97 95 -53 166 27 -308 -167 -180 -266 -48 -149 135 -24 125 54 28 131 133 180 8 -3 -64
3294 -64 102 -53 -226 3 -44 -221 22 50 -125 -34 127 102 194 79 280 395 132 218 111 -46 13 -142 -207
3317 -207 -99 -184 -195 -195 -68 200 52 -89 191 104 37 218 318 99 89 144 10 -200 -114 -152 3 -284 -65
3340 -65 -242 -82 -1 -30 106 91 -32 85 322 182 263 392 38 -154 -120 -81 -231 -88 -214 -254 -249 -143 -133 -27
3364 -27 71 -107 170 191 132 195 570 267 277 -26 -119 -76 -206 0 -255 -246 -63 95 141 -103 -27 173 122 249
3388 249 37 138 185 -20 73 -44 -123 -216 -200 -44 -31 -48 -90 38 -109 -122 151 -24 20 95 125 92 244 -5
3412 -5 41 -40 -263 -51 -14 -36 -221 -106 -134 24 69 83 -25 -34 140 175 74 54 131 -114 133 -18 -90 -182 -81
3437 -81 -52 -100 -58 -198 -50 149 151 211 115 226 122 89 166 -25 69 -45 -250 -33 -80 -49 -156 -68 -75 68 140 137
$$ packed form
3269c0J40l7RJ5kj48K19j39l35J41j3q6K18j01K84j59J49p1k6J03KM7j72j1o1
3294f4J66j55j73K29m7j77K43K8j75R1J61k5R2j15K01J15k63Q6j07j57N9j55o5
3317b07J08q5j1%J27K68j48j41K80q7o7J81J00k19j0N5j34k10Q6l8J55k87K19
3340f5j77J60Q1k9J36j5j23J17K37j40Q1J29l54j92L4L9j50J43j26m0NJ06J0J06
3364b7R8j78K77K1n9O3L75l03J0l03r3M3j30K06k55RJ83J58M6k44P6K00n1J27
3388B49k12J01M7k05R3j17p9r3J6J56J3j7m2J28j47j3K73j75M4P5L0l3J52k49
3412eM6q1k23K12L7k2j85J15k8J58M5J4j08rJ74L5j01k0P7k45K47j51p2r2J01
3437h1K9m8M2j40J48J99KO0r6J11j04l3P7j91R4j14k05K17m7L1j07Q8pJ43P2l
$$ plain form
3463 137 208 -77 123 56 -30 90 176 -125 -113 -149 -146 17 28 -261 -175 -23 -9 11 -14 178 148 232 78 190 -80
3488 -80 130 43 121 58 -304 -117 -88 -152 116 -246 -161 -178 -114 125 224 268 194 152 214 78 114 -237 53 -11 -323
3513 -323 -58 -213 -1 -96 41 -154 -45 -249 97 81 -90 122 -24 107 138 268 91 62 -32 -120 -125 -125 -35 -217
3537 -217 -283 -251 -51 12 -121 239 238 94 153 125 39 70 -40 -58 -98 -124 -187 -289 -122 -72 21 -217 -74 -188 114
3562 114 15 272 224 130 -9 13 62 58 3 -179 113 -203 -136 -64 -73 -89 -11 -356 -57 16 -71 138 121 -36 164 60
3588 60 37 156 -4 -234 -66 -213 -42 -127 71 -129 -176 -152 17 -165 122 221 84 -120 202 175 98 141 -113
3611 -113 -152 -169 -114 -52 37 5 -137 21 29 82 19 105 142 44 -25 39 33 -26 -81 174 113 -175 -225 -168 -200 -17 -152 -41
3639 -41 2 -157 70 179 177 155 143 -119 334 -20 8 243 -272 -223 -244 -159 -72 104 -384 -124 205 140 316 210
$$ packed form
3463A37P1k85K00o7q6J20Q6l01J2l6LJ63J1k89Q6J52J4K0k5J92l0Q4j54J12k70
3488h0K10q7P8o3l62J87K9o4K68l62Q5j7O4K39R9M4p4m2O2j36L6l51K90o4l12
3513c23K65j55K12r5J37j95J09k04L46j6j71K12j46J31L1J30j77k9r4q8n%R0j82
3537b17o6L2K00O3j33L60jj44N9k8q6L1j10j8m0k6o3j02J67N0R3k38J43j14L02
3562A14r9K57m8r4j39K2M9mn5j82K92l16O7P2rj6P8l45K99P3q7K09j7j57K00j04
3588F0k3J19j60k30J68j47J71q5J98k00m7K4J69j82K87R9j37k04L22k7p7M3k54
3611a13l9j7N5O2Q9l2j42J58QN3o3Q6L7r8o9O4on9n5K55o1k88n0N7l2J83j35J11
3639d1M3j59K27J09kk2j2k62M53l54K8K35n15M9k1Q5Q7J76m88K60L29o5J76j06
$$ plain form
3663 210 141 7 116 -39 285 245 103 -83 -76 -79 -264 -45 -152 -6 -265 -187 33 -63 308 -16 72 221 177
3686 177 184 -15 44 -15 -204 -34 -207 -3 -117 -199 -133 8 -62 44 198 315 99 158 -54 192 100 76 80 -64
3710 -64 -170 79 -184 -55 -194 -1 -223 -102 -84 -148 -78 84 106 38 102 -64 236 -59 -38 -1 -45 -103 -249 -137
3734 -137 70 5 -38 52 -162 -192 310 210 -15 298 138 157 257 219 -53 -59 -36 77 133 -159 38 -50 -90 -165
3758 -165 -78 41 -45 164 79 67 231 187 -25 86 232 77 21 154 66 86 32 -91 2 87 24 245 105 143
3782 143 84 33 31 -10 -16 76 89 -103 -67 -197 -138 -57 -92 -182 -78 219 158 -152 96 105 -60 -15 7 -136 94 36 -94
3809 -94 -35 -62 -105 -32 18 -14 78 163 -52 163 246 204 240 93 215 106 74 98 -192 122 -53 -228 -213 -57 0
3834 0 -298 181 46 135 21 29 -74 75 156 -2 -9 66 248 -215 90 -166 -11 -84 20 -72 61 -59 3 105
$$ packed form
3663B10o9j34J09j55L24m0j42j86Plj85K19j07J46k59P8K20r6L71l24Q8J49m4
3686A77Pj99N9n9j89J70j73K04j14q2O6J41p0J06J54J17k16N9k12K46r2k4Mj44
3710f4j06K49k63J29j39J93k22J21J8o4P0J62K2o8O4j66L00k95K1L7m4n8j46J12
3734a37K07o5m3R0k14l0N02j00k25L13j60J9J00l8k72oK3J13N6k92J97q8m0p5
3758a65Q7J19q6K09q5j2J64m4k12J11J46j55n6J33q8K0n4j23R3Q5o3K21j40L8
3782A43n9n1km1oR2J3j92L6j30N9Q1l5r0J04K97o1l10K48Rj65M5K2j43K30n8j30
3809i4N9k7m3P3N0l2R2Q5k15K15Q3m2L6j47J22j09l2K4k90L14j75j75J5J56N7
3834@k98M79j35Q9j14Qj03J49Q1j58pP5J82m63L05k56J55p3J04r2J33j20O2J02
$$ plain form
3858 105 42 124 209 73 121 -130 99 4 -97 -121 -60 18 -33 -67 -223 -150 -62 139 41 70 25 25 276 -39 2 -75
3884 -75 -46 292 -1 -74 -7 -252 -16 -72 22 8 -146 18 -32 193 110 -9 79 375 147 49 194 -71 -93 -208
3908 -208 64 -144 78 -69 -86 -40 9 -251 -16 11 55 88 -172 -100 126 98 -96 159 -94 29 -150 -79 -63
3931 -63 -193 -56 48 -197 9 -43 -87 229 237 256 51 111 2 141 -17 -40 0 -11 -75 -152 -157 -37 -106 -164 -1
3956 -1 47 4 148 -106 17 -125 1 121 -53 -96 -84 210 -51 -110 -175 77 89 -97 159 28 -175 121 111
3979 111 2 -39 89 -110 111 105 -211 -72 17 -210 -57 -81 13 31 -69 83 -240 145 7 102 42 162 46
4002 46 -31 -36 83 32 13 -107 40 -33 -93 5 -110 129 232 -12 -30 66 79 -151 37 -11 6 79 2 93 -189 -224
4028 -224 -98 20 -108 -33 -34 135 14 165 196 -68 4 111 263 215 58 33 -144 150 87 -170 -136 -152 41
$$ packed form
3858A05o3Q2Q5j36M8k51K29r5j01k4O1P8n1l4j56P3Q8K01r8K9m5%K51l15M1p7
3884g5K9L38k93p3O7k45K36n6R4j4j54J64n0K25q3j19Q8K96k28r8J45k65k2j15
3908b08K72k08K22j47j7M6M9k60K35K7M4L3k60P2K26k8j94K55k53J23j79P1J6
3931f3j30J37J04k45K06n2m4L16QJ9k05O0j09J39j58k3M0j1o4p7nJ20o9n8J63
3956aM8m3J44k54J23j42J26J20j74m3J2K94k61n9o5K52J2j86K56j31k03K96j0
3979A11j09m1J28j99K21ol16J39Q9k27J53k4R4J8j00J52l23L85j38R5o0J20j16
4002D6p7nJ19n1j9j20J47p3o0R8j15K39J03k44j8R6J3k30J88m8J7P3p7R1k82l5
4028b24J26J18j28P5jJ69j21J51L1k64P2J07J52m8j57k5j77K94o3k57L4j6J93
$$ plain form
4051 41 -6 -13 53 -35 -96 -10 246 64 -248 152 9 -10 35 -85 12 -72 -147 -29 123 159 -55 196 89 -111 55
4076 55 -6 117 10 88 17 137 205 30 -197 66 90 53 4 15 142 -29 -202 -80 -127 -4 -35 -79 146 65
4100 65 280 -48 40 42 -188 -54 144 -12 137 35 50 -88 -75 222 24 77 128 130 131 181 249 29 -23 -4 -29 -67
4126 -67 49 29 -55 20 34 -190 -19 67 21 22 36 70 -43 48 213 -36 41 -97 -144 209 -75 -225 13 -127 75
4151 75 171 49 58 7 50 268 137 134 171 41 48 150 -65 113 -20 5 -71 -151 -38 46 201 -22 -44 -37 291 30
4177 30 -86 -83 69 -46 187 -27 -62 -97 11 69 -43 -205 186 79 -116 63 31 -46 1 -29 163 109 -62 220
4201 220 -116 -117 141 40 -143 38 12 -192 -72 225 -88 12 76 -10 -23 102 -71 64 67 214 -8 5 29
4224 29 -100 -105 -205 -50 -140 -111 -146 148 -222 -132 -30 -29 48 63 71 133 40 -69 -89 102 73 42 -7 -94 -33 118 -63
$$ packed form
4051D1m7pO6q8o1Q6K56j82l12M00j43j9M5j20R7q4p5J18J52L6k14K51j07k00J66
4076E5o1J23j07P8p1J20O8j75k27K63K4l7m9J1J27j71j73J22m7J23l1m4K25q1
4100F5K15l28Q8Kk30J34J98j56J49j02J5j38J3K97j98N3N1KJN0O8k20n2J9k5l8
4126f7J16k0q4P5J4k24J71Q6m6JJ4L4j13R1J65k49P7j38m7L53k84j50K38j40K02
4151G5R6j22Rn1M3K18j31lL7j30PJ02k15J78j33K5p6q0J13Q4J55k23k2PL28k61
4177C0j16LJ52j15K33k14l5l5J08N8j12j62L91j07j95J79l2p7M7l0J92n4j71K82
4201B20l36jK58j01j83J81k6k04J20K97l13J00O4q6j3J25j73J35LJ47k22J3K4
4224B9j29nj00J55r0K9l5K94l70R0J02JP7J5QO2r3j09k0J91k9l1m9q7O1J51j81
$$ plain form
4251 -63 92 -62 18 -40 31 27 -66 35 147 115 -20 277 -57 -24 12 -38 -151 12 -49 -57 50 0 -25 130 -138
4276 -138 24 -37 59 239 22 -71 -20 54 121 122 110 -125 -33 -175 -63 -169 65 -7 0 172 -49 41 -14 -17 -11 -12 41
4303 41 44 -111 -80 -78 -86 -210 162 -123 34 67 -83 86 -16 -1 88 133 251 -111 -52 125 -102 -142 -103 6 -121
4328 -121 -66 -68 -46 -120 209 81 43 124 -49 -95 -26 -189 -37 54 -20 -99 -2 124 -185 -77 -8 -65 197 -225 -30
4353 -30 -38 85 81 30 118 32 227 -6 -213 -134 -166 237 -8 -128 -113 -179 -50 138 118 58 104 169 156 -73 98 65
4379 65 222 142 22 -152 -49 113 -37 -64 -16 -243 15 -20 118 -70 64 64 -200 -70 -35 216 23 182 28
4402 28 -125 -131 -105 7 6 43 -37 138 17 -55 -99 64 -76 -49 -22 -43 168 -96 84 4 -17 -2 -39 -95 -152 28
4428 28 -23 -18 -24 68 -14 -198 -25 108 119 254 42 163 -109 49 205 -134 10 -74 -61 -76 -169 52 36 111 29
$$ packed form
4251f3J55j54Q0n8P1mr3J01J12l2j35K97l34L3L6n0j13J63o1qJ07n0k5J55k68
4276a38J62o1R6J80k17r3N1P4O7Jj2k35R2j42J12j06K34p2PJ72k21R0n5lOjN3
4303D1Lj55L1Kqj24L72k85J57L3j50J69j02J5Q9M5J18l62N9J77k27m0L9J09j27
4328a21N5kK2p4L29j28l8Q1j73m6O9j63J52R1p4p9R7J26l09J08O9n7K62m22J95
4353c0qJ23mn1Q8q6J95k33k07P9l2M03k45j20J5o6J29J88k0o0M6O5j3k29J71l3
4379F5J57q0j20j74J03J62j50k7M8k27K58l5J38j88J34%k64J30L5K51j93J59j54
4402B8j53oK6J12jL7q0J75j21p2m4J63j40K7K7k1K11k64J80q0k1J5l7n6n7J80
4428B8n1NoR2q2j84J73J33J1J35k12J21k72J58J56l39J44q4J3j5r3K21j6P5q2
$$ plain form
4453 29 16 114 156 64 -22 -75 -13 36 -100 -47 68 -89 -108 14 68 199 -126 -175 -14 -180 86 137 -61 95 25
4478 25 212 121 -308 43 -184 62 -97 -90 90 86 -136 -99 93 -37 11 227 69 222 -15 -8 -9 -23 -31 68 -200
4503 -200 -131 23 108 98 69 22 -202 -17 -7 73 58 172 28 -74 -48 45 17 67 137 -143 -10 -106 -105 -132 -398 2
4529 2 1 -115 66 -119 55 -43 20 -59 11 184 51 19 39 33 -41 -27 101 -14 -64 40 34 -164 106 11 -66 -76 -170
4556 -170 2 74 -2 121 -84 3 128 -48 -109 -105 -30 81 -213 -181 -49 102 150 184 199 84 160 88 6 -20 149
4581 149 -47 152 71 -43 115 74 100 -123 -41 -54 97 -74 85 -104 -73 -147 114 -163 4 99 -128 -65 -57 109
4605 109 -57 13 -135 68 -78 -36 189 142 44 1 113 91 -136 63 284 -95 31 -233 -9 67 -168 -17
4627 -17 -78 -3 119 -31 29 169 61 -117 -53 -118 92 56 -140 -232 58 -171 135 -185 216 -72 37 36 39 -63
$$ packed form
4453B9j3R8M2r2q6n3O2M9j36N3J15j57j9J22N4J31l25m9J61j66K66N1j98J56p0
4478B5J87r1m29L51k27K46j59PJ80mk22L7J92j30M8K16j58J53k37Pjj4qR9k68
4503b00O9J54Q5j0k9m7k24J85J0Q0j5J14j44j02K6R3k8N0P0k80J33r6Jk7k66M00
4529Bjj16J81j85J74r8O3p9P0J73j33l2K0op4J4J28j15n0J04oj98K70r5p7j0r4
4556a70J72P2p6J23k05Q7J25j76o1MP5J11k94L2J32J51M8L4J5j15P6p2q2k6J69
4581A49j96J99q1j14J58m1K6k23Q2j3J51j71J59j89L1p4K61k77J67R5k27O3QJ66
4605A09j66P0j48K03j46M2K25m7r8m3J12k2k27J99K21l79J26k64K24P6k35J51
4627a7o1P5J22j50O0J40j08j78O4o5K10l6j96r2K90k29L06l20M01k88J09jLj02
$$ plain form
4651 -63 -25 97 65 33 -27 188 -66 64 60 72 103 -106 -22 56 -76 140 -18 178 -41 -56 26 240 -14 -78 -187
4676 -187 -145 -201 -5 -3 -103 72 -80 97 -194 -114 -209 -59 -11 26 102 116 46 60 8 89 50 104 22 -18 78 -59
4702 -59 -76 -160 93 35 7 69 -19 94 6 -68 -53 -23 -21 106 76 122 137 -22 -207 139 24 70 88 177 -6 -76 -93
4729 -93 -62 57 1 68 -62 -38 -23 16 -57 8 97 -63 -187 -345 73 -147 -99 -17 172 36 -66 145 -173 50
4753 50 -101 -94 12 -59 54 205 -170 -277 218 -39 -38 -200 -194 49 -56 60 -118 155 103 71 -74 21 71 78 72
4778 72 67 27 -121 -44 -41 208 73 -201 31 -12 -106 150 115 9 19 -67 102 59 -46 56 -89 -1 78 -167 64
4803 64 34 -22 -48 -13 -15 -3 -17 -8 242 39 -65 -35 -270 -80 -36 21 27 6 -204 62 -215 106 87 184 -64 -26 86
4830 86 69 -125 -19 189 188 125 61 136 25 -159 -56 8 -36 51 -30 146 115 189 -175 -37 24 180 -148 -52 -20
$$ packed form
4651f3L8J22l2l2o0K15k54J30mJ2L1k09Q4P8j32K16j58J96k19j5Q2K14k54o4j09
4676a87M2n6J96Kj00J75j52J77k91Q0r5J50M8L7P6J4p0J4n2Q1l9N4q2m0R6j37
4702e9j7q4K53n8k8O2q8J13q8p4J5L0KJ27l0M6J5j59j85L46j15M6J8Q9j83p0j7
4729i3L1J19n6O7j30K4J5L9p3O5Q9j60j24j58M18k20M8Q2J89j36j02K11l18K23
4753E0j51PJ06p1J13J51l75j07M95k57Jj62OK43j05J16j78K73n2l2j45R5N0Po
4778G2nm0j48P7LK49j35k74K32m3r4K56l5j06J0q6J69m3j05J02j45Q8P9k45K31
4803F4l0n6k6L5kJ2j4RK50k03j04L0k35J90M4N7Ok1k10K66k77L21j9R7k48L8J12
4830H6j7j94J06K08jo3o4P5j11j84J03O4m4Q7q1J76l1P4l64J38O1J56l28R6L2
$$ plain form
4855 -20 -33 -29 -156 -86 -64 -154 -12 32 -42 190 -48 49 288 88 34 -23 -31 107 -168 68 2 -88 19 -162 -72 -180
4881 -180 -83 76 -121 -15 32 51 155 96 205 224 169 -178 3 -79 49 48 54 -22 295 -174 -127 16 -100 4
4905 4 56 -11 -72 -27 112 5 -34 124 129 -33 194 20 -5 -148 -254 64 17 -152 2 -161 -34 -83 -31 61 120
4930 120 32 -116 62 229 -1 -51 115 28 -150 -261 -23 45 -139 -126 62 -108 -1 -137 -40 -51 -6 146 92
4953 92 -38 86 41 -5 35 -93 -202 105 218 -133 18 -154 45 -105 -93 9 -26 -73 -23 79 -314 -116 -169
4976 -169 50 59 329 -28 8 44 -115 -195 -101 -28 -23 117 -106 42 -106 45 -13 55 -87 -36 -49 98 -31 59 -21
5001 -21 46 -96 -13 52 46 -113 -118 273 232 12 10 -24 103 2 -160 75 -98 -76 -253 -250 -189 -28 -293 -70 83
5026 83 51 12 115 28 -20 -97 30 137 57 -166 7 147 106 20 32 -88 94 74 117 3 17 71 110 -80 197
$$ packed form
4855b0j3Mj27P0K2r0J42M4p4K32k38R7K39k00n4n7qJ38k75K36o6r0J07j81R0j08
4881a80R7J59j97J06M7J9J04n9J09J9n5l47J81q2J28jOp6L17m69M7J43j16J04
4905DN2o7o1M5J39j07l9J58Nj62K27j74k5j43j06L18m7j69J54j63J27m9N2R2N9
4930A20q8j48J78J67k30n0J66q7j78j11K38O8j84J3J88j70J07j36R7j1M5J52n4
4953I2j30J24m5m6M0j28j09L07J13l51J51j72J99j50J2J02l5m7N0J02l93J98n3
4976a69K19RK70l57L6L6j59q0R4P3NJ40k23J48j48J51n8O8j42N1j3J47j29R0q0
5001b1O7j42Q3O5oj59nL91m1k20kl4J27j01j62K35j73K2j77LO1J61k65K23J53
5026H3l2l9J03q7m8p7J27J07q0k23J73J40m1q6J2j20J82k0M3j14J4N4L9j90K77
$$ plain form
5051 197 4 81 30 47 104 -136 -8 -217 123 8 79 -106 -205 139 119 167 20 -111 292 50 93 -109 -25
5074 -25 -99 -30 -88 -38 -31 -136 -137 -91 -102 -68 53 -74 140 59 65 59 14 -47 78 60 83 117 -12 -51 -162 107 95 -69
5102 -69 139 10 -54 -120 -74 239 92 131 162 235 29 -8 -26 -61 141 110 154 -100 31 -109 10 -16 33 31 206
5127 206 28 -20 -19 145 -62 68 -36 26 -43 -8 -202 -192 108 -203 -3 138 61 -4 -107 57 -17 -50 28 -96
5151 -96 -20 -81 -26 162 114 -290 -40 83 93 -142 -238 -52 -206 -85 203 -44 144 37 1 -58 39 -62 66
5174 66 139 -15 -147 69 0 -95 138 -20 -149 63 38 21 -71 -132 86 -40 -48 -40 -25 121 -155 160 -144 -81 -92
5199 -92 -114 101 -64 -100 206 154 -1 90 123 66 61 -88 149 61 78 121 62 103 -173 -79 -111 -366 113 -35 -74 79
5225 79 143 28 -23 24 -19 43 118 101 28 2 -21 -137 110 -204 6 95 -91 -231 234 -108 127 -22 -70 -11 45
$$ packed form
5051A97j93P7n1J7N7k40J28k09L40j15P1j85r9L44k0M8j47j31M03k42M3k02Q4
5074b5p4O9n8N0Pj05jM6j1L4J21j27K14q1Oom5o1J25j8K3L4j29l9j11K69j2j64
5102f9K08j29o4o6M6L13j47L9L1P3k06l7j8l5K02l1M4k54J31j40J19k6M9kJ75
5127B06j78m8JJ64k07J30j04O2o9L5j94J0L00l11K00J41p7o5j03J64p4l3P8j24
5151i6P6o1N5J88m8m04K50J23J0k35r6J86j54J21K88k47J88j07l6n9R7j01J28
5174F6P3j54j32K16o9r5K33j58j29K12k5j7r2o1K18j26qQJ5J46k76L15l04O3j1
5199i2k2K15j65l6L06n2j55R1L3n7nj49K37q8J7M3n9M1k76R4l2k55M79j48l9J53
5225G9O4j15n1M7m3O2P5j7p3k6k3j16K47l14K10Q9j86j40M65l42K35j49m8N9N6
$$ plain form
5250 45 82 56 124 -54 -15 157 -6 -20 -121 112 -87 148 -4 -168 -36 22 -71 35 162 150 -55 40 -51 8
5274 8 -119 -49 -194 60 -50 -184 -103 16 37 -197 -66 83 37 145 197 -126 -23 106 164 16 87 146 47 55
5298 55 61 -55 -141 -176 57 -90 98 -148 -49 182 -64 36 -93 98 10 68 -36 -51 -96 -90 -18 67 57 47 -92
5323 -92 8 102 -59 -95 -179 -8 -56 -50 -106 116 81 314 60 58 16 -131 -31 -22 134 -25 -117 75 166 -122 -19
5348 -19 -51 -60 -96 -299 113 -125 -174 -89 204 -17 0 -54 -35 22 147 -49 -51 -12 -30 120 -13 -159 8 131 66
5373 66 -120 238 -137 -120 152 -85 -25 35 96 -183 171 -54 228 90 -40 101 63 -141 70 125 -59 -171
5395 -171 82 69 -145 27 -158 70 32 102 14 -134 -86 78 -74 7 73 34 -144 62 286 -10 -89 -100 -37 77
5419 77 -109 -141 -80 33 -183 108 190 135 58 -14 -17 153 -129 -19 -76 -69 7 -28 1 -129 -70 158 -23 57 71 -128
$$ packed form
5250D5L7k6O8j78L9J72j63j4j01K33j99K35j52j64J32N8r3J06J27j2k05R5r1N9
5274Hj27P0j45K54j10j34Q1J19K1k34J31J49m6J08N2l23J03J29N8j48P1N9r9Q
5298E5Oj16q6l5K33j47J88k46R9K31k46J00j29J91q8N8j04j5m5OP2Q5j0j0j39
5323i2J00R4j61l6q4J71m8On6K22l5K33k54km2j47J00RJ56j59r2J92R1k88J03
5348a9l2rl6k03M12k38m9Q5K93k21J7n4J9N7J25j96kL9j8J50j33j46J67J23o5
5373F6j86L58l75J7K72k37O0O0O1k79L54k25K82j38j30J41l8k04K11N5j84j12
5395a71K53j3k14J72j85K28l8P0q8j48M8J64j52Q1O6l9j78K06K24k96p9j1O3J14
5419G7j86l2O1J13k16K91Q2n5p7p2lJ70k82J10n7PP6l5K9j30N9K28j81Q0J4j99
$$ plain form
5445 -128 43 3 -7 77 -52 -1 -83 -42 -6 -101 -74 -215 18 26 18 -32 134 -121 60 -13 134 -153 -19 47 136 147
5471 147 22 -130 -59 -100 -132 -59 24 187 173 -77 -126 1 237 -164 65 -62 -20 174 23 50 -67 19 -68 -136
5495 -136 -28 77 18 -76 87 -82 -63 -83 -164 92 63 -74 76 -150 -63 163 -104 2 -138 -202 -30 -9 -111
5518 -111 -44 67 -37 -97 -165 139 19 -103 45 62 -242 -118 -149 113 18 -333 -245 -130 -41 60 45 -180 40
5541 40 51 -6 -20 47 192 188 157 -26 28 -153 102 -55 -2 -26 -166 20 -94 -90 120 141 184 49 -20 130 16
5566 16 -46 -123 -120 -75 44 -37 -148 -187 -21 -18 13 140 33 39 -110 -99 97 7 -2 65 70 148 92 -14 -75 185 -45 12
5594 12 -77 -216 -62 40 -111 69 139 56 134 -2 152 -93 -130 112 247 -27 -177 70 134 40 -40 -102 -59 -108
5618 -108 -60 172 -8 -5 -56 -97 44 -76 -56 54 -149 -92 148 -71 -148 38 -62 36 19 -88 156 -98 48
$$ packed form
5445a28J71m0j0Q4j29N1q2M1L6r5K7j41K33Qqn0J66k55J81p3J47k87J34O6Q9J1
5471A47j25j52P1m1l2P3Q3J63j4k50m9J27K36m01K29j27M2J94j51K7j17Q6q7o8
5495a36J08J05n9r4J63j69J9k0q1K56k9j37J50k26Q7K26k67J06j40o4J72K1j02
5518a11O7J11j04o0o8L04j20j22J48J7l04J24l1K62r5l51Q8J15Q9J01j5k25K20
5541D0J1n7j4O7J45ml1j83N4j81K55j57N3k4j40J86j14MK10K1M3j35o9J50j14
5566A6o2p7LM5J19q1j11l9J66LL1J27j07Oj49J1J96r0rO7NP8n6j06o1K60k30N7
5594A2q9j39J54J02j51J80P0q3P8j36J54k45l7K42J35k74j50K47O4r4q0o2M3m9
5618a08M8K32j80Ln1m1J41j20K0J10k03N7K40k19p7J86j00R8j7j07K44k54J46
$$ plain form
5641 48 -92 -51 60 -30 49 -198 163 36 -138 -26 36 83 48 -20 -71 46 67 -270 183 118 103 50 15 -41 22
5666 22 66 20 -19 -156 -119 -151 -55 -142 -19 121 120 -69 47 -9 40 172 -49 -15 114 63 -10 62 -67 84 -209
5691 -209 -58 178 78 -52 150 -209 -88 -23 23 190 157 105 21 -7 -32 74 56 -2 15 122 69 68 -167 199
5715 199 -273 -67 -121 -62 94 -67 79 29 -11 44 -118 29 38 -63 -76 152 4 67 96 2 -269 -138 -123 -57
5739 -57 -3 141 68 41 -54 10 55 -107 -168 102 45 -83 124 -204 46 -38 52 -16 -147 161 -45 -72 197 9
5763 9 -9 -2 1 -121 102 -383 285 -167 -202 -274 10 131 19 93 233 194 138 -46 111 215 -14 -112 -19 242 -12
5788 -12 32 -41 -184 37 -194 -82 37 -223 -27 68 28 39 -135 43 154 -163 -78 16 43 -123 -117 186 -66 -20
5812 -20 -37 -71 66 -111 -11 270 64 -130 -58 -48 63 129 -141 -80 -131 10 -131 29 172 -66 173 -2 -147
$$ packed form
5641D8j40M1J11r0P9k47L61j27j74J12O2M7l5o8n1J17K1l37M53o5j5n3l5n6O3
5666B2M4m6l9j37L7l2R6q7J23J40jj89J16n6M9J32k21L4J29n1p3P2j29J51k93
5691b09J51K36j00j30K02l59J21O5M6J67l3n2q4k8k5J06j8n8J7J07n3jk35L66
5715A99m72K06n4N9J56j61J46n0m0N5j62J47Rj01j3K28j48O3K9r4k71J31J5O6
5739e7N4J44p3k7r5O4M5j62o1K70n7j28K07l28K50q4R0o8j31L08k06k7K69j88
5763Ij8PLj22K23m85O68m52l5p2K84J21j12P4J40l9n6j84J57J04k29r8R3K61k54
5788a2M4p3j43K21k31J12J19k60J96R5m0J1j74J78J11l17Q5R4K7j66OL03k52M6
5812b0j7l4J37j77J00K81k06j94P2J0J11O6k70O1n1J41j41J60J43k38K39j75j45
$$ plain form
5835 -147 -161 96 183 62 22 -90 -97 -8 287 136 -43 -98 -50 12 -90 74 150 -51 124 -220 -92 -80 -7 11
5859 11 164 105 115 -26 123 -6 -60 -32 60 -60 -10 -229 -251 59 -80 60 -155 48 -3 132 153 -49 -126 -43
5883 -43 -28 -86 4 -28 -110 192 -73 -15 -72 -172 -29 -19 105 81 116 280 -21 -154 24 11 -32 -54 26 -4 -79 -15
5909 -15 -65 -161 -105 -121 -96 31 -51 158 286 -25 36 -130 153 -23 36 -36 72 -86 -49 -102 -17 -104 -36 37 58 -86
5935 -86 -10 152 -98 -225 -70 203 77 -254 -163 -52 165 -39 43 -188 21 -218 -142 125 109 -10 -83 61
5957 61 -11 14 -106 113 44 68 -37 33 137 -40 -77 51 -118 -110 -5 -89 -140 -62 -149 53 -27 -165 174 5 117
5982 117 113 -54 -4 40 111 17 -205 -28 -82 95 27 -132 -1 45 -49 22 -89 -30 172 175 -80 -59 -94 -152 35 11
6008 11 -1 -48 28 87 161 -16 -150 29 141 81 -135 -38 -4 -169 67 82 50 25 -137 -4 0 -256 -46 37 -51
$$ packed form
5835a47j4K57Q7j21m0j12pQ9K95j51j79n5M8O2j02J64P6k01J75l44J28J2P3J8
5859A1J53n9J0j41J49j29n4K8R2j20N0k19k2L10j39J40k15K03n1J35K1k02p7Q3
5883d3J5n8R0l2q2L02k65N8n7j00J43J0J24k4L5J64l01j33J78j3m3k2Q0l0p5O4
5909a5n0r6N6j6K5J27q2K09J28l11O1j66K83j76N9p2J08j58L7n3Q5q7O8P3K1j44
5935h6P6J62k50j27J55K73j26l31R1J11K17k04Q2k31K09k39P6K67j6j19p3J44
5957F1p2K5j20K19o9K4j05P0J04j77l7J28j69QJ05q4n1P8q7K02q0j38L39j69J12
5982A17mj67N0M4P1r4k22J77n4J77o8j59J31M6r4P1j11N9K02Lk55K1l5n8J87k4
6008A1j2m7P6N9P4j77j34J79J12o0k16R7L4j65K36J5l2k5j62J33Mk56K10Q3q8
$$ plain form
6033 -51 74 108 24 117 -108 -36 -125 158 111 -2 -29 -226 -155 119 24 -31 -22 -83 34 95 51 35 1 37 -28 -14 72
6060 72 -53 -76 0 61 166 -188 -94 -219 -384 113 -282 -22 -92 149 -16 143 13 160 98 -19 93 1 -81
6083 -81 75 -81 -38 -92 11 98 39 47 -89 42 1 -140 84 90 136 141 105 -104 -21 -70 1 -3 32 98 51 -128 -107 -4
6111 -4 66 -129 131 143 -119 19 -118 8 40 83 83 67 -98 -6 -99 41 21 -43 -149 191 -91 -91 -36 -7 59 200
6137 200 142 -19 -14 11 -25 59 -135 48 -153 50 21 27 -5 -163 217 -33 32 -13 162 86 189 35 -157 -91 -12
6162 -12 51 36 119 -109 152 -53 42 15 35 2 24 205 82 -65 -14 -44 -140 105 143 31 79 -185 -45 5 167
6187 167 114 -137 -257 -145 -151 -142 149 -36 -25 -22 -67 -183 183 -59 33 -228 -62 226 -5 32 87 37 -47 -43 115
6212 115 -130 58 -19 -51 92 -50 69 -35 -101 -145 83 92 -138 -42 76 -202 -101 -11 -142 71 -53 -70 -11
$$ packed form
6033e1J25L4q4R3k25P2q9K83m7j13k7j97P1K74r5n5Ro1J17O1m4j6l4L6o5J4Q6
6060G2j25k3P6O1J05l54R4j25j65M97l95K60p0K41j65J59j30J47o2j17J12r2q2
6083h1J56j56M3n4J03Q7n9Qj36J31m1j41K24OM6Nl6k09Q3m9P1mL5O6m7j79K1J03
6111dP0j95K60J2k62J38j37J26L2M3%j6j65R2r3J40k0o4j06L40k82%N5K9O6J41
6137B00n8j61NK5l6Q4j94J83k01K03k9Ol2j58L80k50O5m5J75p6J03j54j92O6P9
6162a2O3j5Q3k28K61k05R5k7K0l3K2J81j23j47N1l0r6K45L8j12M8k64J40N0J62
6187A67n3k51j20J12oRK91j85J1Lm5j16L66k42R2k61J66K88k31L7N5n0q4MJ58
6212A15k45J88p7l2J43j42J19j04o6m4K28Rk30R6J18k78J01R0j31K13j24j7N9
$$ plain form
6235 -11 -138 -256 -39 57 58 44 -61 -118 -103 -140 -177 -129 -174 -165 -124 153 -140 -31 46 22 91 -163 184 -22 136 35
6261 35 119 -93 176 1 -92 -86 -93 45 201 -206 51 58 22 29 -44 -193 -116 -156 40 43 -37 -9 -114 80 120 -88 -77
6288 -77 -139 37 -14 83 -22 179 206 23 138 88 102 37 -107 -149 109 -148 -107 85 -18 104 -192 41 -101
6311 -101 91 69 146 199 -157 163 -4 3 144 0 -189 108 -17 -110 -21 -78 158 -118 61 -171 155 119 -18
6334 -18 72 56 83 -56 -82 -14 -39 -6 -32 98 -1 -234 73 86 15 -81 74 42 -312 13 -40 -116 46 96 -32 -144
6360 -144 52 -84 -179 17 -168 -142 -77 142 -47 13 79 221 93 143 -130 -83 -78 -42 -112 60 139 10 -178 -79
6384 -79 -177 -10 137 -6 -168 107 236 5 36 -9 -9 -4 -78 6 106 -2 34 182 -36 -45 -212 -202 -96 -123 -110
6409 -110 240 -59 166 -194 72 129 -14 181 236 26 -36 -96 94 42 -29 16 21 199 -16 -45 23 188 318 19
$$ packed form
6235a1j27j18K17R6Jj4j05n7J5l7l7M8m5RM1K77k93J09P7k4O9k54L47k06J58j01
6261C5Q4k12K69j75r3OpJ38J56m07K57Pl6Pp3j49P7m0J96Lq0K8j05J94M0k08J1
6288g7o2J76n1R7j05K01K7j83J15n0J4o5j44m2K58k57M1J92j03J22k96K33j42
6311a01J92k2P7N3l56L20j67PJ41j44j89K97j25r3Q9n7K36k76J79k32L26l6j37
6334a8R0j6K7j39k6O8k5L3k6J30r9k33L07J3p1r6J55l2l54L25n3p6J62N0j28j12
6360a44J96j36r5J96j85K6O5K19j89O0O6J42j28N0k73M7NL6p0J72P9j29j88R9
6384g9r8J67J47j43j62K75J29k31L1m5%Np4Q4J00j08L6J48k18rj67J0J06k7J3
6409a10L50k99K25l60K66N7j43J95N5k10o2o0J90n2p1M5NJ78k15k9O8J65J30k99
$$ plain form
6433 19 81 -64 19 191 -172 96 -178 147 -92 -108 28 85 11 -20 -176 64 -108 53 -75 228 -16 -13 198
6456 198 174 70 119 36 -95 211 84 -18 89 115 -81 -77 -38 -26 -78 67 214 313 61 -12 208 150 -104 -40
6480 -40 91 -29 23 -216 -329 -135 -27 -152 -40 -157 -116 107 68 -61 -94 -34 61 3 -62 283 7 83 30 -22
6504 -22 17 -32 63 49 28 -134 -81 -191 96 -44 100 -17 8 -34 -24 -46 -2 -95 122 -158 -131 -160 70 36 78 -7
6530 -7 197 -82 -212 26 -68 123 61 -45 32 -24 30 -127 -120 -32 82 174 12 156 52 3 -54 244 38 156
6554 156 -54 99 152 -107 -68 -88 -74 -30 108 -28 16 -49 -35 137 21 171 -34 -78 -64 -23 -97 -99 118 -42 -152
6579 -152 -115 -194 4 -145 -76 94 -64 62 36 128 -89 -17 141 78 -2 4 132 -58 -20 38 -85 182 -189 21
6603 21 -64 -121 168 82 41 87 -84 155 176 123 -62 -116 94 26 -28 -167 -101 2 -177 -28 -38 131 162 276 61
$$ packed form
6433A9O2j45Q3J72l63K68k74L25k39j6J36N7p4l1j56K40j72J61j28L03k44LK11
6456A98k4j04M9q3j31L06j27j02J07K6j96ML9J2n2J45J47R9k52p3K20n8k54O4
6480d0J31j20N2k39j13J94J08j25J12j17M1K23l9j29l3O0R5n8o5L45k76P6n3n2
6504b2L9m9R5j4k1j62N3j10K87j40J44j17K5m2J0k2M4r3K17k80K7k9K30l4M2q5
6530gK04k79j30K38r4J91o2j06P7n6N4j57PQ8J14R2j62J44j04m9n7K98k06J18
6554A56k10J53N3k59L9k0J4M4J38j36M4o5J4J72j16J50k05m4J4M1p4kK17j60j10
6579a52L7p9J98j49O9J70j58J26k6R2k17P2J58o3q0OJ28j90L8N8j23K67l71K10
6603B1q5n7K89q6m1M6j71K39K1n3j85n4K10o8n4j39O6J03j79J49j0J69L1J14k15
$$ plain form
6628 61 -2 75 67 38 75 72 -114 -169 71 213 -181 -48 -48 -123 52 167 -58 -36 -152 97 -59 129 -132 -143 11
6653 11 150 125 -55 192 38 -30 -65 32 111 81 -22 -108 91 87 -5 23 13 -51 184 104 11 83 127 -30 -165 151
6679 151 9 80 129 76 -64 -74 176 148 11 -87 -33 -83 -127 -49 267 68 -177 23 4 61 -48 62 23 110 65
6704 65 45 8 -86 -28 92 -146 -12 13 50 4 -49 -57 -166 -38 81 -116 1 -135 -12 -69 79 25 -19 -87 13
6729 13 14 134 -48 -7 193 13 41 103 170 -13 -59 -85 97 75 -20 87 -85 62 129 -85 -66 252 132 -30
6753 -30 -227 67 -75 -1 -114 -93 -41 110 162 54 -62 163 51 86 45 -75 55 158 -42 96 -214 -21
6775 -21 4 -297 -229 57 -111 63 -40 58 -99 -205 -81 -66 -215 -34 -22 -28 75 14 102 -3 127 -201 -88
6798 -88 -83 0 40 39 120 24 111 211 178 7 56 109 76 67 -86 -212 -188 -180 -123 -48 -149 -38 -114 43 -178 -42 -88 -113
$$ packed form
6628F1o3P7qk9L7lj86n5K40J42l94J33%p5J75J15k25K2j16K49j56J88k61j1J54
6653A1J39k5j80K47j54o8l5R7P9l0j03q6J99mr2K8j0o4K35q0r3P2M4j57j35L16
6679A51j42P1M9n3j40j0K50k8j37r8N4n0m4P8L16j99k45K00j9N7j09J10l9Q7m5
6704F5k0l7r4N8J20k38J34K5L7m6n3qj09J28J19j97J17j36J23n7J48n4m4o8J00
6729A3JJ20j82M1K00j80K8O2O7j83m6k6J82k2r5J07j72J47O7k14J9L18j20j62
6753c0j97K94j42P4j13K1N2J51N2j08j16K25j12L5m1j20J30J03k00J38l10J93
6775b1K5l01O8K86j68J74j03R8j57j06J24J5j49J81J2oJ03o1Q8j05J30l28J13
6798h8NQ3M0jQ1r6Q7J00l3j71M9N3l3rj53j26K4QN7P5j01J11p6J57k21J36m6k5
$$ plain form
6826 -113 -6 -43 -93 156 184 -21 74 -84 -267 78 -43 -8 29 -37 -170 158 159 14 -15 65 109 100 290 -9 -48
6851 -48 135 -72 -51 -99 41 141 37 101 -91 -55 56 -1 -6 -104 -199 -146 46 -7 61 106 -170 -100 190 35 143
6876 143 -56 42 64 -110 71 -209 9 207 -153 19 0 64 104 35 -2 74 212 117 -8 -71 50 -56 -203
6899 -203 -8 -2 1 -165 108 -184 174 -95 156 11 106 275 -103 -100 -105 -177 3 -179 127 -16 159 107 -37 48
6923 48 -182 107 90 136 29 127 105 -69 -201 -180 -174 96 157 176 19 67 85 -18 -100 -124 -72 95 -16 86 12
6948 12 36 111 72 -50 62 14 35 243 -80 133 65 -52 112 -122 -72 63 78 -58 102 -139 -28 -183 -34
6971 -34 55 93 56 -190 -14 -26 93 31 -42 5 80 -185 30 69 -69 -14 50 28 26 -185 -30 169 -134 -159 -91 0
6997 0 63 191 -175 -14 13 -4 -51 118 19 -27 60 69 60 38 -187 126 14 102 -22 140 57 51 109 -69 101 -23
$$ packed form
6826a13J07l7n0K49K8k05R5j58j83L45j21L5L7o6j33L28Jj45k9Q0M4rJ90k99l9
6851d8J83k07K1m8J40J00j04O4j92L6J11n7nr8r5N3J92n3O8M5k76P0K90j55J08
6876A43j99R8K2j74J81k80K18J98l60J72j9O4M0o9l7P6J38r5j25o3J21j06j47
6899b03J95OLj66K73k92L58k69K51j45R5J69l78Lnp2J80j82L06j43J75n2j44Q5
6923D8k30K89j7M6j07R8k2j74j32K1OK70O1J9j57M8J8j03q2k4N2J67j11J02p4
6948A2K4P5l9j22J12m8K1K08l23K13o8j17J64k34N0J35J5j36J60k41J11j55J49
6971c4Q9L8l7k46J76j2J19o2p3M7P5k65K15L9j38N5O4k2kk11J55J99l03k5O8R1
6997@O3J28l66J61K7j7m7J69r9m6Q7Rrk2k25L13j12Q8j24J62q3oN8j78J70j24
$$ plain form
7023 -23 -11 50 -109 122 85 75 -177 -119 -71 205 66 -28 -56 185 75 -40 147 -3 186 -32 179 -17 124
7046 124 -85 51 55 -137 -118 -4 -95 -40 -67 16 119 106 -154 -113 -7 80 102 14 113 46 19 -38 -86 -77 95 -362
7072 -362 -98 -4 -49 43 197 -46 142 105 237 126 98 31 -44 35 -114 18 170 130 -251 45 -18 136 -23
7095 -23 -227 -55 -12 131 -99 98 109 187 33 77 38 -220 -208 37 36 -22 -112 -25 -137 24 17 -193 118 -12 54
7120 54 43 -72 -44 -22 129 1 104 -73 30 199 24 -2 59 -9 28 -84 56 -14 -131 -52 -105 69 17 -96
7144 -96 155 -88 35 -55 147 -127 42 -111 -124 -163 26 209 -114 -97 86 30 -154 -15 102 -93 51 8
7166 8 36 -13 -75 155 48 -70 40 -115 -182 -60 -27 -120 25 174 21 126 -61 -72 131 147 72 -11 88 -24
7190 -24 49 -93 86 -13 104 -100 -16 -64 -5 -8 -1 105 -159 -28 -16 -231 150 -103 -139 -40 -33 -37 157 -54 -17 -210
$$ packed form
7023b3J2O1j59K31l7j0k52N8M8K76j39r4k8K41j10j15J87j50J89k18K11j96J41
7046A24k09J36Mj92J9J14r1N5k7Q3J03j3k60M1J06Q7K2q8R9o7k7n7m8RJ72m57
7072c62K64R4m5R2J54k43J88l7J32j11k8o7p5P9j49J32J52m0l81K96o3J54j59
7095b3k04J72M3J43k30J97J1P8j54M4l9k58J2K45jn8r0Q7j12J61pk10L11j30O6
7120E4j1j15K8K2J51j28J03j77J03J69j75k6O1o8L7j12J40p0j17P9n3J74n2j13
7144i6K51k43J23r0K02k74J69j53j3l9J89J83l23J7J83n6j84J39J17j95J44m3
7166HK8m9o2K30j07j18J10j55o7J22L3r3J45J49j53J05j87j1K03J6p5q3R9j12
7190b4P3j42J79r9J17k04Q4m8N9lPJ06k64J31J2k15L81k53l6R9PmJ94k11L7j93
$$ plain form
7216 -210 -17 -77 63 37 -46 142 17 234 -32 -17 64 -221 54 -91 27 -127 100 41 -180 -256 -178 -57 -186
7239 -186 56 -18 101 19 199 64 -16 -62 119 36 25 -118 -52 -59 -143 -101 181 -17 -106 315 51 -86 37 64
7263 64 22 212 -67 33 66 -74 -3 -46 -29 103 62 22 66 45 48 66 -6 15 19 131 203 -9 107 -109 -183 -50
7289 -50 89 -2 -5 -83 5 -13 -71 12 108 159 91 -140 117 -13 -80 8 96 82 -38 141 -198 37 -275 16 -8 -83
7315 -83 -94 -13 41 -2 -141 -84 -51 -24 88 194 -41 56 -7 -166 36 -76 -75 205 -48 -41 72 78 95 -214 -96 141
7341 141 -72 -86 186 -81 6 205 -84 -175 185 -38 150 -61 60 61 -22 1 8 -139 24 -111 67 34 28 139
7365 139 60 -39 -56 31 202 41 57 -70 -249 43 217 163 198 155 120 -35 -124 37 35 101 -56 137 -132 -54 -12
7390 -12 167 326 -98 165 -48 139 -19 -25 27 101 -216 -130 194 -153 78 32 5 -6 -84 -98 188 111 66 -9 -73
$$ packed form
7216b10J93o0J40k6q3J88j25K17k66J5Q1k85K75j45J18j54K27n9k21p6P8J21j29
7239a86K42p4J19q2J80j35q0m6J81q3j1j43O6pq4M2K82j98q9M21k64j37J23K7
7263F4m2J90k79J00L3j40P1m3J7J32m1m0M4k1LJ8p2K1MJ12P2k12J16k16p4J33
7289e0J39r1lp8Q8j8n8Q3R6N1o8k31K57j30o7Q8Q8j4j20J79l39K35l12K91k4p5
7315h3j1Q1N4m3j39N7L3K7J12J06k35R7o3j59K02j12JK80k53PJ13OJ7l09J18K37
7341A41k13j4K72k67Q7J99k89r1L60k23J88k11J21Jq3K3Pj47J63j35J78l3oJ11
7365A39p9r9j7Q7J71j61J6j27j79K92J74n4L5m3l5j55q9J61kO6j57J93k69P8M2
7390a2J79J59m24K63k13J87j58oN2P4l17Q6L24l47K31m6k7j1p8j4K86p7m5p5o4
$$ plain form
7415 -73 64 -98 -142 112 -177 187 -55 78 -97 39 -68 112 85 -38 -124 -41 -5 52 112 154 45 -198 293
7438 293 54 -27 -82 158 135 31 46 238 -139 88 0 -200 -109 -53 -143 -27 44 22 163 126 240 62 -83 9
7462 9 241 -133 -25 114 -73 36 116 -101 138 23 -23 136 -24 -28 104 59 -68 -85 -70 45 75 103 -96 33
7486 33 -95 -166 -195 -47 36 -173 -37 152 -114 -28 -4 -70 90 163 111 -82 57 -18 53 -125 -25 88 -96 -68
7510 -68 152 198 94 -77 10 58 71 -43 202 29 199 185 -71 157 35 24 -52 -46 -171 -8 23 51 -191 110
7534 110 -302 -200 20 49 76 57 -66 -100 -19 -29 133 -89 -122 -119 17 -138 39 -133 123 -128 -184 -57 -8 -82
7558 -82 144 -109 185 -14 -88 119 2 35 154 115 -29 39 112 -110 27 211 -131 -25 101 -54 -115 49
7580 49 -115 -50 -58 64 -118 -1 -11 -147 90 -188 105 -3 23 -46 29 25 4 -46 -60 77 -188 -7 -105 -27 19
$$ packed form
7415g3J37j62m4K54k89L64k42J33j75J36j07J80k7j23q6Q3L6N7O0M2j09k43M91
7438B93k39q1n5K40k3j04J5J92l77K27q8k00R1N6r0J16P1k2J41l7J14j78j45R2
7462IK32l74J08J39j87J09Q0k17K39j15m6J59j60mJ32m5j27j7J5J15L0K8j99J29
7486C3j28p1k9J48Q3k09J36J89k66Q6K4o6J60P3n2j93J39p5P1j78J00J13j84K8
7510f8K20M6j04j71Q7M8J3j14K45j73J70j4k56K28j22j1p6Oj25J63L1K8k42L01
7534A10m12J02K20K9K7j9j23l4Q1j0J62k22l3LJ36j55J77j72K56k51n6J27M9p4
7558h2K26k53K94j99p4K07j17L3J19l9j44O8P3k22J37J84l42J06J26j55o1J64
7580D9j64O5qJ22j82J17j0j36K37k78K93j08K6o9P5mk1n0j4J37k65J81r8P8M6
$$ plain form
7605 19 97 -198 4 -91 -28 64 2 -56 -115 12 -37 -133 -227 114 51 57 -84 -171 -167 -73 -81 40 -79 53 -137 -10 79
7632 79 -62 71 58 -98 164 27 -4 127 -5 -125 -77 89 -71 -132 66 -17 -274 -89 89 -104 -168 60
7654 60 40 159 108 132 8 -77 12 -17 23 -44 -167 39 110 -123 32 69 79 -95 131 -73 -49 -6 -35 87 -44
7679 -44 153 -160 17 213 -72 -43 105 -71 12 -137 123 -97 -86 -122 -14 98 1 128 -34 -188 202 19
7701 19 -87 -90 44 -57 7 60 131 -139 -130 29 -29 -111 74 164 -55 28 -126 138 112 -84 68 86 28 124 98 61
7727 61 -106 -72 -24 70 64 155 22 106 3 -28 15 -40 -40 -57 19 -55 -63 99 -81 -12 106 56 -29 -129 186 135 156 -54
7755 -54 -23 208 78 -44 15 25 179 -82 -101 47 -34 123 24 121 -140 56 68 -30 31 -115 -121 180 -77 -69 -104
7780 -104 -137 -42 -35 150 -8 -197 118 37 -40 -38 10 -37 33 -165 -130 -103 -88 107 22 49 143 145 -114 -103 -120 -159 -43
$$ packed form
7605A9P8k95K02r5O3R2o2n8n9J27m9r6r4L41o3Oj41q7MR4qJ21j19J32j90J27Q9
7632G9j41J33j3j56K62j37l1J31j32j20M8J66j60o1J98q3k57J85J78j93o4K28
7654F0k0J19n1K4j24q5Q9k9M0o7j23K06P1k33J55L7J0j74K26k04K4M3k9J22j31
7679d4J97l13J77J96k85K9J48j76Q3j49K60k20J1l6J08J12r7J27j62j54L90j83
7701A9j06lJ34j01O4N3P1k70RJ59n8q2J85R0k19Q3j54K64k6j96J52J8n8R6k6l7
7727F1j67L4M8R4oR1j33Q4j03l1M3n5%j7P6p4qJ62j80O9J18n0q5j00L15n1K1k10
7755e4L1K31j30j22N9J0J54k61j9J48q1J57r9R7k61J96J2r8O1j46oL01k57Ql5
7780a04l3R5PJ85j58j89L15q1p7KM8m7P0j98L5K7J5J95q5K7R4Kk59J1j7l9J16
$$ plain form
7807 -43 179 -1 52 170 192 77 -185 93 148 39 67 101 -13 -148 -152 -15 -74 121 -25 -24 88 71 153 82 -30
7832 -30 -225 -57 -3 143 -96 -79 -81 -38 -90 99 12 -105 -26 109 -181 236 84 -31 100 83 -64 -212 -63
7855 -63 -58 80 192 31 -146 -133 -208 -93 4 -70 -186 80 140 222 57 -74 -251 79 71 4 -39 -100 -72 -32 -88 -60
7881 -60 61 -7 -38 -224 117 -231 -82 37 55 -90 145 -27 0 58 -180 -47 -6 25 -184 -186 -119 108 140 142 127
7906 127 108 58 7 0 64 33 -25 30 -58 112 67 227 101 34 -42 -174 -207 -90 -85 47 19 -151 1 1 218 -22
7932 -22 94 -81 -16 -1 109 -13 25 37 -46 71 -285 -47 56 118 -86 45 -211 -37 125 -112 31 105 36
7955 36 -193 -50 -28 97 240 50 -150 61 -125 5 -132 -79 56 55 48 -3 -171 88 48 -10 96 86 100 -37
7979 -37 -24 -92 174 -157 155 -71 154 -33 143 76 -126 81 32 239 -165 -10 -116 -197 -24 -65 26 74 44
$$ packed form
7807d3K22j80N3J18K2j15k62K78N5j09K8L4j14j35mJ37n9J95j46JJ12j7Q2p1j12
7832c0j95J68N4J46k39J7kM3n2J89q7j17P9J35k90M17j52j15J31j7j47j48J49
7855f3NJ38J12j61j77J3p5J15R7p4j16K66O0Q2j65j31j77L30qo7m3o1K8M0n6K8
7881f0J21o8l1j86L41l48J49J19J8j45K35j72K7N8k38J33M1L1k09kO7K27L2Kj5
7906A27j9n0n1pO4l1n8N5q8J70m5J60j26o7p6j32l3J17NJ32k8j70J52%K17k40
7932b2J16j75O5J5J10j22L8J2q3J17l56K38J03O2k04J31k56J74J62k37J43P4o9
7955C6k29J43K2J25J43j90k00K11j86J30j37N3J35jpn1j68K59m0n8J06j0J4j37
7979c7J3o8K66l31L12k26K25j87J76o7k02K07m9K07m04J55j06q1J73m1R1M8l0
$$ plain form
8002 44 208 -188 126 -66 -72 34 110 86 -93 106 -152 133 -66 -147 -146 174 -7 79 -64 36 -24 -12 104 -60
8026 -60 21 110 56 7 162 -43 -24 -8 -109 -78 12 -23 59 -134 18 -190 -141 -40 -49 188 123 -190 -88 -82 326 24
8052 24 -152 43 -33 180 -30 138 71 21 30 111 216 -207 -67 120 186 138 -3 -41 -171 212 176 47 132 63
8076 63 53 -107 -119 -101 -109 234 94 11 36 -19 113 207 -61 -6 -87 111 -2 62 98 -41 -13 203 23 -67 -23 91
8102 91 47 -47 148 -154 -63 97 78 71 212 97 139 76 -45 -152 -47 -52 4 -2 -160 -39 -36 76 -107 -57 66 173
8128 173 -37 -70 -77 -23 -51 -42 14 23 -27 107 -59 -77 157 164 -103 197 -35 -22 -94 -99 51 207 73 272 16 -70
8154 -70 -32 -42 -11 -68 -89 17 -88 -110 -5 -77 -46 26 -188 24 20 -49 -19 90 -156 36 88 -20 156 140 -126
8179 -126 71 -60 128 76 -37 -168 -34 -67 8 226 -83 28
$$ packed form
8002D4J64l96L14j92oJ06P6k4j79J99k58K85j99q1JL20j81Q6j43J00o0J2J16j64
8026f0Q1Q9n4m9J55k05J9J6j01L1R0l5Q2j93J52k08M9J01rK37o5l13J02OM08l02
8052B4j76J95p6K13k10J68o7n0RQ1J05m23J40J87O6m8j41l8j30L83l6j29Q5o9
8076F3j0j60j2J8qL43j40q3K5n5J32R4k68N5q1J98j13O4L6j39K8K16j80r0M4J14
8102I1m4r4J95l02R1J60j9pJ41j15M2o3j21j07J05nN6oj58J21LJ12j83N0J23J07
8128A73k10l3pN4k8RN6Rn0J34j66j8K34Pk67L00k32J3p2nJ50J56j34J99k56q6
8154g0L8j0L1n7k1J06j05k2J05p2L1P2k14K12mo9L0J09k46J92N2j08J76j6k66
8179a26J97j31J88n2j13j31J34l3P5K18l09J11
8191B8
$$ Imaginary data points
##PAGE= N=2
##DATA TABLE= (X++(I..I)), XYDATA
$$ plain form
0 0 0 0 0 0 0 0 0 0 0 0 0 0 0 0 0 0 6 -8 8 -8 8 -8 16 -16 16 -22 24 -25 32 -38 41 -48 56 -62 70 -78 89 -97
38 -97 111 -121 136 -151 168 -185 206 -227 250 -275 305 -336 370 -407 450 -495 548 -605 672 -749
58 -749 837 -942 1070 -1223 1419 -1672 2022 -2529 3344 -4865 8725 -43771 -55197 -2649 -6647
73 -6647 152 -6306 -3234 1869 12843 20995 23919 12592 12708 6276 50 4610 -1372 -16838 -12903
88 -12903 -13637 -18217 -15215 -10507 -5222 -3944 -5835 6830 12758 9022 13767 13051 6162 10024 6949
103 6949 589 619 -3888 -7784 -9390 -10663 -4846 -8440 -13813 -3470 818 -1581 6795 8079 4052
118 4052 6519 7587 9565 9358 2992 1321 -3358 -6977 190 -2684 -9810 -5045 -6114 -8328 -1419
133 -1419 1042 1458 1447 655 6481 7457 4563 8772 4401 -2446 1537 -630 -4347 -1128 -3983 -6632
$$ packed form
0@%%%%%%%%%%%%%%%%Oj4J6j6J6j6K4l2L2l8M6m9N7p0P9q9J04j18J32j48J67j86
38i7K08k32K57k87L19l53L91m33M77n25N80o41P06p77Q57r45J043j153J277j421
58g49J586j779K012k293K642l091L694m551N873q209J3590n2496j1426N2548l998
73f647O799o458L072N103J0974Q152K924j1327J16o432o226M560n982j5466L935
88a2903p34m580L002M708N285J278j891J2665N928l736M745p16o889L862l075
103F949o360L0m507l896j606j273N817l594n373J0343M288k399Q376J284m027
118D052K467J068J978k07o366j671m679l619P167k874p126M765j069k214O909
133a419K461M16j1p92N826R76k894M209m371o847L983k167l717L219k855k649
$$ plain form
149 -6632 -6211 -6219 -1103 -394 -2118 4005 2851 159 7172 7098 3647 5350 2286 12 -42 -2756 -2718 -5933
167 -5933 -8683 -2928 -3788 -5064 1080 -571 -2008 4779 6050 5832 6313 3249 4317 3295 1280 3434
183 3434 -2604 -7715 -4260 -6585 -7305 -2891 -4484 -5072 -1763 -43 4994 5896 5361 8307 4873 2759
199 2759 7530 3968 729 1091 -4380 -7654 -6182 -6918 -5577 -6329 -7226 -2812 -2349 151 7401 5489
215 5489 4461 8403 6694 6750 7611 3508 680 -2246 -4807 -3111 -6873 -8872 -5947 -8770 -7644 -1213
231 -1213 -1437 75 3912 4459 7474 8812 7716 8954 4377 1825 3596 -957 -3739 -3002 -8397 -9597
247 -9597 -6616 -6817 -4461 -3366 -2824 695 1529 4346 9797 7412 5945 7628 3419 2919 4039 -327
263 -327 -3023 -5625 -7909 -5464 -6198 -5361 -2726 -5686 -3800 2197 2112 4385 7168 4399 4699 5452 4746
$$ packed form
149f632M21qN116P09j724O123j154k692P013p4l451J703l064k274n4k714L8l215
167e933k750N755q60j276O144j651j437O787J271k18M81l064J068j022k015K154
183C434o038n111L455k325p20M414j593n88L309J720N037R02n35K946l434k114
199B759M771l562l239L62n471l274J472p36J341p52q97M414M63K500P250j912
215E489j028L942j709N6Q61m103k828k926k561J696l762j999K925k823J126O431
231a213k24J512L837N47L015J338j096J238m577k552J771m553k782P37n395j200
247i597K981k01K356J095N42L519Q34K817N451k385j467J683m209n00J120m366
263c27k696k602k284K445p34Q37K635k960J886N997q5K273K783k769L00P53p06
$$ plain form
280 4746 4770 1075 -1840 -1199 -4875 -4798 -2507 -6220 -6201 -2822 -3566 -515 1574 1365 3342 2770 4095 6893
298 6893 3679 2701 3458 -1259 -1056 348 -3037 -3678 -4210 -5454 -3085 -2730 -1011 1414 -1299 453 4180
315 4180 2564 4462 5603 1161 900 1053 -241 626 -1556 -3483 -3254 -5735 -3408 396 -2103 -836
331 -836 1127 -270 2799 4716 3674 3672 1771 1153 2301 -412 -533 -239 -4959 -4114 -2465 -4263 -2436
348 -2436 -1331 -2186 362 1185 2709 5233 3145 3723 4388 1392 2505 2280 -2075 -2636 -2937 -4902 -3543
365 -3543 -3855 -3944 -2951 -3842 -504 2940 1794 4189 5239 2641 4782 5669 3594 2795 -77 -2747 -2676
382 -2676 -4627 -3538 -3305 -6851 -5051 -3056 -3403 1033 2972 1773 3659 4190 5243 6899 4889 4075
398 4075 2431 -1821 -936 -1388 -5054 -4556 -5367 -7448 -4589 -3166 -1910 178 293 2638 4786 4077 6663
$$ packed form
280D746K4l695k915O41l676P7K291l713J9L379p44L051K089k09J977n72J325K798
298F893l214r78P57m717K03J404l385o41n32j244K369L55J719K425k713J752L727
315D180j616J898J141m442k61J53j294Q67k182j927K29k481K327L804k499J267
331h36J963j397L069J917j042kj901o18J148k713j21K94m720Q45J649j798J827
348b436J105q55K548Q23J524K524k088N78O65k996J113k25m355n61l01j965J359
365c543l12q9R93q91L338L444j146K395J050k598K141Q87k075p99k872k670P1
382b676j951J089K33l546J800J995l47M436J939j199J886N31J053J656k010q14
398D075j644m252Q85m52l666M98q11k081K859J423J256K088J15K345K148p09K586
$$ plain form
415 6663 6717 2986 3630 2912 -28 -134 -2301 -4652 -5037 -6063 -4641 -3548 -4797 -2202 -678 -775 3568
432 3568 4997 3687 4799 4213 3443 4344 2574 1637 -414 -4251 -3041 -3238 -5150 -3176 -3780 -5413 -2206
449 -2206 -473 976 3266 2663 3209 3839 3094 4951 4311 705 1071 -746 -3349 -1624 -2281 -4038 -3528
466 -3528 -4542 -2868 -697 -694 1908 1799 524 3798 4079 2644 3869 2105 -98 364 -700 -1091 -2004
483 -2004 -4253 -2634 -2668 -3433 44 -189 -1425 1208 1594 2133 4125 3007 2182 1726 1 1459 468
500 468 -2239 -1566 -3328 -4462 -1429 -1269 -1822 -451 -880 327 2420 2586 4091 3028 1027 2419 1421
517 1421 -145 1242 -1698 -3934 -2983 -3644 -2666 -1569 -2188 -902 -466 -236 3303 3251 2397 4130 2600
534 2600 1794 3132 1520 -87 -1172 -3334 -3077 -3395 -4071 -2373 -3197 -3475 331 648 1234 3606 2872
$$ packed form
415F663N4l731O44p18k940j06k167k351l85j026J422J093j249K595J524r7M343
432C568J429j310J112n86p70R01j770r37k051l837J210j97j912J974o04j633L207
449b206J733J449K290o03N46O30p45J857o40l606L66j817k603J725o57j757N10
466c528j014J674K171LK602j09j275L274K81j435J225j764k203M62j064l91r13
483b004k249J619l4p65L477k33j236K633L86N39J992j118q25m56j725J458r91
500D68k707O73j762j134L033J60n53J371m29J207K093J66J505j063k001J392r98
517A421j566J387k940k236R51o61R78J097o19J286M36K30L539n2q54J733j530
534B600q06J338j612j607j085k162K57l18o76J698q24k78L806L17N86K372p34
$$ plain form
551 2872 2977 4117 3504 4182 2393 -372 0 -2380 -3431 -1794 -4099 -5332 -3651 -4038 -2165 226
567 226 504 1771 2040 2448 5206 4717 3728 4423 1288 -517 501 -1355 -2363 -3230 -5249 -4810 -4167 -3637
585 -3637 -915 -1235 -1106 1887 1841 3377 5659 4143 3555 3598 1792 1762 504 -1481 -1712 -4367 -5073 -2910
603 -2910 -3806 -3650 -1632 -2302 -747 2058 2389 3460 3496 3039 4061 2924 2297 2588 -871 -1960 -1173 -2988
621 -2988 -2976 -2584 -4277 -3137 -2413 -1337 1075 1068 1281 2899 2048 2917 4882 2538 1635 1170 -1051 -765
639 -765 -1069 -2088 -2057 -3570 -3583 -1487 -1865 -790 1271 -151 735 2549 2288 3016 2808 991 1094 -78
657 -78 -137 305 -2076 -2649 -1772 -3329 -1888 -120 -1181 5 581 632 2406 2313 2366 2757 586 664 1408 -553
677 -553 -674 -923 -3093 -2591 -1848 -1804 -757 -962 -816 1169 1197 2484 3618 1731 1663 1973 583 952 446
$$ packed form
551B872J05J140o13O78j789k765L72k380j051J637k305j233J681l87J873K391
567B26K78J267K69M08K758m89r89O95l135j805J018j856j008q67k019M39O43N30
585c637K722l20J29K993m6J536K282j516n88M3j806l0j258j985k31k655p06K163
603b910q96J56K018o70J555K805L31J071L6m57J022j137o27K91l459j089P87j815
621b988J2L92j693J140P24J076K412pK13J618q51Q69J965k344r03m65k221K86
639g65l04j019L1j513j3K096l78J075K061j422Q86J814k61P28k08j817J03j172
657g8n9M42k381n73Q77j557J441J768j061J186N76N1J774r3N3L91k171P8P44j961
677e53j21k49k170N02P43M4J047k05J46J985K8J287J134j887o8L10j390L69n06
$$ plain form
696 446 -1612 -1894 -3102 -2924 -1464 -2348 -1913 -910 -1742 498 2533 2016 3060 2884 1690 2692 2256
713 2256 1456 1128 -1633 -2333 -1885 -3355 -2530 -2059 -3681 -2375 -1213 -551 1816 2050 2241 3134 2382 3569
731 3569 3953 1507 1387 695 -1924 -1168 -1734 -3390 -3280 -4101 -3735 -1680 -1394 -74 1102 504 2604 4179
749 4179 3126 4248 3477 1085 1488 717 -327 -677 -3035 -3488 -3403 -4386 -2412 -1743 -2495 -861 300 935
767 935 3232 3727 3449 3462 1996 2570 2396 128 6 -1286 -3847 -2926 -2863 -3501 -2294 -2770 -2319 -591 191
786 191 1592 2849 1771 2848 3432 2131 3001 2088 -211 -328 -1356 -2142 -1500 -3006 -2880 -2467 -3018 -855
804 -855 453 -65 1648 1662 1173 3012 2876 2413 2170 349 -4 47 -1535 -769 -1739 -3578 -1814 -1464 -1752
823 -1752 117 -109 -321 1157 1413 2378 2826 1299 1562 953 -517 814 65 -1580 -1314 -2344 -2404 -1095
$$ packed form
696D46k058k82j208J78J460q84M35J003q32K240K035n17J044j76j194J002m36
713B256q00l28k761p00M48j470Q25M71j622J306J162O62K367K34J91Q93p52J187
731C569L84k446j20o92k619P56n66j656J10q21L66K055K86J320J176n98K100J575
749D179j053J122p71k392M03p71j044l50k358m53Q5r83J974O69p52J634J161O35
767I35K297M95k78J3j466N74j74k268j22j292k561R21O3o38J207m76M51J728P82
786A91J401J257j078J077N84j301Q70r13k299j17j028p86O42j506J26M13n51K163
804h55J308n18J713J4m89J839j36m63k43j821l53N1j582P66r70j839J764L50k88
823a752J869k26k12J478K56R65M48j527K63o09j470J331p49j645K66j030o0J309
$$ plain form
841 -1095 -1226 -469 104 -442 1181 1992 1278 2867 1930 392 1429 497 -90 -27 -1743 -1846 -1961 -2400 -939
860 -939 -773 -1660 4 330 193 2560 2104 1374 2093 1276 1318 1456 -152 -412 -1402 -2990 -1500 -1929 -2584
879 -2584 -1401 -1955 -1325 617 943 1614 2453 1598 2244 2237 1847 2539 975 -1068 -924 -2180 -2483 -1603 -2670
898 -2670 -2851 -2321 -2307 -435 630 522 2313 2103 1766 3523 2726 1915 2178 140 -465 -485 -1841 -1804 -2722
917 -2722 -3982 -2623 -2408 -1880 99 -181 19 1968 2264 3154 3712 2398 2401 1777 692 1083 -621 -2129
935 -2129 -2289 -3475 -3232 -1939 -2390 -2102 -925 -954 915 2007 2234 2994 2417 1894 3106 1922 1233 889
953 889 -1184 -1933 -1840 -2768 -1928 -2283 -2837 -1599 -1340 -362 1530 1206 1494 2537 1924 2400 2881 1263 976
972 976 -127 -1275 -467 -1560 -2296 -1709 -2704 -2284 -555 -772 -50 947 335 1526 2179 1858 2693 1275
$$ packed form
841a095j31P57N73n46J623Q11p14J589r37j538J037r32n87O3j716j03j15m39J461
860i39J66q87J664L26j37K367m56p30P19q17M2J38j608k60r90j588J490m29o55
879b584J183n54O30J942L26O71Q39q55O46pl90O92j564k043J44j256l03Q80j067
898b670j81N30J4J872J065j08J791k10l37J757p97q11K63k038o05k0j356L7r18
917b722j260J359K15N28J979k80K00J949K96Q90N58j314Lo24j085L91j704j508
935b129j60j186K43J293m51K88J177k9J869J092K27P60n77n23J212j184o89l44
953H89k073p49R3r28Q40l55n54J238K59R78J892l24K88J043o13M76M81j618k87
972I76j103j148Q08j093p36N87r95M20J729k17P22R97o12J191O53l21Q35j418
$$ plain form
990 1275 500 916 -366 -521 -271 -2033 -2256 -1561 -2119 -787 -295 -604 273 208 782 2377 1648 1495 1888
1009 1888 249 509 737 -576 -929 -1359 -2368 -1350 -1646 -1053 3 -891 -314 1152 859 1703 2249 1023
1027 1023 1226 744 387 694 -418 -1513 -1153 -2273 -1970 -718 -1493 -1342 -551 -538 846 1592 1383 2126
1045 2126 1575 1287 1860 774 558 395 -1666 -1437 -1348 -2337 -1621 -1790 -2355 -817 -130 499 1765 1205 1563
1064 1563 2306 1661 2385 2328 572 227 -506 -1461 -1111 -1814 -2524 -2238 -2847 -1770 -423 -562 549 1425 733
1083 733 2332 2676 2482 2765 1551 637 487 -526 -742 -946 -2872 -2770 -2421 -2995 -1346 -878 -1023 242
1101 242 637 1499 2729 2360 2440 2511 889 1303 1223 -457 -699 -1718 -2850 -1990 -2105 -2272 -1568 -2111 -727
1120 -727 579 593 2045 2421 1626 2373 2351 1790 2033 700 -628 -655 -1800 -1792 -1337 -2582 -2106 -1794 -1828 -214
$$ packed form
990A275p75M16j282j55K50j762k23O95n58J332M92l09Q77o5N74J595p29j53L93
1009A888j639K60K28j313l53m30j009J018k96N93J056q94N77J466k93Q44N46j226
1027A023K03m82l57L07j112j095L60j120L03J252p75J51P91J3J384P46k09P43
1045B126n51k88N73j086k16j63k061K29Q9r89P16j69n65J538O87O29J266n60L58
1064A563P43o45P24n7j756l45p33r55L50p03p10K86o09J077J347j39J111Q76o92
1083G33J599L44j94K83j214r14j50j013k16k04j926J02L49n74J649M68j45J265
1101B42L95Q62J230l69Q0P1j622M14q0j680k42j019j132Q60j15j67P04n43J384
1120g27J306J4J452L76p95P47k2n61K43j333j328k7j145QM55j245M76L12l4J614
$$ plain form
1140 -214 641 528 1449 1320 1607 2557 1826 1917 1285 -384 -143 -211 -1480 -870 -1735 -2516 -1265 -1260 -979 274
1160 274 -226 380 1365 914 2168 2045 895 1217 423 -91 123 -487 -1217 -1202 -1952 -1445 -657 -1024 -251 -28
1180 -28 -247 948 1542 1065 1861 964 329 1025 -5 172 -107 -1795 -1487 -1320 -1585 -607 -635 -1165 204
1199 204 161 544 1805 1289 1176 1381 512 1075 957 -411 -367 -1163 -1996 -970 -1236 -1366 -662 -1216 -402 572
1219 572 665 1626 1640 1047 1953 1606 1064 1420 70 -797 -681 -1725 -1416 -1438 -2428 -1572 -1265 -1107 670 806
1239 806 482 1784 1535 1810 2561 1670 1316 621 -648 -437 -836 -1647 -1577 -2449 -2760 -1303 -1182 -826 400
1258 400 28 982 1923 1786 2511 2297 1165 1622 661 -277 166 -1208 -1862 -1627 -2585 -2035 -1400 -1778 -774
1277 -774 -475 -120 1465 1560 1648 2396 1745 1266 1872 905 681 -97 -1466 -1385 -1461 -2217 -1265 -1741 -1913 -735
$$ packed form
1140b14Q55j13R21j29K87R50p31R1o32j669K41o8j269O10q65p81J251NK81J253
1160B74n00O06R85m51J254j23j150L22p94n14K14o10p30J5p50N07P88l67P73K23
1180b8k19J195N94m77P96q97o35O96j030J77k79j688L08J67k65R78k8n30J369
1199B04m3L83J261n16j13K05q69N63j18j368M4p96q33J026k66j30P04n54Q14R74
1219E72R3R61J4n93R06l47n42L56j350q67J16j044L09k2r90Q56L07J58J777J36
1239H06l24J302k49K75P51q91l54o95j269K11l99q11P0q72l11J457J21L56J226
1258D00l72R54R41j37P25k14j132M57r61r38M43j374o54K35r58N50O35l78J004
1277g74K99L55J585R5Q8P48o51m79O06r67k24p78j369Q1p6p56R52m76j72J178
$$ plain form
1297 -735 -588 360 1294 1067 1606 1852 1356 2021 1570 672 622 -560 -1164 -417 -1370 -1629 -1424 -1975 -1434 -386
1317 -386 -528 487 472 547 1695 1334 1456 1990 807 322 418 -648 -188 -431 -1843 -1564 -1536 -1307 -225
1336 -225 -753 -303 481 24 864 1896 1183 1065 1059 322 501 303 -396 -304 -1396 -1563 -565 -1119 -696 -252
1356 -252 -796 -110 871 647 1450 1124 859 982 362 244 741 -681 -919 -757 -1661 -783 -543 -1130 -602 -496
1376 -496 -21 927 958 1066 1413 743 889 1415 204 94 -223 -1233 -696 -1062 -1529 -858 -1388 -1208 -241 -236
1396 -236 554 1338 716 1208 1549 1107 1513 1086 90 98 -942 -1073 -776 -1474 -1509 -1499 -1723 -651 210 -134 666
1417 666 867 944 2011 1909 1795 1661 675 295 397 -690 -731 -1156 -2105 -1684 -1585 -1539 -583 -624 -409 457 879
1438 879 1465 2179 1672 1487 1278 513 754 228 -600 -872 -1663 -1651 -1237 -1637 -1462 -967 -1117 -188 635 680 1678
$$ packed form
1297g35J47R48R34k27N39K46m96O65m51q98n0j182o04P47r53k59K05n51N41J048
1317c86j42J015j5P5J148l61J22N34j183m85R6j066M60k43j412K79K8K29J082
1336b25n28M50P84m57Q40J032p13j18op37J79j98o99R2j092j67R98n54M23M44
1356b52n44O86R81k24Q03l26k65J23o20j18M97j422k38J62r04Q78K40n87N28J06
1376d96M75R48L1J08L47o70J46N26j211j10l17j010N37l66m67O71n30J80R67N
1396b36P90P84o22M92L41m42M06m27r96Qj040j31K97o98l5J0k24J072Q61l44Q00
1417F66K01P7J067j02j14j34r86l80J02j087m1m25r49M21R9M6R56m1K15Q66M22
1438H79N86P14n07j85k09p65K41n26q28k72p91J2M14m00J75M95j50R29Q23M5R98
$$ plain form
1459 1678 1520 1395 1664 1399 1086 1154 -262 -347 -825 -1430 -1048 -1241 -1874 -1496 -1181 -1010 281 414 696 1072
1479 1072 947 1539 1797 1180 1284 765 -370 -113 -440 -1004 -833 -1609 -1543 -1022 -1043 -428 197 -222 398 906
1499 906 887 1652 1093 618 632 268 -8 294 -804 -909 -950 -1542 -799 -764 -672 -246 -21 54 981 991 1012 1337
1521 1337 300 614 551 187 86 -529 -1039 -687 -794 -681 -376 -677 -631 -98 -37 898 1205 414 960 628
1541 628 314 895 281 -451 -478 -999 -929 -796 -1008 -492 -339 -892 -28 880 455 1296 769 658 1274 744 708
1562 708 377 -409 -686 -642 -1071 -922 -953 -1594 -1091 -491 -348 841 560 540 1181 1098 1370 1561 589 642 49
1583 49 -532 -479 -598 -1181 -1077 -1547 -1338 -715 -723 -155 512 290 883 1264 1354 1888 1159 674 811 7 -169 -349
1605 -349 -1272 -1352 -1424 -1722 -972 -864 -918 -104 -74 457 1192 1299 1498 1723 940 920 958 99 130 -583 -1135 -1216 -1279
$$ packed form
1459A678j58j25K69k65l13O8j416q5m78o05L82j93o33L78L15J71J291J33K82L76
1479A072j25N92K58o17J04n19j135K57l27n64J71p76O6N21k1O15O25m19O20N08
1499I06j9P65n59m75J4l64k76L02j098j05m1n92P43L5R2M26K25P5R27J0K1L25
1521A337j037L14o3l64j01o15n10L52j07J13L05l01M6N33O1R35L07p91N46l32
1541F28l14N81o14p32k7n21P0J33k12N16J53n53Q64R08m25Q41n27j11O16n30l6
1562G08l31p86k77M4m29J49l1o41N03O00J43J189k81k0O41q3K72J91r72N3n93
1583D9n81N3j19n83J04m70K09O23qN68O67k22N93L81R0N34p29m85J37q04j76j80
1605c49r23q0p2k98P50J08n4Q14L0N31P35J07J99K25p83k0L8q59L1p13n52q1o3
$$ plain form
1628 -1279 -1421 -962 -1289 -864 -203 -68 742 1202 697 1312 1293 982 1350 680 140 -93 -808 -759 -641 -1331
1648 -1331 -1389 -1315 -1480 -429 -139 -249 594 597 740 1242 1273 1077 1103 270 441 103 -571 -439 -778 -1361 -912
1669 -912 -1134 -816 -211 -348 -133 390 479 969 1028 948 843 745 11 414 138 -782 -507 -1229 -840 -583 -795
1690 -795 -207 -159 -421 302 396 464 1106 588 243 928 152 188 300 -595 -632 -700 -853 -534 -503 -661 -134 58
1712 58 183 1027 780 809 800 651 404 437 -114 -100 -229 -977 -471 -873 -766 -464 -863 -639 -54 104 737 1018
1734 1018 772 1050 751 768 891 323 -104 -288 -786 -762 -429 -1158 -1024 -627 -1022 -87 146 359 796 502
1754 502 783 1460 1212 1009 919 -26 -28 -204 -719 -598 -1213 -1459 -934 -901 -613 -68 -320 334 737 665 1408 1372
1776 1372 839 925 586 165 340 -266 -615 -938 -1501 -1153 -809 -980 -497 -425 -292 484 566 645 1314 1072 886
$$ packed form
1628a279j42M59l27M25O61J35Q10M60n05O15j9l11L68o70n40k33p15M9J18o90
1648a331n8P4j65J051K90j10Q43LJ43N02L1j96K6q33J71l38o74J32l39n83M49
1669i12k22L18O05j37K15N23Q9M90N9q0j05r8p34M03k76r20K75p22L89K57k12
1690g95N88M8k62P23R4O8O42n18l45O85p76L6J12q95l7o8j53L19L1j58N27J92
1712E8J25Q44k47K9rj49k47L3n51J4j29p48N06m02J07L02l99K24N85J58O33K81
1734A018k46K78k99J7J23n68m27j84m98K4L33p29J34L97l95R35K33K13M37k94
1754E02K81O77k48k03r0r45kj76n15J21o15k46N25L3K88N45k52O54M03p2P43l6
1776A372n33Q6l39m21J75o06l49l23n63L48L44j71M83P2J33P76Q2P9O69k42j86
$$ plain form
1797 886 1074 725 871 313 -451 -719 -711 -1125 -988 -909 -1489 -673 -645 47 414 498 755 1046 921 992 901 617
1819 617 572 76 -503 -237 -747 -992 -770 -1359 -960 -432 -503 107 371 133 797 1043 842 1097 758 195 292
1840 292 -56 -19 -235 -647 -692 -721 -1038 -387 -266 -586 -11 31 546 945 591 766 856 189 403 480 -131 -5
1862 -5 -532 -723 -346 -457 -589 -181 -401 -272 316 80 818 698 478 578 569 182 390 -34 -649 -205 -745
1883 -745 -576 -525 -712 -447 -307 -317 405 341 497 749 618 388 756 432 564 181 -373 -639 -630 -819 -470 -614
1905 -614 -972 -232 -395 203 574 377 713 899 817 1038 797 416 327 -322 -653 -293 -701 -935 -652 -1016 -797
1926 -797 -316 -160 403 453 496 950 883 777 1033 392 245 435 -172 -160 -462 -1073 -845 -1069 -901 -457 -383 -439
1948 -439 189 144 412 1151 875 1067 901 382 571 451 -49 -78 -716 -1111 -810 -955 -998 -571 -791 -443 39
$$ packed form
1797H86J88l49J46n58p64k68Qm14J37P9n80Q16K8O92L67Q4K57K91j25P1r1k84
1819F17m5m96n79K66n10k45K22n89L99N28p1O10K64k38O64K46k01K55l39n63R7
1840B92l48L7k16m12m5k9l17O51J21l20N75M2N15L99l54J75R0o67K14P7o11J26
1862en27j91L77j11j32M08k20J29N88k36P38j20k20J00rl87K08m24o15M44n40
1883g45J69N1j87K65J40j0P22o4J56K52j31k30L68l24J32l83n54k66Rj89L49j44
1905f14l58P40j63N98L71j97L36J86q2K21k41l81q9o49l31L60m08k34K83l64K19
1926g97M81J56N63N0M3M54o7j06K56o41j47J90o07J2l02o11K28k24J68M44P4n6
1948d39O28m5K68P39k76J92j66n19J89j20n00k9o38l95L01j45m3M27k20L48M82
$$ plain form
1969 39 180 759 783 719 920 866 433 935 249 -401 -428 -748 -796 -913 -970 -690 -714 -870 -25 110 162 516 584
1992 584 713 885 631 934 489 -17 122 -155 -592 -518 -1125 -1094 -806 -723 -461 51 -397 179 617 436 1175
2013 1175 1095 525 588 398 50 109 -446 -617 -593 -802 -659 -319 -582 -151 -270 -169 374 404 520 708 450
2034 450 339 527 178 348 21 -688 -472 -483 -500 -356 -315 -462 116 -121 309 672 496 520 576 155 569 449
2056 449 -67 48 -413 -597 -410 -495 -353 -430 -596 -259 412 141 602 368 316 624 512 365 307 -5 -352
2077 -352 -178 -647 -248 -585 -906 -461 -589 -384 292 289 151 698 506 639 1052 611 554 242 -405 -211 -221
2098 -221 -820 -653 -938 -766 -470 -479 -345 158 57 323 464 588 1125 764 586 483 171 49 289 -573 -501
2119 -501 -808 -1033 -803 -420 -606 -334 -134 9 657 773 968 1071 773 805 521 236 250 -231 -728 -577 -822
$$ packed form
1969C9J41N79K4o4K01n4m33N02o86o50k7l20m8j17n7K80k4j56Q45J35N2L54O8
1992E84J29J72k54L03m45n06J39k77m37P4o07L1K88Q3K62N12m48N76M38j81P39
2013A175q0n70O3j90l48N9n55j71K4k09J43L40k63M31j19J01N43L0J16J88k58
2034D50j11J88l49J70l27p09K16j1j7J44M1j47N78k37M30L63j76K4N6m21M14j20
2056D49n16J15m61j84J87q5J42p7j66L37O71k71M61k34n2L08j12j47n8l12l47
2077c52J74m69L99l37l21M45j28K05O76lj38N47j92J33M13m41n7l12o47J94j0
2098b21n99J67k85J72K96rJ34N03j01K66J41J24N37l61j78j03l12j22K40q62P2
2119e01l07k25K30L83j86K72K00J43O48J16J95J03k98L2k84k85J4m81m97J51k45
$$ plain form
2140 -822 -1053 -570 -932 -498 -310 -26 212 857 599 479 789 664 613 551 350 275 -354 -400 -402 -638 -597 -630 -953
2163 -953 -602 -196 -171 379 467 484 946 633 608 653 288 141 181 -237 -275 -362 -638 -610 -793 -835 -179 -284 -171
2186 -171 235 62 481 796 553 552 513 34 282 183 -156 -46 -483 -731 -529 -503 -359 -63 -432 -1 300 164
2208 164 526 522 276 428 299 235 185 -81 -257 -368 -578 -173 -257 -529 -285 -388 -125 227 -121 277 591 326
2230 326 508 443 207 254 174 -457 -465 -476 -493 -66 -358 -341 84 -103 168 582 72 637 505 432 676 153 -114
2253 -114 150 -357 -198 -191 -699 -570 -390 -681 -525 113 -97 411 442 327 866 563 442 431 -133 48 -144
2274 -144 -447 -343 -504 -924 -713 -616 -674 -192 -251 193 285 182 855 872 528 504 557 52 236 -103 -515 -269
2296 -269 -690 -649 -402 -565 -422 -161 -411 -1 529 405 637 645 577 724 439 417 444 4 -361 -299 -518 -829
$$ packed form
2140h22k31M83l62M34J88K84K38O45k58j20L10j25n1o2k01p5o29m6kk36M1l3l23
2163i53L51M06K5N50Q8J7M62l13k5M5l65j47M0m18l8q7k76K8j83m2O56j05J13
2186a71M06j73M19L15k43jl9m79K48r9l39J10m37k48K02K6J44K96l69M31L01j36
2208A64L62mk46J52j29o4n0k66j76j11k10M05q4k72K44j03K63L52l48L98L14k65
2230C26J82o5k36M7q0o31qj1j7M27k92J7M25j87K71M14n10N65j32p3K44n23k67
2253a14K64n07J59Pn08J29J80k91J56O38k10N08L1j15N39l03j21j1n64J81j92
2274a44l03J04j61m20K11R7n8M82n9M44R2j03O73J7l44k4N3n05J84l39m12K46
2296b69m21M1K47j63J43K61k50M10N30j24K32Qo8J47k85k2K7m40l65O2k19l11
$$ plain form
2318 -829 -550 -683 -654 -313 -170 317 158 283 559 639 715 859 402 352 270 -159 -4 -391 -418 -495 -611 -650 -247
2341 -247 -353 -166 197 57 346 172 618 809 538 434 200 30 -147 3 -350 -455 -624 -630 -320 -206 -457
2362 -457 63 -27 35 644 254 467 692 -59 367 296 -69 -55 -242 -398 -106 -558 -490 -201 -367 -424 181 44
2384 44 158 558 266 353 202 302 286 186 124 -21 -356 -285 -60 -462 -332 -292 -328 -23 -20 328 586 499 308
2407 308 392 -56 237 102 -283 -178 -204 -561 -269 -387 -811 -184 -281 -179 278 85 321 531 329 368 495
2428 495 64 341 90 -282 -241 -560 -848 -379 -535 -244 -399 -180 153 265 208 548 558 329 664 517 115
2449 115 133 -146 -81 -127 -514 -545 -815 -840 -348 -129 -366 -97 -49 277 463 561 465 658 355 439 250 -162 36
2472 36 -283 -528 -541 -622 -575 -326 -433 -229 92 173 478 501 370 524 465 416 652 342 -21 108 -376 -459 -219
$$ packed form
2318h29K79j33K9L41J43M87j59J25K76Q0P6J44m57n0q2m29J55l87k7p7j16l9M03
2341b47j06J87L63j40K89j74M46J91k71j04k34j70j77J50l53j05j69oL10J14k51
2362d57N20r0O2O09l90K13K25p51M26p1l65J4j87j56K92m52O8K89j66n7O05j37
2384D4J14M00k92Q7j51J00j6j00o2j45l35P1K25m02J30M0l6L05LL48K58q7j91
2407C08Q4m48K93j35l85J05k6l57K92j18m24O27r7J02M57j93K36K10k02L9J27
2428D95m31K77k51l72M1l19k88M69j56K91j55K19L33J12n7L40J0k29L35j47m02
2449A15J8k79O5m6l87l1k70k5M92K19k37K69M8L26J86R8r6J93l03Q4j89m12J98
2472C6l19k45j3q1M7K49j07K04L21Q1L05K3j31J54n9m9K36l10l63J29m84q3K40
$$ plain form
2495 -219 -559 -605 -552 -402 34 -114 146 234 381 464 494 461 528 353 131 67 110 -409 -200 -397 -646 -554 -593 -320
2519 -320 -74 -80 35 270 74 399 444 163 431 380 198 278 -163 -213 -274 -485 -260 -339 -384 -356 -94 -128 236 160
2543 160 221 312 238 257 390 153 167 144 -119 -300 -249 -426 -174 -181 -330 -31 -34 -28 146 234 138 130 228 92 276 -126
2569 -126 -60 -170 -385 -57 -407 -416 -90 -361 -141 -117 63 445 428 212 344 252 401 253 1 -12 -50 -245 -18
2592 -18 -263 -287 -412 -289 -347 67 155 112 286 165 380 602 367 324 154 -264 146 119 -239 -365 -400 -375 -420
2615 -420 -349 -164 40 40 -24 411 388 391 423 276 319 297 65 136 -181 -269 -391 -554 -399 -333 -604 -125 -108 -187 281
2640 281 238 452 713 209 505 468 250 172 113 -464 -225 -222 -478 -390 -446 -701 -322 -313 -82 249 238 381 356 224
2664 224 425 528 345 248 -50 -173 -123 -351 -447 -360 -489 -222 -138 -320 184 49 -100 224 432 315 443 218
$$ packed form
2495b19l40m6N3J50M36j48K60Q8J47Q3L0l3O7j75k22o4M3n19K09j97k49R2l9K73
2519c20K46oJ15K35j96L25M5k81K68n1j82Q0m41n0o1k11K25p9m5K8K62l4L64p6
2543A60O1R1p4J9J33k37J4k3k63j81N1j77K52pj49K99lOJ74Q8r6qR8j36J84m02
2569a26O6j10k15L28l50rL26k71K20K4J80L82j7k16J32r2J49j48k52j3l8j95K27
2592a8k45k4j25J23n8M14Q8m3J74j21K15K22k35m3j70m18M10k7l58j26l5K5m5
2615d20P1J85K04%o4M35k3LL2j47M3k2k32P1l17q8j22j63J55O6k71M79J7p9M68
2640B81m3K14K61n04K96l7k18p8n9n77K39Lk56Q8n6k55L79RK31L31j1J43k5j32
2664B24K01J03j83r7k98j23N0k28r6Q7j29K67Q4j82N04j35j49L24K08j17J28k25
$$ plain form
2686 218 144 183 -119 50 2 -279 -263 -417 -353 -86 -245 -304 -36 -8 257 287 280 282 237 17 259 148 107 96 -236
2711 -236 -396 -347 -352 -235 16 -228 -154 59 96 267 237 -41 215 312 270 90 151 81 -203 -164 -55 -133 -233 -203
2735 -203 -133 -305 -130 155 338 29 102 155 393 45 157 111 -192 -151 -224 -298 -295 -304 -166 -141 -121 212 313 101
2759 101 157 264 3 220 131 210 115 -152 -45 -142 -233 -297 -458 -422 -275 -70 -65 157 214 137 406 249 387 391 187
2784 187 156 -37 -269 -203 -403 -379 -198 -354 -214 -192 -37 162 -81 96 332 383 154 476 512 248 299 118
2806 118 -17 -77 -218 -292 -176 -507 -63 -109 -293 31 243 39 332 389 396 419 327 244 312 -111 -157 -90 -259 -141
2830 -141 -317 -380 -377 -454 -258 26 153 169 452 180 282 392 447 393 338 18 -4 16 -271 -55 -551 -578 -347 -178
2854 -178 -101 11 -164 66 289 293 424 413 240 354 73 -63 61 -221 -170 -194 -472 -356 -118 -322 -91 -31
$$ packed form
2686B18p4L9l02J69m8k81J6j54O4K67j59n9K68K8K65L0pKm5k20K42j11m1j1l32
2711b36j60M9nJ17K51k44P4K13L7J71l0k78K56R7m2j80O1p0k84L9J09p8j00L0
2735b03P0j72J75K85J83l09P3N3K38l48J12m6l03M1p3p4LrJ38K5K0L33J01k12
2759A01N6J07k61K17q9P9r5k67J07r7r1o4j61L6J47K05NK22N7p7K69j57J38Mk04
2784A87l1j93k32O6k00K4J81j56J40K2J55J99k43J77K36N1k29L22L6k64N1j81
2806A18j35o0j41p4J16l31M44m6j84L24K12k04K93N7PK3r2q3O8m23m6O7j69J18
2830a41j76o3Lp7J96K84J27J6K83k72J02J10N5n4n5l20k2K0k87K16m96k7K31J69
2854a78P7J12j75K30K23MJ31j1j73J14k81j36J24k82N1k4k78J16K38k04K31O0
$$ plain form
2876 -31 -27 117 182 213 384 234 243 356 -23 128 201 -143 -212 -87 -174 -187 -270 -138 -68 -134 -14 109 176 206 250 -1
2902 -1 89 162 -22 -219 -231 -275 -239 -386 -300 37 -142 -3 -24 -12 102 175 160 259 178 141 96 19 21 -70 -233 -19 -195
2929 -195 -389 -172 -212 -242 -65 -33 243 284 78 317 315 -23 375 160 -160 -119 56 -373 -172 -127 -240 -266 -173
2952 -173 -98 52 116 138 243 171 280 169 105 163 -24 -88 -81 -406 -411 -263 -392 -203 -81 -199 -187 -61 51 302
2976 302 228 183 422 129 210 309 50 -63 36 -96 -445 -350 -274 -88 -329 -294 -191 -126 48 225 117 181 384
2999 384 352 243 13 165 11 -218 -93 -137 -196 -414 -187 -319 -96 -116 -69 92 289 82 325 63 400 264
3021 264 72 313 -136 -162 -155 -218 -265 -295 -324 -483 -40 -6 -8 46 -124 158 223 128 262 121 -2 174 -35 20 -190
3046 -190 -314 -271 -18 -249 -224 -256 -94 111 -60 85 397 81 173 208 251 39 228 0 -146 -29 -118 -202 -236
$$ packed form
2876c1MJ44O5L1J71j50RJ13l79J51P3l44o9J25q7j3q3J32P0o6J20J23O7L0M4k51
2902aR0P3j84j97j2m4L6j47Q6L37j79J39k1J2J14P3j5R9q1l7m5p7Kr1j63K14j76
2929a95j94K17m0l0J77L2K76M1k06K39kl38L98k15l20M1J75m29K01M5j13k6R3
2952a73P5J50O4K2J05p2J09j11o4N8j87o4Pl25nJ48j29J89J22j18J2J26J12K51
2976C02p4m5K39k93Q1R9k59j13R9j32l49R5P6J86k41L5J03O5J74J77j08O4K03
2999C84l2j09k30J52j54k29J25m4n9k18K27j32K23k0M7J61J97k07K43k62L37j36
3021B64j92K41m49k6Po3m7l0k9j59M43L4kN4j70K82O5r5J34j41j23J76k09N5k10
3046a90j24M3K53k31K5l2J62K05j71J45L12l16R2L5M3k12J89k28j46J17q9q4l4
$$ plain form
3069 -236 -259 29 -161 -325 327 16 66 124 83 214 301 -23 242 225 -222 3 -252 -247 -114 -354 -216 -57 -108
3092 -108 297 314 -118 137 204 -71 143 237 -11 -37 -17 -49 -213 -173 -158 -260 -197 141 -30 -4 260 86 111 351
3116 351 269 237 147 111 51 73 -65 -102 -108 -280 -205 -354 -92 66 32 -98 45 80 222 326 -18 360 404 -244
3140 -244 120 158 -200 -281 -348 -200 94 -218 -97 -184 -182 -34 209 248 246 327 148 309 187 193 15 -201 -75 -225
3164 -225 -245 -477 -334 -224 -300 -123 -157 97 249 129 189 137 286 251 194 252 212 -137 -47 -3 -294 -169 -179 -293
3188 -293 -169 -235 124 199 64 273 164 89 323 111 166 152 36 5 25 -252 -332 -167 -208 -103 -167 -6 -29 24
3212 24 227 134 246 119 138 141 199 -59 -71 -91 -36 -24 -145 -69 -55 -230 -193 -55 -43 81 123 310 266 -88 45
3237 45 -134 -11 54 2 -69 -154 -135 -84 -162 -143 -126 18 40 101 84 161 169 114 54 14 155 22 -79 -62 65 -69 -131
$$ packed form
3069b36k3K88j90j64O52l11N0N8m1J31Q7l24K65j7m47K25k55NJ33k40J38J59n1
3092a08M05J7m32K55O7k75K14R4k48k6K0l2j64M0J5j02O3L38j71K6K64j74K5K40
3116C51q2l2r0l6o0K2j38l7oj72P5j49K62J58l4j30J43L5J42J04l44L78M4o48
3140b44L64L8l58q1o7J48K94l12J21q7KJ48K43L9kQ1j79J61j22Oj78k16J26j50
3164b25k0k32J43J10p6J77l4K54J52j20O0n2J49l5n7N8m0l49R0M4k91J25j0j14
3188b93J24o6L59P5j35K09j09p5K34k12N5j4j16l1K0k77q0J65m1J05o4J61k3N3
3212B4K03r3J12j27J9LN8k58j2k0N5J2j21P6J4j75L7J38J2J24M2J87m4l54J33
3237D5j79J23O5n2p1q5J9N1p8J9J7J44K2O1j7P7Qn5o0m0J41j33j01J7J27j34o2
$$ plain form
3264 -131 -105 -70 27 -151 -42 92 -15 37 116 48 65 101 87 240 81 -33 -11 -119 -55 -1 -163 -85 -127 -167 23
3289 23 40 -106 15 209 338 172 -26 43 108 -196 -51 -216 -255 -246 -313 -298 -124 199 151 -104 259 192 156 207
3313 207 219 147 35 84 143 -207 -90 -46 -113 -311 -314 -263 -189 -136 -123 64 1 219 312 134 167 26 79 165 87 93 -94
3340 -94 -238 -39 -128 -340 -51 -159 -218 120 150 61 267 185 -29 329 101 322 39 11 153 -96 -392 -127
3362 -127 -258 -398 -14 -215 -122 71 -111 -163 292 286 335 127 62 67 55 124 178 -189 -20 4 -173 -96 -102 -199 -15
3387 -15 96 137 155 -70 35 155 23 204 191 85 216 -85 -62 -54 42 -81 14 -27 -5 -110 -28 8 83 -122 61
3412 61 79 40 411 -74 191 28 20 -129 -38 -171 -5 -170 -39 -44 56 48 -13 -10 -5 51 89 -78 183 -4 -97 103
3438 103 3 -107 -84 -189 -109 -148 -234 32 87 -126 138 59 -56 275 126 114 106 -12 67 -97 -170 -92 -218 -93
$$ packed form
3264a31K6L5R7j78J09J34j07N2P9o8J7L6j4J53j59j14K2j08O4N4j62P8m2m0J90
3289B3J7j46J21J94J29j66j98O9O5l04J45j65l9Ro7J5J74L23m8k55L63o7l6N1
3313B07J2p2j12M9N9l50J17M4o7j98lN1P4N3J3J87o3K18R3j78L3j41N3Q6p8Oj87
3340i4j44J99q9k12K89j08n9L38L0q9K06q2k14L58k28K21k83k8J42k49k96K65
3362a27j31j40L84k01R3J93j82n2M55oM9k08o5Nj2O9N4l67J69K4j77P7or7J84
3387a5J11M1J8k25J05J20j32J81j3j06J31l01K3QR6j23R5m1K2j05Q2L6P5k05J83
3412F1J8l9L71m85K65j63qj49R1j33J66j65J31nJ00qo1LNN6L8j67K61j87r3K00
3438A03j00j10K3j05Q0l9q6K66N5k13K64p9j15L31j49j2qj18P9j64p3P8j26J25
$$ plain form
3462 -93 -18 -66 -61 0 44 -26 45 166 228 49 221 94 -13 -21 -194 -128 -60 80 -94 -238 -95 -217 138 -13 68
3487 68 131 202 272 94 177 322 160 -6 -82 -83 -117 -3 89 -106 68 -225 -151 -56 -68 53 166 228 184 196 322
3512 322 129 145 335 12 -57 31 -52 -243 -241 91 -336 -142 -1 133 185 41 136 215 -79 179 6 110 149
3535 149 52 123 53 -177 -189 4 -222 -136 -34 -30 -68 176 75 -31 110 267 306 214 80 202 -130 -56 -114 -114 -125
3560 -125 91 -63 -5 -44 -178 21 336 -24 180 192 87 75 45 7 360 29 50 22 -148 -106 50 -58 -91
3583 -91 -26 -9 -161 85 -34 126 51 1 180 -79 63 181 -191 200 -74 21 -137 -176 9 -84 6 -98 72
3606 72 -38 211 -61 224 3 107 1 -64 -100 -13 25 -74 -119 20 -220 -250 -206 -196 39 63 -153 112 59 -20
3630 -20 53 197 -146 -160 59 34 -37 -92 -153 -176 -126 13 24 151 181 -69 9 176 117 65 -124 42 52 -31 108
$$ packed form
3462i3P5m8NO1M4p0P1J21O2j79J72j27j07qj73O6O8J40j74j44J43j22L55j51Q1
3487F8O3P1P0j78Q3J45j62j66p6jl4J14R2j95J74k93P4R5j2J21J13O2m4J2J26
3512C22j93J6J90l23o9Q8q3j91KL32m27J94J41J34N2j44R5P9k94K58j73J04L9
3535A49r7P1p0k30j2J93k26Q6J02Ml8K44j01j06J41J57L9r2j34J22l32P4n8%j1
3560a25K16j54N8l9j34J99L15l60K04J2j05j2l0l8L53l31K1k8j70M2J56j08l3
3583i1O5J7j52K46j19J60p5n0J79k59J42J18l72L91k74R5j58l9J85r3R0j04J70
3606G2j10K49k72K85k21J04j06o5l6Q7L8r9m5J39k40l0M4J0K35K4k16K65n3p9
3630b0P3J44l43j4K19k5p1n5o1k3N0J39J1J27L0k50P8J67n9n2j89J66J0q3J39
$$ plain form
3655 108 31 23 -298 -123 -278 -79 -173 -117 -4 -52 -8 181 94 162 143 106 5 -16 150 100 -264 -396 31 -327
3679 -327 -90 65 -101 -10 -19 -201 171 49 106 109 166 129 102 -85 32 -52 -13 67 -86 -177 -149 -57 30 38 -201 -75
3705 -75 85 102 114 171 115 111 150 57 -239 -123 36 -82 -165 -22 -228 -125 -230 56 81 36 -35 -8 -91 150 -3
3730 -3 -78 166 -73 75 -46 -414 107 -129 5 -166 -173 70 116 186 47 141 -71 1 175 21 -63 -28 63 -106
3754 -106 -194 -41 177 -30 -8 -74 -208 -3 -150 -122 113 130 133 150 -23 93 185 -163 48 124 -190 -150 -135 72
3778 72 -59 -35 -70 77 43 -96 -17 -16 -1 118 107 188 68 99 -105 -22 -148 -204 -74 -203 -40 -46 85 36 -36 104
3804 104 1 -79 200 2 7 208 -80 58 85 -130 -12 -90 -10 -88 -67 -39 -17 -34 -4 82 171 27 295 -126 125
3829 125 -112 107 201 -249 -45 -167 49 -222 11 -251 -50 5 33 -62 121 92 347 192 -4 75 56 -18 224
$$ packed form
3655A08p7ql21J75j55J99r4N6J13m8M4J89q7O8j9l7j01k1J66n0l64j32M27l58
3679c27K37J55j66R1rj82L72j22N7LN7l7k7j87J17q4L9Q0j53r1K8R2Q7Qk39J26
3705g5J60J7J2N7n6mL9r3k96J16J59j18q3J43k06J03j05K86K5m5p1K7q3K41j53
3730cp5K44k39J48j21l68N21k36J34j71pK43M6P0j39R4k12P2J74j54q4L5R1j69
3754a06q8J53K18k07K2o6j34K05j47K8K35J7LJ7j73J16R2l48K11P6l14M0J5K07
3778G2j31K4l5J47l4j39P9JJ5J19j1Q1j20L1k04Q3j26n6J30j29J63oJ31m9p2J40
3804A04j03q0K79j98NK01k88J38K7k15J18p8Q0p8K1K8K2j7L0Q6Q9j44K68m21K51
3829A25k37K19R4m50K04j22K16k71K33k62K01N5K8r5J83k9K55j55j96P9j9p4K42
$$ plain form
3852 224 -62 -64 -38 8 -3 -273 -259 -209 79 -47 -96 87 22 129 242 -5 104 40 -93 -8 -12 149 -63 -165
$$ packed form
3852B24k86kK6M6j1k70J4N0K88j26m9J83o5J07J13k47J09o4j33Q5mJ61k12j02
$$ [...]
8191h8
##END NTUPLES=NMR FID
##END=
