##TITLE=1H_Pr MeO2
 CDCl3
 8 sc, 
 18.10.2022
##JCAMPDX= 6.0         $$ Bruker NMR JCAMP-DX V2.0
##DATA TYPE= NMR FID
##DATA CLASS= NTUPLES
##ORIGIN= UXNMR, Bruker Analytische Messtechnik GmbH
##OWNER= root
$$ XWIN-NMR		Version 3.5
$$ Tue Oct 18 12:10:25 2022 Russian Standard Time (UT+4h)  she@DPX200
##.OBSERVE FREQUENCY= 200.1313499994
##.OBSERVE NUCLEUS= ^1H
##.DELAY= (6, 6)
##.ACQUISITION MODE= SIMULTANEOUS
##.ACQUISITION SCHEME= undefined
##.AVERAGES= 8
##.DIGITISER RES= 18
##SPECTROMETER/DATA SYSTEM= spect
##.PULSE SEQUENCE= zg30
##.SOLVENT NAME= CDCl3
##.SHIFT REFERENCE= (INTERNAL, CDCl3, 0, 15.7039)
##AUDIT TRAIL= $$ (NUMBER, WHEN, WHO, WHERE, WHAT)
$$ ##TITLE= Audit trail, XWIN-NMR		Version 3.5
$$ ##JCAMPDX= 5.01
$$ ##ORIGIN= Bruker BioSpin GmbH
$$ ##OWNER= she
$$ F:/spectra/data/she/nmr/H-F/1/audita.txt
$$ ##AUDIT TRAIL=  $$ (NUMBER, WHEN, WHO, WHERE, WHAT)
(   1,<2022-10-18 12:08:52.85 +0400>,<she>,<DPX200>,
      <created by zg, POWCHK disabled, PULCHK disabled
       configuration hash MD5:
       00 E9 B6 7A A2 85 ED C7 34 08 36 98 17 FE 4E 26
       data hash MD5: 16K
       CA CF AA C3 4B F8 AC 4A D7 7C 43 77 17 62 C3 96>)
$$ ##END=
$$ 
$$ hash MD5
$$ 5F B1 E3 AB B8 86 6F 52 EF E4 04 24 8B 4E 91 CC
##$RELAX= 
##$RELAX= 
##$RELAX= 
##$RELAX= 
##$RELAX= 
##$RELAX= 
$$ Bruker specific parameters
$$ --------------------------
##$DU= <F:/spectra>
##$EXPNO= 1
##$NAME= <H-F>
##$PROCNO= 1
##$TYPE= <nmr>
##$USER= <she>
##$AMP= (0..31)
100 100 100 100 100 100 100 100 100 100 100 100 100 100 100 100 100 100 
100 100 100 100 100 100 100 100 100 100 100 100 100 100 
##$AQSEQ= 0
##$AQ_mod= 1
##$AUNM= <au_zg>
##$AUTOPOS= <>
##$BF1= 200.13
##$BF2= 200.13
##$BF3= 200.13
##$BF4= 200.13
##$BF5= 200.13
##$BF6= 200.13
##$BF7= 200.13
##$BF8= 200.13
##$BYTORDA= 1
##$CFDGTYP= 0
##$CFRGTYP= 5
##$CHEMSTR= <none>
##$CNST= (0..31)
1 1 145 1 1 1 1 1 1 1 1 1 1 1 1 1 1 1 1 1 1 1 1 1 1 1 1 1 1 1 1 1 
##$CPDPRG= <>
##$CPDPRG1= <>
##$CPDPRG2= <>
##$CPDPRG3= <>
##$CPDPRG4= <mlev>
##$CPDPRG5= <mlev>
##$CPDPRG6= <mlev>
##$CPDPRG7= <mlev>
##$CPDPRG8= <mlev>
##$CPDPRGB= <>
##$CPDPRGT= <>
##$D= (0..31)
0 1.2 0 0 0 0 0 0 0 0.06 0 0.03 0 0 0 0 0.0002 0 0 0 0 0 0 0 0 0 0 0 0 
0 0 0 
##$DATE= 1666080532
##$DBL= (0..7)
120 120 120 120 120 120 120 120 
##$DBP= (0..7)
150 150 150 150 150 150 150 150 
##$DBP07= 0
##$DBPNAM0= <>
##$DBPNAM1= <>
##$DBPNAM2= <>
##$DBPNAM3= <>
##$DBPNAM4= <>
##$DBPNAM5= <>
##$DBPNAM6= <>
##$DBPNAM7= <>
##$DBPOAL= (0..7)
0.5 0.5 0.5 0.5 0.5 0.5 0.5 0.5 
##$DBPOFFS= (0..7)
0 0 0 0 0 0 0 0 
##$DE= 6
##$DECBNUC= <off>
##$DECIM= 32
##$DECNUC= <off>
##$DECSTAT= 4
##$DIGMOD= 1
##$DIGTYP= 9
##$DL= (0..7)
0 120 120 120 120 120 120 120 
##$DP= (0..7)
150 150 150 150 150 150 150 150 
##$DP07= 0
##$DPNAME0= <>
##$DPNAME1= <>
##$DPNAME2= <>
##$DPNAME3= <>
##$DPNAME4= <>
##$DPNAME5= <>
##$DPNAME6= <>
##$DPNAME7= <>
##$DPOAL= (0..7)
0.5 0.5 0.5 0.5 0.5 0.5 0.5 0.5 
##$DPOFFS= (0..7)
0 0 0 0 0 0 0 0 
##$DQDMODE= 0
##$DR= 18
##$DS= 0
##$DSLIST= <SSSSSSSSSSSSSSS>
$$ [...]
##$SUBNAM2= <"">
##$SUBNAM3= <"">
##$SUBNAM4= <"">
##$SUBNAM5= <"">
##$SUBNAM6= <"">
##$SUBNAM7= <"">
##$SUBNAM8= <"">
##$SUBNAM9= <"">
##$SW= 18.0517283424941
##$SWIBOX= (0..15)
0 0 2 0 0 0 0 0 0 0 0 0 0 0 0 0 
##$SW_h= 3612.71676300578
##$TD= 16384
##$TD0= 1
##$TE= 0
##$TE2= 300
##$TE3= 300
##$TEG= 300
##$TL= (0..7)
0 120 120 120 120 120 120 120 
##$TP= (0..7)
150 150 150 150 150 150 150 150 
##$TP07= 0
##$TPNAME0= <>
##$TPNAME1= <>
##$TPNAME2= <>
##$TPNAME3= <>
##$TPNAME4= <>
##$TPNAME5= <>
##$TPNAME6= <>
##$TPNAME7= <>
##$TPOAL= (0..7)
0.5 0.5 0.5 0.5 0.5 0.5 0.5 0.5 
##$TPOFFS= (0..7)
0 0 0 0 0 0 0 0 
##$TUNHIN= 0
##$TUNHOUT= 0
##$TUNXOUT= 0
##$USERA1= <user>
##$USERA2= <user>
##$USERA3= <user>
##$USERA4= <user>
##$USERA5= <user>
##$V9= 5
##$VALIST= <valist>
##$VCLIST= <CCCCCCCCCCCCCCC>
##$VD= 0
##$VDLIST= <DDDDDDDDDDDDDDD>
##$VPLIST= <PPPPPPPPPPPPPPP>
##$VTLIST= <TTTTTTTTTTTTTTT>
##$WBST= 1024
##$WBSW= 4
##$XGAIN= (0..3)
0 0 0 0 
##$XL= 0
##$YL= 0
##$YMAX_a= 33847
##$YMIN_a= -50359
##$ZGOPTNS= <>
##$ZL1= 120
##$ZL2= 120
##$ZL3= 120
##$ZL4= 120
##$ABSF1= 10
##$ABSF2= 0
##$ABSG= 5
##$ABSL= 3
##$ALPHA= 0
##$AQORDER= 0
##$ASSFAC= 0
##$ASSFACI= 0
##$ASSFACX= 0
##$ASSWID= 0
##$AUNMP= <proc_1d>
##$AZFE= 0.1
##$AZFW= 0.1
##$BCFW= 1
##$BC_mod= 2
##$BYTORDP= 1
##$COROFFS= 0
##$CY= 11.3945322036743
##$DATMOD= 1
##$DC= 2
##$DFILT= <>
##$DTYPP= 0
##$F1P= 2.36226072786647
##$F2P= -0.459571619588291
##$FCOR= 0.5
##$FTSIZE= 0
##$FT_mod= 4
##$GAMMA= 1
##$GB= 0.15
##$INTBC= 1
##$INTSCL= 1
##$ISEN= 128
##$LB= 0.24
##$LEV0= 0
##$LPBIN= 0
##$MAXI= 10000
##$MC2= 0
##$MEAN= 0
##$ME_mod= 0
##$MI= 1.114404
##$NCOEF= 0
##$NC_proc= 0
##$NLEV= 6
##$NOISF1= 3.799351
##$NOISF2= 2.8
##$NSP= 1
##$NTH_PI= 0
##$NZP= 0
##$OFFSET= 15.70392
##$PC= 1
##$PHC0= -18049.05
##$PHC1= 38.4007
##$PH_mod= 1
##$PKNL= yes
##$PPARMOD= 0
##$PSCAL= 0
##$PSIGN= 0
##$REVERSE= no
##$SF= 200.130013532006
##$SI= 16384
##$SIGF1= 3
##$SIGF2= 2
##$SINO= 400
##$SIOLD= 16384
##$SREGLST= <1H.CDCl3>
##$SSB= 0
##$STSI= 0
##$STSR= 0
##$SW_p= 3612.71676300578
##$SYMM= 0
##$S_DEV= 0
##$TDeff= 0
##$TDoff= 0
##$TI= <>
##$TILT= no
##$TM1= 0
##$TM2= 0
##$TOPLEV= 0
##$USERP1= <user>
##$USERP2= <user>
##$USERP3= <user>
##$USERP4= <user>
##$USERP5= <user>
##$WDW= 1
##$XDIM= 8192
##$YMAX_p= 0
##$YMIN_p= 0
$$ End of Bruker specific parameters
$$ ---------------------------------
##NTUPLES= NMR FID
##VAR_NAME=  TIME,          FID/REAL,        FID/IMAG
##SYMBOL=    X,             R,               I
##VAR_TYPE=  INDEPENDENT,   DEPENDENT,       DEPENDENT
##VAR_FORM=  AFFN,          ASDF,            ASDF
##VAR_DIM=   8192,          8192,            8192
##UNITS=     SECONDS,       ARBITRARY UNITS, ARBITRARY UNITS
##FACTOR=    0.0002768,     1,               1
##FIRST=     0,             0,               0
##LAST=      2.2672688,     0,               0
##MIN=       0,             -50359,          0
##MAX=       2.2672688,     33847,           0
$$ Real data points
##PAGE= N=1
##DATA TABLE= (X++(R..R)), XYDATA
0 0 0 0 0 0 0 0 0 0 0 0 0 0 0 0 0 0 0 8 -8 8 -8 8 -8 16 -16 16 -23 24 -26 32 -35 40 -48 54 -59 66 -75 84 -95
39 -95 105 -118 130 -145 161 -177 196 -216 239 -263 290 -320 352 -388 428 -473 524 -581 646 -723
59 -723 813 -919 1049 -1215 1429 -1716 2132 -2782 3966 -6817 33847 1019 -30859 23231
73 23231 14212 1120 18652 8402 -25857 2020 18207 -8880 -4908 15623 -11194 -17105 15845
86 15845 10404 -13975 1423 4361 -13102 433 12743 -13341 -13130 10414 293 -10090 9012
99 9012 3719 -12347 9524 21045 -4609 -4837 10466 -379 -568 16364 -1031 -21309 -851
112 -851 8527 -7652 -1928 3631 -16434 -12767 9952 2233 -7692 920 -7327 -16248 6001 11917
126 11917 -10357 -9578 1817 -6334 -1068 14507 661 -11348 5781 10649 -618 6271 9591
139 9591 -5369 -800 12314 133 -8125 3414 827 -7511 2268 2252 -11508 -3988 7290 -2200
153 -2200 -5045 2942 -4297 -7806 7011 6435 -7071 -3042 2361 -3702 3024 11379 -937 -6322 5304
168 5304 6099 2035 8802 5423 -6638 -528 8535 1294 -1368 2292 -5548 -8019 2870 2250 -6572
183 -6572 -3079 -481 -5813 -1535 4246 -3205 -5136 2577 555 -3593 1594 1951 -2944 2152 4914
198 4914 -1294 -328 6018 2765 1150 5865 2512 -2644 2015 4787 -340 -708 17 -4925 -4041 2161
214 2161 -206 -5185 -3152 -2462 -3368 633 1977 -2985 -3055 374 -410 255 3518 1017 -2106 1211 2871
231 2871 1116 3020 3961 91 459 3306 1996 441 1938 955 -2069 -598 -125 -2401 -2538 -1035
247 -1035 -3073 -3889 -2063 -1872 -2166 -774 -843 -2291 -1474 603 511 630 1545 406 95 2018 2779 2042
265 2042 2164 2123 904 1284 2526 1976 707 376 -633 -493 -407 -525 -1770 -2300 -2465 -2299 -1812 -1515 -1734
284 -1734 -2097 -1597 -1208 -665 -77 232 516 539 604 1460 2055 2186 1990 1936 1444 1370 1986 1846 957 578 9
305 9 -388 -419 -236 -917 -1638 -1695 -2181 -2070 -1423 -1507 -1899 -1715 -1131 -1483 -653 -73 -360 12 670 1038 1040 1993 2185
328 2185 1322 1746 2508 1583 1444 1702 1111 324 488 371 -501 -728 -400 -1555 -1460 -962 -1583 -2031 -1439 -1428
348 -1428 -2076 -848 -709 -1016 -1009 -96 -55 99 844 1044 829 1489 1971 1815 1998 2189 1546 934 1194 1097 100
369 100 -126 164 -1017 -1541 -877 -1128 -1849 -1463 -1440 -2272 -1372 -634 -1306 -1587 -610 -1074 -1138 147 447 -206
389 -206 468 1656 596 806 2628 1908 1291 2095 1734 319 1128 1795 -378 -865 -70 -1442 -1822 -55
407 -55 -949 -3033 -1738 -945 -2152 -824 474 -1815 -2385 422 468 -594 951 720 -1420 982 3097
424 3097 816 725 2767 1030 613 3071 2263 -693 1142 1762 -1289 -383 1294 -1931 -2651 668 -717
441 -717 -3186 -869 -622 -2899 54 1361 -2655 -2175 1970 503 -743 2282 325 -2415 1887 4094
457 4094 342 507 2604 -484 763 5185 2036 -2236 801 1029 -1682 1382 1549 -4156 -3879 838
473 838 -1350 -2526 440 -2258 -5118 816 2469 -2802 -1279 1389 -1699 -465 3903 86 -2886
488 -2886 2303 2947 -710 2069 3030 -2201 303 5469 770 -2411 1634 -75 -2640 2833 2209 -5444
504 -5444 -3663 1035 -1976 -1702 1414 -3639 -5550 2184 3095 -1948 45 565 -3586 643 6269 200
520 200 -3086 1978 1188 -504 5239 3424 -3788 -265 4817 408 68 2999 -2482 -4049 3454 2138
536 2138 -4658 -1935 -271 -4233 -108 3038 -4279 -5137 2345 1222 -1766 2021 217 -4440 1780
551 1780 6475 -502 -1530 1971 -972 -54 6568 2469 -4381 288 3040 -454 2352 3346 -5029 -4518
567 -4518 3726 1282 -2971 -129 -2104 -5826 1143 4074 -3825 -3842 1064 -1449 -523 5028 357 -4933
583 -4933 1721 4390 68 1530 2723 -3013 -831 6612 1768 -3115 1149 961 -2114 2865 3158 -5069
599 -5069 -3342 2295 -604 -2074 1002 -3301 -5911 1700 3093 -3050 -1697 320 -3171 376 5737
614 5737 62 -3909 1726 2527 -61 4026 2747 -3932 -551 5194 1368 -713 1826 -1789 -3065
629 -3065 3444 2698 -3984 -1953 443 -2833 -594 2529 -3289 -5048 977 850 -2257 932 271 -3817
645 -3817 651 4558 -285 -1279 2224 523 -151 4740 2260 -3010 571 3479 104 766 2084 -2570
661 -2570 -2471 3008 1377 -2460 -550 -957 -3221 235 2041 -3088 -3514 268 -572 -795 2000 43 -3174
678 -3174 678 3048 5 1038 2143 -849 107 4027 1556 -1008 1039 1124 -1138 1322 1988 -2260
694 -2260 -1883 1256 -586 -1792 8 -1488 -2812 391 636 -2417 -1487 -12 -1569 -276 1874 -398
710 -398 -1975 1075 1666 213 1622 1662 -534 887 3258 1239 -117 1120 95 -609 1542 1107 -1651
727 -1651 -1182 -78 -1236 -579 372 -1409 -2649 -244 -309 -1370 -236 -493 -1704 -238 1077 -87 -253
744 -253 1273 704 340 1543 1396 81 1242 1788 462 395 1056 130 -175 663 -197 -1225 -806 -499 -1183
763 -1183 -841 -771 -1679 -1568 -260 -532 -827 -257 -553 -957 279 574 432 450 754 342 668 1682 1294 689
783 689 1041 778 234 973 781 284 -170 176 -362 -555 -80 -611 -1084 -1209 -1130 -1276 -901 -621 -940 -920 -539
804 -539 -405 -128 584 321 229 628 723 744 1291 1206 774 568 622 831 1085 853 118 61 -246 -361 -319 -281 -747
827 -747 -1318 -982 -876 -961 -553 -794 -1245 -922 -433 -163 66 683 283 84 345 992 882 964 1025 537 323
848 323 1031 1039 875 579 123 -209 -120 33 -72 -453 -680 -1114 -1139 -780 -847 -723 -946 -959 -993 -748 -130 305 -96
871 -96 -176 95 352 683 1180 646 500 556 751 723 897 607 386 -81 193 -245 62 267 -393 -860 -874 -586
893 -586 -980 -674 -457 -1285 -1357 -467 -329 -396 91 85 -686 134 869 694 686 1056 500 334 1356 1032 594 773
915 773 614 -136 115 605 -338 -592 -74 -605 -1240 -298 -118 -1337 -898 -411 -1256 -904 134 -663 -462 623
935 623 -105 -646 807 1393 160 687 1050 47 575 2210 769 -146 469 348 -611 679 1167 -1236
953 -1236 -1153 8 -774 -903 587 -954 -2034 -407 186 -1377 -484 150 -1419 -719 1278 219 -628
970 -628 932 719 -252 1554 1889 -638 442 1758 690 -64 1183 -188 -1166 1325 887 -1636 -923
987 -923 327 -1169 -612 940 -1629 -2814 284 364 -1170 -339 -55 -2408 -277 2486 286 -641 1041
1004 1041 55 -177 2883 2044 -1467 121 1676 -55 1112 1776 -997 -1993 1204 832 -1260 47
1020 47 -260 -2726 -102 1701 -1571 -2077 98 -669 -1141 1509 191 -2613 111 2052 23 0 1482
1037 1482 -773 -512 3350 1676 -1037 643 1116 -801 1710 2284 -1891 -1724 1365 160 -1068 877
1053 877 -1231 -3661 175 1464 -1409 -1356 206 -1912 -834 2775 225 -2544 167 953 -330 1906
1069 1906 2053 -1734 -425 2908 1029 -360 1296 -237 -1420 1990 2265 -1797 -1377 536 -1083 -325
1085 -325 1836 -1673 -3541 -8 1243 -1151 66 35 -2843 -768 2990 190 -1389 829 244 -693
1101 -693 2609 2240 -2206 -97 2620 674 791 2262 -825 -2107 1953 1564 -1440 -254 45 -2466
1117 -2466 -72 2344 -1456 -3085 -30 -264 -1031 1189 63 -3075 -572 2343 -44 -185 1300 -1034
1133 -1034 -860 2870 1900 -1281 550 1376 -500 1356 2084 -1388 -1583 1500 554 -812 744 -505
1149 -505 -2562 151 1570 -1551 -1576 72 -1544 -802 1917 -111 -2393 -59 1126 -595 1042 1303
1165 1303 -1354 -326 2615 1286 -440 1076 352 -1111 1811 1875 -1265 -685 585 -757 -279 1328
1181 1328 -930 -2267 -111 644 -1355 -383 -60 -1751 -743 1717 -204 -1567 554 225 -339 1692
1197 1692 1221 -890 378 1915 807 448 1395 121 -819 1510 1088 -949 -126 82 -1144 -8 1191
1214 1191 -865 -1852 -223 -91 -918 223 -328 -1690 -342 953 -488 -334 905 -433 -101 1377
1230 1377 932 -386 531 1184 335 608 1272 29 -162 900 353 -791 458 -198 -1021 73 392 -978
1248 -978 -930 -262 -778 -777 225 -622 -786 -179 305 -189 164 388 -32 318 1142 490 334 854 757 224 668
1269 668 1027 26 276 519 97 -268 228 -301 -825 -373 -338 -787 -427 -326 -749 -684 -9 -527 -397 174
1289 174 307 -178 281 365 44 587 666 495 506 841 626 650 607 325 267 389 357 45 -120 -68 -459 -529 -170
1312 -170 -255 -715 -517 -218 -628 -357 -97 -368 -276 -171 17 -162 407 177 226 349 525 313 752 869 667
1333 667 400 571 153 101 149 127 -153 -439 -142 -646 -479 -602 -285 -515 -329 -447 -429 -422 -76 -185 -171 36
1355 36 -319 371 380 193 386 330 902 553 464 592 546 463 582 374 102 302 -85 -243 -385 -351 -590 -361 -480
1378 -480 -683 -719 -619 -525 -425 -257 -102 -312 -147 84 22 532 113 259 419 484 518 359 568 714 327 549
1400 549 536 209 -157 1 -84 -397 -337 -202 -568 -519 -234 -661 -733 -202 -775 -588 71 -190 -287 266 222 198 341
1423 341 529 213 152 611 591 279 620 532 111 466 357 -151 -89 251 -578 -373 135 -368 -1087 -335 -188
1444 -188 -714 -319 -66 -540 -443 312 2 -427 396 236 -190 500 955 35 263 654 184 320 917 142
1464 142 -214 496 493 -392 95 249 -704 -424 187 -658 -730 0 -351 -836 -64 283 -1233 -269 635 -225 216
1485 216 689 -379 -372 1113 999 63 355 660 -158 803 1236 57 -615 424 349 -337 379 -119 -1364
1504 -1364 -321 301 -714 -1026 -289 -1034 -953 880 -105 -1278 -303 526 54 395 1069 -654 -642 1369
1522 1369 997 -65 692 311 -450 833 1372 -256 -736 511 -236 -535 831 -211 -1508 -297 513
1539 513 -657 -267 131 -1392 -927 932 286 -1141 168 101 -322 947 1210 -1095 -497 1074 434 349
1557 349 1280 -24 -1282 934 1715 -405 -55 141 -1408 -85 1208 -228 -1585 -229 -217 -1019 488
1574 488 340 -1887 -1134 834 -278 -413 825 -551 -818 1361 1298 -646 -28 908 14 697 1843 -252
1592 -252 -822 1083 853 -321 478 105 -1611 -235 1527 -589 -1206 -238 -619 -555 1027 30 -1922 -751
1610 -751 556 -399 372 1197 -1004 -1127 1306 1008 -173 779 149 -626 1148 1945 -485 -731 806 -78
1628 -78 -240 1068 31 -2004 -197 584 -795 -696 120 -1481 -1041 881 -270 -1382 -143 186 -537
1645 -537 794 1208 -914 -419 1293 749 93 985 -72 -1054 1069 1736 -68 -394 202 -640 179 1570
1663 1570 -235 -1710 17 72 -896 326 306 -1534 -1053 714 -246 -574 467 -96 -811 657 1062 -682
1681 -682 -216 843 -58 574 1377 -154 -751 982 899 -254 249 216 -861 21 938 -633 -971 56
1699 56 -326 -885 292 41 -1288 -394 486 -186 -230 361 -534 -536 837 710 -375 405 305 -275 690 1142
1719 1142 192 -100 719 383 -151 649 195 -896 -14 401 -567 -411 27 -809 -933 225 -117 -1137 -323
1738 -323 148 -555 66 444 -354 -87 520 143 -42 613 460 -139 457 922 326 45 350 -104 138 705
1758 705 -35 -794 62 60 -303 2 -145 -676 -585 -235 -419 -328 -52 -251 -617 118 558 14 171 415 -75
1779 -75 190 535 382 330 510 602 -195 86 243 -91 -33 222 -258 -601 -53 -275 -538 -290 -285 -739 -559 -215
1801 -215 -251 -328 -112 -181 -239 282 272 -171 226 341 107 265 481 407 215 229 127 125 105 160 -110 -33 74 -140
1825 -140 -216 46 -409 -401 -473 -597 -307 -286 -36 -479 -471 129 -276 -47 317 -203 22 432 362 107 410 333 236
1848 236 86 374 454 180 79 82 -36 -261 -46 -128 -208 -370 -211 -346 -306 -146 -466 -159 -216 -216 -138 0 85 31
1872 31 142 82 215 378 252 264 429 481 499 365 367 324 255 -67 -141 -175 4 9 -37 -235 -363 -272 -286 -138 -376
1897 -376 -203 -152 -134 -242 -33 13 -144 87 280 186 367 359 264 261 372 314 360 300 425 -53 284 78 -210 -32
1921 -32 145 -311 -408 -202 -160 -469 -287 -508 -476 -145 -313 -491 -84 138 137 241 181 147 -27 500 247 210 189
1944 189 596 264 -234 169 153 -42 80 -60 -203 -131 -26 -363 -275 -169 -260 -275 113 -159 -641 -262 -317 -423
1966 -423 -228 61 -139 -179 563 418 71 560 491 16 307 388 89 15 184 239 -122 207 208 -551 9 170
1988 170 -390 -458 -2 -794 -511 88 -116 -464 -415 -111 -359 65 483 -163 -217 611 635 156 605 332 -251
2009 -251 64 738 130 98 447 -65 -281 323 174 -609 -128 32 -511 -73 227 -667 -811 265 72 -448
2029 -448 188 135 -490 439 470 -313 65 240 135 137 762 410 -584 307 568 -36 474 218 -749 -165 545
2050 545 -288 -627 -5 -466 -590 289 -33 -940 -554 41 -405 -149 481 -75 -879 583 618 -231 415 555
2070 555 -240 244 938 186 -192 504 164 -298 683 336 -862 -291 565 -207 -303 142 -478 -711 632 191
2090 191 -968 -258 -55 -557 167 821 -590 -747 677 506 25 460 257 -468 198 1118 363 -205 516
2109 516 -269 -238 912 152 -878 6 209 -191 -22 135 -939 -739 417 100 -573 176 18 -976 393
2128 393 726 -583 -414 538 188 192 907 431 -777 457 749 -31 398 429 -395 -196 815 29 -708 -86
2148 -86 -50 -549 386 354 -925 -720 222 -219 -227 180 -643 -1003 415 534 -444 -117 424 -329 491 1173 -159
2169 -159 -310 537 376 43 709 533 -407 -131 682 -55 -710 -86 -571 -511 846 237 -746 -245 -20 -275
2189 -275 61 533 -181 -666 388 366 -57 474 159 -432 569 877 388 -125 628 14 -124 638 324 -847
2209 -847 -8 236 -256 -96 -56 -487 -798 327 61 -513 -425 3 -741 99 523 -447 -474 457 -148 137 686
2230 686 226 -102 328 397 -64 38 280 82 -133 384 136 -671 -110 118 -328 96 342 -477 -547 46 -189
2251 -189 -158 -91 -189 -460 211 320 -71 21 142 61 178 684 105 -37 157 236 71 410 333 -244 -201 392 -79
2274 -79 -302 104 -1 -258 217 -75 -322 -251 -41 -276 -305 31 -222 -327 4 293 -381 207 21 131 86
2295 86 518 33 110 325 220 -18 353 669 -245 127 290 45 -70 157 -195 -300 137 40 -155 -36 134
2316 134 -141 -161 24 -70 -181 17 253 126 35 95 86 400 91 209 478 312 155 51 72 73 -96 243 145
2339 145 -233 110 -216 -157 40 -216 -77 -272 -255 -346 -66 -240 145 -98 -19 -202 -32 292 -166 158 210 280
2361 280 178 410 242 88 233 355 -39 -58 145 55 -36 -41 -273 -134 -144 -322 -205 -35 -330 -162 -122 -317
2383 -317 -359 -297 39 58 -80 120 -206 -127 350 248 303 190 173 212 119 110 234 43 62 -95 -67 118 -102 256
2407 256 -140 -265 -245 -146 -344 -277 -317 -364 -276 55 -57 -352 -12 -94 16 97 176 215 85 326 154 260 129
2430 129 216 163 147 133 -260 -135 -18 43 81 -138 -70 -408 -206 -260 -277 -17 -38 -297 -106 -233 -159 -306 81 281
2454 281 -8 170 198 24 25 110 215 505 408 117 -62 279 -27 2 94 -110 17 -120 -137 -425 -351 19 -378
2477 -378 -419 -387 2 -121 -30 198 -205 -54 376 47 120 61 319 -37 75 95 248 193 141 -20 -191 180 -46
2500 -46 6 110 9 -210 15 110 -224 -489 -117 -330 -119 20 -102 -346 185 -12 -77 121 286 -54 83
2521 83 233 213 -375 458 278 61 503 413 10 6 423 147 -248 -137 8 -481 -14 -44 -534 -251 -18 -296
2543 -296 -326 121 -49 -462 6 230 -256 377 111 -160 -76 521 256 -49 492 -50 119 446 439 -350 -152
2564 -152 382 -66 -74 166 -515 -568 175 203 -610 -88 -328 -432 -25 414 -167 -588 88 -64 155 384 10
2585 10 -341 234 127 -7 28 444 -89 -347 699 186 -456 -169 -223 -361 143 298 -576 -490 -18 -98 -247
2606 -247 84 -183 -451 211 208 -293 -44 81 -482 211 254 339 -544 445 612 7 619 342 -582 52 657
2627 657 93 -496 102 -205 -332 373 419 -295 -478 58 35 -96 490 -348 -947 13 37 -106 184 -49 -627
2648 -627 -112 752 257 -199 188 -27 -169 363 213 -366 -24 336 -77 150 188 -374 -336 136 208 -326 -367
2669 -367 -247 -709 -218 358 -362 -433 -20 6 -419 497 152 -442 -43 897 233 -50 337 -151 59 690 406
2690 406 -168 30 118 -235 102 661 -134 -308 -126 25 -390 201 -304 -622 -149 296 -277 -324 129 80 -272
2711 -272 293 4 -386 -18 452 -191 344 198 -34 -44 273 142 -159 172 -49 -438 228 172 -370 -215 -81
2732 -81 -288 48 84 -119 -534 -69 310 -203 -18 33 15 -49 283 -169 -81 182 207 167 25 211 -36 6 268
2755 268 -304 -63 452 85 -38 -78 125 -374 -21 -5 -111 133 17 -503 -368 1 119 -353 133 101 -192
2776 -192 -53 284 -48 125 49 233 -23 380 77 221 -11 228 -58 60 60 -176 -174 -180 66 -125 -206 -12 -177
2799 -177 80 59 -335 -193 -20 -58 -149 137 -36 -402 160 383 12 458 467 369 11 146 248 -46 158 142
2821 142 -32 197 105 -146 -167 148 -153 -131 -299 -340 -200 -50 -186 -26 -238 -59 79 -63 46 418 56
2842 56 252 68 237 14 -27 221 13 160 236 203 -46 48 -172 21 -48 -104 -58 56 7 -168 -335 -42 -117
2865 -117 -346 -78 -75 28 -40 58 -255 151 -94 104 -47 122 92 139 503 109 295 113 -77 82 1 147
2887 147 -65 66 -159 12 -157 70 -26 -43 -210 -213 -302 -287 -201 -272 73 38 -22 76 23 -187 136 379 149 260
2911 260 2 87 116 195 5 1 -178 286 -49 6 -303 -248 -180 123 -48 -130 -54 -189 -183 -194 -85 -171 137 -206 -111
2936 -111 118 88 27 82 187 157 309 132 121 227 183 391 176 154 -15 -191 -75 -55 -11 -129 -259 7 -100
2959 -100 -397 -192 100 -209 -8 -189 -76 24 -13 146 154 195 99 238 98 194 188 23 421 210 -12 14 -111
2982 -111 223 3 -17 -88 13 85 -112 -103 -60 0 -319 77 -230 -257 -136 115 -69 158 -157 25 76 213 -71
3005 -71 -237 207 10 54 221 398 -149 90 206 20 -166 -28 36 -189 83 -145 -390 61 0 -43 104 -23
3027 -23 28 -166 -23 30 -113 206 168 -141 99 164 155 -97 169 59 -55 271 28 -292 148 -23 17 10 174
3050 174 73 100 -83 -234 -453 7 -26 -298 -34 396 -37 -403 84 -170 -162 220 240 -155 172 248 -67 -65 107
3073 107 -40 58 267 431 -5 -34 -63 -327 85 489 -402 -153 160 -13 112 256 -240 -334 -43 -8 -233 -22
3095 -22 143 -439 155 319 -20 -133 -109 150 66 342 355 -177 105 367 -68 -15 216 79 -431 198 221 -286
3117 -286 -268 -16 -554 -499 306 -185 -359 -123 -114 -358 173 167 -294 190 264 212 -109 331 -194 -74 506 279 -162
3140 -162 115 142 -212 31 158 -370 -355 305 186 -21 -5 -169 -443 184 205 55 -247 63 -66 -334 268
3161 268 54 -457 127 143 134 274 295 -264 -232 318 244 -197 256 117 -109 270 436 -166 -490 334 -145 29
3183 29 202 -120 -575 -131 188 -314 -177 -71 -264 -136 259 35 -128 150 131 -56 348 283 -351 -100 77
3204 77 130 -131 162 -68 -358 198 155 -108 48 -100 -415 -152 240 -110 -275 -135 16 -219 16 -143 -453
3225 -453 95 99 -36 -180 229 179 12 298 305 -236 -18 193 59 247 210 -223 -123 327 -57 148 -46 -233
3247 -233 -183 -200 150 -202 -448 49 -235 -227 308 -3 -134 147 224 -49 105 -33 -172 -87 -24 30 -150 61 327
3270 327 -230 22 189 -186 -84 -25 19 9 90 27 -131 19 106 -199 18 -4 20 78 -4 -96 -270 -86 -162 29
3294 29 124 188 -178 84 126 119 57 357 31 71 -103 105 -5 109 0 -88 155 98 -311 -401 -106 -143 -3 115
3318 115 -27 -178 -77 -81 -94 26 189 -169 19 -14 69 360 134 247 -41 39 201 -151 49 138 12 40 -233
3341 -233 160 164 -176 -31 -106 -259 112 -215 -114 -48 -18 -83 -294 205 50 98 85 -108 -118 226 362 152 -204
3364 -204 78 50 100 222 79 -185 115 -134 -5 83 -192 187 -268 -291 -169 -261 -165 -258 -98 -133 -108 0 61
3387 61 0 -53 -116 50 -75 206 67 92 -17 92 61 -11 217 105 64 14 166 59 -15 33 -120 -54 -97 -13 120
3412 120 -108 -121 -91 108 56 -189 -139 159 36 -72 228 154 -93 118 237 -30 176 81 252 223 64 237
3434 237 72 -97 -37 -122 -55 89 94 -63 -40 -323 -228 -34 49 -81 99 -128 -113 -142 281 59 -237 128 88 -42
3458 -42 117 -190 184 45 418 220 172 326 248 69 140 100 -215 -136 281 63 -200 124 -187 -314 -185 129
3480 129 -297 82 76 9 -221 -19 154 -25 142 25 85 124 9 -87 286 39 58 50 207 -203 -33 -97 24
3503 24 148 -22 33 -88 39 171 28 -67 -338 -226 48 133 46 157 -265 -42 -90 124 244 -66 206 214 121
3526 121 -249 30 -102 -267 370 3 -47 -130 84 -241 36 6 -184 -71 -21 -45 7 23 -34 222 -132 246 287
3549 287 -46 268 78 96 -4 -31 16 218 262 8 -45 72 -84 -70 339 6 85 -300 123 -57 -208 182
3571 182 -112 -387 -18 -139 -103 -232 73 -399 -23 155 108 -86 96 89 -282 292 419 -46 -262 166 -157
3592 -157 170 211 -241 -76 312 293 -243 0 19 -113 23 69 54 -205 -8 -214 -72 71 232 -52 -51 84
3614 84 -140 171 5 -136 27 357 105 142 136 116 63 -56 419 -126 -77 20 -52 -108 144 142 -98 88 68 -142
3638 -142 -384 -179 -424 -204 97 -89 -467 96 80 -55 42 288 159 -48 145 -267 103 -25 78 -113 180
3659 180 315 -25 62 83 -102 -68 281 55 -285 -97 271 -64 -69 -92 -463 -174 76 89 -104 131 -103 -82 119
3682 119 268 -312 82 249 -10 60 245 -84 -215 195 224 -178 35 97 -381 -231 108 -45 -262 131 -127
3703 -127 202 29 79 -566 -216 -37 113 183 29 -39 -82 37 92 -83 120 329 46 82 345 77 -75 75
3725 75 92 54 113 39 98 29 -14 -52 16 78 -112 -309 32 118 -181 136 224 84 -74 195 -33 -161 204 54
3749 54 -75 194 165 -56 288 51 152 50 185 -104 -30 318 -138 -161 124 2 -152 62 -183 -174 -73 -81 30
3772 30 -42 207 42 -373 125 168 -60 -9 -255 -11 97 -23 -144 -85 103 91 59 117 33 -18 72 33 -217 -428
3796 -428 -47 -123 -226 -215 15 -278 79 -66 -24 -60 -41 -143 -154 -176 169 -54 -24 373 90 110 184 -165 89
3819 89 108 -18 -146 26 11 115 -116 33 -87 -93 151 -62 211 -94 -140 54 87 79 -53 -28 -69 -134 -83 194
3843 194 295 149 -149 30 35 178 233 83 199 -16 356 339 223 -27 91 75 -51 -57 35 9 -139 -34 86
3866 86 87 -232 -28 -98 -107 350 137 82 133 -82 99 43 -87 84 217 103 63 125 155 1 -97 -315 -14 121
3890 121 -232 245 -127 -102 267 -112 -319 54 -84 -165 -57 164 128 72 124 -9 65 16 168 25 54 212 196
3913 196 -64 189 195 -1 33 139 -39 154 129 -41 -22 -203 -166 74 -15 30 101 -41 173 -48 -108 -82 -87 -3 167
3938 167 199 62 78 119 -165 163 128 200 136 -30 234 118 252 73 74 1 143 79 -167 4 -14 169 -142 105
3962 105 103 -110 172 45 17 -21 -318 -207 55 61 113 279 195 -81 116 -92 34 -51 113 52 -201 -93 2 51
3986 51 195 105 -35 -241 120 44 -5 130 33 -113 -79 72 -26 -23 4 -94 20 121 39 -81 63 44 70 -96 134
4011 134 -185 17 -36 -40 54 88 -10 -101 -53 -40 -18 -176 -236 -137 -196 -52 -8 -101 68 -31 -276 -112 -67 -238 109 301
4037 301 -14 80 69 -116 118 189 262 2 17 444 143 123 -51 22 98 33 -241 -163 51 -24 -63 -72 -70 21 -145 238
4063 238 -192 136 -86 88 11 51 -10 143 131 -32 -198 87 108 -24 -182 26 105 -12 -77 -9 64 -114 130
4086 130 -121 1 -278 -159 11 44 -32 -76 3 -81 -24 4 167 -210 -66 71 158 -215 100 -136 -40 136 54
4109 54 -90 153 240 127 -81 137 142 -57 -88 -106 -159 -387 126 -274 -215 2 -95 -172 -31 -135 -138 -37 422 -219
4133 -219 -222 74 81 159 100 170 114 132 293 58 55 143 126 133 246 -93 -132 127 -111 301 -15 13 -283 108 130 57
4159 57 -182 77 -362 -25 16 67 -24 -203 223 -123 185 31 -107 126 -40 87 139 300 -35 123 -70 86
4181 86 -64 -232 -68 107 -10 -54 -11 -47 -217 -179 -39 59 130 -160 -58 32 79 -73 112 133 256 -113 79
4204 79 -123 -193 187 342 90 73 -51 -23 166 129 193 223 41 27 -183 43 95 -177 16 -108 -79 90 268
4227 268 87 -117 313 102 11 154 130 5 96 159 -102 -41 197 -216 69 170 163 -260 32 195 15 -114
4249 -114 16 -60 40 246 -155 -27 -113 -122 -100 8 94 -23 -18 -146 21 41 128 -24 -23 11 52 151 127 419 210
4274 210 88 -23 269 82 -144 -285 -208 203 -13 -221 107 195 70 151 49 -49 80 252 66 -181 156
4295 156 194 -11 127 46 -45 -77 -132 22 -199 231 121 25 109 26 81 -44 30 233 -338 44 39 -174 -10 181
4319 181 -98 6 14 -29 -114 25 111 -235 118 -123 -69 142 -32 -12 479 106 -77 -23 -140 54 -110 -279 52
4342 52 -181 -69 100 -155 127 -90 -111 55 -104 -56 -59 -8 251 -96 129 141 -114 26 168 -35 -229 159
4364 159 -182 -20 225 -140 158 141 34 18 2 -96 144 18 84 -95 -78 17 59 -90 -229 -58 -197 -38 0
4387 0 -35 -105 135 32 137 253 -115 144 15 -19 205 -243 88 29 59 42 292 37 81 131 -145 -146 160 -73
4411 -73 145 182 123 65 -250 58 -58 -240 117 -120 97 -93 -125 4 -119 114 -35 66 -55 139 142 8
4433 8 -7 -49 -40 -108 9 -46 -89 183 -18 31 -273 -87 -105 -238 63 -130 -290 105 -66 57 -189 -52 -70 -168
4457 -168 -68 -37 104 5 -20 76 128 15 -20 62 164 -23 114 13 51 -260 168 -131 -8 60 199 14 -111
4480 -111 -119 -171 -188 -50 138 124 116 -119 55 160 55 50 -116 0 -166 98 89 113 -3 -4 -424 53 4 -28 -153
4505 -153 -57 -176 -274 133 165 -19 -135 -61 -99 -243 -158 -104 -136 96 -11 -40 22 51 68 124 94 209 -167 69 118
4530 118 122 264 -132 7 98 -18 -75 -67 -70 19 18 -106 -135 -30 -116 256 9 155 -53 202 8 51 -46 124 -112
4555 -112 -155 -263 57 -106 -41 177 -45 21 22 68 -482 131 75 84 -2 -195 25 -83 241 192 -179 107 140 -164
4579 -164 -134 -129 25 -1 -41 -42 -72 -56 42 129 -50 282 -49 14 2 1 241 -16 -203 -35 179 115 -17 97 -280
4604 -280 -25 -130 108 -100 82 -88 120 -335 94 -22 -287 -18 -192 -155 -19 39 65 22 151 54 -177 73
4626 73 196 157 -15 61 -238 191 -70 -112 -240 -172 20 -66 24 192 -152 106 -106 -52 -115 133 -62 15 -139
4649 -139 4 249 12 -26 -412 -55 42 133 21 -102 87 -243 -6 73 24 91 -174 -109 -117 -72 -292 -159 124
4672 124 -104 83 185 133 58 -158 -13 172 -95 52 55 -114 -51 73 13 -86 249 -83 118 190 122 -98 -137
4695 -137 340 -87 -133 -294 -329 71 30 -134 -5 107 -234 -211 -244 -45 -110 18 -192 -358 -156 125 -148 -7
4717 -7 322 -156 15 127 69 -66 -51 213 271 -49 -139 16 16 204 -118 32 -53 -49 -50 -155 136 70 2 -52 263
4742 263 133 -138 30 -73 -126 21 113 1 -147 235 86 -60 147 -49 -141 38 -77 9 -32 -156 -156 -76 148
4765 148 -33 -152 96 -73 -58 -180 -159 -47 226 -186 0 -170 -381 3 -214 -47 205 60 -263 102 96
4786 96 113 -98 2 268 -7 105 226 2 138 36 50 -258 -162 -60 73 121 20 6 -99 -41 -65 127 -18
4809 -18 40 -2 -97 -18 -218 100 -153 159 -137 252 9 185 -175 161 189 -269 -184 -194 9 64 -55 5 103 81
4833 81 183 107 126 -128 171 144 59 -200 162 -188 110 -11 96 133 20 -25 -150 171 195 109 126 198 -99 -105
4857 -105 -94 142 -110 58 119 117 84 -28 -203 49 -350 201 85 20 -54 72 119 -103 -145 185 104 169 192 67
4881 67 -34 221 67 215 -121 -42 192 -137 7 -18 -25 58 -30 -96 36 96 273 -52 -147 108 -249 -183 131 -177
4905 -177 -20 -151 137 132 -86 178 253 332 24 200 -151 59 -196 94 -156 18 152 187 118 -15 -195 -41
4927 -41 -2 92 -89 142 54 79 7 -200 -10 27 85 -151 -134 -138 198 66 40 51 -40 90 52 -3 -83 -161 -82 -8 -38
4954 -38 34 -14 -103 101 -123 66 120 -157 -78 -24 -82 -33 -20 -10 168 -35 133 -65 34 66 77 -90 -111 -80 -6 -2
4980 -2 -63 118 -27 200 174 -152 94 11 -122 -79 -32 53 -184 -27 17 -72 -176 -25 -138 55 85 -15 75 41
5004 41 71 -67 81 -36 77 148 135 205 -114 -211 -102 -203 161 -232 130 -134 169 161 43 -125 -149 -112 127
5027 127 118 81 -422 -110 -172 -226 -161 -14 214 -207 -203 -183 -187 -128 108 30 64 152 -85 -34 -131 337 -8 20 82 246
5053 246 101 -44 4 -61 -173 -52 29 -58 102 9 80 128 45 71 15 20 203 -112 53 6 -147 226 154 -14 11
5078 11 32 122 250 103 -3 96 -56 -89 39 -94 35 49 -125 40 1 -202 -92 -67 46 148 22 -49 27
5101 27 122 12 110 19 164 97 226 106 46 232 6 69 66 -140 -81 -116 -72 -115 120 -22 95 -115 295 22
5125 22 -113 43 -81 161 -91 -93 -87 -196 -19 134 -119 2 101 2 29 175 226 -110 98 280 -177 69 -58
5148 -58 80 -2 30 96 -140 77 72 -204 -122 -384 6 -6 255 63 -34 178 -132 -74 -68 -198 -196 113 205 -49 110
5173 110 91 -56 -45 -133 -95 -17 83 340 -117 191 117 101 -261 -24 -78 -113 58 -90 19 -325 32 -138 -28
5196 -28 -106 -157 -88 105 -10 -120 -39 -88 -208 -13 220 -7 18 -102 -224 33 19 -127 122 180 32 -98 -58
5219 -58 -172 -188 -388 -15 -185 54 23 87 -22 -83 183 -176 -48 -105 305 43 70 -70 -86 134 -94 -194 -35
5242 -35 -63 -27 -73 68 23 279 -15 -136 -286 -126 73 74 172 -164 1 70 -62 -314 -207 -89 -83 -116 88 -87
5266 -87 -7 246 -148 -20 54 46 9 -145 193 -60 75 50 28 93 212 25 121 -271 -240 62 65 -152 -115 -142 -53
5291 -53 11 176 200 -111 173 36 65 177 -61 -110 -286 -38 40 409 33 166 94 16 57 -40 189 104 -18 -91
5315 -91 -65 119 -242 -9 -30 -274 256 148 -34 -65 80 65 23 -8 91 228 -80 -133 264 11 -25 -130 41
5338 41 -52 243 -264 -226 -128 -53 89 -53 194 48 6 185 19 76 -111 90 60 2 79 145 -115 40 217 -52
5362 -52 -173 214 -236 68 194 107 54 229 103 8 3 99 -286 -41 28 26 89 -19 147 -220 47 -60 132 -146
5386 -146 -42 156 -91 116 110 -68 12 52 -148 110 113 -121 152 -66 32 -161 -133 -324 -207 -120 24 180 478
5409 478 150 14 75 -457 7 43 53 -101 112 -170 28 -252 -56 127 -28 154 101 -71 123 -208 -70
5430 -70 144 209 84 -178 41 112 -361 -77 113 37 162 107 47 36 -116 -81 36 -171 -168 -8 38 -54 -169 121
5454 121 117 64 -75 14 34 -116 33 88 -31 61 185 62 290 19 120 268 -6 36 -125 -64 -76 173 -334
5477 -334 104 -224 229 242 98 191 152 -191 -7 36 -220 70 -242 231 64 -62 125 370 -101 14 115
5498 115 202 -127 -102 -34 216 -25 -50 -156 144 125 198 -175 8 -66 227 -47 168 58 181 121 237 -194 -4
5521 -4 -55 -164 -208 52 -12 48 -254 79 163 -123 -181 80 133 -351 85 69 -22 -225 -67 -10 148 -18 -214 154
5545 154 -129 31 -6 -94 -106 -128 -193 14 133 50 6 122 -28 -166 2 -22 -91 -40 -63 -298 -208 -19 -147 76
5569 76 -46 41 99 13 -90 -43 -88 2 -26 -48 -90 70 235 288 -63 -3 -10 -198 -90 127 61 -207 -296 21 41 84
5595 84 -77 243 -31 12 -1 -264 119 157 -134 100 187 1 -300 -39 72 -105 129 -76 69 -136 -41 56
5617 56 -205 19 54 270 -135 -77 5 -87 19 267 76 189 115 -4 121 173 56 -107 -47 -53 -92 -40 -36 18 93
5642 93 130 -14 -105 -67 -1 66 210 -260 53 -54 -38 -173 -139 57 -102 -127 193 82 109 -62 160 -138 -70 149
5666 149 -382 -171 145 127 11 237 72 155 1 57 -118 22 352 130 -199 6 40 7 323 -28 -214 -220
5688 -220 -69 94 -67 65 -145 96 164 -114 -81 -7 164 -327 -32 21 -5 -71 -94 100 99 3 163 -230 151
5711 151 16 -82 -104 -92 58 -289 26 -234 -28 -48 82 -83 -48 177 109 81 40 170 217 25 106 20 49 20
5735 20 -155 -47 49 -242 -318 24 -9 -5 -51 184 -116 -65 84 -12 -145 204 -18 -13 4 157 -35 336 15 -216
5759 -216 74 91 205 -61 193 -178 -207 -23 136 -168 171 -99 164 35 -62 -107 -258 154 -2 -156 47
5780 47 -117 142 43 -140 -23 70 56 146 143 15 -7 97 96 66 -23 14 -63 170 -62 109 -129 70 167 154 277
5805 277 -145 -39 -59 -304 60 -7 197 2 -69 -81 124 -113 -237 -163 -79 137 186 93 -91 88 56 19 31 -38
5829 -38 -79 -98 -131 55 80 -81 -231 213 -67 -112 60 -6 13 -164 110 -73 61 22 -28 -58 -136 95 90 106 46
5854 46 38 252 -1 -82 -31 -165 22 247 382 33 -46 -22 9 3 -58 44 -31 40 -234 134 -29 -305 8 17 133
5879 133 -91 -69 269 -63 -5 32 -154 -35 -267 -157 -271 61 165 -127 -18 101 -40 -23 -136 58 -111
5900 -111 -26 -125 10 73 -133 19 -255 -142 -203 -85 -116 89 24 -69 -106 34 186 193 108 71 48 -97 55 235
5924 235 204 71 56 -48 -12 70 198 128 11 -74 8 -15 37 -64 71 148 127 49 126 35 -122 -162 -61 -12 -120
5949 -120 -118 -43 -31 4 -10 117 -115 204 70 11 128 7 -62 -62 41 48 -167 65 310 -82 -5 -111 -167 -25 -20
5974 -20 -188 -287 122 -78 -8 -51 7 23 214 216 -6 52 -103 -38 -47 135 -151 -55 181 170 -189 -215 319 82 -86
5999 -86 180 49 -32 -161 148 -23 43 73 -164 -131 63 80 -95 -30 152 4 112 -209 37 136 -154 73 -106
6022 -106 139 66 -201 50 -24 -247 274 68 -209 179 211 -72 276 55 -10 -11 157 -286 -165 -229 51 101 -195
6045 -195 137 -126 -5 -75 165 31 192 76 -9 -9 80 -85 -62 19 12 14 65 51 40 -7 74 -38 207 -22 127
6070 127 102 294 165 199 258 -353 57 181 -62 139 -32 17 4 49 33 -38 -131 -112 -1 203 -206 -50 62
6093 62 -211 49 -28 -123 5 -77 117 56 -117 -180 -38 -70 -42 7 143 1 -14 30 31 78 -114 172 -83 7 140
6118 140 -103 -15 96 -52 73 -74 210 77 -228 -111 -23 -121 -8 -9 -116 -62 -377 -97 10 149 17 56
6140 56 -128 -111 206 73 9 -179 111 -311 273 189 -15 -16 -96 -141 -180 96 205 133 -52 221 -10 106 -46
6163 -46 126 -105 225 -71 17 -97 -109 -82 -172 -52 -29 -72 77 160 -98 -39 -107 -200 -289 3 310 -146 100 -58
6187 -58 100 6 -142 -65 -45 117 -116 -61 339 -69 49 186 -147 0 68 110 92 165 -19 -121 48 117 149 153
6211 153 -218 -136 53 -64 18 -1 -88 -43 55 -93 27 74 -82 -83 129 -175 -224 80 -43 -67 174 175 -45 302
6235 302 0 -252 178 -49 -69 110 -47 -93 4 -21 -2 13 -15 -120 131 -109 -167 22 23 -155 134 -7 -197
6258 -197 117 77 -26 -3 170 -59 -146 76 -2 -10 -46 117 224 87 32 -33 17 -164 -287 -42 -15 143 100 -183
6282 -183 -68 122 8 43 42 9 -2 45 66 148 -100 -161 96 94 167 -173 -42 104 -195 154 4 60 165 -165
6306 -165 128 -4 54 86 210 295 -134 62 137 -42 29 339 133 226 -140 42 213 23 78 55 -35 -136 98
6329 98 49 -56 213 -157 -173 13 58 -6 13 150 40 47 125 43 -230 -72 210 40 -155 154 -30 -41 71 -15
6353 -15 25 -115 159 -148 108 365 116 70 1 363 -52 29 42 309 -75 -15 129 98 153 -79 108 67 225
6376 225 -160 89 -88 -108 103 16 204 51 78 -297 21 28 -28 -34 187 -94 86 56 164 -23 -98 -103 -149 -156 171
6401 171 11 -22 75 -99 153 132 317 -170 -50 34 88 49 242 -153 -28 9 -57 161 97 124 -93 -91 -101 8
6425 8 16 -197 -221 13 96 54 11 96 307 45 -22 129 -41 -135 -65 51 -170 -14 195 49 -229 56 149 50 -34
6450 -34 -196 123 -16 -213 -286 -151 27 259 -11 206 -67 -253 -53 67 65 139 -26 -42 -156 116 -29 -7
6472 -7 -30 -199 193 50 96 -54 -146 -84 -13 21 10 -416 -117 -92 -96 195 99 -72 -136 0 -41 -334 33 18 113 62
6498 62 102 156 -332 245 35 95 92 -69 14 111 142 214 167 111 23 -119 11 -95 -174 -19 -9 15 -92 -227 33
6523 33 157 -47 -128 130 19 88 -208 -110 75 -4 -140 38 2 -245 -17 124 36 -79 -111 -35 -12 193 171 102
6547 102 63 -161 4 22 -137 -11 47 67 -173 37 136 1 33 117 -34 60 -21 141 71 -21 84 -5 87 11 146
6572 146 -113 -240 59 315 -6 188 68 -13 -92 -179 -207 -28 61 33 -78 28 -131 -212 -7 173 209 59 -175
6595 -175 21 -4 -55 -42 86 91 -116 -69 -48 241 -63 25 -112 -19 58 55 -123 127 127 -96 116 -21 22 -1 -80 7
6621 7 129 257 13 -41 -17 48 -55 -11 14 118 -157 165 -52 -9 -10 -169 -106 -103 53 128 -4 -82 -213 -5 -106
6646 -106 -313 -62 33 -139 137 -84 -26 -92 179 -46 2 149 -101 180 -221 227 -13 192 -147 127 -59
6667 -59 91 39 -25 -115 110 -15 -176 -41 112 -3 -152 -42 -233 -281 51 232 -31 -80 84 124 21 39 58
6690 58 -243 -219 62 231 -157 0 -229 106 133 124 -20 -354 -24 53 69 -10 109 -66 -76 -247 160 -55 -100
6713 -100 97 21 204 -81 -83 111 167 -144 219 178 -115 10 -49 -137 -67 -100 46 105 -40 17 -2 -94 -40 42 -315
6738 -315 3 42 -188 310 16 -21 53 -319 -72 -71 38 -164 348 -207 49 162 -76 -72 -94 178 -159 -39 79
6761 79 285 146 308 -156 114 16 -218 -99 -13 93 -351 118 5 12 -22 -20 -234 -197 43 -158 123 40 43 143
6785 143 78 -283 531 136 21 -88 -40 -121 94 -92 -132 -3 -99 -79 44 23 -330 170 91 -30 112 159 29
6808 29 -78 237 -8 217 -120 128 -68 -128 99 113 -174 -81 191 139 -38 25 173 80 11 -220 203 32 -258
6831 -258 -94 244 -189 -49 -94 3 -220 -228 -4 -87 -27 108 -17 -129 -139 -66 140 112 -76 214 13 81 -145
6854 -145 -147 160 238 64 -1 -102 73 18 -166 6 -413 -103 -45 25 -72 -204 -45 -267 -97 -57 238 111 58
6877 58 26 -17 5 7 3 215 355 260 -63 -19 -147 -176 -22 119 -178 -202 -209 45 -63 -89 -45 148 64 -35 34 -106
6903 -106 127 82 142 -47 -60 -115 -60 -11 96 116 -33 -247 -162 41 88 2 -68 -18 -35 -103 -368 -24 -197 -159 -89
6928 -89 191 -158 41 105 18 28 291 140 35 34 92 -182 -205 162 214 -65 -43 51 91 -180 193 -17 119 46
6952 46 -82 138 -100 -7 234 84 -256 56 -132 -90 18 129 -134 -176 -74 51 110 -98 93 139 -188 18
6974 18 -105 126 257 87 -179 124 -87 -127 -14 -75 -70 -132 -205 -91 74 172 -4 -101 -56 40 8 -187 -48 -91
6998 -91 124 -263 45 -103 -127 62 -151 -205 -43 94 57 52 -127 -99 -125 -25 -79 -4 53 81 -173 47 150 4
7022 4 116 -21 96 3 -292 -9 -41 58 35 97 65 26 106 -99 -53 -130 258 94 69 -79 -47 217 -120 141 -17
7047 -17 22 28 180 -202 -7 243 30 -35 -89 19 90 -25 -113 458 99 138 -50 44 110 463 59 -79 137 77
7071 77 94 -172 -75 -87 158 155 -100 52 -152 124 -120 205 -39 140 -67 38 -82 -157 -54 14 -95 -108 75
7094 75 -198 61 -51 192 148 136 -24 144 47 -117 132 -98 147 -74 95 -169 -76 -76 -204 63 -170 -175 -239
7117 -239 149 -40 -92 -111 267 -21 -53 -51 30 111 202 17 53 51 -1 -289 185 11 205 81 10 260 -202 -285 68
7142 68 19 188 -64 -19 -212 -27 95 18 140 -33 -99 80 54 -244 -29 -316 -193 -40 -74 -72 244 37 -154
7165 -154 92 -138 -88 36 40 45 39 67 -99 129 -46 -39 113 -8 -170 319 -290 -261 -120 -61 -114 126 -20 107
7189 107 222 -217 204 -187 203 25 -137 169 -102 138 -50 104 -57 -167 -66 -35 279 116 -24 -17 -78
7210 -78 72 51 68 9 -181 345 138 81 -22 93 23 -262 35 -193 -6 97 179 12 -148 -79 33 157 -56
7233 -56 -260 53 16 -209 -20 104 -155 141 444 -113 157 77 80 106 -125 30 148 -165 -41 131 -101 -13
7255 -13 -7 129 44 1 199 39 -113 -28 -93 -98 32 46 -16 -46 -276 -43 -18 97 133 -168 55 -154 273 23 -89
7280 -89 -30 -35 95 15 -158 151 118 -75 131 -58 237 18 -56 14 -101 -71 -102 -59 -175 165 -88 188 72 -172
7304 -172 -221 0 -95 132 -143 95 100 76 72 155 22 -144 146 14 -41 -41 -49 118 219 -39 148 -209 -59 150
7328 150 -101 11 -145 58 298 136 -139 200 -28 -82 157 241 -89 174 149 -191 -105 -76 -72 164 20 -13 -53
7351 -53 247 -64 55 -84 -36 -35 -49 -33 141 95 -70 -127 -29 -225 -210 -57 141 -51 144 85 -5 83 164 319 89
7376 89 -188 -119 -113 -164 -146 43 153 -191 168 91 -22 195 34 58 26 -97 -51 243 -183 77 15 -99 -76 18
7400 18 -77 -181 36 66 159 91 256 -26 -10 229 -99 -61 -275 -125 -196 -134 291 -104 98 -217 -39 62 -359
7423 -359 203 -206 -61 -125 19 -47 122 120 125 172 -183 97 209 243 34 54 371 -87 -35 -72 49 -118 26 58
7447 58 -81 213 126 89 -43 -138 33 -96 110 -3 -56 -136 75 -86 16 -24 -95 89 58 -7 197 109 -85 -125
7471 -125 -159 159 -112 -97 -263 -78 -7 -80 53 75 211 29 -99 -72 79 264 57 -322 66 108 -76 -59 -155
7494 -155 -118 -52 58 76 -13 -145 42 -39 152 69 274 58 103 198 166 -35 -7 167 84 -240 -14 -276 168 0
7518 0 -73 -84 93 -22 189 38 -104 37 -88 -8 132 -47 28 248 -36 -58 125 4 -266 209 13 113
7540 113 234 -32 -206 28 -35 -135 -50 71 90 100 -147 178 115 87 -58 83 -14 -99 346 72 30 233 59
7563 59 -29 155 18 -45 -96 -346 39 -39 253 185 -45 139 -108 -76 -100 -42 -194 -273 72 -42 253 -104 34
7586 34 307 -79 47 8 120 264 -191 31 -128 156 72 80 -54 -36 -173 125 179 139 137 0 131 50 -180 152
7610 152 27 10 98 -75 -45 130 227 -65 148 218 109 -69 63 62 81 -127 -51 151 126 -151 -28 190 -45
7633 -45 -143 -11 -25 -116 54 -52 -86 8 172 27 35 -35 -88 75 96 40 -122 8 45 66 -82 -22 -21 201 109 91
7659 91 65 3 -47 -126 207 110 88 13 -81 -33 -65 92 -63 27 216 -191 -93 -125 -129 93 -127 111 94 -14 30 168
7685 168 19 19 -105 39 58 -39 -120 16 95 213 128 -137 154 6 149 22 -23 39 -33 -132 -128 -70 44 36 -119
7710 -119 65 28 188 40 -130 110 -60 134 30 204 11 -58 47 172 -17 353 -21 -168 -21 -3 88
7731 88 307 97 -62 21 -61 -24 87 -71 -141 -176 204 283 -192 28 -24 -7 28 -50 -21 -252 -64 50 -9 -4 -12 28
7757 28 6 12 -60 59 -34 171 -111 199 -78 -172 186 134 48 -52 94 -16 -98 -53 -181 -125 -52 63 27 -67 34
7782 34 82 -61 -223 -123 -192 -41 -42 -27 176 -68 51 105 134 184 139 -4 40 220 -46 -33 190 54 133 -33
7806 -33 219 22 -74 -36 91 30 83 362 215 121 -101 66 117 92 124 109 17 -291 -70 -103 -127 2 -48 101 -43
7831 -43 -70 -92 -127 -322 38 41 -28 103 -240 -89 -137 -65 86 -95 -88 -21 -267 -60 -120 154 129 -126 -267 189 83
7856 83 128 84 97 -114 -129 156 -1 117 207 -253 159 121 -16 -171 -80 -39 -297 4 161 -47 177 -47 158
7879 158 -154 233 -7 45 -120 69 -2 146 -126 -78 35 -114 247 135 24 149 154 -65 -65 -123 59 11 77
7902 77 -95 -180 29 -122 98 -11 91 -124 -4 -71 -175 -43 18 -130 107 75 81 -100 -42 -90 -48 37 182 -54
7926 -54 -14 -62 6 65 -97 135 56 -197 -143 -122 38 69 -71 29 43 -160 49 -184 -108 72 80 -114 -54 -42 121
7951 121 -283 -21 -136 86 6 150 -36 2 -127 -102 -127 46 -25 128 -104 -210 -98 -326 -10 52 154 169
7973 169 23 97 -31 -98 9 -104 174 -106 28 -123 31 116 -193 -149 -57 151 56 293 73 108 -11 22 28
7996 28 -201 -92 -144 118 -71 -169 61 67 -15 -321 83 72 158 -56 81 91 -75 8 -47 -18 183 73 92 100 21
8021 21 116 -160 66 131 124 117 55 -44 131 -68 -157 32 -10 -96 -75 112 -443 -108 25 -37 96 -149 101 -58 158
8046 158 -76 51 198 -200 57 28 89 -105 161 -92 94 264 -60 -150 -215 61 -128 166 -65 -3 -13 -13 -166
8069 -166 78 -39 6 79 60 297 -116 74 244 103 -51 -99 -208 217 21 -3 -30 11 -75 -60 -42 -101 163 169
8093 169 -8 -40 -55 -183 -210 16 -172 19 -59 -92 -41 104 148 119 -4 56 -53 310 21 -124 23 312 138
8116 138 -28 -123 -93 28 -29 51 -140 73 44 -64 84 -87 7 58 -68 75 192 -166 11 179 -5 -59 -135
8139 -135 82 -124 78 -35 59 -167 76 61 62 -29 -123 -17 224 149 4 -50 91 40 -92 -125 -70 -87 -31 57 162
8164 162 69 21 84 -72 -202 253 20 152 30 -19 -64 -63 -163 73 243 -39 57 -168 92 66 -245 37 185
8187 185 45 85 229 299
8191B99
$$ Imaginary data points
##PAGE= N=2
##DATA TABLE= (X++(I..I)), XYDATA
0 0 0 0 0 0 0 0 0 0 0 0 0 0 0 0 0 0 0 0 0 0 2 -8 8 -8 8 -8 8 -11 16 -16 16 -20 24 -24 31 -32 38 -40 47 -50 56 -63
42 -63 70 -77 85 -93 103 -115 126 -139 152 -167 187 -205 226 -251 278 -311 349 -393 450 -519 607
63 607 -723 887 -1134 1542 -2342 4483 -22307 -50359 15723 24473 -4660 8490 11029 -18402
77 -18402 3955 29125 441 -8761 15624 -3098 -16136 15562 16793 -13345 -2303 12292 -5127
90 -5127 340 16053 -6289 -13403 10737 4619 -14830 375 2278 -15609 229 15142 -8363
103 -8363 -13225 10532 6557 -57 15442 5995 -13577 6043 21396 753 -2032 7792 -7029
116 -7029 -8297 14208 7957 -9916 -1634 -805 -9636 6470 13639 -10858 -14587 2572 -2557 -6101
130 -6101 6126 -4407 -19060 -1821 7986 -6077 -3145 5438 -5466 -2768 12739 4353 -6684
143 -6684 5837 8215 -3089 3159 6425 -6829 -3450 9460 -52 -7885 906 -1130 -6697 4723
157 4723 5650 -9291 -7445 2652 -2562 -2151 4869 -5460 -12346 982 5298 -2484 2151 2947 -6308
172 -6308 -9 12138 5177 -560 4704 1846 -1681 7534 7445 -4007 -2451 2926 -2192 -1878 3662
187 3662 -2524 -6668 1228 984 -5364 -1469 1152 -4533 -2182 1721 -4189 -4679 2338 941 -2762 1861
203 1861 1858 -2396 2559 7268 2266 812 3520 1245 1030 6327 3801 -3019 -1555 1101 -934 627
219 627 1265 -4013 -4830 -291 -563 -2523 -31 -1339 -4889 -1860 1099 -1121 -827 595 -1749 -1369 2938
236 2938 2623 301 2679 3145 833 2308 4063 1892 1154 2682 749 -932 599 436 -1217 -1149 -1334
253 -1334 -2813 -2617 -830 -1500 -2151 -2020 -2656 -2791 -658 92 -986 -817 -296 -384 666 2141 1950 1058
271 1058 1169 1806 1943 2711 2498 1452 928 926 707 714 304 -612 -1057 -1668 -1595 -1711 -1558 -1861 -2235 -2112 -1965
292 -1965 -1728 -998 -749 -1136 -673 -210 197 1057 1804 1050 1593 1803 1954 2152 2335 1497 1275 1249 1011 498
312 498 856 539 -673 -700 -563 -1528 -1401 -1138 -2005 -2418 -1837 -1667 -1967 -1624 -798 -1613 -919 451 628 444
332 444 1154 1369 1106 1791 2245 1518 1603 1943 982 956 1341 990 246 64 47 -975 -400 -463 -1262 -1637 -1039
353 -1039 -1567 -1645 -1421 -1238 -1802 -1470 -386 -502 -444 377 573 459 1412 2140 1750 1584 2187 1603 1116 1799
373 1799 1486 620 343 537 -113 -260 441 -795 -1248 -605 -1111 -1757 -1321 -821 -1973 -1836 -1032 -1577 -1756
392 -1756 -272 -352 -860 347 1254 345 1280 2614 1297 609 2138 2032 716 2097 1479 -1203 -13
409 -13 1203 -485 -618 276 -1889 -2782 49 40 -2212 -1171 -1102 -3328 -1620 769 -1504 -2696 42 -466
427 -466 -1266 1501 2017 -560 948 3089 1129 989 3522 1203 -29 2735 1848 -1551 81 1107
443 1107 -1523 -608 728 -2368 -3154 796 -89 -2543 -640 -1033 -3618 -141 2331 -1727 -2613 718
459 718 -544 -921 3802 2037 -2592 1112 3890 1237 2598 4106 -1195 -1491 3979 2496 -1383 804
475 804 323 -3698 714 2849 -2955 -3564 775 -1466 -2716 1658 -823 -4960 101 2446 -2516 -1112
491 -1112 1682 -2040 -1151 4706 1408 -2788 1978 2961 -179 3568 3987 -2788 -1434 4534 1476 -1479
507 -1479 1195 -2026 -5218 1588 3155 -3964 -3180 -230 -3592 -1458 4147 -1612 -6019 12 1583
522 1583 -1570 2093 1880 -4792 -1662 5444 1680 -1182 2895 329 -1641 4934 4887 -2918 -1102 3366
538 3366 -894 -153 3328 -3005 -5503 2115 2032 -3692 -986 -521 -4824 -394 4747 -1973 -4997 918
554 918 -147 -1228 4150 1774 -5503 -609 5204 1114 1126 3354 -2303 -2314 6216 4487 -2312 -342
570 -342 1076 -2757 1919 5071 -3329 -5664 1144 -311 -2417 1839 -1043 -7021 -765 4222 -1799
585 -1799 -2234 1566 -2547 -1622 5521 2335 -4077 691 3301 -145 2562 4485 -2790 -1864 5301 2926
601 2926 -1117 1777 -416 -3921 2359 4163 -3434 -4122 491 -2136 -1481 3131 -1778 -6784 -342 2408
617 2408 -1307 460 941 -4193 -1503 5503 1739 -1984 1205 531 -1323 4147 4496 -2550 -1545 3295
633 3295 321 -184 3079 -1354 -4271 1839 2288 -2629 -1364 -137 -3995 -981 3228 -1976 -4491 92
649 92 173 -1725 1939 1057 -3697 -556 4212 1033 -205 2323 -430 -1285 4428 3227 -1808 -280 1856
666 1856 -556 1380 3189 -1851 -3235 1147 646 -1527 369 -831 -4252 -1026 2330 -1293 -2410
681 -2410 234 -1161 -1445 2664 1002 -2268 348 1907 -42 1411 2708 -566 -419 3315 1994 -463
697 -463 1444 816 -1282 988 1932 -1667 -2057 641 -700 -1575 170 -1352 -3217 -408 718 -1693
713 -1693 -1035 11 -1754 -647 2132 652 -1152 666 1009 409 1844 2161 -441 98 1840 962 568
730 568 1508 92 -1268 735 962 -875 -809 -284 -1759 -1282 53 -1340 -1868 -373 -842 -1522 -154 190
748 190 -763 -109 916 -89 -141 1199 675 446 1557 1095 150 916 1602 743 439 770 -278 -306 356
767 356 -36 -795 -765 -1081 -1425 -896 -66 -1015 -1363 -847 -997 -740 254 31 -581 -246 266 545 681 1203 709
788 709 760 998 1262 1246 1402 998 477 283 457 263 -139 5 -696 -1035 -608 -891 -915 -699 -1141 -1244 -1163 -609
810 -609 -382 -330 -183 -367 -406 291 459 684 912 585 549 775 1172 1386 867 848 521 303 624 533 344 -97
832 -97 -558 -900 -715 -547 -775 -910 -1311 -1369 -1176 -580 -253 -373 -357 -328 -276 365 645 886 689 366 545 985
854 985 1304 1177 782 478 417 528 925 612 322 -381 -545 -376 -703 -645 -659 -1310 -1645 -1002 -834 -607 -194
875 -194 -561 -673 -280 307 219 538 551 188 120 1049 903 900 1226 707 511 504 1024 586 177 226 -834 -718 -43
898 -43 -231 -882 -1027 -952 -1562 -869 -196 -836 -961 -670 -602 -782 273 625 -115 67 766 345 930 1407 571
919 571 651 1089 796 172 1001 996 -592 -57 556 -134 -660 95 -361 -1333 -463 -910 -1472 -435 118 -1105
939 -1105 -1037 170 -759 -309 1266 689 -878 355 1034 327 1263 1737 -177 -280 1542 1182 430 984
957 984 292 -1233 279 1409 -439 -873 30 -1426 -1346 634 -315 -2027 -785 125 -1396 -312 684
974 684 -1238 -861 1489 499 -603 1122 677 -556 1277 2153 -717 -177 1735 569 -14 1722 -143
991 -143 -1842 826 1137 -1047 -536 127 -2144 -1010 1599 -802 -2514 -673 -301 -1344 1222 979 -1976
1008 -1976 -889 1596 714 200 1917 69 -1516 1969 2373 -523 371 1294 -892 289 2477 -360
1024 -360 -2096 621 266 -1293 333 13 -2964 -884 1537 -1147 -1680 -133 -1046 -1668 1981 986 -2304
1041 -2304 -158 1860 11 1100 2482 -1149 -1283 2680 2271 -471 1067 340 -1833 1141 3025 -725
1057 -725 -1722 476 -1156 -1230 1828 -42 -3751 -767 1310 -1024 -115 608 -2306 -1948 2431 1070 -1516
1074 -1516 656 713 -1007 2170 2853 -1142 -1371 2091 530 188 2151 9 -2386 752 2238 -1055
1090 -1055 -901 123 -2273 -1052 2320 -632 -3301 -602 -10 -1409 1032 1002 -3036 -1756 2264 712
1106 712 -641 1288 -418 -1599 2410 2851 -814 -156 1337 -369 812 2776 -498 -2540 693 1221
1122 1221 -966 521 -78 -2691 -912 1923 -718 -2147 -86 -1257 -1513 1399 1038 -2777 -1021 1681
1138 1681 -259 514 1871 -871 -1314 2230 1956 -322 540 835 -1120 1091 2882 -820 -1611 501
1154 501 -73 -888 1077 -290 -3180 -691 1172 -875 -798 83 -1855 -1398 1537 627 -1624 -247 687
1171 687 -667 1477 2256 -631 -812 1770 997 317 1418 285 -1243 1039 1853 -473 -736 510 -1077
1188 -1077 -741 1068 -436 -2247 -452 2 -1137 -164 192 -1777 -1084 1447 122 -681 377 -184 -580
1205 -580 1395 1583 -241 37 1404 138 541 1681 221 -843 778 1075 -489 285 314 -1561 -587
1222 -587 726 -617 -1314 -358 -657 -1194 -24 197 -1099 -627 496 -507 -73 926 141 -296 1016 1163
1240 1163 -92 691 890 205 625 1131 -59 -493 759 130 -230 23 -381 -1052 -429 -15 -522 -936 -310
1259 -310 -798 -935 76 -139 -936 -428 107 -63 543 504 -4 159 945 865 351 777 590 20 659 363
1279 363 255 177 373 -471 -462 74 -189 -328 -162 -283 -788 -355 -237 -537 -603 -73 -291 -469 -160 36 -175
1300 -175 529 588 64 265 734 556 461 662 117 448 597 459 432 -215 -91 -321 -332 51 -134 -600 -329
1321 -329 -423 -525 -438 -647 -674 -413 -235 -300 -191 135 39 115 600 380 382 497 695 628 549 671 400 511 194
1344 194 226 61 25 -236 -229 -264 -350 -476 -515 -500 -609 -578 -620 -385 -707 -415 -376 -245 160 101 76 265 416 605
1368 605 505 576 523 745 646 438 676 371 337 384 -26 37 -94 -428 -439 -220 -425 -613 -522 -496 -447 -538 -591 -294
1392 -294 -358 -194 -228 52 63 92 359 546 343 539 605 557 264 524 644 341 132 209 -82 106 -118 -156 -440
1415 -440 -72 -319 -924 -714 -471 -263 -544 -148 -137 -194 0 -222 -110 210 400 -74 451 840 208 43 746
1436 746 523 119 637 342 -193 222 382 -112 -11 181 -436 -682 105 -522 -936 -196 -419 -772 -133 140
1456 140 -718 -301 362 -40 -233 567 366 -179 553 1013 93 319 950 160 170 1123 114 -544 28 274
1476 274 -380 64 -99 -1233 -762 153 -686 -933 -96 -547 -754 270 478 -909 -364 623 -190 104 916
1495 916 -134 -497 881 965 77 387 604 -230 604 1469 -135 -471 -55 -39 -575 741 352 -1542 -631
1514 -631 126 -719 -537 193 -1032 -1318 638 463 -809 -174 365 -700 565 1419 -378 -738 912 742
1532 742 22 1259 750 -890 305 1346 -43 -392 447 -604 -538 1061 17 -1862 -552 72 -1037
1549 -1037 -69 570 -1493 -1217 677 333 -626 326 -312 -1169 1127 1741 -304 -540 951 216 327 1893
1567 1893 351 -1530 238 851 -318 251 514 -1512 -1019 1052 179 -1600 -266 -336 -1345 559 733
1584 733 -1159 -914 635 52 -13 1003 -552 -1299 1186 1473 -394 223 498 -493 522 2097 -7
1601 -7 -1196 315 440 -511 932 309 -2074 -821 1088 -141 -461 112 -1146 -1562 691 554 -1199
1618 -1199 -389 67 -717 518 1766 -450 -1143 989 771 -74 1187 524 -1154 224 1985 -210 -255
1635 -255 431 -264 -533 1430 278 -1601 -398 532 -871 -16 560 -1312 -1315 815 511 -965 -19 -43
1653 -43 -1281 491 1619 -350 -513 815 50 348 1510 333 -1119 311 1067 -127 51 419 -996
1670 -996 -876 938 138 -840 -198 -329 -1058 371 498 -1276 -1054 436 -217 -353 556 -230 -753 717
1688 717 1121 -261 150 739 -472 182 1404 195 -659 435 729 -161 517 513 -1093 -384 1011 -337
1706 -337 -935 -78 -721 -914 140 462 -891 -541 140 -765 -64 1109 -187 -783 580 270 -87 813
1724 813 742 -243 481 1094 39 -93 917 235 -344 392 161 -1022 -307 126 -667 -583 -81 -616 -973 290
1744 290 -185 -809 -317 143 -591 269 466 30 -235 417 286 -55 718 430 -145 227 924 347 239 370
1764 370 -236 -427 230 -87 -660 -168 -424 -864 -318 -46 -670 -532 245 -512 -745 72 113 -280 123 298
1784 298 -214 219 597 3 380 580 292 2 245 447 160 165 135 -47 -161 531 -201 -570 -164 -229 -369
1805 -369 -287 -155 -610 -331 -181 -332 74 109 -47 -117 37 -3 80 423 471 368 66 344 283 521 371 270
1827 270 -111 281 51 -77 -239 11 -131 -259 -284 -375 -338 -159 -272 -307 -497 -207 -266 -61 237 156 -58 310
1849 310 331 287 248 522 223 184 251 335 205 -223 48 187 11 -197 -89 17 -254 -290 -275 -255 -225 -371 -403 -6
1873 -6 -230 -288 -190 -111 109 -223 66 151 227 333 224 388 430 100 526 229 258 -44 238 98 393 144 -11
1896 -11 -267 -343 -128 -322 26 -235 -441 -460 -495 -303 -183 -77 -172 -61 -150 118 229 245 302 102 234 544 479
1919 479 201 762 413 270 141 56 55 -10 45 -38 -92 14 -178 -98 -105 -106 -569 -241 -140 -408 -249 160 -300 -306 134
1944 134 271 -174 220 413 -285 568 519 80 200 685 217 266 415 14 50 63 105 -380 -363 -6 106 -122
1966 -122 157 -186 -502 -178 -18 -325 -228 181 -291 -39 288 -93 -156 161 197 327 684 451 -221 -27 326
1987 326 -43 -91 137 -72 -157 317 94 -372 -412 -71 -311 21 55 -553 -909 -79 10 -355 -52 -12 -566 167
2009 167 683 57 -139 104 213 377 914 206 -290 267 461 88 330 561 -322 -458 623 220 -753 -26
2029 -26 -52 -753 -33 263 -513 -513 139 -361 -363 423 -110 -741 398 821 168 102 595 -108 -132 1037 453 -390
2051 -390 242 379 -314 587 616 -805 -380 518 -5 -89 453 -525 -1218 249 358 -481 -680 -8 -446 -193
2071 -193 784 49 -596 163 316 -233 569 794 -549 393 830 339 -379 322 -94 -415 782 564 -753
2090 -753 -517 145 -347 -121 206 -692 -1233 85 580 -830 -129 -56 -1102 22 987 -300 -666 321 61
2109 61 -111 883 598 -510 -44 774 268 1 286 -589 -507 1198 361 -758 -90 88 -608 87 609 -744
2129 -744 -913 12 210 -335 237 -254 -988 103 684 -70 -505 319 -247 -168 1040 654 -705 -54 447
2148 447 -301 454 641 -674 -587 570 72 -343 4 -449 -1058 218 609 -582 -644 -26 -469 -526 674
2167 674 -429 -1062 221 728 -47 222 444 -369 30 1192 203 -147 459 303 -244 505 322 -521 -179
2186 -179 579 -328 -297 194 -485 -684 126 25 -770 -90 60 -647 94 478 -159 -649 386 15 -112 560
2206 560 308 -398 50 911 50 -61 389 99 -409 585 296 -285 -234 144 -292 170 474 -378 -816 23
2226 23 86 -645 -194 -147 -642 146 572 -177 -440 239 -135 -185 685 391 -344 187 372 26 277 526 -423
2247 -423 -210 225 101 -262 -102 47 -475 100 82 -452 -557 -202 -252 -384 -40 -185 -479 -37 128 -132 6
2268 6 82 -222 29 516 -113 -97 358 328 190 349 398 32 -16 113 17 -53 42 -80 -556 -15 1 -266 -100 -73
2292 -73 34 -209 -111 -161 -424 -16 -55 -100 146 270 -233 99 399 -106 98 213 406 193 211 113 -43 -67 119
2315 119 -312 -275 13 -124 -313 -255 -195 -491 -112 -243 -189 -102 57 -121 11 -178 180 155 77 206 -156 252
2337 252 318 281 344 310 124 -103 502 71 0 72 101 -90 32 -33 -165 -202 -260 -240 -495 -361 -348 -91 -87 15 -163
2362 -163 -150 56 38 41 -53 155 83 206 279 273 138 166 -25 204 350 114 111 -199 94 -78 126 -139 -230 -111
2386 -111 18 -120 -273 -113 5 -122 -133 -109 14 108 78 0 -54 -28 18 273 239 164 -9 184 269 145 69 140
2410 140 -160 -313 -80 -175 69 -92 -165 -249 -200 -58 -216 -136 -24 -262 -134 -51 -114 -161 68 259 -178 465 -12
2433 -12 129 196 281 155 -11 -20 156 175 -94 -71 -261 -58 -49 -271 41 -104 -412 -245 89 -105 -143 -382 -128
2456 -128 -178 76 -149 -188 18 -24 -53 267 266 263 42 -59 331 58 179 432 203 7 215 -12 -177 -161 -29
2479 -29 -284 -69 72 -106 -347 -42 -126 -217 253 -122 -319 3 47 99 62 -20 106 14 299 413 -307 382 273
2502 273 125 565 348 -102 -77 205 12 -289 177 -55 -486 51 112 -187 -337 -210 -67 -171 54 100 -190
2523 -190 -47 377 -130 -14 162 -31 -35 491 388 -107 205 307 -73 208 407 -330 -253 277 -329 108 143
2544 143 -192 -688 -18 -78 -194 -283 -318 -358 -50 521 145 -419 -67 386 -351 444 328 22 -9 733 161 -103
2566 -103 282 83 -314 495 388 -237 -144 20 -414 -182 331 -133 -639 211 -179 -208 242 -381 -589 -42 616
2587 616 -197 -183 39 -284 -297 865 202 -327 -157 165 4 123 410 -305 -420 362 176 -155 71 -107
2607 -107 -531 163 335 -360 -531 121 -222 -259 275 -198 -763 5 360 -121 11 338 -534 -270 609 423
2627 423 -455 76 302 -342 454 325 -371 -316 184 -45 -293 497 -225 -735 109 360 -489 -359 -237 -650
2647 -650 -169 322 181 -562 58 264 -184 156 373 -281 -127 530 296 196 297 131 -25 370 685 -239
2667 -239 -208 466 -179 -134 418 -180 -683 -73 -56 -541 94 -267 -772 -135 493 -54 -372 117 175 -187 608
2688 608 441 -511 2 547 90 41 557 -54 -383 454 410 -258 -2 -16 -416 -152 218 -194 -261 28 -203
2709 -203 -477 271 6 -680 122 87 -244 -294 165 -439 -239 485 541 -167 -70 161 123 378 328 -20 -65 163
2731 163 196 27 310 -126 -494 86 167 -27 -289 -78 -248 -304 178 -172 -407 25 107 -111 16 235 -234
2752 -234 -153 298 14 66 146 394 66 243 533 -90 -107 60 13 -170 -48 -120 -208 119 400 -364 -64 24 -421
2775 -421 -211 242 52 -278 -62 -91 -337 137 -140 -190 -184 294 222 -57 93 -59 62 263 284 -10 322 -10
2797 -10 -30 -78 212 -95 -126 124 70 -294 -149 -33 -292 -18 -126 -152 100 11 -42 -129 159 24 16 45 201 68
2821 68 57 347 209 225 228 181 139 154 176 -21 141 -76 -89 -125 -64 -298 -29 -103 138 4 -245 -206 -116 -201 1
2846 1 -128 -156 242 0 18 -58 99 362 146 355 106 -40 -2 7 251 -34 76 -137 -10 71 51 -161 -13
2869 -13 -121 59 61 154 -138 -108 -205 127 -6 17 91 -161 -215 119 232 300 341 193 140 16 134 209 194 113 198
2894 198 58 27 105 -96 122 81 -129 21 -98 -182 -114 -188 -367 -59 4 -173 108 -94 135 97 -194 -2 3
2917 3 72 312 -62 -132 -83 69 -27 119 58 124 -226 -95 -49 -255 271 -248 -247 -180 -191 -69 -90 -317 -86 -23 -172
2942 -172 -215 43 41 -81 -74 269 52 98 156 27 138 135 191 -30 130 -118 -50 -141 1 -144 163 84 -167 -242 29
2967 29 -129 -376 -32 -57 -25 -110 68 -117 -90 167 -79 329 -204 305 192 159 -89 -13 27 303 3 -31 17
2990 17 -155 -113 78 -24 -320 -178 96 -262 23 -208 -166 89 20 -234 -236 24 -136 -18 -169 279 -91 -158
3012 -158 225 175 -33 174 135 26 383 257 218 151 44 158 84 213 -58 -226 106 28 10 -98 -110 -200 -32
3035 -32 -112 -178 -47 0 -87 55 239 440 56 -45 174 -29 19 531 -121 -47 314 180 -234 -44 31 15 -52
3058 -52 168 -15 -158 -56 -183 -178 -245 76 -331 -100 200 -281 -39 270 -55 -530 116 213 -41 40 340 -41
3080 -41 -16 511 223 -359 203 -26 4 183 -43 -170 -144 211 -108 -11 87 -73 -323 112 -56 -432 33 48
3102 48 -108 93 -104 -92 -96 487 11 94 109 -256 -204 246 444 -354 -125 349 -44 51 544 -129 -441 78 -7
3125 -7 -175 -99 72 -322 -71 188 -57 -126 -107 -163 -106 342 321 -461 74 354 -255 174 342 156 -392 125 310
3148 310 -30 29 314 -321 -51 578 -64 -131 166 149 -125 -35 127 -292 -150 195 -339 -221 35 12 -380 252
3170 252 350 -217 94 346 -162 361 51 -17 -242 381 136 -25 85 -222 -531 114 343 55 -274 5 -57
3191 -57 -37 175 -220 -224 -94 59 -133 66 -7 -171 -200 195 190 92 220 419 -5 35 303 -10 -133 -176 64 135
3215 135 631 84 -270 124 202 -147 -220 -51 -479 -67 155 -125 -321 95 -171 -227 200 -283 -289 -106 346 274
3237 274 -169 -64 -110 14 564 404 -275 -81 186 -167 -22 415 -90 -137 17 -74 -10 -1 214 -185 -276 257
3259 257 -349 -181 -35 -34 -39 84 84 -221 -251 101 -7 50 215 24 -82 370 244 -76 361 95 53 106 -211
3282 -211 11 -193 -10 -202 -134 18 -108 -353 113 87 -35 157 167 -134 -378 22 -180 -71 309 74 -147
3303 -147 -43 9 282 35 80 460 155 -34 2 -64 -54 77 44 -59 -37 -170 -291 -76 -94 -352 -184 -20 -200
3326 -200 -7 -83 -149 -166 -51 58 102 -216 47 -73 220 215 13 78 77 36 192 22 3 -280 -262 -78 -34 76
3350 76 -259 -195 -81 -151 -132 6 152 -258 -10 -42 -20 -188 37 -118 -21 34 -43 82 191 6 -116 420 185
3373 185 352 112 91 285 -97 20 128 167 -116 -2 -89 -252 -39 113 -367 -146 6 -202 -132 -95 -124 -185
3395 -185 107 15 23 298 122 -51 -94 -5 15 320 -38 103 -10 -1 30 120 -95 19 -36 163 51 -368 -37 -304
3419 -304 -2 49 -127 300 -11 -116 -94 -12 50 -110 -86 168 117 -81 -80 -109 154 75 45 84 68 -32 11 6 -71 117
3445 117 57 -37 -115 -65 -106 232 -42 -129 -315 -38 -199 -38 29 -33 69 -279 226 -39 -165 -87 317 -64 222
3468 222 100 92 0 192 44 -66 2 137 -178 177 101 -289 -242 51 -140 151 -42 125 -308 -237 44 -109
3490 -109 54 -122 -189 174 84 -192 -311 -53 277 -75 10 94 -80 3 247 133 192 173 -180 -139 98 -110 -33
3513 -33 -85 93 -245 -175 68 -64 -250 -297 -38 -397 316 274 -163 91 205 148 -144 -91 -102 101 40 78 253
3536 253 126 198 -123 -3 180 0 50 318 -198 -207 128 -201 -179 -106 -41 19 140 119 -265 -36 -13 -50 -221 -82
3560 -82 202 -118 15 285 -16 171 201 -40 205 287 128 -178 132 137 -78 -235 -18 -243 -41 295 -48 -247
3582 -247 -302 89 -297 105 284 0 77 -66 149 -15 -36 19 -3 158 186 61 -32 316 264 5 557 -95 -266
3605 -266 34 -54 -34 50 -192 114 52 -7 313 -129 -68 -353 -222 168 185 -128 -283 61 -203 16 313 -58
3627 -58 -201 161 243 -26 64 112 12 -20 21 40 -139 141 -158 63 140 32 -86 -94 104 -257 -179 224 -88 -178
3651 -178 85 -62 -139 -14 -197 -116 -220 328 -252 95 -67 -173 -226 -223 86 -188 144 268 -135 61 106 -231
3673 -231 -88 -5 136 -182 -36 81 -137 36 -136 -115 -53 138 301 55 118 -113 -84 206 59 -178 93 218
3695 218 -238 18 -11 -59 -241 109 181 -60 6 142 -158 -217 12 -70 -99 216 148 -324 -80 120 -339 -84 -252
3718 -252 -21 -154 35 57 -220 357 20 -208 237 484 -203 162 208 -59 -125 7 140 -27 -21 -102 -392 -52
3740 -52 -161 -147 -156 329 -352 -194 134 60 -191 -146 151 -83 278 174 -105 75 39 211 -128 140 50 -84 137
3763 137 230 -52 -155 69 -165 -74 -7 176 -181 -21 47 -146 3 -28 5 -130 -214 102 -161 -32 -95 -243 25
3786 25 28 -112 -120 114 6 87 225 -93 -85 41 22 67 68 -3 -3 -97 254 305 -113 -31 -288 -141 -42 -49 -26 -101 118 -110
3814 -110 -126 95 233 -1 -52 -124 -17 -82 142 -13 37 324 41 169 -65 57 74 -7 85 75 -172 -145 -34
3837 -34 -336 -35 -92 -152 -46 -173 -410 -4 242 16 -92 88 54 19 191 208 191 115 26 104 28 179 -34 -146
3861 -146 195 10 -221 157 273 -106 5 23 57 -153 -99 -159 39 -232 -202 -16 180 127 26 -39 160 -145
3883 -145 -119 69 302 243 14 -5 -51 252 185 -198 125 144 59 -320 -282 65 -188 -42 130 8 25 -350 -120
3906 -120 85 221 -10 70 204 -223 -6 220 77 -118 -34 106 127 108 -200 -41 185 -26 22 -227 -3 -222
3928 -222 -226 113 -182 -62 189 111 292 -128 78 -138 -148 -42 -100 -132 -87 97 378 64 52 -68 323 50 90
3951 90 304 46 -50 156 69 15 39 6 56 219 -282 65 248 -125 9 -147 -270 13 -90 -103 -24 -271 104
3974 104 19 166 -128 -9 -139 163 -39 -35 95 65 193 22 189 -39 68 238 -208 227 58 -40 132 -20
3996 -20 -10 -13 84 13 27 -33 -173 -247 -35 -165 -170 -44 141 1 -50 -111 81 5 51 48 -15 -143 208 189 6 137
4022 137 128 53 -158 67 181 -154 -86 58 -19 -76 59 127 216 -79 -123 -60 -109 -125 59 130 -54 31 17 32 29 109
4048 109 160 -10 178 -6 -59 -322 215 182 12 171 83 -189 81 -119 79 -53 -140 -109 -240 128 -101 -40
4070 -40 -61 42 1 37 -120 90 -303 83 70 268 163 -61 130 11 156 55 -87 95 25 -105 41 -167
4092 -167 35 -285 -30 -141 28 -172 -135 134 154 -103 -187 -351 182 32 100 -12 -160 -49 165 -134 -29
4113 -29 224 4 136 87 292 -88 173 179 -31 -217 184 -85 7 78 -214 -145 21 -83 -45 35 91 295 -187
4136 -187 -70 -156 -41 372 -65 32 -10 52 234 -98 163 27 -1 75 172 41 123 -102 -33 126 -74 -160 -6
4159 -6 -11 106 -277 126 377 -370 -90 204 19 -114 130 82 -30 176 38 -136 -220 114 -68 -167 365 -62
4181 -62 -26 68 -35 -153 158 -31 48 134 93 -294 -117 -72 121 22 -30 -25 -285 -168 132 -70 249 48 -124 237
4205 237 134 39 21 78 128 277 -121 91 79 48 -14 16 -14 172 22 -68 -89 181 -290 -77 259 -49 -27 -247
4229 -247 -152 -139 157 -48 -212 58 49 51 -14 81 -262 -229 183 230 49 212 181 -82 -51 103 -114 132 93 76 96
4254 96 -186 276 -118 84 -29 -267 -87 -192 -90 19 24 90 -2 4 17 -171 148 73 32 99 178 -76 -69 237 -41
4279 -41 92 166 -98 -132 -196 -82 240 69 97 72 -41 57 30 -167 48 -272 -262 40 -38 -349 95 -26 202
4302 202 -22 1 144 -352 270 142 -114 34 -102 -58 -126 -91 -231 -91 70 113 167 324 -6 122 -331 -110
4324 -110 174 -118 -12 143 79 -77 43 -313 -338 -253 -136 42 3 -69 -86 -39 126 -163 166 -155 182 74
4346 74 21 -131 -60 134 -26 56 202 -45 -8 -16 -33 -132 185 -160 -257 -5 -60 176 29 31 -120 62 184 -140
4370 -140 125 39 -84 123 -92 -98 194 137 -76 -52 -108 -8 107 -72 190 -223 -84 53 145 -73 -105 -153 157
4393 157 36 -279 -33 -61 230 -107 -77 40 69 170 -135 194 135 -19 47 -187 -53 -191 36 125 62 -56
4415 -56 264 22 -57 -48 47 -120 -444 -64 -90 -60 -342 56 -59 -10 23 222 -114 159 -12 -165 -98 -58 232 -83
4439 -83 -51 144 -100 202 -18 99 -150 -99 66 69 155 -332 12 -62 -136 105 23 -36 34 -46 77 -112 -126 -176 -153
4464 -153 135 192 162 -126 -18 68 -95 -83 162 47 182 -244 149 -118 -183 4 8 35 -60 -105 75 35 49 -166
4488 -166 -111 -200 68 63 -107 154 -146 41 -134 -96 50 -14 -75 -108 160 43 -117 -232 -177 -30 -145 -147 -87 -180
4512 -180 -70 147 145 80 67 -240 -358 -61 -13 -191 -78 158 145 -78 84 -13 -62 68 -206 -324 -102 -119 45
4535 45 135 363 -142 -16 -44 227 -140 -89 -100 -57 -82 -26 -178 -275 -11 258 69 -156 37 -264 -237 -5 -54 -31
4559 -31 47 -5 -147 177 123 112 74 104 103 21 175 -35 225 137 -85 -72 -13 -101 -108 -162 96 -371 -282 90 -93 32
4585 32 63 -222 -255 -46 81 21 173 222 -113 28 103 160 -148 -4 -87 -52 -91 22 83 -14 264 -154 -1 40
4609 40 384 -126 54 99 -20 -12 -268 -8 13 46 22 -105 -132 127 194 -60 -135 194 13 -110 -30 -146 217 80
4633 80 -206 170 96 -53 -264 84 118 -72 -20 112 -63 83 172 14 199 -157 71 -122 103 65 -283 147
4655 147 196 45 -97 115 -334 49 59 -36 248 -48 -51 -42 145 233 -140 107 190 -134 204 141 -4 -120 306
4678 306 -168 19 -130 -230 -9 116 257 -142 93 139 -114 -39 161 31 -179 72 159 189 140 84 -272 -181
4700 -181 -1 113 39 91 200 -104 -118 62 -152 -89 114 134 -233 138 32 -87 -202 30 35 95 155 -73 -142
4723 -142 203 -111 151 13 -31 74 179 -9 -157 -41 -41 19 -149 125 70 63 -47 350 -208 128 37 95 86 -72
4747 -72 -27 -134 -103 183 -260 -125 4 105 -25 202 -52 -107 147 -7 -46 81 71 -113 63 128 -90 -66 81
4770 81 -156 -185 32 48 -50 152 24 -69 218 -79 52 -50 -194 67 -162 -83 -68 -117 -12 37 113 43 -3 -306
4794 -306 -41 243 -60 110 -21 -114 4 114 153 -278 187 208 -1 16 124 -337 -237 218 255 -198 8 -349
4816 -349 143 -128 302 -85 -56 175 -24 269 59 70 198 166 -9 247 180 41 198 91 52 -59 -79 -53
4838 -53 -60 -37 19 169 79 -186 198 7 -66 -40 54 39 281 165 42 297 -9 321 27 -206 -72 -147 -241 110
4862 110 3 15 21 46 5 193 -236 -156 105 69 -213 -82 -75 22 -347 -106 -114 86 249 211 -276 -26 -53 133 297
4887 297 -244 -10 -37 123 -28 85 103 203 -5 86 33 -84 102 -143 82 -351 -295 26 -147 186 113 -64
4909 -64 -251 -18 10 180 371 34 148 -170 -145 -165 -16 51 31 -163 -4 -22 176 88 152 199 49 -23 -175 -24
4933 -24 300 -234 -50 322 129 -90 135 104 -62 -86 -69 -32 -37 3 35 -228 -87 -9 26 -133 105 173 -133 -38
4957 -38 15 89 -210 148 53 115 85 -111 -314 -207 60 117 -39 -154 63 -67 -144 -12 -36 218 -8 -218 -89
4980 -89 141 71 169 -18 127 48 153 -177 137 -49 91 -173 139 209 45 -40 226 -316 -262 -149 -179 88 111
5003 111 -99 11 13 -88 -267 -65 286 -478 -351 44 302 -225 -61 -22 -302 37 -1 371 22 -123 29
5024 29 -264 20 125 96 191 -89 104 -117 140 -279 96 30 -189 34 87 -350 161 -68 -196 -177 102 99 100
5047 100 52 47 19 113 -31 26 -109 117 -108 -38 25 111 89 -53 -59 -248 150 175 173 -67 78 36 38 -53 -103 -107 159
5074 159 78 -30 -160 194 -22 -30 -91 30 121 -93 -204 -2 -64 -14 -16 204 125 -85 -181 37 -74 -157 85 133
5098 133 -48 -135 107 -3 -116 -117 48 -5 -113 115 -65 85 -15 -104 -7 164 118 7 20 320 11 -129 -94
5121 -94 -41 -51 -176 -1 31 -54 -299 95 -98 -34 -193 -330 -110 -47 -223 -149 -102 -267 27 -232 10 -49 -105 -68
5145 -68 157 62 160 94 173 106 -127 -68 -37 -303 44 342 198 61 -148 135 5 -221 -49 37 -21 -45 -283 17
5169 17 213 -134 -80 -118 -184 -111 114 -145 -298 182 72 -49 165 -108 -128 99 -4 -9 -46 225 -109 36 -151
5192 -151 119 -20 -173 2 77 -95 38 64 -86 51 -7 -121 -233 145 -173 -305 95 -14 -149 -155 -15 -215
5214 -215 122 0 29 66 -101 -271 134 -21 129 43 -81 -235 112 75 42 -114 -67 -170 190 -122 58 23
5236 23 -2 -217 -79 -79 -150 179 -187 27 82 -282 -173 -8 -196 -74 179 40 -120 -50 164 -22 13 203 -126
5259 -126 -82 214 236 -236 -16 51 41 -102 52 -53 -143 -48 274 -168 -69 215 -201 96 241 -154 84 123 -74
5282 -74 -21 254 31 152 -305 72 132 143 50 -102 86 -213 40 -323 -101 -194 13 -142 117 -62 -267 -30
5304 -30 40 -113 240 93 61 164 250 134 -188 -122 -11 115 20 179 -73 11 -132 -117 -24 -3 -58 -192 -64 86
5328 86 98 51 119 -120 -177 192 188 -230 -102 -256 -55 120 90 -54 8 84 146 -125 9 -259 96 156 24 -148
5352 -148 -10 92 -87 42 115 -122 -29 -38 124 -124 -196 122 -100 -146 3 -19 -348 7 -61 240 -27 5 46
5375 46 -35 -17 216 -135 109 92 38 -16 1 -43 -42 154 -277 -142 -90 128 75 24 -186 49 86 -119 40 7 60
5400 60 -179 39 55 -16 -6 -38 -76 -99 -15 -1 56 100 182 44 -63 257 -162 24 44 27 181 273 -130 183 -13
5425 -13 114 -195 -41 -222 -119 176 44 -242 26 -2 -12 -28 -126 284 -143 101 -118 235 -58 -16 -27 116
5447 116 -92 5 46 206 73 4 256 136 24 78 -73 -172 -174 -111 41 75 -143 -194 57 11 -124 -12 3 90
5471 90 104 -172 -21 80 -381 -239 222 31 -38 -100 -32 -146 55 -61 80 -80 -139 -8 -120 29 -149 -175
5493 -175 -237 -187 354 75 32 -11 29 -14 111 60 -54 -279 50 -75 -129 108 146 -5 -90 170 61 28 -178 90
5517 90 -205 -131 89 -124 49 47 -131 -43 -18 -53 -14 107 -242 -147 -52 41 88 -53 72 -14 -112 43 -173 51 110
5542 110 114 116 109 61 -125 28 -94 -107 4 97 46 4 223 22 -72 -87 -37 135 126 -40 138 12 -53 -4 112 66
5568 66 -220 96 44 -136 -35 -153 -193 106 -73 157 -69 57 -84 -37 -34 -55 -175 -163 -68 78 -73 -96 86
5591 86 -194 85 -39 -38 47 33 347 -24 26 -139 -39 135 182 -1 111 62 -57 333 20 -22 -108 98 -195
5614 -195 47 -86 70 -34 14 -166 -155 132 -219 -97 144 -29 362 99 -217 -273 154 -64 107 108 299 -3
5636 -3 -34 193 -48 -56 -83 -15 18 216 142 -161 -69 -48 -84 -59 155 -6 -22 60 -128 -230 10 169 -32 -69 46
5661 46 -106 -154 14 58 -60 -115 296 105 -151 360 41 -125 -56 93 62 278 -68 149 -75 -27 -98 49 -136
5684 -136 221 -18 109 -223 -41 116 37 161 -75 122 -139 29 285 240 -191 -164 155 -206 -181 200 159 42
5706 42 2 95 -198 -175 133 -5 -288 -135 65 88 -173 -8 2 -198 13 251 85 -99 -154 276 346 183 -111
5729 -111 49 -253 39 -59 290 146 124 -93 166 -202 121 130 -45 110 -125 62 -97 -94 -17 65 -97 -33 186
5752 186 -96 -28 -63 43 -66 -50 106 4 -144 -55 44 27 -186 -17 -15 175 86 255 197 122 -204 -94 -92 -90 134
5777 134 -382 0 92 52 292 -63 -177 -148 -160 65 -91 201 221 -74 -305 263 -34 -142 -159 -29 129 37
5799 37 30 89 98 -63 -92 -258 -205 14 -91 142 90 -17 -62 -157 -151 191 66 342 -128 0 -193 50 138 -152 -214
5824 -214 -73 -208 -34 -115 -21 48 -79 2 185 125 90 285 12 1 122 77 -21 -95 -31 128 176 -80 -106 66
5848 66 -91 80 125 -24 90 111 182 119 386 -108 54 122 74 178 60 43 32 -270 229 81 -274 193 186 126
5872 126 3 -72 200 -266 134 -134 -189 -253 -76 -44 89 140 129 -53 41 -109 -182 50 -7 17 -58 120 -27 -149
5896 -149 177 241 10 29 0 -7 -85 -113 -44 27 -25 -183 80 258 53 -19 -101 -53 -133 -191 -112 68 -79 -191 39
5921 39 116 -15 -57 154 -62 -87 163 -40 26 25 109 -37 -185 -117 162 -137 -151 127 -45 -85 110 96 -259 -13
5945 -13 -108 -74 -111 -35 101 -51 114 108 378 103 -70 -51 82 116 24 -247 -74 105 176 -48 301 121 69 -84
5969 -84 25 -248 -269 -221 -168 -86 2 191 -73 57 -147 -102 20 -119 87 25 -108 99 5 49 3 338 115 47
5993 47 49 285 84 45 206 7 37 46 168 -125 13 -134 28 140 -20 -171 -100 -91 -45 -46 31 -91 64 -138 -7
6018 -7 253 -24 188 76 156 -38 118 -44 -217 -308 122 -19 60 36 53 -96 -37 -74 63 -188 -204 98 110 -218
6042 -218 83 -64 -219 -170 91 -64 82 -24 246 -173 -233 125 70 -8 -43 22 28 140 99 183 -106 134 42 -185
6066 -185 -37 -30 -225 29 -69 -41 49 -359 -60 -177 -43 -86 -334 -283 -78 74 -30 -51 247 127 3 255 274
6089 274 -26 194 65 -33 176 103 37 -128 201 -51 -268 57 10 -47 34 -189 -103 -309 -16 164 100 163 15
6112 15 -172 205 67 103 -357 -144 162 -148 57 99 115 161 74 -199 84 -81 -108 1 -96 221 8 -209 -68
6135 -68 -106 -169 203 -96 80 55 -170 20 -156 -43 80 -76 148 -34 200 -48 -211 273 -15 20 70 158
6157 158 4 -62 139 -41 128 80 -87 103 41 50 72 130 -13 -38 82 -95 -15 186 -17 -140 6 -208 15
6180 15 151 -274 29 60 -24 136 83 48 -189 -91 -77 71 13 38 316 -33 45 -105 45 20 -1 -51 129 -156
6204 -156 64 117 -138 239 -106 32 35 125 120 -98 84 -101 -271 77 29 109 85 92 -114 116 -86 375 198 135
6228 135 98 -241 70 38 -143 -160 -71 -116 -153 -19 -67 18 37 -96 -233 80 210 -53 48 6 32 -12 321 47
6252 47 -11 200 217 -82 44 -281 56 68 -190 49 -299 -203 -28 -231 125 219 -48 -46 -68 2 -43 -156 -114 -63
6276 -63 84 37 -63 -7 -14 326 14 172 -46 -72 339 2 165 214 118 -146 -438 120 120 -83 253 115 -164
6299 -164 -65 -5 110 -199 -33 109 0 -76 115 36 -53 -42 416 -122 62 -42 -36 -89 12 -118 -56 143 -105
6322 -105 -101 -152 -74 1 111 -286 -140 -139 217 -60 -21 115 -193 -130 -130 183 107 64 -144 -164 -296 -118 167 202 61
6347 61 25 70 35 17 145 -107 106 -286 26 294 -276 78 -44 136 -104 13 190 -43 184 -71 -54 -314
6369 -314 228 -168 98 -55 139 -173 311 -13 -398 -4 -246 84 -6 -69 205 25 -184 -99 8 -130 91
6390 91 106 36 117 41 -88 -35 49 -31 63 -17 45 93 96 -113 -131 -25 185 45 159 0 31 97 154 88 -4 132 107
6417 107 270 -78 -4 33 57 -148 31 -11 -43 184 -191 -103 -189 41 -179 -163 -221 -252 -84 50 -104 112 -117
6440 -117 312 -158 355 -21 51 66 33 -273 -137 186 198 61 161 9 -221 -99 -31 50 14 129 -215 10
6462 10 3 145 -122 -48 13 -178 -77 22 166 125 155 153 -33 -135 -140 -18 53 -23 -65 25 27 142 151 148 118 235 156 -58
6490 -58 -105 -96 75 -9 0 203 -83 110 170 -22 159 35 9 -300 -46 296 203 -239 -106 -77 -185 68 108 -95
6514 -95 30 -54 329 31 -120 -35 -75 73 -135 -71 241 2 -196 -126 128 201 376 -90 19 65 -44 38 -99
6537 -99 48 -114 -17 -64 142 201 -12 132 280 -37 -96 -159 -128 160 137 -130 -35 -73 -54 -216 -66 -245 143 -335
6561 -335 -37 -2 -258 238 -192 22 18 -48 92 121 -105 107 70 -53 -116 -150 -55 171 216 -127 212 36 -53 131
6585 131 49 32 -57 -71 57 -31 -93 -109 90 -152 43 -63 -117 -107 112 -77 33 -133 -25 -121 21 201 28
6608 28 64 192 33 -53 -20 73 283 193 195 -49 220 81 -342 -81 -71 -38 391 -183 -226 33 86 -182 138 48
6632 48 20 116 162 41 140 -166 -63 250 147 139 -305 220 29 -75 -124 89 -324 -137 79 -167 91 116 -34
6655 -34 -25 -134 155 -181 21 -221 -67 -42 161 -118 -160 -203 -127 117 -6 30 322 78 78 72 97 -117 -145 161 50
6680 50 50 -130 -215 91 -44 169 20 -14 -39 281 60 -17 -71 165 -60 -129 84 -5 6 -295 79 -188 -56 -69
6704 -69 161 118 92 197 -197 96 -80 203 97 55 -226 -38 -174 52 -170 -290 -82 -49 114 131 6 55
6726 55 -104 108 106 87 -186 -7 -139 -36 -92 -53 -207 -245 -13 -255 -22 -163 79 -65 -87 173 -290 -317 103
6749 103 -72 6 203 -190 171 -81 -151 -11 -138 -120 -111 -173 34 -18 26 -231 36 -26 -7 -172 203 83 42 145
6773 145 109 -50 -31 -8 48 -20 -7 -89 163 -32 24 -175 61 -241 -302 -119 88 171 -114 86 16 104 -169 -71
6797 -71 -44 171 6 148 57 -83 125 16 10 124 -141 341 16 -100 276 -26 -35 240 91 -79 104 -30
6819 -30 28 -110 -155 -63 -105 22 -189 -302 -119 96 88 -87 6 134 -26 41 -122 144 98 31 -78 -16 205 -200
6843 -200 34 101 -1 97 62 -194 -225 -20 -96 6 -24 64 419 -254 -28 -69 -84 -257 -91 346 -96 84 175
6866 175 -71 -49 -30 -129 45 -104 -61 32 47 -143 13 -64 125 -145 -130 -94 88 2 258 53 138 264 11 -44
6890 -44 -14 -26 -31 118 71 -83 133 -55 119 -174 28 112 -4 139 140 137 -113 113 -122 99 124 -26 147 132
6914 132 9 59 102 -52 -177 119 37 -48 31 -30 -121 21 50 91 -41 179 -81 101 69 177 -83 -9 -119 -239
6938 -239 -212 151 8 128 -34 35 -199 133 7 -77 157 -195 -33 299 113 57 62 256 64 -37 160 197
6960 197 -122 131 76 -41 41 79 24 -262 16 -181 -116 -174 26 -137 138 34 57 -164 -147 -257 -122 47 -150
6983 -150 -156 -71 -250 -153 14 -116 83 312 289 54 166 -34 -185 -6 -88 95 10 -180 175 -14 -120 -71 -18
7006 -18 -123 -75 19 -43 -40 -236 -63 58 -14 205 -190 -94 -15 -223 47 182 -102 -127 74 -38 -220 102 95 9
7030 9 -246 119 95 -74 -68 -61 243 190 -189 83 -197 -43 -44 124 146 -25 -56 -49 -112 -138 -133 -156 117 3 -32 -251 -118
7057 -118 -62 -212 95 54 -158 221 106 111 -123 -119 -83 -189 71 -32 40 95 167 -346 39 -108 -108 -180 -83 -30 -131
7082 -131 -152 41 66 127 -149 0 89 -250 55 -301 137 -117 -148 -69 229 -83 -53 121 3 -108 141 -146
7104 -146 -212 30 -3 -57 -280 -109 -154 154 -149 -72 -84 -92 83 -32 19 -3 -34 209 140 -140 127 -7 16 45 -140
7129 -140 -51 -160 36 -199 92 267 143 -167 -47 -271 -45 92 -72 -124 -63 -165 -290 -8 41 350 53
7150 53 -52 -74 -155 8 79 -5 -38 -201 81 -63 8 -216 -326 -368 202 128 -234 113 140 107 141 38 222 94
7174 94 101 31 -120 177 92 11 -65 -56 178 -186 213 -27 10 -62 -88 -72 97 -86 90 -119 63 -31 -177 35 -31
7199 -31 191 -120 -310 96 -406 -87 196 140 60 -106 -181 -39 -119 79 182 5 150 -73 161 -86 -160 44
7221 44 -33 -14 42 310 181 46 94 62 77 169 -83 7 50 74 112 33 -118 -120 84 -222 -34 -66 237 -5 -54 136
7247 136 -111 70 -39 12 -16 -109 109 -100 106 13 106 112 5 -47 -112 -111 8 111 -48 179 198 86 -45 -192
7271 -192 -19 97 56 90 -13 203 353 166 96 231 -78 102 192 -93 -55 70 -103 100 71 -32 -30 -144 179
7294 179 40 -21 100 -18 161 -26 -11 -91 -67 -107 -223 -8 18 39 156 -212 21 -124 -148 220 -22 94 64
7317 64 14 -45 36 -90 -111 49 81 164 231 68 56 -10 254 38 -5 -143 -257 -52 19 101 17 124 -25 130 -15
7342 -15 -66 36 -35 -163 56 99 -270 81 -36 -220 313 64 -42 167 -39 36 127 119 19 3 162 129 4
7365 4 -106 -183 32 158 31 299 -47 104 262 66 -33 -94 -110 -45 30 47 245 -23 -32 65 67 -51 -61 -99 238
7390 238 -95 -122 -31 -235 17 83 33 -82 10 -74 -81 105 -120 -143 111 158 -88 -26 42 45 -88 215 -1 15 -53
7415 -53 53 43 58 81 -232 -224 181 55 -70 197 16 -35 -9 93 81 -218 -138 174 -108 -36 5 -10 193 108 -293
7440 -293 77 137 -49 205 -25 19 -39 -79 -95 -18 18 -204 256 133 -177 -209 -145 -36 -61 -24 206 4 -196 242
7464 242 -120 132 171 283 4 157 -6 -33 90 79 85 -255 253 29 -79 147 206 -188 64 94 -34 242
7486 242 206 161 -210 115 -17 -113 -117 -118 192 44 104 -106 63 21 -58 165 -280 -32 28 193 188 -97 86 111 -149
7511 -149 -134 196 -120 52 -227 69 -12 -107 150 46 174 46 -23 34 -76 33 -230 -191 -46 180 -29 -289
7533 -289 46 -169 -212 -51 -114 -205 -67 -115 -89 -159 17 -217 172 126 108 178 174 -54 -225 -110 -50 -150 -56 5 97
7558 97 261 -154 -192 -71 -8 -96 -226 20 -9 -11 -66 10 191 62 197 -28 356 93 16 115 121 205 51 -265 58
7583 58 132 194 -40 69 -159 16 -66 178 87 -180 14 -55 -120 59 -207 -9 224 96 -13 16 -77 -175 35
7606 35 68 87 171 -170 151 239 106 2 134 307 -207 98 -57 -10 114 75 198 -109 -431 -197 123 -141
7628 -141 -40 108 77 26 -81 -69 -418 84 -110 -115 0 142 60 -36 280 122 -59 -297 -26 32 -75 -111 -125
7651 -125 -68 -53 112 5 -155 -11 110 -54 -211 -338 -4 74 -139 -80 137 112 42 234 -29 -206 72 -132
7673 -132 -1 -77 -57 65 174 -139 88 11 11 -212 -26 -47 -19 56 131 -70 73 -48 161 247 55 192 -1
7696 -1 -112 243 60 307 -110 -9 53 -312 189 -28 309 274 -358 120 60 109 70 42 -1 -46 188 -94 301
7719 301 190 -51 -184 -50 -29 -86 -146 71 -98 -91 -207 -230 -61 86 211 131 -31 56 86 73 21 -94 189 70
7743 70 32 -19 -173 -189 64 86 155 -292 152 -14 290 -12 -299 55 -7 15 -129 -232 259 -208 1 -63 -1
7766 -1 37 48 160 127 12 222 -132 36 20 99 -93 89 -114 53 -6 -98 -28 136 -90 -33 69 151 44 -170
7790 -170 76 -20 87 214 -115 43 67 42 -85 -310 181 4 -12 4 -222 28 20 163 -115 -119 -113 -79 -14 -112 -121
7815 -121 -58 -60 81 -61 -155 -99 -4 -73 -140 258 201 -215 311 -88 228 43 308 193 -122 92 -46 -121 225
7838 225 65 -118 93 18 136 -87 -1 47 151 -37 36 79 121 24 -80 -18 65 132 -15 -41 227 41 -57 -231
7862 -231 188 38 70 197 1 64 -64 -101 86 103 -3 -109 4 8 90 -147 -127 -9 -35 -138 164 229 230 -34
7886 -34 -245 209 -19 -48 127 58 69 -28 237 -30 131 123 53 24 156 47 237 -11 28 136 99 122 -73 -241
7910 -241 -283 81 -114 -84 -13 -8 -160 35 85 -143 -103 64 -3 237 -94 71 176 18 -195 39 238 -59 -24
7933 -24 87 287 121 22 299 131 -116 -50 -65 110 136 244 6 125 -10 34 -142 -68 -2 225 39 46 33 -32
7957 -32 230 -59 -212 -91 -181 143 -81 47 175 70 -51 74 -19 51 124 98 87 -128 -160 20 -55 -89 -229
7980 -229 -283 -373 -138 -44 85 96 317 -133 -20 89 -3 125 -57 94 13 24 172 -86 -23 34 126 -107 -98 -183
8004 -183 -71 -32 -19 -49 -135 -80 -44 -21 -69 27 205 105 -116 55 12 74 -58 -109 147 -80 226 83 -144 7
8028 7 -93 166 235 42 -335 -88 73 -98 87 111 -136 -16 -53 -88 55 71 -80 -104 -161 208 67 -155 -183
8051 -183 -83 15 91 -53 262 -74 -47 -51 51 -16 29 -161 -135 27 143 -16 -23 212 -112 226 -103 -37 75 -103
8075 -103 87 -166 -195 -54 -100 -74 14 76 -77 5 16 226 22 -131 46 -76 -92 127 -183 -51 -7 72 47 209
8099 209 -197 -292 -6 -32 116 -43 -82 -145 -10 154 -62 19 -2 288 -229 16 373 -207 61 -23 -132 23
8121 23 -136 -144 -95 260 -27 -199 245 -218 176 -46 79 -161 129 -57 156 -150 -242 199 -227 -52 114 103
8143 103 12 -22 -74 -12 135 8 -111 -52 26 76 137 -111 -150 -15 65 -121 86 -3 103 48 -1 -203 -52 -58 6
8168 6 84 -2 -209 -74 15 -101 -31 62 -296 2 -36 -66 4 66 18 47 67 -127 62 59 63 -125 41
8191D1
##END NTUPLES=NMR FID
##END=
