##TITLE=1H_Pr MeO
 CD3OD
 8 sc, 
 17.10.2022
##JCAMPDX= 6.0         $$ Bruker NMR JCAMP-DX V2.0
##DATA TYPE= NMR FID
##DATA CLASS= NTUPLES
##ORIGIN= UXNMR, Bruker Analytische Messtechnik GmbH
##OWNER= root
$$ XWIN-NMR		Version 3.5
$$ Mon Oct 17 16:08:25 2022 Russian Standard Time (UT+4h)  she@DPX200
##.OBSERVE FREQUENCY= 200.1313499994
##.OBSERVE NUCLEUS= ^1H
##.DELAY= (6, 6)
##.ACQUISITION MODE= SIMULTANEOUS
##.ACQUISITION SCHEME= undefined
##.AVERAGES= 8
##.DIGITISER RES= 18
##SPECTROMETER/DATA SYSTEM= spect
##.PULSE SEQUENCE= zg30
##.SOLVENT NAME= MeOD
##.SHIFT REFERENCE= (INTERNAL, MeOD, 0, 15.7039)
##AUDIT TRAIL= $$ (NUMBER, WHEN, WHO, WHERE, WHAT)
$$ ##TITLE= Audit trail, XWIN-NMR		Version 3.5
$$ ##JCAMPDX= 5.01
$$ ##ORIGIN= Bruker BioSpin GmbH
$$ ##OWNER= she
$$ F:/spectra/data/she/nmr/H-F/1/audita.txt
$$ ##AUDIT TRAIL=  $$ (NUMBER, WHEN, WHO, WHERE, WHAT)
(   1,<2022-10-17 16:07:07.82 +0400>,<she>,<DPX200>,
      <created by zg, POWCHK disabled, PULCHK disabled
       configuration hash MD5:
       00 E9 B6 7A A2 85 ED C7 34 08 36 98 17 FE 4E 26
       data hash MD5: 16K
       FF CC DE 38 21 56 73 2A 95 6F 0B 69 F8 52 E8 C9>)
$$ ##END=
$$ 
$$ hash MD5
$$ 4D 0E 28 7E B2 8C 84 DF 73 64 A1 86 E3 04 ED 11
##$RELAX= 
##$RELAX= 
##$RELAX= 
##$RELAX= 
##$RELAX= 
##$RELAX= 
$$ Bruker specific parameters
$$ --------------------------
##$DU= <F:/spectra>
##$EXPNO= 1
##$NAME= <H-F>
##$PROCNO= 1
##$TYPE= <nmr>
##$USER= <she>
##$AMP= (0..31)
100 100 100 100 100 100 100 100 100 100 100 100 100 100 100 100 100 100 
100 100 100 100 100 100 100 100 100 100 100 100 100 100 
##$AQSEQ= 0
##$AQ_mod= 1
##$AUNM= <au_zg>
##$AUTOPOS= <>
##$BF1= 200.13
##$BF2= 200.13
##$BF3= 200.13
##$BF4= 200.13
##$BF5= 200.13
##$BF6= 200.13
##$BF7= 200.13
##$BF8= 200.13
##$BYTORDA= 1
##$CFDGTYP= 0
##$CFRGTYP= 5
##$CHEMSTR= <none>
##$CNST= (0..31)
1 1 145 1 1 1 1 1 1 1 1 1 1 1 1 1 1 1 1 1 1 1 1 1 1 1 1 1 1 1 1 1 
##$CPDPRG= <>
##$CPDPRG1= <>
##$CPDPRG2= <>
##$CPDPRG3= <>
##$CPDPRG4= <mlev>
##$CPDPRG5= <mlev>
##$CPDPRG6= <mlev>
##$CPDPRG7= <mlev>
##$CPDPRG8= <mlev>
##$CPDPRGB= <>
##$CPDPRGT= <>
##$D= (0..31)
0 1.2 0 0 0 0 0 0 0 0.06 0 0.03 0 0 0 0 0.0002 0 0 0 0 0 0 0 0 0 0 0 0 
0 0 0 
##$DATE= 1666008427
##$DBL= (0..7)
120 120 120 120 120 120 120 120 
##$DBP= (0..7)
150 150 150 150 150 150 150 150 
##$DBP07= 0
##$DBPNAM0= <>
##$DBPNAM1= <>
##$DBPNAM2= <>
##$DBPNAM3= <>
##$DBPNAM4= <>
##$DBPNAM5= <>
##$DBPNAM6= <>
##$DBPNAM7= <>
##$DBPOAL= (0..7)
0.5 0.5 0.5 0.5 0.5 0.5 0.5 0.5 
##$DBPOFFS= (0..7)
0 0 0 0 0 0 0 0 
##$DE= 6
##$DECBNUC= <off>
##$DECIM= 32
##$DECNUC= <off>
##$DECSTAT= 4
##$DIGMOD= 1
##$DIGTYP= 9
##$DL= (0..7)
0 120 120 120 120 120 120 120 
##$DP= (0..7)
150 150 150 150 150 150 150 150 
##$DP07= 0
##$DPNAME0= <>
##$DPNAME1= <>
##$DPNAME2= <>
##$DPNAME3= <>
##$DPNAME4= <>
##$DPNAME5= <>
##$DPNAME6= <>
##$DPNAME7= <>
##$DPOAL= (0..7)
0.5 0.5 0.5 0.5 0.5 0.5 0.5 0.5 
##$DPOFFS= (0..7)
0 0 0 0 0 0 0 0 
##$DQDMODE= 0
##$DR= 18
##$DS= 0
##$DSLIST= <SSSSSSSSSSSSSSS>
$$ [...]
##$SUBNAM2= <"">
##$SUBNAM3= <"">
##$SUBNAM4= <"">
##$SUBNAM5= <"">
##$SUBNAM6= <"">
##$SUBNAM7= <"">
##$SUBNAM8= <"">
##$SUBNAM9= <"">
##$SW= 18.0517283424941
##$SWIBOX= (0..15)
0 0 2 0 0 0 0 0 0 0 0 0 0 0 0 0 
##$SW_h= 3612.71676300578
##$TD= 16384
##$TD0= 1
##$TE= 0
##$TE2= 300
##$TE3= 300
##$TEG= 300
##$TL= (0..7)
0 120 120 120 120 120 120 120 
##$TP= (0..7)
150 150 150 150 150 150 150 150 
##$TP07= 0
##$TPNAME0= <>
##$TPNAME1= <>
##$TPNAME2= <>
##$TPNAME3= <>
##$TPNAME4= <>
##$TPNAME5= <>
##$TPNAME6= <>
##$TPNAME7= <>
##$TPOAL= (0..7)
0.5 0.5 0.5 0.5 0.5 0.5 0.5 0.5 
##$TPOFFS= (0..7)
0 0 0 0 0 0 0 0 
##$TUNHIN= 0
##$TUNHOUT= 0
##$TUNXOUT= 0
##$USERA1= <user>
##$USERA2= <user>
##$USERA3= <user>
##$USERA4= <user>
##$USERA5= <user>
##$V9= 5
##$VALIST= <valist>
##$VCLIST= <CCCCCCCCCCCCCCC>
##$VD= 0
##$VDLIST= <DDDDDDDDDDDDDDD>
##$VPLIST= <PPPPPPPPPPPPPPP>
##$VTLIST= <TTTTTTTTTTTTTTT>
##$WBST= 1024
##$WBSW= 4
##$XGAIN= (0..3)
0 0 0 0 
##$XL= 0
##$YL= 0
##$YMAX_a= 52191
##$YMIN_a= -44199
##$ZGOPTNS= <>
##$ZL1= 120
##$ZL2= 120
##$ZL3= 120
##$ZL4= 120
##$ABSF1= 10
##$ABSF2= 0
##$ABSG= 5
##$ABSL= 3
##$ALPHA= 0
##$AQORDER= 0
##$ASSFAC= 0
##$ASSFACI= 0
##$ASSFACX= 0
##$ASSWID= 0
##$AUNMP= <proc_1d>
##$AZFE= 0.1
##$AZFW= 0.1
##$BCFW= 1
##$BC_mod= 2
##$BYTORDP= 1
##$COROFFS= 0
##$CY= 11.3945322036743
##$DATMOD= 1
##$DC= 2
##$DFILT= <>
##$DTYPP= 0
##$F1P= 2.36226072786647
##$F2P= -0.459571619588291
##$FCOR= 0.5
##$FTSIZE= 0
##$FT_mod= 4
##$GAMMA= 1
##$GB= 0.15
##$INTBC= 1
##$INTSCL= 1
##$ISEN= 128
##$LB= 0.24
##$LEV0= 0
##$LPBIN= 0
##$MAXI= 10000
##$MC2= 0
##$MEAN= 0
##$ME_mod= 0
##$MI= 1.114404
##$NCOEF= 0
##$NC_proc= 0
##$NLEV= 6
##$NOISF1= 3.799351
##$NOISF2= 2.8
##$NSP= 1
##$NTH_PI= 0
##$NZP= 0
##$OFFSET= 15.70392
##$PC= 1
##$PHC0= -17936.4
##$PHC1= -3.99931
##$PH_mod= 1
##$PKNL= yes
##$PPARMOD= 0
##$PSCAL= 0
##$PSIGN= 0
##$REVERSE= no
##$SF= 200.130013532006
##$SI= 16384
##$SIGF1= 3
##$SIGF2= 2
##$SINO= 400
##$SIOLD= 16384
##$SREGLST= <1H.CDCl3>
##$SSB= 0
##$STSI= 0
##$STSR= 0
##$SW_p= 3612.71676300578
##$SYMM= 0
##$S_DEV= 0
##$TDeff= 0
##$TDoff= 0
##$TI= <>
##$TILT= no
##$TM1= 0
##$TM2= 0
##$TOPLEV= 0
##$USERP1= <user>
##$USERP2= <user>
##$USERP3= <user>
##$USERP4= <user>
##$USERP5= <user>
##$WDW= 1
##$XDIM= 8192
##$YMAX_p= 0
##$YMIN_p= 0
$$ End of Bruker specific parameters
$$ ---------------------------------
##NTUPLES= NMR FID
##VAR_NAME=  TIME,          FID/REAL,        FID/IMAG
##SYMBOL=    X,             R,               I
##VAR_TYPE=  INDEPENDENT,   DEPENDENT,       DEPENDENT
##VAR_FORM=  AFFN,          ASDF,            ASDF
##VAR_DIM=   8192,          8192,            8192
##UNITS=     SECONDS,       ARBITRARY UNITS, ARBITRARY UNITS
##FACTOR=    0.0002768,     1,               1
##FIRST=     0,             0,               0
##LAST=      2.2672688,     0,               0
##MIN=       0,             -44199,          0
##MAX=       2.2672688,     52191,           0
$$ Real data points
##PAGE= N=1
##DATA TABLE= (X++(R..R)), XYDATA
0@%%%%%%%%%%%%%%%%%%%%%%%Qj6J6j6J6j6J6k0K8l2L2l4M2m8N2o0O4p2Q2r0J02
44E4j11J21j36J50j64J82k01K21k42K66k96L28l64M06m54N11n78O61p66R04j092
65f00J364j800K610m609J8888L6338j3525j3865j7686k8804k2510M989J1784J8563
79h863L1376K2547p156j6351j7176k5415k0949K905J6667K1942K6066J5211q344
92C2460j7932j8677k1629j3847O280J7492K0505K1979J1854p285j6653j9793k2401
105b7647j1567R841J9600J9020J7919P775r954j7305j6645j7106q416J0022J9346
118e117J7685J5126O049j0267j8575j7604j5435n217J2944K0419J4963J0323L825
131B9119j0114j8428j5199j0632l531J1193K0306J5294P564J282j0349j9861j6356
$$ y = [0, 0, 0, 0, 0, 0, 0, 0, 0, 0, 0, 0, 0, 0, 0, 0, 0, 0, 0, 0, 0, 0, 0, 0, 8, -8, 8, -8, 8, -8, 8, -12, 16, -16, 16, -18, 24, -24, 28, -32, 32, -40, 42, -48, 54, -57, 64, -72, 78, -86, 96, -105, 116, -126, 140, -156, 172, -192, 214, -240, 271, -307, 354, -412, 492, -600, 764, -1036, 1574, -3035, 15853, 52191, 38666, 24801, 7115, -21689, -44199, -39210, -27426, -8863, 22513, 45060, 37904, 21553, 4377, -21038, -41987, -39082, -22415, -473, 25593, 40804, 32460, 14528, -4149, -25778, -39625, -33345, -15853, 4652, 26631, 38485, 31200, 14547, -5246, -27647, -39214, -29373, -9773, 9247, 27166, 34941, 24987, 7682, -8963, -26069, -34485, -24463, -5117, 12568, 27694, 33743, 23476, 4901, -12703, -28138, -33355, -20411, 8, 14971, 25294, 29119, 19005, 577, -14622, -25254, -28785, -17592, 2714, 18008, 25572, 26854, 16505, -3356, -19712]
144a9712o472J920J1204J7573J3993N509j452r745j7125j5134n638L782J1590
157i707J6243J3168M435m434j2199j6168j2035k779N407J1750J4696J0673K682
170B1732m421j1349j5743j1209r03O665J1515J4262R753j60p198j1021j3315r027
184b0419J016P806J0442J2227R029m26q263j1531j2204p518K128Q793J0586J0902
198A2568O926k385r324j0568r779n624K686Q778J0138R905N854l464j0317j0585
212e191q433m028L868R608R783P751L588m077r735r631p078k870M280R752R704
227G291O693J876n101r815r117n844j152N379R545Q415N172R33n258r483q444
242h910m771k48N818R752Q088L716p36n863r201p477l185J050N736Q956P457K911
$$ y = [-19712, -26184, -24264, -13060, 4513, 18506, 24015, 22563, 12818, -4307, -19441, -25079, -21297, -9707, 6536, 19704, 24139, 19705, 7506, -8662, -20697, -23476, -18069, -6319, 8377, 19050, 21732, 17311, 5962, -9781, -20990, -21893, -15228, -3713, 10549, 20302, 20142, 12944, 1923, -11392, -20419, -19403, -11597, -1155, 11072, 20101, 19675, 11412, -119, -12323, -19841, -17713, -8920, 1666, 12568, 19494, 17109, 7785, -2783, -12562, -18186, -15500, -6722, 3416, 13321, 19175, 15711, 5394, -5191, -13624, -17652, -13784, -4176, 5607, 13358, 16946, 12869, 3134, -6497, -13575, -16445, -12165, -2413, 7291, 13984, 15860, 10759, 944, -8173, -14017, -15169, -9790, -245, 8170, 13342, 14275, 9017, -466, -8910, -13681, -13929, -8111, 1641, 9729, 13445, 12709, 6846, -2355, -9832, -13017, -11967, -6231, 2725, 10182, 13093]
258A3093j695o147q788o985k231K282O318Q481O402J595k798o257p982n877j265
273a1854K878O233P934N793Q33l568o568p671n095J0M024O198O894M657m9m055
289F594o233o795m446M21M541O398O428L894r30m877o337n903l176J333M805O015
305A732N512K988j412m928o051n405k694J832N421O133M839J887k355n316n578
320c395m171j684K141N208N641M179J414k487n535n710l757q21K892N519N324
335D758L162L01k918n234m953k883k51K879N246N075K828j43l386n564m883k095
351h061Q23L491N108M305J779p97l203m909m319j774J030L525N089M236J322j650
367E995l821m882l691p56J885L617M446L424P67j750l518m493l493o80K128L924
$$ y = [13093, 11398, 5251, -3537, -10522, -12753, -10471, -4153, 4328, 10730, 12325, 9527, 3270, -4712, -10589, -11854, -8976, -2743, 5191, 10984, 11817, 8249, 1681, -5990, -11085, -11075, -7051, -853, 6041, 10698, 10649, 6594, 361, -6434, -10880, -10459, -5918, 480, 6908, 10802, 9872, 4995, -1342, -7245, -10421, -9088, -4283, 1732, 7244, 10232, 8820, 3892, -2159, -7564, -10258, -8426, -3005, 3128, 7967, 9854, 7499, 2183, -3395, -7566, -9250, -7109, -1901, 3740, 7919, 9333, 6846, 1311, -4399, -8156, -8977, -6085, -566, 4758, 7920, 8221, 5303, 69, -4884, -7767, -8018, -5139, 107, 5182, 8010, 7867, 4481, -1083, -5966, -8061, -7238, -3747, 1361, 5666, 7445, 6648, 3445, -1464, -5783, -7557, -6527, -3002, 2087, 6323, 7645, 5995, 2174, -2708, -6399, -7155, -5270, -1653, 2793, 6217, 6984, 5234, 1716, -2777, -6270, -6950, -4822, -898]
383h98M481L048j7k617l832l906k485J66K431L552L779K605m5k604l871l867k381
400f461M42K995L901L465J775q63k991l562k965j538P68K823L545L081J609r17
416E107l194l871k986j132J395L383L539K338P08j319k990l222k272p73J292L158
432h39L458K272M55j710l411l428j859J8J907L239L030J551o5j662k933k960j632
449d569M1J822L232L083J366n89k245l200k632q91P85K062K861K509R56o80k008
466A903k921k592r56Q63K311L005K328M54j298k358k689j926k61J250K152K513
482A778J983L94j229k341k750j974j55J613K480K491J528j46j650k262k139j383
498c762J48J630K270K165J413j66j801k551k200j104N41J972K386J859Q49n62
$$ y = [-898, 3583, 6631, 6614, 3997, 165, -3741, -6226, -6060, -3629, -77, 3702, 6307, 6262, 3658, -213, -4080, -6461, -6019, -3024, 877, 4342, 6117, 5254, 2263, -1299, -4264, -5802, -5034, -2211, 1334, 4415, 6024, 5107, 1913, -1958, -4944, -6076, -4681, -1298, 2241, 4579, 5287, 3968, 978, -2244, -4516, -5289, -3997, -839, 2619, 4891, 5346, 3636, 225, -3203, -5062, -5044, -3137, 102, 3132, 4683, 4618, 2956, 23, -2937, -4569, -4528, -2706, 526, 3609, 4975, 4386, 2141, -1059, -3691, -4582, -3797, -1735, 1126, 3635, 4591, 3911, 1903, -1018, -3610, -4566, -3703, -1392, 1613, 3941, 4395, 3097, 739, -1950, -3876, -4137, -2887, -735, 1778, 3761, 4155, 2926, 585, -2165, -4139, -4294, -2681, -201, 2290, 3818, 3672, 2022, -240, -2379, -3762, -3614, -1984, 286, 2451, 3864, 3698, 1897, -654, -2854, -3958, -3417, -1445, 941, 2800, 3649, 3087]
514C087j799k183j726p88N09J821K268J809P20q06k101k371j549l19R84J954K070
531A580J367L37q91j901k048j340l08R51K026K099J222K0j225k063j948r27J92
548b857J197J893J801Q98j64j151j879j871r14K86J340J998J736O18n94j346j789
565g98j509n52N78J368J722J488N42o15j433j791j492m19Q23J567J705J213K01
582B598q35j434j543j142j84Q57J467J579J106J19r63j579j566r42J11J058J485
599A92J394Q11j33j038j436j316p91J64J082J529J308O68l22j224j516j168m78
616b274L74J166J391J095M32l79j161j421j070l88M59J264J450R55J92o15j220
633B50j303q35j37N82J192J273Q35J27o34j229j313p53K2P69J244J194O01j30
$$ y = [3087, 1288, -895, -2621, -3409, -2900, -1079, 1189, 2998, 3718, 2912, 811, -1560, -3109, -3428, -2444, -490, 1580, 2947, 3284, 2393, 492, -1556, -2896, -3204, -2253, -227, 1872, 3094, 3114, 1889, -174, -2122, -3049, -2857, -1660, 233, 2034, 2932, 2768, 1617, -262, -2133, -3047, -2761, -1421, 577, 2313, 2931, 2337, 991, -798, -2307, -2859, -2281, -913, 809, 2297, 2839, 2224, 791, -1000, -2492, -2911, -2088, -521, 1184, 2397, 2598, 1763, 329, -1214, -2356, -2540, -1683, -216, 1363, 2469, 2588, 1625, 46, -1520, -2462, -2351, -1293, 192, 1586, 2397, 2264, 1226, -210, -1526, -2317, -2153, -1071, 458, 1766, 2434, 2112, 888, -628, -1796, -2274, -1900, -734, 657, 1752, 2184, 1805, 644, -777, -1847, -2235, -1776, -512, 938, 1893, 2085, 1470, 250, -1053, -1888, -2025, -1443, -251, 1022, 1857, 1984, 1350, 121, -1192, -1945, -1923, -1154, 90, 1284, 1885, 1755]
651A755p57j154j107n81J50P57J154J142N45j98q82j229j046m04L71Q91J097R11
669A415L27l50q40j072r19l43M14R10J108Q96K28n19r92j041p34j04N43Q90R51
688G68O86J40n15r33r74o93p4N97J024R77N56q0o92r54q22m73R7O08R11Q29M65
709A448q4o69r76q34m11K06P97R76P08K46k87p27q46o52k37K23P09R04O75K39
729A408l01q07r46o08p9M08P97Q24M87K4l73p16p65n25n6L83P61Q22N05k0n19
750G04q11p80l60J52N20P34O45L23r5m59p04o99l74J25N61P82O77K86k64o23p22
771c82n42j54K57N50O44N29K10k28n65p08n68j92L28O63P02M68M6l87o16n84l84
792i13m6L20N71N82M17P5l56o62o41l87M3M58O55N60K80j12m24n59m79k56N0L78
$$ y = [1755, 998, -156, -1263, -1844, -1694, -937, 217, 1359, 1904, 1706, 824, -405, -1451, -1855, -1484, -593, 504, 1415, 1742, 1392, 552, -520, -1439, -1782, -1368, -458, 650, 1546, 1774, 1255, 263, -778, -1512, -1616, -1073, -183, 768, 1454, 1594, 1079, 146, -828, -1521, -1595, -998, 26, 1003, 1559, 1479, 787, -167, -989, -1462, -1365, -757, 154, 983, 1448, 1364, 695, -281, -1115, -1526, -1320, -523, 453, 1161, 1407, 1120, 393, -453, -1105, -1342, -1119, -410, 494, 1169, 1408, 1107, 300, -646, -1254, -1333, -925, -128, 696, 1183, 1207, 834, 118, -647, -1172, -1228, -845, -84, 738, 1243, 1223, 704, -107, -887, -1247, -1095, -575, 159, 804, 1127, 1032, 573, -131, -830, -1204, -1079, -518, 264, 941, 1227, 963, 340, -382, -924, -1078, -821, -271, 373, 902, 1112, 884, 319, -389, -957, -1149, -821, -158, 544, 1012, 1058, 671, 55, -529, -913, -959, -639, -68, 514, 931, 1006, 650, -12, -653, -1040, -997, -539, 116, 676, 956, 844, 420, -139, -618, -874, -824, -446]
814d46N78N38K79j08m92o43n12j53K22M93N86M02J05j92m11n24m14j58J67M62
834b21N73M35Q9k77n33n53l33K4L20M46M87K85J4k47m46m94l39j5K96N26N23K69
856H29q9l84m85m13j76J17L31M10L90K20j00l39m53m46j97J34M05M90L70J20k28
877E06l66m09k99j02J68L40M04L32J03j76m05m41l20o7K55M41L80K48J2k32l73
898al42k18l4K31L66L78K42lk92m22l57j93J01L02L85L02J40q5k48l67l07j55
920e77P3K76L97L04J15j22l40l66k62m6J50K99L38K35N6j26k96l56k53m7J69L36
942d3L44K18k2k03l12k90j68L0J96K72K78J86j8k00l06l12j80O2K49L20K58J04
964D63p6k38k69k38j04O8K26K79K57J05r6k62l00k29o9J35K66K82J75N4j22k34
$$ y = [-446, 132, 670, 949, 841, 349, -294, -806, -959, -737, -244, 342, 744, 849, 657, 246, -278, -692, -850, -683, -221, 352, 787, 876, 599, 66, -487, -820, -796, -476, -30, 457, 742, 756, 509, 63, -431, -770, -785, -489, 37, 560, 829, 740, 356, -129, -542, -718, -601, -270, 140, 530, 750, 650, 311, -142, -588, -785, -651, -246, 244, 614, 734, 506, 140, -269, -568, -670, -502, -162, 242, 574, 677, 501, 96, -345, -665, -732, -477, -36, 344, 592, 604, 372, -1, -343, -561, -595, -364, 2, 380, 622, 619, 327, -95, -452, -645, -544, -242, 143, 445, 585, 500, 252, -115, -422, -577, -504, -228, 169, 473, 588, 466, 126, -240, -502, -548, -398, -99, 239, 474, 530, 404, 108, -248, -501, -548, -379, -43, 301, 519, 497, 294, -18, -308, -476, -446, -250, 22, 300, 486, 468, 268, -38, -350, -530, -468, -219, 101, 359, 463, 387, 149, -120, -358, -462, -394, -168, 111, 368, 473, 377, 115, -185, -414, -483, -348, -82, 200, 375, 429, 307, 73]
986G3k53j85n2J22K53K75J91J4j54k78k65j35K2J57K46K29J17oj44k57k29j35
1008c94J2J69K87K20R0n9j99k35k10n3N3J71K21K08Q5o4j86k54j93n4R2J91K65
1031A63J55K5j18j84k15j46j6Q4K06K02J56K8j22j91k48j30J9J42K11J95Q6l4
1053B68j16j70j85j17J1J32K10J78J13k7j72k16j63n5O2J66J63J32P0m6j34j73
1075f9j59r4R2J59K06J32L9r8j97j72j03j5R4J58J42J14K9q7j44j87j17j2J23
1098a66J79J70P4k8j19j67j19p5J8J11J47J46Q1j9j19j71j60o0O5J49J64J08K5
1121B34o3j03j41j14m8M8J17J42J26M5o7j51j57j09KR6J41J23N4Lo1j15j23j01
1145b22rQ4J24J39J04j4j14j27j35m6M8R7J10Q9O9k2r1r9j18q1K0J19J28J26K8
$$ y = [73, -180, -365, -417, -295, -42, 233, 424, 438, 284, 6, -259, -394, -372, -215, 31, 260, 377, 371, 227, -30, -259, -394, -382, -213, 74, 294, 384, 325, 126, -109, -319, -372, -319, -148, 73, 281, 366, 302, 116, -138, -331, -385, -293, -102, 163, 318, 343, 225, 41, -174, -320, -336, -252, -46, 156, 312, 340, 218, 27, -221, -351, -332, -190, 21, 216, 302, 268, 152, -18, -203, -320, -309, -177, 33, 211, 324, 297, 125, -91, -254, -309, -247, -81, 82, 214, 284, 238, 104, -69, -228, -322, -230, -71, 135, 267, 306, 208, 11, -161, -264, -279, -185, -27, 115, 229, 258, 171, 27, -160, -277, -289, -166, 13, 183, 257, 229, 110, -57, -176, -251, -233, -122, 25, 171, 252, 233, 114, -57, -217, -277, -212, -63, 101, 209, 234, 171, 68, -73, -187, -235, -187, -70, 72, 198, 243, 176, 25, -132, -241, -239, -143, -2, 121, 175, 178, 117, 2, -121, -222, -231, -147, -23, 116, 220, 206, 92, -35, -170, -216, -168, -71, 39, 128, 197, 175, 84, -15, -133, -214, -194, -75, 53, 179, 207]
1170B07n2j20j08p1k4N1P0J03P4M3l7r6j31j07j9P1J22J35P1lp8j13r2m8nN5R0
1197a2J14O3J3p1j25j18n6L0Q5J30Q4K6j7r0q4q9l7J0N7J05J08L6l0p6j22j00
1223a66oN5Q8J00N7Rl4q3q3o7l3L8Q4J07P4Ml6r5j11l6J4O2O1Q5N4Kn5o4j11o9
1253a55J1N9J00J04L6k5o8q2o8l3J5N4Q1N0M8j6o2q8q6m1L1R2Q9P0K2m2p2p4n7
1282a07j6L3O3P7N4K4k8p6r2n2jM6Q9P4L3pm9o3o2m2nK4Q4P7M3k0m4q2o4k8K1
1313i6N6O5M9L2j6l7p0p7k6K2N0Q3N7J4k1n8p3l5j9L9M7N8M3J7j7o2p3n2j4L7
1343g7P3N9L2lm1l4n3m2kL4L6O0L9ml3m5q3k3J0N3O4M3K8k7l8l3n6k7J0N0M4N1
1375F5K9j7n4m7l8k3K8M8M4M5Qk6m0n6l1j5J0N2O3K1J5l5n3o5jJ4ON0M5K2j0p
$$ y = [207, 155, 35, -73, -144, -168, -117, -47, 56, 130, 173, 136, 40, -91, -198, -217, -146, -24, 111, 182, 179, 101, -12, -104, -152, -157, -102, -12, 102, 165, 178, 107, -18, -136, -192, -162, -77, 53, 137, 163, 146, 56, -28, -117, -154, -144, -87, 18, 126, 162, 132, 56, -66, -166, -172, -117, -29, 71, 128, 137, 103, 20, -63, -130, -163, -125, -41, 66, 140, 144, 108, 13, -98, -134, -120, -58, 3, 88, 142, 144, 89, 25, -86, -155, -144, -85, 15, 119, 155, 130, 62, -20, -88, -121, -106, -52, 29, 79, 127, 111, 49, -39, -125, -166, -135, -43, 46, 116, 138, 96, 24, -50, -107, -123, -90, -27, 50, 104, 128, 100, 24, -68, -120, -121, -75, 14, 88, 121, 114, 65, 2, -60, -102, -107, -83, 1, 78, 121, 101, 57, -25, -89, -117, -96, -40, 25, 74, 106, 90, 53, -17, -94, -120, -98, -48, 35, 92, 106, 85, 27, -46, -81, -100, -61, -14, 44, 87, 104, 87, 25, -48, -100, -114, -77, -4, 55, 87, 84, 43, 9, -44, -86, -88, -54, -18, 42, 81, 77, 44, -1, -84, -107, -97, -44, 20, 63, 91, 64, 26, -7, -63, -90, -80, -30, 14, 65, 94, 77, 23, -24, -62, -85, -57, -9, 35, 80, 88, 62, 22, -34, -65, -80, -70, -18, 45, 66, 81, 46, -7, -72, -73, -59, -53, -3, 42, 64, 54, 47]
1407D7o0l7k8J4K4N2M7J3rk7n3k1j5KL3K6M5K2Jl4o4m4j0K5L2M5L1jk5k9l4k4
1439e6j2J2L0L9M0Ok3l9l8l5NM0L6L5K8k2k7j5k1k9MJ3M6K3L0k3j9m3k7j8K3K2
1471a5J9K8K5j8j7m0j9k0ML1M2K7Lj4n4j8k4J0RJ6L0K5K1j4k3l7k3j3RO3K9Ln
1504D0j1l4k6%pK3J0K4K8lj6l6l8j7NL0M8J0j1pjl2j8Oj4K0J6L7K3k1k6k3k1j5
1538e7L2J6M3r%ork3j2j7J0K7L1J9nj8k5k5LJJ4J6J0Pmll4j3j6OK2K1K7Mk2oj6
1575a1rmoK2J2J8Qjj2k6k7kJ2K2K5OJ2k1ol0j3%J7MK0J5Kj4k0k4%lKM6OMqk1j
1614fk3qoJ0K9K5J6qj3k5j4j6K4J6K1KOj4rj1j7j1J0J7K3J5Rj7k6j8oJ4nK0J3
1649A7Pj1Lk5j2j4MQK6J3KKKk6k6pJ6QJ0J3L0j3j7j1j3j7RK7J1Njj2pj9J2pj0
$$ y = [47, -13, -50, -78, -64, -40, 12, 59, 72, 63, 36, -17, -38, -53, -51, -18, 8, 53, 75, 76, 42, -22, -66, -76, -51, -19, 26, 57, 56, 31, 2, -32, -56, -68, -56, -26, 13, 53, 59, 36, -3, -41, -76, -71, -31, 5, 40, 68, 46, 19, 4, -17, -46, -42, -29, 17, 40, 70, 47, 28, -15, -42, -60, -37, -15, 4, 32, 57, 39, 22, -18, -37, -57, -53, -22, 20, 47, 50, 36, -18, -36, -60, -50, -41, -25, 5, 30, 51, 37, 14, -23, -46, -59, -50, 13, 42, 45, 40, 29, -5, -31, -31, -38, -15, -5, 19, 47, 44, 28, -8, -46, -63, -58, -28, 20, 30, 19, 12, 11, -21, -39, -33, -47, -27, -11, 26, 49, 28, 2, -21, -42, -57, -25, -9, 34, 25, 25, 19, 10, -13, -25, -42, -32, -5, 26, 45, 40, 22, -3, -28, -25, -24, -10, 6, 16, 23, 19, 16, -18, -31, -47, -41, -19, 2, 29, 33, 11, 5, -11, -20, -24, -30, -8, 4, 22, 30, 29, 17, -9, -36, -38, -26, -4, 21, 27, 39, 18, 12, -18, -31, -31, -14, -10, 10, 25, 27, 13, -7, -31, -31, -34, -32, 14, 20, 24, 16, -5, -6, -29, -37, -43, -33, -4, 21, 37, 29, 16, -9, -23, -39, -15, 1, 22, 24, 30, 16, 7, -4, -21, -32, -22, -5, 18, 33, 42, 25, -1, -19, -25, -11, -16, 4, 17, 24, 13, 16, -9, -21, -35, -31, -23, 3, 16, 18, 20, 22, -4, -30, -37, -21, -13, -3, 10, 40, 27, 10, -1, -14, -31, -22, 5, 16, 21, 20, 8, 1, -18, -6, -13, -23]
1686b3J1J8J4p%l1jj7NK1J1OPRj2k4qoqJ6J8OJ1Jj7j6kjLK0QLRmpk2mLLJ2kJ0
1728A3Qk5%j3j2PQLRJ8kj0j9qj0oJ9K0JJ5loj7npMNJ2J4lJ2rk5KqPjK1J0J1l0
1769@Qj2j3jj0J3J1OKj4Jlk1J8oLJ4PmOj4jk0OOJ4K1Oj9jmj8MJ7qPQLJorj8Mj
1813a7J1J0oJ6j3JJk2lpPJ0J1pRj0j0qJ2nJ0NOnJ2j1KmmjJ5J1kKPj7j3mkRkJ4
1855Hj2J9j6Jonj6J9mLK1mj4j2%QpnJ4NMJLj3j2JPJ7jKRoj3KP%JNMnqJ6rj3j7
1900b1kJ1%RnQj1qJjjJ2j6J7J0n%j4mMKJ4%LJ0j1qMMqJ0j6J9KLRmk6LKKJ4rJ0
1944A3q%j5npPRpoJ6j0%J0j0jRjNJQqlRk4MmJ3%kJ0QJj9J4j6OmJ6kkonj2RjMn
1991a1J6roMqoPj2K9j7QKOlrj1J5jLRj0MLMj5Oj0MNRjlJj8J3j9J7MlJMj0J8j4
$$ y = [-23, -12, 6, 20, 13, 13, -18, -19, -36, -31, -10, 1, 7, 14, 23, 11, -13, -21, -27, -35, -19, -1, 5, 16, 17, 0, -16, -18, -19, -16, 4, 12, 15, 24, 20, 13, -9, -13, -10, -7, 5, 3, 13, 21, -4, -4, -17, -29, -22, -14, -11, -2, 16, 14, 4, -15, -23, -33, -39, -20, 0, 1, 16, 13, 7, -10, -15, -22, -18, -13, -1, 13, 10, 22, 13, -12, -10, -18, -11, -12, 9, 19, 30, 0, 8, -4, -17, -18, -28, -15, -4, 2, 4, -10, -9, -12, -33, -15, -21, -18, -4, 3, -1, 5, -9, -10, -30, -24, -18, -4, 17, 23, 4, 3, -1, -19, -15, 2, -6, 1, 9, 12, 13, 7, -2, -20, -16, -17, -6, 4, -2, 14, 1, 2, 3, -19, -22, -29, -22, -12, -1, -8, 1, -9, -19, -27, -15, -20, -10, -5, 1, -4, 8, -3, -1, -5, -9, -10, 5, 16, 14, 16, 23, 6, -7, -11, -13, -4, -6, 8, -4, 15, -1, 0, -6, -11, -27, -8, -12, -9, 12, 8, -6, -18, -18, -10, -17, -22, -8, -3, 1, 2, 5, -8, -20, -19, -12, 5, 4, 6, 15, 9, -4, -2, 5, 5, 6, 11, 15, 10, 2, 18, 9, -4, -21, -23, -12, -12, -3, -8, 0, -11, -19, -18, -19, -20, -8, -24, -7, 3, -2, -2, -16, -20, -16, -14, 0, 0, 3, 13, 2, -6, -2, 2, -6, 4, -12, 7, 9, 12, 21, 17, -9, -6, -4, -2, 12, 3, 13, 5, 5, -10, -15, -22, -15, -6, -13, -19, -3, -13, -13, -3, -13, -14, -5, -6, -1, 0, 8, 0, -3, 6, -18, -14, -18, -5, -5, -7, 3, 11, 12, -7, 7, -9, -3, -7, 9, 7, 5, -1, -6, -18, -9, -10, -6, -11, 5, -4, -10, -6, -14, -20, -13, -25, 4, -13, -5, -3, 3, 0, -9, -20, -5, -6, -3, 6, -4, 0, 3, 7, -8, -2, -12, -8, -3, 6, 5, 2, 3, -15, -2, -21, -4, 0, -3, -2, 2, -8, 10, -4]
2035dj3J4k0J5LQjr%Mj1NqOJMJ1KkjqLkJ6%j1J2j1j5J0Omj5MOPkkJ3k3lqJ0QO
2080Aj6K3rj9QrK3j2kJ1JoMMj5RqKNJ6kJj2J4k3OPQNjoNj3%lKjOj7J6j3jmkMo
2126a9PMjOKLOqjnJKPmjJj%Kkj4K7rnJ2j1mJQlkOojj%j0j0J6qJ4j5K1j6O%j0J2
2174clQqK2j5J4lj0qPnRoLPlrRk0J0j4OJ6kqjOpj0J3J2j9OJpMllj0mJ7QNjnpJ
2221a0oMJ7lmRnOrrNOpLQp%NNj3Jk%j1JJJ8jj3Nj0J2j2MOMJ0j2nkRqLqJ7kMMm
2270DlJ1j2J3mj0J9j0jJ2k5MmJLqKRj4mKNJqkOJ9j7Qj3J8j5%MKJj2OLjKJ1lpJ8
2315A1j4LJ3nojm%J5mkrrmJ2lqJ4oJj0Rj0OKj8PJ7MoPlJpkJ4j0OKRomqMmKQLn
2364BOmLp%nPqPoNj4J3kj7J5pj0J7rM%KLj2JPJ6Nj6J3%pJkjJJJ6j1j7J5j0J5j0
$$ y = [-4, -17, -3, -23, -8, -5, 3, 2, -7, -7, -3, -14, -9, -17, -11, -10, -6, 5, 7, 5, 4, -4, -1, -3, 13, 13, 2, 14, 3, -12, -2, 4, 0, -15, -11, -5, 2, 0, -2, 11, -12, -15, -23, -13, -5, 1, -15, 8, -1, -20, -12, -21, 2, -10, -12, -1, 0, -6, -2, 2, -13, -4, -12, -10, -5, 11, 9, 10, -2, 12, -11, -5, 2, 10, 15, 14, 8, 13, 0, 0, -3, -1, -2, 4, -13, 3, -10, -11, -15, -17, -13, -19, -12, -8, -9, -3, -1, 2, 8, 0, -1, -6, -5, -3, 4, 0, -1, 0, -1, -1, 1, -1, -15, 12, 3, -2, 10, -1, -5, -4, 4, 1, -1, 5, -1, -2, -3, -3, -13, -23, -7, -15, -1, -16, 5, -11, -5, -5, -15, -3, -6, 2, -6, 16, 1, 15, 12, 2, -6, 1, -4, 5, -1, 2, 9, 6, -3, 6, -14, -4, -18, -12, 4, 2, -6, -7, -1, -8, -18, -5, 7, -12, -6, -5, -12, -8, -11, -14, -24, -28, -11, -3, 2, 1, -4, -11, -10, -16, -12, 5, 2, -2, 7, 2, 8, -1, -10, -5, 1, -6, -3, 5, -2, -2, 3, 8, -5, -4, -6, -6, -17, -16, -15, 3, 2, -11, -6, -16, -4, -16, -12, -6, -2, 8, -4, -9, -11, -2, -10, -7, -15, 2, 0, 4, 8, 4, 1, 12, 0, 13, 9, -1, 18, 8, 7, 19, -6, -2, -6, -5, -2, -10, -8, 1, -13, -17, -15, -10, -9, -17, -19, -13, 6, -11, -3, -16, 2, -13, -13, -9, -7, -6, -18, -12, -9, -10, -8, 3, 0, -7, 11, -3, 0, 13, 8, 2, 1, -3, -3, 12, 8, 6, -3, -12, -16, -4, -7, -15, -1, -7, -6, -16, -7, -17, -11, -9, -27, -20, -3, 1, -5, 2, -1, 0, -7, -9, 5, -5, 1, 3, 12, 6, 2, -6, -2, -6, -4, 4, 7, 2, 8, 4, 7, 0, 0, -5, 2, -6, 1, -5, 0, -14, -1, -3, -20, -5, -12, -22, -5, -14, -10, -10, -8, -5, -17, -16, -9, 7, 12, -4, 9, 9, 2, 3, 1, 0, 1, 2, 18, 7, -10, 5, -5, 10, 0]
2409@Pj2OqK1k5oJ3ojJ5k0J4jrMmJnKjJ8j0krJ3lJ5k5J6%%J4jo%o%kqJ6ljJ5k4
2454hKlJ4j7pMJ1RonlOoRj6QJJ3nMpkOQrJJnRJnLkNj3PRrPrMj3%PlJ0ojL%oJ0
2506Fj2j1J7%mlOj1kJ0%pJ0jlmJ1pj2J6J5j0kLjlJ1plMkLrJKqrNJ7nlmK%Mj5p
2553b2J6j4JP%N%nJ1mJnJ1j0J3koMlNnMPj0Lq%J0j0PrQj0pJ3j1J1mpkQRnj7J5
2598gkJJj0J1LrQoPJ4k8K1Nlk%NLplnMjRqRk7J3nOLnNoj0J4j1OJJ%j0NjMoPj3
2647a9J3jLoK0j3pOJ%Ol%NnL%JJrpMRnoljRj0MNkqnJ1jMN%nRoLpKLRqkJJ0jkj2
2701gPjJ2j2J0Mj2nJ4oKpPKrj8K1j2Qj0onJ5nKNNj6PRj8J4KqNJ3PrkKLqO%j0J
2747cPjkOqjJ5j2Mj4JJ0k0J3jnLj8RJ1%Mj4LnK2j1J2lJmoJ5j8NMJJ2j2kJJJoL
$$ y = [0, 7, -5, 1, -7, 14, -11, -17, -4, -10, -11, 4, -16, -2, -3, -12, -8, -12, -11, -16, -14, -15, 3, -7, -9, -18, -5, -8, 7, -18, -2, -2, -2, 12, 11, 5, 5, -1, -1, -3, -11, 5, 2, 1, 16, -8, -6, -9, 5, -12, -19, -15, -4, 5, -1, -6, -9, -3, -9, 0, -16, -8, -7, 6, 1, 5, -2, -4, 2, 10, 1, 2, 3, -2, 7, 8, 3, 6, 4, 9, -4, 3, 12, 3, 10, 1, 5, -8, -8, -1, -4, 6, 0, -1, 2, 2, -4, 6, -6, -17, 0, 0, -4, -7, -1, -12, -14, -4, -4, -11, -1, -2, -5, -9, 2, -5, -17, -1, 14, 4, 2, 5, 4, 1, 12, 5, 2, 6, 4, 7, -2, -1, 1, -7, -16, -11, 6, 1, -2, -6, -4, -4, 0, -15, -22, -6, -20, -19, -12, -12, -7, -7, -12, -1, -5, -4, -9, 2, -8, 5, 3, -3, 1, -2, 3, -2, 2, 9, -1, 2, -6, -6, 4, -6, 1, -8, 0, -10, -17, -4, -15, -4, -8, -15, -17, -9, 0, -5, -22, -7, -9, -8, -7, -17, -6, -3, -12, -4, -10, -3, 11, -17, 4, 9, 6, 4, 4, 9, 12, 5, 2, -3, 1, 0, 9, 1, 10, -17, -4, -9, -3, 0, -5, 0, -6, -16, -2, -13, -7, -6, -5, -5, -15, -10, -11, -7, -13, -6, -19, -6, -7, -4, -10, 10, -3, -10, -4, -3, -3, 3, 0, 0, 5, 0, 3, 3, 4, 5, -4, -11, -7, 2, -3, -9, -12, -13, -4, -14, -10, -5, -7, -15, -20, -9, -10, -6, -1, -1, -6, 3, -3, 0, -7, -5, -2, 7, -1, -3, -2, 8, 7, 5, -7, 0, -1, 11, -1, 9, 13, 1, -4, 10, 4, 6, -1, 6, 8, -1, -19, 2, -10, -2, -12, -18, -23, -8, -13, -11, -6, -1, -17, -10, -1, -19, -5, -3, -11, -6, 7, 14, 5, 3, 5, 8, 0, 6, 6, -4, -3, 4, 3, 1, 7, -1, -2, 13, 1, 5, -9, -8, 2, -18, -5, -6, -11, -8, -26, -17, -6, -6, -2, -16, -13, -18, 4, -7, 5, 2, 3, -1, -7, 8, -10, -5, -1, 0, 12, 0, -2, -1, 0, 1, -5, -2]
2792bKNr%Mj0OoLKj3QLJKj1MMQj1j0J7rMQj6LMNQqmJ6pnOJ1j1J0mj3QLl%mkpM
2841flN%J0j9J4j6PoJQlJ2j2J0kmjLjKNmkmJ7rkKlJlQL%k1J1lPkLk%mkmJ%nNk
2892a0LrJ1MkKkLomkJ8Kj1KRmPoonRjmN%mlJ3k0K9j6%J0j3lQk0J0Pjj6J3mj5J1
2938a1KLMokqJ4nOQqm%J8%Lj0j3K3qj%OqMnnRj0%mJ1lLqRjj3lOOj5nJ8j5J1j0
2985a7%RK%L%LokJ3JmM%LrlJJ4jj4Pj0MLj3J5j5QlPpLKLpKP%Kj3mJ1NmkMkj6J9
3035CkJMJMmQj0Pq%J2j2Rlj1NJ0k0J0j1Oj4J3%kpL%rRPkOj8MOpJ0KMpQj0J0pl
3082eJ2k%jKj0L%%JQklPnjj9RNllljJ1okmJ3j0KPj2J2KlRj0jmPkJ0k%KlnNn%O
3133FjKoMkJ1j5nOq%nJ0npRkKj1J5lmJJ2nj1PRmmPQkjNj1NLJjj3K1j9JOomnmQ
$$ y = [-2, 0, 5, -4, -4, 0, -10, -4, -10, -7, -5, -18, -10, -7, -6, -4, -15, -11, -7, 1, -10, -20, -3, -12, -8, 0, -16, -13, -9, -4, 4, -4, -8, 8, 1, -4, 2, 13, 2, 12, 8, -5, 3, 6, 3, 3, -1, -3, -10, -6, -9, -4, -4, 6, -13, 1, -15, -8, -14, -13, -5, -8, 4, -8, 2, 0, -4, -5, -2, -3, -1, 4, 0, -2, -6, 11, 2, 0, 2, -1, 0, -3, 5, 8, 8, -13, -2, -5, 2, 0, 3, 1, 1, -3, -5, -9, -8, -8, -13, -8, -10, -7, -16, -5, -1, -3, -1, -3, 0, -6, -10, -12, 6, 8, -3, -1, 8, 4, 11, 5, -1, -6, 3, 2, -2, 3, 3, -1, -4, 9, -11, 18, 2, 2, 12, -1, -4, 4, -16, -6, 1, 0, -16, -3, -7, -22, -11, -9, -6, -2, -8, -10, -18, -4, -9, -3, 5, -3, -7, -7, 11, 11, 14, 4, -9, 14, 6, 5, 5, 11, 3, 7, 2, -3, 6, -4, -4, -8, 3, 0, 3, -5, 4, 3, -10, -13, -7, -1, -16, -21, -3, -18, -7, -17, -17, -8, -6, -6, -3, -3, 0, -6, -8, 5, 6, 2, 6, 6, 9, 0, -3, -2, 12, 11, -3, 4, -6, -2, 1, -12, 3, -12, -4, -7, 0, -7, -4, -2, 1, -6, -4, 3, 3, 5, -8, -12, -1, 4, 0, -2, 2, 0, -16, 3, 1, 2, 6, 7, 11, 7, 15, 5, 12, 4, 4, 16, 4, 13, 10, -1, 4, 14, -6, 4, -7, -1, -15, -2, -2, -4, -11, -8, -8, -17, -8, -1, -3, 3, -15, -11, -5, -12, -2, 0, 4, -3, 5, -5, 5, -2, -5, 7, 5, 5, 4, 6, -4, -1, -1, -1, 0, 8, 6, 3, 10, 5, 4, -15, -6, -1, -4, -7, -10, -11, 0, -6, -8, -12, 1, -9, -7, 0, -12, 0, 2, -1, 8, -2, -3, -7, 0, -2, 8, 6, 6, 8, 5, 0, 5, 0, 0, 6, 5, 7, 1, 5, 3, 14, -1, -6, 0, -8, -8, -13, -3, -8, -15, -6, -8, -6, -17, -2, -5, -9, -8, 4, -1, -12, -5, 4, 0, -4, 3, 11, 9, 8, 13, 2, 7, 10, 11, 10, -3, 18, -1, 0, 6, 0, -4, -9, -13, -5]
3183eqPmrK0LolRoNrmJ0j3J7j2J1Pk3J1%JMRLNoRj8%KOnNj6%NnKlQj2pJ4j0KM
3231ej2OL%j3J8Jj5%MNKKjNrOJ0j9J8pMkJ0Pj7j3L1j2%OoNk1J6qRj3pJ4rqJ1%
3275dpJ1j5J4j8OMNQl2K7pPn%RlJ3j0KLJnjLj2Rk%qJ3NJoMj4MoKlNJjk1KK1j4
3322a4OjJj0OoK5j1OJLJ0k0J8j4mRMj3MNj3J5ljqLJ0nomRkq%Kj0J3kOj9RJ0k2
3366b1NRKoJ2mJ2j3JkkJ5jj0PLj0J5njJplMnQjrJOlj3J6j4JOpj0QQn%lQlK2k3
3413a1KNJMmjKnQKOmnJNqQJkK%j1JoJ4loJ1k0j1J5J3k3J3J1j1kjRlJlOjMLj5k
3461a0K4j6MknLRj0RKJpjO%LqJ4j5mjPpoRnNOj2mJ8nNk0PjRoqRQnRMnPj6PkJk
3512CkQ%nlpJ1nlJ5kj0KlKlLLmNJj8%LKmOLRj0J1j1J4j3nRONjojNpJ1opRj2QJ5
$$ y = [-5, -13, -6, -10, -19, 1, 4, -2, -5, 4, -2, 3, -6, -10, 0, -13, 4, -8, 3, 10, -13, -2, -2, -1, 3, 12, 15, 20, 14, 23, 5, 5, 7, 13, 8, 13, -3, -3, 2, -3, -1, -4, 4, -8, -15, -1, -11, -9, -5, -17, -11, -8, -8, -21, -3, -2, -17, -17, -13, -8, -6, -4, -5, 0, -9, -3, 7, -12, 6, -1, 3, 1, 11, 18, 1, -12, 19, 7, 7, 13, 7, 12, -9, 7, -1, 8, -5, -12, 2, -7, -15, -4, -4, -11, 0, -15, -1, -19, -13, -9, -4, 4, -28, -1, -8, -1, -6, -6, 3, 0, 13, 3, 5, 8, 9, 4, 3, 6, -6, 3, 1, 1, -7, 6, 11, 12, 6, 10, -4, 0, -6, -4, -7, -2, -1, -2, -23, -21, 0, -14, -8, -9, -8, -18, -12, -18, 7, -4, 2, 3, 6, 16, -4, 14, 0, -4, 5, 9, -4, 0, 5, -8, 7, 4, 3, -5, -2, 8, 3, -3, -7, 2, 0, -8, -8, -6, -16, -3, -5, 1, -18, -9, 1, -21, -16, -7, -5, -11, 1, -3, 9, -4, -3, -5, -7, 8, 7, -3, 4, 7, -3, 12, 7, 6, 7, 0, -3, 1, -4, 4, 3, -6, -5, 1, -2, -15, 1, -13, -12, -6, -13, -23, -15, -7, -12, -12, -15, -7, -10, 12, -11, -9, -4, -3, 1, -3, -4, -2, -7, 1, 3, 9, 5, 0, 1, 6, -2, 6, 7, 5, 7, 7, -4, -3, -9, 5, 2, -4, 7, -13, -24, -9, 4, -19, -6, 5, -6, -8, -9, 0, -3, -2, -5, 1, 0, 4, 7, -8, -10, 14, -2, 2, 0, -5, -2, 7, -3, 6, 8, 9, 2, 1, 7, 7, 10, 2, 16, 1, -3, -4, 3, -4, -10, -1, -6, -1, 5, -7, -11, 7, 2, 7, -13, -6, -7, 2, -4, -12, -3, 5, 0, 9, 13, 8, 15, -1, 6, 4, 5, 3, 1, 9, 9, 4, 1, -6, 5, 0, -3, 12, 10, 0, 2, -1, 1, -2, 1, 4, 0, 5, 6, -12, -12, -9, -7, -11, -5, -2, 7, -3, 8, -3, 11, -2, -7, 2, 8, 13, 12, 6, 5, 10, 3, 14, 8, 1, 10, -2, 6, 21]
3562B1j0j8nJ0Kj3J7j1oJ1Mpo%QMPj1Kp%J0mJj0OMRj1OKLJnj0QLkNRkk6J8L%q
3608BnJj0%lkJ3lJ1mj8oJ7%%%%MlJ4j5J6kPrLJMmlJJNJ3q%jj4Rj5jOPplqNnOm
3658gkPrOJpPn%pJ9lRmj0J6jjmoQjlOj2J1lkkJ2nLqj0PQk%rqPkOnmjJPnNrPQj9
3712a5MJ4j1kJ5j2J0Mj1J6j6J3kJrJjQj4QnjjNKoJ4k0%JKJkOqNNNpk%oPPqOlM
3760BJ1qmJ0OoMNJj7PLnj0J8Mj4jMrpQMk1J2Jlj0J3mpLLKKjNloPoR%jMJOmkJ0
3810A6j0JjRlnnJJ1oj4J4jooooJ7j3PMlPrj1LQJMPKjoPkJKmJ2j2%NQk0OoRmlK2
3860B1j0oKkrRj0LJmrj0J0Rj1K8pj0Kkj0J5JKJj0jJK0kllNLOolMj0J3mqjKNj2
3906@%nJ0j7J9LrLj8PLlKnNlrJ1%oPnQRj4J6nOLpKNKNj0mkmJ3j8MNj1jmKLjko
$$ y = [21, 11, -7, -12, -2, 0, -13, 4, -7, -13, -2, 2, -5, -11, -11, -3, 1, 8, -3, -1, -8, -8, 2, -2, -1, -11, -5, -1, 8, -3, 3, 5, 8, 9, 4, -6, 2, 5, 3, 8, 17, 15, -11, 7, 10, 10, 2, -3, -2, -12, -12, -15, -17, -4, -7, 4, 0, -18, -24, -7, -7, -7, -7, -7, -3, -6, 8, -7, 9, 7, 14, 5, 8, 9, 13, 9, 6, 7, 8, 13, 26, 18, 18, 17, 3, 12, -3, -4, 2, 9, 2, -1, -9, -4, -9, -3, -7, -9, -2, -11, -5, -4, -11, -4, -9, -9, -16, 3, 0, 9, 5, -5, 11, 10, 9, 5, -1, 7, 6, 3, 9, -3, 8, 5, 3, 1, 13, 8, 11, 3, -7, 0, 8, 6, 6, -3, -11, -4, -6, 0, -5, -9, -10, -9, -2, -7, -2, -11, -4, 4, -15, -11, 3, -8, -10, 5, -7, 3, 7, -4, 12, -4, 9, 7, 8, -1, 0, -1, 7, -7, 1, -4, -5, -6, -1, 1, -5, 9, -11, -11, -10, -8, -7, -9, -3, -11, -6, -1, 4, -3, -5, -5, -11, -4, 3, -5, 1, -2, 2, 13, 5, 1, 11, 17, 11, 15, 20, 21, 4, 11, 14, 9, -1, 17, 21, 7, 6, 10, 1, -6, 2, 6, -15, -3, -2, -5, -15, -2, -6, -13, -10, -7, -5, -3, -4, 1, -2, -8, -1, -7, 2, 2, 1, 5, 6, 12, 8, 6, 16, 6, 7, 6, 15, 12, 7, 2, 3, 14, 8, -6, 8, 7, 1, -5, -11, -17, 0, -13, -6, -2, -5, 2, -7, -18, -15, -7, -6, -2, 5, 7, 6, 0, 7, 5, 6, 8, 4, 16, 4, 4, 9, 17, -3, 3, -3, 6, 2, -1, 21, 11, 5, 7, 5, -4, 5, -5, -2, -1, -5, -14, -24, -14, -5, -16, 12, 5, -5, -3, -5, -15, 0, 1, 3, 4, -6, -7, -6, 14, 12, 9, 6, 11, 14, 20, 14, 11, 15, 5, 18, 14, 6, 5, 7, 12, 0, 0, -5, 5, -12, 7, 10, 1, 4, -14, -7, -4, -7, -5, -10, -5, -8, -17, -6, -6, -12, -5, -10, -2, 7, -7, 9, 4, 10, 13, 6, 8, 13, 15, 20, 10, 6, 4, 0, 13, -5, -1, 4, -7, -8, -12, -10, -7, -8, -10, -16]
3956a6OJoOlJ3nnKj1J2jjJ0jj0%NK%Mj0K0rOjrRKj2KKOj7J3j3QkqJ3j0oK1j8m
4001a5J0%KqJMQj1MONoKoLPlpJ6j5JJ7krlOMp%JOj5J5j2QrmlpNjOJJlrON%J5j2
4052bkPq%KQK%qPQmL%j0OMj3jJ2j9RrQRpKj0N%mloMkj1J4pQj1RpKP%PjoNPKj2
4104fK4j2LJJ2ok2RJ4j6%QpolQRj1LkJnnLjlLOqJ0Jmj1J0oJLq%J2LMjLRmqKLj3
4154cJ0Mj1J2JlmrJ0jj7J2pM%j7J8j3OJ0knj2J4Pj6J5lj1OPnOKL%j8J7pNJPMj4
4198CJ2Pj1oOoojKoNmOrJ2knmNj3J2%Mj5PJMQjPrRlrLPllQk0J8kkOj2J2mpKj6
4248a3K1omNk4K4%j9J0Lj4pJ1kJ1j6J0KkJ5j3N%J4NrNjQj9LQNQj3Kj0%pJ4oLr
4291b%pjJ6KonpLmJ0OpmOlrJ4Nj1kK3j2OpQ%j0Oj1K1mrLqpJ9j3PlNolljJ5j6L
$$ y = [-16, -10, -9, -15, -9, -12, 1, -4, -9, -7, -18, -6, -7, -8, 2, 1, -9, -9, -4, -2, -2, 2, -8, 12, 3, 9, 8, -1, 8, 10, -2, 0, 2, 8, -9, 4, -9, -1, -3, -11, 2, -8, -14, 7, -11, -15, -5, -5, -3, -11, -10, -6, 2, -9, -5, 1, 6, 0, 2, -4, -1, 6, 3, -4, 12, -3, -2, 15, 13, 4, 1, 7, 11, 4, 4, 5, 11, -4, 11, -1, 7, -2, -6, -9, -16, -11, -12, -6, -5, -4, -7, -16, -10, -5, -5, 10, -2, -4, 3, -5, -5, -3, 5, 7, 7, -1, 6, 14, 10, 13, 13, 3, 9, 13, 0, -1, 11, -8, 1, -8, 0, 9, 2, 4, -6, -1, -1, -5, -8, -14, -10, -12, -23, -9, -16, -8, -19, -10, -17, -15, -8, -8, -1, -2, -8, -3, 4, 6, -6, 18, 6, 9, 10, 22, 16, -6, 3, 17, 1, 1, 9, 2, -4, -7, 1, 10, -1, 2, 0, 1, -4, -9, -6, -7, -10, -7, -1, -9, 1, 2, -2, -13, -3, -9, -8, -5, -13, -13, -1, 2, 6, 5, 8, 17, 13, 5, 7, 10, -3, 7, 11, 0, 12, 13, 10, 6, -3, 7, 6, -11, 1, -6, -2, -2, -19, -1, -14, -8, 2, 0, -5, -17, -3, 4, -12, 3, 0, -11, -5, 2, -3, 3, 5, 8, 8, -10, 7, 0, 5, 6, 13, 17, 3, 15, 22, 11, 5, 11, 5, -1, -2, 0, -6, -1, -5, 1, -8, 4, 2, -3, -7, -2, -15, -3, -3, 1, -14, -7, -6, -2, 6, 5, 12, 3, 12, 9, 0, 3, 10, 7, 4, 12, -8, 10, 8, 6, 12, 0, 12, 8, 1, 3, -13, 8, 2, -2, 3, -21, 3, 3, -16, -6, -3, -17, -24, -13, -15, -4, -20, -10, -8, -10, 5, -8, -3, -3, 11, 16, 7, 12, 11, 19, 0, 3, 11, 16, 24, 11, 13, 3, 3, -4, 10, 4, 7, -2, -2, -9, -10, 6, 8, 2, -3, -10, -7, -11, -1, 5, -2, -6, 0, -3, -12, 2, 7, -4, -6, 17, 5, 11, 4, 12, 12, 2, 8, -3, 18, 14, 5, 8, 0, -7, 12, -1, 6, 3, 8, 2, -1, -4, -5, 10, -6, -3]
4339cnMkqJ5j0mOJ4j5%nOMJqJ5q%J2kj6J4LMpRmpLJlLlNnopLJ5mkj5MlK%kmQq
4390a5MNllJ1rJ7rJ0onJ0mrJ3m%pJ6pqQRjNjj6Nj2lJ0lQj1kjljMJ%Lj4N%NOnM
4439crPQMqPpLPLnM%nmLmJ7qqMOkj4Mj4J6j0%JkJnmJJ0KqQjlNOkLpJ2pKJ1k0J8
4491A3lkpmL%K4j2molnMLonRrmJ0q%Rj3%Rj1J0Qj6J7mPj0OMk2L0qnRMm%J1plp
4539BJ0OLj7%jJ0k0J5k2MJ0%j2J0poMjMLlNkJ4k1J1Kj0LKKOrK5k2KPNmNojRpj0
4585bK0j7nkJ6rj1MMmlrKNQnlKkJ0Noj2OJ0mJ6qpRo%PJj1QKjjmJrJ8j1jOj2PM
4634FnrQklKlJj2J5j3J4Kj8J5j0J3j2mJ4J0lnj1J3Rj2J6nkpRpjKj1R%Mnkl%Kn
4679fp%NlKkOKPj0rPjNmJ1j1RmOrOnJ2KL%NroLOnMj0KnNnkMlj2J7kj3J1j1J9j5
$$ y = [-3, -8, -4, -6, -14, 1, -9, -13, -7, 7, -8, -8, -13, -7, -3, -2, -10, 5, -3, -3, 9, 7, -9, 5, 8, 12, 5, 14, 10, 3, 6, 7, 4, 7, 4, 9, 4, -2, -9, -6, 9, 5, 3, -12, -8, -11, -9, -9, -11, -15, -7, -15, -11, -6, -9, -12, -1, -10, 7, -2, 8, 2, -3, 7, 3, -6, 7, 3, 3, -4, 12, 5, -3, 5, 14, 13, 18, 17, 1, 6, -6, -9, 1, -2, 6, -5, -7, -8, -11, -12, -8, -7, -7, -4, -18, -13, -13, -8, -2, -7, -3, -12, -5, 3, 7, -1, 6, -1, 2, 9, 12, 7, 11, 11, 6, 2, 5, 1, 18, 10, 2, 6, 12, 10, -4, 0, -14, 2, -8, -8, -7, -9, -8, -13, -17, -16, -6, -4, -12, -4, -5, -8, -3, 3, 1, 4, -3, 9, 2, 4, 15, -5, 13, 10, 8, 1, -3, 0, 0, 24, 12, 8, 2, -1, -6, -2, 1, -5, -10, -1, -10, -14, -4, -12, -12, -3, -16, -16, -7, -18, -8, 0, -16, 1, -3, 4, -6, 0, 4, -18, 12, 4, -1, 8, 12, 8, 8, 19, 12, 9, 2, 12, 18, 21, 4, 4, 3, 13, -7, 8, -14, -10, 0, 0, -12, -2, -9, -15, -11, -12, -8, -5, -8, -3, -5, 9, -12, -1, 1, -9, -6, -4, -2, 4, -5, 20, -2, 0, 7, 12, 8, 13, 7, 6, 15, 8, -2, 18, 1, -4, -6, 10, 1, -10, -6, -2, -6, -9, -18, -16, -11, -3, -8, -11, -9, -11, -1, 4, -2, -14, -8, 2, -2, 14, 6, -1, 8, 2, 2, 9, 10, -1, 7, 9, 8, 7, 3, 4, -5, 13, 2, 1, 7, -5, 2, 6, 1, -8, 0, -2, -5, -3, -6, -5, -17, -2, -15, -1, 1, -17, -2, -12, 1, -11, -15, -1, 9, 6, 1, -10, 3, 12, 0, 16, 11, 9, 2, 11, 4, 3, 5, -6, 3, 3, 7, 2, 0, -3, -3, -1, -6, -13, -13, -8, -11, -9, -11, -5, -3, 4, -6, -15, -8, -9, -4, -8, 3, -8, 1, -3, 3, -6, 0, -5, 7, 9, 12, 12, 17, 8, 2, 5, 11, 6, 10, 0, 2, -3, 2, -3, -5, -1, -4, -16, 1, -1, -14, -3, -14, 5, -10]
4729a0JMmJ2j5QJLjKQj3J4llNJpJ4j5NJ0j2NlLPj9%Lm%qJ6j2mJ0j0J4ooOKJ0j3
4774dKmRj6K3p%lPpkMpJ8mklJ0npJ1njjlOqoJ5j9J0Mj1Kj3MJ0Jj4NLOj1LlLjP
4822djrPRlkJ3Rj2PmrK1onmK%pOj0J0Mj8kOJ2k0JJ3j0jJ5qoolJ4nOoQmnJ5j4M
4869bkRJ3jj2J4oPmJnmmoJ9j6KNnpQnoMP%j2RmJ1j3qPKoNjLOj2J5Jj0NkJmK1j3
4918EoJ2%Nj2KOmj1OoMj0J0Qk0K1j9Mnj1JQNQjj8%K5j7KJ0r%J3jpKJ8j6%OmJ1
4962A5j5NNmkJ1j1Jjj4J3Mk3JPnLJQj7PmP%j4J7nKRqRrJ7Pj7KJ0lLrnJ9Lj3J1
5007A8j0Nj6J8j3J0nj3%J6j7R%PjqPj9JnMpJ2rJ3JKqJ1Jk2K7j5J6nJ2oJlRmj6
5049bJ0PNqk2MJ7j6J%QrqPJ1KmJj4ONkoRkKkj8J9Nj3J2j0JQNonJ3jOj6J3KKlj
$$ y = [-10, -9, -5, -9, 3, -12, -4, -3, 0, -1, 1, 9, -4, 10, 7, 4, 9, 10, 3, 17, 2, 7, 17, 5, 10, 7, 10, 17, -2, -2, 1, -3, -3, -11, 5, -7, -11, -1, -11, 3, -3, -9, -3, -1, 9, -4, -2, -6, 3, -13, 10, 3, 3, 0, 7, 0, -2, 2, -5, 13, 9, 7, 4, 14, 9, 2, 13, 8, 7, 6, 3, 9, 1, -5, 10, -9, 1, 5, -6, -4, -17, -13, -3, -2, -16, -11, -8, -2, -13, -10, -13, -10, -11, -4, -5, -14, -7, 2, -1, -3, 10, 19, 7, 14, 10, 1, 22, 16, 11, 7, 9, 9, 2, 8, -2, 8, 12, -6, -8, -2, 10, -10, -9, 4, -6, -7, 8, 0, -6, -12, -15, -1, -6, 0, -6, 2, -2, -7, 8, -6, -2, -4, 5, 18, 17, 5, 19, 13, 20, 16, 17, 12, 8, 4, -2, 17, 1, 3, 8, 3, -4, 4, -1, -7, -3, 4, 4, -8, 1, -3, 8, -5, -13, -6, -4, -10, -5, -6, -3, 3, -9, 6, 7, -3, 2, 0, 1, -3, 18, 5, -1, 11, 11, 16, 4, 6, 12, 8, -3, 3, -3, 1, -9, 1, 9, -11, 10, -9, -5, -10, -21, -20, -12, -7, 1, 0, -18, -18, 7, -10, -8, 2, -7, -7, 6, 5, -2, 0, 18, 2, 2, 8, 4, 15, 0, 5, 10, 6, 4, 15, 4, 5, 4, -10, 3, 7, -16, -15, -8, -13, -10, -9, -1, -18, -11, -15, -8, -8, -22, -5, -10, -8, 1, -7, 2, -7, 10, 17, 0, 2, 12, 9, 12, 3, -2, 17, 20, 7, 18, 8, 13, -3, 15, 2, 12, 7, -6, -6, 10, -7, 2, 2, 9, 8, 0, 7, -12, -11, -16, -12, -19, -7, -16, -3, -2, 0, -8, 3, 4, -18, 9, -6, 10, 5, 17, 11, 12, 9, 18, 14, -2, 8, 15, 20, 12, -10, -6, 11, -5, -4, -4, 4, -5, -13, -6, 5, 7, 3, 4, -10, -4, 1, -1, -7, 2, 0, 2, 0, -18, 1, 6, -7, 5, -5, -4, 4, 9, 3, -2, 11, 10, 16, 0, 13, 15, 17, 14, 13]
5096A3Jmj4J3kkjnj5J7j3Pj2QJ5pmRjj2K3k2LNnRloKJ6oJ2j9PnKPkKkknPjKrQ
5143Ij2JNjpoNOj2MLj3J2kO%QKnpKJLJ1jj9J5LJJPpj2ON%j4QLMj0J5k8J2knMm
5191ek%Rj8KJ0qqK%QjpJ2kmJ5Kj2J4K%nPj0J7j2M%nJ7k0mRpJj0J9j6PoJ1Mj0M
5236Dkj3J5nkj0QNrQojJ6k0J0KKrjRJ0pPmj1J1OrJ1nKpmnlJ7j6Kj4J2j1J6kKr
5281a0OrPOj2PqPMJj0JJ7nLj1J1kj1RMLmPnLj3K8j6j3J2lrmNMnooK0j2j0NmRp
5327a6JPpJ0jJ0k1J3qMLN%Nj3J1J1pplQRJrrJ2lJPj4MKjj1J%j3%J0qJoRQj2J2
5373dmQMj5J0%%lNjJ0ljnJJ0qJRmnpmRkpoJ3%j0J2qj3NojJ1Ml%OqnMlNJ1mkkP
5424ALlJ0J0oMoNr%J2j2Jr%KLjnq%kmMlmJ0%Oj6MJ8nnj5LJ1Qoj4J4J%kP%NMKJ
$$ y = [13, 14, 10, -4, 9, 7, 5, 4, -1, -16, 1, -12, -5, -17, -9, 6, -1, -5, 4, 3, -9, 14, -8, -5, 0, -5, 4, 1, -5, -3, 13, 7, 19, 0, 7, 2, 4, 11, 9, 11, 9, 7, 2, 9, 8, 10, 1, 9, -3, -2, 3, 2, -5, -11, -6, 0, -12, -8, -5, -18, -6, -8, -2, -2, 6, 8, 3, -4, -2, -1, 2, 13, 12, -7, 8, 11, 12, 13, 20, 13, 1, 7, 12, 12, -2, 6, 9, 13, 3, 18, -10, 2, 0, -5, -1, -5, -7, -7, 2, -16, -14, -4, -12, -20, -18, -18, -10, -11, -18, -6, -8, -12, 3, 5, -7, 7, 9, 9, 4, 11, 1, 18, 6, 10, 10, 5, 22, 2, -2, 7, 0, 1, -9, 10, -6, 1, -5, 6, 10, 0, 4, 2, -11, 4, -1, -3, -13, -5, 0, -9, -1, -7, -8, 8, -12, -2, 0, 2, -7, -8, 1, 11, 4, 11, 7, -4, 7, 13, 4, 15, 10, 12, 5, 1, -4, -7, 10, -6, -4, -18, -6, -17, -1, -3, -1, -10, -4, -13, -6, 0, -12, -5, -13, -6, -2, -1, -11, -10, 7, 2, 5, -6, 5, 3, -8, 1, 5, 8, 4, 11, 6, 9, -4, 24, 8, -5, 7, 4, -5, -9, -4, 0, -5, -11, -17, 3, -9, -19, -14, -18, -9, -16, -15, -8, -15, -5, -6, 4, -17, -4, -12, -8, -5, 0, 0, 5, -8, 3, 14, 7, 0, -3, 5, 14, 15, 6, -3, 9, 6, 7, 14, 0, 4, 6, 5, -6, -5, -5, -18, -18, -8, -16, -15, -21, -12, -4, -16, -4, -8, 0, 4, -11, -1, -1, -1, -4, 1, 0, 10, 7, 6, 1, 2, 12, 4, 5, 14, 10, 5, -2, -6, 3, 1, -6, -12, 1, 1, -9, 3, -5, -18, -13, -19, -20, -9, -5, -8, -8, -2, -10, -15, -11, -14, -9, 2, -2, -4, -6, 1, 4, 1, 11, 21, 15, 19, 13, 18, 9, 9, 21, 9, 10, 1, 1, 3, 6, 5, 0, -8, -8, -10, -14, -10, -13, -17, -7, -7, -1, -17, -13, 5, 0, -5, -20, -17, -6, 2, -4, -18, -4, -3, -3, -5, 2, 2, 7, 11, 13, 14]
5474A4k%j1NQjqj%lJj0koMKjkJ%Oj6J6rLKlQqJ1PlMoJjMK%jQo%J3j6lJ5j3J1p
5524GoNj0N%J0k3RpPjkj5J2rj0J6Oj0J0Oj3KnK0LqJ2Ljj1J1j2MJJ0Kmj5LOnKo
5568anLJ3j5KLLj6KlQKj2%jPkJKKKKnONmmJ4LkqLKMKpNnnMj4J6pjjoknJ3lKoK
5621gPopJ3jj8%J7mJoQOLj2JJ3pJ4%j0QkOj2pjJ1jMj0JMj0LNOqj0JMlo%J7jk1
5668a7jJ8%jnMrK0j7J6j8K3JpKLqnJ3llLlLj3J7%Mrq%KJ3k7KNjqJ4q%qQkLqJ4
5715aoMLlmJ5lrJ4oOj6QNljJrJ8rJ5rj8PJ6j2pPr%OlNj0QllnQpnRj3J4Nj1kJ5
5763BJ2onOlMk%Qj1JQj0Mlj2MJ1KqpJ0j0%JjRnqqRPj1j%J7j0rJ3qPjj%J1OLom
5812EQqPpN%jqJ0nMopjOj5RoJrJJ7pnK4k0mJrQKQQnpK1j9MJ1nj0J4Lj4QoPJ7m
$$ y = [14, 12, 12, 1, 6, 14, 13, 5, 4, 4, 1, 2, -8, -10, -16, -12, -10, -11, -13, -12, -12, -6, -22, -6, -15, -12, -10, -13, -5, -13, -2, 5, 2, 6, 0, 1, 0, 4, 6, 6, 5, 13, 7, 7, 20, 4, 1, 16, 3, 14, 7, 1, 6, -4, 1, 1, 11, -12, -3, -10, -3, -4, -6, -21, -9, -18, -28, -12, -6, -16, -6, 0, -13, -11, -16, 4, 7, -1, 11, 14, 13, 2, 13, 1, 5, 6, 16, 18, 14, -1, 2, 8, 3, 5, -1, -6, -3, 10, -5, -3, 0, 3, -13, -11, -14, -6, -4, -16, -16, -17, -10, -12, -11, -9, -7, -5, -3, -8, -2, 3, -1, -5, 9, 12, 10, 2, 5, 7, 11, 13, 6, 11, 6, 1, 5, -9, 7, 0, -1, -2, -8, -10, -15, -2, -5, -3, -9, -7, 0, -6, -13, 0, -1, -19, -19, -2, -6, -5, -11, -3, 3, 6, -6, -5, 8, 1, 15, 15, 5, 13, 11, 17, 5, -2, -3, 8, 7, 11, 1, 2, 6, -4, -1, 4, 10, 2, -8, -7, -3, -6, -12, -12, 5, 4, -17, -18, 0, 0, -1, -6, -2, -11, 9, -8, 8, -10, 13, 14, 7, 9, 12, 4, -1, 12, 9, 6, 9, 6, 9, -4, 13, 13, 17, 8, 0, 0, 2, 15, -12, -10, -5, -6, -14, 0, -8, -8, -16, -8, -10, -7, -15, -1, -7, -3, 0, -3, -7, 8, 5, -4, 10, 4, 10, -6, 2, 7, 4, 3, 4, -5, 13, 4, 19, 10, -8, -1, 15, 3, -4, 3, -6, -6, 0, -3, 2, -8, 0, -3, -6, -11, -3, -10, -15, -6, -19, -5, 0, -11, -13, 2, 14, 8, 3, 9, 6, 10, 8, 8, 16, 5, 6, 14, 4, 8, 5, -7, -3, 8, 10, 2, -5, 5, -5, -5, -4, -5, 4, -1, -9, -17, -8, -1, -12, -13, -13, 4, -6, -15, -2, -10, -3, -4, -5, -5, 6, 12, 15, 9, 5, 13, 5, 12, 5, 10, 10, 9, 1, 11, 6, 10, 4, -3, -4, 2, -13, -4, -10, -9, -18, -17, 0, -7, -12, 12, -8, -12, -11, -20, -12, -10, -2, 6, 1, -6, 15, -4, 0, 11, 6, -4, 10, 13, -1, 7, 1, 8, 25, 21]
5861B1Kmmpl%Pj0klQorOKnlJ5j0nmNJ5j1LpJ1mjmmJ9lpMJ5j9J3j3KnJ6j6J3lJ2
5907A7olNql%rJ3pk2J4Nj3mRnJ1j0LqJ1NkPOpnjJ7kJ1qkjLjo%jkNL%j1kJ3qKk
5956AQj6LOj1k%J3j3PrkjJ2Lj8J8nOJqJ9j0oJ7qkKQpKMmKNj4j%J5j4nKJ0j6kK
6002hjlPkKoJpQKkJ%KKPlmOj0OMjJpJ0oJ8j2Qj3J9k4RQjjj5kK%okKNj5nK1kpm
6053a8PNJ3nj0JjRnOkmKNjQj3J0PqK0k5PpJ4Kj3qKjRqooJ0%llJnKPNj2J3J%%o
6102dmJ4%OjL%rOjJ3j5pLr%LJ6j3JQrJ2kk6K2q%Jj0jpK4k7J2lrK3j1JKmqK8j0
6147@%KRj0LM%J4j4OLj4NmlM%ljj4K2j3jkR%j3JmNQkloRpKPmpJ3%jN%LKJjlLj
6199IM%nMj1KLlQqKj1PJj6QLkj3Rj0PORJnJ1qqkJ5mmQlKQj4NJNpJ2Pj2J4pLrj
$$ y = [21, 23, 19, 15, 8, 5, 5, 12, 2, 0, -3, 5, -1, -10, -4, -2, -7, -10, 5, -5, -10, -14, -9, 6, -5, -2, -9, 2, -2, -3, -7, -11, 8, 5, -2, 2, 17, -2, 11, -2, 0, -5, 11, -5, 8, 5, 17, 11, 8, 13, 5, 2, 2, -7, 6, -1, -23, -9, -4, -17, -21, -12, -17, -6, -16, -13, -21, -10, -5, -7, 0, 6, -1, -6, -7, 10, 8, 19, 11, 9, 8, 11, 10, 4, 4, 3, 1, 6, 9, 9, -2, -4, 9, 1, 3, 1, 9, -7, -4, 2, -9, -11, -11, 2, -11, -4, -13, -15, -16, -4, -1, -19, -1, -6, 0, 1, -7, 12, 2, -4, 13, 5, 3, 5, 13, 6, 8, 12, 8, 10, 15, 1, 0, 0, 15, 1, -4, -2, 8, -8, -10, -8, -9, -12, -5, -7, -5, -11, -10, -17, -9, -7, -9, -8, -8, -6, -4, 3, 0, -4, 2, -8, -2, 2, 1, 2, -5, 5, -1, 17, 5, 13, 0, 19, -5, 4, 12, 11, 10, -5, -7, -5, -5, -11, -13, -11, -6, -21, -26, -5, -7, -14, -18, -11, -6, 7, 2, -8, -7, -8, 1, -4, 2, 0, -4, -2, 3, 2, 10, -3, 7, 14, 6, 26, 1, 8, 1, 15, 17, 4, -4, -2, -3, 6, -2, -8, -14, -4, -4, -7, -10, -9, -14, -12, -5, 0, -12, 1, 2, 2, 2, -4, -8, 6, 6, 12, 11, 14, 14, 5, 11, 10, 23, 8, 1, 4, -5, -5, -2, 14, 1, 2, 10, 1, 13, 11, -15, 7, -1, -1, 0, -10, -11, -18, 6, -21, -9, -12, -21, 2, -9, -8, -6, -10, -18, 10, 0, 0, 2, 11, 1, 4, 8, 8, 22, 8, 14, 17, 3, 8, 4, 1, 5, 5, 2, 1, -13, 9, -4, -5, -7, 2, 2, -11, -10, -14, -9, -1, -3, -6, -12, -3, -10, -8, -1, -5, -12, 1, 1, 0, 5, 5, 8, 10, 11, 10, 7, 10, 9, 13, 13, 8, 12, 1, 3, 6, 3, 11, 3, 5, -6, 1, 2, -14, -6, -3, -5, -18, -9, -19, -12, -6, 3, 4, -1, 10, 2, -6, -8, 7, 3, -1, 7, 4, 6, 14, 0, 5, 6, 11, 4, 16, 23, 11, 25, 18, 21, 12, 11]
6249A1qNkmKmOj7kJ2lJ0j4Np%pJ7%klKQpPj3J2LqJ1q%KPJjKj1KRoJRmkoJLlrL
6300@qJ1kJnnmj%J7rRJj3J5j3J2MooLQJqQmQKlKqooJ1LKj0Jj3J4jpJ2j0orJ5j
6348dkLmPj4lJ3lqJ7RqjNjnNQJj4J7%j1koJ5%j9J6j2J2j9P%rKQJj4MOmpMrJ5j4
6395a8J1%lJ0J5k1lNKkOQj2QJJJ4nmPm%j1J5%ojQk0MloQj1j2MJ1kjNj1MJmJ6j
6441CjmQKjmNqQJqJ3J1j4j%RrjQnOj7oJ3nMj2j5K7pjmq%J0rJ1pkjJ1jj3J2j1P
6488fJ4JqPJ1k0J5lMj0LMJrPj4NRLq%Kj3%%Oj2LPj6J6Lk2J3j5J0NKj4J0MOLJP
6533A2mMj0OLj4K1j4KkMnkJ3j1J3j1Jj5%JKMLmJqLMj0jLQlj2J3J6j8Rk2J5J2q
6576aJ0rPpQlJ5olOopKQk3K2j3pjJ8k1J1pJ0j0Lm%PkMj0jjK0mrj2K3Oj5N%JpJ1
$$ y = [11, 3, 8, 6, 2, 4, 0, 6, -11, -13, -1, -4, 6, -8, -3, -10, -10, -17, 0, 0, -2, -5, -3, 5, -2, 5, -8, 4, 7, -1, 10, 2, 2, 4, 11, 12, 11, 13, 2, 4, 13, 7, 8, 17, 13, 11, 5, 6, 9, 6, -3, 0, -8, 3, 1, 2, -3, -8, -12, -13, -13, 4, -5, 4, 5, -8, 7, -6, 6, 10, 4, -2, 1, 9, 10, 2, 10, 6, 14, 16, 13, 15, 7, 1, -5, 6, 9, 11, 1, 2, -11, 3, 2, -5, 7, -3, -9, -18, -3, -4, -6, -3, -7, 0, -14, -17, -4, -7, -15, 2, 11, 3, 2, 7, 6, 1, 6, 14, 15, 1, 18, 18, 7, 5, -1, 14, 14, -5, 11, -1, 11, -8, -1, -1, -10, -8, 0, 1, -13, -9, -3, -7, -14, -10, -19, -4, -18, -7, -7, -10, 0, 15, -6, -9, -4, -2, -4, 2, 10, -2, 6, 7, 8, 22, 17, 13, 20, 16, 16, 5, 20, 20, 14, 13, 21, 1, 5, 2, -4, 4, -7, -19, -15, -4, -6, -7, -2, -13, -9, -8, -12, 4, 3, 2, -2, 6, 8, 7, 3, 8, 0, 8, 9, 1, 14, 25, 11, 10, 10, 19, 10, 9, 17, 12, 18, 1, -5, 8, 3, 7, -5, -20, 7, 0, -1, -5, -13, -13, -3, -12, -1, -8, -10, -11, 0, -1, -14, -2, -13, -6, 8, 9, 1, 8, 19, -1, 14, 11, 15, 5, 8, 12, 13, 4, 11, -3, 2, 11, 14, 6, 6, 8, -5, -5, -5, 1, -11, -8, -1, -17, -1, 2, -20, -7, -22, -12, -7, -5, -19, -9, -5, 1, 4, 5, 12, 8, 12, 2, 8, 11, -3, 18, 4, 6, 4, 8, 3, 1, 14, 3, 16, 5, 6, -9, -9, -8, -6, -2, 1, -3, -2, -10, -7, -3, -13, -14, -11, -3, -6, -18, -5, 11, -7, 2, -20, -5, 7, -1, 9, 0, 7, 0, 8, 5, 20, 14, 11, 17, 11, 4, 6, 14, -9, 13, 0, -7, -8, 10, -11, 0, -7, 3, -7, -4, -8, -8, -1, -3, 1, -9, -10, -11, 9, 5, -4, -16, 7, 13, -2, 3, 3, 4, -3, 8]
6622Hj9K0qKoNPloJ5j7J5j0JrJnPPj2kjlPqpMJ3nrKNJ9Lj5MkjJ6j2Qj1jJ1j1J5
6668A2Mr%Lj8J0Qj6LMMj0J2j0lOJk4J5Klj0J0j0OKOjRjJj0lJ6j1Rj3J6MPj1Kq
6711ANPj0KOLj3OnjMlj0n%J0J2j4pNNknKLnqJ2lMpJ2KLj0QpMJ1jLkJj4J3oPlL
6760A3j7Rml%kmJ8rljj1NplJ2nJ3kpkOlJMMqLQkPqJ0j2PLNj9J8jj6J8j9OmJNo
6808bj6nQJ2pMmpj1J5J1j3J2j1MKJ3qRLmKqQLrlPQj6RJj1J3j6NRKj6QJ0knpMj4
6854a3J5j6J1rJnQLroK6j4j4J1QoMONj2J2Oj2LQJ0j8Mj%rQmlNN%Mj2mnQkj0q%
6900b1K7k7J7kmq%J4rJrJ4K2k5%J7kqQMlmJ3rPklj0mJ1Kjj3nJ6k0J7%mj6J8ln
6943iknRJ2qmoJ3j2ljMJ0m%MJ1rQjjJ1oRk1LNpJ0lMMk3JJ4lj2lMqKOj0J1%qJP
$$ y = [8, -11, 9, 1, 3, -3, 2, 9, 6, 0, 15, -2, 13, 3, 4, -5, -4, -9, -2, 5, -7, -9, -10, -13, -6, -14, -21, -17, -4, -9, -18, -16, -11, 8, 11, -4, 0, -2, -3, 13, 1, 9, -2, -3, 8, -3, 12, 16, 7, 7, 10, -8, 2, 10, -6, -3, 1, 5, -5, 7, -3, -6, 0, 1, -23, -8, -6, -9, -19, -9, -19, -13, -11, -5, -6, 3, 2, 3, -7, -10, 6, -5, 4, -9, 7, 11, 18, 7, 9, 1, 6, 13, 3, 5, 11, 14, 1, 7, 2, 1, 5, 2, -8, -13, -13, -3, 9, -5, -12, -7, -2, -4, -9, -7, -4, -9, -17, -5, -8, -4, -11, 1, 3, 6, -4, 4, -3, 1, 12, 11, 14, 12, 13, -1, 12, 6, 13, 10, 13, -4, 5, 1, -2, -2, -4, -8, 10, 1, -2, -3, -14, -9, -16, -19, -7, -12, 1, -1, -8, -10, -4, -7, -6, -2, 2, -6, -3, 5, 3, 10, 2, 12, 0, 7, 10, 15, -4, 14, 13, -3, 15, -4, 2, -2, -1, 4, -2, -18, -23, -15, -3, -10, -6, -10, -17, -28, -13, -2, -15, -3, -14, -10, -8, 5, -3, 6, 9, 5, 7, -1, 7, 10, 1, -2, 5, 13, -3, 6, 7, -4, 9, -7, -2, 7, 9, -7, 1, 11, 9, 4, -3, 1, -13, 2, -14, -3, -12, -11, -16, -8, -5, -14, -20, 6, -8, -22, -11, -3, -9, -5, 1, 6, -6, 6, 12, 0, 3, 11, 21, 3, 7, 6, 6, -3, 5, 1, -2, 3, 8, 8, 12, 0, -4, -9, -1, -3, -13, -21, -21, 6, -21, -4, -6, -10, -18, -18, -4, -13, -12, -21, -7, 15, -10, -10, 7, 5, -3, 5, 9, 6, 2, 15, 6, 13, 11, 8, -2, -6, 5, 7, 6, -7, -12, 4, -16, 1, 1, -3, -19, -1, -4, -9, -11, -16, -7, 5, -3, -7, -13, 0, -12, -15, -16, -12, -2, -6, -6, -2, 9, 0, 8, 7, 6, 17, 11, 20, -1, 2, 7, 0, 10, 7, 11, 15, -8, -7, 7, 4, -8, -11, -7, -15, -13, -7, -17, -6, -6, -14, -13, -6]
6991fJqJ6qKQqJ9j6jNKnQj1RJ1j4j%OJLrPPjqQj4j0JMpJ1%j0nQKj3%PLQjJ1j4
7039bPj3J4LqMJ0j3RQqOJj0qLL%Onl%kMj1J6j7KKonJ0jj5KK0Jk0K2j9lNQJ1j1
7084cLoJ7JjOj1nJ0J0l%nkpKj4QKj0K4j7nRkkj1PLLj5J6pj0J1jj6K5j0jLJ0j5
7127iJ1Mj4LJ5oJ8j2pJ6rmKKKmKqmJ0pj0J2Pj4%Pj2JLNj1lJ6nq%KMKJJLmQOj0
7174BmJ5Jj2PKjjmLnOj4J1Ojj2J0j4%J0j5PoOrPpLmLLlj%J3%Ooj4J4PnLLMrJ2
7222A7k4RJ2NqqJ2rJ%LKj2JLlj3RkNrKpJ2NrKmm%PKKrNLkK1pmpnLoJ8j6OQJqr
7273iLPoKLlqRj2MLkoQj3jJ9j4K0k1RLlQnRPNqj6J0nMJ4%nKj1NNj0J3j1qKJ0j3
7320fJlpkkMKJ4j1o%RJMppJ2mK%J0pJ7k4J2NoJ6Lj5KjlQjJlnLl%j5J8j3LqRj3
$$ y = [-6, -5, -13, 3, -5, -3, 5, -3, 16, 0, -1, 4, 6, 1, 9, -2, 7, 18, 4, 3, 3, 9, 10, 13, 4, 11, 18, 17, 9, 17, 3, -7, -6, -2, -9, 2, 2, -8, -13, -5, -3, -16, -16, -9, -6, 2, 1, 12, -2, 5, -8, 6, 9, 1, 5, 15, 2, 11, 19, 11, 17, 18, 8, 0, 3, 6, 6, 12, 7, 4, 4, 2, 6, -5, 11, -6, -4, -2, -8, -13, -3, -4, -19, -17, 3, 4, -16, 6, -13, -16, -11, -3, 8, -3, 0, -6, 11, 12, 11, 17, 6, 1, 11, 21, 18, 18, 13, 11, 4, 6, -8, 0, 2, -8, 16, -1, -6, 3, 1, -1, -12, -5, -2, 1, -14, 2, -5, -15, -4, -5, -21, 4, -6, -7, -4, 6, -9, 2, 6, -8, -5, 10, 4, 22, 10, 3, 19, 10, 6, 8, 10, 12, 8, 10, 2, -2, 8, 1, -9, 3, 10, -4, -4, 3, -9, -8, -5, 0, -11, -14, 2, -3, -11, -11, -9, -5, -3, -2, -1, 2, -2, 6, 12, 2, -2, 13, 14, 2, 9, 11, 10, 9, 5, 8, 3, 9, -5, 6, 12, 11, -1, 9, -5, -5, 5, -10, -3, -9, -3, -12, -5, -12, -9, -13, -10, -7, -10, -11, -11, 2, 2, 8, 2, -12, 2, 9, 4, 7, 10, 14, 5, 17, -7, 2, 14, 19, 11, 3, 15, 6, 7, 7, 10, 12, 0, 1, 4, 1, -12, -3, -5, 0, -9, -7, -14, -2, 3, -6, -4, -8, -12, -12, -5, -3, -1, -10, -5, -2, -4, 17, 10, 6, -1, -6, -3, -9, 9, -7, -1, 7, 8, 0, -9, -6, 1, -5, -3, 0, -3, -11, -2, -14, -10, -7, -9, -15, -7, -20, -21, -2, -16, 4, -17, -8, -5, -8, 0, -5, 4, 11, 16, 8, -8, 2, -3, 1, 15, 15, 10, 12, 1, 6, 11, 1, 14, 3, -5, -3, 7, -6, -5, -8, -15, -17, -19, -15, -13, 1, -10, -16, -16, -7, -6, -2, -9, -16, -4, -8, -6, -6, 4, -3, 14, -10, 2, 7, 1, 17, 20, 5, 7, 6, 3, 11, 10, 11, 8, 3, 6, 3, 3, -12, 6, -7, -4, -12, -3, -16]
7368a6JMJ9j2knlNNJ2j1QqjpkK0ljKpJ6j0LLpQroRkjJmNjpJJj4J5Lj3J3k1J1m
7415a2pPjmMMkJ0jmJ4j1OlJ5j5Rj6PJ0j1J5O%j1pKJnRqLNj5J0klLj9K3j5j%OL
7460anj1K0rmqK0lRPj0KjkJ7j4NpNJ5j6oQj2NJKj1lLN%j5J2mkkkJ6j2Rj6MNNK
7506Aj0kLJ1j1J6pRk0K0pOQooNmLNkNj2Jl%pPpLj4%J0Kj2KJQQrKJpJ1pkN%mQp
7556eKQo%J0lqJ1lQKnknRj5LjJJ7j7lj1J7pojNj1jKMjJ3mMLnMJrKJMQj5J0LJm
7606E%J6rj0J2j1Pj3QoPNpj3J1Pj3l%oJQLj3kjJ0KrMqJ0RnOqJ7pjLoJ2kJ0p%j7
7653dLJ3qlKMj4J4j7J9j6mJ0jOmk2J3nJQj%p%J6Lj1J8prJ6j5lJ6nJ4qjlLJ2j2
7696A1j0Pm%Koj8J1oJ4Lrl%jnKrLQLPJpRj2NmkLkNoJ8rLPJ2j7QrJjrJ0jkNj2J
$$ y = [-16, -15, -11, 8, -4, -6, -11, -14, -9, -4, 8, -3, 5, -3, -4, -11, -13, 7, 4, 3, 5, -2, 14, 4, 7, 10, 3, 11, 2, -4, 5, 3, 2, 3, -1, 4, 3, -4, -3, -2, -16, -1, 2, -11, 2, -19, -8, -12, -19, -12, -13, -17, -13, -9, -11, -1, -2, -6, 8, -3, 3, 0, 15, 0, 9, -7, 0, 10, -1, 14, 20, 20, 9, 2, 4, 5, 0, 9, 1, 4, 9, -6, 4, 2, -1, 2, -17, 6, -9, -10, -10, -4, -1, -6, -17, 3, -6, -10, -18, 2, -1, 8, 15, 5, 7, 6, 4, 21, 7, 12, 5, 10, 25, 9, 3, 11, -1, 4, 5, 7, -4, -7, -4, 1, 1, -14, -2, -6, -8, -10, -12, 4, -8, 1, -15, -11, -6, -1, 1, -9, -11, -8, 3, -8, 8, 1, 10, -10, 10, 3, 9, 17, 11, 5, 10, 6, 9, 14, 12, 17, 5, 6, 3, 3, -4, 3, -4, -1, -15, -15, -5, -3, -15, -13, -12, -4, 4, -5, -3, -2, -9, 2, -5, -7, -2, -2, -6, 2, -5, -3, 5, -1, -1, 9, 6, -2, 9, 6, 14, 16, 11, 9, 4, 13, -2, 1, 0, 1, 18, 1, -2, -13, 4, -3, -9, -10, -5, -16, -17, -15, -11, -12, 1, -3, 1, 4, -1, 3, 4, -5, -3, -2, 2, 10, -5, 5, 8, 9, 5, 5, 21, 12, 2, 14, 3, 10, -3, 5, -1, 6, 11, 4, -9, 2, 9, -4, -7, -7, -13, -12, -4, -1, -14, -16, -17, -7, -5, -14, -10, -18, -8, 1, -4, 2, -6, 11, 4, 3, 6, 0, 12, 10, 20, 13, 13, -4, -1, 12, 4, 1, 3, 7, -7, 7, -10, 9, -7, -11, -1, -2, 4, 0, -22, -9, -14, -13, -5, -6, -6, -13, -13, 3, 6, -5, 13, 6, -3, 13, -2, -5, 11, 6, 20, 12, 11, 8, 11, 23, 11, 1, 8, 4, 4, 6, 0, -18, -7, -13, 1, 4, -5, -8, -8, -9, -14, -12, -21, -18, -10, -7, 0, 1, -6, 3, -9, -4, -8, -10, -7, -9, -4, -10, 8, -1, 2, 9, 21, 4, 12, 3, 4, 3, -6, 4, 3, 1, 6, -6, -5]
7746eJ1k1JOjNj7J0pJ0Pj9J4%NJ2j1mkjJ5pjlJ1mmRlKOqJ0omOj3MLNmmmmLKMj0
7794fj3LMkKmNMkKlJ2j7KOQkJmJ1qM%jJ1j1mKKJ2mj3Pj3QnlJ2j1Rj2LOpoJ2j0
7841a3rONLJ0roNLpK1oKoNMjJ%j8K6j0J3lmOj1nj2J4j2J1pmOmLmJ3k7J9J4oqj4
7886a6PQLj0jNj2RLK%NOMj2LRj1MOKj3O%Orn%knJ4KqqJJJKJj2PPmJ1j6KM%J2k0
7936a1J6rJ0pjnJ9j2JRpOj3RMjMmoJ1j3lNQpj2oJ0j0LoRlj4JK2qpQNrmJ1MNJl
7983@RrKL%J1j4KJKNLj3OrJ4j2NnnL%j5J3qJ5j2npMRqJ1j0NLLmJ1%rmJ8nlrJ3
8030EPk%KkjP%oJLj5J4j7j3K3nqjqJJ0oLJ3j8OL%kKRpOmPlJrJ0J6oj0MqJPJ6j8
8079HJ2j3Lj1J2j7J1j1lJ0o%nkoOkkJ2j0KJ1j9J2LJ0lrNL%%j2J3oQrKMj2QJkK
$$ y = [-5, 6, -15, -14, -8, -9, -4, -21, -11, -18, -8, -1, -20, -6, -6, -1, 11, 0, -4, -6, -7, 8, 1, 0, -3, 8, 4, 0, 9, 6, 8, 14, 6, 16, 10, 6, 12, -1, 3, 6, 11, 7, 3, -1, -5, -2, 0, 4, -6, -19, -16, -12, -14, -12, -16, -11, -7, -9, -7, -10, 2, -15, -13, -7, 1, -1, 0, -4, 7, -1, 3, 3, 2, 13, 2, -2, 0, 2, 14, 10, -3, 4, -9, -1, -6, -9, 3, -8, 1, -11, -8, -2, -9, -15, -3, -13, -22, -16, -11, -8, 2, -7, -13, -8, -5, -12, 9, 3, 5, -1, 4, 8, 7, 8, 8, -10, 16, 6, 19, 16, 12, 18, 7, 2, -10, 4, -8, 3, -4, -8, -2, -6, -3, -7, 6, -21, -2, 12, 6, -2, -16, -9, -1, 2, -8, -9, -4, -16, -7, -4, -2, -2, 3, 9, 13, 1, 4, 13, 2, 6, 12, 14, 1, 7, 7, 13, 4, -1, -1, -3, -8, 6, 8, 0, -8, -7, -6, -5, -3, -2, -14, -7, 0, -4, 7, -9, -7, -3, -3, 9, -11, 5, -4, 6, -1, -2, -7, 12, 0, 1, 10, 3, 9, -4, 5, 9, 8, 12, 8, 2, 13, 0, -3, 2, 10, 3, -9, -15, -5, -15, -12, -18, -9, -12, -26, -25, -3, -11, -18, -10, -5, -14, -18, -7, -3, 2, 3, 0, 9, 0, 2, 5, 5, 16, 2, 4, 5, 7, 12, 15, 2, 8, -1, 13, 1, 6, 1, -4, -1, -1, -16, -3, -11, 4, -8, -13, -20, -16, -7, -15, -4, -14, -9, -6, -3, -7, 4, 4, -5, -9, 9, 4, 1, -8, 5, 12, 10, 10, 12, 10, 9, 16, 16, 10, 11, 14, -1, 13, -4, -17, 6, 1, -7, -8, -16, -15, -5, -11, -8, 5, -13, -7, -4, -4, -6, -4, 5, -2, 4, 0, 7, 4, 5, -4, 6, 22, 16, 6, 10, 2, 3, 10, 26, 8, 20, 7, 10, -1, 11, -6, 5, -6, -9, 1, -5, -5, -10, -12, -18, -12, -14, -16, -4, -14, -12, -1, -20, -8, -5, 5, 2, -7, -2, 1, 1, 1, -11, 2, -4, 4, -5, -3, 1, -11, -3, -2, -4, -2]
8123bJoPJpOkjjrnJ2nKj0%mJ2nJ3j2jJ1LJJ1lj3KMOlJMqlLJPkjMk%mrRjKn%j1
8175a2J9j4%oJ7j0llJ0Lk4J2j%Jk
$$ y = [-2, -1, -7, 0, 1, -6, 0, -2, -3, -4, -13, -18, -6, -11, -9, -19, -19, -23, -11, -16, -3, -15, -16, -5, -2, -1, 10, 7, -6, -4, 0, 6, 3, 4, 8, 0, -3, 0, 1, 8, 6, 5, 9, 7, 7, 3, -6, 3, 2, 4, -1, -1, -12, 7, -7, -7, -13, 4, -6, -9, -12, -2, 1, -23, -11, -12, -12, -11, -13]
8191a3
$$ Imaginary data points
##PAGE= N=2
##DATA TABLE= (X++(I..I)), XYDATA
0@%%%%%%%%%%%%%%%%%%%Qj6J6j6J6j6J6k4L2l2M0m8M8n6O4p2Q0q8J04j18J26j36
41g2J53j75J98k16K40k64K88l20L52l86M26m72N20n74O36p04P82q74R82j108J262
62F74j453J699k030K495l212M475p339K6126K091l9815q087j5917J432K2752K8905
77A2796J3900J5134j525k6777l0651j2320q368K090K2603K9968J7136P820p728
90C4078k6175k7353j2469m488O288K2046K5167J3542M145q375k2653k3151j1977
103c1375l759Q958K4646K4363R761q70j0960k2429k0884q172K29R190K1762K1903
117B2363Q409k465j0886k0468j9594p407K776J1790K1956J9580L849p063j1413
130A1427j7721j7492n154N979J1677J8358J8149M426q690j2827j5975j6132m726
$$ y = [0, 0, 0, 0, 0, 0, 0, 0, 0, 0, 0, 0, 0, 0, 0, 0, 0, 0, 0, 0, 8, -8, 8, -8, 8, -8, 8, -16, 16, -16, 24, -24, 24, -32, 32, -40, 40, -48, 56, -62, 64, -72, 81, -94, 104, -112, 128, -136, 152, -168, 184, -202, 224, -248, 272, -302, 334, -370, 412, -462, 520, -588, 674, -779, 920, -1110, 1385, -1827, 2648, -4691, 21435, 23526, -16289, -24376, -40293, -38861, -16109, 12796, 26696, 41830, 40305, 13528, -17123, -29443, -37811, -35721, -13118, 16850, 33986, 41806, 34078, 7903, -19450, -31919, -36407, -30119, -8073, 17094, 30636, 34781, 26406, 3753, -19398, -31375, -35134, -26176, -1530, 22833, 32594, 31724, 20764, -1665, -22549, -30721, -30492, -21302, 460, 22363, 30772, 28307, 17421, -3047, -22641, -30048, -27272, -15482, 6474, 26054, 29903, 22840, 11427, -6294, -23786, -28940, -22961, -11284, 7074, 25223, 29649, 20959, 8132, -7843, -23975, -28701]
143b8701R478J4949J5390J2624K428r145j3497j3932j2378l522R068J5451J4958
156A3171J0569J303r411j4698j4318r699n7J0274J4324J2669P846q51r757j3097
170a732j2227q615P18J1473J4630J1243O327j952j1446j4009j0135n248K207J1255
184g511J3602Q983M016k108j0409j3699r519l343L831J1494J3129P913K088l865
198A4602j0943j2855p500r86M636J0421J1786O903J145m391j0827j2426o413Q41
212a6007N834J0288J0944N390j122n768j0033j0621n028J708O143R736J0086M694
226A6244k159o803r878r401l640K851O934R410Q576K875l294o758q932q271k759
241a5005L614P158Q953P909K043m499p488q277o839j458M596P322P777O357J331
$$ y = [-28701, -19223, -4274, 11116, 23740, 26168, 17023, 3526, -10406, -22784, -26306, -17238, -1787, 13171, 23740, 25043, 15632, 934, -13384, -23083, -23140, -12866, 1458, 14127, 21973, 21122, 11365, -1732, -13959, -22574, -21856, -10383, 4247, 15490, 21817, 19865, 8419, -5590, -15725, -20973, -18766, -7511, 6091, 15074, 19090, 16982, 6573, -7126, -16645, -19988, -16157, -4663, 8466, 16379, 18467, 14602, 3659, -9196, -16696, -17682, -13046, -2625, 9161, 16064, 17209, 12818, 1991, -10435, -16848, -16007, -10173, 115, 11059, 16449, 15327, 9559, -474, -11095, -16123, -14415, -8272, 1464, 11550, 16244, 14085, 7282, -2596, -11997, -15637, -12786, -5852, 3558, 12134, 15009, 11715, 4957, -3975, -12246, -15005, -11391, -4233, 4720, 12629, 14672, 10173, 2685, -5592, -12431, -13889, -9293, -1971, 5806, 12163, 13494]
256A3494m733p651p766n773o27N156P748P393N078L7n429p644o880m340L84N394
272f159P392O564M099n96n728p671o383l393J337O115P476N561K549j521n731
287C911p178n407k325J746N921P267N186J705k297o052p077m727j043K731N960
302a679O567M172P45k741n775o467m033m69L029N992O500L709k69l613n955n908
318f195k969P13L466N443N631L019p42l662n612n588k673J281M134N590N126K096
334I058j766m242n230m596j773J820M067N019M492J769j910m375n226m364j240
349h497K582M630M788L562O97k620m346m428l364p72K556M496M573L341M80k989
365D689m793m434k726R3L208M569L880K220k35k993m331l733k196K46L187M634
$$ y = [13494, 8761, 1110, -6656, -12429, -13056, -7900, -152, 7241, 12319, 12356, 6927, -717, -7597, -11937, -11553, -6159, 1233, 7797, 11896, 11300, 5572, -2099, -8482, -11875, -10538, -4423, 3053, 8614, 11163, 9642, 3911, -3267, -8674, -10999, -9253, -3332, 3935, 9121, 10826, 8529, 2477, -4600, -9327, -10370, -7639, -1679, 4888, 9060, 9805, 7064, 1289, -5178, -9211, -9680, -6651, -659, 5841, 9550, 9281, 5668, -287, -6195, -9164, -8451, -4985, 458, 6089, 9108, 8366, 4704, -908, -6496, -9169, -7888, -3754, 1836, 6962, 9058, 7292, 3050, -2180, -6776, -8549, -6729, -2662, 2357, 6849, 8618, 6708, 2333, -2893, -7257, -8497, -5915, -1285, 3503, 7065, 7762, 5142, 796, -3632, -6996, -7768, -5212, -716, 3857, 7198, 7678, 4689, -104, -4538, -7264, -7171, -3963, 606, 4486, 6706, 6471, 3478, -853, -4586, -6782, -6536, -3349, 1285]
381A285L889J950q09l601m616l399j245J105L323M138L023J186r39l178m229l159
397e276j024J324L572M314K879M60j776l609m004k386j61J713L246L674K402K87
413E635j671l356l877k353Q5K195L624L609J766o82k346l275l141j571N25K126
429b707L191L280J715o48k456l375l157j351J069K702L200K647Q84j255k562k893
445a716k406q94J091K559L063K593R16j410k953l125k171l60J683K775K675J787
461D107K84j479k622k614j766k58J621K850K788J694o8j994k976k542j219L20
477c874J892K674K218J087k37j715k645k336j160M13K027K896K220O55q06k153
493A156k702j877n17Q01J950K524J852N39p57j970k607j927l49J143K218K482
$$ y = [1285, 5174, 7124, 6315, 2714, -1902, -5301, -6546, -5441, -2118, 2020, 5043, 6229, 5290, 2112, -2117, -5276, -6300, -4976, -1404, 2910, 5789, 6249, 4473, 864, -3140, -5526, -5687, -3974, -728, 2946, 5348, 5635, 3964, 608, -3269, -5622, -5537, -3342, 282, 3891, 5657, 4975, 2629, -646, -3787, -5358, -4833, -2707, 484, 3764, 5479, 4831, 2375, -1000, -4157, -5508, -4439, -1737, 1463, 4110, 4994, 3739, 1177, -1716, -4122, -5016, -3925, -1366, 1697, 4290, 5206, 3796, 843, -2282, -4453, -4813, -3130, -355, 2320, 4107, 4391, 2912, 290, -2324, -4090, -4348, -2727, 123, 2911, 4605, 4537, 2543, -433, -2975, -4194, -3874, -1982, 692, 2910, 3997, 3760, 2045, -600, -2936, -4096, -3683, -1656, 1240, 3460, 4115, 3309, 1156, -1546, -3423, -3940, -3139, -1189, 1335, 3187, 3726, 2969, 999, -1608, -3535, -3884, -2741, -523, 1959]
509A959J549j6j278k078k231j367L7J217K008K209J454K4j308k183k290j282L46
526c230J596K110J916R28m30j459j953j842r03M42J498K019J887R11o21j729k079
543i39j711o26Q13J724J857J442M91p90j595j792j407n14Q23J783J905J389K65
560C118j079j901j717j077j58R99J759J647J006O7j002j699j669r68PJ116J845
577B94J629P72k81j237j726j431o36K70J161J659J413O30l12j217j690j390n20
594b612N28J353J649J179L23n61j294j550j099k47N56J292J558J111K07o81j363
611C49j540r93oQ09J316J379Q28k1p91j290j335q39Q2Q28J320J360P78k05r98
630A031j355j182n94K82R50J233J098N66k86r63j251j121n08L79J078J282J015
$$ y = [1959, 3508, 3492, 2214, 136, -2095, -3462, -3425, -2208, -200, 2009, 3463, 3487, 2179, -4, -2294, -3576, -3230, -1634, 476, 2392, 3320, 2890, 1431, -522, -2364, -3267, -2825, -1327, 692, 2579, 3490, 2869, 1140, -939, -2650, -3276, -2463, -739, 1118, 2560, 3051, 2261, 666, -1126, -2533, -3047, -2224, -441, 1464, 2853, 3118, 2039, 138, -1579, -2656, -2814, -1815, -56, 1591, 2597, 2664, 1662, -37, -1706, -2674, -2667, -1551, 294, 1923, 2695, 2414, 1177, -549, -1980, -2616, -2346, -1185, 474, 1887, 2517, 2205, 988, -702, -2092, -2612, -2084, -731, 918, 2097, 2420, 1859, 565, -985, -2084, -2331, -1775, -483, 1075, 2186, 2393, 1712, 349, -1191, -2184, -2190, -1381, -65, 1314, 2142, 2121, 1330, 40, -1295, -2134, -2052, -1224, 96, 1456, 2234, 2029, 1031, -324, -1506, -2100, -1818, -868, 365, 1463, 2029, 1743, 780, -471, -1592, -2100, -1721, -643, 639, 1654]
647A654L50m87j074j182q76k84M58J028J168Q57K86n24j096j186q32j39O45J161
665g3J100O52L2o44j068j019o11m1O32J077J050N96k7p26j138j027m47J86P72
684g24J075Q66L73j80p21j030q63l87K06P60J075R04K91l51q57j049p19j57L90
703a098P62R42O94J55l73p80r60p20j25M65Q67R75O26j6n78q61q07n00M8N01P87
724DQ05N27j8n37q53q45m74J28O52Q73P60L17k18o52p66o39l09J73N94P74O83
745I79L42k18o84q45o67k14L44P38P46N01J15l00o42p01n11j63K94O79P82N26
765A101J02m26p47p40m07K4M53O85O21L30Pl64o38o60l79RM35P36O75L02j33n48
787D38p00n64k03J82M79O05N20K15j08m51o48n76k31K10N49O80N11R2l06n47n69
$$ y = [1654, 2004, 1517, 443, -739, -1615, -1899, -1441, -413, 755, 1612, 1898, 1374, 278, -908, -1740, -1879, -1234, -73, 1027, 1679, 1711, 1067, -1, -1020, -1631, -1672, -1040, 37, 1087, 1683, 1656, 930, -208, -1235, -1682, -1496, -724, 351, 1217, 1590, 1410, 689, -341, -1204, -1591, -1385, -625, 450, 1354, 1645, 1294, 437, -612, -1331, -1488, -1098, -336, 606, 1300, 1455, 1082, 302, -658, -1378, -1503, -1038, -171, 804, 1430, 1414, 836, -25, -832, -1332, -1284, -783, 4, 809, 1336, 1318, 781, -72, -917, -1391, -1263, -611, 262, 1022, 1339, 1121, 469, -297, -936, -1245, -1072, -478, 296, 979, 1321, 1103, 419, -426, -1093, -1307, -963, -225, 521, 1022, 1137, 837, 195, -506, -1017, -1180, -886, -207, 575, 1101, 1203, 777, 30, -710, -1117, -1093, -640, 45, 666, 996, 1003, 639, 1, -659, -1038, -1029, -594, 142, 817, 1119, 986, 438, -262, -826, -1029, -847, -368, 237, 757, 972, 864, 413, -235, -811, -1042, -832, -283, 397, 908, 1000, 694, 147, -422]
808d22m13o4K54M94N50M33J26k62n35o19m42m0L73N84N48L07n0l82n05m60k83
829h08J9L32N09M98L34m1m20n87n09k42J32M57N38L91J69j39l82m71l66j95J18
850f63M06N20M18J55j90m90n32l38n8K42M41M43L05N1j73m01m51l07q6K30M65
871a3M73K88k4l05m90m14j84M6K89L85L84J98Jk55m26m24k20O7L26M43L94J31
893F70j54l23m08l06j07J28K96L78L31J31j07l39m19l33r8K01L67L93K40K8k09
914C60l12l42k42k2J89L36L50K61K8k50l57l69k12M3K61L47K98J47m0k25l25k70
936c46j63M2K43L56L05J42r7l01l45k62q7J10K86K89K39R1q8k57l21k48q3J03
958c92L13L26K08L0j65k88l02j78mJ47K82K73J76K6j49k89l06j69PK14K85K50
$$ y = [-422, -835, -899, -645, -151, 399, 832, 958, 696, 161, -458, -900, -940, -567, 17, 565, 872, 822, 440, -65, -525, -808, -789, -457, 52, 550, 884, 843, 423, -164, -673, -915, -783, -326, 212, 603, 772, 633, 251, -220, -586, -781, -663, -257, 263, 681, 836, 646, 156, -376, -714, -772, -530, -89, 354, 659, 710, 537, 136, -315, -622, -708, -478, -13, 460, 748, 724, 419, -71, -485, -669, -623, -334, 51, 435, 633, 634, 379, -47, -471, -691, -624, -298, 145, 539, 670, 516, 193, -215, -521, -628, -500, -204, 174, 505, 636, 529, 190, -229, -562, -660, -459, -92, 301, 541, 569, 360, 48, -294, -536, -558, -369, -33, 317, 578, 606, 356, -1, -370, -582, -539, -278, 69, 367, 514, 474, 249, -76, -346, -509, -467, -224, 132, 437, 579, 482, 181, -164, -426, -513, -403, -117, 172, 411, 502, 414, 157, -164, -412, -495, -392, -79, 247, 455, 485, 320, 32, -270, -448, -452, -305, -23, 250, 426, 452, 303, 14, -292, -461, -454, -240, 45, 295]
980B95J33n5j79k69k31j19M7J85K64K53J20n3k13k72k45q4R7K08K62J93O4r0k05
1003A06k52j78p3R9K19K47K13N1j30k57k40j64kJ61K04J97J45J1j12k17k24j60
1025c56JJ54K33K23J42n6j76k21j94p9K9J63K09J53J32l9j69k25j96q7O9J92K28
1048A30J53N8j00j86j88j26m5O2J66J96J64M3q6j95k13j22l1J20K20J71R5lr6
1071A87j71j63j24oR4J85K03J12k4j37j98j76o1N4J25J65J41N5m5j02j56j66p5
1094b83M6J39J83J48N8q2j66j65j10k6R1J17J48J17L4p0j26j58j27k1Q1J62J84
1117A74R1k5j05j47j30o6J3Q8J16J27Q9Rr8j45j48q6K4J27J57J18M4m4j19j17
1141e3r5n1J7J01J31J27N3m7j07j62j22j4Q6J14J19Q3Rn3j01j15q0l1M8J17J37
$$ y = [295, 428, 373, 194, -75, -306, -425, -378, -193, 71, 324, 444, 391, 178, -94, -339, -423, -326, -118, 144, 337, 401, 311, 106, -146, -324, -397, -298, -79, 168, 381, 432, 302, 45, -195, -359, -361, -200, 4, 201, 346, 357, 245, 28, -196, -356, -355, -201, 32, 255, 397, 341, 165, -56, -250, -329, -300, -137, 72, 225, 357, 318, 149, -76, -272, -359, -290, -98, 130, 283, 341, 241, 55, -133, -259, -304, -242, -76, 120, 284, 327, 241, 46, -167, -289, -320, -200, 20, 191, 286, 283, 187, 16, -147, -271, -277, -183, 2, 205, 317, 293, 156, -42, -218, -279, -225, -100, 65, 206, 261, 216, 114, -42, -208, -283, -237, -98, 85, 233, 291, 209, 43, -122, -232, -258, -167, -50, 98, 215, 249, 179, 53, -105, -232, -253, -172, -10, 174, 265, 240, 135, -12, -142, -208, -195, -107, 9, 136, 225, 234, 136, -9, -157, -243, -219, -92, 65, 183, 227, 183, 64, -53, -148, -199, -182, -81, 50, 177, 230, 183, 76, -86, -208, -222, -136, -22, 97, 180, 189, 136, 35, -80, -160, -191, -143, -26, 111]
1166A11J02Mr5j32j38n5K9Q5J20R7M6j0n6j07j15o6jQ4J29J29L4n2j00q5j08j3
1192a63M0Q1J02Q3L9k1q8j02j07m1N2J02J16Q3Jo2r4r1n6j4N1P0R5Q5K6p2j00
1219A5j09p4%P9J10R5L9l8n7q2p3m8K0N8Q1J00N2j1q8j07r8k7M2Q9R0O5J0qp7
1248D8p0p5k9J4P6J01Q1J8m7r2r9m5j3N7P5P7M2J4l1q2q3p0j0N3R2Q4M3jp0q3
1278b5o2l6K3N3P6O8M1j1n3r1o7m6J2P5Q6P6J1k6p7o6n2j7L1M3N4O8K3j8n1r3
1308e1o3j0N0M7Q5M5Om7m4n9m9j6L2P7O8L1J6n1p0n3m2J4M8N1N2M8om8n9n3k9
1339h0OL8O5N1K3k4m8o1l8k2J5M3O3M5J8j4l7p4l9j4MP5N5L9ok6n1m1l3mJ4M1
1371a7O9L8o%o9o4m2K2L0M3N1J5Jk8n0m6j6pL1M3O3K8k3k8o0m8qJ9L5N1L6Jj0
$$ y = [111, 213, 217, 122, -10, -148, -203, -174, -89, 31, 128, 174, 164, 108, 1, -114, -180, -181, -97, 32, 161, 195, 143, 43, -42, -150, -163, -123, -42, 60, 143, 182, 161, 73, -29, -136, -177, -125, -23, 93, 176, 177, 115, 21, -70, -126, -140, -89, -19, 76, 161, 187, 115, 15, -94, -168, -168, -89, 21, 116, 155, 117, 60, -22, -95, -143, -123, -65, 16, 116, 168, 157, 69, -38, -136, -163, -121, -32, 58, 123, 133, 125, 48, -22, -97, -126, -112, -36, 65, 146, 164, 117, 25, -74, -119, -132, -75, 0, 77, 119, 133, 102, 20, -63, -133, -143, -90, 2, 86, 129, 128, 58, -25, -87, -123, -100, -47, 29, 97, 138, 127, 74, -17, -84, -130, -118, -43, 43, 119, 130, 104, 27, -39, -91, -108, -77, -34, 20, 88, 111, 93, 42, -51, -114, -124, -74, -27, 58, 103, 109, 62, 18, -41, -90, -106, -74, 3, 71, 102, 118, 67, -3, -56, -98, -84, -36, 15, 67, 115, 109, 61, 2, -51, -80, -74, -36, 29, 80, 103, 79, 31, -30, -68, -90, -75, -32, 31, 76, 94, 80, 43, -31, -70, -84, -80, -5, 50, 89, 83, 57, 6, -35, -68, -72, -58, -17, 52, 90, 84, 84, 15, -49, -91, -69, -39, 4, 55, 70, 71, 43, -7, -53, -69, -76, -45, -2, 61, 89, 66, 38, -22, -70, -78, -59, -24, 27, 63, 64, 54]
1404E4k1m7l1k0QM4N8L8Jj7m3n9k2nL1M3J3L2J5k2l8l0m8KK9M2M3K7j3l9m9j9
1436d3qNJ0K9M0L1j4j9n2k5l5K5M4L5L1J0j7k6k6k9j6QL4K9N0jj2m8m1j6MLN4
1469A4K0K2j0j5j8l0nm1K7K3M4K0Pl9k7m1oJ2K3L5J5NQj4k9l3j3jK4N3K0Pj2l3
1503A2j0l5lK7%K4J5J2kj2m5j9k3K8K7L7MPk1k9k4mJ4oK6J8J7J7j0n8k3j9J0L3
1537a5M1J1Rpj0k2j9j5mK0J4K1K4j2j9k0m3mK3J7K1J7kj1j7k7jj8K0J8J7J9Np
1571B4l5j7K%RK8J6mNnj7j0l4%J8K0L7J0l0qk7kj3RJ5J8J6OJj3l0k3j6J4K5K0
1607IRLj1qj9j5oJ8K0pM2j3Mk9k9jj1L2K0K1Jlj9Kl1NmNJ0K8Nqoj7k9%J6RJJ8
1647A2K5j5km1jj3J1J3J0K5Jqj7j5j6RJ3J1K7oQmk0j2j3pQK7RRkj5j9j1MoJ3N
$$ y = [54, 33, -14, -45, -65, -57, -13, 45, 83, 84, 67, 24, -35, -57, -62, -31, 12, 25, 57, 72, 50, 12, -18, -66, -64, -35, 7, 50, 77, 64, 25, -24, -43, -51, -46, -36, -7, 33, 64, 50, 31, -21, -46, -81, -56, -12, 23, 54, 64, 47, 21, -5, -34, -50, -42, -8, 21, 71, 70, 58, 10, -31, -47, -43, -40, 14, 34, 56, 46, 31, 13, -17, -22, -63, -36, -13, 31, 51, 58, 19, -8, -49, -55, -43, -20, 15, 30, 35, 43, 29, 0, -33, -46, -47, -23, 30, 50, 57, 45, 12, 2, -33, -36, -9, -9, 15, 30, 42, 40, 28, -17, -36, -59, -31, -4, 33, 37, 44, 23, -6, -30, -34, -20, -26, 0, 18, 35, 52, 42, -16, -39, -58, -48, -15, 26, 37, 46, 39, 29, 7, -12, -27, -31, -11, 3, 24, 48, 36, 17, -3, -46, -50, -27, -10, 11, 28, 26, 15, -2, -29, -30, -48, -28, -10, 7, 26, 31, 24, -11, -28, -26, -26, -17, 11, 27, 23, 28, 23, 6, -4, -38, -38, -20, 0, 37, 47, 17, 9, -18, -20, -33, -24, -9, 9, 25, 31, 32, 19, -11, -34, -50, -36, -11, 9, 18, 21, 10, 2, -17, -32, -38, -20, 0, -7, 35, 22, 26, -3, -32, -33, -44, -12, 8, 29, 30, 27, 8, 10, -21, -16, -20, -15, -5, 23, 28, 20, 14, -3, -32, -32, -16, -7, -6, 12, 37, 22, 20, -21, -22, -35, -24, -11, -1, 24, 25, 17, 0, -15, -31, -22, -9, 2, 29, 23, 31, 27, 7, -5, -18, -25, -17, 10, 19, 28, 26, 11, -8, -19, -15, -21, -8, -3]
1685cJ9J%kj6j8oPJ6J7Oqj5Pj4j5LJ1j0L1J6Mj0j0j3j3MRJ1OJ7rpopj6%J1J0O
1725A4OJ3k7k8lmJ6lJ3RJ2pPk1rj1J5oJ5K0jLk6j1jJ0ljJ4K8rjj3j3nk%J7R%Q
1766B4jk4Mj8Qj6RK1NoJ0k6j9QMJK5kNLk0K1j7k1J9pK1NoKnj5rQOkMJ5J0qrmJ
1809Dj3nJ0J3QJ0k6Jj1Jj0J4k%QJ2pj3Oj2mKK4KkLjj6MnMNMOPkoj8rOMKJ6jQj4
1855Gll%j2J1kPRmmj0ooPNJ1%jqmJ1k%okLK3j0J9j5qPj1j2J2J2rQLjnj1%nlRO
1902GJ4pok4J8koJJ3%%Knj7%%QNoJ7j0mK0j6Qj6LJ3KMRj3kpj6J3nRJ0rRj3Mrl
1947gj1J3J1KKlj0Mj5J0OkJ0J1Kj3pNooq%K0PJMj1omJ0j0NmOQj0Rj4mj0J3PnN
1991EomKPj2LrK1mnJ2j1rPJ1mmQRJqMmnlQJrlRoLpj1J6MjnmMMj3JLNn%LoQJmq
$$ y = [-3, 16, 17, 17, 15, -1, -19, -25, -18, -2, 15, 21, 13, -2, 5, -9, -24, -21, -10, -20, 11, 27, 31, 21, 11, -2, -15, -11, -2, 9, 15, 32, 23, 16, 10, 3, -13, -13, -2, 8, 14, 20, 33, 6, -22, -25, -29, -13, -16, -3, 6, 18, 11, 18, -3, -12, -23, -8, -14, 1, 21, 20, 23, -3, -14, -15, -5, -8, -9, 5, 33, 24, 23, 10, -3, -8, -10, -10, 7, 16, 16, 24, 23, -1, 3, -15, -7, -23, -14, 7, 12, 6, 16, -10, -29, -21, -17, -16, 9, 7, 12, 15, -5, 16, -1, -22, -3, -10, 11, 16, 10, 12, 7, -8, -17, -9, -3, -5, -1, 14, 24, 16, 7, 3, 4, -9, -14, -4, 9, 17, 27, 1, 2, -9, -8, -18, -4, -6, -6, 2, 14, 7, -6, 0, -12, -16, -14, 10, 12, 10, 13, 12, -4, 0, -5, -1, 4, 8, 14, 21, 19, 13, -5, -14, -8, -4, -2, 14, 13, 21, 7, 4, 1, 1, -11, 0, -2, 5, 14, 10, 6, -4, -10, -16, -9, -4, 7, 7, 6, -2, -6, 5, 3, 3, -3, -5, -2, 21, 11, 30, 15, 7, 14, 3, -9, 3, 15, 6, 14, 17, 16, 11, 0, 0, -5, -8, 1, 7, 21, 14, 8, -16, 2, 0, -6, -5, 8, 8, 8, 10, 5, -12, -12, -12, -4, 1, -5, 12, 2, -2, 18, 2, 10, -6, -3, 10, 12, 16, 25, 12, 10, 3, -13, 0, -5, 4, 14, 5, 14, 1, 5, -4, -7, -18, -5, 6, 8, 10, 7, -3, 1, -14, -4, 2, 0, 10, 21, 23, 10, 3, 8, 2, -4, -12, -12, 8, 15, 16, 20, 9, 3, -1, 9, -1, 4, 0, 6, 14, 4, 13, -1, -5, -15, -2, 5, 0, 5, -1, -5, -3, 4, -8, -5, -14, 7, 3, -2, 10, -1, -10, -3, 8, 4, 0, 8, 17, 18, 10, 14, 10, 5, 2, 10, 11, 2, -1, 8, 2, 5, -2, -13, 3, 7, 6, 1, -3, 1, 5, -8, -7, -4, 1, -4, -4, -1, -7, 1, 2, -2, -10]
2044a0lOJ3nPMKmj1QmkJ2Njj8J1j0jJ2Pk4PlJ2nkMj2Jj1J3Rj4J1lmjJQKj1M%n
2089eMpJ8j1jJ1PqK1k2Pkj8ORj1%ROjj5Pj0pJ2J%qNjmPjNk0K3KJKKq%k2NJ0%R
2136Gj2K0Nj1mOrpNOQrnJ0pMj0jpJ9%oJj3JnpORnJJ0onJjLNOQojJljMj3J3mRO
2187A6rNrLLlqJ4j0J1qj3NlOj1J6j6J3oNj3K1ppJKJ8pj0LllPl%mJ1oJ3jj1jMj
2232DjnOplj%OkpmQKJ1oj1NpjOP%Ko%qLMJ4olKlJ4j2lj3J7MKJ2j1rKRmj4jNnp
2283a5O%kJ2o%nOqJ0LOj6J5j5KOlJRjljjqKQj3J9JLj2J0pLj3J8j3J1rlRn%qlO
2330d%oRkLj8J8n%KjJJ0kLKk2J4k%Pmjj1J5pnJ1JJ2roQnqkQj1mpJ2MklJ0pJj1
2378a4PMQlpjRJ0j4lQLRlpKj3J7j5PNj4PMmonJ0mORMj4l%jlJ4ooKmRjj6PqJJ1
$$ y = [-10, -13, -7, 6, 1, 8, 12, 14, 10, -1, 7, 3, 1, 13, 18, 17, -1, 10, 0, -1, 11, 18, -6, 1, -2, 10, 5, 3, 7, -5, -4, -15, -2, 7, -7, 4, 1, -3, -4, -3, 5, 7, -4, 0, 0, -5, -1, -8, 10, -1, -2, 9, 16, 8, 29, 7, 14, 12, -6, 0, 9, -2, -2, 7, 13, 12, -3, 4, -6, -13, -1, 0, 0, -8, -3, -4, -8, -1, -2, 3, -17, 6, 8, 9, 11, 13, 5, 5, -17, -12, -2, -2, 7, -5, 15, 20, 9, 5, 11, 2, -5, 0, 6, 14, 5, 0, 10, 3, 7, -3, -4, -11, 8, 8, 2, 3, -10, -9, -14, -21, -15, -6, -11, -10, 0, -6, -11, -10, -11, -8, -3, 3, 11, 5, 4, 5, 2, 1, 5, -8, 5, 1, 10, 16, 7, 12, 3, 6, 9, 6, -2, 12, 2, 13, 5, -8, -3, -6, 0, -11, 5, -11, 2, -4, 1, -12, 9, 2, -5, -4, -2, 16, 9, -1, 2, -1, -4, 3, 0, 0, -4, 7, 1, 14, 13, 2, 1, 5, 4, 3, -2, 4, -3, -6, -7, -7, -1, -3, -10, -14, -6, -4, 7, 1, -10, -5, -12, -13, -7, 0, 0, 2, -4, -4, -12, -9, -5, 9, 3, 0, 2, -1, 13, 1, -2, -15, 2, 6, 8, 20, 9, 0, 2, 11, 7, -7, -8, -3, -8, -15, -9, -9, -11, 1, -5, -5, -10, -4, -12, -2, 1, 7, -9, 6, -9, -7, -1, -4, -3, 6, 5, 2, 1, 0, -8, -6, 2, -11, 8, 9, 12, 0, 10, 3, 6, -7, 11, -2, 9, 0, -3, 6, 1, 1, -7, -10, -4, -4, -10, -1, -3, 0, -18, 0, -5, -5, -3, -4, -3, 7, 5, 8, 10, -12, 2, 0, 0, 7, 3, 2, -9, 6, -1, -6, 5, 6, 18, 9, 3, 11, 6, -2, -4, 4, -7, -11, -18, -6, -2, -4, -7, 3, -4, -3, -14, -7, -3, 5, 2, -5, -6, 3, 13, -1, -4, 4, 7, 16, 13, 6, 8, -5, 12, -3, 4, 9, -5, 2, 6, 2, -4, -9, 1, -3, 3, 12, 16, 2, -1, -1, -2, -5, 9, 3, -3, -1, -5, 4, 3, -13, -6, -14, -13, -2]
2427b%oJ1jjpJ1kqkK2lLj5KRqKrOjMlJ0j2pjlPKJ0nlnMj7K0pqJ8lQOj4lJ2j9Q
2475@KLmRMj2%LJjNq%Nj3POKn%kj0rJ6Nj4NrJ0JJjOnmNp%QMPj9LJ6omOpMjNql
2528cNPqNKj7K6k0J2j4K0j2jj2J0oOJpoJ3qkoQRKlNmn%QJlNj1J5j6J1lJ%Jj1p
2574a2K0pj2K1roKOj4NkPjoRrn%J0pj4J6J4j4J4j1QpRkKNn%rJ0jj1J0J3lj7J7
2617A4j2mqJOQ%jKj5J1lj3J1lQoJ0pNPj3mJ0kn%KNOj0%J0kJOOr%nkJ1qnlKjpM
2666b%Oj5J0pJ6j4MkOjKrKPMkl%rO%nRlQj1NkJJ0j3mPlNkKkrLMkKoOj%pK1kk5
2718a5lRLkRLmJnNNOj7KPoJ0kj0PorJ9mOJqlnNjJ0mpPljj2LPjo%mkJ2lNjj0J0
2769bmR%%MpLj0%OkJPnnJ3j6OLkMjrLrPJJmNJkJ4j3qlJ3kpJ3j0QKj0OqRkPjmK
$$ y = [-2, -2, -8, 3, 2, 1, -6, 5, 3, -5, -7, 15, 12, 15, 0, 2, 11, 3, 5, -4, 2, 1, 5, 2, 12, 0, -7, -8, -11, -4, -2, 8, 3, 0, -5, -1, -18, 2, -5, -13, 5, 2, 10, 16, 2, -1, 11, -8, 0, 2, 5, 1, 10, 14, 2, 2, 5, 6, 5, 10, 2, 2, 7, -6, 1, 7, 9, 4, 4, 2, -8, -17, -1, 4, -10, -5, -14, -4, -3, -2, -3, 3, -2, -6, -1, -8, -8, 0, 4, 11, -8, -5, 11, 5, 1, 7, 0, 4, 3, 8, 0, -3, 2, 9, 1, 6, 8, -9, 17, -3, 9, -5, 15, 3, 2, -10, 0, -6, 0, 1, -6, -12, 1, -7, -9, -15, -7, 2, 4, 1, 6, 2, -3, -3, 5, 6, 3, 8, -3, 12, -4, 7, 4, 5, 5, 6, -5, -12, 8, 1, -11, 10, 1, -5, -3, 3, -11, -6, -8, -1, -2, -8, 1, -8, -13, -13, -3, -10, -24, -8, 6, -8, 6, -5, 3, -4, 5, 3, 5, 10, 5, 5, -4, 6, 5, -6, 4, 17, 14, -3, 14, 2, -2, -10, -9, -3, 5, 5, 4, 6, -9, 2, -1, -14, -3, -6, 2, -4, 6, -1, 4, 11, -2, -6, 4, 2, -3, -3, -1, 4, 10, 0, 0, 10, 8, 9, 15, 21, 12, 12, 7, 5, 16, 8, 3, 0, 2, 1, -6, -2, -2, 4, -11, -1, -8, 8, -6, -2, -4, 2, 1, 3, -6, -4, 3, 7, 5, 2, 2, -7, -1, -1, -6, 3, 0, 8, -3, 2, 0, 1, 11, -2, -6, 1, -2, 3, 1, 3, 1, -8, -5, -1, -3, -1, -7, -1, -2, -2, -9, 12, 10, -15, -18, -9, -6, -8, 1, 4, 0, 1, -4, 1, 6, 12, -5, -3, 4, -2, 8, 6, -4, 3, -3, -12, 7, 3, 9, 10, 2, -1, -6, -1, -2, 8, 4, -3, 4, 1, 0, -12, -9, -2, -3, -9, -9, -13, -15, -3, -6, -1, -2, -12, -2, -6, 3, 3, 3, 7, 0, 3, -7, -7, -1, -3, -2, 5, 0, -5, 8, -8, -2, 1, -1, 3, 2, -7, -4, -13, -6, -5, -4, -8, -3, -2, -4, 10, -3, -11, -14, -1, -3, -10, 3, -7, 1, 3, -7, -1, -9, 0, -2, 5, 4, 0, 2]
2821BJ1Mlj2Rn%onLRj0j%J8k6LNomJ3nJOj4LQqMKKLknMkMNmLN%moJ3j8J7Lj1J0
2871A3lrLRkj3nJ9j0j5J2qMj%k%nNpMJ0mnKRkPpJ4r%%poK4k0J0J5j4Oj8KpQJ3
2917A0k2LJ5rlKlMqJ1j2JoOMj6J5KopJ2nJ6j2OPnQj0PmJ1k0J6j6J8Rk3nRoOlK
2961ajJRj2Mj5J3okOnrRNqpLPJoPMqJ2j6L1j2%jLj8J2lJ6j0pOmmPj2QlQj4Njj1
3009a9J5MJ1k0NPjKnoQQj7J5j5%jPlMj3J1Qj2J5Jj0MPljjoNRj3LnJ0j3J1qOj6
3053a2JnJ2lRk4J6lpJ1OLnoJ4lolj0J7oJ2j4PrNmK0krKj7J9llJ2j2j0J2j1RRj8
3096iJ%qJ7omKLnJ3kk0J3mQMKpNmqJ5oMJ2j1%kJj3LJ0Nj2OOj3KKLKOj3%Nj4JP
3144clqNj%J1j5NOOlQpJ5j6MlQj1OkJ3k0NoLOkjrJ0Lj4kLjPJjoLJ4ppNj3J4%P
$$ y = [2, 13, 17, 14, 2, 11, 6, 6, 0, -5, -2, 7, -3, -4, -4, 14, -12, -9, -4, -10, -14, -1, -6, -5, 1, -13, -10, -2, -10, -6, -4, -2, 1, -1, -6, -2, -4, 0, 5, 1, 4, 9, 9, 5, -1, 12, -6, 11, 14, 3, 13, 10, 1, 4, 13, 11, -2, -7, 12, 2, -13, -1, -9, -5, -6, -6, -8, -8, -13, -8, -15, -11, -1, -5, -10, -8, 1, -1, 6, -1, 13, 4, 4, 4, -3, -9, 15, -5, 5, 20, 6, 12, -6, -4, -11, -3, 10, -12, -9, 6, -3, -6, -4, -7, -3, -11, 0, -12, -11, -17, -11, -7, -23, -8, -6, -12, -19, -7, -12, 4, -8, -2, 5, 0, 8, -2, 5, 1, 12, -8, 8, -8, 10, 19, -4, -9, 0, -6, 0, -3, -1, -2, -1, 8, -4, 0, -15, -2, -8, -10, -4, -9, -18, -9, -4, -12, -19, -16, -9, -8, -14, -7, -3, -11, 1, -15, 16, 4, 4, 3, 6, -12, 0, -3, 13, 3, -4, 2, -2, -6, 1, -11, -3, -6, 2, -12, -7, -8, -19, -4, 0, 11, -9, -4, 3, 2, 4, -1, -7, 1, 9, -8, 7, -8, -8, -9, -2, -5, -1, -14, -3, 5, -7, 8, 9, -1, 3, 10, 7, 6, 5, -1, 4, 13, 0, 3, -2, 8, -5, 6, -2, 4, -12, -11, -16, -4, -7, 2, -22, -6, -9, -16, -5, 1, 4, -1, -7, 7, 4, -2, -5, -15, 2, -4, 8, -6, 1, -8, -3, -7, 13, 11, 2, 4, -13, 6, 3, 0, 12, 0, -10, 2, -9, 0, 9, -9, -8, -8, -16, 1, -5, -9, -7, -4, -9, 4, 2, -18, -5, -9, -1, 3, 5, -2, 3, -1, -9, 6, 0, 4, 16, 5, 5, 3, 4, -9, -6, 4, 9, -3, 3, 9, -4, -2, 0, 3, 5, 11, -2, -2, 3, -11, -10, -3, -6, -14, -9, -10, -10, 1, -14, -9, -3, 3, 0, 8, 1, 16, 0, 4, 1, 9, -2, 4, 2, 15, -5, 0, -6, -3, 3, 1, 0, -9, 1, 4, -10, -12, -9, -10, -3, -2, -3, -9, -6, 8, 1, -6, -1, -14, 0, 0, 7]
3193Gj2Qj0jJ2j2J0J2j2JmJ4j0kOJjk%nJ0ljj3J3j3QQqj2J1qNjjj3J9%Qnj7J1
3235bnJ0nJ0moKLJ1j8OmqJ5Pj6QMqLoQqJ7k5lJ4kkpJ0rJj7K1oQj1J3oPpJ6j3J1
3280GjOqPj2JmmJ2pJLNLpNLj3QJ%j1NlMNpKMj0nQo%j6K5oJ1j5LNqJ7Jj4kJ2Lj
3329Gj4RljPKnL%pKmJP%koJMj3PlJ0pNJj0J1plNomqJ8KnMlKRj0RpnK1rqJ2JlK
3381Ipj5J5Mj5OJ7j3%rNMqKLKj4J6j3pJ7j5J2PmmJ4j4PlkNkjPNjlj%j3K7j7No
3426BkkJ2%qj%mNnLmJ0j2LPj0j3J6j3NPjMOj0kNjoj0J3J1nLlNKj1J0mkPLjpj1
3473iJ2mMj2Q%qJ1j0JJJj0OmJ7nnJ4j1kMMm%kMMKmk0J4JqJ5JlRj4J3j8PkOloJ
3520dPKjJk0J0J2j5j5J8j0J1LokOnMK%%kKlRj3J5nQj2Pj0KJ5%j2j0J4rQrpJK1
$$ y = [7, -5, 3, -7, -8, 4, -8, 2, 14, 2, 3, -1, 13, 3, 1, 7, 8, 7, 5, 5, 0, 10, 7, 6, -7, 6, -7, 1, 9, 1, -11, 0, -8, -3, -4, -5, -18, 1, 1, 9, 4, -13, -2, -7, 3, -2, 8, 4, -2, 0, 3, 14, -4, 2, -2, -10, 5, 12, -4, 4, 8, 0, 3, -3, 5, -3, 14, -11, -14, 0, -2, -4, -11, -1, -10, -9, -26, -5, -11, -3, -14, -1, -7, 0, -7, 9, -4, 7, 6, 12, 4, 11, -1, 0, -4, -8, 4, -3, -2, 1, 6, 9, 2, 7, 10, -3, 5, 6, 6, -5, 0, -3, 1, 6, -1, 1, 5, -5, -10, -2, -8, -8, -24, 1, -5, 6, -9, -6, -1, -9, 8, 9, -5, -7, 5, 8, 7, -7, 2, -1, -2, 5, 7, 2, 5, 5, -2, 0, -4, -3, 4, 4, 2, -4, -3, 1, -12, -5, -8, 2, -5, 0, 1, -9, 2, -5, -8, -3, -9, -13, -21, -3, -1, -6, -2, -5, -3, 6, -4, 5, -2, -7, 14, 5, -3, 9, 10, 7, 9, 2, -13, 2, 6, -9, -3, 14, 1, 1, -8, -3, 1, -7, -5, -2, 0, -14, 2, -11, -18, -1, -16, -4, 3, -1, -5, 9, -5, 2, -1, -3, 2, 0, -1, 6, 11, 10, 7, 6, 6, -7, 20, 3, 8, 2, 0, -2, 10, 10, 2, 1, 1, -3, 2, -3, 0, -4, 6, -6, -3, 4, -6, -19, -3, -16, -11, -4, -5, -1, 5, -5, -7, -2, -3, -9, -19, -6, 5, 0, 3, 0, 5, 7, -4, 6, 2, 0, 7, 10, 9, 2, -9, 3, -1, 3, -9, -1, -1, -9, 2, -8, -7, -6, -5, -15, -9, -13, 4, -1, -6, 8, -3, -5, -1, 3, -1, -1, -3, 1, 5, 7, 3, -17, -3, -2, -10, 5, 6, 3, 12, -2, 11, -7, 0, -2, 4, 1, -5, -4, 3, 5, 4, 5, -15, -5, 7, -8, -23, -5, -15, -4, -1, -7, -9, -3, -8, -4, -2, -2, -2, -4, -2, -5, 4, -9, 6, 1, 9, -3, 4, -6, -4, 11, 11, -1, -11, 3, -6, 2, -7, -14, -13, 8]
3564Hj5JQj5J1j1MJ3pNj5KPmNj3J6Mj3KJ0qJ5k9K5%oPLj4J0rOQj4NrK%mkMoQm
3609iOoNPj4MrJ8j2KJ0oLqRjM%ojOKkpNJj%KJ2j0J3j4kKjJ2k1mJJ2%j0NlJ3j2
3656eLmkOnpJ0JlNQkrNJJj0kJ0NpLolJ1Kj2mOQJrKKJrjJONj6MRrlKRmjQKkjlM
3711BKMj1J0qqL0pnj0MkrJ2qJJJMj2LMqNj3J7j1OLkJPj2O%%KjJQpj0QJ0loOj2
3759gJ8j5MjOj%nQkqMj1Q%klrK0j9mK2pnJlOJ0j0J1k0OLKKQj4K%J7oqJPpNJ1j9
3807dJMJMJj3QnqPL%JmoKpQpO%J2Oj2MKj4J7j2K1qolkJ1KlLj2lJ7j2J2j1J2rn
3854aNJq%J2rKpNj3J5qkrJ6Pk0KQOPrlOmqJ4NpJ4%rPoklLj3NJJ0lqKJmjNNkqN
3906Bj6J1QLljnkmJ3j3K1k6J7MpNj2J6k1J5rKQkmMJ2kj5QjpPj1KJJ%Rj8J3rOm
$$ y = [8, -7, -6, 2, -13, -2, -13, -9, 4, -3, 2, -13, -11, -4, -8, -3, -16, 0, 4, -9, -7, 3, -5, 10, -19, 6, 6, 0, 7, 10, -4, 6, -3, 3, 11, -3, 2, -7, -5, -5, -9, -11, -7, -13, -5, -9, -3, -9, -4, 3, -11, -7, -16, 2, -10, -8, 2, -4, -1, -9, 0, -1, 3, 3, -3, -4, 2, 4, 2, -5, 0, 1, 0, 0, 2, 14, 4, 17, 3, 1, 3, 2, 14, -7, -11, -10, 2, 2, -8, -3, -6, 7, -5, -2, -6, -8, -2, -7, -14, -4, -3, -6, -1, 7, 5, -4, 1, 2, 3, -7, -9, 1, 6, -1, 2, -4, -7, 4, 6, -6, -10, -4, 4, 5, -4, -2, 0, 1, -8, -9, -8, -2, 3, -13, -9, 0, -9, -12, -10, -1, -5, -6, 2, 4, 2, 1, -2, 2, 4, 8, -3, 7, -1, -9, 21, 14, 9, -1, 3, 1, -8, 4, -4, -3, -2, -1, 3, -9, -6, -2, -10, -5, -18, -1, -12, -6, -3, -5, -4, 3, -9, -3, -3, -3, -1, -2, -1, 7, 0, -10, -2, 8, 5, -1, 5, -7, 11, -4, 0, -1, 5, 4, 4, -1, 7, 5, -3, 1, -10, -2, -2, -4, -7, -16, 4, -15, -19, 3, -4, -9, -8, -11, -5, 5, -5, 6, -14, -8, -5, -3, -1, 7, -7, -5, -5, 12, 6, -2, -1, 6, -1, 4, 15, -4, -3, 1, 2, 6, 7, -6, 2, -3, -11, -4, -1, -1, 0, -4, -10, -8, -15, -7, -14, -8, -8, 4, 10, -2, 2, 4, -10, 7, -5, 16, 8, 2, -1, -3, 8, 10, 7, 10, -2, -5, 12, 0, 12, 1, 13, 4, -1, 4, 5, -3, -3, 9, 0, 2, -5, 0, -13, 2, -6, -8, -17, -1, 6, -14, -12, -4, 2, 9, 0, -3, 3, -1, -9, 5, 10, 3, 17, 17, 8, 15, 9, 7, 4, 7, -6, -1, 0, 10, 7, -1, 1, 2, -2, -3, 2, 7, 5, -3, 2, -14, -3, 5, 8, 5, 4, -1, -3, -7, 6, -7, 14, -12, 5, 9, 2, 7, -5, 11, -10, 5, -4, -2, 6, 4, 0, 4, 16, 14, -1, 7, 6, -1, 6, -5, -3, -2, -1, -1, 8, -10, 3, -6, 0, -4]
3951dkJ1oRqJn%J4pj2J3rlKJ6j0j1R%J1jlOjlpJ4kj1llJ4nj0J6j3%Omk4RJ0j1
3995a7J6nkNJj%%JkRoKOj6J5K%j3RJ0j6OkknMJKjoJ0pRJ0j8rJ3j1mJJ4oj4J6m
4041eLJ1pmNkQj3LJ5jj0mMlLrLmJ0LKj0JOj0Pj0PLKrRj6RmjjjlQlJJ0qMMRj7%
4091eLjQnl%KJ5k1K0j0kQk%Mj6KjOKoJ4k1J0J5j5RkLj3Mj2K0mrlPnj7J4JNLKq
4137dNJMqQlKlJ0jjpJk%MmpPj3J7j5OlJ3j5mQKLoLj1NMOlJkJJM%NnKlrJ6j5KK0
4189A7j6qOQknjJ3j5Mj1Q%rQQlLrJl%J0pKmQj7J7nJ1p%k0J2J1qNrK2j2jMj1J5
4234A0j7RjkOLpnJ0p%Rn%rR%Nj4lJ2k5J5RjmM%j0J4Lq%KlQj4J2pJ5opPj5kKLO
4282AnNLLJroNMpkmLJ0kKj8KJ1lQqLNrJ6j1QloKJ0Mj0lNmOj5J1j6J1Rj2J2jNj5
$$ y = [-4, -6, 5, -1, 8, 0, 1, -4, -4, 10, 3, -9, 4, -5, -8, -6, 10, 0, -11, -2, -2, 9, 8, 5, 11, 10, 7, 0, 14, 12, 1, -2, -5, 9, 4, -6, 10, -3, -3, 3, -1, -25, -16, -6, -17, -1, -6, -8, -3, -2, -3, -3, -3, -2, -4, 5, -1, 1, 7, -9, 6, 8, 8, -5, 4, 14, -2, 4, 2, 0, -5, -1, 0, 2, 1, -5, 5, -2, 7, 17, -1, -10, 3, -8, -12, -11, 3, -3, -17, -1, -5, -2, 9, 2, -2, 3, 1, 9, -4, -1, 14, 13, 3, -1, 3, 0, 3, -6, -3, -7, 3, 6, 8, -2, -1, 5, -5, 2, -8, -1, 2, 4, -5, 4, -12, -3, -7, -8, -9, -10, -13, -5, -8, -7, 3, -5, -1, 3, 12, -5, -5, -2, -3, 5, 0, -3, -3, -1, 14, -7, 13, 3, 1, 9, 7, 7, 11, -5, -3, -4, 2, 4, -2, 12, -9, 1, 16, 1, 10, 8, 11, -2, 2, -10, 10, 6, -3, -6, 1, -4, -21, -7, -6, -1, 2, 4, -4, 1, 2, 6, -2, 6, 3, 5, 2, 12, 11, 10, 3, 4, 2, 2, 6, 2, -5, 2, -11, 6, -9, -3, -6, 7, -8, -12, -4, -2, 1, -5, -2, -13, -8, -4, 2, -1, 0, -2, -1, 0, 4, 4, 9, 4, 6, 3, -6, 10, -5, -3, 17, 1, -7, -1, 7, 5, 0, -1, 12, -3, 1, -10, -2, -2, -11, -3, 5, 2, 5, -4, -3, -6, -6, 4, -3, -1, -5, 3, -14, 3, -2, 9, 2, 2, -18, -6, 5, -3, 2, -7, 15, 3, 2, 6, -5, 10, -7, 2, 1, -1, 5, 8, 1, -4, 6, -1, -1, 8, 3, 3, -6, 3, 3, 8, -6, -9, 3, -22, -7, 2, 1, -3, 1, 1, -9, 5, 8, 0, 0, 2, -1, 7, -7, 5, -2, 13, 7, 0, 7, -8, -10, -8, -5, 1, -4, 1, 4, 7, 8, -1, -7, -2, 2, -5, -7, -11, -8, 2, 0, 2, -16, -14, -3, -6, 2, -6, -3, 2, -7, 9, -2, 6, 3, -3, -1, 9, 13, 3, 0, 5, 1, 7, -8, 3, -13, -2, 7, -5, 7, 6, 11, -4]
4330dOqOmkRrJ6ooJ0j2JnNmJ9Kj7NMj3kJ9j3J2%pkqK1k3RLkjKQoMpMj4NMpMko
4379a2QMl%rQrJ3pRlKOMk0RM%pJ0kkQpnoJ4KrOj0J5j1Rj5KJ1j2nL%QpoqLRlJ1
4428@rKMnMLJ5onpJ4nloJ7q%mQj0Qj8J2kqJ1pKqJ1NpLJ6k1Lj5MOkQ%j3RmKJOM
4477EJLn%Rj2j0J0J1pm%%%mLJ0j6Qmj2J5J0j3j3J0%J1nj0nJ2J2j1LNk0J3oRj0
4518gQonJ9j2mRjjRJ5k8J0mQ%j0JoJ3KNj8pJ4rNPkqmmKJ0jNlmkJ5j6J1j%qLKj
4566AkJKMnjjJ9o%j4J3jj1MKjMj6KKJ6j0KppqJ5j4J4JmmJ2mRrJ0Jj1NqJ0lk%N
4613EkoRRlrOqj2R%NPj1lkPkj4NQnRj2jJ3k1J4qQm%QQj5J2nPJ5j5nJLPj0LplM
4662ajJ0p%m%OMJrmPoOmMM%j1PJjj6J2JoRNlqJ1j0J0j0RMj4LJJJ4mj8kK5jj2Q
$$ y = [-4, 2, -6, 0, -4, -6, 3, -6, 10, 4, -2, 8, -4, -3, -8, -3, -7, 12, 14, -3, 2, 6, -7, -9, 10, -3, 9, 9, 2, 0, -8, 13, -10, -1, 2, 0, -1, 1, 9, 3, 7, 0, 4, -10, -5, -1, -8, -4, -6, -12, -4, 0, -3, -3, -12, -4, -13, 0, -7, 2, -1, 1, 7, 11, -9, 0, 4, 4, -3, 7, 5, 3, 11, 4, -1, -7, 7, 9, 0, 6, -4, 11, 0, 9, -6, -4, 7, -5, -10, -7, -7, 1, -6, -12, -20, -17, -8, -11, 0, -9, -7, -3, -8, -4, -1, 14, 8, 3, -4, 10, 5, 2, -4, 13, 5, 5, 1, 9, -1, 7, -11, 1, -1, -9, 2, -5, -3, -11, 0, 5, -2, 1, 17, -4, -1, -16, -12, -6, -8, 0, 0, -13, -4, -8, -6, -5, 1, 5, 6, 9, 4, 4, 13, 1, -9, 1, 12, 5, 1, 1, 1, 1, -3, 0, 10, -6, 2, -2, -14, 1, 11, -2, -15, -5, -5, 6, 1, -9, -14, -2, 10, -1, 2, 7, -13, 0, -6, 3, -7, 1, -5, -10, 9, -3, -7, 2, 1, 0, 9, 24, -4, 6, 2, 10, 10, 0, 1, -5, 8, 10, 15, -3, -10, 4, -5, 0, 7, 5, -3, -7, -11, -9, 1, 0, 5, 2, -2, -4, 11, -5, 6, 5, 5, -3, 0, 2, 1, -1, 0, 2, 6, 1, 0, -1, 18, 12, 12, -2, 11, 10, -1, 3, 5, 4, 8, -8, -6, -4, 12, 2, 4, -3, -10, -18, -3, -17, -3, -2, -6, -10, 2, -2, 7, -2, 8, 9, -2, 3, -5, 5, 2, 0, 0, 5, 3, -3, 6, 15, 12, 3, 9, 1, -11, -2, -2, 3, 10, -1, -4, -6, 1, -1, -15, -10, -2, -7, 2, -10, -11, 2, -19, -5, -13, -5, -9, -9, -1, 7, -8, 4, -1, 6, 21, 6, 1, 2, 5, 12, 2, 5, -2, -5, -1, -2, 8, 1, 1, -3, -3, 3, 7, 8, -1, -5, 2, -4, 2, -2, 2, 6, 6, -5, 2, 3, 2, -14, -2, -1, -7, 2, 7, 4, -4, 7, -3, 7, -3, 6, 10, -4, -1, 0, 1, 15, 11, -7, -9, 16, 15, 3, 11]
4710A1j8K5k0LlmONoKLjPqj1J0kKJ1j2jj3K3j2P%j1J5mMmqJ4plKMlKNj1OoOmL
4756DmOj2Rj1J2%kM%lKloJ7j6MojLNQrJlKjNmlkJJ9j3Oj1LnJ4rNpMkRKk8J7m%
4806clNmmNmOkJPljJ4j6%%%NlJ1oNJpKmjKqJ0j5NlOjlNpj0K8rkqlPNkmmMRjoK
4860bNl%pmL0j8Qol%kK6k2nlPJj2OMLkKrQjMk3J5pRn%QKj2%J2ko%Pj1LPqJ5o%
4910CL%%LljJL%j3OMqJ3pKkk0JKNP%%JJmJ2rj4J5kMoQJNj4%MOpJOMqpQkJ2j5M
4962CJJqKmMJj%kJJj2nJ4qPj0lJ5KkKJj4K4j0nOj1K1Jkqj%ljNKKPk7PNl%J2oq
5012gRoMnJoJ8nnrLnJ9j4J1jQj9J0j3J5LLj3R%MpNjj2J9rjj3MJ2o%rJPj2QlJ0
5058Bj0LKrRrJ4j0rJ8mJ6j1jKqPj0KRkL%KlnJ5mNk1J2RmJ0k4QmMpJ0j5jJLJ5j2
$$ y = [11, -7, 18, -2, 1, -2, -6, 0, 5, -1, 1, 4, 3, 10, 2, -9, 1, -1, 1, 12, 0, -1, -14, 9, -3, 4, 4, -7, 8, 4, 8, 4, -4, 10, 3, 0, 2, 6, 3, 5, 10, -1, 5, -1, 5, 1, 4, 0, 6, -6, 3, -8, 4, 4, 2, 6, 6, 3, 5, 2, -4, 13, -3, 1, -5, -6, -3, 2, 10, 1, 2, -1, 1, 0, 5, 1, -2, -4, -3, 16, 3, 9, -2, 1, -4, 10, 1, 6, -1, 3, 1, 10, 12, -16, 1, -3, -3, -6, -1, -5, -9, -4, -8, -2, -4, -3, 4, 1, 0, 14, -2, -2, -2, -2, 3, 0, 11, 5, 10, 11, 4, 6, 2, 1, 3, -5, 5, -10, -5, -8, -2, -3, -6, -1, -8, -18, 10, 1, -1, -9, -12, -5, 0, -2, -6, -10, -6, 3, 2, -4, -2, 3, 0, 0, -7, -11, 19, 1, 9, 3, 0, 0, -2, 24, 2, -3, -6, 1, 2, -10, -4, 0, 3, 1, 3, -6, 2, 1, 5, -18, -3, -10, -1, -6, -6, 2, 4, -8, -8, 4, 2, -4, -4, 3, -8, -5, 2, -6, 9, 3, 3, 6, 6, 6, 9, 6, 5, 6, 9, 9, -4, 2, 6, -2, 11, 4, 6, 4, -16, -15, -13, -8, -1, -1, -1, 0, 1, -3, 9, 0, -14, 1, -1, 3, -3, 5, 6, 11, -3, -3, 1, 7, 0, 1, 7, 11, 3, -4, 4, 2, 14, -1, 3, 4, 5, -3, -1, -5, -1, 0, -1, -1, -3, -2, -1, -13, -18, -4, -12, -5, -15, -18, -3, -1, -3, -1, 0, -14, 10, 0, -5, 1, -10, 11, 12, 10, 2, 1, 1, -2, -3, 2, 4, 6, 13, -14, -7, -2, -5, -5, 7, 1, -7, 2, -4, 0, -5, -4, -10, 8, 3, -2, -11, -8, -13, 6, -8, 3, 2, 10, -9, 1, -12, 3, 6, 9, -4, 5, 5, 9, 2, 7, 6, -6, 13, 4, 3, -10, -6, 6, 0, 0, -9, -8, -1, -13, -5, -8, 2, -8, -5, -3, -12, -3, -12, 2, -8, -17, 1, -3, 13, 2, 1, 3, -5, 2, -8, -6, 3, 1, 4, 4, 6, 3, -2, 13, 9, 14, -7, 5, 14, 10, 20, -4, 4, 0, 4, -3, 7, -8, -9, -8, -5, 10, -2]
5104boJ5KjmJpJ4j3KjnKQj1J3ljOj4MlPmRj2JLoJ2mjMq%LQmmpmQkLJkJ0j0lPj
5155@J5pkJjKmOr%MrJJ4j1OqJ4j6KPJkmJ0k1J6oJ2pj8J3lPpLrKJ0mKjRNk9J6P
5202GknJ3j8PqJ3j0NmQj0NjRplJNj2R%j1NLJ4j2rJjK0j1kMj2J4JljpQ%qNKklN
5250BJjnNJ2k2J1J0loRoJKl%jroNoK0j6PmLOj0Pj5QpL%LoJ5LqNj0J4jJ1qrRj4
5298dJ4KnqKj6K3j0J1k%j2jlPpoJ9mJ0j3LKj2Ojj1J3nPKnOjJj%N%lkLLqOKpjn
5347fJ3j2MRj0N%rJnMQk3J8j5J2k%Pj3J3MrJ0mKmJ3qMJJLprmJ0OPj0pMJPjprK
5395ePOj6Rlj2K3j2%mLoJ3kj%oKOjPmpm%J2NqoJRRj1j2K4jnmmj1%J1npJ4PqLM
5444A0rrLNlLooJ6oMNqPJ0qRk1jJ3%Nj0Rj7RJ3jj2KPj4J2j1nlQJ1prRkkj2J2M
$$ y = [-2, -8, 7, 9, 8, 4, 5, -2, 12, -1, 1, 0, -5, -3, 5, -6, 7, 4, 3, 9, -5, -1, -4, 3, -1, 8, -4, -3, 0, -6, 6, 2, 1, 5, -3, -3, 0, 8, 4, 0, -7, -11, -3, -5, -2, -1, -3, 7, -3, -6, 1, 0, 15, 8, 6, 7, 6, 8, 4, 10, 1, 1, 5, -4, -3, 11, 0, 6, -2, 12, -4, -2, 5, 6, 4, 0, 10, -11, 5, -1, 11, 4, -14, -1, -4, 3, -4, -1, -10, -8, 2, -2, 0, -1, 8, 13, -16, 0, 7, 5, 0, 13, -5, 2, -6, 7, -3, 2, -2, 6, -4, 1, 0, 9, 2, -1, 0, 5, -7, 2, 2, -9, -4, -1, 13, 1, -8, -7, -8, 12, 1, -1, 3, -9, 5, 6, 3, 2, -5, 3, 3, -5, 0, 2, 0, -3, 2, 3, 2, -3, 2, 14, -8, 3, 13, 10, 4, 13, 7, 8, 10, 7, 7, 6, -3, -9, -4, -10, 10, -6, 1, -3, 0, 6, -4, 3, -12, -4, -11, -8, -8, -5, -11, 4, 7, -1, 4, -6, 8, 7, 18, 10, 1, 10, -4, 10, 12, 7, -1, 1, -15, 8, -2, 9, 7, 7, -5, -6, -9, -2, -9, -15, 4, 0, 10, -3, 0, 2, -10, -4, -5, -16, -3, -8, -1, 1, -4, 2, 1, 2, 1, 1, 6, 6, 3, 1, 4, 7, -1, 5, 7, 0, -1, -6, 7, -5, -1, 8, -2, 3, 3, -6, -5, -10, -6, 2, -21, -3, -18, -6, -8, -8, -1, -14, -1, 3, -6, 4, 0, 2, -2, 11, 3, 7, 8, 9, 12, 5, -4, -8, 2, 8, 15, 5, -2, 2, 3, 10, 9, 2, -7, -5, 2, 8, -8, 1, -2, -14, 9, -3, -3, -7, -4, -10, 3, 1, 0, 0, -6, -4, 2, 1, 8, 4, -3, -7, -7, 5, 10, 2, -4, -3, 6, 15, 4, -8, 16, 15, 10, 6, 2, -9, -9, 2, -3, -10, 4, 11, 3, 6, 10, 1, -8, -5, 0, -3, 0, -6, -12, 4, -2, 2, 7, -1, 6, 16, 8, 17, -4, -5, 8, 8, 13, 3, 12, -5, 4, 17, 16, 4, 6, 13, -1, 11, 0, -5, -8, 0, 11, 4, -5, 4, 2, 0, -12, 0, 4]
5490DJknN%nQqQJj7K5j4mjQpMnkJKMJ4pj2J9j6KJ2lJj8J3j2K4k3mqPPNpJ4j5P
5536AlkNLjLoOkoJpQrJK0j2lLNQj9J3JNmlrJ4mj0J5j0jnQjMj0J0pNnJ2k2RnkJ9
5585A1nj2J1MOj1PLlj1Rj4J8j9PmnLrK3rOkkoqJ2J1j1J5j9J3j1LrJ8j5MMj3Qj1
5627a3J8Qj1qJ0j4J6qMnJ3nJjj1QJ5j0qOjLpjJ2j6Po%KPqkPLnJ0okJ0j7KkNlm
5673gJOJ%KkM%J1j0qJ0rJ6nMj6rJ5OpJ1lj4J4Kj9JJ5rmLKNlopNOoJ2rPnJO%Kk
5722Hj1lNQkrK1j6KP%lPoomJ3j0lnOpJ1j1NKj2J5j7RJ3k4J6JNj0RRj2Rj3J0Mk0
5766iJ8rPplJLJkk%J2Ol%j9J4kpMJ2j6kmJ4oRqj3OmJ9qJ2k4NLK0j9LLj4J9Ok2
5811fRnlMMlk0K3Nqmj0J2JLLmojOoLJljjQqRnkJ4KmkmjKlLJ3j7KkJj%k%MmMQn
$$ y = [4, 5, 3, -2, 3, 3, -2, 6, -2, 6, 7, -10, 15, 1, -3, -4, 4, -3, 1, -4, -6, -5, -3, 1, 15, 8, -4, 15, -1, 1, 13, 10, 11, -7, 6, -6, 18, -5, -9, -17, -10, -3, 2, -5, 9, -6, 1, -2, -4, 1, 4, 3, 6, 0, 6, 4, -2, -1, -8, 0, -9, -8, 12, 0, -3, 0, 5, 13, -6, 7, 8, 13, 9, 6, -3, 11, 7, -3, 12, 2, 1, -4, 4, 3, 7, -3, 7, 0, 5, 0, 12, -10, -1, -6, -8, 11, 6, -6, 5, 9, 15, 4, 11, 14, 11, 0, 9, -5, 13, -6, 1, -3, -8, -5, -14, 9, 0, 6, 4, 2, -4, -12, 0, 11, 0, 15, -4, 9, -2, 1, -8, 10, -5, -1, 3, -10, -2, -13, 5, 13, 2, -6, 4, -10, 6, -2, 2, -3, 10, 5, 6, 5, -6, 2, 17, 7, -1, 5, 4, 7, 0, -1, 11, -5, 2, -4, -4, -2, 5, -3, -5, 2, 5, 0, 10, 4, 2, 12, -5, -3, -5, 0, -3, -7, -6, 0, 1, 1, 3, 1, 5, 5, 16, 6, -2, 8, -1, 15, 10, 14, -2, -11, 4, 10, 3, 14, 11, -3, 11, 13, -6, -5, 10, 1, -3, 0, 2, 7, 4, -2, -9, -4, 2, -4, 8, -1, 6, 1, 2, 8, 8, 10, 8, -3, -6, -1, 7, 5, -4, 17, 1, 3, 10, 10, 7, 14, 8, 2, -2, 11, 1, -2, -7, -1, -8, 3, -8, -3, -1, -13, 2, -15, -6, 7, -17, -1, 0, 5, -5, 4, 13, 1, 10, -3, 7, 11, -9, 9, 0, 7, 0, -3, -2, 1, 2, 0, -2, -2, 10, 16, 13, 13, -6, 8, 6, -1, 3, 15, -1, -3, -7, 7, 1, 10, 2, -11, -5, -9, 10, 2, 14, -10, -5, -2, 18, -1, 2, 5, -9, 10, 16, -6, 3, -2, -5, -1, 3, 0, -20, 3, 8, 0, -4, -14, -2, -1, 2, 5, 1, -5, -6, 0, -6, -3, -2, -5, -6, -7, 1, -7, 2, -3, -5, 9, 11, 7, 5, 1, 0, 2, -1, 2, 15, -2, 0, -2, -1, -2, -2, -4, -4, 0, -4, 0, 8, 3]
5865CrJ0k1J3lNMj2J4j2K0mooOmpK1mnjmm%nJ4j0RJ1qpPq%J8j3kP%mPj3JoJ4j
5911Ej4%JKnPJ1Jj4Mj0J7r%J0Llj1nRk%J6j1lRpNnkKjPlj3JNKJ0pkLqPj0NJ2j4
5959eLjj3JK1mkMj6NnLJ1KnoJ3rJJJPqKk%nRljnJ4j5nOj%J0nONj7J0rNk%oJ3l
6009@Nnj0QrJ5l%rOjlK3j4MjQj7J3pJ2k1O%jJl%pNpJ5j1j2NQmJ4jlKjkjOjrQp
6058fJ1nkJ4j7QLj0MkPqmJ1poNLQj3KQkrJ2knLljj2JJ0pKOLKljJPpLlJMj1K0j5
6108b%Ppp%%RlOPnmOj0J8j2pkPj2J3j2KJ%LJO%Jnj0J1klmNOlnLjLKoMRppNrPj5
6161a8K5k9K0Nj0JNj7J5Mj4MJjL%rJ0qJ8rnnJ2j0K1j6QNkPk0J8j2PNj3NLj8J8
6202DoqLQj1PnLlMlKNjOppJJ2j0P%jpJ2j2J0j9RqK1plqJ2LjMj3QLnlKKJ2j7jO
$$ y = [3, -6, 4, -17, -4, -7, -2, 2, -10, 4, -8, 12, 8, 2, -4, 2, -2, -9, 12, 8, 3, 2, -2, -6, -6, -11, 3, -7, 2, 13, 5, -2, 5, -3, -3, 15, 2, 0, 7, 7, 3, 10, -3, -2, -8, 6, 5, -9, -9, -8, -6, -11, -4, 7, 8, -6, -2, -12, 5, -4, -4, 6, 9, 6, -5, -10, -1, -3, -3, 13, 2, -1, 8, 1, 6, 1, -1, 1, 0, 7, 4, -9, -8, -3, -1, 9, 2, 0, 3, -5, 2, -8, -3, 9, -5, -2, -3, -16, -15, 6, 2, 0, 4, -12, -7, -12, -9, 2, 4, -1, -7, 6, -3, -2, -1, 0, 7, -1, 1, -1, -1, -6, 3, 0, -1, -6, 8, -7, -12, -6, -7, -7, 3, -2, 4, 9, -8, 2, -7, -2, -4, -4, -10, 3, 0, 5, 0, -10, -2, -11, 4, 1, 1, -8, -2, -3, -6, 17, 3, 7, 6, 14, -3, 10, 3, 15, -6, 0, 0, -1, 0, -3, -3, -10, -5, -12, 3, -8, -20, -15, -7, -11, 3, 2, -1, 1, 0, -2, -3, 3, 2, -7, 1, -6, 5, 0, -2, 12, -5, 3, 6, -4, 0, -2, 5, -3, -7, 4, -3, -9, -4, -1, 7, -6, -4, 4, 2, -7, 5, 3, -2, 1, -2, -3, -15, -14, -4, -11, -9, -3, 0, 2, -1, -2, -1, 6, -1, 2, -1, 0, 4, -7, 13, -2, -2, 5, -2, -9, -9, -9, 0, -3, 3, 10, 5, 1, 7, -3, 15, 3, -4, -6, 1, -11, 2, -10, -8, -7, -7, -4, -3, 3, 3, 4, -1, -11, 0, -2, -5, -9, -4, 2, -1, -6, -3, -4, -1, 1, -5, -1, 8, 1, -6, -1, -10, -3, -18, 7, -22, -2, 3, -7, -6, -1, -18, -3, 1, -13, -9, -8, -9, -6, -6, -15, -5, -13, 5, -4, -9, -14, -2, -12, 9, -7, 1, 6, 4, 11, -9, 9, -3, 4, 9, -4, 1, 4, -14, 4, -2, -10, -7, 1, -10, -3, -8, -5, -8, -4, -7, -5, 0, -1, 5, -2, -9, -8, 4, -6, 1, 1, 0, -7, 5, -7, 3, -16, -7, -15, 6, -1, -4, -12, 0, 3, 2, 6, -7, 1, 4, -1, -4, -2, 0, 12, -5, -6, 0]
6251@j2MPM%po%OqMPJ1qnjJ1JnKjj5OnQKj1MJ3%krOJ1j2qOLjjKLNj1QMj5KJ0k0
6301a3%RkkJ0qJ1lmk%NnljKlMOJ0j3J2omjOqQnjqKkJ8j4nJ9k1K1mmnKLj9RjJ0
6349@nMKrN%OJj7J1Omj1J6oQqJ3pKJj1mJ5mJj7PJ4j6j0RNjkkKKkJ3pJLqNopNN
6398bjOmRj5J3j6J3j1MRknJ1%j4QpOjj1J3j5NPpMmMpJ2Nj4NlKjLjMk%J0j9jJ6
6444Fj2KMmOj0J2j3LK%Rj4J3kRoKj0%kmJ%Rmj1J0j3J0KQomJ1jKpkRJMnPj3jJ0
6491HllqQqJ4pmOj3OO%j3OoJ6nj7J6%%rQnoOPj4J0KQkqJJ0j1mJ5qLmJOLomOpn
6541hJ0MKKlJol%JJ0j1pkK2Oj0rLMj2J1j8NMLLkJKqJ3loJ4onNoMlqJ5Lj2L%kP
6590Hj3OnMkj2J1Nj0J7j6mJ7noMJ1nj0jkJLMj1J4j1OjOOj2J0rNkMkQroJ0qnJ0
$$ y = [0, -12, -8, -1, 3, 3, -4, -10, -10, -4, -12, -8, -1, 10, 2, -3, -4, 7, 8, 3, 5, 4, -11, -5, -10, -2, 0, -11, -7, 6, 6, 4, -5, 1, 12, 0, -8, -2, 1, 0, -1, 1, 4, 9, -2, 6, 10, -5, -3, 7, -13, -13, -4, -6, -8, 2, -6, 5, 2, -2, -4, -4, 1, -4, -7, -8, -6, -9, -5, 1, 11, -2, 10, 4, 0, -1, 5, -3, 5, 0, -1, -9, -7, -9, 9, -5, -10, 9, -12, 9, 5, 1, -4, -2, 1, -18, -9, -10, 0, -5, -1, 1, -8, -3, -3, 3, 4, -13, -2, 4, 0, -11, 5, -1, 7, -1, 12, 5, 7, 8, -3, -7, 8, 4, 5, -12, -5, 9, -7, -17, -8, -3, -4, -6, -8, -6, -4, -6, 7, 0, 1, 4, -4, 1, -5, -12, -7, -2, -3, 3, -1, 8, -7, 6, -10, 3, -8, -4, 5, 3, -2, 9, 9, -5, 3, -4, 2, 1, -10, 3, -12, -7, 0, -7, -3, -7, -3, -10, 2, 7, -7, -2, -5, -3, -4, -1, -2, 2, 0, 0, 10, -9, -10, 6, -6, -4, 0, -4, 2, -8, 4, -9, -6, -4, -4, 5, -9, 4, 2, 11, 5, 7, -3, -3, -5, -9, -8, -8, 1, -3, -14, -4, -17, -7, -5, 3, -3, -7, 4, 3, 5, -2, -4, 5, 6, 10, 5, 12, -1, -2, 8, 5, 2, -6, 2, -6, 8, 1, -3, 3, -10, -4, 2, 2, -11, -5, -11, 5, 0, -17, -1, -1, -1, -10, -2, -7, -13, -7, 0, -14, -4, -2, 6, 4, -4, -3, 7, -4, -8, 7, -1, 2, -2, -1, 5, 8, 2, -2, 4, -3, -8, 2, 6, 8, 10, 7, 8, 2, -1, -1, 0, 10, -1, -8, -10, 12, 18, 8, -1, 2, 6, -6, 5, -13, -8, -4, -1, 2, 0, 1, 3, -5, 8, 5, -1, 13, 7, 2, 7, 1, 5, 2, -6, 9, 12, 0, 3, 3, 1, 8, -5, 1, -4, 0, -2, -14, -3, 2, -8, 9, -7, -11, 6, 1, -5, -1, 10, 5, -5, -6, -8, -7, -4, 0, -11, 3, -8, -2, -3, 3, 9, -3, 7, -2, 3, 1, 5, 3, 11, 2, -4, 6, -2, -7, 3]
6635CmJMoNNoplNJ0j1KLj1J2j3PQKrQoNMoQ%qM%nMjmNNqlPkrMLnKnJJ2rnKJ1j9
6689a3QQ%Pj4NPkQj4J0%rQj2jNj1J9%Kl%KonKqJ7%%qKjqNnOLkl%KlNlmQqQqLk
6742cRjPJ%j2MKMNj1j6PJjNljmNRjj2lKKj0K4rmK0k6Rj0J2olklJ5qOmlJJ0Kop
6791gJ2mkm%lPpMKJ0j8J3rQMj8JJ2kJ%l%KNj4ONnOoj%NplOPj0OmJ3j7LlRmMOj3
6842gQl%J2j6KJ1lNj2kKpJ0jKn%Oj0NLQj6J2jnkKMlMljLjmN%qLK%Mj6J0%kK3k1
6892ckJPpoNlKKnOrQmlNOLj4OnQRj0K%mmJ5Qk2J4j1kPlkj%oJK4j1j2J9j1M%qJ2
6942Frnkj1K4l%Jj0J7k3J8jmj6PJ1j2J2mKJ3rj4J4plLKKmj0KMpJ5j1J6olMq%j0
6986a9J6Kj2M%mMMOlomJ2lj0J7Jj3PJkJ2j4oLJ0rKJ0mj0pQj6L2k3jJ0ooJ2j0%
$$ y = [3, -1, 0, 4, -2, 3, 8, 2, -5, -8, -3, 7, -4, -2, 1, -10, 2, -11, -4, 4, 6, -3, 5, -1, 4, 8, 2, 10, 10, 2, 6, 6, 1, 5, 4, 0, 5, 10, 2, -1, 6, 4, -5, -1, 2, -3, -1, -6, -5, 7, -2, -7, -5, 6, -13, -5, 3, 3, 10, -4, 1, 8, 6, 14, 0, 10, 10, 1, 9, -3, -4, 1, -10, 9, 9, 11, 8, 8, 10, 4, -1, 1, -7, 10, 10, 10, 2, 4, 3, -5, 0, -5, 1, 4, 2, -1, -1, 1, -2, 3, 0, -4, 4, -4, 4, -4, -1, -3, 6, 5, 12, 13, 13, 1, 5, 7, 11, 16, 5, -11, -4, -3, -4, 1, -2, -3, -7, -2, 7, 6, -6, -9, -7, -5, -15, 9, 0, -4, 16, -10, -1, -11, 1, -5, -8, -10, -13, 2, -6, 0, -4, -7, -6, 4, 6, 0, -7, 5, 1, -1, -5, -5, -8, -1, -8, -4, -2, 8, -10, 3, -6, 2, 6, -12, -11, 1, -1, 0, 0, -3, -3, -1, 4, -10, -4, 1, -4, 2, -4, -5, -5, 0, -7, -10, -4, 3, -7, -1, -5, 8, -9, -6, -9, 0, -4, 0, 6, -7, 1, -2, -2, 10, -6, -4, 7, 4, 9, -3, -5, -3, -10, 0, -1, 1, -4, -4, 2, -8, -3, 0, 8, -8, 4, 3, -2, -4, -2, 2, -1, 3, 0, -1, 2, 1, -3, 2, 2, -6, -3, -1, -1, 3, -13, -3, -3, -5, 18, -3, -5, -4, 3, -4, -10, -5, -8, -6, -4, -9, -3, -12, -4, -8, -11, -6, 0, 3, -11, -5, -10, -2, 7, -3, -1, -1, -5, -9, 6, 14, -8, 6, -5, -7, 0, -3, -5, -6, -6, -12, -11, 13, 2, -10, 9, -2, 2, 2, -6, 6, -3, -8, -10, -21, 3, 0, 0, 1, -9, 8, -15, 3, 2, -2, -18, -11, 0, -12, 0, -4, -2, 11, 2, -12, 2, -5, -8, -5, -3, -1, -5, -15, -13, -9, -16, -1, -12, 4, -2, -5, -1, -9, -9, -19, -3, -1, -13, -9, -9, -13, -9, -5, 1, -2, -8, -12, 0, -3, -13, 4, 5, -8, -1, 0, -2, 10, -4, -10, -7, 3, -6, -4, 6, 2, -8, -15, -7, -23, 9, -14, -15, -5, -11, -17, -5, -15, -15]
7029a5KR%oNlQr%J2mlJ3k1NNlJlNKqJ4lj5J1JlMMnlJ0Lj4j3K5rlj3J5Jj2J6pm
7075hJ1jKjkKopJ7j6%JQjqK1okpJ2j7J2k3J2J5j8KkPNljJ4nk3J0qK3j1lnj0J1
7118ioJ1j5J3JJNmjOoJ4qj4J7Lk0LJ5noljRm%MlLmqKRN%k1K1qOj1J2oLqJ2ppJ2
7166B%k0K5k2J1j2J6Mj0J0j4J8pj0J0J0mj9J0OqPkj0J2j2pJ3Mj4J3ok%J7Kpkj0
7205hMRp%%jpMJ0nNjNj5PnQJj3QMK%j8J3J0ppOpQKkKnKj6%jRKNrNQk6J6mOjJ0
7256FpkpJ0qPKj0NoNqjJ5nNj0lJ2Lj3RJ6j7nNl%oKnQPj7lPOM%%j1J2KkMlQmjK
7306EmQrQj9J3Pj4Jj2J8okLnOnNJmN%j2R%qKOnpJ1lJ0k0J8lnoQKm%J0llPjNJk
7356GJJJj7rJ2J%nR%j2O%RNj1lJOkmJJ0kj6PkJ%mNrPLjJ3rLkoK5j8jPj4J4oOj1
$$ y = [-15, -13, -4, -4, -10, -5, -8, 0, -9, -9, 3, -1, -4, 9, -12, -7, -2, -5, -4, -7, -2, 0, -8, 6, 3, -12, -1, 0, -3, 1, 5, 0, -3, 7, 10, -4, -17, 8, -1, -4, -17, -2, -1, -13, 3, -4, -8, 3, 2, 4, 3, 1, 3, -3, -10, 7, -9, -9, -8, 0, -1, -9, 12, 6, 4, -3, 9, -8, 4, -19, -7, 8, -10, -8, -10, -3, 2, -1, -2, 12, 7, -16, -6, -14, 9, -2, -5, -10, -20, -9, -15, -4, -19, -6, -5, -4, 1, -3, -4, 2, -4, 10, 2, -12, 5, 8, -12, -9, 6, 1, -5, -8, -9, 0, -4, -4, 0, -3, 0, -4, -12, -10, -1, 4, 4, -17, 4, -4, 2, -9, 3, -3, 0, -8, 4, -3, -10, 2, 2, -18, 7, -15, -4, -16, 0, 4, -6, 4, -10, 8, 1, -9, 1, 11, 7, -12, -2, 4, -4, 3, 1, -9, 3, -9, -16, -3, 1, -13, 0, -6, -8, -8, 9, 11, 4, 2, -8, -4, 5, -2, -2, -2, -3, -10, -6, 4, -1, 4, 3, 8, -7, 0, -5, 3, 4, -9, -1, 3, 5, 5, -13, 0, 10, 3, -4, 2, -5, 3, 5, 3, 5, 0, 2, -14, -14, -15, -6, -4, 1, -8, -3, 5, -21, -5, -9, -3, -4, 6, -1, -3, -10, 0, -8, -1, 1, -9, -4, -10, -5, -13, -14, 1, -4, 1, -9, -12, 0, 3, -10, -1, 15, -2, -7, -2, -5, -5, -11, -9, -14, -6, 1, -16, -19, -12, -6, -2, -2, -2, -13, -1, 1, -1, 3, 0, 8, 4, 3, 5, 1, 9, 0, 8, -11, 2, 9, -5, -4, -16, 2, -4, -6, -3, -8, -2, -7, -2, -1, -5, 0, 0, -12, -3, -3, -11, -9, -3, -8, -15, -4, -7, 3, -17, 1, -2, -7, -13, -5, -3, -7, -7, 3, 0, -3, 4, 3, 8, 9, 7, 8, 9, 10, -7, -16, -4, -3, -3, -8, 1, 1, -11, -5, -5, 4, 9, -2, -5, -4, 2, 0, -4, -3, 7, 5, -11, -4, -6, -5, -5, -9, -4, -13, -6, -3, -4, 9, 0, 3, 1, -5, 20, 2, 1, 8, -6, 8, 2, 8, -3]
7406cNj1oJ2n%J0MMj2%%ONqnPJ0j8J2jnj4J4oJ1oMJoJJkNmlLJ0j1J1%qJnKjnP
7454AnlnNJpPlKLj0J0Nn%jNMJj5J4Qkj2NqJ2j2J6j0nKNmRj2LNmKooJ4ojjLlRj2
7504gJ0jJqJ1prJ7j8PKMqoJ1nPOlLmj%rPQj5PJlk%j4J6J1j4KJ0j7J3KrqlOPpk
7552a1RKnJ2j3kJJ8j3nQKRqPj0njMLMj5K3j4Qj0JOj7RlLJ0rKkj0J4J%MrLR%j6
7598fRKJj3MNOj9RM%Pj1J3j6J9j5P%l%JrPqNKj3ROq%MKnMkj0J9j2J0Ok5MJ6NJ
7645A2omjjKOLprPnRj0J2joMnloJ0jkmj0J3j2J6k1K2oLKmqJJ2JKj1LJ0oOj%n%
7693AojJ4ljj4QJ1j0nQpJ2j6QMkQj2KrMJ1j1RNj8PmjRoLOrkJ4j5J4rJ1Kkj6J4
7738FnjJ0j5J3j0J0j8MNoJ3rOolJ4j8RJPj2P%%lj1J9j5%J7pkpJ4lNj5NkMnJ0%
$$ y = [-3, 2, -9, -15, -3, -8, -8, 2, 6, 10, -2, -2, -2, 4, 9, 1, -4, 3, 13, -5, 7, 6, 1, -13, 1, -5, 6, 0, 4, 5, -1, 0, 1, -1, 4, 0, -3, 0, 10, -1, 10, 10, 2, 3, -2, 0, -1, -6, 1, -4, -7, -12, -7, -6, -13, -6, -9, -7, -4, -14, -4, 1, -4, -4, -5, 0, 4, 5, -10, 4, 12, 10, -2, 3, -5, 7, -5, 11, 1, -4, -2, 3, -1, 8, -4, -1, 4, 0, 2, -4, -10, 4, -2, -3, -4, -1, -4, 5, -7, 3, 2, 3, -5, 6, -1, -10, 7, -11, -4, -2, 2, -6, -12, -1, -6, 1, 7, 4, 7, 3, 2, 2, -7, 0, 8, -7, 0, 1, -2, -4, -4, -18, -2, 9, -5, -3, 7, -10, 3, 5, -4, -12, -15, -9, -2, -9, -11, -2, 0, -5, 7, -6, -8, -7, 11, -2, -7, 1, 3, 12, 4, 11, 1, -4, -5, -1, 2, 6, -9, 14, 0, 8, -2, -1, 5, -12, -3, -6, -3, 7, -2, 0, -2, -12, 2, 3, 3, 7, -2, 1, 10, 10, -6, 3, 5, 6, -7, -3, 2, 8, -11, -2, 2, 2, 9, -2, 11, -5, 14, -1, 6, 6, 3, 3, 4, -5, 2, -6, -1, 1, -12, -3, 3, -5, -5, -1, 1, -4, 0, -2, -12, 7, -5, 5, 11, -14, -10, 6, 11, 12, 6, 2, 1, 0, 2, 8, 11, 4, -5, 2, -3, 6, -4, 8, 7, 1, 5, 0, -3, -9, 1, 0, -2, -6, -16, -3, -15, 1, -20, 2, -4, -1, 1, -3, -11, -10, 2, 3, 5, -6, -3, 7, 1, 7, 6, 6, 1, 1, -5, -6, 8, 5, 4, -10, -2, 9, -1, -6, 2, -5, 7, -9, -1, 3, 1, 9, -3, -1, -10, -6, 5, -6, 3, 8, -10, -3, -7, -8, 1, -5, -2, 4, -5, -7, 7, -8, 6, -3, 8, 10, 8, -8, 6, 1, 0, 10, -5, 8, -2, 8, -10, -6, -1, -7, 6, -3, 3, -3, -6, 8, -10, -1, 0, 7, -5, 2, 2, 2, -1, -12, 7, -8, -8, 9, 2, 0, -7, 7, 4, 9, -6, -1, -3, 1, -4, 6, 6]
7782FMj1OMoKLo%jkLjLj5J1joQnmJ3j4%J0NNj4jQMkjKj4MNMrKpmK0k0J9noJ6r
7831CpPkPj2MOklrOj1J8lqrMN%oJ6j1Qj3J3Qj0NlNlkJPKj3ONOj5kK1k0OrK3qj5
7879dkRJj8J1lKJ0k0K0j4J3j1OqRJ3j9LrQJklOMpJ3o%%rJK1rklj0J3%J%j0Rpr
7925a1RJ4k0j1J8j0J4mOoOqKMmkjJ2nl%Rj4J3n%QompJ2JPjprOnj1NOOlJnNmOr
7974eJ1j7J9mr%j%jKJRq%QPj7KnJ2J0j3J1j5QLjooQpKKpJk%j3QJ2oj2J3QLPmj0
8022bnNOrkJ0MNqRrjPjrj0J4nRqnKmK1qKoqJ0Lj1JNj0K2j5kJmQjj1K1rj3K0j3
8069dOkPPj7OOj4QMjkJj1NMMljLqPj4J6q%jjJMj1RnQKNrj4J6j0QLmJ%QJrMKkP
8121A2qmNLrOJj0K%%J2j0kJ9j5j6POLj%kK%JNqkjQrK0k0KJQkmJ3Nj2nJ2kjpJ5
$$ y = [6, 10, -1, 5, 9, 3, 5, 8, 2, 2, 1, -1, 2, 1, 4, -11, 0, -1, -7, 1, -4, -8, 5, -9, -9, 1, 6, 11, -3, -4, 4, 8, 6, 5, 7, -7, -3, 2, 6, -3, -1, -8, -12, 8, -12, 7, 2, -4, 12, 3, -4, 3, 1, 8, -4, 0, 6, 4, 1, -8, -2, -13, 5, 2, -6, -15, -11, -6, -6, -12, 4, -7, 1, -12, 1, 9, -1, 4, 1, 6, 3, 1, 2, 9, 11, -2, 4, 9, 15, 0, -2, 19, -1, 5, -4, 19, 11, -4, -6, 3, 4, -14, -3, -6, -4, 6, -14, 6, -8, 5, -6, 0, -8, 1, 14, -5, -2, -11, -3, -2, -4, -7, -1, 3, -4, 9, 3, 3, 3, -6, -5, 16, 7, 5, 2, -8, 5, 5, 6, 6, -4, 5, -2, -11, -2, 12, -8, -19, -1, -11, 3, -1, 5, -1, 5, -3, -1, 3, -1, -3, -4, 8, 3, 0, 0, 9, -5, 8, 3, 3, 11, 5, 1, -6, 6, 7, 14, 13, 6, -3, 3, -2, -13, -8, -2, 4, 1, 2, -3, 2, -2, 4, -5, 6, -11, 8, 4, -5, -5, -6, -6, -7, -5, -4, 5, -3, -3, 5, 12, -5, -3, -8, 4, 14, 1, 12, -3, 5, 8, 7, 1, -5, 3, -4, -2, 0, -7, -6, -8, -8, -21, -13, -1, -7, -19, -6, 2, 5, 12, 8, -2, -7, -2, 4, -5, -7, 3, 7, 12, 4, 13, 4, 3, 10, 9, 0, -10, 4, -1, 8, 0, -5, -3, -7, 14, 6, 8, 2, -6, 4, 7, -4, -3, 2, -8, 14, -1, -3, -2, -6, 2, 1, -10, 11, 2, -11, 9, -4, 2, 0, 7, 14, -3, 3, 9, -5, 3, 7, 6, 4, 5, -6, -1, 3, 7, 4, 3, 6, -2, 5, -9, 7, -1, -1, -2, -3, -2, 2, -9, 0, -5, 3, 5, 10, 1, -13, 3, -7, 1, 4, 0, 1, 1, 9, 10, 1, 5, 7, 5, 12, 4, 0, 5, 8, -1, 5, 6, -4, -2, -2, -2, 10, 0, -2, 17, 2, -14, -7, -1, 2, 1, 1, -1, 1, 1, 2, 7, -1, -3, -4, 4, -5, 15, -5, -3, -2, 6, 4, 0, 13, 18, 6, 1, 13, 11, 10, 3, 18]
8169A8j9nJ0MMn%oPj2MmJKOj2OJ3oljq
$$ y = [18, -1, -6, 4, 8, 12, 7, 7, 1, 8, -4, 0, -4, -3, -1, 5, -7, -1, 12, 6, 3, 2, -6]
8191f
##END NTUPLES=NMR FID
##END=
