##TITLE=1H_Pr MeO-Me
 CD3OD
 8 sc, 
 18.10.2022
##JCAMPDX= 6.0         $$ Bruker NMR JCAMP-DX V2.0
##DATA TYPE= NMR FID
##DATA CLASS= NTUPLES
##ORIGIN= UXNMR, Bruker Analytische Messtechnik GmbH
##OWNER= root
$$ XWIN-NMR		Version 3.5
$$ Tue Oct 18 12:50:20 2022 Russian Standard Time (UT+4h)  she@DPX200
##.OBSERVE FREQUENCY= 200.1313499994
##.OBSERVE NUCLEUS= ^1H
##.DELAY= (6, 6)
##.ACQUISITION MODE= SIMULTANEOUS
##.ACQUISITION SCHEME= undefined
##.AVERAGES= 8
##.DIGITISER RES= 18
##SPECTROMETER/DATA SYSTEM= spect
##.PULSE SEQUENCE= zg30
##.SOLVENT NAME= MeOD
##.SHIFT REFERENCE= (INTERNAL, MeOD, 0, 15.7039)
##AUDIT TRAIL= $$ (NUMBER, WHEN, WHO, WHERE, WHAT)
$$ ##TITLE= Audit trail, XWIN-NMR		Version 3.5
$$ ##JCAMPDX= 5.01
$$ ##ORIGIN= Bruker BioSpin GmbH
$$ ##OWNER= she
$$ F:/spectra/data/she/nmr/H-F/1/audita.txt
$$ ##AUDIT TRAIL=  $$ (NUMBER, WHEN, WHO, WHERE, WHAT)
(   1,<2022-10-18 12:48:28.42 +0400>,<she>,<DPX200>,
      <created by zg, POWCHK disabled, PULCHK disabled
       configuration hash MD5:
       00 E9 B6 7A A2 85 ED C7 34 08 36 98 17 FE 4E 26
       data hash MD5: 16K
       B1 9E 68 E4 E7 55 37 3A FA 4A 3B A8 27 79 35 AA>)
$$ ##END=
$$ 
$$ hash MD5
$$ 5A 2B 79 C9 28 D0 66 AF 93 1B 50 BE 58 94 82 65
##$RELAX= 
##$RELAX= 
##$RELAX= 
##$RELAX= 
##$RELAX= 
##$RELAX= 
$$ Bruker specific parameters
$$ --------------------------
##$DU= <F:/spectra>
##$EXPNO= 1
##$NAME= <H-F>
##$PROCNO= 1
##$TYPE= <nmr>
##$USER= <she>
##$AMP= (0..31)
100 100 100 100 100 100 100 100 100 100 100 100 100 100 100 100 100 100 
100 100 100 100 100 100 100 100 100 100 100 100 100 100 
##$AQSEQ= 0
##$AQ_mod= 1
##$AUNM= <au_zg>
##$AUTOPOS= <>
##$BF1= 200.13
##$BF2= 200.13
##$BF3= 200.13
##$BF4= 200.13
##$BF5= 200.13
##$BF6= 200.13
##$BF7= 200.13
##$BF8= 200.13
##$BYTORDA= 1
##$CFDGTYP= 0
##$CFRGTYP= 5
##$CHEMSTR= <none>
##$CNST= (0..31)
1 1 145 1 1 1 1 1 1 1 1 1 1 1 1 1 1 1 1 1 1 1 1 1 1 1 1 1 1 1 1 1 
##$CPDPRG= <>
##$CPDPRG1= <>
##$CPDPRG2= <>
##$CPDPRG3= <>
##$CPDPRG4= <mlev>
##$CPDPRG5= <mlev>
##$CPDPRG6= <mlev>
##$CPDPRG7= <mlev>
##$CPDPRG8= <mlev>
##$CPDPRGB= <>
##$CPDPRGT= <>
##$D= (0..31)
0 1.2 0 0 0 0 0 0 0 0.06 0 0.03 0 0 0 0 0.0002 0 0 0 0 0 0 0 0 0 0 0 0 
0 0 0 
##$DATE= 1666082907
##$DBL= (0..7)
120 120 120 120 120 120 120 120 
##$DBP= (0..7)
150 150 150 150 150 150 150 150 
##$DBP07= 0
##$DBPNAM0= <>
##$DBPNAM1= <>
##$DBPNAM2= <>
##$DBPNAM3= <>
##$DBPNAM4= <>
##$DBPNAM5= <>
##$DBPNAM6= <>
##$DBPNAM7= <>
##$DBPOAL= (0..7)
0.5 0.5 0.5 0.5 0.5 0.5 0.5 0.5 
##$DBPOFFS= (0..7)
0 0 0 0 0 0 0 0 
##$DE= 6
##$DECBNUC= <off>
##$DECIM= 32
##$DECNUC= <off>
##$DECSTAT= 4
##$DIGMOD= 1
##$DIGTYP= 9
##$DL= (0..7)
0 120 120 120 120 120 120 120 
##$DP= (0..7)
150 150 150 150 150 150 150 150 
##$DP07= 0
##$DPNAME0= <>
##$DPNAME1= <>
##$DPNAME2= <>
##$DPNAME3= <>
##$DPNAME4= <>
##$DPNAME5= <>
##$DPNAME6= <>
##$DPNAME7= <>
##$DPOAL= (0..7)
0.5 0.5 0.5 0.5 0.5 0.5 0.5 0.5 
##$DPOFFS= (0..7)
0 0 0 0 0 0 0 0 
##$DQDMODE= 0
##$DR= 18
##$DS= 0
##$DSLIST= <SSSSSSSSSSSSSSS>
$$ [...]
##$SUBNAM2= <"">
##$SUBNAM3= <"">
##$SUBNAM4= <"">
##$SUBNAM5= <"">
##$SUBNAM6= <"">
##$SUBNAM7= <"">
##$SUBNAM8= <"">
##$SUBNAM9= <"">
##$SW= 18.0517283424941
##$SWIBOX= (0..15)
0 0 2 0 0 0 0 0 0 0 0 0 0 0 0 0 
##$SW_h= 3612.71676300578
##$TD= 16384
##$TD0= 1
##$TE= 0
##$TE2= 300
##$TE3= 300
##$TEG= 300
##$TL= (0..7)
0 120 120 120 120 120 120 120 
##$TP= (0..7)
150 150 150 150 150 150 150 150 
##$TP07= 0
##$TPNAME0= <>
##$TPNAME1= <>
##$TPNAME2= <>
##$TPNAME3= <>
##$TPNAME4= <>
##$TPNAME5= <>
##$TPNAME6= <>
##$TPNAME7= <>
##$TPOAL= (0..7)
0.5 0.5 0.5 0.5 0.5 0.5 0.5 0.5 
##$TPOFFS= (0..7)
0 0 0 0 0 0 0 0 
##$TUNHIN= 0
##$TUNHOUT= 0
##$TUNXOUT= 0
##$USERA1= <user>
##$USERA2= <user>
##$USERA3= <user>
##$USERA4= <user>
##$USERA5= <user>
##$V9= 5
##$VALIST= <valist>
##$VCLIST= <CCCCCCCCCCCCCCC>
##$VD= 0
##$VDLIST= <DDDDDDDDDDDDDDD>
##$VPLIST= <PPPPPPPPPPPPPPP>
##$VTLIST= <TTTTTTTTTTTTTTT>
##$WBST= 1024
##$WBSW= 4
##$XGAIN= (0..3)
0 0 0 0 
##$XL= 0
##$YL= 0
##$YMAX_a= 121393
##$YMIN_a= -188744
##$ZGOPTNS= <>
##$ZL1= 120
##$ZL2= 120
##$ZL3= 120
##$ZL4= 120
##$ABSF1= 10
##$ABSF2= 0
##$ABSG= 5
##$ABSL= 3
##$ALPHA= 0
##$AQORDER= 0
##$ASSFAC= 0
##$ASSFACI= 0
##$ASSFACX= 0
##$ASSWID= 0
##$AUNMP= <proc_1d>
##$AZFE= 0.1
##$AZFW= 0.1
##$BCFW= 1
##$BC_mod= 2
##$BYTORDP= 1
##$COROFFS= 0
##$CY= 11.3945322036743
##$DATMOD= 1
##$DC= 2
##$DFILT= <>
##$DTYPP= 0
##$F1P= 2.36226072786647
##$F2P= -0.459571619588291
##$FCOR= 0.5
##$FTSIZE= 0
##$FT_mod= 4
##$GAMMA= 1
##$GB= 0.15
##$INTBC= 1
##$INTSCL= 1
##$ISEN= 128
##$LB= 0.24
##$LEV0= 0
##$LPBIN= 0
##$MAXI= 10000
##$MC2= 0
##$MEAN= 0
##$ME_mod= 0
##$MI= 1.114404
##$NCOEF= 0
##$NC_proc= 0
##$NLEV= 6
##$NOISF1= 3.799351
##$NOISF2= 2.8
##$NSP= 1
##$NTH_PI= 0
##$NZP= 0
##$OFFSET= 15.70392
##$PC= 1
##$PHC0= -18033.84
##$PHC1= 10.6007
##$PH_mod= 1
##$PKNL= yes
##$PPARMOD= 0
##$PSCAL= 0
##$PSIGN= 0
##$REVERSE= no
##$SF= 200.130013532006
##$SI= 16384
##$SIGF1= 3
##$SIGF2= 2
##$SINO= 400
##$SIOLD= 16384
##$SREGLST= <1H.CDCl3>
##$SSB= 0
##$STSI= 0
##$STSR= 0
##$SW_p= 3612.71676300578
##$SYMM= 0
##$S_DEV= 0
##$TDeff= 0
##$TDoff= 0
##$TI= <>
##$TILT= no
##$TM1= 0
##$TM2= 0
##$TOPLEV= 0
##$USERP1= <user>
##$USERP2= <user>
##$USERP3= <user>
##$USERP4= <user>
##$USERP5= <user>
##$WDW= 1
##$XDIM= 8192
##$YMAX_p= 0
##$YMIN_p= 0
$$ End of Bruker specific parameters
$$ ---------------------------------
##NTUPLES= NMR FID
##VAR_NAME=  TIME,          FID/REAL,        FID/IMAG
##SYMBOL=    X,             R,               I
##VAR_TYPE=  INDEPENDENT,   DEPENDENT,       DEPENDENT
##VAR_FORM=  AFFN,          ASDF,            ASDF
##VAR_DIM=   8192,          8192,            8192
##UNITS=     SECONDS,       ARBITRARY UNITS, ARBITRARY UNITS
##FACTOR=    0.0002768,     1,               1
##FIRST=     0,             0,               0
##LAST=      2.2672688,     0,               0
##MIN=       0,             -188744,         0
##MAX=       2.2672688,     121393,          0
$$ Real data points
##PAGE= N=1
##DATA TABLE= (X++(R..R)), XYDATA
$$ [...]
1846a90n20l47m30J381O23K24N68p36k58j35q93k22J87j5Q88M00M05L11n82p07
1866d8r00o80J024L42P13J52k0l0M5n18l83p46l11R12N14Q10M23r21j1p72m85
1887h90M38l12L24P18J41O24l6m80j76j072j94J71%R71R37m57L86q73n76J55o52
1908h53N6N37l21J330K40%p4j585km6l73R36O46k08P61m07j31k78j054L1J14j77
1930h58J217q3K88L58o23j37q99k93O30p4P48N23l44L58M04r33m10r88l69J415
1950g0J25P03K21r99L99k14n45p0l87J03R57K15L02J40m06j47p12n31L21j74J349
1971E80K48k01k4k03l79J16j020j48K91L44J030K08l27k06j047M95q5n40L00L90
1991a78L96P22p3m34k26j081M09j21j08R95l7L20N81r28l37n8q17N79p8L7Q94
$$ plain form
1846 -190 -710 -1057 -1487 -106 517 741 1309 573 315 180 -713 -935 -748 -763 125 525 930 1241 659 -48
1866 -48 -948 -1628 -604 -262 451 603 583 553 598 80 -303 -1049 -1360 -448 66 876 1299 378 367 -405 -890
1887 -890 -452 -764 -440 278 419 1043 1007 527 351 -721 -915 -744 -744 227 1164 707 1093 220 -356 -201 -853
1908 -853 -797 -260 -581 749 989 989 915 -670 -672 -718 -1091 -155 491 283 1044 637 506 228 -826 -795 -681 -858
1930 -858 359 276 564 922 299 162 -737 -1030 -400 -474 274 797 453 811 1215 282 -128 -1116 -1485 -70
1950 -70 55 758 979 -20 379 165 -380 -450 -837 -734 223 438 740 880 474 327 -385 -916 -595 -769 580
1971 580 828 627 603 400 21 137 -883 -1031 -740 -396 634 842 515 309 -738 -243 -328 -868 -568 -178
1991 -178 218 940 867 433 207 -874 -465 -586 -694 301 264 584 1165 237 -100 -158 -975 -396 -474 -437 457
2012D57l1P19j79j392j47l16K57J091m66J45N21j77L40k98j090j22l44N50P64
2031B82J37K84k20l59M37r04l09J27jN07N25j50J96r3m8l47q59RL86M91N92O4
2053G47n27K32l86l44J0o80K01P77K06J108o45o27l1m82K81j86o28J174j53K37
2073B84M42m44k85j77p40N92k24K5J228r5Q1j93j296N23m3k64L45j88L20P40L2
2094F63K09n41r80n1L12M3Q78n65M40K48n12J71k70r11L71J73L56L34q3O43m53
2115D75k16m56p90M68N09K3M75j99q3O92l73p02k85p90N62Q34M12K77n94l42K45
2136A42k95m6k14n31P96M88ML08l66M9n06k45l00lL74P91k05l1k22k49K23k41
2158b79j17J13k10J89J423l43j21q80n66O35n7j06K29j21M70L62l58j57j36m81
$$ plain form
2012 457 426 1145 966 -426 -573 -889 -632 459 -7 138 659 482 822 524 -566 -688 -1032 -482 282
2031 282 419 703 483 124 561 -343 -652 -525 -526 -19 506 356 552 459 411 64 -795 -786 -400 91 683 747
2053 747 220 452 66 -278 -268 -948 -747 30 236 1344 699 72 41 -441 -160 -346 -974 200 47 284
2073 284 726 282 -3 -180 -920 -328 -552 -527 701 606 687 494 -802 -279 -322 -586 -241 -429 -109 631 663
2094 663 872 331 -649 -700 -388 -345 533 -32 408 656 144 315 45 -866 -495 -322 34 368 285 928 475
2115 475 259 -197 -987 -519 -10 13 488 289 206 898 525 -177 -462 -1252 -690 144 556 833 239 -103 142
2136 142 -153 -199 -413 -944 -148 340 344 652 286 335 -171 -416 -716 -719 -345 446 241 210 -12 -261 -38 -279
2158 -279 -396 -283 -493 -304 1119 776 655 -225 -791 -156 -213 -319 -90 -211 259 621 263 106 -30 -511
2178e11L30l01K24M91J43N30l95p25k61PJ97L01k16o0O46J12O86o89r03j05k39
2199g38R10J86m33L05j27K9M47p36l56j1l22J113J35jr6j09P8k54n03j49J73L40
2221a19M69Kl84L00k79O69p50p05J37M80N90L82n10l02l4k42K30m24l8J66J75
2242a87P59j1k55J02n29l80M06m94L59N47m1M40n14l75K06n06P1J10k17M20M87
2263C98M08j16o42m78M1m05Q58O8l68M00oL48k56q77L02k38L07L39o0K07M79l95
2285C14J8l17n44R7J36K48M68n10M39J68m70k70r7m32N49K12J44L65n97J67J93
2306B81j51L3q64M4O36K50L38j20n84J55K4k89l6k77K48M66o0M81k78n91R20r63
2328c37m0P5L9M13P07m64k57l21kK66k06n6J11l14Q78K21m05j64o93P0L33l32
$$ plain form
2178 -511 -181 -482 -258 233 376 906 511 -214 -475 -468 -271 30 -186 -246 400 512 1198 509 -394 -499 -738
2199 -738 172 358 -75 230 103 132 579 -157 -513 -524 -846 267 402 401 305 196 274 20 -483 -632 -459 -119
2221 -119 350 352 -32 268 -11 658 -92 -797 -660 -180 410 792 282 -20 -54 -296 -66 -490 -528 -362 -187
2242 -187 572 561 306 408 -121 -501 -95 -589 -230 317 276 716 202 -173 33 -473 -402 -292 -509 -89 398
2263 398 806 690 48 -430 -389 -794 64 132 -236 164 158 506 250 -627 -325 -563 -256 83 23 230 709 314
2285 314 332 15 -529 -432 -296 -48 420 -90 349 517 47 -223 -320 -752 -203 9 153 518 -79 88 281
2306 281 130 163 -701 -657 -21 229 567 447 -137 18 42 -247 -283 -560 -312 154 94 575 297 -294 626 -337
2328 -337 -377 -302 -263 150 857 393 136 -185 -187 79 -127 -183 -72 -386 492 713 308 144 -549 -479 -146 -478
2350d78M74n0k0O53k67l15M8n88M00j5P9k5m9K60O32o44j92m46j08Q93j84K2j42
2373f2j8K96K12n64j65l62N7P45J04P7k20P3P1j44m89L4o7L30L32l88M88j56J45
2396C29o9o14K42m79L70P64q4n64L71k76OK04n56k40K48M19N33Q5p52J69m39J43
2418a90J66k92K20k19O00L56l01l73R1j79j06%k87O42L72j77K11p34K6k4P2P6
2440e0p7j14N34j15N77n15o09J36K9j78P62l27p7K81l05M12m18n46K02j58L48
2461b08M26l71N73J23l52J25o19r7L24p0L86j68k6J89N2o8j67o04J76K38M87Q2
2483D31j20l12j2J01n6r0l27R5K68J04L54j06k31j97k44J55L15l69M19p9Q4J36
2505C19n78L8O27o11j16q3L58M08l3J6k06n63L41n1R0M2j94L61L92k06J1m76j42
$$ plain form
2350 -478 -4 -54 -74 579 312 -3 45 -543 -143 -158 -79 -104 -153 107 739 95 -97 -543 -651 242 58 80 -62
2373 -62 -80 216 428 -136 -301 -663 -606 139 243 320 100 173 244 100 -389 -355 -422 -92 240 -148 340 184 329
2396 329 260 -354 -112 -591 -221 543 459 -105 266 -10 -4 200 -356 -596 -348 71 604 689 -63 106 -333 -190
2418 -190 -24 -316 -96 -315 285 641 340 -33 58 -121 -227 -227 -514 128 500 323 534 -200 -174 -198 -126 -50
2440 -50 -127 -241 293 178 755 240 -369 -233 -204 -382 380 53 -24 257 -48 364 -54 -600 -398 -556 -208
2461 -208 218 -153 420 543 191 316 -303 -400 -76 -146 240 72 46 235 287 219 52 -552 -376 -138 349 431
2483 431 311 -1 -13 88 32 -58 -385 -290 -22 82 436 330 99 -98 -342 -187 128 -241 178 99 183 319
2505 319 -259 -221 406 -205 -321 -404 -46 362 329 345 139 -424 -83 -134 -44 -2 -196 165 557 351 362 -114 -256
2528b56r1J14O3K62o0K38J13l77j8k26l8K83j84K34j5J1Q43m75k66k30m28P4O11
2551A82k72M68j04m33P51l04k32j14l55K72L06J7J97l41M2R2n97K78Kj75M92R9
2573B71KK47m15Rk12k47O0J33L14M3l6j87R0j73J81j87k68N9K14J89J32J04j79
2596A44k41l12N44n62K93K13j16J83q0q3L5m15L16n0QK01J1K45K66l74n13L47
2618F0p5k69L22j31K50k49K84K83k92l12L9m79L75N16k09l9J8NN1j17j70j02P7
2641a64K77l34M04O0pl23K43l54K01r0K73J8j78J67R9k21j64q3l02M82j73J66
2663cL83l82n1q0k86K42L2q0M02j03J12J43l54L94l29q6J40l49J74K21q8K59j74
2686A37k61J00l91K54P5j68L99J95p6k0m81J59J32j37k07L80J60j2r8n5J30o54
$$ plain form
2528 -256 -347 -233 -170 92 32 270 383 6 -12 -238 -276 7 -177 57 42 53 896 421 155 -75 -503 -429 182
2551 182 -90 378 274 -159 592 288 56 -58 -413 -141 165 182 379 38 80 172 -425 -147 -145 -320 172 271
2573 271 273 520 105 114 -98 -345 -285 -152 162 205 169 -18 72 -101 80 -107 -375 -316 -102 87 219 323 144
2596 144 -97 -409 135 -427 -134 79 -37 146 66 -17 18 -397 -81 -131 -123 78 89 334 600 226 -287 60
2618 60 -15 -284 38 -93 157 -92 192 475 183 -129 -90 -569 -194 322 113 74 92 97 148 31 -139 -241 -164
2641 -164 113 -221 183 243 236 -87 156 -198 3 -87 186 204 26 193 292 71 -93 -176 -478 4 -169 -3
2663 -3 380 -2 -53 -133 -419 -177 -145 -225 177 74 186 329 -25 369 40 -46 94 -255 -81 140 52 311 137
2686 137 -124 -24 -415 -161 -86 -254 145 340 264 244 -237 -78 54 -83 -290 90 250 238 140 85 215 -439
2708d39R1J84j83M50J33k02L12j98k05L9k74P1J02n5J41J06J85J4j72j8k14j99
2730c31J13J85OL19k41j23Q7j26J06j52PNJ74N5J53j32L1l24o4m8Q1J89M5j86
2754a71L48k11k03L16o60Q7K34J42L65J34l10l0L5j15j15N0Q5j13J3K92j18oN7
2777A06l31K77l19O5L43j07R4L3k09J0K07k30K7j01k4J79J65J67L0l24j33o8M0
2800a03j0j94L69J92k90J16R1k13J48l42K00K98k76K68J32m52J92r0k57j29KL02
2822d6K01j60K33O8l55M4l40K46m6p4O71l92o2J78m23R1j32k9k06N67L5J70J05
2845C44j80J35n15J63j87M6L15K2RJ53m07J42J2Q8k57J02J08L28j01j39P2j19
2867A34m27K66Oj1q1j04L59j83J97j64j55Q9p1P0K74j77J11J28l00l4K71m35K04
$$ plain form
2708 -439 -348 -164 -347 103 236 34 346 148 -57 -18 -292 -221 -119 -174 -33 73 258 272 100 82 -132 -331
2730 -331 -218 -33 -27 292 51 -72 15 -111 -5 -157 -150 -145 29 84 237 105 136 -188 -252 -300 -219 -30 15 -171
2754 -171 177 -34 -237 79 -581 -494 -260 -118 247 381 71 41 76 -39 -154 -104 -19 -132 -119 173 55 49 106
2777 106 -225 52 -267 -202 141 34 128 161 -48 -38 169 -61 -34 -135 -159 20 185 352 382 58 -75 -143 -103
2800 -103 -113 -307 62 254 -36 80 171 -42 106 -236 -36 262 -14 254 386 -66 126 36 -221 -350 -348 -46
2822 -46 155 -5 228 296 -59 -15 -355 -109 -155 -229 442 50 -12 166 -257 -166 -298 -327 -533 34 69 239 344
2845 344 164 299 -216 -53 -240 -194 121 143 152 305 -102 40 52 140 -117 -15 93 421 320 181 253 134
2867 134 -293 -27 -21 -32 -113 -217 142 -41 156 -8 -163 -74 -145 -75 199 22 133 261 -39 -73 198 -237 -33
2890c3o7J93j04j29L05J33l16j5l1M1J27j52J33J15o5Q2l38L83j15n06L41O7k08
2913a59M64j6l43J08j72J12Qn9m8K00k75K05j76K08j39o2K09k57P1J68O7q2J47
2936A79q7n5l59M42k89m1m5M27K8k6K0k58J69m17L70N5j96K50O5j95K44k42m78
2959d39L46O0jJ26R7o8k84J24J39j09Kj33l6L96o2k29L53n60K74l1l07K71N4M8
2983C1K45k96N2J06j58J55l09R4L39j82J8L42j45l20J9k03K9j15o5N22k01J28
3005H6N0k72J96L6l14L97j91J23Q8k44r9J74K5pQ2l39Q2O3K98j14j12Lp6j47J87
3030b5j51MM20k4j40L4k14L11m42L67Jk44J71J04n6n2r7O9j57Q7l2L3k22L66j18
3055gj71K16k51P1p9j78K70J05k8L74l23k94K41j83L73j53l4Rj60K44K12k30j62
$$ plain form
2890 -33 -100 93 -11 -140 165 298 -18 -33 -64 -23 104 -48 85 200 135 217 -121 262 147 -359 -18 49 -159
2913 -159 305 289 -54 54 -118 -6 2 -57 -105 95 -180 25 -151 57 -82 -144 65 -192 -121 47 114 32 179
2936 179 92 37 -322 120 -169 -210 -255 172 200 174 194 -64 105 -312 58 113 -83 167 232 37 281 39 -439
2959 -439 -93 -33 -34 92 189 121 -163 -39 100 -9 -7 -140 -176 220 158 -71 282 -278 -4 -35 -342 -71 -17 31
2983 31 276 -20 32 138 -20 135 -174 -80 259 77 95 437 292 -28 -9 -212 -183 -298 -363 159 -42 86
3005 86 136 -136 60 96 -218 179 -12 111 199 -45 -144 30 55 48 130 -209 -127 -64 234 120 8 11 -65 -212 -25
3030 -25 -176 -172 248 224 84 118 -96 215 -227 140 141 -103 68 172 116 64 -33 36 -121 -34 -66 -33 -255 111 -7
3055 -7 -178 38 -213 -142 -221 -399 -129 -24 -52 322 -1 -295 -54 -237 136 -17 -51 -42 -202 42 254 24 -138
3078a38J02m04M32r5k07M71j10L66k52j7q2m72M57j84K07o6J55q8k0K2l12L89
3100A54r9l28L00J9j04J36j2q0k78l9J52N1K13J36k51K48k56j09M41n28K11o1
3122h4q9K20J96j18P5l77J33j92RN29l80J73J18k62o1K04l25L41m39J8N95m25
3144a41J12J04j45p0O0n2j8J94k46L24j63K3K12j33j10k36R4J50J77Qj36j75L82
3167B15k46r8Q2l16J68L15O3k2k0k01j2r7J09l0k2K60M7j56j20P1j72M71l68j20
3191a99K72j9r8P3L8R4l60J05N9j18N4K73Nk32j22M88n21J74O2K4l75K73K00k03
3215e3J88O5j98J06l58L30J44m13K28J82j54J58j06M6m92J57L95k49KJ58j53J13
3237I6k27K40m2l10pK42j26K49p8k14L45l27J10j35J61N6K9j43K39j04q7J11l31
$$ plain form
3078 -138 -36 -440 -8 -103 -310 161 51 417 165 148 66 -406 51 -133 74 8 163 75 55 77 -235 154
3100 154 55 -273 27 46 -58 78 66 -14 -292 -331 -179 -128 85 221 -30 218 -38 -147 294 -234 -23 -84
3122 -84 -173 47 243 125 200 -177 -44 -236 -227 302 -78 95 213 -49 -110 94 -231 110 -329 -311 284 -141
3144 -141 -29 75 -70 -140 -80 -132 -150 44 -202 122 -41 -18 194 61 -49 -285 -191 -41 136 144 8 -167 215
3167 215 -31 -129 -47 -363 -195 120 183 161 141 -60 -72 -169 -60 -90 -112 148 195 39 -81 -10 -182 289 -79 -199
3191 -199 73 54 -44 29 67 161 -199 -94 -35 -153 -99 174 179 -53 -175 313 -208 -34 28 52 -323 -50 150 -53
3215 -53 135 200 2 108 -250 80 224 -189 39 221 67 225 119 165 -327 -170 225 -24 -22 136 -17 96
3237 96 -131 109 67 -243 -250 -8 -134 115 37 -177 168 -159 -49 -184 -23 33 62 -81 158 54 -33 78 -253
3260b53M70M5l08Q2n7Km8p5J91mj03R8j9K30k11R7p5QJ01k12J72j26l7j4J93N3
3286B00k75R8j16R7R6j43K8M2J30j40M54m87O5p6n6j9j35O5J62OJ25r7j01M1j51
3311a87K13K0k23L56l78N5K96k41j1L83o56N00Q1l68L19o0l70K23M8j99L53j67
3333a3l7j9M3K39l97K7J06j15J38O5o1P0m7oM19m96P1j6j74L23m9m0J4K07M6l02
3359dj53J20l14J94M17k89n9J99j52PL01k72J76l4k25N6K7J51j52j89L24O3k42
3382e0J89k64J5Q3P5j81J17N8J56k96L47j81P6L0j67j9j23m7o4J13J30J90m00
3405b13J94M01o18J65K95n00J74J18O2J10n6n7J81j99J12m54J96P1k8m4K00l8
3427G2k30R6k23L43n9k4J7m8J62k78J50L5Ok64Q4K11j51K18j02J20J78n35K31
$$ plain form
3260 -253 217 262 -46 36 -21 -19 -67 -142 49 45 -58 40 21 251 40 137 62 70 171 -41 131 5 -32 -46 147 200
3286 200 -75 23 -93 4 100 -43 -15 27 157 17 471 -16 49 -27 -83 -102 -237 -172 -10 -4 121 24 -77 -36 -187
3311 -187 26 46 -177 179 -199 -144 152 -89 -100 283 -373 127 208 -160 159 99 -271 -48 0 -199 154 -13
3333 -13 -50 -69 -26 213 -184 -157 -51 -166 -28 37 -24 46 -1 -7 412 -84 -13 -29 -203 120 71 31 45 252 298 -4
3359 -4 -157 -37 -351 -157 260 -29 -88 111 -41 -34 267 -5 171 137 -88 -32 -5 146 -6 -195 129 192 -50
3382 -50 139 -125 -110 -27 48 -133 -16 42 198 -98 249 68 144 174 7 -12 -135 -182 -246 -133 -3 187 -213
3405 -213 -19 382 -236 -71 224 -276 -102 16 78 188 132 75 256 57 169 -285 -89 -18 -46 -90 110 72
3427 72 -158 -62 -285 58 -1 -25 -8 -56 106 -172 -22 13 19 -245 -161 50 -101 117 15 135 313 -222 9
3450IKk46L18k00K64Kl10N73p28R1J91j97L55J64r9p9q5n7m2K41k00K2p5k1K86
3475A79j58J34l39L38j56q7K22kk45M31n21R6K01M2o16L38J31O7P5j35J00j04
3497il2Rj14L51n13L09O1j87K98lk72P3m2k33K43O6K7j53J19M9j65NJ21j33l1
3522a56J28K78q9Q0l04o0qR4q8J16PL0q2L9mLJ83p6j82M6q2J08J33k31J91ok14
3549a46J25K58j98k39L20j36R7l39M34k48J75J90l72K53j52k89J74L02m9j66n4
3570f0J42k12J15j75J83j08M67m12J58j76m6K23l8j66m8L23l45K40r6J42l47K10
3592b6O0j33Q2K17k83J12n8M0j09O8Q1j81M32m48J13J92o4l19J90J09J73j16O2
3615A94l44P8ok0q4K59r4O8J49N9j11m8m6K9M4l09j35J73N6K07k38q3K59j25k60
$$ plain form
3450 9 11 -235 83 -117 147 149 -161 412 -316 -225 -34 -231 124 288 189 110 25 -32 -74 167 -33 -11 -86 -107 179
3475 179 21 155 -184 154 -2 -89 133 131 -114 317 -204 -108 93 135 -481 -143 -12 55 130 -5 95 -9
3497 -9 -41 -32 -146 205 -308 1 62 -125 173 170 -102 -29 -71 -304 -61 5 32 -121 -2 47 -118 -113 8 -125 -156
3522 -156 -28 250 161 241 -63 -123 -131 -37 -125 -9 -2 28 -54 -15 -19 -16 167 91 -91 -45 -127 -19 114 -117 74 68 -146
3549 -146 -21 237 39 -200 120 -16 81 -258 176 -72 103 293 -79 174 22 -267 -93 209 160 -6 -60
3570 -60 82 -130 -15 -190 -7 -115 352 -60 98 -78 -124 99 61 -105 -153 170 -175 65 -31 111 -236 -26
3592 -26 34 -99 -17 200 -83 29 -29 11 -98 -30 51 -130 302 -146 -33 159 95 -224 -34 75 248 132 194
3615 194 -150 -72 -78 -98 -182 77 -17 51 200 259 148 100 54 83 127 -182 -317 -144 -88 119 -119 -202 57 -68 -328
3640c28K56L54k81R4N2J4k90K27L08n05J36J83l34k0J82k58J61J01k03O6q5N8
3662a12j82Q5q7L56p3K86l21J50k92J66N3M9j46K29p9j09P1J06k59j10J80J25
3684H6K32l49R7J00o63N39k02J61P8r8P8q4j65K79r2J54l98J24J92J6l02M64k19
3707B8J33j97l49K00K57k42l4K12j08K56N8l6k80o2n2L57n7j00j56K70j18j57
3729a77L87q4r6m6K08j92O7K2J11o6j04J16j69q5K96j83P9m7n8O1r1O1m4J40k45
3754a39N6nL72l79j54J02j58K89N2k49L99j73R2j47J70L8l46KM65l63q0K19k74
3777b11J88k13K24j0J27R3j74k2q9J41k3j09l8K6L41n68M16j92L8J18K0J11l51
3800a57L93m31L25j79j35K65J03l11n7K32P4l1p3J82k95K16rq7K46n03o3L33k23
$$ plain form
3640 -328 -72 282 1 95 147 161 -129 98 406 -99 37 220 -114 -134 48 -210 -49 52 -151 -85 -170 -112
3662 -112 -294 -209 -296 60 -13 273 -48 102 -190 -24 29 78 -68 161 82 -27 44 150 -109 -219 -39 86
3684 86 318 -31 66 166 -497 42 -160 1 79 -19 59 -25 -190 89 -3 151 -247 -123 69 85 -217 247 28
3707 28 161 -36 -385 -185 72 -170 -204 8 -100 156 214 178 -102 -164 -216 141 84 -16 -172 98 -20 -177
3729 -177 210 126 30 -16 192 0 67 89 200 134 30 146 -23 -108 188 5 84 37 -21 40 -51 10 -34 106 -139
3754 -139 -83 -88 284 -95 -249 -147 -305 -16 36 -213 186 13 105 -42 128 166 -180 -178 287 -76 -156 63 -211
3777 -211 -23 -236 -12 -22 105 198 24 2 -87 54 31 -78 -116 -90 251 -317 99 -93 -55 63 83 194 -157
3800 -157 236 -195 130 -49 -184 81 184 -127 -184 48 122 91 18 200 -95 121 112 25 271 -232 -295 38 -185
3823a85J84K8l1K25n26K90n7PJ33j37p6N7M4k0R5p9J5R6j60pK74m13K50K9J32
3848A68l95K86k9n3j22J70oNO5k54J61p2j71J04K2J45J62m34K23r8K48j36K38
3871B27l96N6R4J05P5j6j18j41n3J69J26j51l7K55j11l08J30ML0K31l36j29L52
3894E8J42k60q8J29J36k13J56K7l2j8J19l64K58J5j44K23q5M0l67K9O00k33j85
3917e7K43j15j68RR5j54K79j99J97k62K18R9j66j04q8J87k88J97k86O70l33l5
3939f1O2m1j05K45j36n9K22j03J50m39K16P0N0r3Q2j72m9M92j40l43K13k97N90
3962C54n10K06O7j17J11k21K3Q4p4NK57k55J72l0j33j21K06l0J80j22l6q5r3R7
3986f5K71K2j87m55M02p4n0M4J83j68o9J14O0q8K13k5j9k25K32o3j26j07J41K62
$$ plain form
3823 -185 -1 27 -4 221 -305 -15 -72 -65 68 -69 -145 -88 -44 -64 31 -48 -33 63 -97 -104 170 -243 7 36 168
3848 168 -227 59 30 -23 -145 25 19 24 89 -165 -4 -76 -247 -143 -121 24 186 -248 -25 -123 125 -11 227
3871 227 -169 -113 -19 86 161 145 27 -114 -167 2 128 -23 -60 195 84 -224 -94 -90 -60 171 -165 -294 58
3894 58 200 -60 -148 -19 117 -96 60 87 55 37 156 -208 50 65 -79 144 59 99 -268 -239 361 128 -57
3917 -57 186 71 -97 -88 7 -147 132 -67 130 -132 86 185 19 -85 -173 14 -274 -77 -363 307 -26 -61
3939 -61 1 -40 -145 100 -36 -95 127 24 174 -265 -49 21 71 -22 60 -112 -161 331 191 -152 61 -236 354
3962 354 -156 50 117 0 111 -110 -87 -3 -77 -72 185 -70 102 72 -61 -182 24 -6 174 52 16 -69 -162 -65
3986 -65 206 228 41 -414 -12 -86 -136 -92 91 -77 -146 -32 28 -60 153 128 109 -116 116 53 -73 -180 -39 223
4010B23n2L7j01j69J15L7k17M09j61MK0k94J68N2j97J60J11J6m10J77J46J80j85
4033F9O1Q4l4L8j34M7n2j04Q5J05k55m7J96r5J5R7j02j41J13j70K35J18j5l1o4
4058A9K5J11k02J51K3o9j32j03mK52k18L04j88l3J10P7J00j74K37l40k37K60J05
4081G4n8l2l85O06k32J37k49J07Jk44L32j21J23Q5j83K21j4k22J95m14K94O3O2
4104A46Q9m27J61J45j31K6k42K27R2l65L35Ro2K1p0J29j6P1k68K47J16pl27J68
4128F7k8Jl40K01R7L2Q3k09J72L7j21L08r7k98J67o0J80j35j33K07j23k62K81
4151B7nj86J44R7K96m91K08r9j03J25N0k21p5O2K49j92J73j56K3Q5j86j29K47
4174e7J24r3L46k72n4K16m08J63R0n8j29Q3J79j89P5k8j0j00J69n3L7O7M0j51
$$ plain form
4010 223 171 208 107 -62 53 90 -127 282 121 125 145 -149 19 71 -126 34 145 161 -249 -72 74 254 69
4033 69 130 214 180 218 84 131 79 -25 60 165 -90 -137 59 -36 -21 76 -26 -167 -54 -224 11 129 114 83 19
4058 19 44 155 -47 104 127 58 -74 -177 -181 71 -147 157 -31 -64 46 123 223 49 286 -54 -291 -31 74
4081 74 16 -16 -401 205 -27 110 -139 -32 -31 -275 57 -64 59 144 -39 182 168 -54 141 -273 21 84 146
4104 146 235 -192 -31 114 -17 9 -233 -6 86 -279 56 65 3 24 -46 83 67 138 -130 117 233 226 -101 67
4128 67 39 40 -300 -99 -2 30 113 -96 76 113 -8 300 203 -95 72 12 192 57 -76 131 8 -254 27
4151 27 22 -164 -20 77 373 -118 90 -9 -112 13 63 -158 -233 -171 78 -114 59 -97 -74 11 -175 -304 -57
4174 -57 67 -26 320 48 -6 210 -198 -35 55 -3 -132 -49 130 -59 16 -12 -22 -122 47 -6 31 98 138 -13
4198a3K7j31NJ40L5k07m7M13j30L7k56K96k67J20k57K5K79l8r8L12k03K75l24
4221gP9j51J69j42jl7K44j73M5j9m36L38R4m6kJ39p3Lr2j11Q2M9J14m6L15m0l31
4248c6j11jK66J5j83k22L73j47K43j41j94L89q9n0k44K56k53J82K14l86p1J01
4270h9R0M24o72K36j32P4P8j60J21J35k68n0L06j2K68j98j82m5K65K8k40k50M62
4293A89k39N6K79l30M48k13k48K00j75j1Oj06R2J61m9j78J15j24j19J13J17K15
4315A99k82j45J17Q2J16j38o2P2J60k7j11Q0P8p6R3k32K1M3j82K70N3q4n5L3j36
4340a13J36J47j71M94n99j79N25m61K05J09L3l19J8QK91k32O0Q4j34L14l69J15
4362c8q0J12j21K40j39j7J83k48j53J88K46l86L25j87rK63j99L30l54K15M8j70
$$ plain form
4198 -13 14 -117 -112 28 63 -144 -191 222 92 129 -127 169 -98 22 -235 -210 69 31 -67 245 42 317 -7
4221 -7 72 -79 90 -52 -53 -90 154 -19 26 7 -429 -91 3 -43 -45 94 21 24 -68 -179 -97 -48 66 20 335 295 -36
4248 -36 -147 -148 118 133 -50 -272 101 -46 197 56 -138 251 162 112 -132 124 -129 53 267 -119 -190 -89
4270 -89 1 425 -247 -11 -143 -69 9 -151 -30 105 -163 -213 93 81 349 151 -31 -76 189 217 -23 -273 189
4293 189 -50 6 285 -45 403 190 -58 142 -33 -44 -38 -144 -52 109 60 -118 -3 -127 -246 -133 -16 199
4315 199 -83 -228 -111 -29 87 -51 -113 -41 119 92 -19 61 139 63 156 -76 -55 -12 -194 76 129 45 -10 23 -113
4340 -113 23 170 -1 493 -106 -285 240 -221 -16 93 126 -193 -175 -167 124 -108 -48 36 -98 216 -153 -38
4362 -38 -118 -6 -127 113 -26 -43 140 -108 -261 -73 173 -213 112 -75 -84 179 -20 310 -44 171 219 49
4384D9k91M57l20O7j10N8k51K03J31K20k28N8k76M9N0K37Ok57J08P6K59k04j04
4407a3L0K4P0k23j43L00J04k42K68j10j74J32k1K2j70J68k87K34Q5j78L83m60
4429b01m7QJ81K75l18J15j32K26l07J76L26k46J54m53L43k57L0K78m9j42P7J2
4451D9K18k96K29k49j11J78J08m5N9K8m29M23k31j36M25n42L91NL5N9k01O2M9
4474G8k64J29l1Q0R1k03P8K64j38pj21P3k01R6J8LJ39k0j23j30K05J9L5k88J94
4499b4N2k13K94j74J03J08Q8j65m6P8k60M36k74k28L85k42J82Qj03k0o1j63K95
4522E6j49J91j44J41j2J01j07j75P0j73K21Q1j88Q2q3K26o3j07ok57L51k15L34
4545A75l01k54M13Om8k1K7M8J7l4j04p3J23R1M9j09j32K01mj63o9N5L23P8o30
$$ plain form
4384 49 -242 215 -105 -38 -148 -90 -341 -138 -7 213 -15 43 -233 -184 -134 103 109 -148 -40 36 295 91 -13
4407 -13 17 41 111 -112 -255 45 149 -93 175 65 -109 23 2 24 -146 22 -265 -31 54 -124 259 -201
4429 -201 -248 -240 -59 216 -102 13 -119 107 -200 -24 302 56 210 -243 100 -157 -127 151 102 -40 37 49
4451 49 267 -29 200 -49 -160 18 126 81 140 168 -261 162 -69 -205 220 -322 69 74 109 168 -33 29 78
4474 78 -186 -57 -88 -8 83 -120 -42 222 84 77 -44 29 -172 -76 -58 -55 84 64 -59 -189 16 35 70 -218 -24
4499 -24 28 -185 109 -65 38 146 234 69 23 101 -159 277 3 -225 160 -82 100 108 5 -15 -76 -239 56
4522 56 -93 98 -46 95 83 184 77 -98 -28 -201 20 101 -87 -5 -88 138 75 -32 -38 -295 56 -159 175
4545 175 -126 -380 33 39 -9 -30 -3 45 62 28 -76 -149 -26 65 114 5 -127 74 70 -93 -162 -107 216 294 -336
4570c36N09k87J04M3j0K55j49r8K07m12K59J85k53j5j13R4j9n7j7pL8J50k15J12
4594c2K3J26j70K65k25j96K66j63l0j74k1K46j2J37j15J56p9K6J14L0r1j03q4
4617a06j44L91k44R7k28L03j38J10r0J59j09J11l6k29qJ66J68q7k01K00j86n3
4639a54Q2n9j20K55p4k6O9J26p8L8O0m7n9k36J98R8o1k3m4N2J61j80K12j73K8
4664D5j00J00O0M8K2J3j29j46j1j50K85o0R4k87O7K72k2r5j77K14j87J22P2j25
4688g5j5L8Q2k26Q9P0ok43L51J1j03p1J34K2J31k97n9L77l53M18r0j69R5N5j68
4713bj9k59L7J79Oj03K34J59k99J79j14n4o2J43k51K43k38L40j4m59L45L6J36
4736A63j50K87p7k08K10k97J24P5j90K03j08j03J01j25J73j6j82O9J07m1j0L2
$$ plain form
4570 -336 173 -114 -10 33 23 278 129 31 238 -174 85 270 17 2 -111 -17 -36 -93 -110 -117 -79 71 -144 -32
4594 -32 -9 117 -53 212 -13 -209 57 -106 -136 -310 -331 -85 -97 40 -75 81 2 28 142 172 81 -22 -106
4617 -106 -250 141 -103 -6 -234 69 -69 41 -49 110 1 112 76 -153 -161 5 173 86 -115 85 -101 -154
4639 -154 -72 -131 -251 4 -70 -96 -27 99 21 59 119 72 13 -223 -25 73 12 -11 -55 -3 158 -22 190 17 45
4664 45 -55 45 105 153 175 188 59 -87 -98 -248 37 -23 71 -216 -149 123 101 6 -171 43 -144 -22 50 -75
4688 -75 -90 -52 30 -196 -107 -37 -43 -286 65 76 -27 -98 36 58 189 -108 -167 210 -143 275 185 16 111 166 -2
4713 -2 -21 -280 -243 -64 -58 -161 73 232 -67 112 -2 -56 -118 25 -226 17 -221 119 105 -354 -9 27 163
4736 163 13 300 223 15 225 -72 52 127 -63 140 32 -71 30 -95 78 62 -120 -51 56 15 5 37
4758C7J61j51J09M4o1k13l4M50l26pJ3J98k65o8p8j25N36k58O1P5k07K75l27K15
4782E4j31J75p8l30K83J6n7p9p0K84j00p4M8Q8m4J10k00L32m01L94k48M9Q8k78
4806a69j6O9n9J41J92j22J8K6J4j27l7r7K07r1Jj16J09J15p0L4J15K1p6j39J36
4831G9j8p7OJ83n5k00K82l98L15j30j9J27L5k65p3Q3J76k06J95l0N9k03J19K22
4855B07j47l8J39k7k1K2j04o1k9P3j1J03n0p1R2K01l53J66l21N7J1K74j76R2R7
4880A25k35J58Oj89J74q1K4RJ68r8j30J13l2P8k01q6J86k33K65J68k31O5k39K09
4904gl8O5k1R6Kj71m2J05o7J64N5lk35J80K2j28O9R4j93M6j0n4q4K49m9l6K09
4931B18j29l02L03N9m9j51J93ro7j9J71j20k31K59q4K00m3k91J59j07j52P5O1
$$ plain form
4758 37 198 47 156 200 139 -74 -108 342 16 9 22 220 -45 -113 -191 -316 220 -38 23 98 -109 166 -161 54
4782 54 -77 98 20 -310 -27 -11 -68 -147 -217 67 -33 -107 -59 29 -15 95 -105 227 -174 220 -28 21 109 -169
4806 -169 -185 -116 -175 -34 158 36 54 80 94 -33 -70 -167 40 -51 -50 -166 -57 58 -12 22 137 158 82 -57 79
4831 79 61 -16 -10 173 118 -82 200 -198 117 -13 -32 95 130 -135 -208 -125 51 -155 40 10 69 -134 -15 207
4855 207 60 22 161 134 113 135 31 -30 -59 14 3 106 56 -15 77 278 -75 91 -230 -173 -162 112 -64 28 125
4880 125 -110 48 54 -135 39 -42 -18 -9 159 61 -69 44 12 90 -111 -197 -11 -244 21 189 -42 23 -216 -7
4904 -7 -45 20 -1 95 97 -74 -116 -11 -78 86 141 138 -97 83 105 -23 46 140 -53 -7 -17 -71 -155 94 45 9 218
4931 218 89 -213 90 149 100 -51 142 133 66 47 218 98 -133 126 42 242 199 -92 67 -40 -192 -117 -56
4954e6K53p5J14j71J31k26n1K09k10J75P5j15r8j23K82q0l29L62j01k50L54k91
4976b21L33R9j04j99l6J49l45N28Mm15R5J74p5p5K68j66M2M1l79L59N1L7m6J03
5000B22j61Q0j76j69J31o6R0Lj4M6j52NJ74o1J80j79K38j59k70K92K95l40K76
5023B85j90k28J96r0r9N85m82K21j26j25L56m02q0K05K7j53K3J04J14n7J54j99
5045C9Pj86K11j86J78j23j16k8K86r9O6n1P7k79L0K05J11l56J88R8n3k3m0J09
5069F5J71j17p9k06J27M2j8j31r3M40l63J69k77m4J99M57m85P0l7lK7r7K85k85
5093a83L01N0j23l20K19l8J33K63l92j22J17J46o9k1N2r2R0n9J40j32k02M66j94
5116C0k02M10K52k50n73K65m2K93l14L12l00L57n9r5k37K3J63J81l3J1o4q6k22
$$ plain form
4954 -56 197 122 236 65 196 -30 -81 128 -82 93 168 53 -45 -168 114 34 -295 67 -34 -284 70 -221
4976 -221 112 211 107 -92 -128 21 -324 204 208 -207 -112 62 -13 -88 180 14 56 97 -282 77 128 165 119 222
5000 222 61 141 -35 -204 -73 -139 -49 -46 -60 -14 -166 -161 13 -48 132 -47 191 32 -238 54 349 9 285
5023 285 95 -133 63 -27 -126 459 -23 198 72 -53 303 -99 -179 26 53 -100 -77 27 141 84 238 39
5045 39 46 -140 71 -115 63 -60 -176 -204 82 -17 49 -2 75 -204 -174 31 142 -214 -26 72 19 -4 -44 65
5069 65 236 119 40 -166 -39 3 -15 -146 -239 201 -162 7 -270 -314 -115 342 -143 -73 -110 -113 -86 -183 102 -183
5093 -183 118 168 45 -275 -56 -94 39 302 -90 -212 -95 51 -18 -39 13 -79 11 -48 92 -40 -242 224 30
5116 30 -172 238 490 240 -333 -68 -110 183 -131 181 -119 238 179 84 -153 -130 33 214 181 192 128 42 -180
5139a80k3K6L13R9k13j21j3K19J35k14j43KK07j3l82J03M59j02j49P4j92M40k9
5162C03j45k59jK29j06J2L2p2K25n04K97l6K3J45q5k47J96n2J41%p7J7Mm1J34
5187A33J1o9L0l2k9J6l09K88j4P1Ok84J0J98O4r5M6O5Q8j71r8J17j35J29qj94
5213a66K11j17J10K04m17J78J49m1l1m0k53L90l5K8k5m48K24M4n1J59j04J74j42
5236Al2k4kk2L03m23K94mj63kJ68q8j12J08k1Q9m3qR6k29Q5OJ01j12nn8K43J61
5264C07m40n1J38J14p0M5j07L6q0J12J23r3k7K87l51j1N5P2q6J23OO0j29j59R3
5289c3L7r0K25n7j50J74l59J68J15j11j29l2L63k32l6J51j8L00j03j75n8K2J90
5312A62M7o5j87J31q9J71l09N1J75p5j20K11j36K2j16O4P9k2j04L4n8J97k29J65
$$ plain form
5139 -180 -203 -177 136 235 22 -99 -112 107 242 28 -115 -113 94 81 -301 -198 261 159 10 84 -108 332 303
5162 303 158 -101 -102 127 21 33 65 -7 218 -286 11 -25 -2 143 58 -189 7 -45 96 96 19 36 40 -1 133
5187 133 144 75 105 73 44 60 -249 39 25 96 102 -182 -172 26 90 -5 41 106 194 23 -75 42 -93 36 28 -166
5213 -166 45 -72 38 242 -175 3 152 111 80 40 -213 177 142 170 145 -303 -79 -35 -86 73 -31 143 1
5236 1 -31 -55 -57 -79 224 -199 95 91 -72 -74 94 6 -106 2 -19 70 27 19 115 -114 -29 -23 78 -34 -39 -97 146 307
5264 307 -133 -184 -46 68 -2 43 -64 -28 -108 4 127 34 7 294 -57 -68 -13 59 -27 96 102 162 33 -126 -33
5289 -33 4 -86 139 82 -68 106 -253 -85 30 -81 -210 -242 121 -111 -147 4 -14 286 183 8 -50 -28 162
5312 162 209 144 -43 88 -1 170 -139 -88 87 12 -108 103 -33 -11 -127 -63 16 -6 -110 -76 -134 63 -166 -1
5336aj87P0K15J2l25m1J10J7J18q5J40l0j6P4qk4o5J08k04J19j49L48l17L1Q0
5361a0N8j72J16J03K2j25J58l91K50j56P0M6J1K38k24k85L52J33l35J48J4J11
5383A32J43l31J11m4O6k14J30j61K41q6Q1j38J5J53J83k97J07n3K1J5j72K74k45
5406f9J90l6j66l79L56o0K27L43n43J9j27M39j77p2J66j48j21L41k52J02j91o1
5428b19N57l74k93M39p6j54k4L21j94K7o2J83r1l25K07K08L7J21j48N8l01Q2K10
5451A89j10k21J14K6J17N7l00jLJ35n8j1O1j6j76L6K40j07j61J07k16L16k43K69
5475E0l6l6J14k0J04l85J81L54k05k70P5O6qK90k80J30J09j12J4l42K96J77m20
5498a54Q7J69k23L84k08j49K08q2K0j99P0m25N90p3k24N40k38j85j34M36k02J4
$$ plain form
5336 -1 -188 -118 97 109 -216 -257 -147 -130 -12 -97 43 13 -3 71 63 39 -26 82 -122 -3 -152 196 -121 -90 -10
5361 -10 48 -124 -8 95 117 -8 150 -241 9 -147 -77 -31 -20 218 -6 -291 61 194 -141 7 21 132
5383 132 275 -56 55 11 77 -137 -7 -168 73 -13 68 -70 -55 98 281 -16 91 38 59 74 -98 176 -69
5406 -69 121 85 -81 -460 -104 -164 63 406 -137 -118 -245 194 17 -55 111 -37 -158 183 -69 33 -158 -219
5428 -219 338 -36 -329 110 34 -120 -144 177 -17 10 -52 131 40 -285 -78 130 167 288 140 198 -103 -21 189
5451 189 79 -142 -28 -2 115 172 -128 -129 -126 9 -49 -60 1 -15 -191 -155 85 -22 -183 -76 -292 24 -219 50
5475 50 14 -22 92 72 176 -209 -28 326 121 -149 -74 -8 -16 274 -6 124 233 121 135 -207 89 266 -154
5498 -154 -67 102 -121 263 55 -94 114 32 52 -147 -77 -502 88 15 -209 331 93 -92 -226 210 8 22
5520B2rJ55l04P3R8j26K43Kq4j63K33k72J04j78L37L0j67K30l62J85r0K9j94J88
5544b0P4k6j91R1K08r0j76J70J02l00l4J67j04J39q2j5J52L4o7j67r0L24l06J04
5568a03l6M4L48l59L35j76k4R9k18l6RJ03K8j58L5K93j21k29K18j16K18k71J03
5591a4P7k49J02J82j41J63J8l65L46j79Q4J07j87M40l66Q9Lj92O9k90L09J86j35
5614E7m1pk96Q5L97j81J46j87P9K0J52j27J22k36QL4q3K22l06K19n2k9M8j66P
5639a15L17j3K4k70K80k07R2j01J09j35O3j30J86q5J98l85N0QJ28j4p6K00j41
5662a7mj26P6K05j95O4N0k01J51R8M5j87L7P2j69K1M4P2J94k05L28l32o0j22L95
5687B34l67M78k53l9R3n3n6l05L3M0J48l6K70r3l94J99J6m3J56J18k78k62M84
$$ plain form
5520 22 13 168 -136 -63 35 -91 152 154 70 -93 140 -132 -28 -206 131 161 -6 224 -138 47 -43 -14 -208 -20
5544 -20 54 28 -163 -72 136 46 -130 40 142 -158 -192 -25 -129 10 -72 -87 65 99 32 -135 -225 99 -207 -103
5568 -103 -139 -95 253 -106 229 53 29 128 -90 -126 -117 -14 14 -144 -109 184 63 -166 52 -64 154 -117 -14
5591 -14 63 -186 -84 98 -43 120 138 -227 119 -60 24 131 -56 384 18 107 110 -82 -13 -303 6 192 57
5614 57 16 9 -287 -202 195 14 160 -27 52 72 224 97 219 -17 -9 25 -58 164 -142 77 25 -4 44 -122 -115
5639 -115 202 189 213 -57 223 16 108 7 116 -19 44 -86 100 15 213 -172 -122 -114 14 0 -76 124 -17
5662 -17 -21 -147 -71 134 -61 3 53 -148 3 101 146 -41 -4 68 -101 -80 -36 36 230 25 353 21 -39 -161 234
5687 234 -133 345 92 53 146 93 37 -268 -235 -195 -47 -83 187 94 -300 -101 -85 -128 28 146 -132 -394 90
5710I0M4j56O1k04Q2K0j3J1J14jj09J49j70J47J11k12j78K77j99N5l8J45k44J4
5734b04L55k13l5J71j01R3k38M02k83J13k41K34K22m45N62k94l4o2L0k83P6J19
5756e6J19j34KJ86l17L17j26j80K20K1j70J04j00L4J42j58j28K37k13L89k02N8
5778D5j50L20p8j50r3J43O8j2J54Pj24j07O0k11J05J0K28l17K53j67J16j09J8
5801IM66m26j17J91k13l22L22K59k33L55k32K1N2k10J23L0l76K91J00o2p9j34
5823a85K21K4P9r0K7j75R2J75j75N8j20r6J40j01j2K34l4J7l47K23J56k48J43
5846FL29m25J6J31J82l11l4k65L79J24k51K88k46J59L8q8L9o1M1J11j87K57j61
5869G1o3L50k66J61l01M3k89K69J18Q5k45R3j14P0L62n94L87j10r7J6J6j65K54
$$ plain form
5710 90 134 -22 39 -165 -83 -63 -76 -65 49 48 -61 88 -82 65 176 -36 -214 63 -136 -81 -119 26 -218 -204
5734 -204 151 -62 -97 74 -27 66 -172 230 -53 60 -181 53 275 -170 392 98 64 2 32 -251 -175 -56
5756 -56 63 -71 -69 117 -200 117 -9 -189 31 52 -118 -14 -114 -80 62 -96 -224 13 -200 189 -13 45
5778 45 -105 215 137 -13 -106 37 105 93 247 254 130 23 83 -128 -23 -13 215 -102 151 -16 100 -9 9
5801 9 475 49 -68 123 -90 -412 -90 169 -64 291 59 80 132 -78 45 75 -301 -10 90 28 -51 -185
5823 -185 36 60 139 49 76 -99 -7 168 -7 51 -69 -165 -25 -126 -138 96 62 79 -268 -45 111 -137 6
5846 6 335 -90 -74 57 239 -72 -106 -371 8 132 -119 169 -77 82 120 32 71 10 51 162 -25 232 71
5869 71 8 358 92 253 -48 -5 -294 -25 93 178 -67 26 -88 -18 344 -250 137 27 -70 -54 -38 -203 51
5892E1M1r4J06q1j28L67m20K76N1K2j08k2j49oK19j41m4J84m6J39n6l1j66j46
5916a82M57l36K0r8K54l38l6J70P7Q7O2n1k1j59K47l1k97K96m9l93K17J69N6r8
5940B3r0K03k61j63K52j79L20j61j19K52k00K69j95r6J66M9pJ78Qk1m2j82L9J66
5964B09j01l2r8M9k0K03n6j01K8m9p2M0J43l07qq4J98J31p0J38n5l3P4k21n0J50
5990Fk60L31j68Rr2J66j85L96q1L8j40K2j03J78N5m57O9J36L1K16k30J93j9k00
6014h9n7K51j01J75k80j9n2M29l88J61P3l3J23k48QO1J22j89J43N5l05p7M15J47
6038C25l03j88J92q6l02M44J91k68J33j51p3k9L26k68J43m39J20K85K8k0qJ89
6060B41m64L02N1k15kK26k35L0kk8k30K57J12j04j4k70K20Q3L9J80l55J38k32
$$ plain form
5892 51 92 -2 104 23 -105 262 -158 118 169 191 83 61 -88 -94 125 -16 -60 124 78 217 161 130 -36 -182
5916 -182 275 -61 -41 -139 115 -223 -259 -89 -12 75 137 86 65 -94 153 122 -175 121 72 -321 -104 65 121 23
5940 23 -67 136 -125 -288 -36 -215 105 -56 -175 77 -123 146 -49 -145 21 70 63 241 249 228 186 4 43 209
5964 209 108 76 -22 27 7 210 154 53 81 32 -40 0 143 -164 -172 -256 -58 73 3 141 86 53 127 -94 -144 6
5990 6 -254 77 -91 -82 -174 -8 -193 203 122 160 20 42 -61 117 172 -285 -216 -80 -49 167 -63 130 111 -89
6014 -89 -146 105 4 179 -101 -120 -172 257 -131 30 103 70 193 -55 -47 14 136 -53 90 145 -160 -237 178 325
6038 325 22 -166 26 -60 -362 82 273 5 138 -13 -86 -115 211 -57 86 -353 -233 52 80 60 52 241
6060 241 -223 79 130 -85 -87 139 -96 -66 -68 -96 -326 -69 43 -61 -75 -345 -125 -42 -3 177 -178 -40 -272
6083b72L61j61J10l3n2K55o4nk98M08k89R6m9J01j5r0l17M20K2q3N8j75j73K23
6107b2P3j44K0J42j48j3K26k47L9K44k6j73l6l5J50L1j12J10k8j60K61j84J05
6130G3j37j98K61K32j85M6j73K51m32R0L08j21J59k77q3N5L01k73j3r9J04K02
6152I1K2Mj48K04q8j84mo8K32KQp7k13M51l32k0J40J53j07J74l95K17j90P4J39
6177H5j22o5Q5l27M22j88j54N5J96O6J50j89lK6P0l41K65K2J36j71r6J56K14j79
6201A13J72j39j3M8k66p0K58J79m6m07L51q7O6k25p1J67j70J39L9j60J86l3Q9
6224A20q5j83j45J58L0R3jM8l5n1J85j98K41k31J84j78j79L74k38P1K4j5nJ89
6248A73k12p2M4J00j7k7l5k9K21j08R5k21L16k82K61m26N16k19j86J91p9O7j32
$$ plain form
6083 -272 89 -72 38 5 -47 208 144 139 -159 249 -40 56 7 108 93 3 -314 106 128 45 103 -72 -245 -22
6107 -22 51 -93 -73 69 -79 -92 134 -113 -74 170 144 -29 -65 -100 50 81 -31 79 51 -109 152 -32 73
6130 73 -64 -262 -1 231 46 92 -81 170 -262 -172 136 15 174 -103 -186 -131 170 -103 -116 -215 -111 91
6152 91 113 117 -31 173 85 -99 -103 -171 61 63 71 -6 -219 232 -100 -120 20 173 66 240 -155 62 -128 -54 85
6177 85 -37 -102 -17 -344 78 -110 -264 -209 -13 53 203 14 11 37 107 -234 31 53 189 18 -78 78 292 113
6201 113 285 146 133 181 -85 -155 103 282 236 -171 180 93 159 -66 -137 30 -140 -1 38 -122 64 31 120
6224 120 35 -148 -293 -135 -105 -12 -13 35 0 -51 134 -64 177 -54 130 -48 -227 147 -91 -20 4 -11 -16 173
6248 173 -39 -111 -67 33 16 -11 -46 -75 146 38 133 -88 228 -54 207 -219 297 78 -108 83 4 71 -61
6271f1L1k21k1J82K01J0j35l3k0L3R0J57r5M6rLo2m06K78R2K3q7kk32J96k7J71
6298A02k52K10j07N5l5n4M5n8J54J70k10L8q1M8k77J73K03j95J51l5J83k95J85
6321A18l93O34k47k66J31K73o3p4l09R2j07P3K84l25K21J5o1p3k8q4J63p%j0J62
6346A19k72J36Q5L8j95R1Mm3J78k74K03l45L68o8K04k22m34L88r3M34m42J29J36
6369A25l47M35j53J16j64j01K0O2j70J46O8J2o6j13mm9J08K3J94J05j92J93l01
6392e3P9K64m58M4J8K36k77P9J43k56rJ78j0M9J05K6P0l30J21j31Q1m7R1r0q8
6417a65J78k01M08p7k73K80j32J34k37L74j61j90J74l6%J33j69O2j51p0K30M0
6439A51J4l21M02j6l52j09L62j73L1r4J2p3M46m83Q8L40q6p3J37j20j02K83j86
$$ plain form
6271 -61 -30 -251 -272 -90 111 121 -14 -47 -67 -34 56 213 118 164 155 158 96 -310 -32 60 83 -4 -6 -238 -42 -69 102
6298 102 -150 60 -47 8 -27 -81 -36 -94 60 230 20 58 -23 25 -252 -79 124 -71 80 45 228 -67 118
6321 118 -275 359 112 -154 -23 250 187 113 -196 -104 -211 -138 146 -179 42 57 -4 -77 -105 -189 -26 -33 -33 -43 119
6346 119 -153 -17 68 106 -89 2 6 -37 141 -133 70 -275 93 25 229 7 -427 -39 -132 302 -140 -11 125
6369 125 -222 213 60 176 12 -89 -69 -7 -177 -31 37 49 -17 -130 -134 -183 -75 -52 142 247 55 248 -53
6392 -53 26 290 -168 -124 -106 130 -147 -68 75 -181 -190 -12 -22 27 132 158 228 -102 19 -112 -31 -78 13 -77 -165
6417 -165 13 -188 220 143 -130 150 18 152 -85 289 128 -62 112 76 76 209 40 102 -49 -119 111 151
6439 151 165 -156 246 230 -122 -231 131 -42 -11 -105 -93 -166 280 -203 -115 225 139 66 203 83 -19 264 78
6462G8j08L06j44k71J05m2Q0j52M23l87Q5l14L94k42K52j6j35j73K19J80j21j80
6484a63P9J95j31J29k54K29pm6p7J0j21K53k09J64Ok7J7L9K2j01J04j28n9pJ99
6509A16k00K74r2j86Q1J79j60L3j13p9O2k0K27k0j87M48n77K5L47O5k33J42j49
6532a7K12r3K2K4j33m3j2j86J25J00j11K26j67n8J01L4j00J75j83j25K11J1j2
6555Ak9K59k60K54m7l24L54r0k24K7r4K30j47j20QP7M7KQ8j28J1K91l22K52k60
6580a44J66j05J00L4k50K4R4J0l6J3M45n76L23j03K8N6k21K72k38K02l4lq7j08
6604a38o2N27k67K36l60n3N4L72k73J67l62J99M7k27L87l78LK48P7l48R4M7%j13
6628a23J39j22o2L43j71j83L14j01M7Lq7q9K94r2j08J28N8k27q0K13j51K66R7
$$ plain form
6462 78 -30 276 132 -139 -34 -76 4 -148 275 -112 -27 -341 53 -189 63 47 -88 -261 -42 138 17 -163
6484 -163 -84 111 -20 109 -145 84 77 31 -46 -36 -157 96 -113 51 57 30 47 86 108 7 111 -17 -76 -83 116
6509 116 -84 190 98 -88 -7 172 12 45 -68 -147 -85 -105 122 102 -85 363 -214 -189 158 223 -10 132 -17
6532 -17 195 102 124 148 15 -28 -40 -226 -101 -1 -112 114 -53 -111 -10 24 -76 99 -84 -209 2 13 1
6555 1 -28 231 -29 225 178 -146 208 118 -106 -79 -173 57 -90 -210 -202 -125 -78 -76 12 -116 -105 186 -136 116 -144
6580 -144 22 -83 17 51 -199 -175 -81 -71 -107 -94 351 -225 98 -5 23 79 -142 130 -108 94 60 57 -30 -138
6604 -138 -200 327 60 296 -64 -117 -63 309 36 203 -159 40 87 -140 247 -131 -128 120 197 -151 -57 -10 -10 -123
6628 -123 16 -106 -168 175 4 -179 135 34 81 84 -3 -92 202 110 2 130 188 -39 -119 94 -57 209 306
6651C06k68J41j34J5Q6l32J67o6K27m31J73J55pK0j58K26j70k8J87j77M1J24k27
6674a30RLK05j04k2k0K9O0oj44J57p9q2K39k76R4J9J81k81J92M3j27m3k39p1L42
6700e1J88j17j17p9K97k6j03Q9j97J67M0k40P8J61j68K46l53pQ5P1j65J59j51
6723a93Q9N5J07m4q3L78k62L6m1n5K8l70N47j2k7m22L22l3r4Q4j2n2q9j8K59k1
6749G7m7j29j07M71k11q9K2P0K28k97%q4j82L66j4J0k37J27M9j14L54m26J95O2
6773I4k08L24l25M08k29j42J21j75m1k8J99n6R9l6n2k3K06pj77k2n7N2L50m03
6797a28L12k21j88J38K11j20nj43J77p2j89K65j4k9J62k17J70n9n7J13KNn71N76
6821A18j05Kj10J86j56K45j22n3M7R2l73O7r2M14j88n0k6J08J60k46J3j40J52
$$ plain form
6651 306 38 179 45 60 146 -186 -19 -85 142 -289 -116 39 32 52 -106 120 -50 -78 109 -68 -27 97 -130
6674 -130 -121 -118 87 -17 -39 -59 -30 30 24 -120 37 -42 -124 115 -161 -67 -48 133 -148 44 87 -40 -83 -322 -393 -51
6700 -51 137 20 -97 -176 121 95 -8 81 -116 51 91 -149 -71 90 -78 168 -185 -192 -107 -36 -201 -42 -193
6723 -193 -104 -49 58 14 -69 309 47 83 42 -13 15 -355 192 180 153 -269 53 20 -74 10 -2 -54 -143 -161 98 77
6749 77 30 -99 -206 265 54 -35 -13 57 285 -12 -12 -96 -278 88 74 84 -153 -26 23 -91 263 -163 32 94
6773 94 -114 210 -115 293 64 -78 43 -132 -173 -201 -2 -58 41 5 -47 -70 136 129 -48 -70 -127 -75 275 -128
6797 -128 184 -37 -225 -87 124 4 -1 -144 33 -39 -228 37 23 -6 156 -61 109 50 -7 106 108 113 -458 118
6821 118 13 15 -95 91 -65 180 58 5 52 144 -229 -162 -254 160 -28 -78 -104 4 164 -82 -69 -209 -57
6844e7J67Q2k92L04j15K28n8k41M9J99o9k88M4JJ38j06l5k14K03j78J15R3k7n8
6868a15j96K94J49j70q5m8J71j9N4oL9Q0j16k21J71J8J67m3k00K57l65J48J03
6891F7j21J85k68J1M8J8J75j73K5Q6K40p4r3n9k20J68k8l20K21N4M64l26j01K06
6915A85J23l98J02r4j31M70k43PK3k13qL08k98J63P1k17K02j68l5J56k22J91k56
6938b82L27p2p9n4L06o5j08m1l0R2J3l33N2L02n1J00P4j20k03J69%P4j70P7j4
6963c6N0j37k7J18j3Q9j88K58J54q6K4l34J9L97o20L53j51J72R0q8k99R2L4R2
6987c7Ml73M12l4K15j60O7l70K00QK27j10M1j58Q0j45j5R1j13R4K9J16j04l16
7011c51M49o5P6J01l37Q3j42K57j43L7j50j3J34j8J16L2l78J90O4nK04k74K22
$$ plain form
6844 -57 110 192 -100 204 89 317 259 18 67 266 197 -91 -47 -46 92 -14 -49 -263 -60 -238 -123 -30 -57 -115
6868 -115 -311 -17 132 -38 -123 -171 0 -19 35 29 68 148 32 -189 -18 0 167 124 -76 181 -184 -36 67
6891 67 -54 131 -137 -126 -78 -60 115 -58 -33 53 293 219 126 67 -153 15 -13 -333 -112 -58 406 80 -21 185
6915 185 308 -90 12 -82 -213 257 14 21 44 -169 -177 131 -167 -4 67 -150 52 -116 -151 5 -217 -26 -282
6938 -282 45 -27 -106 -160 146 81 -27 -68 -98 -6 7 -326 -274 28 -23 77 151 31 -172 -3 -3 71 -99 -22 -36
6963 -36 14 -123 -150 -32 -45 44 -144 114 268 182 206 -128 -109 288 -332 21 -130 42 132 44 -255 -163 -129 -37
6987 -37 -33 -406 6 -28 187 27 94 -276 -76 -68 159 49 90 -68 12 -133 -148 -57 -170 -76 -47 69 -35 -351
7011 -351 98 33 109 210 -127 -44 -186 71 -72 -35 -185 -198 -64 -82 34 66 -312 -122 -58 -63 141 -133 89
7034H9r5n9J58j41j01j1K90q5m4l7k0kK09k43o3K23Jm8J11j01J3J18k13J37j48
7059f2O1j0k65L87n8J09k58K35J7j88J18k03L5J80j98J86j26R1J34l36j36L51
7081F4l9j66k41L41p2j36M73m04J02J12mk03K24k24K41j25K87j90J66l17K08p0
7103B7j50m2K15k26J12n9L4L28l40rj2K00Q0k40jL25k54P3j69K25m42M34j10L1
7127C0k14J34j31L26j88p1P0L2r1J0j67J84j2K43j87n4O8j76J43q1J42pJ13p7
7151C9n0j62L73k54m6R9K7K5l3j76M89k95j45M9L6J09PR5k18J8l4Lo3J08p0MJ82
7178A17N3j01k01J64J18k74J97K9l23K11jk3Q4Q6j20j9r6J01K09q0q7J41k55j52
7202b22J59J95j18L1k21K20m7L4r8l2J88K4j30Q8Q3M9J5j21n2J77l9k91k4O4J67
$$ plain form
7034 89 -6 -65 93 -48 -149 -160 130 45 1 -36 -56 -58 151 -92 -155 68 69 21 132 31 44 162 -51 86 -62
7059 -62 -1 -11 -276 111 53 162 -96 139 156 -32 86 -117 -82 98 -100 86 -40 51 185 -151 -287 64
7081 64 25 -141 -382 -41 -113 -249 224 -180 -78 34 30 -173 51 -173 68 -57 230 40 206 -111 97 27
7103 27 -123 -165 50 -176 -64 -123 -89 239 -101 -110 -122 78 158 -82 -83 242 -12 61 -108 117 -325 109 -1 30
7127 30 -184 -50 -181 145 -43 -114 -44 -12 -103 -93 -260 -76 -88 155 -32 -86 -18 -194 -51 -132 10 3 116 39
7151 39 -11 -173 200 -54 -100 -1 26 51 18 -158 331 36 -109 -60 -24 85 92 187 -31 -13 -47 -44 -107 1 -69 -65 117
7178 117 170 69 -132 32 150 -124 73 102 -221 -10 -11 -34 50 136 16 -3 -99 2 211 131 44 185 -70 -222
7202 -222 -63 132 14 45 -176 44 -3 31 -67 -99 89 113 -17 71 154 203 218 97 45 222 183 -108 -132 -68 99
7227I9j97J85k9k53K40m8J7j00J20J3j5k32K94j36Q7n0o1K33n5j75j80K98l41
7250b86L59k88L10J8j45J97k89J73Q7K1k14Q8j8n0O8J26j63j05lJ57k33M83k94
7273aK42q0j23j09lj5M13k47l54M80j99j18J0l2J69M2K8j30R5j84j57M15l0m92
7297c80M13J07Q2j35j50P9M8m0j76M13k82k02L75k56P3k78K52L58l69Q3J89k14
7319a0j21M63m13J38J00j05q4L64k65j65Q7j53K05J4J57k11j72L34o0j64Qj18
7341a71M61m26p7K90j35N5j8K10k88l1O7R5N6O8j53J46k22L27k33q0J03j24Q9
7364Inj33J10K18j60K1j77J77M1n8k67J91j11M9J47l6M1O6k08N2l5J99k05L54
7388B80j03l67K91J56m6j57J74l03K89l35J01K91j81j15N4p4j7L40r8n00L87K14
$$ plain form
7227 99 -98 87 58 -195 45 -3 14 -86 34 47 32 -200 94 -42 45 -5 -66 167 112 -63 -243 55 -286
7250 -286 73 -215 95 113 -32 165 -124 49 136 157 -57 31 13 -37 31 157 -6 -111 -114 43 -190 293 -1
7273 -1 241 161 38 -71 -74 -89 324 77 -277 203 4 -114 -104 -136 33 75 103 -27 68 -116 -273 142 112 -380
7297 -380 33 140 222 87 -63 16 64 24 -152 261 -21 -223 152 -104 -31 -309 -57 301 -68 15 204 -10
7319 -10 -131 332 -81 57 157 52 -32 332 67 -98 -11 -164 41 55 212 1 -171 163 103 -61 -53 -171
7341 -171 290 -136 -213 77 -58 -3 -21 189 -99 -130 -63 32 88 156 3 149 -73 254 21 -59 44 -80 9
7364 9 4 -129 -19 199 39 60 -117 60 101 43 -224 -33 -144 -95 52 16 57 123 -85 -33 -68 131 -74 280
7388 280 177 -190 101 257 211 54 228 -75 214 -121 -20 271 90 -25 29 -45 -62 278 180 -320 67 281
7410B81k27j25n1N11j43l20K39l35J3L06j30j86L05j97p5o0M06j29M9k40p1rK35
7433D7m3K04l86N71k13j05Q3q5j4J25j45P2j37j35J04M1L4n0J12m5n8J96j84L20
7457C09l05J4P3P3o6k69J17J60J75r7j63L2m0M2n5k5R2k32L38l47J78j4q3J26
7481C3Q1J53m27q5M86k09r0O4rj0M5J2O8M4m5j22l4J51O5j98J00j4O9j79j54L5
7507a70P1J16j51J73p3P3k10K18J45k71j34K74M8j73j06K93j20j00J78r1n0J64
7529A04O7k59J01L03l88J52j30K07j73l4M3l7L22m47K72j72Q6N9J29k98k2N6J58
7552I9j17K18k54QJ01k4O8j06K69m71j15J71r9L08j12J33r7J73k57nL46j67j18
7575d8l9K51k5j43j87J33j34J34J44L51l85q6N4n6j06J31o2R2pJ0J2k4q0j23k00
$$ plain form
7410 281 54 -71 -122 389 246 -74 165 -170 -157 149 19 -167 138 -59 -134 -194 212 83 132 -108 -179 -188 47
7433 47 4 208 -178 393 180 75 158 73 59 184 39 111 -26 -161 -57 -16 18 -32 80 35 -23 173 -11 309
7457 309 4 18 91 164 98 -171 -54 106 281 184 21 53 13 55 0 -25 67 -165 173 -174 4 -10 -93 33
7481 33 114 267 -160 -245 241 32 -58 6 -3 -13 32 44 112 156 111 -11 -45 106 171 -27 73 59 128 -51 -205 -170
7507 -170 -99 17 -134 39 -34 39 -171 47 192 -79 -213 61 109 -64 -170 123 3 -97 81 -10 -60 104
7529 104 171 -88 13 316 -72 80 -50 157 -16 -50 -7 -44 278 -169 103 -69 17 76 205 -93 -115 -59 99
7552 99 -18 200 -54 -46 55 31 99 -7 262 -209 -324 -153 -252 56 -56 77 -20 153 -104 -109 237 70 -48
7575 -48 -87 164 139 -4 -191 -58 -192 -58 86 437 52 -34 20 -36 -142 -11 -73 19 12 22 34 10 -70 -193 -393
7600c93N33l04L24L1l62K16L1P2k72Q2M8k58J46K00j62n3M25l90K24Mm28K41J9
7623b6K45l75J98k63L92k3j34L3J9j13J18mP6j70Kr1N6N3q4J72k58K12N1q9J58
7648A55o9K85m51J45j65j54J46K72k67O8j04J84LPr4K9Q0J20l35K85k30J8L5o9
7672a06q3K80O5n5R1M1k44J23L2k4j17J9R2l07M8n2J84j62K07L4J5p4O3j74J08
7697DK9j98J00K98m47L11K15l03l0MJ28j62j44N56n79K76K36k96R6r4k7o4J35
7720D4K7n2j00Q5QK36m73J05L09m03J40J5k7K1o9J94P1J63k13kk50j8L88j78J25
7745A46j08J24j25n2j94L87j93M6k9R4m4j1k25K42j00K03l82O7J06O2J01k57Q1
7768f1Mj43K01q5L5j82K03j52R8RJ92o1Q5l1j43p6j7K04j78J28K80m16J68K5L3
$$ plain form
7600 -393 140 -164 160 191 -171 45 76 148 -124 -42 6 -252 -106 94 -68 -121 304 -86 138 142 -286 -45 -26
7623 -26 219 -156 42 -221 171 148 14 47 66 -47 71 67 143 -27 -25 -116 -60 -7 -91 81 -177 35 86 -3 155
7648 155 86 371 -80 65 -100 -254 -108 164 -103 -35 -139 45 48 55 -39 -10 70 190 -145 140 -90 -72 -37 -106
7672 -106 -189 91 156 101 192 233 -11 112 144 120 3 22 114 -193 -145 -197 -13 -175 32 66 81 7 70 -104 4
7697 4 33 -165 -65 233 -214 97 312 9 -21 -17 111 -51 -195 361 -218 58 294 -2 94 0 -27 -91 44
7720 44 71 19 -81 4 12 248 -225 -120 189 -214 -74 -59 -86 -65 -134 60 131 294 81 79 -171 -189 199 21 146
7745 146 38 162 37 -15 -209 178 -15 31 2 96 52 41 -184 58 -42 161 -221 -154 -48 14 115 -142 -61
7768 -61 -57 -200 1 -84 -49 -231 -28 -180 -82 -73 119 58 143 112 -31 -107 -124 80 -98 30 310 -106 62 87 120
7793A20j57L9J01O0J9k84J78j46J97r4K7k59K04J5M2k0n6p1n7J46J82m29P9L07
7817A43l8j39L50o04K22K68k33K62j44j64J31k2J3p0J50k68J35m9j40K32pR0M2
7840A60k76L34k16J3J65k23J80r6j72O8pj92K39MJ19N7k64K56k4j26p2j32J73
7863c2L2k12M54l61J02q2j04K78J04k73K62l07J65l22K35Q7J78m8j3O0l7k74J45
7886C7j37J21Pj25m4L16k53J49N0j9j1q4J20k85R5J38M6j6k59M5M03n07L19k77
7910a71J05J29J73k4m6r6n7K09k08pk18K91j65J9jJ9L43l60J25K74k20P0o3k66
7934a45K09K24m60J98q4o3M7K67k23j51M41n01K08j9J28j98L00k43J36m7k79M05
7956A50l26M24m16J40Mk1L88k64j21j31L14k09K14j41K9k9o2J52L6j66qm4M2J05
$$ plain form
7793 120 -37 2 103 163 182 -102 76 -70 127 33 60 -199 5 20 62 42 -14 -85 -142 4 186 -243 -164 143
7817 143 105 -34 316 -288 -66 202 -31 231 87 -77 54 32 45 -25 125 -143 -8 -57 -197 35 28 118 160
7840 160 -116 218 2 15 180 -43 137 41 -131 -63 -70 -262 -23 -19 100 157 -107 149 125 -1 -73 -205 -32
7863 -32 0 -212 242 -119 -17 -99 -203 75 179 -94 168 -139 26 -296 -61 26 204 156 143 203 166 -108 37
7886 37 -100 21 28 -97 -141 175 -78 71 121 102 91 7 127 -158 -63 75 121 105 -154 -109 294 -213 106 -171
7910 -171 -66 63 236 212 166 70 13 222 14 7 -211 80 -85 -66 -67 -48 295 -65 60 334 114 184 121 -145
7934 -145 64 288 -172 26 -58 -121 -74 193 -30 -181 260 -241 -33 -52 76 -122 178 -65 71 24 -255 150
7956 150 -176 248 -168 -28 -24 -45 343 79 -42 -173 141 -68 146 5 34 5 -57 95 131 -35 -43 -87 -45 60
7980F0O6L1r3j84K03k75m8J08K22k39J63J44j89nK02j62j12K50o1k43L49j59j96
8003a68L44k00qo7K24l35K46j07J15L8p4n3q4K12l5j05L20j2j68J59k88j05QJ32
8027a1j11M53m90q5K27P0j28l2J31kK52k96J37K8o5o3K9L3k62P4K02p6P4k87L13
8052A15k34m5M20k89K2k78N86j47j52O1j31O8J84k13J45l8P4k42M2J17J56o9p5
8075G7r0p6R6nP5r4J60k47J09j5J11O5k17o4J84J08j4j37o0j36L1J56j51K30l05
8100b09L02M6l51R1R3N8n2r9J15m0j27K09M3j7m33J17J62J90m32K47j6J79k50
8123a74K92J66l17k40L5J75J66l5j83J17Q6k07L54k45pO1j69K30j63Q4k90O5K23
8146B4j6N3J83m30J79J40l13L30q8k08N19k96j76n9L94k42Q5p6J43j73l3L47p6
$$ plain form
7980 60 126 157 64 -120 83 -192 -240 -132 90 -149 14 158 -31 -36 166 4 -108 142 81 -162 187 28 -168
8003 -168 176 -24 -32 -99 125 -210 36 -71 44 82 8 -45 -129 83 48 -57 263 251 83 242 -46 -151 -143 -11
8027 -11 -122 331 -159 -244 -17 53 -75 -107 24 22 274 -22 115 143 78 15 44 77 -185 -111 91 15 89 -198 115
8052 115 -119 -164 256 -33 -11 -289 297 150 -2 59 -72 -4 180 -33 112 74 148 -94 -52 65 221 152 77
8075 77 -13 -89 7 2 77 -17 143 -104 5 -10 101 166 -51 -115 69 177 163 26 -34 -170 -139 17 -134 96 -209
8100 -209 93 139 -212 -121 -28 30 -22 -121 -6 -46 -173 36 79 62 -371 -254 -92 98 -334 -87 -103 76 -174
8123 -174 118 284 -33 -273 -238 -63 103 68 -115 2 88 -119 235 -10 -17 44 -125 105 -58 26 -264 -199 24
8146 24 8 61 244 -186 -7 133 -180 150 62 -146 373 77 -99 -158 236 -6 79 3 146 -27 -60 287 211
8169B11j91N9J35l40R9l6j28J14k30J53J51j31pJ17j14R1P6J52k6j52K08j83
$$ plain form
8169 211 20 79 214 -126 -27 -63 -191 -77 -307 -154 -3 -134 -141 -24 -138 -47 29 181 155 3 211 28
8191B8
$$ Imaginary data points
##PAGE= N=2
##DATA TABLE= (X++(I..I)), XYDATA
0@%%%%%%%%%%%%%%%qJ6j6J6j6J7k5L2l3M1m8N6o5P3q8J01j12J26j44J63j83K06
37A09k31K57k85L17l53L93m34M78n29N84o44P11p82Q60r49J047j155J278j416
56g44J570j749J960k207K505k873L338l948M784o006P966j1603K0535q2100j20172
71a88744J51466L6674k7224O7775N4123m6693L481K5220r4025r8261N9307L1932
83b4969k9946O9541P6155j7889j1262j7522p2388n5009L4125M2471p978M1386
95B6715O3453l1955k2632J2970o1032o5016L777J1705J9578P1314O9343k8272
107F9948n1719R129l2318n8826J8667J1663q249N2269N2858l088k3582k1494l8412
120b3154m8164Q95K1926J2989O5528N1583l1376k1700q86l6119l9526q004J2966
$$ plain form
0 0 0 0 0 0 0 0 0 0 0 0 0 0 0 0 0 -8 8 -8 8 -8 9 -16 16 -17 24 -24 32 -33 40 -48 53 -59 67 -77 86 -97 109
37 109 -122 135 -150 167 -186 207 -227 251 -278 306 -338 373 -409 451 -498 549 -606 672 -744
56 -744 826 -923 1037 -1170 1335 -1538 1800 -2148 2636 -3370 4596 -7007 13528 -68572 -188744
71 -188744 -37278 -604 -27828 39947 94070 47377 50858 76078 -17947 -116208 -56901 -24969
83 -24969 -54915 14626 90781 72892 61630 44108 -28280 -83289 -49164 -6693 -14671 26715
95 26715 90168 58213 35581 48551 -12481 -77497 -73720 -62015 -42437 28877 98220 69948
107 69948 18229 27358 -4960 -63786 -45119 -33456 -41705 10564 63422 60334 36752 15258 -23154
120 -23154 -71318 -70423 -48497 -35508 30020 81603 50227 28527 27641 -8478 -48004 -56008 -43042
133d3042M238L0886O8515P520m0597j1750l3113m7992K967L2232K6128J6749K5810
146C8551K0990j7535j9127k4443n3359j5950K3453K3107L6895K8478P854k927
158D5987k8632l5104k5266o323K1596J7449K0074L1213M774j309j0251m4408l9954
171e0154j4104J7441M3043K5439J5700J2620j1853j4025k2015l1573j2798J104
183d1175K3458L6625J5731J3408p86l0685l1015k6269p196J5420J3929K9057K9632
196D0134L602k592k1159l1267j5491j6319k893K0198K7723L4009J2230j5835k3437
209H903l0670j0683J320j0046J6268L2882J9344J7401k143k5628k9470k4862l076
222d0460L526J1259L5650K0034L871N180k0004k8414j8527j1313Q070J4911K0277
$$ plain form
133 -43042 -38804 -7918 60597 68117 27520 15770 -17343 -65335 -62368 -30136 -4008 12741 38551
146 38551 59541 42006 22879 -1564 -54923 -70873 -47420 -24313 12582 41060 48914 45987
158 45987 17355 -17749 -43015 -49338 -27742 -10293 9781 40994 45768 44459 34208 -10200 -50154
171 -50154 -64258 -46817 -3774 21665 37365 49985 38132 24107 2092 -29481 -42279 -41175
183 -41175 -17717 18908 34639 48047 47261 16576 -14439 -40708 -47904 -32484 -18555 10502 40134
196 40134 43736 41144 19985 -11282 -26773 -43092 -45985 -25787 1936 35945 48175 32340 8903
209 8903 -21767 -32450 -31130 -41176 -24908 7974 27318 44719 42576 16948 -12522 -37384 -40460
222 -40460 -36934 -25675 9975 30009 33880 39060 19056 -9358 -27885 -39198 -31128 -16217 4060
235D060K6606Q720O06j5119l8831j8924k845M83K1770K2100J4951J1323P09q248
249B7361k9570l0927k868J223J4747L5051J3540K250J474j4289k0263k3936j2162
262c8369O262J0612K8117K3972O54J990j1091k8472j7680j2584P42K0454K2405
275G012K1145L195o764l879k2177k1826o671p974J3166L1675K1800R737j0157
288B8282j6415j5394k0253m599K689J817K4508K3477P834K950j6894k2959j7999
301b2956j2126O343J2044J7653K5338N317l866q738k4788j4408m661l528R786
314a8590J5399K1768J8290m375j2570k3925k6357m65P633R188J7851J0578J0409
327B4834N257j1563j4845k3104j5971N487J0002K0530K2060M405n43j1125k1786
$$ plain form
235 4060 30666 39386 39992 24873 -13958 -32882 -35727 -35244 -13474 8626 23577 34900 35609 27361
249 27361 -2209 -33136 -36004 -34781 -20034 15017 28557 30807 32281 17992 -2271 -26207 -38369
262 -38369 -32107 -21495 6622 30594 31248 33238 22147 -6325 -24005 -36589 -35847 -15393 7012
275 7012 28157 31352 24588 20709 -1468 -23294 -29965 -37939 -24773 6902 28702 38439 28282
288 28282 11867 -3527 -23780 -28379 -25690 -23873 635 24112 31946 34896 18002 -4957 -22956
301 -22956 -35082 -28739 -16695 958 26296 31613 27747 19009 -5779 -20187 -24848 -28376 -18590
314 -18590 -3191 18577 36867 32492 19922 -4003 -30360 -30825 -23192 -14004 3847 14425 24834
327 24834 30091 18528 3683 -19421 -35392 -29905 -19903 627 22687 27092 26549 15424 -6362
340f362j2848j0175K438J3486J0808J7184J1248p5k156k0242k4994r579j615J6936
354a5946K3459J1790P987n781j0691o741j6119j0528k727L045K1944K0180R640
367B9512M046j5781j9855j3843j1829M177J1343J2945J7321M581n56l312j6357
380B392j2466j0874r799J0901J8611K0089J4426p138j4232j6424j4983L63o02
393a9736K155J4378J0816J2871R610j0817j6698j8326j2807L761Q688J7734J7315
406A8944J357J104p515j6999q199q998l747P276R466J7033J3926L009l946k2056
420F55k1114m217P77J2447J5560N174N943K174l169p445j8313j1842k236L353
434b2253K0828J7708N635L922j0924j6886j1113p838K828N804P229J5218O511
$$ plain form
340 -6362 -19210 -29385 -26947 -13461 -2653 14531 25779 25704 23548 3306 -21688 -31267 -32882 -15946
354 -15946 7513 19303 27290 21509 10818 4077 -12042 -22570 -25297 -22252 -308 19872 29512
367 29512 33558 17777 -2078 -15921 -27750 -23573 -12230 715 18036 22617 22061 18749 2392
380 2392 -10074 -20948 -30747 -19846 -1235 18854 33280 26142 11910 -4514 -19497 -19134 -19736
393 -19736 -17581 -3203 7613 20484 30094 19277 2579 -15747 -28554 -24793 -16105 1629 18944
406 18944 20301 21405 13890 -3109 -11308 -20306 -24053 -16777 -7311 9722 23648 26657 22711 655
420 655 -20459 -24676 -23899 -11452 4108 9282 15225 17399 14230 6785 -11528 -23370 -25606 -22253
434 -22253 -1425 16283 21918 25840 14916 -1970 -13083 -20921 -18093 -12289 -5060 10158 16669
447A6669L523M29j5906j4744r739o099J1339J7318J4846R054o811p030r475j2924
461i550k874m293k090J3210J4476J2493N541r898j3043j5733r867M633N253J1455
475b87J4373J423J470k709j2534r465j0884n386N105R539J8287J2919j700n099
489A5052j5413j4645k551n03N812R632N251J0279M787l723p576j7897j1792R91
503b2296N252J5851J3747M741K730p108r624q510j1830o2N065N351J3795P694
517A4796L793j67j3491j4237r057k750J1624J1391Q516P360k387j580n432j4089
531e710q686n748K281J4330J0481R290N181q691r294j0017r328J649L491P798
545b973J1196N381M522l277j1715p939j0862o039P558Q685J2827J0576n49l620
$$ plain form
447 16669 20192 20621 4715 -10029 -19768 -25867 -14528 2790 17636 26690 19879 12849 3374 -9550
461 -9550 -12424 -16717 -18807 -5597 8879 21372 26913 17015 3972 -11761 -21628 -16995 -11742 -287
475 -287 14086 15509 16979 14270 1736 -7729 -18613 -23999 -18894 -9355 8932 21851 20151 15052
489 15052 -361 -15006 -17557 -18060 -12248 -2616 2635 12914 17701 13978 6402 -11495 -23287 -22296
503 -22296 -17044 -1193 12554 17295 20025 12917 3293 -5217 -17047 -17109 -12044 -6693 7102 14796
517 14796 18589 18422 4931 -9306 -18363 -21113 -9489 1902 10418 17778 15391 13811 8379 -5710
531 -5710 -14396 -20144 -17863 -3533 6948 16238 21419 12728 3434 -6583 -15911 -14262 -10771 -2973
545 -2973 8223 13604 18126 14849 3134 -4805 -15667 -21706 -14148 -5463 7364 17940 17391 13771
559A3771j0888r496k854n928J278R090P919J1958L509p265p838j1495p704j430
573a7373J483J2862J0884M038N203m840q924n914j0569n332L061P234J4289O461
587A2563J732j654j1644p514n122o278O128Q677P563R259K252j499o575j4168
601f280o869l472J730J2337P779O095N498m925o208p598q939j752k06P481J2893
616G564M991M136j678j2012p819p427l406M676N520R612P912J354N80p014j0974
631c985m959o832J047J0869P738Q426K134n211n304r147o044r48j632P404R759
646C315N673P192k169q614q680r891j613L795N047J0674M805J093J821p985p666
661c203n062o392K284O341P900J1036J873k394o561j2130m087j344L1Q010M927
$$ plain form
559 13771 2883 -6613 -9467 -15395 -14117 -5027 2892 14850 18359 11094 3256 -8239 -15943 -17373
573 -17373 -15890 -3028 7856 11894 17097 12257 3333 -2581 -13150 -18482 -15421 -8187 6102 12563
587 12563 14295 12641 997 -6517 -11639 -17917 -11789 -3112 4451 13710 15962 14463 7888 -6280
601 -6280 -13149 -16621 -14891 -2554 5225 11320 16818 11893 5685 -1913 -10852 -12604 -12810 -5329 7564
616 7564 12555 16691 15013 3001 -4818 -12245 -15651 -10975 -5455 4157 12069 13423 14003 6989 -3985
631 -3985 -8944 -15776 -14729 -3860 3878 12304 14438 9227 3923 -5224 -11268 -12216 -13848 -6444 3315
646 3315 8988 16180 14011 5397 -3283 -13174 -14787 -10992 -5945 4729 9534 10627 12448 4463 -3203
661 -3203 -8265 -14657 -12373 -6032 1868 12904 14777 12383 5822 -6308 -10395 -11739 -11708 -3698 1229
676A229N874O126j835l978p872j0586k141P1O845J2094M992K310k340q334m341
691a886n517m801K304K066P785R831K856J285o427j1187n896m501K694Q708N719
706C033O141J425k693j013o798p760l267k886O288R709O272O534l005q426n920
721b366p899j124L739K292O770M906L072L170n624p005o655q215K410O802P189
736A462R798J057l559m014p717k557k617k310M947M191O554Q332j778m234p847
751b92j0277j753J757N496R402K141K430O58n528k602n635p007N96K131P112R402
767H031L217P73o740r543l545l437J769O697K546M814M614n61l37o175q481m180
783a0538k812O084R321M534N225k357o926l459n392j528Q33K3O212N760L810M403
$$ plain form
676 1229 7103 13229 11394 7416 -456 -11042 -13183 -13112 -6267 5827 10819 13129 10789 2455 -1886
691 -1886 -7403 -12204 -9900 -7834 -49 9782 12638 13923 7496 -3691 -9587 -14088 -11394 -2686 3033
706 3033 9174 10599 7906 6893 95 -7665 -10932 -13818 -7530 2179 8451 14985 11980 3554 -2366
721 -2366 -10265 -11389 -7650 -5358 1412 6318 9390 12560 6936 -69 -6724 -14939 -12529 -5727 1462
736 1462 11260 12317 8758 4744 -2973 -5530 -8147 -10457 -5510 -1319 5235 13567 11789 7555 -292
751 -292 -10569 -12322 -10565 -5069 4333 6474 8904 9562 4034 1432 -4203 -11210 -10614 -8483 -1371 8031
767 8031 11248 12021 5281 -4262 -7807 -11244 -9475 -2778 -232 4582 9196 8635 8298 2123 -6358 -10538
783 -10538 -13350 -7266 2055 6589 11814 9457 2531 -928 -6320 -7848 -7015 -6992 -780 4980 8790 13193
799A3193n633p726n908o534K237O070N380O058J048j082q71o425k974l246m336
814a0749M096N609O080P261j566m755o578p537q11Q70L194O649J844L093L045
829I745l306l044o465p007L06K639O789Q030J443k4m653p056j726k990j221L946
845d594K033N760N386K91j048o233p859k751j955M777P228K517L872n17l817k135
861I55n293l453j92k38O454O248L467K928m854o733m147m831J620L967K728N692
877D318J737Q12N61n482m490l885l311M265N084N177N371j712l219l521o172j580
893f047m65O71N189L228M023L178l562l539n574n615R43K430L997O519P40R86
909G102j849n057k544m269k091L141K564N522N683j099p81n069n968j793j480
$$ plain form
799 13193 7560 -166 -6074 -12608 -10371 -4301 1079 7137 8185 7103 6232 -193 -3167 -6413 -10749
814 -10749 -6653 -1044 5036 12297 10731 5976 -602 -8139 -8950 -8080 -4886 1763 3607 6700 9745
829 9745 6439 3395 -3070 -10077 -9771 -7132 -343 7687 9130 9106 4453 -2603 -4329 -7319 -8540 -4594
845 -4594 -2561 3199 8585 8876 7828 1595 -6264 -9015 -10970 -6193 1035 3552 7424 6907 3090 955
861 955 -4338 -7791 -7983 -8221 -1767 4481 7948 10876 6022 -711 -4858 -9689 -8069 -4102 -1374 4318
877 4318 6055 6867 7428 1946 -2544 -6429 -9740 -5475 -391 4786 10157 8445 5226 1705 -4467 -6047
893 -6047 -6512 -5841 -652 2576 6599 9777 6215 2676 -2898 -8513 -7570 -5140 -1143 5376 6116 7102
909 7102 5253 196 -2348 -6617 -8708 -5567 -3003 2519 8202 7103 6322 1253 -4715 -6508 -7988
924g988K850M143K115M920J120k782j974n462m324k32O37N756N060K421J838l387
940D711l805k433n414J32K222J144N815L148J349j02n518m356k864k391L714L549
956a099L141M568k73j397j695n830k864j810L46N732L348L586K603l854k723l583
972a804m326O77J150K101N352J817K354p40m897k634m763k758L812K650M659M238
988F888j195p42k832l884j498l296N74M243K500N531J609l500k305n129l473O71
1004e838K28M271L467J217K932j269l414j832n628j506J804K055N873L069J15
1019E544m59m768l101j183k379K380J983K004N123J064l37k135o088k798j328
1034f478J89N574K893K146J793k935j090k321l951n90n68J813N493K475K653p71
$$ plain form
924 -7988 -5138 -995 1120 6040 7160 4378 2404 -3058 -7382 -7614 -6977 -1221 3839 6260 8098 4711
940 4711 906 -1527 -6941 -6809 -4587 -3443 2372 5520 6869 6767 1249 -3107 -5971 -8362 -4648 -1099
956 -1099 2042 6610 6337 4940 3245 -2585 -5449 -7259 -6913 -1181 2167 5753 8356 4502 1779 -1804
972 -1804 -6130 -5453 -4303 -2202 3150 4967 7321 6581 1684 -950 -5713 -8471 -4659 -2009 2650 6888
988 6888 5693 4951 2119 -1765 -3263 -6559 -5985 -1742 758 6289 7898 4398 2093 -3036 -6509 -5838
1004 -5838 -5610 -1339 2128 3345 6277 5008 1594 -238 -5866 -7372 -5568 -3513 2360 5429 5544
1019 5544 5085 317 -2784 -3967 -6346 -3966 -1983 21 5144 6208 5871 3736 -2352 -5150 -6478
1034 -6478 -6289 -715 2178 4324 6117 3182 2092 -229 -4180 -4770 -5338 -3525 1968 4443 7096 6325
1050F325n372k749l329j435L426J400L228K828n60J394j424m465k042m031L73
1065f433M858K912M256P43k797j833l836k326Q24j075K250L073J967L513o84k745
1081B667k718n673q41J988K233M852K212p06L56l423j880j192k683M16Q29K787
1097g76N739J082q82k183n736j885J43J75L834K012J272K022j327j50k456m754
1113c870q38r01J896N613K030J661p56m139j837k391j194K197M81J769L335O02
1129C658J518j311m755k765k683P64M460K144L107P15k595j64k497k267k81j644
1145d596J074L580K308L491p66l294k120m334m99K101J035L470J827k25J337j784
1161B605k081j730m080K34J884K732N275L15j508j516l834j124l16n76K818J067
$$ plain form
1050 6325 953 -1796 -5125 -6560 -3134 -1734 1494 4322 3762 5156 3732 -733 -2775 -6806 -6433
1065 -6433 -1575 1337 5593 6336 3539 1706 -2130 -4456 -3632 -4707 -2457 616 2583 6096 5412 2667
1081 2667 -51 -5724 -6565 -4577 -2344 2508 4720 4014 4370 947 -933 -2125 -4808 -4392 -3563 -776
1097 -776 4963 6045 5163 2980 -2756 -4641 -4498 -4323 -489 1523 2795 4817 3490 3340 884 -3870
1113 -3870 -4708 -5609 -3713 1900 3930 5591 4835 696 -1141 -3532 -4726 -2529 -2048 -279 3056 3658
1129 3658 5176 3865 -890 -3655 -6338 -5574 -1114 1030 4137 4852 2257 2093 -404 -2671 -2952 -4596
1145 -4596 -3522 58 2366 5857 5091 1797 -323 -4657 -5156 -3055 -2020 1450 3277 3052 4389 2605
1161 2605 524 -1206 -5286 -5052 -3168 -436 4839 5154 3646 2130 -1704 -2828 -3144 -3720 -902 165
1177A65J694L053r78m90k226m934j129P0J726M504J392J235l34k766p14j874k288
1194c894J376l83J848L728J379P67j959m586j464k055Q59L519O26K405J337q98
1210B605J30j894l166p63j915K067L248J263L084r72k439j364l073r15J603M5
1226b456K892J915N59J730j740k590j993l169O54J791K133L384J42q59l56l008
1242i71j032m11j476J988J566K175K977p93j268k273l434n01j3J120L284J102
1258B040J068J004k171p62k219k266O34L36K202L252M49K69j559l511o10j377
1274c221l60J893N47K938J816l10l79k352l173l60j238J755K689R09J792l90j533
1291A023n65k883j148N20p5K741K459Q20J424k340j989j541k501J013J321P45
$$ plain form
1177 165 1859 4912 3934 3444 1218 -3716 -4845 -4775 -3049 1455 2847 4082 3748 982 268 -1606 -3894
1194 -3894 -2518 -2901 -1053 2675 4054 4821 2862 -1724 -3188 -5243 -4384 -865 -239 2166 3503 2605
1210 2605 2735 841 -2325 -3088 -5003 -2936 312 1575 4659 3687 1248 -116 -3189 -4104 -2501 -2456
1226 -2456 436 2351 2910 4640 2900 310 -1683 -4852 -4198 -2407 -274 3110 3252 2393 2037 -971
1242 -971 -2003 -2414 -3890 -1902 -336 1839 4816 4023 2755 482 -2952 -3453 -3466 -2346 938 2040
1258 2040 3108 4112 1941 1179 -1040 -3306 -2672 -2336 -134 3118 3567 3836 2277 -1234 -1844 -3221
1274 -3221 -3581 -1688 -1141 1797 3613 3303 2924 572 -2601 -2961 -4199 -2444 245 1154 2946 2556 1023
1291 1023 458 -2425 -3573 -3053 -3128 -387 2072 2892 4316 1976 -13 -1554 -4055 -3042 -1721 -976
1307i76K409Q54Q4L32k450j689j086j397K242J906J996J965j230j023j282k736
1323b081l63j31m38L085R43J799J295k216p55k235k262R77P00J690K398l01N77
1340B682m85k291o66j881r08J620N45K800K417j062o3k194k352k31o30J129J510
1357f0L50K161K90q76m19l066j795P49j14K864K254N5J027k035j544n06j826m2
1375b533L02M62K689J282K98L56k893j860p12j108K372J494O87J780o54j58o63
1392A141k313r94n74o45K746J371J966J025k260j005j603j629R87N33P73J844
1408A363R3J014M55j802j226k153j368J688J181K372J427j062k32j467j544L60
1424i01j419O1J434Q79K254R82j336q95k756j245K39N86J899J718O7P21o56j157
$$ plain form
1307 -976 1433 2287 2371 2703 253 -1436 -2522 -3919 -1677 229 2225 4190 2960 1937 655 -2081
1323 -2081 -2444 -2575 -3013 72 1015 2814 4109 1893 1138 -1097 -3359 -2382 -1682 8 2406 2105 2682
1340 2682 2197 -94 -760 -2641 -3549 -1929 -1384 1416 3833 2771 2708 514 -1838 -2069 -2699 -1570 -60
1357 -60 290 2451 2741 1865 1446 -1620 -3415 -2666 -2780 84 2338 2393 3420 1385 -159 -665 -2491 -2533
1375 -2533 -2231 -1769 920 2202 2500 2856 -37 -1897 -2609 -3717 -1345 149 836 2616 1962 1804 1141
1392 1141 -1172 -2166 -2740 -3385 -639 732 2698 3723 1463 458 -1145 -2774 -1787 -1254 -481 1363
1408 1363 1456 2470 2925 1123 -103 -2256 -3624 -1936 -755 1617 3044 1982 1750 283 -1261 -901
1424 -901 -2320 -2259 -825 54 2308 3290 1954 1059 -1697 -2942 -2703 -2117 -218 1500 1567 2288 1632 475
1442D75k12k057p92R7R76K547J584k9N7k736j727k02l76J245Q60L44J769L4M14
1461B271n46k660r05q94k92K740J503J113N72j889q13o53j415K46k38O99J713
1478E52Q23J300R4k189j142j730o24J852P00J510J093r71L03q07j161l59j793
1495b549K71J546P53K268N80j182r32k016r18N24J24J193R74j29J499p4j059o36
1513B37k048q89N89P07K539J039j94J87k045r48Kj021M84M97N56K122J07M09q65
1532A465k531n78m52K61J825Q22Q23O01j241j18n05j709l24q1K68J977Q43J020
1550B366j1k114r66q81n12J323L0Q83J205j01M85k25j861p84j150QJ459J135J571
1569A860J12j069rj604r61L11m90Q33J374K83J441j46j245o88j824m33Q24L85
$$ plain form
1442 475 263 -1794 -2586 -2489 -1513 1034 2618 2589 2646 -90 -1817 -2019 -2395 -1150 -290 54 1823 1857 2271
1461 2271 1725 -935 -1840 -2734 -3026 -286 1217 2330 2902 1013 200 -453 -1868 -1622 -1860 -1161 552
1478 552 1375 2675 2769 580 -562 -2292 -2916 -1064 -364 1146 2239 1268 1571 764 -397 -756 -2549
1495 -2549 -2278 -732 21 2289 2869 1687 755 -1261 -2179 -1655 -1531 -338 636 507 2006 1932 873 237
1513 237 -1811 -2700 -2111 -1404 1135 2174 1980 2167 122 -826 -824 -1845 -1361 -864 -308 1814 1921 2330 1465
1532 1465 -1066 -1644 -2096 -1835 -10 812 1635 2236 995 877 372 -1337 -1661 -1742 -1474 503 1346 2366
1550 2366 2355 241 -725 -1606 -2118 -795 -765 118 1323 1222 1707 1482 -379 -1163 -2313 -2305 -846 289 1860
1569 1860 1972 903 894 -710 -1671 -1360 -1850 -1017 357 640 2081 1935 690 2 -1822 -2255 -1431 -1046
1587a046J893P87m16N45j112p88m05j533N05Q23M98K156Q1l67m27k327j55k42
1605a530k73J381P20L60J422m42o65o16j646m63L14J65J928M68M14Q0j284j76
1623A57p48j236R93M8P35J629k17O55p55j706o14r48K88J438M7J323N42l27l5
1642A269j088j218p8o38P21J538L29R14l61r72q29j321j73P42k28J542O64N7J144
1661B014j133j157k39j416K96R61O27J380j08n20J57j454l46k57r40J563O86R54
1679A068J087n77m92r44j385R8P6L15J300RN37N42q79j11r48j416P37J68R75J621
1699A781n24M86r12j485K28p77m0P22J80P32J134k95L19j590j221J23n88J161
1717e66R41K72P36m58p12n1r40n69L75n01J176R10O02Q73j231j061o23p12N77
$$ plain form
1587 -1046 847 1634 1218 1763 651 -137 -542 -2075 -1570 -747 -249 1907 1988 1621 1194 -1133 -1288 -1530
1605 -1530 -1803 -422 298 658 2080 1638 973 357 -1289 -1752 -1438 -1273 655 1123 1537 1617 333 157
1623 157 -591 -1827 -834 -786 -51 1578 1361 2016 1261 -445 -1059 -2007 -1719 -281 -234 1089 1631 1304 1269
1642 1269 181 -1037 -1115 -1753 -1032 506 835 1749 1388 416 -413 -1734 -1907 -1165 -1393 149 813 870 2014
1661 2014 881 -276 -515 -1931 -1635 -674 -47 1333 1225 705 862 -592 -938 -1195 -2135 -572 114 1068
1679 1068 2155 1578 1086 142 -1243 -1145 -1069 -754 546 555 1092 1634 755 644 -304 -1720 -983 -815 160 1781
1699 1781 1257 1743 831 -654 -426 -1203 -1243 -521 -341 391 1525 1230 1549 -41 -1262 -1139 -1727 -566
1717 -566 375 647 1383 925 213 162 -778 -1347 -972 -1473 -297 613 1215 2088 857 -204 -827 -1539 -962
1736i62P78L1R16j79L15L87j221q54p19k72J270O57Q28R27q42n55l83j052p7L7
1756i70k28J100N45N97M56p00j24j267j054N48N49P89Q77J16m67k09q57K24q17
1775h92l35L66O3J331J420p06r0j030j428M77k09O05Q16q4P13K46o46j23j009
1794e15p24K54m01J272R25J21O71j152j073om85M05K78k17Q01M56K43M84j319
1813A8q10m64j12J061N75K09O57m21m1l32r56j5m46j07J020K31O10Q72q58o19
1833G2o74j061P83M69O02M54l35M56L15q43j00r78q10Q71L87J329O45o38k14r01
1853a71n34M07o69J25Q43O4R97J72o30J10j173n46Q1j77J039J179j86L28q25p85
1873c51M53p52P4k70l67J715N04J73k5j419n94Jn1P51p5L36J036j81m09k36q21
$$ plain form
1736 -962 -184 -153 763 584 899 1286 65 -789 -1508 -1780 -510 147 975 1902 1060 505 122 -930 -1007 -970
1756 -970 -1198 -98 447 1044 1500 800 676 -591 -1645 -1097 -548 241 1118 1234 767 558 -299 -75 -892
1775 -892 -1227 -861 -798 533 1953 1247 1157 127 -1301 -824 -1033 -428 388 304 1017 1263 617 494 -515
1794 -515 -1239 -985 -1386 -114 811 932 1603 451 -622 -628 -1113 -708 -430 -647 154 610 853 1337 18
1813 18 -792 -1256 -1368 -307 268 477 1134 713 672 340 -616 -631 -1077 -1184 -164 67 677 1549 691 72
1833 72 -602 -1663 -880 -411 191 645 310 766 1081 238 138 -840 -1650 -779 -392 937 1582 944 730 -171
1853 -171 -705 -298 -967 -842 1 65 1062 1234 604 714 -459 -1005 -924 -1101 -62 1117 931 1259 434 -351
1873 -351 102 -650 -576 -846 -1213 502 1006 1179 1154 -265 -859 -858 -909 -158 -233 103 1139 958 549 313 -508
1894e08l33l19J86P90K85P40N51n88o86r61k95M63M53J54K69P5L97N45j246J08
1914H0j078l47J245j64J104lm44M29p11n06R2q70L98R67j98P19K28m61j25q44
1934d89o74L38Q2L62J110l43L53k88m84K57r89l07K71L16J273L11o61L30q55j25
1954b12j0p16L31L15L55R83m67J95k01j109J24p9m51Q72M19N37K25n78o28n6n30
1975f81L11K4k40J157J96L20J20j407k73L6k19M91J38PP44l63N11k47j126k5m23
1996i49M18N01K27L90L79m89Q8q20n20J04j17N15N57k3N81n9n63J11j328j51P95
2017c53K65Q91l83l11L50l74q3p0j074q6R01M29Q41n61l25J87p18L99p01k01J071
2038I4j08L03O78n44l34L2r85N59n64J84J237J90J66j72j052J26r0j48Q3m71O33
$$ plain form
1894 -508 -841 -1160 -974 -184 101 841 1392 804 118 -843 -1138 -675 -222 -68 201 276 673 1218 -28 80
1914 80 -998 -1345 -100 -264 840 837 393 822 111 -395 -303 -1173 -775 192 -6 713 941 480 355 -489
1934 -489 -1163 -825 -743 -381 729 386 739 451 -33 224 -765 -1072 -801 -485 788 1099 438 768 -87 -212
1954 -212 -222 -938 -607 -292 63 1046 579 774 573 -536 -412 -491 -942 -70 349 886 1111 533 -95 -151 -681
1975 -681 -370 -346 -586 571 767 1087 1207 -200 -473 -437 -656 -165 -27 -20 724 361 872 625 -501 -526 -949
1996 -949 -531 -30 197 587 966 477 565 -255 -775 -671 -788 -273 284 261 842 783 220 331 -997 -1148 -353
2017 -353 -88 803 420 109 459 85 2 -68 -1142 -1228 -327 102 943 382 57 244 -474 -75 -776 -977 94
2038 94 -14 289 967 423 89 121 -864 -305 -869 -685 552 742 908 736 -316 -190 -280 -428 -345 -816 -183
2059a83R16j71M17p08j393P20L9M7N30l94M80L12j72q3o84k90L66m56M46O29l17
2080E1J026p6n74o39q25K60O65qL02k23J73R37o95l14o66p25P53P79p4N69o44
2101E2K67Q0n68k38k55j65P84K21J00M62m04J67q1j276J93j2K46P32J68k98%l50
2123a75M59p5p94k5k40P00J017j99q2n06o42L61m20J64K85j92Q06O59q32K41n06
2144Dn33N73p85K90P00R5N56k04q44N7k97M4J66l46K38M91K64P15p16p51n79N6
2166h06O22L56k61O06l18k9K81o62kl91l70Q48J86m3O83l92K39l78n89j64O7N18
2188AL39k82L5K66j60L24p50n01N09k60N45R28n80k82j3k17J22l50k01L35n7N77
2210C28L56o84L05k94p5l71j69K53N26J23K82k82o33N90l50j11j78k93N31L42
$$ plain form
2059 -183 733 562 979 271 -1122 -402 -363 -316 214 -180 300 612 440 357 -327 -617 -251 -707 -261 368 51
2080 51 1077 1001 427 -212 -1037 -777 -112 -120 182 -41 132 1069 374 60 -606 -1331 -578 201 127 696 52
2101 52 319 399 -169 -407 -662 -827 -43 178 278 740 336 503 422 -854 -661 -673 -427 305 473 175 175 -175
2123 -175 284 209 -585 -610 -850 -150 867 668 586 80 -562 -201 -621 -457 -172 -364 442 1101 269 510 4
2144 4 -529 44 -741 -451 249 344 900 696 -148 -91 -388 -344 -178 -524 -286 205 469 1184 468 -283 -862 -806
2166 -806 -184 172 -89 517 199 170 451 -211 -213 -604 -974 -126 60 17 700 308 547 169 -420 -584 -517 1
2188 1 340 58 93 359 199 523 -227 -728 -219 -479 66 994 414 132 119 -98 24 -326 -527 -192 -249 328
2210 328 684 0 305 11 -64 -435 -604 -351 175 298 580 298 -335 255 -95 -206 -384 -677 -146 196
2230A96N39K75r54n27K21l36N26k85O9L75K48K97Q9j164N2K90m65L15R0M48J99
2251D98m3k71J55p49K06J36k14L50j66J64N78n88P9n85m94O69K71L72k93K8r4
2272IL75l51N5o61k71N21L72L52l0l32K70P1o72Rr4K57N04l55M57o3k73J87j71
2295A66q43K35k48O19P18j89O9n63R9j9l76n6N2j37P98L26m9k97o31j41L11n14
2317f70L99J36J45N23k14rm92j66M32o7o30L61J10O90M2l79k94k94j89N98J90
2338B22m08K51O1K69L12n65l08o00L32O16l65M12q8Q4R2j32o17K06m24L11N03
2359A64j20M9J16k81L57m29r0j87J58N25J56m08m7L3L8K19q16R2J07K62P28j82
2381D44j76K66o51K75l23l92J89P6P3Q48n00j44lj59J09j92n8P5N26J59P2n32
$$ plain form
2230 196 735 1010 56 -471 -250 -586 -60 -345 -276 99 347 644 733 -431 -379 -89 -554 -239 -149 299 498
2251 498 455 184 339 -410 -204 -68 -282 68 -98 66 644 56 135 -450 -944 -275 -4 368 75 103 9
2272 9 384 33 88 -573 -844 -323 49 401 371 39 309 380 -292 -283 -377 -120 384 29 486 423 150 337 166
2295 166 -677 -442 -690 -71 647 458 527 -36 63 44 -332 -388 -336 -473 325 651 602 305 -326 -467 -156 -670
2317 -670 -271 -135 10 533 319 310 -182 -348 84 17 -613 -252 -142 548 590 211 -83 -377 -566 32 222
2338 222 -186 65 126 395 707 142 -166 -766 -434 182 -183 229 141 225 317 185 -432 -226 -650 -339 164
2359 164 44 93 209 -72 285 -144 -234 -421 -263 262 418 10 -37 -4 34 253 -563 -471 -364 -102 626 444
2381 444 268 534 -117 158 -165 -557 -368 -292 -219 629 129 -15 -18 -177 -68 -260 -318 -243 283 442 514 -18
2403a8j69j46M8L81l66j40O48Q0M55k91o16j05l6P0L54m44J98K66o5M89p85j96
2425c88L98k98K12M16n46N21J08j29J38m91l81M80m21N09j96N5K26K74l25j04
2445E8q65M59Q1L42L48j60l43M52l12J04l0o24L36J4K49L47j53l36K33l63J37
2466b6l66j57N98K15k44K99l55K68k9m17k13k47M02L58J73J92m97m18L48r2j2
2487b20M43m99K00N32l97L42j59k89J27m12m1N16k04L94J61n46J71j81k49K40
2507g1l70M4L77K60M11k31l86j55m46J50Q53m73O1n8J61J96M7m53K83o25L15J81
2529G1n1K34k57J48M2m98n5K06l71P99n64L08K44k90L01l0p14L16j76L29L06M
2551C02p6k41k30O74n50j40n1j1L49L11j76j0n8n07L12j21k32J39K15M72j54k30
$$ plain form
2403 -18 -187 -333 -285 96 -270 -410 238 318 773 482 -134 -239 -275 -205 149 -295 -97 169 104 593 -192 -388
2425 -388 10 -288 -76 340 -206 315 423 294 432 -59 -440 40 -381 128 -68 -13 213 487 162 58
2445 58 -807 -348 -267 75 423 263 -80 372 60 164 134 -490 -154 -140 109 456 303 -33 200 -163 -26
2466 -26 -392 -549 49 264 20 319 -36 232 203 -214 -427 -674 -272 86 259 451 -46 -464 -116 -208 -220
2487 -220 223 -276 -76 456 59 401 242 -47 80 -332 -373 143 -61 333 494 -52 119 -62 -311 -71
2507 -71 -441 -397 -20 240 651 420 34 -121 -567 -417 436 -37 24 -34 127 323 370 -83 200 -425 -110 71
2529 71 20 254 -3 145 187 -311 -366 -160 -531 268 -296 12 256 -34 267 237 -477 -161 -337 -8 298 302
2551 302 226 -15 -245 429 -121 -261 -312 -323 26 337 161 151 93 -414 -102 -223 -455 -316 -101 371 217 -13
2573a3J63j97J6qm05J67O39P9J93l68m20J64k54R5J73j30O9J53K38L8j40l05l38
2596c91J06j70M60j16J79K33k63O0n31L52j88O6K74p6NK19j74J86p2n06K64j1
2618i4M02J45n16P9J80j10J37l01k43L00q5L25J53l11M75l35l26L78p10J58M18
2639A19j42K14q7rJ48l59j49M11l42n0K44M4J99q4k21J00r7O2Rm85M22M33k94
2662H6R0k03k1j34j27L48l45M60K46l48KJ93m24J23j18L8J39Rq6L89M5l67m1j82
2686b28N17k95l33N28j74QK92m76J84l10j04M39K8K5o8n4J78o0Nl9m69K19K23
2709C6j13J15R1R5N3j48m45J27k08O23k7j91K53k26O2j8j37j81R7j35L76L29n29
2732a01L94m43O1m8j04R4Kq9L21kj60L63m13jJ44m66L20K45k23K95j16N5j77k37
$$ plain form
2573 -13 150 -47 -31 -39 -444 -277 362 441 634 266 -154 10 -244 -149 24 -106 -37 116 354 392 252 -53 -391
2596 -391 -285 -455 5 -111 68 301 38 98 -433 -81 -269 -203 71 -5 0 219 45 231 159 -347 -83 -94
2618 -94 308 453 -63 16 196 86 223 -78 -321 -21 -106 219 372 61 536 201 -125 253 -457 -299 119
2639 119 -23 191 104 95 243 -116 -265 146 -196 -246 -2 42 241 157 -64 36 -61 1 10 -475 -53 380 86
2662 86 176 -27 -48 -182 -309 39 -306 154 400 52 54 247 -177 -54 -172 -134 5 14 -72 317 362 -5 -46 -228
2686 -228 289 -6 -339 189 15 23 315 -161 23 -287 -391 48 76 101 33 -21 157 97 102 63 -406 -187 36
2709 36 -77 38 129 224 277 129 -316 -189 -397 226 199 8 261 35 97 79 -58 -239 -142 -277 99 428 -101
2732 -101 293 -150 -89 -137 -241 -147 -145 -234 87 85 -75 288 -125 -126 18 -448 -128 117 -106 189 73 128 -49 -286
2756b86L13k36k75P41o24O05N5l33p7j5K9J77j86j45M22k67L28j06M0j53k79J6
2778b56M22p8K82J02m96J16p0o8j18K18j66j4M9J92K19r8j22k25l36K60K5L65
2800B03k75J66J86j61L0l22k64K33j51M14k9j3J67rj5n19N46m28K92k14j8K85
2822A04k58L68k11j53R7l2k44M91j09K80m13N1K59l78j0K77k65K28L0j18L27j86
2844A35m10O8j59O6M95m53M55k62K69j00r6P0Jp0j48K4j50L85M5j63o7k9L9J28
2868G3j2J20l8j43J75q6J0o8l61J70J10j60N27k66N2K34m02k18J88j41K46j84
2890a74RO17j32j40j9k57j15K19q0L16k83LK02j31q6O1j34J84j47p7J82n8K76
2913B36j54l35J39Jk7J67k3J5k20K55L0O4o8j43j06J62J06j87M27k43j3k01k34
$$ plain form
2756 -286 27 -209 -484 257 -367 238 293 -40 -117 -132 -103 74 -112 -257 165 -102 226 120 160 7 -272 -256
2778 -256 166 88 370 472 -24 92 22 -46 -164 54 -112 -126 -77 115 334 236 114 -111 -447 -187 -162 203
2800 203 -72 94 280 119 149 -173 -437 -204 -355 59 30 17 184 175 160 -359 187 -241 51 -163 -181 104
2822 104 -154 214 3 -150 -53 -85 -329 162 53 333 -80 -29 230 -148 -158 119 -146 82 112 -6 321 135
2844 135 -275 -207 -366 -300 195 -258 197 -65 204 104 8 78 79 9 -139 -115 -265 120 165 2 -65 -94 -55 73
2868 73 61 181 143 0 175 89 99 31 -330 -160 -50 -210 317 51 103 337 -65 -283 -95 -236 10 -174
2890 -174 -165 452 320 180 161 -96 -211 8 -72 244 -39 -36 166 35 -51 10 -124 60 -87 -164 18 -40 236
2913 236 82 -253 -114 -113 -140 27 4 19 -201 54 84 148 80 -63 -169 -7 99 -88 339 96 83 -118 -352
2936c52L15P5k67J96M9Q1L86j98n93L78m2k85L01j58O26l60m24N36k74J67J91
2957C48n16J02J50j15M57m27JR9j84J24j75J47o0k21M79j02j37J71j80l26L6K25
2979a04J90L3O3q1M3j63J42l85k1N63l65K92q4L4N6j05l30M8K56k38K94O3M9j28
3003A22k21J07j79k7K57k24M88l02K46n4Ll01J59j80J0K64l08M01l96J15M94n40
3025f6M1J8n27M13J09n1K92k59K43p3l05L24p0k38M02j56j00K9K9r9n7N9j60K51
3049D9j2K55j98K12K6l99k40O6J6L87rm3J85j94P3j95k6J78j19n7N0l23M53j04
3073C1J2J6p9l08K59k52L22J11l5L81l73j24K44l55k8J0j26N44k77J45J07k99
3095g4j23L15j87K36o8O7R0n03L21o0r8k7J60l58L92l0j40M33n93R7O7j46K61
$$ plain form
2936 -352 -37 38 -229 -33 16 97 483 285 -308 70 28 -257 44 -114 512 152 -272 264 -10 157 348
2957 348 -168 -66 84 -31 426 -1 0 99 -85 39 -136 11 -49 -270 209 107 -30 141 -39 -365 -329 -104
2979 -104 86 119 182 101 144 -19 123 -262 -283 280 -85 207 123 157 213 108 -222 -174 82 -156 138 201 250 122
3003 122 -99 8 -171 -198 59 -165 323 21 267 213 216 -85 74 -106 -96 168 -140 261 -135 -20 474 -66
3025 -66 -25 -7 -534 -121 -12 -63 229 -30 213 140 -165 159 89 -149 253 97 -3 26 55 -44 -101 -42 -202 49
3049 49 37 292 94 306 332 -67 -307 -241 -225 162 153 110 295 101 174 -21 -47 131 12 -45 5 -318 135 31
3073 31 43 59 -20 -328 -69 -321 1 112 77 458 85 -39 205 -150 -178 -168 -294 250 -27 118 225 -74
3095 -74 -197 118 -69 167 99 166 256 -247 74 14 -84 -111 49 -309 83 53 -87 346 -247 -150 -83 -229 32
3118C2k65J24M00l75L84q3j42Ql88K18j2O8K79j31j10J22k07K08j72P5j55R7j2
3141c7K64m4m23L40k38J09k7p3J88L17m20K27j86l6N7j52J05q4m1K77n9K15n6
3164B23j59j25j02p9K85n6P9N4j85M85l59k79J91j2P7L37j50j30j6o6n5K51m17
3187b08J79J33l11K05L5j2M4k71K21m4j56K03j12J42J82j7p5q7J9m7k28J46m8
3210a07K65K3n9j14j72K24L4j37j06J20L38k88KP4j10J96j19l68K17j63M34j51
3232C3J36Nql4k26j65M74k59O7j15R8L19k80j32M2q3pJ08J55j55J68j01N8q8k26
3257b16J1n2K37L24j50K7k45p6M8J4K94j17k61P8J02j64J59q4R8Oj09J72j78M0
3281d2N6J4j87K38L6j30L03n69J68l9J46R7j11p4J6r8J14l8L2J24J39j66K41j08
$$ plain form
3118 32 -233 -109 291 -84 300 217 75 83 -305 -87 -99 -31 248 117 7 129 -78 130 -42 33 -122 -25 -37
3141 -37 227 183 -240 100 -138 -29 -56 -129 59 376 -44 183 -3 -39 18 -134 -29 -113 -154 123 64 279 223
3164 223 64 -61 -163 -242 43 -13 66 120 -65 420 61 -218 -27 -39 38 375 225 95 79 13 -42 209 -208
3187 -208 -29 104 -207 -2 33 21 65 -206 15 -29 -185 18 -94 48 230 213 138 51 70 23 -205 -59 -107
3210 -107 158 181 122 8 -164 60 94 -43 -149 -29 309 21 23 97 -13 183 64 -304 -87 -250 184 33
3232 33 169 174 166 132 -94 -259 215 -44 23 -92 6 325 45 -87 -45 -128 -135 -27 128 -27 141 40 98 10 -216
3257 -216 -205 -257 -20 304 154 181 -64 -140 -92 -78 216 99 -162 -84 18 -146 13 -71 27 33 -76 96 -82 -42
3281 -42 14 28 -159 79 115 -15 288 -281 -113 -152 -6 91 -20 -94 -78 -176 -62 -100 -68 56 195 29 270 162
3305A62l20R1l8Q8n6K8M2Q3Qj18j38l7Lj6K76J11k4q4Q8j32l24j33N74J08k19
3330B3J50k50J57j91k15L86j98K4J76k59L16J42m01M02k89Q9l67L86k9j73J75
3351E4MN6j30O4j42J66j98pj1K8K70j81J63j51K7o8%K4k11J93J27k35O11o17l6
3376b00K60k1j65N2j06K88P7k60k6J90q3j53J83j83K52j1j03K1Nl8o9L97m59j8
3400a70J50L0k9J59j21J05m64K22J72k09jK83k58m8K36j44M02l67j63J48K13p9
3422F7o9Q6j52J72j94R7N4j30J13q2O7R0j00J19l4l52K60k65K35J79m6J84k40
3445E9J76m76K94j1k76J84J13Q8m8j0l28J98j6k6K20k84k1L27j68J82j56j33J30
3468A8k05J41J06J00j27J6M3j2k26q5J81K9lJ26L1o9J41k63p5P3LK71n42M22q
$$ plain form
3305 162 -158 -67 -105 -17 -73 -45 -3 80 88 -30 -168 -205 -202 -218 58 169 145 61 149 17 -307 -440 134 242 23
3330 23 173 -77 80 -111 -326 60 -138 -114 62 -197 119 261 -140 262 -27 62 -305 81 52 -121 54
3351 54 58 114 -16 48 -94 72 -126 -133 -144 -116 154 -27 136 -15 12 -56 -56 -32 -243 -50 77 -158 453 -164 -200
3376 -200 60 39 -126 -74 -180 108 185 -75 -101 89 6 -147 36 -147 105 94 -9 12 17 -21 -90 307 -152 -170
3400 -170 -20 10 -19 140 19 124 -340 -118 54 -155 -156 127 -131 -179 57 -87 315 -52 -215 -67 146 67
3422 67 -2 84 -68 104 -90 7 61 -69 44 -38 29 119 19 138 104 -248 12 -253 -18 161 115 299 59
3445 59 235 -241 53 42 -234 -50 63 151 103 93 -235 -37 -53 -79 141 -143 -164 163 -5 177 21 -112 18
3468 18 -187 -46 60 160 33 49 92 80 -146 -231 -50 -21 -24 102 133 64 205 -58 -133 -60 -57 214 -328 94 86
3493H6Q8j5m16K72Q0j97J80m4p3j70R9K2J53j81R6M3j7P9Q7j06P5nl52M23o10
3518d03J30M83k03Lj47o1M85m90K78o4j03qQ6R0m4j24J31J2K6l1k14J33L6J07
3542A08M5O1k21l40J75L2M3k7K39J21k25l5L63m21J23n4j28K14m1j50J23M8J08
3565A61m6j19P5k39p2L78l97L37q1p1P1l56L56j51q0M00j09K1N0k87qN4j27K12
3589b8k1J46j29k06K01r1nK53l03L66j71j79M1J90m9M4j49QK61j30k71L26j19
3612a5K05j25j80J64j7q2L3Q2m47O38m56K84j01r5j38M6M6M64l26R6J66m60K19
3635AO8l84K15j42J75J66j73J60J17k00j17L32l28J37j60k9K44j70K07j47j04
3656a32J98r9J2j16j36M61m27L10N1l20L80m49K03j45l2J90N9M5P1j01j40m9N1
$$ plain form
3493 86 174 159 -257 15 95 -102 78 34 -39 -209 -110 -88 65 -116 -20 23 6 85 172 66 141 136 -216 207 -403
3518 -403 -273 210 7 10 -137 -198 287 -203 75 11 -92 -100 -14 76 32 -92 39 51 77 46 -168 -35 1 108
3542 108 153 214 -7 -347 -172 -140 -97 -124 115 236 11 -24 339 -82 41 -13 -141 73 32 -118 5 53 161
3565 161 115 -4 71 -168 -240 138 -259 78 -3 -74 -3 -359 -3 -154 -234 166 57 78 128 -159 -167 -113 -240 -28
3589 -28 -49 97 -32 -238 -37 -128 -133 120 -183 183 12 -167 -126 64 15 59 -90 -82 179 49 -222 104 -15
3612 -15 190 65 -115 49 32 -50 -17 65 -382 256 -200 84 -17 -112 -250 -204 -158 306 -20 76 242 -218 1
3635 1 69 -315 -100 -242 -67 99 -74 86 203 3 -114 218 -110 27 -133 -162 82 -88 119 -28 -132
3656 -132 66 -33 -21 -137 -273 188 -239 71 122 -198 182 -267 -64 -209 -241 -51 8 53 124 23 -117 -166 -115
3679a15K8M7Q9N3K07l00P4k3j99q6K12J67J15k04K49k63m1j80K1N7J02r7J33L21
3703C67l34K05l85r7L46rk90J77J0l0K2K4J18j27K1j66k2K14m5J28k26K34j60
3726b5l5l55M71k6j60K41k03j72J93J5R7P0k17K51l07M37j53p1N4k18j49K53q3
3749i2L5k06j61Q86l81j63J95M3l44J74Q0N5J57k17N3j57j6L7J82k26j64J05J57
3772C2k5j05P4J98k78K05k69K77j56J9L13k06j49k9J00j70K0m2J27Q1%J59k77
3795a01J36j57QL80l61j9J07rm9J55k3l02R3K51M1Nl48K57l37K95J42k68q9L79
3819A86k63Q9r1J40j3o8Q6l85K52L58m53P7ok72L40lq0J93k90K80K3j07j18J28
3843CP4l32R1K17p6J63j62pj42J78J45m74L74q7J85Nk36r0R8M2J32j05n8J37q
$$ plain form
3679 -115 -87 -40 49 102 309 9 83 60 -139 -225 -13 154 269 65 314 51 10 -170 -149 -92 10 -87 46 367
3703 367 33 238 -147 -244 102 93 -197 -20 -10 -40 -18 6 124 -3 18 -148 -170 44 -1 127 -99 135 -25
3726 -25 -60 -415 56 30 -130 111 -92 -264 -71 -56 41 111 -106 145 -162 275 122 51 105 -113 -262 -9 -92
3749 -92 -57 -263 -424 462 81 -82 113 156 -188 -14 66 121 278 61 114 -43 -59 -22 160 -66 -230 -125 32
3772 32 7 -98 -24 174 -104 101 -168 109 -47 -28 285 79 -70 -99 1 -169 -149 -191 -64 17 17 176 -101
3795 -101 35 -122 -114 266 -95 -114 -7 -16 -65 90 67 -235 -142 109 150 155 -193 64 -273 22 164 -104 -193 186
3819 186 -77 12 -79 61 48 -20 66 -319 -67 291 -162 -85 -91 -363 -23 -26 -106 87 -203 77 100 -7 -125 3
3843 3 77 -255 -164 53 -23 140 -22 -29 -171 7 152 -322 52 -35 150 155 -81 -171 -73 -31 101 -4 -62 75 67
3868F7n9J8k28Q9J90J14Q4m55O9O9j15m8J00rQ2J1P1N2j23j39K90l27Q6K5J25
3893C9Lj24J70o0j58M97k83j56J12j99K22j1q5j62N01l20J68l64K25mj67K12k35
3916a79J30r9Q6n0K97k92K02m7N4k00J09k4j13j36L04Q8k33P7l7R2r7j23oJ20
3940g7J40N2l1L6p6j04r7J02rr0L27j81J42k35n7L62j61k76L07j08N3p5N5N9j58
3965a00L08kj49j16L8j61J91k67J41N07m65Q2K28m36K37k77O7K6k55K99J92k15
3987a27J81j40N5K8j96K24Kl1j71L57j88j45J93j4j41r7K41q4M7J38Lk98M17l49
4011i5J07O0k95K60kJ61j52j26RK66l22J59N6%P0L6k49R0NR8r7O0o9M4J02k15
4037c9R0J67k42Q3m4j97J69J07n1m1O0P1q6L9j39K48k86J51J9j23j78L30l75N1
$$ plain form
3868 67 8 26 -202 -113 77 191 275 -180 -111 -42 -157 -205 -105 -114 -32 -21 50 102 -21 -160 130 -197 -111 -86 39
3893 39 42 -82 88 28 -130 367 84 -72 40 -159 63 52 -33 -195 306 -14 154 -210 15 11 -156 56 -179
3916 -179 -49 -148 -62 -112 185 -107 95 48 102 -98 11 -13 -126 -262 42 130 -103 -26 -63 29 -68 -191 -197 -77
3940 -77 63 115 84 120 44 -60 -157 -55 -64 -154 173 -8 134 -101 -158 204 43 -233 74 -34 19 -56 -1 58 -100
3965 -100 208 206 57 -59 -21 -182 9 -258 -117 390 -75 7 235 -201 36 -241 -174 -148 -403 -104 88 -127
3987 -127 54 -86 -31 -3 -199 25 27 -4 -175 182 -6 -151 42 28 -113 -210 31 -53 -6 132 135 -163 254 -95
4011 -95 12 72 -223 37 35 196 44 -82 -73 193 -129 30 86 86 156 192 -57 33 38 136 39 99 30 74 176 -39
4037 -39 51 218 -24 59 15 -182 -13 94 43 2 62 133 47 86 -53 195 -91 60 79 -44 -222 108 -267 -216
4061b16J72M40l75j25K86l89K52r3J3JQ6q3K53j93j15j89L79J13k2m0q4j16MJ10
4085F9J36l84O0L63l29J04q6K65k95K47k89r1K53j83J44K65k95K15m40K07J28
4106F4kr0K6J54k83N12p23K26K84k10j24K32Q7j88j90J72N0L7k47k4K0L77j07
4129E3m68M60m1j45R6P1l49N49n15L20l68K14J22K03K9j88k1k12P9J1K07l33L23
4152I7r1J82q5K06l13j83Q3qj00M30q1j71R4L3j30o3K9N9r7O9n8M1L10j68K11
4177B96k41p4j03M5J79l28L73q8k16K1L68k66J33JOk19M1l2J32k7lN0j07J17J26
4202A84j81J74k31O9j62M43j37l02P8J39l6l9j88J30J35K7k67J13K32k0j91k01
4224b31L05j31j34K11j47L73J12n29L28j43j35J38n1k8J1R0M95m54j17L06k38
$$ plain form
4061 -216 -44 396 21 -104 182 -207 45 -48 -35 -34 52 -31 222 29 -86 -275 104 217 195 155 71 -45 -41 69
4085 69 205 -179 -119 244 -85 19 -67 198 -97 150 -139 -230 23 -160 -16 249 -46 169 -271 -64 64
4106 64 62 -28 -2 152 -131 381 -342 -116 168 -42 -166 66 153 -35 -225 -53 -3 34 -213 -237 -217 160 53
4129 53 -415 45 4 -141 -45 26 -323 226 -289 31 -337 -123 -1 202 231 43 22 -190 -111 -100 107 -226 97
4152 97 6 188 103 309 -4 -187 -104 -112 -212 218 137 -34 60 93 -37 -100 -71 -12 -109 -40 -98 -57 253 85 296
4177 296 55 -19 -122 -77 102 -226 147 59 -157 -136 232 -34 99 100 106 -113 -72 -104 28 1 -2 48 -59 58 184
4202 184 3 177 -54 15 -147 296 159 -143 -65 74 38 -1 -189 -59 76 103 -164 -51 181 161 -30 -231
4224 -231 74 -57 -191 20 -127 246 358 -171 157 14 -121 17 -34 -62 -51 39 534 80 -37 269 31
4245C1q3L18l14N9J72m06N4L80l11K37k25q4J23m7J04q8J63J91l69n1L66k80M2
4268a8m26K27L62k29L12j86L9L44l47k46N0P6j02L05j80mk62J72O7R4j62P2J1
4291c1J86Q2m57J73k5J23Q0K9r3r8k34M16l7j73Q3l2J40J21n38P8K75k71L3J24
4315d6L36k40l53L06k9l7mK03j16K86m53J23m5J8M8j69K52j68p1L20l1j73P0K20
4339B47j41j12r7M87k52l2J29m01L40j62l9J08j2k22r2L30J0l02K89j71q8Q3j26
4362b26J00J91M1j15m1j43J13P6p6K90j55k07K96j00n4j00J60k6k94J86O3j5K55
4385B19m29N1JK68q1l08M20j63L2j5J70o5j64O5Q2j18J6M2O5q5k63K24kj06J54
4410A0R1l06J0K54r7L15m39J41J36m4j8J63m35K00K17l17K42j37J0J17p0k56K72
$$ plain form
4245 31 -52 266 -48 11 183 -223 -169 211 -100 137 -88 -172 -49 -96 8 -80 83 274 -95 -146 220 -60 -18
4268 -18 -444 -217 145 -84 228 42 81 425 78 -168 -118 -42 -144 161 -19 -23 -285 -113 -46 48 -114 -42 -31
4291 -31 155 237 -220 -47 -72 51 131 160 67 -31 -265 151 114 -59 24 -8 132 253 -285 -207 68 -203 -170 -46
4315 -46 290 50 -303 3 -26 -63 -67 136 20 306 -147 -24 -69 -51 -3 -172 80 -88 -159 161 130 -43 27 247
4339 247 106 -6 -103 384 132 100 229 -172 168 6 -33 75 63 -159 -251 79 89 -213 76 -95 -183 -100 -226
4362 -226 -126 65 106 -9 -50 -193 -80 -4 -80 210 55 -152 144 44 -10 -110 50 24 -270 -84 -21 -36 219
4385 219 -210 -159 -158 110 29 -279 141 -22 10 -5 165 100 -64 1 83 -35 -19 23 88 3 -260 -36 -38 -144 10
4410 10 101 -205 -195 59 -38 277 -162 -21 115 71 53 216 -219 -19 198 -119 123 -14 -4 113 43 -213 59
4433E9j54K67k09K3J02q8J39j46j50L68j83j38q9L13n2j47m3Q6lj06O06k06j84
4456F5M2j30J6Q5j89J60m9p7J84K8j72R8j34m7M1K1L5J31j05l23J57M19k14j27
4480h5P1o2K23j21k7k01J36k3L09j52k80M00m68K86j4J32m2K08k89J30j10m7K
4503b4R0j88J27J18k17MQR3k90K26R1K0J29N2k98n4J08r7J57j22J92l72N0L42
4527A45p8N6Mj07Nj3L2K24m58K62l2k00N1J48KO0j91N9K03n2J31l8l46ln5L24
4553A33j18k4j24J13K5J10L7l82L24m7J80k78O1k35O4N7J24j0j45O09k27l29L13
4576B31k77K22k70K01O0j01O4j4j12J36j97L8J21k40J35K00l36N9J73J48j99j32
4598i0J63o0q5k09L3L86%q8M0l16L44k80LK06l08M44j80k1%R9nj59J68p9K1L68
$$ plain form
4433 59 -95 172 -37 -14 88 0 139 -7 -157 211 28 -110 -199 114 62 -85 -128 -42 -45 -151 455 249 65
4456 65 107 -23 -7 78 -111 49 0 -77 107 135 -37 61 -73 -120 -79 -58 -23 108 3 -320 -163 256 42 -85
4480 -85 -14 -76 147 26 -1 -202 -66 -89 220 68 -212 188 -280 6 -8 124 82 290 1 131 21 -26 -24
4503 -24 66 -122 5 123 -94 -90 -82 11 -279 -53 38 58 187 239 -59 -113 -5 -102 55 -67 125 -247 -197 145
4527 145 67 123 127 20 25 12 44 268 -190 72 40 -160 -109 39 41 101 -90 -31 172 120 251 213 -133 -136 -191 133
4553 133 15 -9 -133 -20 5 115 152 -230 94 47 227 -51 10 -225 -161 -104 20 10 -135 474 247 -82 231
4576 231 -46 176 -94 107 167 66 130 116 4 140 -57 -19 102 -138 -3 197 -139 -80 93 241 42 -90
4598 -90 73 13 -72 -281 -248 138 138 50 90 -226 118 -162 -159 47 -261 183 3 -18 -18 81 76 -83 85 6 27 395
4624C95m28p1N0L45j54j60P7o0M9K65l49k3L7p4J15J40l31J24J2j0N1p0r2J07
4648e5j76J04K18m55L27P7p1k63K31J94k0k42J66q9k0n3K81k44L6m4o4J05O6o4
4672e5n0K92mj20RK15j14%k73k7J31k4n9J76q4J0o1l1JM7jJ48l26N3J92j92K76
4699A29r0J3N9k60n3K05M4K10P6o64K69L89k16J12j99j83J46j28J87k28R2r7J57
4722c0J12J2j54N9j74O3J40k07J0K21n5N9r0OR9k10O0O5L3L88l45kJ29k73J59
4747G5J93l94K30j32L8O6k20J51j68L1j43K30O0q4Qk42L24K81l02K11j15k51R9
4770e4L07k71oj54K22k80l2L43l48M53k81j4j7N4K24n8k3m0K16j23k67L31j08
4793G4r7o9J90j34r1K35R6q9J79j48j67JJ52j38kK15j00j36O0L2L9P7j69m2J84
$$ plain form
4624 395 -33 -104 -54 291 137 -23 54 -6 43 308 -41 -64 -27 -101 14 154 -177 -53 -41 -51 0 -70 -162 -55
4648 -55 -231 -127 91 -364 -37 40 -31 -294 -63 131 111 -131 35 -54 -74 -127 154 -90 -54 -98 -162 -57 9 -55
4672 -55 -105 187 183 63 72 287 173 173 -100 -127 4 -20 -79 97 13 23 -38 -69 -68 -21 -22 126 -200 -147 45 -147 129
4699 129 39 52 111 -149 -202 3 47 257 333 -331 -62 327 111 223 24 -159 -13 -141 46 -182 -90 -187 -30
4722 -30 82 94 -60 -1 -175 -112 28 -179 -169 52 -3 56 -34 -28 71 -139 -79 -14 19 407 62 60 189 -84 75
4747 75 268 -126 104 -28 10 76 -144 7 -161 -130 -273 -43 17 -67 -59 -301 23 304 2 213 98 -153 -54
4770 -54 253 -18 -24 -178 44 -236 -268 75 -273 180 -101 -115 -132 -78 146 88 65 25 241 118 -149 182 74
4793 74 -23 -92 98 -36 -127 108 204 115 294 146 -21 -20 132 -6 -8 207 107 -29 31 63 102 179 10 -32 152
4818A52j35j15J00k12L69k35oJ89o3P1j12Q7k61K16j99J37o6L03j63k09P0l3j23
4841b38J43J41k4o6j97L65L7l08R6J71k80K28k42M68j03j93k47K62l0J25l04K76
4863H0nP3j99J57j13n2J55q0o9J51P3k08Q6j74J9J81k63J98P4k05L29k13j30J44
4887IJ36q2j60J58m25M55k73L10j03kJ74n22L47j53K83k10ok6L69k06j41K71k1
4910A82l73L80r1k0j46J33j82L15ol9j88o9J26K96j58l4k51lM6K1L52m05K59k25
4934h0M8N5qJ08j71K3o6N5o7J24j20J35p8K1J56j25j1j45R2j65J65J67m0J62j35
4959A00p0m47M23J09j82K05q5M2j62lN7m0M3O2M2K8k88K77k69O7o9J76N7Kkl34
4985b61K78N8j09j73J68J12k53M37p1k23k1J01q7p5LR1J01l2p2m9j3r7M22l28
$$ plain form
4818 152 17 -98 2 -210 159 -76 -82 107 44 115 3 90 -171 45 -154 -17 -83 220 57 -152 -82 -115 -238
4841 -238 -95 46 22 -44 -241 124 161 -147 -51 120 -160 68 -174 294 191 -2 -249 13 -17 108 -196 80
4863 80 75 148 -51 106 -7 -59 96 16 -53 98 171 -37 49 -125 -106 75 -188 10 84 -121 208 -5 -135 9
4887 9 145 63 -97 61 -364 91 -182 128 25 23 197 -325 22 -131 152 -58 -64 -90 279 73 -68 203 182
4910 182 -191 189 98 78 -68 65 -117 198 192 153 -35 -104 22 318 160 126 -125 -128 -82 -61 291 -114 145 -80
4934 -80 -32 23 15 123 -48 -25 -91 -36 -103 21 -99 36 -42 -21 135 10 -1 -146 -54 -219 -54 113 73 235 100
4959 100 30 -417 6 115 -67 138 53 95 -67 -70 -13 -53 -10 52 94 122 -166 111 -158 -91 -160 16 73 75 73 -261
4985 -261 17 75 -34 -207 -39 73 -180 257 186 -37 -58 43 -44 -119 -116 -25 76 44 -28 -77 -90 -187 235 -93
5009i3N1k50L05j88K60K7J59j62j79r0O6L63j97K34m52K61k87r1M41l57l0L94
5031A85k02p7L54j87J98j50L9j63k54K53p5j05L63k23k14J21R3J90j27OJ59l3
5053A51k04o3K99l26j25J57J00P4R2m38M5K29j75J93l0k52J49J82l4R0j89q6N6
5076a05J54j58pK3J6j6K56jj48k7R9k3N4M2j82JK04j19r5j66J92O9J06m37L23
5101E5j47j00QJ7L04k47J80J30j77J90k03j4j98J60p3K22j78J78j23J68k72R1
5123b9K95m57P6M4L44k04j80J96r8J09n3m1j09m4J09q4L78j58p1o9Q9J06O4j93
5147B0r0L40j35l31K37k14J75j20J23j72K48J2o3j81J1j95K24L32j38q5N5k71
5169b18K21j7J44j49J80l43J17p3K32J35n3j75P9n4K63k57j96L13k60L3K23j23
$$ plain form
5009 -93 -42 -292 13 -175 85 112 271 109 -70 -160 -94 269 72 306 -146 115 -172 -263 178 -179 -209 185
5031 185 -17 -94 260 73 271 121 160 -3 -257 -4 -79 -184 179 -44 -258 -137 -44 146 19 25 184 151
5053 151 -53 -116 183 -143 -268 -111 -11 63 155 -283 -238 -9 -184 9 -21 -273 -124 58 24 114 -75 -161 -105
5076 -105 49 -109 -116 -93 -77 -93 163 162 14 -13 86 63 117 159 -23 -22 182 63 -32 -198 -6 63 169 -268 55
5101 55 -92 -192 -184 -167 137 -110 70 200 23 213 10 -4 -202 -42 -115 107 -71 107 -16 152 -120 -29
5123 -29 266 -191 -115 -71 273 69 -111 85 -13 96 43 2 -107 -151 -42 -126 252 94 23 -46 43 149 213 20
5147 20 -70 270 135 -196 41 -173 2 -118 5 -167 81 93 30 -151 -140 -335 -111 221 83 -2 53 -218
5169 -218 3 -14 130 -19 161 -182 -65 -138 94 229 176 1 80 26 289 32 -164 149 -111 -78 145 22
5191B2K6r1kJ1o6k75O04q6o2N6j65j47N0N5Mp6J27Q3j19L4q8N0J14j50J84l4k65
5218b06J87j41K7J99r2K18j13k10j26K10J9kJ81J1l5j8j11j52J62j53J49J40l2
5241A12o3n5J01K35l26N3%J21k45Q1Q0Rk14j60P03n07j3n2K52j77K89j25j98J98
5265I9j51j2K66m5nJ08l83N7J28l8j35J52kp3Q7j78o2K60J6r0pq2J57l6n4j01
5291a24K6K31nl7k25K66q1jJ12j4j88J4j0P9l9L5K9Q7j98j7j92J02L22Q9j94k05
5317a38N4K8M9K38Lk78J19k3K5Q1k79J62L8j77N1j75R1K35n1q4m9j04J70k17L00
5342F9J13j07n7j10K85m4m15L33J04r4k51K5J77JJ86m10L3j24J85K88k56j86L59
5365A04j56K71l36K8k8Oj32K59k38R4R0q3J75j31J37J90k50K02k83O7l2L9L13
$$ plain form
5191 22 48 -43 -45 -34 -100 -375 229 143 81 137 -28 -175 -125 -70 -66 -142 -15 68 -51 -17 -105 -55 59 -91 93 59 -206
5218 -206 -19 -160 -133 66 -26 192 79 -131 -257 -47 -28 -30 151 162 127 109 -2 -154 8 -145 4 144 112
5241 112 49 -6 95 330 4 57 57 178 -67 14 94 103 -111 -271 432 -75 -88 -140 112 -65 224 99 -99 99
5265 99 -52 -64 202 157 152 260 -123 -66 62 24 -111 41 39 -34 53 -125 -187 73 89 -1 -8 -90 67 31 -23 -124
5291 -124 -98 133 128 91 -134 132 51 50 162 148 -40 -26 -36 43 4 39 68 155 -43 -60 -252 -150 172 261 67 -138
5317 -138 -84 -56 -7 231 234 -44 75 52 77 158 -121 41 79 -98 -47 -222 -131 104 53 -31 -80 -184 -14 -231 69
5342 69 182 75 18 -92 193 149 -266 67 171 77 -174 -149 28 29 215 -195 -162 -286 -101 187 -69 -255 104
5365 104 -52 219 -117 -89 -117 -111 -243 16 -222 -128 -38 -121 54 -77 60 250 0 202 -81 -14 -46 -7 306
5388C06J5k97k33K76q8qm6k5J24O8R5p4l19K92n7j69j53M53M9j9l35m7J96j36
5412a32J71l16P0L18k02j13K09k19L27l77K81j50K32l19J30J24J25j49J8J5K13
5433B56om94N40l82P9O0k32q9J49J14R8Q5m12K17m2K20r1R2j22l8r9J16P3l7o4
5458il85L67N4QJ08k43%O6j59J38K0p7L3J65J92l30J32j89J34J39Q5k33j46K78
5482A48j27j19m4J7K33Q1k41L3n0K7R3J40k33K32l47K61j8o9K59k37j95J73j00
5505h3j37K73m4LN4J06m0J7j61J90k35J35j01j76J98N4j07K28J3P6n63K63O9l7
5529ek63J08K18k33J37M0p8J88l9j34R4N5K3J00k05O9j31L1kn1J91k87J61k72
5553b85J86K09k08K24n0r8J55Nk5j15j13o8J97j39J16J37k42J61L9n9J84k78M7
$$ plain form
5388 306 321 24 -209 67 -21 -29 -75 -100 24 92 187 113 -206 86 29 -140 -293 160 209 190 -145 -192 4 -132
5412 -132 39 -277 -207 111 -91 -204 5 -214 113 -264 17 -133 99 -220 -90 34 159 10 28 43 256
5433 256 250 -244 296 -86 -7 53 -179 -268 -119 -5 93 178 -234 -17 -59 161 70 162 40 2 -97 19 92 55 -9
5458 -9 -394 -27 27 35 143 -100 -100 -34 -193 -55 -35 -112 -79 86 278 -52 80 -109 25 164 249 16 -130 148
5482 148 21 -98 -142 -125 108 189 -52 -19 -69 -42 51 191 -42 190 -157 104 86 17 276 39 -156 17 -83
5505 -83 -220 53 9 12 66 172 132 149 -12 178 -57 78 -23 -199 -1 53 -54 174 187 263 -300 -37 32 -5
5529 -5 -268 -160 58 -175 -38 2 -76 112 73 -61 33 88 111 211 6 75 -56 -25 -27 -78 113 -174 -13 -285
5553 -285 -99 110 -98 126 76 -22 133 138 113 -2 -115 -183 14 -125 -9 128 -114 47 86 27 211 -67 -20
5576b0R1J67o8j73J69n4k76J99o2L6K49l76J98J68k01l15M27Mk01J45j27J33k35
5599a22J46N4r5L7k21J89J07j07j22K65Pr0R5j67R7l38L49j60p3L84l28N6j15
5622a52K12k17N6K03k44j98L91J78k96J11k15J67L4j19m2k1R7j86K71J94j55p2
5644cJ43J4L1J01l57K09r3N8k23j28L47j14j04K8j75K77P8k12N1q4J33J19Lj13
5668a4P7k47K71k48K46j38K30l22j73L87j74K38p4j08K03k07J79j30K38N6k08
$$ plain form
5576 -20 71 238 170 -3 166 112 -164 35 -27 9 258 -118 80 248 47 -268 159 163 -38 107 -20 113 -122
5599 -122 24 78 -17 20 -201 -12 95 -12 -134 131 138 48 143 -24 73 -265 84 -76 -149 235 -93 -37 -152
5622 -152 60 -157 -101 102 -142 -340 51 229 -67 44 -171 -4 30 -89 -131 -152 -55 -241 30 224 69 -3
5644 -3 140 154 185 286 -71 138 45 103 -120 -248 99 -15 -119 -91 -266 11 89 -123 -72 -156 -23 96 99 -14
5668 -14 63 -184 87 -161 85 -53 177 -145 -318 69 -105 133 59 -49 154 -53 126 -4 234 290 82
$$ [...]
8191A82
##END NTUPLES=NMR FID
##END=
