##TITLE=1H_Pr Mat
 200.13MHz, CDCl3,
 8 sc
 
 5.2.2025
##JCAMPDX= 6.0         $$ Bruker NMR JCAMP-DX V2.0
##DATA TYPE= NMR FID
##DATA CLASS= NTUPLES
##ORIGIN= UXNMR, Bruker Analytische Messtechnik GmbH
##OWNER= pz
$$ XWIN-NMR		Version 3.5
$$ Wed Feb  5 16:30:31 2025 Russian Standard Time (UT+4h)  she@DPX200
##.OBSERVE FREQUENCY= 200.1313
##.OBSERVE NUCLEUS= ^1H
##.DELAY= (6, 6)
##.ACQUISITION MODE= SIMULTANEOUS
##.ACQUISITION SCHEME= undefined
##.AVERAGES= 8
##.DIGITISER RES= 18
##SPECTROMETER/DATA SYSTEM= spect
##.PULSE SEQUENCE= zg30
##.SOLVENT NAME= D2O
##.SHIFT REFERENCE= (INTERNAL, D2O, 0, 14.3821)
##AUDIT TRAIL= $$ (NUMBER, WHEN, WHO, WHERE, WHAT)
$$ ##TITLE= Audit trail, XWIN-NMR		Version 3.5
$$ ##JCAMPDX= 5.01
$$ ##ORIGIN= Bruker BioSpin GmbH
$$ ##OWNER= she
$$ F:/spectra/data/she/nmr/H-C/1/audita.txt
$$ ##AUDIT TRAIL=  $$ (NUMBER, WHEN, WHO, WHERE, WHAT)
(   1,<2025-02-05 16:29:24.85 +0400>,<she>,<DPX200>,
      <created by zg, POWCHK disabled, PULCHK disabled
       configuration hash MD5:
       00 E9 B6 7A A2 85 ED C7 34 08 36 98 17 FE 4E 26
       data hash MD5: 16K
       10 57 89 7D 3C 96 68 F8 DD 98 93 5B 93 1E E5 A3>)
$$ ##END=
$$ 
$$ hash MD5
$$ 44 7E D4 B1 85 7C BF 64 C2 D0 F1 1B 7D 49 D4 0B
##$RELAX= 
##$RELAX= 
##$RELAX= 
##$RELAX= 
##$RELAX= 
##$RELAX= 
$$ Bruker specific parameters
$$ --------------------------
##$DU= <F:/spectra>
##$EXPNO= 1
##$NAME= <H-C>
##$PROCNO= 1
##$TYPE= <nmr>
##$USER= <she>
##$AMP= (0..31)
100 100 100 100 100 100 100 100 100 100 100 100 100 100 100 100 100 100 
100 100 100 100 100 100 100 100 100 100 100 100 100 100 
##$AQSEQ= 0
##$AQ_mod= 1
##$AUNM= <au_zg>
##$AUTOPOS= <>
##$BF1= 200.13
##$BF2= 200.13
##$BF3= 200.13
##$BF4= 200.13
##$BF5= 200.13
##$BF6= 200.13
##$BF7= 200.13
##$BF8= 200.13
##$BYTORDA= 1
##$CFDGTYP= 0
##$CFRGTYP= 5
##$CHEMSTR= <none>
##$CNST= (0..31)
1 1 145 1 1 1 1 1 1 1 1 1 1 1 1 1 1 1 1 1 1 1 1 1 1 1 1 1 1 1 1 1 
##$CPDPRG= <>
##$CPDPRG1= <>
##$CPDPRG2= <>
##$CPDPRG3= <>
##$CPDPRG4= <mlev>
##$CPDPRG5= <mlev>
##$CPDPRG6= <mlev>
##$CPDPRG7= <mlev>
##$CPDPRG8= <mlev>
##$CPDPRGB= <>
##$CPDPRGT= <>
##$D= (0..31)
0 0.7 0 0 0 0 0 0 0 0 0 0.03 0 0 0 0 0 0 0 0 0 0 0 0 0 0 0 0 0 0 0 0 
##$DATE= 1738758564
##$DBL= (0..7)
120 120 120 120 120 120 120 120 
##$DBP= (0..7)
150 150 150 150 150 150 150 150 
##$DBP07= 0
##$DBPNAM0= <>
##$DBPNAM1= <>
##$DBPNAM2= <>
##$DBPNAM3= <>
##$DBPNAM4= <>
##$DBPNAM5= <>
##$DBPNAM6= <>
##$DBPNAM7= <>
##$DBPOAL= (0..7)
0.5 0.5 0.5 0.5 0.5 0.5 0.5 0.5 
##$DBPOFFS= (0..7)
0 0 0 0 0 0 0 0 
##$DE= 6
##$DECBNUC= <off>
##$DECIM= 32
##$DECNUC= <off>
##$DECSTAT= 4
##$DIGMOD= 1
##$DIGTYP= 9
##$DL= (0..7)
0 120 120 120 120 120 120 120 
##$DP= (0..7)
150 150 150 150 150 150 150 150 
##$DP07= 0
##$DPNAME0= <>
##$DPNAME1= <>
##$DPNAME2= <>
##$DPNAME3= <>
##$DPNAME4= <>
##$DPNAME5= <>
##$DPNAME6= <>
##$DPNAME7= <>
##$DPOAL= (0..7)
0.5 0.5 0.5 0.5 0.5 0.5 0.5 0.5 
##$DPOFFS= (0..7)
0 0 0 0 0 0 0 0 
##$DQDMODE= 0
##$DR= 18
##$DS= 0
##$DSLIST= <SSSSSSSSSSSSSSS>
##$DSPFIRM= 0
$$ [...]
##$SUBNAM0= <"">
##$SUBNAM1= <"">
##$SUBNAM2= <"">
##$SUBNAM3= <"">
##$SUBNAM4= <"">
##$SUBNAM5= <"">
##$SUBNAM6= <"">
##$SUBNAM7= <"">
##$SUBNAM8= <"">
##$SUBNAM9= <"">
##$SW= 18.0517328524113
##$SWIBOX= (0..15)
0 0 2 0 0 0 0 0 0 0 0 0 0 0 0 0 
##$SW_h= 3612.71676300578
##$TD= 16384
##$TD0= 1
##$TE= 0
##$TE2= 300
##$TE3= 300
##$TEG= 300
##$TL= (0..7)
0 120 120 120 120 120 120 120 
##$TP= (0..7)
150 150 150 150 150 150 150 150 
##$TP07= 0
##$TPNAME0= <>
##$TPNAME1= <>
##$TPNAME2= <>
##$TPNAME3= <>
##$TPNAME4= <>
##$TPNAME5= <>
##$TPNAME6= <>
##$TPNAME7= <>
##$TPOAL= (0..7)
0.5 0.5 0.5 0.5 0.5 0.5 0.5 0.5 
##$TPOFFS= (0..7)
0 0 0 0 0 0 0 0 
##$TUNHIN= 0
##$TUNHOUT= 0
##$TUNXOUT= 0
##$USERA1= <user>
##$USERA2= <user>
##$USERA3= <user>
##$USERA4= <user>
##$USERA5= <user>
##$V9= 5
##$VALIST= <valist>
##$VCLIST= <CCCCCCCCCCCCCCC>
##$VD= 0
##$VDLIST= <DDDDDDDDDDDDDDD>
##$VPLIST= <PPPPPPPPPPPPPPP>
##$VTLIST= <TTTTTTTTTTTTTTT>
##$WBST= 1024
##$WBSW= 4
##$XGAIN= (0..3)
0 0 0 0 
##$XL= 0
##$YL= 0
##$YMAX_a= 235397
##$YMIN_a= -266614
##$ZGOPTNS= <>
##$ZL1= 120
##$ZL2= 120
##$ZL3= 120
##$ZL4= 120
##$ABSF1= 10
##$ABSF2= 0
##$ABSG= 5
##$ABSL= 3
##$ALPHA= 0
##$AQORDER= 0
##$ASSFAC= 0
##$ASSFACI= 0
##$ASSFACX= 0
##$ASSWID= 0
##$AUNMP= <proc_1d>
##$AZFE= 0.1
##$AZFW= 0.1
##$BCFW= 1
##$BC_mod= 2
##$BYTORDP= 1
##$COROFFS= 0
##$CY= -3
##$DATMOD= 1
##$DC= 2
##$DFILT= <>
##$DTYPP= 0
##$F1P= 0
##$F2P= 0
##$FCOR= 0.5
##$FTSIZE= 0
##$FT_mod= 4
##$GAMMA= 1
##$GB= 0.15
##$INTBC= 1
##$INTSCL= 1
##$ISEN= 128
##$LB= 0.25
##$LEV0= 0
##$LPBIN= 0
##$MAXI= 10000
##$MC2= 0
##$MEAN= 0
##$ME_mod= 0
##$MI= 1.114404
##$NCOEF= 0
##$NC_proc= 0
##$NLEV= 6
##$NOISF1= 3.799351
##$NOISF2= 2.8
##$NSP= 1
##$NTH_PI= 0
##$NZP= 0
##$OFFSET= 14.38212
##$PC= 1
##$PHC0= -101.3619
##$PHC1= 7.99221
##$PH_mod= 1
##$PKNL= yes
##$PPARMOD= 0
##$PSCAL= 0
##$PSIGN= 0
##$REVERSE= no
##$SF= 200.129724274929
##$SI= 16384
##$SIGF1= 3
##$SIGF2= 2
##$SINO= 400
##$SIOLD= 16384
##$SREGLST= <1H.CDCl3>
##$SSB= 0
##$STSI= 0
##$STSR= 0
##$SW_p= 3205.1282051282
##$SYMM= 0
##$S_DEV= 0
##$TDeff= 0
##$TDoff= 0
##$TI= <>
##$TILT= no
##$TM1= 0
##$TM2= 0
##$TOPLEV= 0
##$USERP1= <user>
##$USERP2= <user>
##$USERP3= <user>
##$USERP4= <user>
##$USERP5= <user>
##$WDW= 1
##$XDIM= 8192
##$YMAX_p= 0
##$YMIN_p= 0
$$ End of Bruker specific parameters
$$ ---------------------------------
##NTUPLES= NMR FID
##VAR_NAME=  TIME,          FID/REAL,        FID/IMAG
##SYMBOL=    X,             R,               I
##VAR_TYPE=  INDEPENDENT,   DEPENDENT,       DEPENDENT
##VAR_FORM=  AFFN,          ASDF,            ASDF
##VAR_DIM=   8192,          8192,            8192
##UNITS=     SECONDS,       ARBITRARY UNITS, ARBITRARY UNITS
##FACTOR=    0.0002768,     1,               1
##FIRST=     0,             0,               0
##LAST=      2.2672688,     0,               0
##MIN=       0,             -266614,         0
##MAX=       2.2672688,     235397,          0
$$ Real data points
##PAGE= N=1
##DATA TABLE= (X++(R..R)), XYDATA
0@%%%%%%%%%%%%%%%%%%Qj6J6j6J6j6K0k8L2l3M0m7N2o0O8p7Q5r6J10j21J33j47
40g7J64j84K05k26K48k74L04l35L67m04M44m88N39n97O62p34Q18r16J030j167
60f21J337j549J825k199K727l535M909p651J5059p0473k06443K11159K45355j12738
74G7162k06311L1360J25746J4100l9028o712k7623k9385N3759Q3644l0063j07680
86f1031p502J12386M7335q0394n6830M2379L8090j2204m179j559m1044j4618O3774
99B4603K7677q3450m8219P5802M9435o3140m0084M8126K5456l0401L528L0034
111A9367j8316j9341M2846K6304m8371l0290N1705L8229n5585n3778M8805N8604
123F0179n4186p5305M1213P3778l9055p5758K9599O5615k2487m3145K8494L2638
$$ plain form
0 0 0 0 0 0 0 0 0 0 0 0 0 0 0 0 0 0 0 0 8 -8 8 -8 8 -8 12 -16 16 -17 23 -24 28 -32 36 -41 44 -52 58 -63 70 -77
40 -77 87 -97 108 -118 130 -144 160 -175 192 -212 232 -256 283 -314 348 -386 432 -484 546 -621
60 -621 716 -833 992 -1207 1520 -2015 2894 -4757 10302 -60171 -266614 -55455 189900 77162
74 77162 -129149 -97789 27957 42057 3029 -3683 -31306 -60691 -6932 76712 46649 -61031
86 -61031 -68533 43853 91188 10794 -46036 -3657 34433 22229 18050 16491 -24553 -39171 24603
99 24603 52280 -31170 -79389 -3587 45848 -17292 -57376 -9250 16206 -14195 -10667 19367
111 19367 1051 -18290 24556 50860 2489 -27801 23904 62133 6548 -47230 1575 60179
123 60179 5993 -69312 -28099 45679 6624 -69134 -39535 26080 3593 -39552 -11058 21580
135B1580k2752j1686L2444J1420k7187k966K6504J98k2565M63R327j3394j1979
148a0593J2478L753k7671j5169K7691K1170k7298k6699K5072L4317j3499k2755
160a9203K0774K3171j8571q581K8255N353l0490l473K5835k248k5161j039Q883
173C505j3074r487J7202M573k8255j3031L3047K9688k5321l6912J9247M8088J052
186C0322l7685q383K8674J5054j2589j0125k000m611M420J2132r162k4364N56
199a7761K1173J819j7407l919Q597J307J253R404j653j3511K409K0704P847j8315
213A947j4904J4103K1005p258k3584j107J7980L574j4226n222M576k61K038N337
227C998p265r812R063J3782p474j4209N825J4396k955j0815K374Q190j925n893
$$ plain form
135 21580 -1172 -12858 19586 31006 3819 853 27357 27555 4990 5453 14780 1386 -10593
148 -10593 1885 5638 -22033 -37202 -9511 11659 -15639 -42338 -17266 17051 3552 -19203
160 -19203 1571 24742 6171 -2410 25845 31198 708 -2765 23070 20822 -4339 -5378 3505
173 3505 -9569 -19056 -1854 2719 -25536 -38567 -5520 24168 -1153 -38065 -18818 29270 30322
186 30322 -7363 -15746 12928 27982 15393 5268 3268 -1343 3077 15209 6047 -18317 -17761
199 -17761 3412 5231 -12176 -16095 -7498 -6191 -4938 4466 2813 -10698 -8289 12415 20262 1947
213 1947 -12957 1146 22151 14893 -8691 -9798 8182 11756 -2470 -7692 -3116 -3377 -1339 3998
227 3998 -3267 -13079 -4016 9766 2292 -11917 -6092 8304 5349 -5466 -3092 5098 3173 -2720
241b720J943N070j952n316K589O705k170o835J120O781k07p202k88M022j808k230
257b498L004l058n979M594P816n835r307O669J1561m030r074L945R488J65m899
272B562j024L512J791k590j234N29k899l323L66K075k840n395J156M429k429j952
288g266L893J384k378M286O865j726n766M632Q506k914p630P10M150j259m678
303H09k955j82k64j820k113q84m55P53K065J533l70N0M772M382k449j276N742
320G338K657m684j493L308p50n473p42J902l751m604J019J668j873j924N86J833
336d983J496O88J687J335J425K301R58O52J1j387J079J351l445l468J706K30m372
353b736k269K247l56l404N30L363n33o36K674J504m73J495J995K04l25O1K94k18
$$ plain form
241 -2720 -777 4293 2341 -2975 -386 6319 4149 -2686 -1566 5215 5008 -2194 -2482 1540 -268 -2498
257 -2498 506 -2552 -8531 -3937 3879 -1956 -11263 -4594 6967 2937 -6137 -2192 7296 7461 2562
272 2562 1538 5050 6841 4251 3017 3546 647 -2676 -2310 -235 -3075 -8470 -7314 -2885 -5314 -7266
288 -7266 -3373 -1989 -4367 -81 6784 5058 -708 3924 12430 9516 1886 2596 6746 5487 809
303 809 -2146 -2328 -2592 -4412 -6525 -7409 -7864 -7111 -5046 -3513 -3883 -3833 939 5321 2872 1596 7338
320 7338 9995 5311 3818 7126 6376 903 161 2063 -1688 -6292 -5273 -3605 -5478 -7402 -6816 -4983
336 -4983 -3487 -2799 -1112 223 1648 3949 4907 5559 5570 4183 5262 6613 3168 -300 1406 1636 -2736
353 -2736 -5005 -2758 -3114 -6518 -5988 -2625 -3158 -3794 -1120 384 -89 1406 3401 3605 3280 3341 3635 3417
371C417l77j215j978m88K53j708p1M97k465n42L774J973l550j104L682K929j014
388B013j083l30R0J629J554k516l480O27L084L15k739k238M36K341J391j308k338
405b552R60K990Q43p18n88r91k95K579N57l656j976K094J563j397j155p17n41
422c000J643K220j248j623K120K024k59J40M81p6q52k67R18k88j540k387p74K157
440f11J144l933l191K769L951m36j988lR49K593L220J9m224q93N184L113k762
457D901n527j865L228L042k999n946j894M580K715k432l091J82J719L846K302
472B761k110k250K545M421J388k079l775o20L456J799l534n721O84L371j756l796
488e216K03K369m1j558O42L493J390j562m68L259K986r19l446K63L347j4k973
$$ plain form
371 3417 3040 1825 -153 -641 -388 -2096 -2167 -1670 -4135 -4677 -903 1070 -2480 -3584 98 3027 2013
388 2013 930 600 690 2319 3873 1357 -2123 -1496 1588 1903 -836 -3074 -2638 -297 1094 -214 -2552
405 -2552 -1592 1398 2241 1523 935 -56 -351 2228 2785 -871 -2847 -753 810 -587 -1742 -2459 -3000
422 -3000 -1357 863 -385 -2008 112 2136 1877 2017 2498 2422 1570 1303 2221 1933 393 -1994 -2768 -611
440 -611 533 -3400 -6591 -3822 129 -307 -2295 -2298 -1349 1244 4464 4483 259 -634 4550 7663 4901
457 4901 -626 -2491 737 3779 780 -5166 -7060 -2480 235 -2197 -5288 -5106 -3387 459 2761
472 2761 651 -1599 946 5367 6755 4676 901 281 3737 5536 2002 -3719 -3035 336 -1420 -5216
488 -5216 -5013 -2644 -2685 -4243 -3601 -108 1282 -280 -748 2511 5497 4578 1132 1395 4742 4728 1755
505A755j715r75j167Q38J765j809m886m85M955L320k339l764K31O000M282l415
521B591m369K434M042Q28k654l046o31J471J879p92m025l308J932M045Q39m260
537c024l662L753O106j21m676j074M618K861k456k148J159J435j374j527K84P08
553H62k148j865J683K302j303l190j47M019J989k352j418J591J475K19Q50jj454
570A112k082O04K792l9m020k868K327M106j076m882l37M285J771o89j719m10J345
587B20K915R86k028l475L37L813J173l524l991K60L889Q95l682k555J996L354
603E83k97j941R8K565R41k40o41N02P91j15r12K07L99k293j496R20J097j613j807
622c252O94J215o02p26J814K008r44j301J824K784j59k290k10J295J116j244k292
$$ plain form
505 1755 40 -935 -2102 -1264 501 -1308 -6194 -6679 -1724 1596 -743 -4507 -4276 1724 6006 2591
521 2591 -1778 656 4698 5526 2872 -174 -805 666 2545 1753 -2272 -5580 -3648 397 1236 -3024
537 -3024 -6686 -2933 3173 3052 -1624 -2698 1920 4781 2325 177 1336 2771 1397 -130 154 862
553 862 -1286 -3151 -1468 834 -469 -3659 -3806 213 2202 -150 -1568 23 1498 1717 2567 2566 1112
570 1112 -970 -366 2426 2387 -1633 -4501 -2174 1932 856 -4026 -4363 -78 1693 1004 -715 -1125 220
587 220 3135 4121 2093 -1382 -1045 2768 3941 417 -3574 -3314 575 1470 -2212 -4767 -2771 583
603 583 286 -1655 -1557 1008 1949 1709 1068 1570 2361 2246 1334 1541 1940 -353 -1849 -929 168 -1445 -3252
622 -3252 -2558 -1343 -1945 -2671 -857 1151 207 -1094 730 3514 3355 1065 855 2150 3266 2022 -270
639b70q10R71Q0q93j672j154J108K232J70k424q21K851L153p34j573J89J514J479
657C396m1j403j353J64J193q68k115r34N76K3m59l53n19J90J113J332P07p66p69
676h86J667K395j74k011n83J824M81j563j542O05j6j638k50K13m09k85O35N73
694i64l59J6J720P2j23J004O45m21l60J57N25k77j224p59K78L24j410r14P10M55
714i05n20m64J015N35K2O68R3Q0N11Q84k6j192M9Q56n13j435j3K91o78q09lL88
736a166n5j84L13P56N72m03K22J030J118j210l59R14J7r76j4j27o76o83K49k48
756i10j019N0J075Q8p10M47R03P82m29K00N81N70j06l18m1n8n36n38j38q0p36
777i23n07K09K0m08K32N66J04k11J303O18p17M21J195l74l75%L31n63m40m36o43
$$ plain form
639 -270 -1080 -109 -29 -922 -2594 -3748 -2640 -408 -238 -2662 -3483 -632 2521 1787 214 403 1917 3396
657 3396 3355 1952 599 763 1956 1088 -1027 -1961 -1385 -1362 -1821 -2174 -2693 -2503 -1390 -58 649 -117 -886
676 -886 781 3176 3002 991 408 2232 2713 1150 -392 213 197 -1441 -1691 -1478 -1887 -2172 -1537 -964
694 -964 -1323 -1307 413 485 362 1366 2011 1590 1230 1387 1912 1635 411 -348 -70 254 -1156 -2070 -1360 -905
714 -905 -1425 -1889 -874 -339 -317 351 444 524 1035 1919 1893 701 750 1606 1093 -342 -355 -64 -742 -1551 -1554 -1166
736 -1166 -1221 -1405 -1092 -336 236 -167 55 1085 2203 993 634 1548 1565 589 575 448 -228 -911 -662 -910
756 -910 -1929 -1879 -804 -716 -1426 -979 -76 706 277 477 1058 1628 1522 1204 1163 1105 569 31 -107 -187 -923
777 -923 -1430 -1221 -1201 -1609 -1377 -811 -707 -918 385 1003 286 707 1902 1528 1153 1153 1484 921 481 45 -598
798e98P2m18n84j40L16j05o3N95P77l17N18N49M95k5M70J22j90k63J65m36p99
819A41l60O4o75n34k34K44j07Q1j14N15N96O14O6L35M90K70m7N5K28o41N3j18
841I22p16p85Q2j65m06p16M40J91k40K72N10L90K33M52K28K49N3L85R8l04j65
862A008o08l1m0n84o82j3Jl19O3p7J58J94N72K28L12k06R82M56j80k09J76k60
884I41n3l79l29m90l46k3l6m58j53k8K54M75L07K51j12O16L45N58j81j73k29J05
906H62K35k31r93l65K94l10k54l60k81M93R6K70J10j26M12P60K59J17k34JJ55
927I10M04l86o02m25K84k89n32l02j78q3L03J95l6j17N50M13M04M26k16lK02K22
949A144K50j015M6k00l6l85j75m52l70k6K92O7P4%J10O68O77j34o12P45Q88J30
$$ plain form
798 -598 -526 -944 -1528 -1668 -1352 -1457 -1520 -925 -148 -465 53 602 1097 1072 1542 1664 1474 1211 1376 940 141
819 141 -219 -155 -830 -1364 -1598 -1354 -1461 -1380 -1494 -979 -383 231 297 632 1122 1392 1345 1400 1628 987 1040 922
841 922 206 -579 -497 -662 -1068 -1784 -1344 -1153 -1393 -1121 -611 -221 12 464 692 941 994 1379 1477 1173 1008
862 1008 400 369 329 -255 -937 -950 -949 -1268 -1205 -1282 -1124 -930 -358 -130 182 -24 958 1414 1234 1025 1201 941
884 941 888 509 180 -310 -656 -679 -715 -1173 -1326 -1354 -1100 -625 -318 -67 -179 437 782 1340 1159 986 757 862
906 862 1097 866 -127 -492 -198 -508 -762 -1122 -1403 -910 -814 -544 -434 -560 -148 612 871 988 754 755 910
927 910 1314 928 326 -99 185 -104 -636 -938 -1116 -1199 -896 -701 -737 -854 -304 109 513 939 723 720 922 1144
949 1144 1394 379 425 225 189 -196 -371 -823 -1193 -1219 -927 -860 -786 -786 -676 -8 669 535 -77 668 1556 1686
971A686j080K9p1k1j97k83o64m83L9L69j35j74l12L64P67N43n79J01Q63N49j76
992A135n28m2N69j59l86P5r41j15j46L7n28J02l49J94N26K49J36k55O32N66k89
1013D83oM46J97n4n64N6J75l33r39J30J84j98q97k44Q32N43o15k80P32O63k48
1034F3L88M88O5l50K77K49l98n75k52J76l8j98r83M8O26j91m60j16P57N42p4J21
1056A65J09J20K91M12j95N2n5m01k31J02l53p06O5j8k6l05J38P47m14j4K33M71
1078A87K66Q2m8L14J45k26j97J7Pl17n87k3K4j12k99L36l03l15M4O72R7K50K25
1101B39L83q4J11K57k15M9J07k94n68N4j16j92k24k95r0j87L88K12l3L53L50k9
1123A76K7M61J00m26M85J06l79k66Q7l7m13k90r3j67j17O4O5N9P2L78m5J7N91
$$ plain form
971 1686 606 635 564 543 346 63 -601 -1084 -1045 -676 -811 -985 -1297 -933 -166 377 -202 -101 762 1311 1135
992 1135 607 565 1134 975 589 664 -277 -392 -538 -501 -1029 -927 -1276 -1082 -556 -307 -171 -426 206 772 483
1013 483 477 923 1120 1066 502 558 733 400 -539 -409 -225 -423 -1320 -1564 -732 -189 -804 -1084 -352 311 63
1034 63 451 939 1004 654 931 1180 782 207 -45 131 93 -105 -1088 -1040 -414 -605 -1065 -1181 -424 118 44 165
1056 165 274 394 685 1097 902 954 899 498 267 369 16 -690 -625 -643 -669 -974 -836 -89 -503 -517 -284 187
1078 187 453 535 487 801 946 720 523 540 547 230 -357 -380 -356 -468 -767 -431 -734 -1049 -1005 -333 -236 14 239
1101 239 622 538 649 906 691 740 847 553 -15 39 -77 -269 -493 -788 -878 -1065 -677 -465 -498 -145 205 176
1123 176 203 664 764 338 823 929 550 284 371 334 -79 -369 -462 -629 -746 -682 -617 -558 -486 -108 -153 -136 455
1146D55J13j44M39j62m6O6K46o48k96M4l36l62R7M2l82J92o2M74l69L78L27p7
1168a1K58M03J63l10L94k84o9j64k0m25M1j4n00l02k33O43m75L17J88J76J31J86
1190I3M15j04qM89j16j02ok9j64m93L8l46k03k02Q4j55L67q7q6J13L74J31q4L66
1214B85K43J5k9L01J04q92K83J62l56o30N4R4l34NL1j21J48K10N4K95K34J25P1
1237C52P3K15p7n3P9r9l6m28j20l14p8J32m31JL37l5M1K7M87J6O6K02J68j7K0
1262E28KJ53k65k21j40j43P3l19j93p2K05k37J3K73P4J74j37N72p3J30n0L02j88
1285D61j79L12r6l19q7j86j88P6l38j33P2O9J38j11J82L11k8K89J06J16oK74j38
1308E97j52l20K50r1m45j38J27k71k90K59N0l16L50J41J92J3J76J86j38L48J7
$$ plain form
1146 455 568 424 863 701 655 721 967 319 23 67 -269 -631 -534 -492 -874 -682 -744 -270 -639 -261 66 -11
1168 -11 247 650 813 503 897 613 544 380 360 -65 -24 -38 -538 -840 -1073 -430 -905 -588 -400 -224 -93 93
1190 93 508 404 396 885 769 667 661 632 468 -25 13 -333 -536 -738 -654 -809 -442 -529 -615 -502 -128 3 -81 285
1214 285 528 543 514 815 919 27 310 472 116 -514 -460 -366 -700 -695 -664 -785 -637 -427 -373 -78 156 281 352
1237 352 425 640 563 510 589 490 454 26 -94 -408 -486 -354 -785 -784 -447 -482 -441 -414 73 89 155 357 525 508 528
1262 528 530 683 418 197 57 -86 -13 -332 -525 -597 -392 -629 -616 -343 -269 -95 -232 340 267 397 347 649 461
1285 461 282 594 498 179 92 -94 -282 -206 -544 -677 -605 -536 -398 -509 -327 -16 -44 245 351 467 461 735 597
1308 597 445 125 375 284 -161 -299 -172 -443 -733 -474 -424 -740 -390 -249 -57 -44 132 318 180 528 545
1329E45q7K06k65j17j25j64l30q8M0j18k64J07M44l21K65J32J89j53K66L89N2
1350F03p0k25M52m11j6l03Pj29m8o3k72j71J70k38L71J51O5j16L70Q4K38RK63
1373G21j10k21J28n3n08j13N1J21k13k94P2J14j92P0j4J24J92J58j50L30L69p8
1395E04k32K13M4j09j4j52k60P7l64L6l8j53j18M2j1K63K18j72K48L59J41r8K04
1418F28j73k34K05k35j50k18qj71O3j5r5j14P0K11k84K61K39l5K61J33l3J57j40
1441C23L1J05O5k66k19%j6l27l74R5mK88k14J82K44k35L48K36O2L2K27j4l88L30
1465E11J05m85q5m2j19j42j90M7m2J25k53K09n3P7L88m2J96J47jk0%J16l45L15
1489D17k51j64j37j13J0j99q0K8O0N1K27j24O2K65Q5J61J7qK90m29m9L29k89j43
$$ plain form
1329 545 458 664 399 282 157 -7 -337 -425 -385 -503 -767 -660 -216 -537 -272 -140 49 -104 162 551 603
1350 603 533 308 760 349 333 30 37 -92 -140 -203 -475 -646 -476 -714 -343 -192 -127 -243 127 211 449 458 721
1373 721 611 390 518 465 -43 -156 -105 16 -197 -491 -419 -305 -497 -427 -441 -317 -125 33 -117 213 582 504
1395 504 272 485 529 420 406 254 -6 71 -293 -257 -295 -448 -566 -524 -535 -272 -54 -226 22 381 522 424 628
1418 628 455 221 426 191 41 -177 -185 -356 -293 -308 -403 -517 -447 -236 -520 -259 -20 -55 206 339 306 463 323
1441 323 354 459 524 258 39 39 23 -304 -678 -583 -587 -299 -513 -331 -87 -322 26 262 324 356 583 569 181 511
1465 511 616 131 46 4 -115 -257 -447 -400 -442 -317 -570 -361 -414 -337 51 9 205 352 351 331 331 447 102 417
1489 417 166 2 -135 -248 -238 -437 -517 -489 -429 -378 -151 -275 -213 52 137 298 315 307 597 168 119 448 159 16
1513A6r6K93n23J3j42n9k9L83j38j20K20K68r0J44K85L8k30J71q7j83R9l2k24
1536b3Q6j60j96ol2J36r9j04J85r6K25RM38K5k70K02j33J18J15k5j60j33k3j15
1560c6m7k45j33l1LJ05L64o6j13M61k09J53J99L1l01L07N0j39k29J56l54l09K64
1583a19k90j71J65K90l63Q8J74M4K59p8K93k04O6Q7M4J91L4j57k26k27R4k12r8
1606c16R8N5l2l66L06K19k11J72l2J61J31K76j85J94P3j15j15J7n6k55q4k70J1
1629c24O7j84K44l57K60J30J5j8K69O5N2J25J58k50J00O1l15mN3k66o7n2K2Mj62
1654c74J21r3n7M01n8K52q3J68M2j27J56n4j21n3p2j67J23r6p0J6j58N4R9j04
1678b55k3J19l5k8L69j20J93J17M2r2j48J60j85j85J19n8m15K39J26l71J39j3
$$ plain form
1513 16 -80 213 -310 -297 -439 -498 -527 -144 -282 -402 -182 86 -4 140 425 463 233 404 317 134 233 201 -23
1536 -23 63 -97 -293 -299 -331 -195 -294 -398 -213 -309 -84 -75 363 388 118 320 187 305 420 395 235 102 79 -36
1560 -36 -83 -328 -461 -492 -489 -384 -20 -86 -199 262 53 206 405 436 135 442 492 353 124 280 -74 -383 -119
1583 -119 -409 -580 -415 -125 -488 -400 -226 -182 77 -1 292 88 154 241 285 476 510 353 127 -100 -6 -218 -316
1606 -316 -218 -163 -195 -561 -255 -36 -247 -75 -107 54 185 461 276 470 543 428 313 330 274 19 -65 -335 -324
1629 -324 -257 -441 -197 -554 -294 -164 -149 -167 102 167 219 344 502 252 352 413 98 94 147 -119 -186 -238 -216 -212 -374
1654 -374 -253 -346 -403 -2 -60 192 109 277 319 192 348 294 173 120 48 -119 4 -92 -162 -146 -304 -250 -151 -255
1678 -255 -278 -159 -194 -222 147 27 220 337 379 287 139 299 114 -71 48 -10 -425 -186 -60 -431 -292 -305
1700c05L1R7k7L12q5J15n3J20J23Q2P7m08R7r1j4j12N9k83n3l4K10k38oJ49J40
1725i7r7P8J34k6K27O1K5k63K10J32j91k63K8o1j32J92j49j29l9R9m2qJ83J60
1749C2k8O3l2K32j54K25j51k35L04j21j72j05K8lj19q7N0m5K02l07N37q5o9K63
1773B23kkj2P0J75j97j86l5L9k4R0k41r6k82N18j33j65R3J22N9j29J26J76l0J27
1798B84J5j78J65k93Qj7j8K4l17K05j67J07m8j25K39m8r1J32N4l3J28q0K31K31
1822D08J06k26m24L65k13k0j73j57J26J1j61K68k21K63o3N1m3K54j57J23J19j21
1844A15J80k27J70j96M0j30k69K22k88J08R1j0ok55L44j22L87K9mj40L68k5r8
1867B84q4j47L88m05j0l51K40j01n6M09m05j66K21J0K83J30L4K7j61J33p2J94
$$ plain form
1700 -305 -274 -177 -204 108 23 138 85 205 328 410 487 79 176 85 71 -41 18 -265 -318 -352 -142 -380 -386 -237 -97
1725 -97 -194 -116 18 -8 219 280 305 42 252 384 193 -70 -42 -103 -235 -43 -192 -321 -360 -261 -303 -311 -128 32
1749 32 4 67 35 267 113 338 187 -48 256 135 -37 -142 -114 -117 -236 -323 -273 -318 -116 -423 114 29 -40 223
1773 223 221 219 207 277 452 255 69 34 73 49 139 -102 -198 -480 38 -95 -260 -167 -45 14 -115 11 187 157 284
1798 284 299 121 286 -7 1 -16 -34 -10 -327 -122 -289 -182 -230 -355 -116 -164 -255 -123 -69 -102 26 -54 177 408
1822 408 514 288 -136 229 16 -4 -177 -334 -208 -197 -358 -90 -311 -48 -111 -60 -103 151 -6 117 236 115
1844 115 295 68 238 42 82 -48 -317 -95 -383 -275 -184 -194 -200 -455 -111 -233 154 183 179 39 407 382 284
1867 284 200 53 441 36 26 -325 -85 -186 -242 167 -238 -404 -183 -173 110 240 274 301 140 273 201 395
1889C95l87K15m7n3P2j83k91J47pp4j9N4q5O5M2l4L75j85K49k80L15p1l9K15j56
1914B33j39J00km63N57l85J46j44j8J6j18K70l3J89k64J64n9L44j13j38M4o6l7
1937H4J34k54j17K16J35m74J88M3r6L1J9j27J62J26M8J10O0j53l0l4p1K80l10
1960c0J42k53L0m8j63J41l2RJ32K5O8j8J30j39J59JQ3Qk71K60o7j16RNk19kJ43
1987a3n8k65K70j4j4n7N6J89J81j58K90k41r2J22P6j19j42P9J06k24n6k18K58
2010d4k53O2O5N9J81j82M10m12M0K04j34J07J14n2n4j67P7j60K29l81K46j38l7
2033b20nP5J5J60k79K17J49m10N67j30q5N6k38L57j37m3j14M7J10k57J43o7j19
2056b08N5k30K01N0OJ08M1P1J7j20O1O0J19j26p8N7Nl0jK5k64o8N6j91K25K39
$$ plain form
1889 395 8 223 176 123 195 12 -279 -132 -139 -213 -232 -178 -263 -198 -156 -190 185 0 249 -31 284 213 174 389 233
1914 233 94 194 192 -271 286 -99 47 -97 -115 -99 -217 53 20 209 -55 109 50 394 281 143 187 121 84
1937 84 218 -36 -153 63 198 -276 -88 -45 -141 -110 -91 -218 -56 70 118 228 288 135 105 71 0 280 -30
1960 -30 112 -141 -111 -159 -322 -181 -213 -204 -72 -47 21 3 133 -6 153 154 237 245 -26 234 167 51 60 65 -154 -156 -13
1987 -13 -71 -336 -66 -80 -94 -151 -95 94 275 117 407 166 74 196 272 153 11 90 196 -28 -84 -302 -44
2010 -44 -297 -235 -170 -111 70 -112 298 -114 -74 130 -4 103 217 165 111 -56 21 -139 90 -291 -45 -183 -220
2033 -220 -225 -150 -135 25 -254 -37 112 -298 269 139 54 110 -128 229 92 49 -65 -18 92 -165 -22 -89 -208
2056 -208 -153 -383 -182 -132 -126 -18 23 94 111 -9 52 112 231 105 27 84 89 59 58 83 -181 -249 -193 -384 -159 80
2082H0r3j42J15M2Q1M2R5J5j52Q9l8l5k18j08J91j05J55k17r4J33P0M6j95L34
2106I1j94K15j90K51n7P1j80OJ14j55M0r7J70k7n6l71M40j31j10J93j00J8L2K29
2130B02j83R5n1J02k02R8R7k75K0oj22J27j43L61m8m8rk65P3J36j2J21O0p3K29
2155B84k33K2j6j6J89k78K7J22q6o4j94K38k71L76j57J40k07K02MplQ0n8R2j35
2180E1j4K4Q4Q8j51k47J92%p5l9K03k93L5K2j8jK8K2J90O0j38J16j09J57j72J87
2206B02k78J55j6n9j91K10M2j70j40R6K35P2q6n7j3j78Q2j6M35n3k19j61K79k05
2230c4J98j93r0J63q2O6j62J60r9J26j12o1L3J0K61l0k08J71J23k41J67k44R0
2253A2k2p9j21J83L37j93M9J5K2m48K77q1p0M78l70O2j5j07K78k61l9J78j75J0
$$ plain form
2082 80 -13 -155 -40 2 83 125 220 235 83 172 134 99 -119 -227 -36 -141 14 -203 -297 -164 -94 -48 -243 91
2106 91 -103 112 -78 173 116 187 7 13 127 -28 12 -85 85 58 2 -369 71 -60 -170 23 -77 -59 -27 202
2130 202 19 114 63 165 -37 61 158 -117 -97 -103 -225 -98 -241 120 72 24 15 -250 -177 -41 -53 68 128 55 284
2155 284 51 73 57 41 230 -48 -21 101 15 -49 -243 -5 -276 100 -57 83 -124 78 82 75 72 152 94 186 51
2180 51 37 61 145 233 82 -165 27 27 -48 -87 116 -177 -142 -120 -138 -139 -111 -89 101 161 23 139 30 187 15 202
2206 202 -76 79 63 4 -187 23 65 -105 -245 -149 86 158 72 15 2 -176 -94 -110 325 272 53 -108 171 -34
2230 -34 164 -29 -119 44 -38 28 -134 26 -73 53 -59 -120 -87 -77 184 154 -54 117 240 -1 166 -78 12
2253 12 -10 -89 -210 -27 310 117 166 181 203 -245 32 -49 -119 359 -11 51 36 -71 207 -54 -93 85 -90 -80
2277h0J24j15J29m4o8r6Q5Jp0K40j77K34p2k9o8RJ0J80m0j88JqN9j17J51K2n4
2304A9o8p0K51j68n6K8J56l15L53Oj61K8J8N4J74j97q9o6j75L88j79l7Q7j3M9
2329A7j20J76N7o6p7o0K53j73N9p2J17j0k46J63N9r1p7J24k38J63r1Q9k09K27
2353b6r1Q8lJ51K3j67P2J31q7J56k78J95j36O7k04Pr6Q1P7J42r3O5j27P6OJ87
2379B16k49K20l32J98J01j02J04l03K75j35k6m6N8k9j76L83k1k35J00j7j40L99
2401B43j88m0J24j03q5J22lk58K12k40L44j63n1o3M8L0K19k77o1K11q0j16j4J53
2425c6O9r3Q6j35P2R9N3k71K00q0J34j40l7J49j94J42J9j8K72l38J33j2q4Q7k0
2450E7p8j17J23M0O9j60N8j94J63J01r5j03K23j02r2J83r7L6M1j01J6J8j7L2M1
$$ plain form
2277 -80 44 -71 58 14 -54 -150 -65 -64 -134 106 -71 163 91 62 -6 3 13 193 153 -35 -34 -42 17 -100 51 73 19
2304 19 -49 -119 132 -36 -92 -64 92 -223 130 136 -25 3 21 75 249 52 -37 -103 -278 110 -69 -106 -19 -32 17
2329 17 -103 73 130 64 -13 -73 180 7 66 -6 111 101 -145 18 77 -14 -91 33 -205 -42 -133 -44 -253 -26
2353 -26 -117 -29 -32 119 142 -25 47 178 91 247 -31 164 28 95 -109 -102 -198 -117 -40 102 9 74 -53 23 29 216
2379 216 -33 187 -145 53 154 52 156 -147 128 -7 -33 -79 -21 -50 -226 157 136 -99 1 -16 -156 243
2401 243 55 15 139 36 -49 73 70 -188 24 -216 128 -35 -86 -149 -101 -71 148 -129 -190 21 -59 -175 -189 -36
2425 -36 33 -60 26 -109 -37 62 115 -156 44 -36 98 -42 -79 70 -124 18 37 19 291 -47 86 74 -10 77 57
2450 57 -21 -138 -15 25 94 -66 -8 -202 -39 62 -33 -136 87 -15 -107 76 -21 15 56 -45 -29 -11 -28 4 45
2475D5N9j06N7M3j0j99J69k97K70R0k70j27L45q0n0j1j7j1J23K7J75o7l29J03
2499f8K04k27K28j87j42j19K59k1J44k09J87j41K87k60K99k65J14j26k9P2l1L47
2521C16m66L04j4J21j36k65K14j72J5J08l8O0j65J67j92LJ30K1k66K59K8j0k84
2544b62J70K25n8q2M9j66K76r4l3n4n2R2k5R7q0L2k1j16J90m0m06M96l76K84M2
2569H8J0J2k23N1M8p7J04L2K5l10M62k00M7m2j14K21j06L9o3m2mKJ23k23K14j45
2595g1J14K9k77L13k01J78k22J38q4J13R2k03J83J86k70j03K49J47l61j33J23
2616f0J83p0M4J17j91j35K03p7J7N4j39K33r7l9K03j97rK22j52q9k9J00k22k9
2640a59P6K70k51J57p4j38J82l7r5K15Jj82J62k11jK17Nj43K10L3j94K6j7j68
$$ plain form
2475 45 104 -2 55 98 88 -111 58 -239 31 121 -149 -276 69 -11 -61 -72 -89 -100 23 50 225 158 -171 -68
2499 -68 136 -91 137 -50 -192 -311 -52 -73 71 -138 49 -92 195 -65 234 -31 83 -43 -72 0 -31 316
2521 316 -150 154 140 261 125 -140 74 -98 -83 25 -13 47 -118 49 -143 -140 -10 11 -255 4 32 22 -262
2544 -262 -92 133 75 -7 42 -124 152 58 25 -29 -81 11 -14 83 3 35 14 -102 88 48 -358 138 -238 46 88
2569 88 98 110 -113 -62 -14 -91 13 45 70 -240 222 22 69 27 -87 134 28 67 4 -38 -42 -40 83 -140 74 -71
2595 -71 43 72 -205 108 -93 85 -137 1 -83 30 122 -81 102 288 18 -85 164 311 -50 -183 -60
2616 -60 123 53 97 214 23 -112 91 14 31 85 -54 179 82 43 246 49 40 262 110 21 -8 92 -130 -159
2640 -159 -83 187 -64 93 19 -119 63 26 -69 146 147 -35 127 -84 -85 132 137 -6 204 237 43 69 52 -116
2664a16M9J94j95P9j02K69r2M1r0O9j97j08M30k29J16J51j15k28J54l66L60j30
2686e6J42j84J59n4j44K53j33M7j25n4K16p0j31M67l83K69k77n9o3J73l22N03
2708A74j21q9j7ON4M5K00k14O4K8p0k44J42J22l4j13J48q3J52l53N2K55j99J53
2732E8O9k4k33kJ58j38K31j55J05l8L6l1j07J30n5p7K18j71j28J51j22J6l9J49
2756Aj36R8nR0j21j47J30J23O3j78P0O4k6J59j65P4j59nK00n9Rl6k26K91l09J72
2782b8J69k39K5j26L42j84nJ68j63l4j13K18K82m19J60k4j37J47j11o7K6J84j04
2805c3j51J32K1j0J27J69j22o9Kp4j42L9K03M9P4k95Q5N4j61Q9n9J11k58K31N0
2830F2j53J25M0j08J52l0k52K74j35J26k8r2M4J62k55J01l44L52j11l5O3m1J88
$$ plain form
2664 -116 -67 127 -68 11 -91 178 86 127 37 106 -91 -199 231 2 118 269 154 -74 80 -286 74 -56
2686 -56 86 -98 61 7 -137 116 -17 30 -95 -149 67 -3 -134 333 -50 219 -58 -117 -180 -7 -329 174
2708 174 53 -36 -53 -47 7 52 252 38 102 130 60 -184 -42 80 46 -67 81 -2 150 -203 -151 104 -95 58
2732 58 127 103 -130 -132 26 -112 119 -36 69 31 67 36 -71 59 4 -73 145 -26 -154 -3 -125 -109 -148 1
2756 1 -135 -37 -42 48 -73 -220 -90 33 96 -82 -12 52 26 185 20 94 -65 -70 130 71 80 44 -182 109 -200 -28
2782 -28 141 -98 -73 -199 143 -41 -46 122 -41 -75 -188 30 312 -107 53 29 -108 39 -72 -139 -113 71 -33
2805 -33 -184 -52 -31 -41 86 255 133 64 66 -8 -150 -111 92 141 215 -80 5 59 -102 -13 -72 39 -219 12 62
2830 62 -91 34 74 -34 118 88 -164 110 -25 101 73 -19 25 187 -68 33 -311 41 -70 -105 -42 -83 105
2853A05k71J01Q0J21J02k83p1K05o4p4N0k6pj17J75Q4Rm4l20K78K11k38r7L20
2877B29k40kP4O1N5k4pj02j73K27l26J99J01j21J74m00J54j04J50L10j93J06j28
2900B0L4M3q7K31k92K56j40jj68p3K11j80K46j11J20L3l45J43J80j72K54k99J36
2923C9K7q0q0L5O5N4j53J62r4j47L06k30J79k25J71lj38j6K45P5k83o0K10p6m2
2948e9Ml9L39l15j3O5j03J05K9K1m3J04j30Q2J7J16q5o9J40l34j3K81j30K24j03
2973I1l01J44n0K2qK15l72J89J52j78J98n5p7L44l36N5k82K64K15j87p3oJ03j27
2997f0L8J4r9K48j9l15M2K09k3Q2L7j05J89m42Q8J07Q4k1P3r9K35j77j63Q0J15
3022A18K8j91q5J11r4J34j92J18Q6p5J36j25N1Oj78J26J31k37J15l8k47K92K13
$$ plain form
2853 105 -166 -65 15 136 238 -45 -116 89 25 -49 1 -25 -32 -149 26 110 119 75 -245 33 244 6 -91 229
2877 229 -11 -13 61 122 177 153 146 44 -129 98 -228 -29 72 -49 125 -275 -121 -225 -75 235 42 148 20
2900 20 54 97 10 241 -51 205 65 64 -104 -177 34 -146 100 -11 109 142 -203 -60 120 -52 202 -97 39
2923 39 66 -14 -94 -59 6 60 -93 69 -25 -172 134 -96 83 -142 29 26 -112 -128 117 192 -91 -151 59 -17 -59
2948 -59 -55 -94 245 -70 -83 -18 -121 -16 13 34 -9 95 -35 47 64 180 95 26 166 -168 -181 100 -30 194 91
2973 91 -210 -66 -116 -94 -102 113 -259 -70 82 -96 102 47 -30 314 -22 33 -249 15 230 43 -30 -36 67 -60
2997 -60 -22 -8 -107 141 122 -193 -151 58 35 117 154 49 238 -204 -116 -9 75 54 127 28 263 86 -77 3 118
3022 118 146 -45 -130 -19 -113 21 -171 -53 33 -42 94 -31 20 26 -152 -26 105 -132 -17 -55 -302 -10 203
3045B03j15j22l6J32m8M4k01m3K6K71j21J20R7j57p9J51k58J70j03N1R0Oj53J98
3069A23J13N0k31q7m5P7R6j23J18j63K23j23m6q1P6n6R5M0n0p1K91l13J9n5N1
3094g2K15r4J40j49r2O1K28j24J94j38j38O7j00n3o3J47m4j25K18k93J90L5j60
3117a50J34J05N9k15Q7K9J60o8j95M7kJ16j94J29J36l84K29oK9R9l35K20K71k39
3141F2j38L3Q0j1j06R4K22j93J01j95J44j33m5N5ON0J26q8k9O6j14M7J0n3l2j16
3167a57J62J14n0k15N7J06k05J68J37Jj50J26J17l80J20R7J09j11k78K99j64j1
3189a08K70j54K1k37J42K0J94l57J17J28k1J58k44J09n6n7l2lK05j29K6J5rj92
3213a94M6K2j11K58L4J05k07lJ67j47K09m3Rj03m6l6j06q1J62J20M6J05j01k3
$$ plain form
3045 203 88 -34 -70 62 14 58 -143 -186 -160 111 -10 110 207 50 -29 122 -136 34 -69 -18 72 78 -75 123
3069 123 236 286 55 -32 -77 0 96 -27 91 -72 151 28 -18 -99 -23 -79 16 56 6 -65 226 -87 -68 -123 -72
3094 -72 143 49 189 40 -52 9 237 113 307 169 31 98 -2 -55 -118 29 -15 -140 78 -215 -25 10 -150
3117 -150 -16 89 148 -67 20 49 209 141 -54 -7 -9 107 -87 42 178 -206 23 17 46 145 -190 30 301 62
3141 62 -76 -43 37 26 -80 14 236 43 144 -51 93 -40 -85 -30 -24 26 152 64 35 101 -13 34 44 -9 -41 -157
3167 -157 5 119 69 -146 -89 17 -188 -20 117 118 -32 94 211 -169 -49 48 157 46 -232 67 -97 -108
3189 -108 162 8 29 -208 -66 -46 148 -209 -92 36 15 173 -71 38 -18 -75 -107 -110 95 -34 -8 7 -2 -194
3213 -194 -148 -126 -237 21 55 160 -47 -50 117 -30 179 136 145 42 -4 -40 -146 -227 -65 55 101 206 105 82
3237H2j42J32j26j02L08p3J45j95r8M8J90k1l9k66J51MN6L4J71l34J41j44p8M06
3261B50N4j10k30j02L00j43j25R8J89j14J9q1r6R4j0J4J28k0j88J28K17k96P2
3284D8o6J41o3K4r6O9k69J86K33l66J00O4N2k23P7nN5K74m16J3K28j17o3j29K33
3309a6K43k7k15p2j27K20M1P8j02m7j1j51K89j54k9Q4J1r7l2L15j69n5J9j27L14
3334A83k00J86j47J50k26j19J37R0m2q1J5k3j86J92K06n5j35j2K17j72l5J20o9
3357fo2R1l0J4qJ71k75N5m0J63j41J07k06J83L02k68O1l12J70Nj05K30J99k17
3381H1J43j0j91j34k8K15k53L8K6o7O2R2l8q8L5Q7N7q4J33k1j5k27P0p7M14l92
3407a72K09K7j63p0m5J26oN0oK40l27Q4J64k9j0p9K85l35QlJ04J11l49L8K03j29
$$ plain form
3237 82 -60 72 -54 -156 152 79 224 29 -69 -21 169 148 109 -157 -6 -2 54 88 259 -75 66 -78 -156 250
3261 250 304 194 -36 -138 162 19 -106 -8 181 67 86 5 -91 3 -7 7 135 115 -73 55 272 -24 48
3284 48 -18 123 60 84 -12 57 -212 -26 207 -159 -59 5 57 -166 -89 -94 -39 235 -181 -168 60 -57 -120 -249 -16
3309 -16 227 200 -15 -87 -214 6 47 125 23 -24 -35 -186 103 -51 -80 4 15 -82 -114 201 32 -23 -4 -131 183
3334 183 -17 169 22 172 -54 -173 -36 54 12 -69 -54 -77 -263 -71 135 80 -55 -67 150 -22 -57 63 -6
3357 -6 -68 23 -7 7 -1 170 -105 -50 -90 73 -68 39 -167 16 318 50 111 -201 -31 -26 -131 99 298 81
3381 81 224 214 23 -111 -139 76 -177 -139 -113 -180 -118 -26 -64 -152 -117 -30 27 -57 76 55 40 -187 -117 -194 220 -172
3407 -172 37 64 -99 -169 -214 -88 -94 -44 -50 190 -137 -53 111 82 72 -7 278 -57 -49 -52 52 163 -186 -148 55 -74
3433g4j12J60L3J89k67J78j53r9K08l9j44J68n6k18J96n3K1L7J25k85J39o0k3
3456a29J77J0j48K73j95k2J66j66P6j03K2k8K12r8OP9j29j06K42k74Q8m7J68P4
3480A48k39J71j08n1R9L3j92P0R3O8r3J30j80o2L90k90j49J20J0j9j03J14K9K0
3504IJ51k00P1n7J37l55K27Q0k05Q4K40l44J79k79K08l3J9J19L4P8r9l6R2k01
3528h1o4R9R1n2rO0j41J31j21K43k18K51k16P9j61J91j39J99o0j08O3O5j96J40
3552D6O1j69K30k99M04k05k70J89l6Q3Q0j77K18j57l7O4q1j0j7O1o4j26J50j1
3576g3P5p4J58K4j59Q7P0j2l19J54J30m0M5k11J40k3j3J4r5L10j33m1J96j6k27
3601c3K55j32K07m91J48ok4j05L38j76M2k5j44Q1j36L34j02l6j2J17k73J35J01
$$ plain form
3433 -74 -186 -26 7 196 -71 107 -46 -145 63 24 -120 48 -8 -226 -30 -83 -62 -25 100 -185 -46 -106 -129
3456 -129 48 58 -90 183 -12 -34 132 -34 42 -61 -39 -67 145 47 53 132 3 -103 139 -135 -47 -94 74 148
3480 148 -91 80 -28 -79 20 53 -139 -69 24 92 -1 129 -51 -113 277 -13 -162 -42 -32 -51 -154 -40 -11 9
3504 9 160 -40 31 -26 111 -244 -17 63 -142 -58 182 -162 17 -262 -54 -87 -68 51 85 163 64 28 120 -81
3528 -81 -145 -46 45 -7 -16 44 -97 34 -87 156 -62 189 -27 52 -109 82 -57 142 82 -26 37 102 -94 46
3552 46 107 -62 168 -131 273 68 -202 -13 -49 34 114 -63 155 -2 -39 25 -56 -66 -83 -22 -86 -212 -62 -73
3576 -73 2 -72 86 110 -49 38 108 96 -223 -69 61 21 66 -145 -5 -28 -41 -27 -122 188 55 14 210 194 -33
3601 -33 222 90 297 -194 -46 -52 -76 -181 157 -19 23 -2 -146 -65 -201 133 31 -5 -17 100 -173 -38 63
3624F3k7L8J78l90K87p2j20j61K06Q4j66j25k4M8J41K1j1r5O6J20J45j56N2r8
3648DkJ0Q0j76M5j6j48J77J11j06J2j00k52L76j00J42p2j25k9J56j10r0K88q7
3672a2q3O0K35k30P2j78L68k95P9mJ74k01q7J35n6J49k87K69k26l4L58k60j00
3695a54J65q4rM0j14L7n7K38o2j5k19K78Q5k19J39j23K84l78J93m5J44k5j46J00
3719E3j80J34k00J28p7K67k29J79j20j16J72m5PJ12k55J20R4k8K35n3j18p3Q8
3742I5j74pK42j6J25j95L1j75k22M25O0LMk81O2J5J55n8n5k6M2r0K52j19p8%q4
3769f9J15O7j38k20K31J16m8K5k8J19k01J46l55N55l45k5r1p0K97q1J10k37J73
3792D6l3p3j1J2R0k44L80r6j28J49j4N7k19k9K23M1j72J90q8j38J53l46K84o4
$$ plain form
3624 63 36 74 252 -138 149 77 -43 -204 2 86 -80 -205 -229 -181 -40 -19 -30 -125 -59 61 206 50 102 4
3648 4 2 12 92 -84 -39 -55 -203 -26 85 -21 -9 -109 -361 15 -85 57 -15 -140 -169 -13 -123 -213 75 -12
3672 -12 -95 -35 200 -30 42 -136 232 -63 16 12 186 -15 -102 33 -23 126 -161 108 -118 -152 206 -54 -154
3695 -154 11 -73 -82 -42 -156 -119 -176 62 0 -15 -234 44 129 -90 49 -74 210 -168 25 -20 124 99 -47 53
3719 53 -127 7 -193 -65 -142 125 -104 75 -45 -161 11 -34 -27 85 -170 -50 44 16 251 198 80 7 95
3742 95 -79 -86 156 140 265 70 101 -74 -296 129 189 192 196 -85 -23 -8 147 89 34 8 50 -40 212 93 15 15 -69
3769 -69 46 113 -25 -245 -14 102 54 79 51 170 -31 115 -240 315 -30 -55 -146 -216 81 0 110 -127 46
3792 46 13 -60 -71 -59 31 -213 167 71 -57 92 78 135 -84 -113 110 151 -21 169 81 -57 96 -250 34 -30
3816c0j18L55j95j39m9K04n6P1N5k12K04J7j20K3j9K2L8JPj63N2j18K68j16j58
3841a76J67l6K33j5r6k6jj03K2J05j34K14k26L9O7r8K67r0k34K05k10J26Q6k3
3865F3M9n5j50j38P7Mj1K04J14l07J87r4J3J76m2K9j88K28pj86J52q9j8Q1K8R4
3891B14k09L8K0j84J02J33M9j44p5J35n0Lk29K20j46J12P4q7M9n4J06k9O1q7k2
3916@j1J5PN6j14N9R8o4p4K42j22Jj35j49J14J45r8J68j29J60j01N4j6j47k8J66
3942I7k54L1L5J51o2M0J00k68P9J60q6j12N8N8L7k06K62j90J22j88j5L27j92m1
3966e7J16J57k53p0PL8R3Q6m23L90M0j72J44ml1j35L07j60No4K5k7J5N0q9L3k83
3993b62K61J70k60P8j9m8%q8L23j46O0j10Q7k11J37J31J43k48K33l32J19J1j50
$$ plain form
3816 -30 -148 207 12 -127 -176 28 -28 43 98 -114 90 107 -13 10 -9 13 51 52 59 -104 -52 -170 98 -18 -176
3841 -176 -9 -45 188 173 77 51 50 -53 -31 74 -60 154 -72 -33 34 -64 203 113 -121 84 -126 0 86 63
3865 63 112 57 -93 -231 -154 -150 -161 43 157 -150 37 -57 -44 132 90 119 -69 159 152 -34 118 29 11 92 120 214
3891 214 5 43 63 -121 -19 114 163 19 -56 79 29 32 -197 23 -123 -11 63 -24 25 -29 77 48 109 22 0
3916 0 -11 4 11 67 -47 12 110 46 -28 214 92 93 -42 -191 -77 68 -30 138 9 169 68 122 106 -41 -69 97
3942 97 -157 -126 -91 60 -2 38 138 -130 -51 109 23 -89 -31 27 64 -142 120 -70 52 -136 -151 176 -16 -57
3966 -57 59 216 -37 -107 -100 -62 31 117 -306 84 124 -48 96 92 61 -74 233 73 78 14 39 12 27 77 -12 21 -262
3993 -262 -1 169 -91 -13 -32 -80 -80 -168 155 9 69 -41 46 -165 -28 103 246 -2 231 -101 18 29 -121
4016a21O5%J40j25J43r1o3k4nK43j51o8m8K26j47K85k71K30j91Pj65K00j89k0
4040a40J38L4q4m3J98K4Q5j85J5j14L16m2j73R8j56J30r0N5nq0j51J60j22J38
4064Fp5M14j95j2j08kJ71l25P2J70j65L0Q2K5j24j3J60m5n6l35M56j44m0j6Q9
4089B0p8j6J40j18K81j13P7l47K01M3q7P8J06k58O8J7q4r1J99Or5Qj1N6J45J1
4115A58j12j66Q3L4j0p3m0K50k60K04k45LM9M4N7K4J62l48M19p5P0l15J95J06
4139B14n2r3Ln2J04j91m3O9k1J61k11n8n2L13l00L6L0L03k17k6pj5Nj15J43N8
4165a4p4q2J38j18J38j30L8J69j21J77q2j61K18j78J14j26mM48k44k20K27nK5
4188A33j08J73j94o7J42n6mL04m01P4j10o9K79J10k84K25j34j14K16j94M6J47
$$ plain form
4016 -121 -56 -56 84 -41 102 11 -52 -76 -81 162 11 -57 -105 121 -26 259 -12 218 27 34 -131 69 -120 -140
4040 -140 -2 32 -52 -95 103 127 212 27 42 -72 244 202 29 127 -29 101 11 66 61 -19 -170 -10 -132 6
4064 6 -69 345 150 138 30 28 199 -126 -54 116 -49 -19 63 88 -36 -49 111 66 10 -325 131 -13 -53 -69 20
4089 20 -58 -74 66 -52 229 116 193 -154 47 90 3 81 187 -71 -3 14 -70 -161 38 44 -51 -43 -54 2 147 158
4115 158 46 -120 -37 -3 -13 -86 -126 124 -136 68 -177 -174 -125 -81 -24 0 162 -186 233 158 228 -87 108 214
4139 214 162 69 72 20 124 -67 -110 -41 -62 99 -112 -170 -222 91 -209 -173 -143 160 -57 -83 -90 -105 -100 -215 -72 -14
4165 -14 -88 -170 -32 -150 -12 -142 -104 65 -56 121 39 -122 96 -82 32 -94 -98 350 106 -114 113 108 133
4188 133 25 198 4 -63 79 23 19 323 -78 -4 -114 -183 96 206 -78 147 13 -101 115 -79 -33 114
4210A14N3Mj97j6qj27K13q2K5l8j4m5J41n2L3K02l37O6l0J26J32p1J27j64l10
4235b55K55l3Q0k2r3K41k18K64l11L4P9r6J00Q4k3K1K8N5j0k06J61k84K55R5j43
4260E8j73r5L9R6j01J55K15j91K3j31L7J71O9k17q2R1K6J5L8j74Q9M8p9J05O0
4285I2j40K7P3q2O8n0k8Q9j36J12j84R1L02l11J19J48q4J3Q4j17j87P1j14J05
4309c9n2J86p0k17k4o9L12M6K1j80j20o7M43q1n0K6Q0l22J70K18k99K54j67J10
4333A09l10O0K24j24J41j11J40n7k58J76Q1j50J15l9J36j72J9K05k75MQ3O7j41
4356g7L33j89J36l53L0J44R3j14j37K46j91J41j36J52j35J60j77j93J85j49K11
4377b0k5K8j0kk63K64O1j07P9J81j17j40J55l18N5M56k50o3J05j46J52j11m9J65
$$ plain form
4210 114 167 171 -26 -42 -50 -177 36 -46 -21 -59 -73 -118 23 -29 4 206 -131 -65 -95 31 163 92 219 55 -255
4235 -255 0 -33 47 25 -68 173 -45 219 -92 -58 21 -75 25 109 86 107 135 190 180 -26 135 -149 106 201 58
4260 58 -115 -210 -171 -75 -176 -21 194 3 26 -105 -68 103 172 -45 -127 -36 -10 5 43 -131 -42 6 -73 32 92
4285 92 -48 -21 52 -30 38 -12 -40 49 -87 25 -159 -68 234 -77 42 190 106 119 203 86 -101 -30 -144 -39
4309 -39 -91 95 25 -192 -216 -285 27 73 94 -86 -206 -273 170 89 39 65 145 -177 -7 211 -88 166 -1 109
4333 109 -201 -141 83 -41 100 -11 129 72 -186 -10 71 -79 36 -3 133 -39 -20 185 -90 -86 -3 64 -77
4356 -77 256 67 203 -150 -120 24 117 3 -134 112 -79 62 -74 78 -57 103 -74 -267 -82 -231 -20
4377 -20 -45 -17 -27 -29 -292 -28 33 -74 5 186 69 -71 84 -234 -179 277 27 -36 69 -77 75 -36 -85 80
4401H0q8k2p5N1N3K46r3K9j02j41J81j29k0k0J38j11J40n2j25P8j23K05r0Q8J47
4426B45k85J2l1K76j55o5K02j91j94K46j13J98k14N8p0lL29n10L83p8M2j33O9
4449A8j65J39K0l39J89K4QK1J35o4k0K06l91L55j77J92k88K67l49R3J04n5K7K10
4473A60j74N6R5j74J58lN8k21l0O2j65J64k29N02k73J43k38N5K3O3j26J55l7J66
4497A90J6k97P3kJ5Q5l3j47Q8j55l0M29r4qM5k56l9L55q5q7q3j37J94L1k7j65
4523a24J97r6J83q3R2l72J52J25q7N9j5LR6k49L36k61J51j64J30J19l16j5J32
4546gJ39j23j9l11J61K33k03K06m9L9k30J35J8j36Q6R3K7o5L7q2RK6m2L8j9ok2
4573f7o0P3O6j7J6k23J64l4L22l36K15j11p5O3o3J53k33K52j96j40K71j9j09J3
$$ plain form
4401 80 -8 -30 -105 -54 -1 245 152 181 79 -62 119 -10 -30 -50 88 -23 117 65 -60 18 -105 100 10 98 245
4426 245 -40 -28 -59 217 62 -3 199 8 -186 60 -53 145 -69 -11 -81 -84 245 -265 118 40 82 -51 18
4449 18 -147 -8 12 -327 -138 -114 -106 -85 50 -14 -34 172 -219 136 -41 151 -137 130 -219 -126 -22 -77 -50 160
4473 160 -14 42 137 -37 121 118 176 -45 -75 -13 -178 -14 -243 259 -14 129 -109 -54 -31 32 -94 61 24 190
4497 190 206 -91 -18 -20 -5 80 47 -100 -12 -167 -197 232 138 130 175 -81 -120 235 150 63 -20 -157 37 68 41 -124
4523 -124 73 -23 160 77 169 -203 -51 74 -13 46 31 34 130 -119 217 -44 107 -57 73 192 -124 -139 -7
4546 -7 132 9 -10 -321 -160 73 -130 76 27 66 -164 -29 -11 -147 -61 32 59 -6 31 -51 -42 -16 -58 -20 -39 -45 -67
4573 -67 -127 -54 12 -5 11 -212 -48 -82 240 -96 119 8 -67 -4 -67 86 -147 105 -91 -231 40 21 -88 -75
4597g5M2L7k53J32K16j43n5J69l0K9j22P3M3j85qJ30L6k8L1j18J97j4n1n1rK55
4623B48j28l48K39p8J29r4j3rM4N4K8J08k46N2K18j22l06J62j7J22l40K85Q0k48
4647a80K01P9q8K7o2J71p5l5j71Q6K00k19L3j34K8K19k4j38R6L1J28j43j37K30
4671A23j09j71J3K97j72J98n1K3l12L07q7j32M0Kj45J56J6K09j5j02Kj5m6j18
4695h9L89j34J2k61L31j10l56J97J23Rj12J70N7j69j57J83k4k7j07m6J90O8k25
4718h8P3j12J84N1j30R0k57K87Qk06J03O9j30J67j32J11L9r6j27J35K5q9n2K39
4742A62j41K12k52p1R8o6J01M3j03K71l36j40K36j04O5K09k60j25J32M4o4L5j65
4765b19K57k11K44n5r1J3K09Q3l41K30L2k76K91j03j35R0lk27J87k01L26j13N
$$ plain form
4597 -75 -33 4 -249 -117 99 -44 -99 70 40 69 -53 20 63 -122 -130 0 36 8 39 -79 118 104 53 2 -7 248
4623 248 120 -228 11 -67 62 -32 -45 -54 -10 44 72 180 -66 -14 204 82 -224 -62 -79 43 -297 -12 68 -180
4647 -180 21 100 12 39 -23 148 73 38 -133 -47 153 -66 -33 -167 -139 80 56 -82 14 45 173 30 -107 123
4671 123 14 -157 -144 153 -19 179 128 151 -161 146 59 -73 -33 -31 -176 -20 -4 205 190 88 90 75 29 -89
4695 -89 300 166 178 -83 248 138 -218 -21 102 111 -1 169 226 57 -100 83 59 32 -75 -121 69 137 -88
4718 -88 -15 -127 57 108 -22 68 -189 98 106 -100 3 72 -58 109 -23 88 127 31 -96 39 64 -25 -77 162
4742 162 21 233 -19 -90 8 -58 43 86 -17 254 -82 -222 14 -90 -25 184 -76 -201 -69 -25 -89 -54 -219
4765 -219 38 -173 71 16 -75 -62 147 230 -111 119 151 -125 166 63 -72 18 15 -212 -25 -226 100 -13 -8
4788hj06L24j88J42k32j5K10p5r2J19N1k21J18m9J7J70j65j98K23QR5o2o5N1p7
4813b5Q2M1j69R0J0k07K34j37Q2J87l92K2K20p2l6R1J37p7j13J70k99L30l38q3
4837b52L63l0jj51PK11rlk17J37Q4j89j19L17l3k03l4O1P2Q5q5Q0J12j45q4q1
4863a07O9J55P7l27K44k16K17q7p6k9J11o0M8r6J15o8J27k05L1J30K4m5N6j10
4887b2J80j35j74J16j91K34n8R3O3j47L1K9K48l61k2M5J14j7j31P4O5k41Q2M5
4911h0q6J42J66l07L04j33m8J06J43k6j72o5k0L6R2j83J79j6k18K43m4j38J77
4934E2m4J22k76R8M0J1O7m3K70k50k49J47N3J51r6Q0m6p5N3j40JJ77j75J44j2
4959F0J01oj68K14k43J08J71o0k82L12l18q0K22j8q6J36j6j65p0L0o7M09k97Q3
$$ plain form
4788 -8 -114 210 22 164 -68 -83 127 52 -40 79 130 -91 27 -22 -5 165 0 -198 25 33 128 66 1 52 -25
4813 -25 57 98 -71 19 29 -178 56 -81 1 188 -204 -182 38 -34 -70 21 158 81 -32 138 -161 169 -169 -252
4837 -252 111 81 80 -71 -64 147 138 135 -82 55 139 -50 -169 148 115 -88 -122 -61 11 96 11 91 203 58 -26 -107
4863 -107 -38 117 194 -133 111 -105 112 25 -51 -80 31 -29 19 -77 38 -30 97 -108 -77 53 77 32 88 -22
4887 -22 158 23 -151 -35 -226 8 -50 43 106 -41 -10 19 267 -94 -116 -71 43 26 -105 -31 34 -207 -125 -80
4911 -80 -166 -24 142 -165 139 6 -42 64 207 181 9 -56 -76 -40 52 -131 48 32 -186 57 13 -125 52
4934 52 8 130 -146 -48 -8 3 70 27 297 47 -202 -55 -2 149 53 133 87 12 65 -75 -74 103 -72 72 60
4959 60 161 155 -13 201 -42 66 237 177 -105 207 -111 -191 31 13 -73 63 47 -118 -188 -158 -225 184 -113 -30
4983c0J7K0L6j12J30J30q0j11j55K13J55l80K42O6j73j34R3K08k44O7L2l7J5J0
5007b2L4n4L96k92r1j31J33J20r0RJ99k48j92J35K10m05M03n1j20L4l6J51m2j8
5031C2q0k34L63j44J2J70j1j85K75l83J50R7J5j35kM6L24l54j47L77l74K26Q4
5054A22J02j54J0j0n4P4lK11j28j20j48J85j2o3J18j41JM6o9J91l94K87k9K49
5078B71j57l21K82o2J35j49rM2L4j00l0P7N5r3P2J26k27P0J4j05M5K3L9J10J87
5103C29l85N8j45L58rr9r6r2L7Q1P4j07j41K62j14j32L73k75m0k8o1J51k0j07
5127a28J54r6J02k2jJ60k67j13K60qq8o0O1K5l6J04J32k30OK40k57K58k91L6K46
5152A87n5j85J6oJ05n2L3P2l4j57J09p3J03j30J51j27j1KJ0J43j53j32J95J27
$$ plain form
4983 -30 -13 7 43 -69 61 191 111 0 -155 58 213 -167 75 141 -32 -166 -73 135 -109 -42 -10 -47 -32 -22
5007 -22 12 -42 354 62 -29 -160 -27 93 3 12 211 -37 -229 -94 116 -289 114 63 -57 -23 -59 92 50 32
5031 32 -48 -282 81 -63 -51 119 108 -77 198 -185 -35 62 77 -58 -60 -14 310 -44 -191 186 -188 38 122
5054 122 224 70 80 70 16 90 87 298 170 50 -98 87 75 12 130 -11 -10 36 -33 158 -236 51 22 271
5078 271 114 -207 75 13 148 -1 -10 32 66 -34 -64 13 68 -25 47 173 -54 16 30 -75 -30 -7 32 142 329
5103 329 -56 2 -143 215 206 107 11 -81 -44 37 111 4 -137 125 11 -121 252 -23 -63 -91 -152 -1 -21 -128
5127 -128 26 -70 32 10 9 169 -98 -211 49 41 -47 -107 -46 -21 -57 47 179 -51 -45 195 -62 196 -95 -59 187
5152 187 132 -53 -37 -43 62 10 43 115 81 -76 33 -40 63 -67 84 -43 -54 -52 -42 101 -52 -184 11 138
5176A38m03K10Q1r4j0K93l89J86J82k91L8Q8R4k64K11j33J26j9Q9j28Q0O1j96
5199e0o7K02k5r0j01L11j37J7j64j4K88k73J51q8j59J42J44j36M4o0N7J06j15
5222a7rk06J76K12m96M40P3j00k81L63k69J00K08k18J00p0J91r0j51j1J82Q9l89
5245a73J4L20R3l30n1K70j39Q7p7k33L67Ok38K79j34Rrn2L35m68K08mr1P0j04
5270d5k3J33p0j2J5J21k15P1J50m6m7qO4M9M9j85p4j72K50j47M04l31J63k34O2
5295g8o1J56R4j59J14p9Q8Q6j56PM1p7J54l37K83j11k7m8Q8o8k3M5qn7K49j25
5321ilN8n4M4J19j86o5l6K30J52l15J16l91K86O8j15K83j72K23k22oj06j6M3j50
5346b24R9J86L9q8m3k15J99l5J45j51K16j73P7qM1P1j11J38p5j11J15m6K8K48
$$ plain form
5176 138 -265 -55 26 -68 -78 215 -174 12 194 -97 -59 29 123 -141 70 -63 63 44 133 5 85 146 -50
5199 -50 -117 85 60 -30 -131 180 43 60 -104 -118 170 -103 48 -40 -199 -57 87 -49 -5 -65 -8 98 -17
5222 -17 -26 -232 -56 156 -340 100 173 73 -208 155 -114 -14 194 -24 76 6 197 107 -44 -55 127 216 -173
5245 -173 -159 161 254 -76 -127 143 4 91 14 -219 148 154 -84 195 61 70 61 9 344 -124 84 80 -11 59 -45
5270 -45 -68 65 -5 -17 -2 119 -96 -25 125 79 32 24 88 137 186 1 -73 -245 5 -142 262 -69 94 -140 -78
5295 -78 -139 17 111 -48 66 -13 75 161 5 12 53 -24 130 -207 76 -35 -62 -110 -22 -90 -113 -68 -76 -133 116 -9
5321 -9 -12 46 -8 36 155 -31 -96 -132 98 250 -65 51 -340 -54 14 -101 182 10 233 11 5 -101 -117 -74 -224
5346 -224 -125 61 100 12 -31 -246 -47 -82 63 -88 128 -45 32 24 65 136 25 163 88 -23 92 46 74 322
5370C22j30j20K35k12P6j13p7q8J35R3j57P4Qo1o6OJ65K07j89k84J87J0K0Q2q
5395A15k61J17J21K41n54K70m9L3o8l0J29j89J24J25K8j64J0j56J90R2k0Q4l84
5418a96J51k3O3k9q2K97j96Q1r8Q2J45q0j11J50l14K78j77oJ4J35n9J38N6j89
5442C0N7j30L5J68J7p5O0k36J63Q6k40M6K8J34l02K44o3m8J03O0j21K1J00k91
5466a54K39L6Q4k62k7j17K58j06kll0j08%J38Q5L7O3P1k54q5j9J64p0K15m1r7
5492A5N3j63Q8J45j63J86O4k63J04k51K74m9k7k1j5q5O8N0J42k56K36j56J92k20
5516e2m3J12l3M9l1l9J93j9q9qK7Kk1j22J09N4j57O7j5M6J23m8q1J4J16k03oP2
5544A7J23j70j13J70l01J10K30J3J6r4o0L4J63k20j0J25j56P5k4r8J65J05o0j
$$ plain form
5370 322 192 72 307 95 171 58 -19 -107 28 121 -36 38 46 -15 -81 -75 90 297 108 -176 11 21 41 123 115
5395 115 -146 -29 92 333 -221 49 0 33 -35 -65 64 -125 -1 124 152 -12 -2 -158 32 124 104 188 -196
5418 -196 -45 -68 -5 -34 -116 181 -15 66 -32 50 195 115 4 154 -160 118 -59 -65 -51 84 25 163 219 30
5442 30 87 -43 -8 160 177 102 162 -74 89 175 -65 -19 9 143 -159 85 22 -26 77 137 16 37 137 -154
5466 -154 85 121 205 -57 -84 -201 57 -49 -51 -54 -84 -192 -192 -54 31 68 131 202 -52 -137 -156 8 -62 153 112 15
5492 15 68 -95 -7 138 -25 161 225 -38 66 -185 89 40 13 -8 -23 -108 -40 10 152 -104 132 -24 168 -52
5516 -52 -95 17 -16 33 2 -37 156 137 48 40 67 69 48 -74 35 89 -68 -1 -16 30 153 105 24 38 154 -49 -55 17
5544 17 140 -30 -143 27 -274 -164 66 79 95 1 -59 -25 138 -82 -92 33 -123 -48 -72 -170 -5 100 40 39
5568C9n5J48k19%O3M2o9M2Q6K1j61R1L0L2j25l7l4J33m6L3nn0j6r9L17j15r2o4
5596a10L32k33j14O2q9J23k10K83n6o6J77l83N15k15N1p9j51K00j0N6j04j60K14
5619C3O7q8J5k2j76K20Rj56J67j43J93m4n6Nj18o4M95m75J8J44J0L9J0j79J57
5644F1J16j18j5K8L7k62J6J92o6q3J80J4j05O0L7l8kJ6k53M01l19K6j33K28l7
5669a9Q3L4j31J2p7j5k38M26L4Q2k12J51j10K0J54j94J41J1j72ll6L9J31j20j35
5694a44K71j56j66J68k02J33K2L8J23j19M7k4n7J75j09j24J83J2k0O3L3l25K59
5717H1l51K09J28l4l76K80J3J01K15k49n3J23K0j00Q3l12K63j32Q8M7J66k73J26
5740F3k07L16k81l2O6J98j58q1J29Q4n8k34K33j60P5mO3j59J17j63J63k9o4L4
$$ plain form
5568 39 -16 132 -87 -87 -24 18 -51 -9 77 98 -63 28 58 90 -35 -72 -106 27 -19 14 9 -41 -57 -156 161 46 -46 -110
5596 -110 222 -11 -125 -63 -152 -29 -239 44 -12 -78 99 -284 231 16 67 -12 -163 37 27 83 -21 -181 33
5619 33 100 12 27 5 -171 49 58 -98 69 -74 119 75 19 24 -94 -158 337 -138 -120 24 34 73 83 -96 61
5644 61 177 59 44 72 109 -153 -137 55 -11 -94 86 100 -5 55 92 54 52 68 -185 216 -103 -77 -210 18 -19
5669 -19 64 98 -33 -21 -98 -113 -351 75 109 191 -21 130 20 40 194 0 141 152 -20 -23 -59 -20 111 -9 -144
5694 -144 127 -29 -195 -27 -229 -96 -74 -36 87 -32 15 -9 -66 109 0 -124 59 71 51 114 147 -178 81
5717 81 -270 -61 67 33 -343 -63 -50 51 266 17 -36 87 107 7 90 -222 41 -91 -3 44 210 -63 63
5740 63 -144 172 -109 -141 -75 123 -35 -116 13 97 39 -195 38 -122 -47 -51 12 -147 -30 -193 -30 -59 -123 -89
5764h9K97k55L7K6J8n9P1o1K18l88j6J56N9j87J48j8j20L7J07ML9m9j24J27m0
5789f2L2L7lj66J33j55L80l33L8j04K86J8l4j82J33NJ64k20n7J62q9p2K15k13
5813h7J03p3J24l4J1l4oJ29jr4K9R9k30J42k42R8J55J15l17K35m8j17L0k25J62
5838g6N8Q1p6M8j55K46k51J02j10K6J79o1l9j2J39l06L30j55J05j42J22m4J3p4
5862e2L39m37K93J0k91J64J05j69J23j0lj15l0kk6k2J05j05K43J4j99J18j2O3
5886A04j73J8K19k56J06l8l1L6M6K8j58K9Pj2j37J38J76J94m07R0L0j4j67K33
5910F1K08l66M29l40j15O6J33j35J63k56j6R3OK91j01O1k54K93k41L7J28j66J7
5933dp4J53J06j63k13L34m3j99j4K47j61j16K38j5k44J96J04j7j72k9K0n7K70
$$ plain form
5764 -89 208 -47 -10 16 34 -25 46 -15 203 -185 -201 -45 14 -173 -25 -43 -163 -126 -19 -15 24 -25 -149 -22 -62
5789 -62 -30 7 4 -162 -29 -184 196 -137 -99 -203 83 101 67 -115 18 23 187 -33 -90 72 -17 -89 126 -87
5813 -87 16 -57 67 33 44 10 4 133 132 38 67 166 -64 78 -164 -66 89 204 -113 122 74 -43 -13 -238 -76
5838 -76 -18 63 -13 35 -120 126 -125 -23 -133 -107 72 11 -28 -40 99 -207 123 -32 73 -69 53 9 22 -52
5862 -52 287 -150 143 153 -138 26 131 -38 85 75 72 -43 -73 -75 -101 -123 -18 -123 120 134 -65 53 41 104
5886 104 -69 -51 168 -88 18 -20 -51 -15 31 59 -99 -70 -63 -75 -212 -74 102 296 -111 -21 9 -5 -172 61
5910 61 269 -97 332 -8 -123 -57 76 -59 104 -152 -168 -75 -69 222 121 182 -72 221 -20 17 145 -21 -4
5933 -4 -78 75 181 18 -195 139 96 -103 -117 130 -31 -147 91 76 -168 28 132 115 -57 -86 -66 -123 147
5956A47M2j90k0J04r9j1j50J87r6J73Kj07L7l9QQk9J11j16J38L5j66O3k9NJ8j32
5983a06K02L9k78L4K41j18L4J16l41J27P0k3j87J31J13K5J3Pk9p1j20j76L86J97
6007B86m12P2J0O2j47L23l68J24q0Q8M8M20j79m27L05k48P3%J13j66J0K02j91
6030h2K81j38j6m9K94k76j05O9K2p4k3J92p2j07K76k10L1m5n8J24k52k9J56l9
6054a30J28o6Jj8O7P1j81L3L90r4p3l6k10O0L61k31j72J18j00J76q6k0r3K26k94
6079a73K40k86J93k8j02Q9J07K6m1n4N9j38L16l85L03J4j42k5M4J51k24O3J05
6102A12q2j58J40j21J69Q6l8r3j76J48k14J85J74j70J02n7n5J21o4m4j83J67L6
6125a5Q7k48J82Qk28K29Q1k7pJ37j14q9K6L9Q6l54J58P8j97R3J51k3n7k43M62
$$ plain form
5956 147 189 -1 -21 83 -16 -27 -177 10 -86 87 89 -18 19 -20 -12 -4 -33 78 -38 100 135 -31 32 3 8 26 -106
5983 -106 96 135 -143 -109 132 14 48 164 -177 -50 20 -3 -190 -59 54 79 92 99 70 -1 -121 -297 89 286
6007 286 -126 -54 -44 18 -129 194 -174 -50 -130 -42 6 426 247 -180 125 -123 -50 -50 63 -103 -93 109 -82
6030 -82 199 61 45 -4 290 14 -91 -22 0 -74 -97 95 23 -84 192 -18 13 -32 -90 34 -218 -247 -91 -130
6054 -130 -2 -68 -67 -85 -18 53 -128 -95 295 201 128 92 -118 -58 303 72 -100 18 -82 94 8 -12 -105 121 -173
6079 -173 67 -219 -26 -54 -156 -67 40 66 25 -29 30 -108 208 -177 126 140 -2 -27 17 168 -56 7 112
6102 112 30 -128 12 -109 60 146 108 15 -161 -13 -227 -42 132 -38 64 7 -48 73 9 -35 -218 -51 -15
6125 -15 72 -176 6 14 -214 15 96 69 62 199 85 -4 22 61 147 -207 -49 29 -168 -75 76 53 -4 -247 215
6150B15j36j90K69k34J06q3J58k94O9P4j2l0p1L06N2o8j48N2k58J75J10l9o7j66
6174b10nK28R7o0K6J05k52j19K52K11k72J87l07J83p0p2J05L5l5J05R2j73l3m3
6198b5L22k33L6j80J99j34J87l41L93k26o5O0J60k85J45J14R5j56l8J0p3L01l64
6221i8K16r3M9mL7k90K03L0J22r4Q3j28J58j86k20P7O6J70n7N3l1j58k2K08j13
6246b2J06j02k33L14Q7rk95m9K12%nk04J98J03m5j17P4m1O1K12j30j00K11j75
6270E1j37L3Q6K16k25j14K50r3n0j2J25k13Q2K8K2p5o8K41k2k33O1K12j42k53
6294b30J27%K15j18O8p5J9J46k45J94j6n3q5J65R6k10R4k73o1J26J2M1jK4J68
6319A28j54J76J6k35N9j52P9J37K3j9r2K4j6J77j71p2R8M3O0J5l01M8J91o0j6
$$ plain form
6150 215 79 -111 158 -76 30 -53 105 -189 -120 -46 -58 -88 -159 147 199 131 -17 35 -223 -48 62 23 -44 -210
6174 -210 -215 13 110 50 76 181 -71 -190 62 273 1 188 -119 64 -6 -78 27 62 27 132 224 51 18 -25
6198 -25 297 64 100 -80 119 -15 172 -169 224 -2 -67 -7 153 -132 13 127 222 66 28 38 -35 266 -98
6221 -98 118 25 74 70 107 -183 20 50 172 78 161 33 191 5 -215 -138 -72 98 41 94 63 -95 -117 91 -22
6246 -22 84 -18 -251 63 150 141 -154 -203 9 9 4 -200 -2 101 56 -61 13 -28 33 245 115 15 226 51
6270 51 -86 -53 33 249 24 -90 160 67 17 5 130 -83 -1 27 49 -26 -94 147 125 -108 -47 165 23 -230
6294 -230 -103 -103 112 -6 62 -13 6 152 -93 101 85 32 -53 112 208 -2 92 -181 -242 -116 -104 -63 -64 -40 128
6319 128 -26 150 166 -69 -10 -162 -83 54 77 58 -34 -10 -26 151 -20 -92 6 49 109 124 -177 -129 62 2 -14
6344a4%M2m2K7L3N8j30L0j23K24r9r9J44j80K5J83m0R9j59K76j37J9m71L67m9
6369a6Q9M4j75n7N4R2j02R0L8j78J36J65k41j89k5J67j22J70j61R2M9L33l81K11
6393H3j45J05l5J15k23Q1m5J87p7O1j95J99j81l1N2M8m2K24m11L47j11J02j3j90
6417i5L96k05J31j11rl7j5j34O4R6m2j3L9o2J05k65J97o6l2J86j46k2J03m3j12
6442i2J43j30p4K49j53R1K7j49J39J00p9p5m3J30k83J43K16K0j26n8J15j97R3
6465GJ24j99J47k31K77O9k93R3J41K5Kq9o1m3Mq0r3J26m4K73k5l7o3j32K19l59
6491b42K02J19j03R1n2j06J12k27L46j54k6j34J57N0j06J98J5J06k28Q5r3j08
6513i8J47K4j89K1J44p0L0n8K07k54R6R0k12q1L01l56K33N3q8Q8J9r1R1l9J04
$$ plain form
6344 -14 -14 28 -14 13 46 104 -26 4 -119 105 6 -93 51 -129 -104 79 39 138 -21 255 118 137 -334 33 -16
6369 -16 73 117 -58 -115 -61 31 -71 19 57 -121 15 180 -61 -250 -275 -108 -230 -60 -221 -129 -80 253 -128 83
6393 83 -62 43 8 123 -100 -19 -64 123 46 107 -88 111 -70 -101 -49 -1 -43 181 -230 117 6 108 95 -95
6417 -95 301 96 227 116 107 70 55 -79 -15 81 39 26 65 3 108 -157 40 -26 -58 128 -18 -40 63 20 -92
6442 -92 51 -79 -153 96 -57 34 61 -88 51 151 72 -3 -46 84 -199 -56 160 180 54 -4 111 -86 7
6465 7 131 -68 79 -152 125 194 -99 -6 135 160 162 73 12 -31 -27 -107 -200 -74 -118 155 130 93 30 -102 117 -242
6491 -242 -40 79 -24 67 15 -91 21 -206 140 -14 -40 -174 -17 33 -73 125 140 246 18 103 10 -98
6513 -98 49 73 -116 -95 49 -21 9 -49 158 -96 0 90 -122 -203 98 -258 -25 28 -60 28 47 -44 47 8 112
6538A12j54M5J47k26J80l5j10p5N2m6o8M3JJ79j64J76K4j08O1j14J77j56J22j05
6562d2P4j84O9n4J95j8K6mm2J2K2k28P3p7J42mR0k05J14k7L2O6k83L93l5k4j42
6589f1P6j2J08k62Q4L6p2L7J70j44P6J4K9j89K58k53R3k41M4K34j61R0j7J53j09
6614a9M8J99k27P3o6L01l28O4k0J44j66Q6K7k08J78K0j23q6J68L1k96K1J96K00
6638B17k71q1K00Q2l67K86k0ok19K87k16j18N7J33m4o9L8JN1K73j13Pm8l2j27
6663i9J91l6k71J87n0P3k2p7j20L85k06J63j28J6q2O0k08K99K2k39K56j90M5q5
6687a16K54p7k09J52n4J85j07j35J1K94k36j53J22N1J09j25j56K18j08J29N5j44
6709d0K20k66J9J27o6QK2j49J4K40k6n7j63M6j5L1k8K47j75r9J58j01M4R5o8q9
$$ plain form
6538 112 -42 3 150 -76 104 69 -41 -116 -64 -110 -178 -135 -134 45 -119 57 81 -27 34 -80 97 -59 63 -42
6562 -42 32 -152 -83 -137 58 40 66 62 20 32 54 -174 -101 -178 -36 -40 50 -155 -41 -68 -36 30 -253 140 105 81 -61
6589 -61 15 3 111 -151 -67 -31 -103 -66 104 -40 36 50 79 -110 148 -105 -12 -253 -209 25 -136 -46 -63 90 -19
6614 -19 29 228 1 74 8 309 -19 45 25 169 3 89 116 -92 86 106 -17 -103 65 96 -200 -179 17 217
6638 217 -54 -135 65 147 -220 66 46 40 -179 108 -108 -226 -169 -36 -80 -149 -111 -110 -59 214 101 108 60 28 -99
6663 -99 92 56 -215 -28 -78 -5 -27 -104 -224 161 -45 118 -10 6 -76 -16 -224 75 97 -142 114 -76 -31 -116
6687 -116 138 61 -148 4 -50 135 28 -107 -96 198 -38 -191 -69 -18 91 -34 -190 28 -80 49 104 -40
6709 -40 180 -86 -67 60 -6 2 24 -125 -111 129 103 46 -117 -71 -86 -55 -83 164 -11 -110 48 -53 -9 86 18 -71
6735g1K25Q8L8j53k23J53j49J24J0j17k25K15R8j08q0L40j06o4J23l8k03J31r0
6758h2J50p4Q5r4k52K02N2Jj0L2pl8P2j10l0J52j12J34j67j1J2J34R6Q9l69K27
6784H2M2j39Ln8J18j17R5M9j25l1J87l04N4L1J91j27p1J87r5N9j00J3n7J59N7
6809A03j66Q4L3n4j47n0K4L4K22k53J21L52k63j13L58l11m8rJ77k08J56J66j33
6832G5o0j77J54j19j08J51r5J69j04o7K18m1r8L56l05J85j40M9o7j6r5L8J0Q6
6856aL7J37l46K14J8j12J6J16k85L64l8j30M1j1Q7j09n1j15J01Q4O3o4p8K58k94
6881i8J51j17o3L09j76l2J66M2k07M7J20k58K23r4j13j73J91P4j76J54J22l5k95
6904b38L05M5K6k8o6j63J80j88K16L2l49K74Pn3j22K61k21oK04N1l68K36r9N6
$$ plain form
6735 -71 154 242 280 127 -96 57 -92 32 42 -75 -300 -85 13 -95 -175 165 59 -5 118 80 -123 8 -82
6758 -82 68 -6 79 -15 -267 -65 -13 -12 -22 10 3 -35 37 -73 -103 49 -63 71 -96 -107 -95 39 135 224 -145 82
6784 82 124 -15 -12 -70 48 -69 26 75 -50 -81 106 -198 -144 -113 78 -49 -120 67 -28 31 -69 -56 -113 46 103
6809 103 -63 21 54 0 -147 -197 -173 -139 83 -170 -49 303 40 -73 285 -26 -74 -83 94 -114 42 208 75
6832 75 15 -162 -8 -127 -235 -84 -179 -10 -114 -181 37 -4 -102 254 -51 134 -6 43 -24 -40 -135 -97 -87 -1
6856 -1 36 173 -173 41 59 -53 -37 79 -206 158 120 -10 31 20 107 -2 -53 -168 -67 17 80 16 -62 196 -98
6881 -98 53 -64 -127 182 6 -26 140 182 -25 22 142 -116 107 13 -100 -273 -82 -8 -184 -30 92 57 -238
6904 -238 67 112 138 110 44 -119 61 -127 89 121 -228 46 53 0 -122 139 -82 -88 116 167 -201 35 -64 -8
6928hk7K19k45J41J20j52j37K35k81K10j75K32n6P5k06K26j65o6J24r7J62j30
6950aM5j25R3r8k9Q2J29J24j59NK7q8LQ4R3l84K37k6K72l89J51Q5k41L8j3J64
6976G9j19P2l03o4L46m5MJ08k02q7J53K5j92J74M1K23p2j82r4J16n0R2r8k43L02
7001a6pR0J16k76J53J10l19p1J83j38J93K5J42j87j27J56j1j63K79K3o3j23j16
7024a47M6J30j23P0R1m8j09MJ02j76O1jK11j23O6O9j81J90j84L8N8N3R0k47P0
7049A0q1J25J45q9p6K13r6j66k6k51L50Q2Lj23k63J45K27q3P1k02J65M4j17o0
7073e3mN9o3K32j16J1O8J6j72J09o6q4O6n4q9m6J06l5K1l4M2LJ21m5J7k8k02L03
7101H3p1Q7l3n7K7J00l26m9J18L34O1l77K4L03m80K62k6K13j28k74R1K20q6J46
$$ plain form
6928 -8 -35 184 -61 80 200 48 -89 146 -135 75 -100 132 76 151 -55 171 6 -60 64 -33 129 -1
6950 -1 44 -81 12 -86 -115 -33 96 220 61 66 93 5 8 92 185 -199 38 12 284 -105 46 131 -110 -72 -85 79
6976 79 -40 32 -271 -335 11 -34 -30 78 -124 -211 -58 -33 -225 -51 -10 213 141 -41 -135 -19 -69 23 -75 -318 -16
7001 -16 -23 67 183 -93 60 170 -149 -220 -37 -175 18 43 185 -2 -129 27 16 -147 132 155 92 -31 -147
7024 -147 -101 29 -94 -24 67 19 -90 -86 16 -160 -99 -100 111 -12 54 123 -58 132 -52 -14 44 97 187 -60 10
7049 10 -71 54 199 110 34 247 151 -15 -41 -292 58 140 143 20 -243 -98 129 46 117 -85 80 124 7 -53
7073 -53 -57 2 -61 171 55 66 134 150 -22 87 21 -63 3 -51 -140 -186 -80 -115 -94 -128 -86 -83 38 -7 10 -18 -220 83
7101 83 12 99 66 9 36 136 -190 -239 -121 213 274 -103 -79 224 -256 6 -20 193 65 -209 -118 102 16 162
7125A62l35N0J99p9J70m0j72o9J54k2Jk38K7J65r8J1J14j1k11L12l04J57Q9q9
7149e7R2m4P8o4K6q4J79k13n3J7J86p4j5K08l17P3P4q6J52k23K19N2j85K43Mj73
7175A5J23J59k88K19l66Lj2J25o1j5J6P3J96j72j09P8J50N8j24j48M2k97J30J38
7199f7l2J63n7r3J46R3m57K77N8j59K21j73MK53k15k0l5N3j6qR4Q3k21L2Q8M2
7225E4l01K06K2%k04K93k0j09k3p8m0K01Qj74R8L4J8J76K4k03J07m4j4p5P2o7
7251c9L9J61l59J26M4J5R6r1J37k67NJ67L2j7j14K1J5J3j0R0l4k50MJ61J01n1
7277eK6j06J55J17j58j61J00M2J38j76N1j58O3J76k53L30l47L85l17K52r3r9J84
7300A46j10J22q5k66J69M2j59J76p3Q9m5O5Q8k52J19NJ8M0p4j9K07l09P6j06J76
$$ plain form
7125 162 -173 -123 76 -3 167 127 -45 -114 40 18 19 -219 -192 -27 -125 -114 0 -11 -222 90 -214 -57 32 -57
7149 -57 35 -9 69 5 31 -53 126 -87 -140 -123 63 -11 -26 182 -135 -62 12 -74 78 -145 74 126 -59 184 188 15
7175 15 138 297 9 228 -138 -135 -147 -22 -83 -98 -82 -9 187 15 -94 -16 134 192 68 -80 -38 -335 -205 -67
7199 -67 -99 64 7 -86 60 153 -304 -27 31 -128 93 -80 -76 177 -38 -58 -93 -40 -56 -64 30 113 -108 -76 12 54
7225 54 -247 -41 -19 -19 -223 70 50 -59 -82 -160 -200 1 9 -165 -67 -33 -15 161 185 -18 89 45 31 -44 28 -39
7251 -39 0 161 -198 -72 -28 -13 83 -8 129 -138 -133 34 66 49 -65 -44 -29 -16 -26 64 30 -220 -216 -55 46 -5
7277 -5 21 -85 70 187 29 -132 -32 10 148 -28 23 -135 -72 104 -149 181 -166 219 -98 154 61 -38 146
7300 146 36 158 73 -193 -24 18 -141 35 -38 51 6 71 159 -93 26 31 49 89 15 -4 203 -106 -30 -136 40
7325D0L7j04k6j1M8j53J32n9K14j17M8q2O6p2P5k0K31k26L1K3j01k38J44J91k01
7350a30Q5j25J13L0j01k9J20M7M8p0j16J65O6L2k13J05M5j40m0nO0n8l1K49p4
7375C3K54j56l31J37L71l37J26m6j70K36k02K29l64J76J45J51k44j67K15O0j59
7396d3J24O2J4j43j23o9J14l2K36j91J30k80L51j66p9K14j98J7J32j71L0j7N4
7419c4j27J49k03J08P1j47L1L5J24J19k02RL7n9p3K03k0K0Jj76J41j70L04k20
7443g9K41j12M5j71Q3KM12m27J74k55k8J82k53Q9j01L34o3j73J59J84k33p9J49
7466H0l8m6K20j16k08J08OM9j98K37qo1J18j93l9MK79k72L1J88j71P9N0l3J19
7491A85j90j51J13K9QJ48m5m91K67R7r2m0P2O4L3q5K84k55L44m39p4K55j9J50
$$ plain form
7325 40 77 -27 -53 -64 -16 -169 -37 -96 118 1 49 -33 33 -39 36 16 247 21 52 75 -26 -264 -120 71 -130
7350 -130 -45 -170 -57 -27 -128 -157 -37 10 58 -12 -128 37 103 135 -78 27 72 -68 -108 -113 -53 -111 -142 107 33
7375 33 287 131 -200 -63 308 -29 97 51 -119 117 -85 144 -220 -44 101 252 8 -159 56 116 -43
7396 -43 81 143 157 14 -109 -178 -64 -96 140 -51 79 -201 150 -16 -95 119 -79 -62 70 -101 -71 -88 -34
7419 -34 -161 -12 -215 -107 -36 -183 -152 -117 7 126 -76 -67 -30 -89 -162 41 21 41 42 -134 7 -163 141 -79
7443 -79 162 50 95 -76 7 9 421 -6 168 -87 -115 67 -186 -97 -198 136 73 -100 59 243 10 -69 80
7466 80 42 -4 216 100 -108 0 6 55 -143 94 86 25 143 -50 -89 -85 194 -78 -47 141 -30 49 99 66 185
7491 185 -5 -156 -43 -14 -6 142 97 -394 -127 -30 -122 -162 -90 -26 7 -78 206 -49 295 -144 -218 37 18 168
7515A68j5k43J65j44L9R2j15q8K38m6p3O2p3O7j4k68K47P3l3k37J59p6l9J67M
7540A7k9o5Q2j17R7j23L35j23j51L7J57k96K18kl0j5j52J88Q2o7K89k99P0k24
7564a21lK41j98K83n0l48K29p8k0qR1k3j11J1k1K19m24M47j28k10L0m5K11j52
7588a78o7M13j12Q3K28k95q1l0K11j44P7l47P0L20r7k07j84Q3J89K80k12j00n3
7611a53j2J73Jj1j05j3J43P6k14LM4Oj51J52K93k33j58J19K2J13k88K63q9k4N5
7636A2l29L95j37r1P8l4K14p2k11K82r1j95K93j16j36J40j19K17n6j46J47Nj42
7659i2JJ07P9n1l03K62L0L2k5o1j28nO1J75p3R4J64k25j42J59l6J81j79J46Nj42
7685C4j05l1K83j97J2o7R9r0l1N4m4J39j56j01M27p1l1J8j40M4j53L0J00J29q4
$$ plain form
7515 168 153 -90 75 -69 -30 62 -53 -141 97 51 -22 40 -33 34 20 -248 -1 72 39 -198 -39 -115 -154 13 17
7540 17 -12 -77 5 -112 -15 -138 197 74 -77 -40 117 -179 39 37 7 -8 -160 28 110 43 332 33 103 -121
7564 -121 -124 117 -81 202 152 -196 33 -45 -65 -73 18 -5 -116 -105 -126 93 -331 116 -12 -222 -192 -237 -26 -178
7588 -178 -245 168 56 139 367 72 -9 -39 172 28 105 -242 -172 148 51 -156 -340 -257 -68 212 0 -100 -153
7611 -153 -165 8 9 -2 -107 -120 23 99 -115 -112 -68 -62 -213 -61 232 -1 -159 -40 -18 95 -193 70 -19 -43 12
7636 12 -317 78 -59 -150 -72 -106 108 36 -175 107 16 -179 114 -2 -138 2 -117 100 44 -102 45 50 -92
7659 -92 -91 16 95 44 -259 3 33 65 40 -21 -149 -154 -93 82 9 103 267 42 -100 59 23 204 25 171 176 34
7685 34 -71 -102 181 -16 -4 -71 28 -62 -93 -39 -83 56 -100 -201 226 155 124 142 2 46 -107 -77 23 152 68
7710F8n2J12l40K28N6k83K38l0J46k47J39J59k45K41k42k6j5L2K25m6o9j04J24
7733F9l13J77N4K2P1j60J6K4K63m07J13j28J52p8J30k4k45L64l46Q0J05K6P2n9
7757b2l13M47j76J03Q9k9j57M3P0n8K6m7Q3Ok5O1j95J35j09J19k28M38j49n7L13
7782C68m20l6N4L09j40j94O3j2j22L4J79j17j5j01K78p3j00rR2j58Qq3q0J90J02
7807A7q7K31j48O9pl0Nq0M3n3J55l03J89r1J5K48k56J85j97M1m1O7P1n8R7J02
7833A84l64M25Pl29J81q1P4l9k10J35J14p5k63L58j25J18R3k11K42l25J85l7q5
7856b8QJ03J7L1k30J11n3oK12j52J29j67q5J1K4Q3M9n1J49m03L09q2Q5j05o0O8
7882c3N7K6o2l12J69K23r6K10l2j44j5p3L9j74K78mKp7k0l4k32K19P1KJ12J05
$$ plain form
7710 68 16 128 -212 16 72 -211 27 -3 143 -104 35 194 -51 190 -52 -78 -93 -61 164 118 49 -55 69
7733 69 -244 -67 -13 9 80 -80 -64 -40 223 -184 -71 -199 -47 -125 5 -19 -264 100 -246 -166 -61 -35 37 -22
7757 -22 -335 112 -64 39 128 99 -58 -15 55 -3 23 -24 59 65 40 101 -94 41 -68 51 -177 261 112 55 368
7782 368 -52 -88 -34 275 135 -59 4 -8 -130 -96 83 -34 -49 -150 128 55 -45 -54 38 -120 -112 -195 -275 -85 17
7807 17 -70 161 13 82 75 45 50 -30 13 -40 115 -188 1 -90 -75 173 -83 102 -95 -54 -95 -28 43 -15 82 184
7833 184 -180 245 252 -77 104 23 97 58 -152 -17 97 22 -241 117 -8 110 203 -8 234 -91 94 57 -28
7856 -28 -20 83 100 131 -99 12 -41 -47 165 13 142 -25 -110 -99 -75 8 57 6 155 -248 61 -21 64 -41 -101 -33
7882 -33 24 50 -12 -324 -155 68 -28 182 150 6 -9 -82 -43 -217 61 57 59 -18 -38 -72 -304 -85 -14 -12 100 205
7908B05k36j17Q8NN0Q6j58L6O9m5J00q8N8J45k47n5J7J36J4l0j89K09q3L8j18
7933a10J58p3p1K67q7j1j01j91L51k32K6n7K46J00j43Kj14m7K7O7k83M36r4O4
7957A30j98N3J2p0J0%l7K16k34P3k3QJ10k55R9K26j51J1O0Q5q1K6M6j76J67j21
7983a4J00j37k5j20K43J80r4M8k48j50K30j33K46j50J94j53j15o2J86l1j60J22
8005d3P9o9OJ22j20o1R4K1J05j02pj06R2N2j74J79j62N1l4M3J29j11nK0L6m7n0
8032f2K52k68J07j42K61l31j72L70j1J93j82j62J46k99L53j19R7N9k61J82J23
8053A34k6p7m6q6M2qm4K32j83n3N1n3L8j4J51l9o2j99J98Rj22J68J75k95N1j4
8079g2J02P3j00j62O5J3L7J45k00J81k6r8R6J2j84J00n8P4K31k21J12K6j92l0
$$ plain form
7908 205 -31 -148 -60 -55 -5 81 -77 -41 28 -17 83 -5 53 198 -49 -104 -87 49 63 33 -156 53 -30 8 -110
7933 -110 48 -25 -96 171 84 73 -28 -219 132 -100 -74 -131 115 215 72 74 -40 -87 -60 7 -276 160 66 130
7957 130 -68 -15 -3 -73 -63 -63 -100 116 -118 -45 -68 -60 50 -205 -106 120 -31 -20 40 125 44 70 116 -60 107 -14
7983 -14 86 -51 -76 -196 47 227 133 181 -67 -217 13 -120 126 -24 170 17 -98 -160 26 -5 -165 -43
8005 -43 36 -33 -27 95 -25 -86 8 29 134 32 25 -81 11 63 -111 68 -94 -43 -77 -34 95 -16 -21 -1 35 -12 -62
8032 -62 190 -78 29 -113 148 -183 -355 15 4 197 15 -147 -1 -300 53 -66 31 90 -171 11 134
8053 134 108 31 -15 -101 -59 -67 -111 121 -62 -115 -64 -117 -79 -93 58 19 -43 -242 -44 -35 -157 11 186 -109 -58 -72
8079 -72 30 103 3 -159 -94 -81 -44 101 -99 82 56 -42 54 66 -118 -18 -76 -2 229 8 120 146 -46 -76
8103g6R4kp4l7K29k33O5J23n1l5rM1q2m1J02r1J76k1r5J14j39j46J61J6M1j08
8129g8K8K11j27R0j10O5j15j81J1K99K08j39l16J80k95K15J59o6j91K6M8K90j51
8152F1J1j08o0J25K4l9j19K08K01l07O0j69J64k08MR8j3o6m2J25J9l4J15j00l1
8177h1L70j45j55J35j80N5n5O0J1k05J8K19m9k0
$$ plain form
8103 -76 18 16 -58 -95 134 -99 -34 89 38 3 -6 35 -47 -88 14 -77 99 78 -17 97 -42 -188 -27 -11 30 -78
8129 -78 -50 161 34 124 14 79 -36 -217 -206 93 301 162 -154 26 -269 -54 105 39 -152 -126 -78 212 61
8152 61 72 -36 -96 29 53 14 -105 103 304 -3 57 -112 52 -156 -152 -54 -67 -133 -175 -50 -31 -65 50 -50 -81
8177 -81 289 144 -11 124 -56 -1 -56 4 15 -190 -172 47 -2 -22
8191b2
$$ Imaginary data points
##PAGE= N=2
##DATA TABLE= (X++(I..I)), XYDATA
0@%%%%%%%%%%Qj6J6j6J6k4L2m0M8n6P2q3R4j15J36j55J79k08K40k78L21l66M16
33B21m72N34o01O75p60Q51r47J054j174J305j445J598j766J950k152K373k615
50a371K882l175L498l859M262m714N226n812O490p282Q227r374J0799j2635J5095
65H257j8575K3926l3298N4414j91429M9301L42801j75146k13419L3731J82954
76F3517L491m6956j3592M592k5896N0088N6943l5990j06209N663R8247K6146j04223
89b4179n4017N4986M6833l1739k0457L843j3568l119N8019K2710o9313l3941Q7670
102B3728N2380o8064m5694N6717L3514l9551j4142K6152j5674k7444K8107J9387
114B9416m9670l0729M8949L3562n2521m3785N4115N8914m9668o4639N0454P7875
$$ plain form
0 0 0 0 0 0 0 0 0 0 0 0 8 -8 8 -8 8 -16 16 -24 24 -32 40 -43 51 -64 72 -83 96 -112 128 -150 171 -195 221
33 221 -251 283 -318 357 -403 448 -499 555 -619 686 -759 839 -927 1023 -1129 1244 -1371
50 -1371 1511 -1664 1834 -2025 2237 -2477 2749 -3063 3427 -3855 4372 -5002 5797 -6838 8257
65 8257 -10318 13608 -19690 34724 -156705 -107404 235397 60251 -153168 -119437 63517
76 63517 67008 20052 6460 11052 -14844 35244 92187 56197 -50012 -44349 53898 80044 -24179
89 -24179 -78196 -23210 23623 -8116 -28573 -24730 -38298 -41417 16602 39312 -30001 -63942 23728
102 23728 76108 8044 -37650 19067 52581 13030 -1112 25040 9366 -18078 10029 29416
114 29416 -20254 -50983 -2034 31528 -20993 -64778 -10663 48251 -1417 -66056 -15602 62273
126F2273l8186p4443L4852P2193k6541n5664K3510L6263k7396k3145K6046R504
138A9266l1324p705K7416J758k4334J80J6310o064r092J3883P467j9398q538K8146
152G971J8186k8163k4293K6342L0790j9149k9503J6533K3227j8933j5643K3841
164A1206O940k9543l701K9007R23k6295o72J5770o355r544J3982N123k3825q836
178b5820L1248K0833k9301l2671K4355M5672p688m2292l500L5289J4287k0211
190A0201j4018M066J579K386O843r408k1237K776K1688m71k1331l691J3741L767
204c109j593N972o17q773N495J9916M200j8350j0630J6641J8306j1599k4337O53
218g825J8725L39j9328p422P652J425j803K323n159o848J0205J4588o217j1522
$$ plain form
126 62273 24087 -50356 -15504 56689 30148 -25516 -2006 34257 6861 -16284 9762 19266
138 19266 -12058 -19763 7653 9411 -14923 -14743 1567 -4497 -13589 294 7761 -11637 -20175 7971
152 7971 26157 -2006 -26299 43 30833 11684 -17819 -1286 21941 3008 -12635 11206
164 11206 18146 -11397 -15098 13909 14832 -11463 -12135 3635 -2720 -12264 1718 6841 -16984 -25820
178 -25820 5428 26261 -3040 -35711 -11356 34316 26628 -15664 -19164 16125 30412 10201
190 10201 -3817 249 1828 4214 11057 1649 -19588 -16812 4876 4405 -16926 -20617 -6876 -3109
204 -3109 -4702 1270 653 -8120 -2625 17291 21491 3141 -7489 9152 27458 15859 -8478 -7825
218 -7825 10900 11239 -8089 -15511 -7859 -6434 -8237 -5914 -11073 -17921 -7716 6872 655 -10867
232a0867R446J6652j873j1384L772R596k365q327q1K950l849q095J18L827m457
247d937q299J003O595J08n561J569P935J363j033M842J442k878N182P167n676
262H822r091N462Q992p248j2724K041P502l394q651j535L628J713k384j89K847
277d209O93N14L293L953j49k917K469N144k197m249J926L67m445L19L426m348
293d10p177K853P112l932p522K904O946j62l307J53K945J927n16o12J51J63K88
310A804P37m66k134j416K091J892m043k767M680K378m479j342M453J086l996P9
326a443M190j687l711K255K471k337k448P67J185q1j037J89N92O98J036L12P0
343A021K11J32J285K010k074k567K426J181l732k356K196j85l816p70L194o14
$$ plain form
232 -10867 -1421 15231 13358 1974 5746 15342 12977 4650 4569 7519 3670 -4425 -4307 -480 -4937
247 -4937 -13236 -12233 -5638 -5530 -11091 -9522 -1587 -224 -1257 3585 5027 2149 7331 14498 8822
262 8822 -269 5193 14185 6937 -5787 -3746 3756 362 -8289 -9824 -6196 -4483 -6867 -7056 -4209
277 -4209 -3516 -3002 291 4244 4095 1178 3647 8791 6594 2345 4271 4638 193 512 3938 -410
293 -410 -7587 -4734 2378 -1554 -9076 -6172 774 612 -2695 -2542 403 2330 1814 1202 1353 1516 1804
310 1804 2541 2075 -59 -1475 616 2508 -1535 -4302 378 2756 -1723 -3065 1388 2474 -1522 -1443
326 -1443 2747 1060 -2651 -396 2075 -262 -2710 -1943 -758 -839 -1876 -1687 -1095 -397 639 951 1021
343 1021 1232 1364 2649 4659 2585 18 2444 3625 -107 -2463 -267 -452 -4268 -5038 -1844 -2458
359b458k327K079J500j003J119K541N18K48Q98J530K91p8j081j238j69m08j674
376B88j550k02k621j656K338Q83l681j229M306L328j048p09J865J984K253J842
392F391j650k416J646K867j092m235k859L70Q53n63k930l258P13K761R1r62K04
409d069J079J466L429J427j774k36L810J811j843j807n43o88j45N21l121l296
425c979N86J437j719q19M04M98j35J529K205N52R3k6J383K830J007l302k521L342
443C365K376k836m264r68P82O03P24j984l800L0N538K638l422l375J469N329L356
460E561k532m680O78N528J584m079l880M72J895J024l59l475k895K363L897j79
476I23k827j985J490M634K013l133l432K418M612j351m581N86K386q26k639k12
$$ plain form
359 -2458 -4785 -2706 -1206 -2209 -1090 1451 1969 2217 3115 4645 4936 4858 3777 2539 2370 1962 288
376 288 -1262 -1464 -4085 -5741 -3403 -2520 -6201 -7430 -3124 204 -844 -1553 312 2296 4549 6391
392 6391 4741 2325 3971 6838 5746 1511 -1348 -978 -125 -688 -3618 -6876 -6163 -3402 -3311 -4273 -4069
409 -4069 -2990 -1524 1905 3332 1558 1322 5132 6943 5100 3293 2750 2062 1917 2438 -683 -3979
425 -3979 -3393 -1956 -3675 -4494 -4090 -3592 -3727 -2198 7 559 652 626 2009 4839 5846 2544 23 3365
443 3365 5741 2905 -1359 -2327 -1545 -942 -218 -2202 -6002 -5972 -434 2204 -1218 -4593 -3124 2205 5561
460 5561 3029 -1651 -973 4555 6139 2060 -1820 -1348 547 1571 1212 -2263 -5158 -2795 1102 923
476 923 -1904 -3889 -2399 2235 4248 1115 -2317 101 4713 3362 -1219 -633 1753 927 -1712 -1924
492a924J731jk755p61K988K119j409k301J374L789Q29k813r18J163K65R50O84
509C010k072m201K6M540J045m445m173J604N434K262m367l743L610N276J77l166
525H17j225J619K438J001j437l852j715K435K584j289n311k738L636N031j897
540I7n607J26N402K775k429j665K464K446n34j114O36Q78j500j581Q73J218k511
557b6l662j47L202O90l515j631K114J925N17L30Q01l73m17J905L294M7l630j882
575d58K885K844k407n684m05L641N01l142k253k1J837K355J19j958j577K389M607
592C273J174l093k685K427M202R9m343k587J899K086j744l522k76J783K01j339
608b445m64O00J265M97j42R62J130m10m19J661J356j310j867N66R92j289j711
$$ plain form
492 -1924 -193 -194 -2949 -3710 -722 1397 -12 -2313 -939 2850 3679 866 -52 1111 1376 2326 3010
509 3010 938 -3263 -3237 1303 2348 -2097 -6270 -4666 768 3030 -1337 -5080 -1470 3806 3983 817
525 817 -408 1211 3649 4650 3213 -639 -2354 81 2665 1376 -3935 -6673 -3037 1994 97
540 97 -5510 -5384 18 2793 364 -1301 1163 3609 3075 1961 2597 3475 1975 394 1267 2485 -26
557 -26 -3688 -3835 -633 57 -3458 -5089 -2975 -1050 -533 -203 598 225 -192 1713 5007 5054 1424 -458
575 -458 2427 5271 2864 -2820 -3225 416 917 -2225 -4478 -4499 -2662 -307 -188 -2146 -3723 -1334 3273
592 3273 4447 1354 -1331 1096 5298 5397 1054 -1533 366 2452 708 -2814 -3090 -1307 -1106 -2445
608 -2445 -2909 -2309 -1044 -547 -689 273 1403 993 574 2235 3591 2281 414 980 1972 683 -1028
625a028P34M16j920j507J161K007n66k159M85K589J327p05j034M70J455J234j059
642A900j397p82J052J153p66l183j134K228J912j935k401Q38K066J086j14r69
658d46k20J664J405j82j626l93J445J41p41j262m06m06K61K63n03j095o31J558
676a174J731l08j699M38K051J475j154q91J284N92j106q31N55l91r83k08N3j170
694a736l92R55l10k58P11N26J01J17Q06Q89N60q46N1Q29K68r62j335M00L42j206
714d90j272O06m7o98r8J73K93K69R08N58n30N30J626L06r08M62P08m91p95m51
734F59n4p63n95m48L02m55q56j43R10Q39o73k16J950P78m32J22O94J62j62K84
754A903j90j053j64M56p33j244k98K63l63l20m98P01Q91k72K96M45O97M87k54
$$ plain form
625 -1028 -294 122 -1798 -3305 -2144 -137 -703 -2862 -2377 212 1539 834 -200 270 1725 2959 1900
642 1900 503 -279 773 1926 1160 -2023 -3157 -929 983 -952 -3353 -2515 -449 637 523 -446
658 -446 -666 998 2403 2221 595 202 1647 1788 1047 -215 -621 -1027 -766 -503 -1006 -2101 -2732 -1174
676 -1174 557 249 -1450 -1012 1039 2514 1360 469 1753 2345 1239 408 963 572 -411 -619 -566 -1736
694 -1736 -2128 -1173 -1483 -1741 -1030 -504 -403 -286 520 1409 1969 1123 1174 2003 2271 1309 -26 374 716 -490
714 -490 -1762 -1156 -1203 -1901 -1999 -1826 -1533 -1264 -356 202 -328 202 1828 2134 1226 1688 2396 1905 1110 659
734 659 605 -158 -753 -1201 -899 -1354 -2210 -2353 -1443 -604 -1277 -1493 457 1235 803 925 1619 1781 1619 1903
754 1903 1713 660 496 952 219 -1025 -1323 -1060 -1423 -1743 -2241 -1540 -649 -921 -625 -180 517 1004 750
773G50O29K75j57k35L45n96r06J37l71o26l33J94l08o49j75J385K47q99O29J030
793C66M69J68m8K08K26K86m69m17j54k96p82j52Q0o90l43N31on22N53N14R3O43
815B58J31O01O4j87P64j36p05j31J42j75n65p92j6q8k67k77Q7M64K25k5M0Q77
837B89J24M21K72o8j40K24K55m30p66l5rp69n02L78k90k13N5nJ51K80M89K41M70
860D22J37M13J18K67k28k69j89K93l96o36n94K4j08k36j81m11M3M17O83J49J2
881b70N73M13R9L56j65J72J61j6l01l31o21m33k83J1r9o73n6J24L73K56J59J0
903e41L76O05P59j88r7M3O41j88n14k34o28j15n1j51o69m31K77J8J43q6R2Q6P28
926a25Q50j76l04P18M40J7l75l66J17m01Ml50m31m49P1j89k56K84l2l44P03O77
$$ plain form
773 750 1379 1654 1497 1262 1607 1011 105 242 -129 -755 -1088 -894 -1202 -1851 -2026 -641 -394 -1293 -664 366
793 366 835 1003 955 1163 1389 1675 1206 789 635 339 -443 -595 -515 -1205 -1548 -1017 -1023 -1545 -992 -478 -385 258
815 258 389 990 1054 867 1631 1495 790 659 801 626 61 -731 -747 -835 -1102 -1379 -1292 -828 -603 -628 -588 289
837 289 413 834 1106 1038 898 1122 1377 947 181 146 137 -632 -1134 -756 -1046 -1259 -1204 -1209 -1058 -778 -289 -48 422
860 422 559 972 1090 1357 1129 860 671 964 568 -68 -662 -638 -746 -982 -1163 -1574 -1531 -1114 -431 -282 -270
881 -270 303 716 815 1171 1006 1178 1339 1323 1022 691 70 -363 -646 -635 -734 -1407 -1463 -1339 -966 -710 -551 -541
903 -541 -165 440 1199 1011 914 957 1598 1410 896 662 34 -81 -132 -283 -952 -1383 -1106 -1088 -945 -1031 -939 -853 -125
926 -125 725 549 245 963 1403 1420 1045 679 796 395 399 49 -382 -831 -760 -949 -1205 -921 -953 -1297 -594 83
948H3M2p0O09L05J55O1j41j99M7k78p6m33m61k90l93M55j46m02l12L02J136K31
970B25j076L96J090K68K6P6l02j15L62J63n56q54l26n7N07l11o93n20Q83P13p52
991h53k65N71R68L19k33Q3p0M06K93K4o49k30k96k70j66n8n69k81L30M32k12k66
1013i92O06L91q0K39L19L11J45k82J69K05l80o03RK39J25r30o07L05L22k58j70
1034i17K79r3mO72M11K77k67K51M22M71o37l26o2K34m71q88j32J77M01n37l38
1055a077J18P2M73J27K87o3M67L90j96L69P9m65K71O7l58o52j12L12m87o34l1
1076a043M14n78N55j84L27M40L9o0N51N18j48l14M30J60m42j96J3j40q34rK01
1097c00j93n03O4J27K7J76J98K8N94K37l7M7J68M93k68n6m25j76J2j94J37n95
$$ plain form
948 83 125 55 664 969 1124 1185 1044 845 892 614 538 105 -356 -646 -1039 -584 -730 -1132 -1444 -1142 -6 225
970 225 -851 -455 635 903 929 1005 703 588 950 1113 557 -297 -623 -680 -173 -484 -1177 -1697 -814 -101 -853
991 -853 -1118 -547 421 740 507 590 520 926 1219 1243 594 364 68 -202 -368 -426 -995 -1276 -946 -514 -726 -992
1013 -992 -386 5 -75 164 483 794 939 657 826 1031 651 48 57 296 421 -509 -1116 -811 -489 -747 -917
1034 -917 -638 -731 -735 -63 348 625 358 609 1031 1502 865 539 477 711 240 -648 -780 -603 -202 -739 -1077
1055 -1077 -959 -887 -414 -287 0 -63 404 794 598 967 1046 581 852 919 561 -91 -203 109 -378 -1012 -1043
1076 -1043 -629 -1207 -652 -836 -509 -69 -30 -90 461 979 831 517 947 1107 665 469 482 342 -492 -501 -300
1097 -300 -493 -996 -932 -805 -778 -602 -404 -376 218 455 418 465 633 1126 858 802 377 201 213 19 156 -439
1119d39k99K68j04k09K04M2O0P0P20r2k12O26M75k47k93J31k09l6O2l32k77k30
1141c21j82l49J85n6Q1P2K3L30Q8K68K59J0j45O02Q0k08l9Q6m85l77k69K59l79
1164d67k33Nj37j7K55L54r8J67J56L94j33M51oP3O0j7m07j67K57l17q58J38J94
1187c53k87m6P8J24j57N46Q4J8J00M28p9m5L08J66n0l10K9k67m20k26R4j40l97
1210h02K52k96M9L36M3q6N98m2j23M80N03j74k03J28K24o01k21J2j03m00O6l7
1232c97l03J06QK3k1M87k06J77K72L02j8K62m0l3j72K75k21m30J66l21j73k79
1254e36Q1k5k71k7L67m9k3M65K18k6kL31K18Q4j93J1k69J27k93l56p5r9j62k28
1278g32J96j04n1L28J82J30k6N36P2j20J86J26j24o2J3j01l93Q3k09l69J03p1
$$ plain form
1119 -439 -738 -470 -574 -783 -579 -537 -477 -407 313 221 9 635 1110 863 570 701 492 456 518 186 -91 -321
1141 -321 -503 -852 -667 -723 -642 -570 -547 -217 -129 139 398 408 263 865 945 737 698 784 299 -78 -347 -88 -467
1164 -467 -700 -695 -832 -849 -594 -240 -338 -171 -15 379 246 697 691 764 824 807 400 233 490 173 -685 -547 -353
1187 -353 -640 -686 -608 -484 -641 -95 -11 7 107 535 456 411 719 885 835 525 554 287 -133 -359 -265 -405 -802
1210 -802 -550 -846 -797 -461 -418 -504 94 52 -71 409 912 738 535 663 887 286 65 77 -26 -426 -360 -397
1232 -397 -700 -594 -586 -563 -584 -97 -303 -126 146 448 430 692 652 619 447 722 501 71 237 -84 -257 -536
1254 -536 -455 -480 -751 -778 -411 -460 -483 -18 200 174 172 503 721 805 612 623 354 481 188 -168 -243 -342 -504 -732
1278 -732 -536 -640 -691 -363 -181 -51 -77 459 531 411 597 723 599 537 550 449 56 139 -70 -439 -336 -407
1300d07k52Q0J09k10K57J77M02r6K6O00j0l37K38j59k2k11N8j20l92j48K41k75
1322d51m8J7j01J68P9j71N37K48j23K86r9K44j8k9j33M6l26j2j07l56m6k13K0
1345e88P9l3m3K44J28j28L81J06K63K5J42j51M1J68k71O9k62m4j59k15j09j51
1367e08Q5J1j31N2N88p8r6L8M92m5R6k6L31l94o0P3q0l55R2m09j68N8j75J9j32
1392g22N15n7j69L36M60j83K21q6L60k71J62k11k18J09Jl10k39k3k35j58K44K5
1414d49M9j28K91J76K3J81j0L77J31j04j84J76ok63k74J95k53k04q0j83K8nK28
1437b88Q5l4o8J72J52K73M4M5O8P5R6k47l43J12k16l5j35p3j60L4R1m1j08K15
1461b86K20j0qM66r5kJ02K70q5l23o4Q2j10k44j95l9K0P3k97J14J16J20k32K07
$$ plain form
1300 -407 -659 -579 -470 -680 -423 -246 156 60 86 686 676 339 577 418 396 185 243 123 -269 -417 -176 -451
1322 -451 -499 -482 -583 -415 -336 -507 30 278 155 441 342 586 568 539 406 452 126 114 7 -349 -395 -608 -588
1345 -588 -509 -542 -585 -341 -213 -341 40 146 409 434 576 425 466 634 363 432 170 126 -33 -248 -357 -508
1367 -508 -423 -412 -543 -491 97 19 -77 -39 453 408 504 478 809 415 355 428 348 -7 85 -324 -492 -434 -609 -590 -722
1392 -722 -207 -264 -433 -97 363 180 401 315 675 404 566 355 137 246 247 -63 -302 -325 -560 -718 -474 -449
1414 -449 -400 -528 -237 -61 -38 143 133 510 641 537 353 529 523 260 -14 181 -72 -276 -356 -539 -511 -516 -288
1437 -288 -203 -237 -305 -133 19 292 336 381 449 524 620 373 30 142 -74 -109 -244 -317 -477 -443 -352 -393 -501 -286
1461 -286 -66 -76 -84 382 287 285 387 657 572 249 185 267 157 -87 -282 -321 -301 -228 -525 -411 -295 -175 -407 -200
1485b00L02J13k54M54J90j63j56J28J25j23l86oj78j48R6l46J21Jj24J26K36J37
1507e5k0j1L88O1p1J99j67K90k04j69j37j28K5N2m53n0K24k34K36j70K19j29R2
1530b12K41J4J44K76q9j20J90l2j42j70J76l24l36K18j61k9j12L02j04j89J24
1551c35L17j32L60n5rP2K27j53p4j70J77k6j25j51K5k66J26j61l1KK08K03l37
1574c08J91J67J23J14J20l7j47M1J73l88j17K58l39r6Kj68j15K43J38j90K6o7
1596c76K53J84J26J26k87K95J97j69J07j33j06Nl51K4Nj88j13m9Oj2K48J75k42
1619b75M02K7J5j4P0K67j71k3J8l4o6k37o2j98J7n1j34L19j02j78K34Q7j5%K13
1644A09M77n06M9J31K01l19O0p4m9o5j86K3J44l63K59j89R2m3o6M08p2J77J10
$$ plain form
1485 -200 102 215 -39 415 605 442 286 414 539 416 30 24 -154 -302 -206 -552 -431 -430 -554 -428 -192 -55
1507 -55 -75 -86 302 363 292 491 324 614 410 241 104 -24 1 53 -400 -450 -226 -460 -224 -394 -175 -304 -212
1530 -212 29 43 187 463 374 254 444 412 270 100 276 -48 -384 -166 -327 -356 -468 -166 -270 -459 -335
1551 -335 -18 -150 210 155 146 218 445 292 218 48 225 199 74 -77 -52 -318 -192 -353 -384 -382 -174 29 -308
1574 -308 -117 50 173 287 407 370 223 264 437 49 -68 190 -149 -245 -243 -411 -526 -283 -145 -335 -309 -376
1596 -376 -123 61 187 313 26 321 518 349 456 323 217 222 -129 -105 -100 -288 -401 -450 -444 -456 -208 -33 -275
1619 -275 127 154 169 155 225 492 321 298 316 282 216 -21 -83 -281 -264 -315 -449 -130 -232 -410 -176 -89 -104 -104 109
1644 109 586 80 129 260 461 142 202 128 79 14 -172 -149 -5 -368 -109 -298 -206 -249 -315 93 21 198 308
1667C08P0L8j95rQ2K7k08J3p0r6k59P2l67N26l08J45j61K13J54q0K51k9j34Q3
1691F6K02n6j35L03k18q1p1J36j7k98k5L8k17J28J44j82J17N2J30K45p3K07j5
1714C80k78L53k34o8n9m9k59K51J9j89l08J19R6N6j9l6K12p3J90J49K1M2j96J4
1738A34R5J51k40j24n4J40M0l68O9j17j07K03j8o7J41J90j26J9K22N7j04K6P2
1761B34l2K0j8n5l11q7P2K8j85K03l5l20L56J31k50K55k24L97N9p2l0O3L1J68
1785C98k21m1L8k13J05k73m0q8L3o1j05N52k05J18M4m2K81k52J62K5J18n3k01
1808G9L5l1j16j77R8j45n6J8P3QJ67j67J06J34pJ51P1P8m8kJ21o5k48K6j48K0
1834b5P2k18l36K32k4J76l62M96Q3k6j0n6L61j87J95o1R1m01J45J25j8k98p4R
$$ plain form
1667 308 378 416 221 212 294 321 113 126 56 -40 -299 -227 -594 -68 -376 -231 -392 -179 -25 -105 146 117 -17 66
1691 66 268 212 77 380 162 81 10 146 129 -169 -194 -156 -373 -245 -101 -283 -166 -114 16 261 188 395 380
1714 380 102 455 221 153 94 45 -214 37 56 -133 -441 -322 -226 -170 -189 -225 -13 -86 104 253 274 316 120 134
1738 134 229 380 140 16 -38 102 142 -226 -157 -274 -381 -178 -196 -263 -122 68 -58 -39 183 240 136 162 234
1761 234 202 222 204 149 -162 -249 -177 -149 -334 -131 -166 -486 -130 1 -249 6 -218 179 238 166 136 199 230 398
1785 398 177 136 174 -39 66 -207 -247 -335 -302 -363 -468 84 -121 -3 41 -1 280 28 190 215 333 280 79
1808 79 114 83 -33 -210 -112 -257 -313 -295 -222 -214 -47 -214 -108 26 19 170 241 319 271 269 390 325 77 103 -45 -25
1834 -25 47 -171 -507 -275 -299 -123 -485 11 94 68 58 2 363 176 371 310 401 0 145 270 252 -46 -120 -111
1858a11j11j52J91J35k51O2O9K2L72q0rq9J3N2K11j06k7J13j15q4k05J05j72j49
1882c16K47j42K04J32l25O1J56J17n0k0J45M0j00j32J8J74j95J88j75k37N2J2
1904a46j57J01M6O3P2J24J31k61K88J26m12L53j38M5J3k58J36j59J10j15r4J08
1926b4R9l18K2J28l1N5R3p0J43j5p8K99l1j52p1J22j59M4j37o6o6K6J1rK2Q8j97
1953b72K09m7L73j6k20J59j81K62j06l3PL3r0p4n4P6j52r5m4K13r4J2Q1rK4P5
1979C7N1P7MJ30j48jmk81J9L32l11j15O5o2n8oJ67o3p9K95j19n0L9J39O4L8J04
2006B64j07j68k9O3O7q7o9L1k57M75k64k38J61k4P7J29J69k12O8j81L67J5j97
2029E3K0K0j51J23M6k90J10O5j65m8K54k63N9j29K07J85Q7j27O0O1J49j53n3k0
$$ plain form
1858 -111 -222 -374 -183 -48 -299 -237 -168 -146 226 146 137 48 61 113 324 218 191 304 189 105 -100 5 -167 -316
1882 -316 -69 -211 -7 125 -200 -139 17 134 84 64 209 249 149 17 35 209 14 202 27 -210 -158 -146
1904 -146 -303 -202 -156 -93 -21 103 234 -27 261 387 -25 328 190 235 248 -10 126 -33 77 -38 -132 -24
1926 -24 75 -243 -221 -93 -124 -69 24 -46 97 82 4 303 272 120 49 171 12 56 -81 -147 -213 -187 -176 -185 -163 -75 -272
1953 -272 -63 -110 263 247 27 186 5 267 161 128 135 168 78 4 -50 26 -126 -221 -265 -52 -146 -134 -53 -62 -38 37
1979 37 88 165 169 299 151 150 146 -135 -116 216 -95 -210 -145 -207 -265 -271 -104 -167 -246 49 -70 -120 -81 58 122 160 264
2006 264 157 -11 -40 23 90 3 -66 -35 -292 183 -81 -319 -158 -182 -105 24 193 -19 49 -132 235 250 53
2029 53 73 93 -58 65 111 -179 -69 -4 -169 -217 37 -226 -167 -296 -89 96 183 56 116 177 326 173 120 100
2053A00q6J21k42j69J92l5r0K69l72K19R5R1k34K09r7k6J02J19j12Q6K92j39M5
2076C38l05O9k53Q7N6j98l2m9K03j01k8K24o6k6Q0oK55m25K53J4j69K15j17m8
2100b9N1Qj35K69k80J37o9qk52L2L51O9k43P2J70r9k7N3Q9J30j60O0k16J76l13
2125a64J55j7k40L24L5k50j9K30K8j19J4J97j86K06K6p6j04l0J3K5n0k5j25q5
2149b37J82ll9j45J11j8N2J68k77L29L3kL4k32J07K5n1J4l6K0J50l51J62j73J6
2174a61J88j28M1J28r5N7j18L39k41m8J79mP1k57J89Jj30J10p8q6r0j01J74j47
2198b07m2J4K01n1O4M0%Q7O1p1K8j39J80J9j01M0q0j8j24o0N1K46k06J09r9N6
2224bj0K7J90k02N1j05L0l3mJ94k63J23l8J72p8j33J07j38J43K6k54J14J92k72
$$ plain form
2053 100 14 135 -107 -276 -84 -119 -209 60 -312 -93 2 93 -141 68 -29 -55 47 166 54 140 432 293 338
2076 338 33 102 -151 -64 -8 -206 -238 -287 -84 -185 -213 11 -55 -81 -1 -7 248 -177 76 90 -79 136 19 -29
2100 -29 22 30 -105 164 -116 21 -48 -56 -308 -276 75 144 -99 -27 143 44 17 70 159 289 129 189 -27 149 -164
2125 -164 -9 -26 -266 58 93 -157 -176 54 82 -37 -23 174 -12 194 220 144 40 10 23 48 -2 -27 -152 -237
2149 -237 -55 -58 -97 -242 -131 -149 -97 71 -206 123 156 154 188 -44 63 88 37 51 15 35 185 -166 -4 -177 -161
2174 -161 27 -101 -60 68 -27 30 -88 251 10 -38 141 137 208 -49 140 141 11 121 43 -43 -133 -234 -60 -207
2198 -207 -249 -235 -34 -85 -21 19 19 106 167 96 124 -15 165 184 83 123 43 25 -99 -159 -108 138 -68 41 -58 -2
2224 -2 -12 15 205 3 54 -51 -21 -54 -58 136 -127 -4 -42 130 52 -81 26 -112 31 57 -197 -83 109 -163
2248a63J46p1K6K70j65k0R3j6Qq3M1r8n2J35p9r3L28k12K2J09q0j16mQ2J45r0
2274F3J79k54k1N9J34j17k31R8R8j9k05k0K45j4j13J40p6n7J09p1K71k21J86J52
2298C15j74j35L8P9k38O4k4R3r5p8K34J11p9k25P4M9R3m8m9N5J54k00R7k27N3
2323f3J47l8M4J6m0j75J36j21p4R0O4j01K07j16N5N4k03N3J38K4J11l9M9L7l58
2348a03M5L1nQ0l07J41P7pj48L05n8j65N43m79q4M19j50j2k91K17Pj16K56o8p1
2373E7r4O0Q4j04p8K44p8k4J7m4J59j75J60k56J43J56k04OJ27j34K0l49L21r0
2397g6N4j26L1M2J30j55L46l73K07J31J7k04q4J27mp1J84l5k35J64j77J93M0k65
2421a39Q4J45k66J85q8L34k96M1N4j56J69n1j64J05r2J4J23k1K7l7p2lJ34R7k61
$$ plain form
2248 -163 -17 -88 -62 208 43 23 116 100 108 25 66 -32 -84 51 -28 -121 207 -5 17 126 46 -70 -74 8 153 63
2274 63 242 -12 -33 26 160 43 -188 -90 8 -11 -216 -236 9 -5 -118 22 -54 -111 -2 -73 198 -23 163 315
2298 315 141 6 44 123 -115 -51 -75 18 -77 -155 79 190 111 -114 -40 9 102 54 5 60 214 14 111 -116 -63
2323 -63 84 46 90 106 66 -109 27 -94 -168 -78 -14 -115 92 -24 31 85 -118 -65 73 97 208 169 218 255 -103
2348 -103 -58 -27 -32 48 -259 -118 -41 -48 -196 109 51 -114 429 -50 -134 285 135 123 -168 49 56 -60 196 128 57
2373 57 -37 23 107 3 -75 169 91 67 84 40 199 24 184 -72 71 227 23 29 156 22 42 -307 14 -76
2397 -76 -22 -148 -117 -75 55 -100 246 -127 80 211 228 24 -60 67 63 -8 176 141 -94 70 -107 86 126 -139
2421 -139 -55 90 -176 9 -79 255 -41 0 54 -102 67 16 -148 -43 -135 -121 2 -19 8 -29 -101 -104 30 127 -134
2446a34K5J09N0k6O3L3K0j26j69J79M6j16l6N8J22j08N3r1K2M7j08o9Q8K3J04
2471E9J22k22K12l69K56k00J70k6ml1N3M3k07k1K67K5j33j24M2%L35m42L19k42
2495a18K25j77kkN2J9p6O5L4J59j85N9q1J23r3J1j4K2O2PJ9J52k58j44R9J66o7
2522E7M3r2P3P4l01o4J67O1l3Q5j41M9j11J33k4Q6q9O2p0M0J46k01j02L28k04
2547b8J4j7o3l8r0k6J35N7J14k30m2R0J29O9J00j36M9k53R8J05j59J11j3k11J94
2572d1J47R4j86l8m2M0k8k8J62k67L43o5j63K26j57K70k31K60j33j11o8J55j38
2595Ao8oK88p4j87o6j25K22r2R9j33J16j52J03J12j71M3L09k7J8j30n7k42K22
2619CJ6q6m3L3J42J81j72O0k06O9m3k9J82j4k31K86p7j70k9K47k64J11J36k92
$$ plain form
2446 -134 -109 0 50 24 87 120 140 14 -155 24 70 -46 -82 -24 98 -10 43 -48 -26 21 -87 -156 -68 -45 59
2471 59 181 -41 171 -198 58 -142 28 2 -2 -33 20 63 -144 -165 102 127 -6 -130 -88 -88 247 -195 124 -118
2495 -118 107 -70 -72 -74 -22 -3 -79 -14 20 179 -6 53 -28 95 2 13 -1 21 83 90 109 261 3 -141 -42 124 57
2522 57 100 8 81 155 -146 -210 -43 18 -15 70 -71 -22 -133 0 -24 62 -27 35 -35 5 151 -50 -152 176 -28
2547 -28 -14 -31 -94 -132 -222 -248 -113 -56 58 -172 -214 -124 5 74 174 38 87 -166 -68 37 -122 -11 -24 -235 -41
2572 -41 106 200 14 -24 -66 -26 -54 -82 80 -187 156 91 -72 154 -3 267 36 296 163 52 -16 139 1
2595 1 -67 -73 215 141 -46 -112 -237 -15 -107 -8 -141 -25 -177 -74 38 -133 -90 219 192 210 80 23 -219 3
2619 3 19 -67 -110 -77 65 246 74 134 -72 -3 -46 -75 107 93 -138 148 71 -99 -128 119 -145 -34 102 -190
2643a90K49j14O9r2Q0n7j60K32p1o9j7K69L7j77q8K87k38O2j9M9j45K25l34N0
2667a62K38j84O3J74l10J60N8J5J04j3k35J56j0j49J34r3J23k78J88k8L7J87l12
2690a37J04j3N0N1k48J99q8m4J15j2K9j10l5R1O0r6L42j19k08J84N1k31N9n6J41
2715G9k12K46j83P8j07P8k2J88j04jJ50r2j08K84k22N6j86j77K68J36j1j19N3
2738G2Ll22J81K19k48J14l9J56j97pk16K57K2j34KK03j4m1p1j19M53l08o8Q7q5
2763a00K8J13J77l74J79R7j94j05L06n3k40J59m2j1l10J49K28Jl7rJ46k79j8J51
2787c8j31J51RJ16OP6r3q2m0K06j11J09k88J53J26j08j10L9r4J59j74j13O7K41
2811G6k25J64Q4k14K89k84Q3k13L47J9j84P2oJ77k88J17j35J36m3O6j26J62P4
$$ plain form
2643 -190 59 -55 14 -78 2 -55 -215 17 -54 -123 -140 129 166 -11 -99 188 -50 12 -7 42 -103 122 -212 -162
2667 -162 76 -108 -45 129 -181 -21 37 52 156 143 -92 64 54 -95 39 -54 69 -209 -21 -49 -12 175 -137
2690 -137 -33 -46 4 55 -193 6 -82 -126 -11 -23 6 -104 -139 -48 12 -84 258 139 -69 115 166 -65 -6 -62 79
2715 79 -133 113 -70 8 -99 -21 -43 145 41 40 190 98 -10 274 52 108 -78 -255 13 149 138 19 72
2738 72 75 -247 -66 153 -95 19 -20 136 -61 -68 -284 -27 -5 -139 -137 66 52 11 -60 -179 274 -34 -102 -15 -100
2763 -100 -72 41 218 -156 23 120 -74 -179 127 74 -166 -7 -49 -60 -370 -221 7 8 -29 -38 108 -171 -189 -38
2787 -38 -169 -18 -9 107 113 189 96 14 -26 180 69 178 -110 43 169 61 -49 -10 -104 55 -119 -232 -165 76
2811 76 -149 15 99 -115 174 -110 -27 -240 107 126 -58 14 8 185 -103 14 -121 15 -28 38 -88 74 148
2834A48k12QJ83r7R4N3j78L7o9J02j17j73M48j32j76M1J41j66J27r2q4K01r1k27
2858b31L19o1J00k29J76J00kj94j11J20jr6J48Rk72J01O8J44j44J71j30P2p4J69
2882A52j27Q7l9n7l9J63k13j33M25j14L3o4k40K63k08J25j58J82M3j01L3q1J27
2905E9l3l0R6ro7M4p5p0O7j28n9J35K13k06m3R0j31p0L97j67r5J4J08p4J85p0
2931H1q2J97j75n4j05K02r9l4l4K6l8J29J10K0k7j42M9%O9j21K7K45k15J4j31
2956h8P9j45R7J80n2R0j06K4n7j51j05K34J09j35j14L35k46J24j58K7L2r8J3j27
2980b38K74j20PM0J01q1Q6J8j54J8k5l3QK8J03N1m15L65m4J53O3r9k8k4j06J38
3006H6k78J99M9q6j12K61j11k53L66l24L15O1j92j49K76N0j38k59K97j18P2j45
$$ plain form
2834 148 -64 -56 127 30 124 177 -1 36 -33 69 -48 -221 227 95 -81 -40 101 -65 62 -30 -114 87 -4 -231
2858 -231 88 27 127 -102 74 174 172 -22 -133 -13 -14 -110 38 47 -225 -124 -56 88 -56 115 -15 57 -17 152
2882 152 25 112 73 16 -23 140 -73 -206 219 105 138 74 -166 97 -111 14 -144 38 81 -20 13 -68 59
2905 59 26 -4 92 83 16 60 -15 -85 -18 -146 -205 -70 143 -63 -106 -16 -147 -217 180 13 -82 -68 40 -34 151 81
2931 81 -1 196 21 -33 -138 64 -35 -69 -103 -77 -115 14 124 144 117 -25 24 24 93 -28 -1 244 29 43 -88
2956 -88 -9 -154 -57 123 71 161 55 79 22 -129 -234 0 109 -26 -140 195 -51 73 -85 -58 -26 -124 -111 -238
2980 -238 36 -84 -77 -37 64 -17 69 87 -67 -49 -74 -107 -99 -71 32 83 -332 33 -11 142 205 106 78 54 -52 86
3006 86 -192 7 56 -30 -142 119 8 -245 121 -203 112 173 -19 -168 108 158 20 -239 58 -60 12 -133
3028a33K81m7j42J78k06J91k43Q5j81L36q1lM4n4N3O3j29j78L43k81Q3j59OJ57
3052a7J96j00j22nK37k26N3K1j47L45j57n7QP3qM0k76J08N9m7k9J2N3j7J08j5
3078I0j83J75j02K77k35nO9M3l7q2j06O7L0P1j49p5K00K77l97K8P9k48K19j08
3102a02J19j31K20qn4K8R7j27j0K9r6J49K0j01k12K81j52M0R3k04k5J79k2k6K0
3127Ej2L23l57j09J17mK56l7j33o6j20L53l28J07mj76J00n2kk4J30P1N5q8J43
3152A48j86J65q7l8k90J85J4J2K02j67o8N8K9r2Q1r5o1K16K5r7n1J04M4NJ34k28
3178c8Jl9L04k68j8L4K56j08j31Oj43J46J54q0j10pP2J77j46J1j1Q8r7q9L4K1
3204A9j01K02j99J03m8j6PjK17j93j02N5L4J15o5M0n9k01P2K07J19l9k46qL3O4
$$ plain form
3028 -133 148 101 -41 137 -69 122 -121 -36 -217 119 38 35 79 25 78 141 12 -166 177 -104 -21 -180 -174 -17
3052 -17 179 79 -43 -48 189 -37 16 37 -110 235 78 21 29 102 94 134 -142 -34 25 -22 -51 -39 14 -3 105 90
3078 90 -93 82 -20 257 22 17 86 129 92 10 -96 -29 1 72 -77 -152 48 325 -72 -44 35 -213 6 -102
3102 -102 17 -114 106 98 44 72 169 42 32 61 -35 114 134 33 -179 102 -50 -10 83 -121 -146 33 11 -15 5
3127 5 -7 316 -41 -150 -33 -37 219 182 49 -17 -137 216 -112 -5 -9 -185 -85 -137 -139 -163 -33 38 93 5 148
3152 148 -38 127 40 2 -288 -103 -89 -77 125 -42 -110 -52 -23 -115 -34 -129 -190 26 51 -46 -97 7 51 56 190 -38
3178 -38 -37 -76 228 -40 -58 -24 232 124 -7 -1 -144 2 156 76 -34 -41 31 208 62 73 62 150 53 -36 -2 19
3204 19 -82 120 -79 24 -24 -40 -33 -34 183 -10 -112 -57 -23 92 27 67 8 -193 -121 86 205 166 -80 -88 -55 9
3230Im1j48K6p4K45K0j55m7J04K40k03p9J75O3Qk60J68J26JO9k77J03j18j18L26
3255A63k01J32j63P1J64k01K57o5q5l0j60L28l23J52l9J4j5K8J03l80K93J17j35
3278B5J8j14o0J35J31p7r7RJ18J21k01RO4L0M3j49m4R8l1j92J50J18k33K8Q9j63
3304a75Q1Q0K31k15n3P4J42k80J02P5l09K60J54j49J92n5m9P2j12No6l3j08K44
3328A08qj60j21J69M5J8K2j18R8P2j21r5O3O3j44K52l69J78nJ39n8q8Q8j1O4j41
3354f0j66K86j4j70J74j88q6M41k00q1PP9o4K52k11J50k15R8K9M2j84J65o0j7
3378GQJ02k90N02m07N5J01k1p1O6L2n8j6M3Q8rj72J07j18K29j83o7J51j30L86
3403C35k52Pj92J77m5Oj66J21o8m6J99j36n8J15l1K55j01k58J35r6NJ13P1K4j4
$$ plain form
3230 9 -32 -180 -154 -228 17 37 -118 -165 -61 179 -24 -103 72 135 143 -117 51 177 178 247 -30 73 -45 -163 163
3255 163 -38 94 -69 2 166 -35 222 157 72 42 -118 210 -113 39 0 14 -1 27 130 -250 43 160 25
3278 25 43 -71 -131 4 135 58 -39 -30 88 209 8 17 81 111 154 5 -39 59 28 -164 -14 104 -129 -101 -12 -175
3304 -175 -94 -14 217 2 -51 23 165 -115 -13 62 -247 13 167 18 210 155 106 178 66 71 5 -28 -136 108
3328 108 100 -60 -181 -12 33 51 73 -45 53 125 4 -91 -28 35 -109 143 -226 -48 -53 86 28 -60 28 17 81 -60
3354 -60 -226 60 46 -124 50 -138 -224 217 17 -64 -57 22 -42 210 -1 149 -66 32 61 103 -81 84 24 7
3378 7 15 117 -173 329 -78 -23 78 57 -14 52 84 26 10 53 141 132 -40 67 -51 178 -5 -72 79 -51 335
3403 335 83 90 -102 75 30 36 -130 -9 -77 -123 76 -60 -118 -3 -34 221 120 -138 -3 -99 -94 19 90 114 100
3428A00j9Q6j21j38J00j56J53l1q4L7J21l35L16K09k40p2q7J44O0j14mp4K62j83
3452g0K93Ok14l3L8j34K16M3k33K68p2k92K58k13QM12j77r7J54q3L0N7j99j2J33
3477H7j29J26N3k13K08or5j1ml1M1j19J10R0j07k26K68K9N8m7j64J08R4QJ23j10
3503A41n3j47J13k56J8L51k67j15K05K8K40k69P4q5M4Q1p4l33M98L8k38Q2j68
3526i2r7K33J24j70q8K90k61R5N1j88J51p1K4k4J54j01j24J39j19R3J46j88O1
3549C8k93K28N0K0j6M1j06O4N5K7r9N8q2L77m66Q3k83L09J5l0R3n5q4L7j58K12
3575C5p0j3N6J01l09J82j13J57Nr5J69j85q0K28P4j37o5j60J16K47N3k69m6N1
3599f8P4M8l9R1q1R9pj46q0J71k00K42j17k31K27K9J9M3j28j22K95p7J18j66J55
$$ plain form
3428 100 81 167 46 -92 8 -148 5 -26 -110 -73 48 -287 29 238 -2 -74 -161 -17 43 -71 -75 -149 113 -70
3452 -70 223 229 15 -18 20 -114 102 145 -88 180 108 -184 74 -139 -131 281 104 7 161 78 108 165 -34 -46 87
3477 87 -42 84 137 -76 132 126 31 20 16 -15 26 -93 17 107 0 -226 42 71 129 82 -82 26 120 128 251 141
3503 141 88 -59 54 -202 -184 167 -100 -215 -10 18 258 -11 63 -22 22 103 29 -304 194 232 -6 76 -92
3526 -92 -189 44 168 -2 -90 200 -61 34 85 -103 48 -23 1 -23 131 30 -94 45 -74 19 165 -23 38
3549 38 -255 -27 23 43 27 68 -38 26 81 108 9 67 -15 362 -104 -21 -304 5 20 -10 83 28 -56 -19 -177 35
3575 35 -35 -48 8 109 -200 -18 -131 26 31 -64 105 -80 -160 68 142 5 -60 -220 -104 143 196 -73 -119 -68
3599 -68 6 54 15 106 25 124 117 -29 -109 62 -138 104 -13 -244 -17 12 31 74 -54 -176 119 42 160 -6 149
3624A49l66K59R3l16J51J15l19K62N1N3k0k25R6qj68J04K9M9j01L31k78J68j36
3647b7J6J82o7j79K13L4l27J00j7L65l15R8r7r8R5N6p2K11j43m21L69j05K77k06
3671e8j07L97j62j57K35pk77K26L3q0j94K4J84j25r1R0j0l6J34Q3l4p8K5o3J71
3696A23k95L01k34K29k2j1r4L4j76J28O3j26Q4n3j28NOM3R8J45K9j19J69m3p2
3721H4k04P0l4J93j98J01R8n4k4j88j6J07KJ29J7k70K56m8j16K35j83J84j02J
3745D0j55K72k08M9p2k6J19k08K69K2M2k60j2J20k8J29j3n5K17l74R3J92l65L25
3769A13k57o0R0N5K8Q6J3rM1j68k01M83j94N9J9j73l3J02k09R4Q9J21J78j34j07
3794B6k91L46k56K20j51m0J25R2j67Q6j48L0N1J51J34k83K39l0j62J14j18J14
$$ plain form
3624 149 -217 42 135 -181 -30 85 -234 28 79 132 112 -113 -17 -25 -193 -89 -60 -11 -112 219 -59 109 -27
3647 -27 -11 171 104 -75 138 172 -155 -55 -72 293 -22 76 -21 -119 -24 32 -40 171 28 -393 -24 -129 148 -58
3671 -58 -165 232 70 -87 148 141 -136 90 123 43 -151 -127 57 -68 -159 -69 -79 -115 19 102 68 -10 15 -48 123
3696 123 -172 129 -105 124 102 91 -3 31 -145 -17 46 -80 4 -49 -177 -172 -166 -123 -25 120 149 30 199 156 84
3721 84 -120 -50 -84 109 -89 12 110 56 32 -156 -172 -65 -63 66 83 -187 69 21 -95 140 -43 141 39 40
3745 40 -115 157 -51 -2 -74 -100 19 -189 80 102 144 -116 -128 -8 -36 93 80 25 242 -132 -39 153 -212 113
3769 113 -144 -204 -114 -59 -31 55 68 59 100 -68 -269 214 20 79 98 -75 -108 -6 -215 -121 -32 89 267 133 26
3794 26 -265 81 -175 45 -106 -146 -21 71 -96 -10 -158 -128 -77 74 208 -75 164 134 -28 86 -32 82
3816H2j50k2J85p0M3l4k04J46J43j44jR8J58j06k49J68j01J28j63K3N4o2J62N
3840H9J4q3k35K71m3J23l68L32k18j2L63j84k49K98N0p5P4j95L15l46K46k90P2
3863e1Nj02R3k5N2%J35o6r9K85n3j35k03P6J5R7K01k69J30R5j05o6J6j47O5N3
3889ck35O1R7j33J13K04k7k5j48J87p6j62R7J97j60R6j50J6O4r1J19K0k29K27
3913E9PJ64k43j15K42k00J27j88J67K8q4j8n2L9J69k43l7K4J42k28L06n1k06L51
3937A60j28m31L30P7q8J42q0j69L46j44o5J64r7o0j31n2L23j51P8p2J54r2j8j48
3961a52J39o2N9J8k06R5k4M45j47p0n9p8l0L4j1K11l0j45N4Qj13L8O7k2J48L8
3987B05r6k90L06j33nJ45j01k98J47Q6j48J08n0R9J7j7J66k02J41J47k82J21r7
$$ plain form
3816 82 -68 -90 95 25 68 34 -170 -24 119 -25 -26 72 230 124 -125 43 -58 70 -93 -70 -16 -78 84 89
3840 89 103 20 -215 56 13 136 -232 100 -118 -130 233 49 -200 98 148 73 147 -48 267 -79 167 -123 -51
3863 -51 -46 -148 -55 -80 -28 -28 107 41 -58 227 174 39 -164 -88 -73 24 225 -44 86 181 76 10 26 -121 -56 -3
3889 -3 -238 -177 -80 -213 -100 104 77 52 -96 91 15 -147 -50 147 -13 83 -67 -51 13 -78 41 61 -168 59
3913 59 66 230 -13 -128 114 -86 41 -147 20 48 -36 -54 -106 -67 102 -141 -178 -154 -12 -240 66 15 -191 160
3937 160 32 -399 -69 8 -80 62 -18 -187 159 15 -50 114 17 -43 -174 -226 97 -54 24 -48 106 14 -4 -152
3961 -152 -13 -75 -16 2 -204 -109 -133 312 165 95 36 -42 -72 -38 -49 162 132 -13 41 49 -64 -26 41 19 167 205
3987 205 109 -181 125 -8 -13 132 31 -267 -120 -34 -182 -74 -124 -25 -8 -25 141 -61 80 227 -55 66 -31
4010c1J80k41L54k59p1n3J30L9J65l60p5Q1j92K23J10Lj73L00j74j41J18L08m9
4033A92k1l43L84k62Q0J42k51L1J4J3j12L6j3J3N0J22k32o0J38N5J63l26L29R
4057A51j03K2j04p6J11J15j64Nj19K40k3j61J51k88J68L4M3Q7o8j8J66k51J76
4080I4l08K41j00Q0m1Qk24M06j14R5k09J9J42l7k57K97L6l5J28o8j10j70l6J93
4104C0j7K2Lq3J21l0J8j22P7n0o5J03P1k55J5K56j09j0J09j09R1N3P8q4j64J50
4130I9N8j82O4k5J80l40K22j74J27j56K85j42j80J01K1q8K80k98J17J75k77M05
4152B72m04J11l5j57J10J19j01j17J85j56R3J25j30K76l21K05j24J57l14K46n6
4173a6o3l00L64J75j34l4Q4k81K29K48j09j60j94K39J00j90JO2j9k14J46K08O1
$$ plain form
4010 -31 149 -92 262 3 -68 -121 9 48 213 -147 -222 -141 -333 -110 0 3 -170 130 -44 -185 -67 241 192
4033 192 171 -172 212 -50 30 172 -79 -48 -34 -21 -133 -97 -110 -97 -47 75 -157 -217 -79 -24 139 -187 142 151
4057 151 48 70 -34 -110 1 116 -48 -43 -162 78 55 -106 45 -243 -75 -41 2 89 21 3 169 -82 94
4080 94 -214 27 -73 7 -34 -26 -250 156 42 137 -72 -53 89 52 -205 92 128 93 221 153 43 -127 -163 30
4104 30 13 35 38 -45 76 46 64 -58 19 -31 -96 7 78 -177 -162 94 -15 -25 84 -25 66 119 197 113 -51 99
4130 99 157 -25 39 14 194 -146 76 -98 29 -127 158 16 -164 -63 -42 -130 150 -148 -31 144 -133 272
4152 272 -132 -21 -56 -213 -103 16 -85 -202 -17 -173 -80 45 -85 191 -130 75 -49 108 -206 40 -16
4173 -16 -79 -379 -15 160 26 -8 76 -205 24 272 163 3 -191 48 148 -42 -41 21 2 -212 -66 142 203
4196B03j40j9k10J42M1j34K05R5k9P3j98Jk03M40j76Lj11J84k26M2K76l72K23
4219A10R1k73OQ2J50j78j53L9K77k40j2P3J15J95k94J62j21K8j02K7P1n4L0k28
4243a99K32K2j3J41j87lj2L67n71K67J26k37J13Kr4P5m8n5J22j98J2K08n3n8n5
4268i6J02j6j49O9k1P9J0j27J45N3j1J15j99n9j6K50l00L32k95nJ21k10M1K48
4292F1N7j10M5J5j07K8r0J77j03K51j67l1j22K86j30q9K70k99l5J00l7N4O5P1
$$ plain form
4196 203 63 44 -166 -24 17 -117 88 183 154 227 29 30 -173 267 91 94 -17 167 -59 -17 259 -113 110
4219 110 201 -72 -66 16 166 -12 -165 -126 151 -89 -101 -28 87 282 -12 150 29 57 -45 -18 53 -1 29 -199
4243 -199 33 55 42 183 -4 -7 -19 348 -223 44 170 -67 46 48 -46 29 -19 -74 48 -150 -138 70 17 -41 -96
4268 -96 6 -10 -159 -90 -111 -32 -22 -149 -4 49 38 153 -46 -105 -121 129 -171 161 -134 -139 -18 -228 -187 61
4292 61 118 8 53 68 -39 -11 -101 76 -27 224 57 26 -96 190 60 -29 241 -58 -93 7 -30 24 89 160
$$ [...]
8191A91
##END NTUPLES=NMR FID
##END=
