##TITLE=1H_Pr Mat-1
 200.13MHz, CDCl3,
 8 sc
 
 10.6.2025
##JCAMPDX= 6.0         $$ Bruker NMR JCAMP-DX V2.0
##DATA TYPE= NMR FID
##DATA CLASS= NTUPLES
##ORIGIN= UXNMR, Bruker Analytische Messtechnik GmbH
##OWNER= pz
$$ XWIN-NMR		Version 3.5
$$ Tue Jun 10 15:22:24 2025 Russian Standard Time (UT+4h)  she@DPX200
##.OBSERVE FREQUENCY= 200.1313
##.OBSERVE NUCLEUS= ^1H
##.DELAY= (6, 6)
##.ACQUISITION MODE= SIMULTANEOUS
##.ACQUISITION SCHEME= undefined
##.AVERAGES= 8
##.DIGITISER RES= 18
##SPECTROMETER/DATA SYSTEM= spect
##.PULSE SEQUENCE= zg30
##.SOLVENT NAME= CDCl3
##.SHIFT REFERENCE= (INTERNAL, CDCl3, 0, 14.3821)
##AUDIT TRAIL= $$ (NUMBER, WHEN, WHO, WHERE, WHAT)
$$ ##TITLE= Audit trail, XWIN-NMR		Version 3.5
$$ ##JCAMPDX= 5.01
$$ ##ORIGIN= Bruker BioSpin GmbH
$$ ##OWNER= she
$$ F:/spectra/data/she/nmr/H-C/1/audita.txt
$$ ##AUDIT TRAIL=  $$ (NUMBER, WHEN, WHO, WHERE, WHAT)
(   1,<2025-06-10 15:20:55.81 +0400>,<she>,<DPX200>,
      <created by zg, POWCHK disabled, PULCHK disabled
       configuration hash MD5:
       00 E9 B6 7A A2 85 ED C7 34 08 36 98 17 FE 4E 26
       data hash MD5: 16K
       B0 80 25 6F 1A 34 A0 AC D9 1B F7 A5 27 35 C4 C5>)
$$ ##END=
$$ 
$$ hash MD5
$$ 25 2E C1 0F 73 3A 53 CC 7D 1D 33 BD 4C DC 31 70
##$RELAX= 
##$RELAX= 
##$RELAX= 
##$RELAX= 
##$RELAX= 
##$RELAX= 
$$ Bruker specific parameters
$$ --------------------------
##$DU= <F:/spectra>
##$EXPNO= 1
##$NAME= <H-C>
##$PROCNO= 1
##$TYPE= <nmr>
##$USER= <she>
##$AMP= (0..31)
100 100 100 100 100 100 100 100 100 100 100 100 100 100 100 100 100 100 
100 100 100 100 100 100 100 100 100 100 100 100 100 100 
##$AQSEQ= 0
##$AQ_mod= 1
##$AUNM= <au_zg>
##$AUTOPOS= <>
##$BF1= 200.13
##$BF2= 200.13
##$BF3= 200.13
##$BF4= 200.13
##$BF5= 200.13
##$BF6= 200.13
##$BF7= 200.13
##$BF8= 200.13
##$BYTORDA= 1
##$CFDGTYP= 0
##$CFRGTYP= 5
##$CHEMSTR= <none>
##$CNST= (0..31)
1 1 145 1 1 1 1 1 1 1 1 1 1 1 1 1 1 1 1 1 1 1 1 1 1 1 1 1 1 1 1 1 
##$CPDPRG= <>
##$CPDPRG1= <>
##$CPDPRG2= <>
##$CPDPRG3= <>
##$CPDPRG4= <mlev>
##$CPDPRG5= <mlev>
##$CPDPRG6= <mlev>
##$CPDPRG7= <mlev>
##$CPDPRG8= <mlev>
##$CPDPRGB= <>
##$CPDPRGT= <>
##$D= (0..31)
0 0.7 0 0 0 0 0 0 0 0 0 0.03 0 0 0 0 0 0 0 0 0 0 0 0 0 0 0 0 0 0 0 0 
##$DATE= 1749554455
##$DBL= (0..7)
120 120 120 120 120 120 120 120 
##$DBP= (0..7)
150 150 150 150 150 150 150 150 
##$DBP07= 0
##$DBPNAM0= <>
##$DBPNAM1= <>
##$DBPNAM2= <>
##$DBPNAM3= <>
##$DBPNAM4= <>
##$DBPNAM5= <>
##$DBPNAM6= <>
##$DBPNAM7= <>
##$DBPOAL= (0..7)
0.5 0.5 0.5 0.5 0.5 0.5 0.5 0.5 
##$DBPOFFS= (0..7)
0 0 0 0 0 0 0 0 
##$DE= 6
##$DECBNUC= <off>
##$DECIM= 32
##$DECNUC= <off>
##$DECSTAT= 4
##$DIGMOD= 1
##$DIGTYP= 9
##$DL= (0..7)
0 120 120 120 120 120 120 120 
##$DP= (0..7)
150 150 150 150 150 150 150 150 
##$DP07= 0
##$DPNAME0= <>
##$DPNAME1= <>
##$DPNAME2= <>
##$DPNAME3= <>
##$DPNAME4= <>
##$DPNAME5= <>
##$DPNAME6= <>
##$DPNAME7= <>
##$DPOAL= (0..7)
0.5 0.5 0.5 0.5 0.5 0.5 0.5 0.5 
##$DPOFFS= (0..7)
0 0 0 0 0 0 0 0 
##$DQDMODE= 0
##$DR= 18
##$DS= 0
##$DSLIST= <SSSSSSSSSSSSSSS>
$$ [...]
##$SUBNAM0= <"">
##$SUBNAM1= <"">
##$SUBNAM2= <"">
##$SUBNAM3= <"">
##$SUBNAM4= <"">
##$SUBNAM5= <"">
##$SUBNAM6= <"">
##$SUBNAM7= <"">
##$SUBNAM8= <"">
##$SUBNAM9= <"">
##$SW= 18.0517328524113
##$SWIBOX= (0..15)
0 0 2 0 0 0 0 0 0 0 0 0 0 0 0 0 
##$SW_h= 3612.71676300578
##$TD= 16384
##$TD0= 1
##$TE= 0
##$TE2= 300
##$TE3= 300
##$TEG= 300
##$TL= (0..7)
0 120 120 120 120 120 120 120 
##$TP= (0..7)
150 150 150 150 150 150 150 150 
##$TP07= 0
##$TPNAME0= <>
##$TPNAME1= <>
##$TPNAME2= <>
##$TPNAME3= <>
##$TPNAME4= <>
##$TPNAME5= <>
##$TPNAME6= <>
##$TPNAME7= <>
##$TPOAL= (0..7)
0.5 0.5 0.5 0.5 0.5 0.5 0.5 0.5 
##$TPOFFS= (0..7)
0 0 0 0 0 0 0 0 
##$TUNHIN= 0
##$TUNHOUT= 0
##$TUNXOUT= 0
##$USERA1= <user>
##$USERA2= <user>
##$USERA3= <user>
##$USERA4= <user>
##$USERA5= <user>
##$V9= 5
##$VALIST= <valist>
##$VCLIST= <CCCCCCCCCCCCCCC>
##$VD= 0
##$VDLIST= <DDDDDDDDDDDDDDD>
##$VPLIST= <PPPPPPPPPPPPPPP>
##$VTLIST= <TTTTTTTTTTTTTTT>
##$WBST= 1024
##$WBSW= 4
##$XGAIN= (0..3)
0 0 0 0 
##$XL= 0
##$YL= 0
##$YMAX_a= 50680
##$YMIN_a= -80063
##$ZGOPTNS= <>
##$ZL1= 120
##$ZL2= 120
##$ZL3= 120
##$ZL4= 120
##$ABSF1= 10
##$ABSF2= 0
##$ABSG= 5
##$ABSL= 3
##$ALPHA= 0
##$AQORDER= 0
##$ASSFAC= 0
##$ASSFACI= 0
##$ASSFACX= 0
##$ASSWID= 0
##$AUNMP= <proc_1d>
##$AZFE= 0.1
##$AZFW= 0.1
##$BCFW= 1
##$BC_mod= 2
##$BYTORDP= 1
##$COROFFS= 0
##$CY= -3
##$DATMOD= 1
##$DC= 2
##$DFILT= <>
##$DTYPP= 0
##$F1P= 0
##$F2P= 0
##$FCOR= 0.5
##$FTSIZE= 0
##$FT_mod= 4
##$GAMMA= 1
##$GB= 0.15
##$INTBC= 1
##$INTSCL= 1
##$ISEN= 128
##$LB= 0.25
##$LEV0= 0
##$LPBIN= 0
##$MAXI= 10000
##$MC2= 0
##$MEAN= 0
##$ME_mod= 0
##$MI= 1.114404
##$NCOEF= 0
##$NC_proc= 0
##$NLEV= 6
##$NOISF1= 3.799351
##$NOISF2= 2.8
##$NSP= 1
##$NTH_PI= 0
##$NZP= 0
##$OFFSET= 14.38212
##$PC= 1
##$PHC0= -1469.578
##$PHC1= 14.1922
##$PH_mod= 1
##$PKNL= yes
##$PPARMOD= 0
##$PSCAL= 0
##$PSIGN= 0
##$REVERSE= no
##$SF= 200.129724274929
##$SI= 16384
##$SIGF1= 3
##$SIGF2= 2
##$SINO= 400
##$SIOLD= 16384
##$SREGLST= <1H.CDCl3>
##$SSB= 0
##$STSI= 0
##$STSR= 0
##$SW_p= 3205.1282051282
##$SYMM= 0
##$S_DEV= 0
##$TDeff= 0
##$TDoff= 0
##$TI= <>
##$TILT= no
##$TM1= 0
##$TM2= 0
##$TOPLEV= 0
##$USERP1= <user>
##$USERP2= <user>
##$USERP3= <user>
##$USERP4= <user>
##$USERP5= <user>
##$WDW= 1
##$XDIM= 8192
##$YMAX_p= 0
##$YMIN_p= 0
$$ End of Bruker specific parameters
$$ ---------------------------------
##NTUPLES= NMR FID
##VAR_NAME=  TIME,          FID/REAL,        FID/IMAG
##SYMBOL=    X,             R,               I
##VAR_TYPE=  INDEPENDENT,   DEPENDENT,       DEPENDENT
##VAR_FORM=  AFFN,          ASDF,            ASDF
##VAR_DIM=   8192,          8192,            8192
##UNITS=     SECONDS,       ARBITRARY UNITS, ARBITRARY UNITS
##FACTOR=    0.0002768,     1,               1
##FIRST=     0,             0,               0
##LAST=      2.2672688,     0,               0
##MIN=       0,             -80063,          0
##MAX=       2.2672688,     50680,           0
$$ Real data points
##PAGE= N=1
##DATA TABLE= (X++(R..R)), XYDATA
$$ [...]
508c80J170j701j441M100L11j664q84l000L409M631m245k675J174J357K908k696
524C74l831K998R77N5J596l496r22K821m51J517n82m486K512L861r64j967l552
541c540J965N702l168l245K103l99J192R25k826P93j3j012L913l27l966K40R17
558g46K947Q51n998N1N116l08j029j937j776L683P88j927Q00j801j12L241j127
575G16j069m58j791L845K473m305j598J098K009K118l765k319L730O72m65m11
591D80k821J415K317j457P66m51k417J943J763m23j277k752K472M136l136k536
607a978J381O27J619r79k815J922J153r46O46j057p18J249l84J071L84k861Q56
624h30K203j051j19n52o68K000j89j149O10j040K44J674j373j44P81j214Q55R68
$$ y = [-380, 790, -911, -2352, 1748, 2059, 395, -489, -3489, -80, 4551, 306, -2369, -1195, 162, 3070, 374, -3457, -459, 518, 573, 2169, -1327, -2249, 572, 121, 1638, 1056, -3430, -918, 2943, 1979, 12, -3540, -1575, 4127, 959, -2286, -183, -582, 610, 1535, -1291, -498, -511, -1523, 2390, 2063, -1903, -1663, -746, 2201, 3052, -2946, -2895, 2221, 1913, 884, -1053, -2829, 854, 1642, -285, 515, -1286, -1398, 1843, 716, -353, -811, -2602, 1243, 3716, -589, -2187, -1089, 920, 3038, -727, -3046, 684, 1356, 891, 480, -2341, -926, 1391, -66, 700, 249, -2168, -225, 1538, 1115, -162, -2914, -442, 3694, 558, -1978, -597, 30, 1649, 670, -2145, -223, 930, -16, 630, -427, -1145, 104, -280, 791, 1175, -1686, -830, 1373, 322, 203, -349, -1017, 983, 794, -355, 255, -785, -541, 1133, -240, -384, 397, -817, 38, 1006]
642A006j424j80N2N65J617j595j303J513J5J90J86j929R00J699j353J1K16j279
660a093O91Q94J9j31j571O33K123j578j061J078j76R91K16j912N73P03o76Q88
678F11n98r47J282j00j45L95j755N01J806j105r5L74p84R42l8q12R06p73q9J710
698A286j423o68J427j009J68Q70j324M11N80o44R05o42q23J366o59RJ289j763
716f44J71J611j431P8M87j070J186J31j065J014q35l75J657j332k67J466j168
733c86M57P12j768Q48O21q37J192r34p52J897j052n17J253j535N35J449j798L02
751c13N86r50J260n75j021J757o92m06J326j661L44J500j697M83O68j360J209
768D58n8j318J300n81l17J474j588mJ576j470N05P09j544J148L12j228J196o28
$$ y = [1006, -418, -598, -546, 19, 1636, 41, -1262, 251, 266, 456, 642, -1287, -387, 1312, -41, -30, 186, -1093, -402, 492, 511, 380, -1191, -558, 1565, -13, -1074, 4, -172, 819, 1035, -877, -304, 399, -277, 611, 13, -934, 348, 248, 103, 498, -1257, -756, 1050, -55, -150, 224, -560, 382, 344, -468, 438, -335, -424, 1286, -137, -805, 622, -387, -219, 651, -673, -262, 318, -326, 579, -63, -886, 480, -179, -170, 1119, -644, -473, 1138, -293, -215, 272, -798, 388, 519, -546, 468, -367, -742, 915, -417, -684, 782, -386, 71, 783, -985, -137, 484, -353, 839, -95, -847, 1050, -2, -519, 734, -801, -266, 1183, -615, -313, 273, -677, 583, 8, -1013, 744, 52, -354, 972, -689, -345, 1155, -542, -59, 609, -751, 458, 400, -918, 382, -199, -516, 958, -630, -634, 942, -528, -23, 686, -858, 290, 602, -626, 570, -58]
786e8m78J542j450j75J526j477N05Q66j768R18N56j177J085m13o46J448j088j73
804d57J354j477M91J080j719P44O12j327J088j24r80J242p21k87J169j254K71
821b95J082j433N55O92j211R14O5q95J067n35l84J224j174j13J114j221M43O71
839E66j374P63N10r74P85l23m21J069p36l5Q10j214M94R50j382M11N28r01P85
858C11j24p93Q99m10k48R15q70j24R03p05M38K10j207Q87N74q55L69k79k51R72
878F12o24k99O06p92M93Q02j328Q4P22m12L99k71n76Q35j49k76P31p27k15Q83
898D98n32K00J23j089Q71P26j184M2K40r7O54n46k00O95q23K36J064j056l19O88
918A91j87O01m09j112J068L68o79L57o54O3J086q23j25N82r28N41P04q53K71q3
$$ y = [-58, -536, 1006, -444, -619, 907, -570, -65, 801, -967, -49, 507, -670, 415, 2, -644, 804, -284, -457, 897, -580, -89, 991, -728, 16, 628, -699, 389, 265, -715, 527, -194, -481, 688, -566, -295, 787, -646, -91, 601, -610, 304, 369, -526, 541, 6, -378, 846, -328, -441, 673, -548, -105, 566, -808, -45, 465, -509, 276, -47, -468, 601, -135, -170, 640, -574, -80, 870, -512, -101, 427, -474, 311, 187, -606, 293, -117, -365, 550, -320, -444, 459, -246, 192, 402, -805, 82, 656, -199, 170, -109, -360, 612, -12, -311, 295, -497, -4, 798, -530, -446, 276, -136, 263, -8, -584, 251, 102, -174, 557, -170, -385, 498, -34, 166, 289, -800, 71, 797, -387, -345, -105, -202, 452, -94, -294, 401, -422, -186, 878, -178, -497, 191, 4, 605, 196, -916, 152, 520, -159, 198, -456, -393, 693, -130, -255, 327, -601, -60, 644, -209, 62, -21]
938b1m64J102l54p38O36n19N10R93j730l45J343k29L9l85o42J285j66q65R47n65
958a68m27J080l55J00R9j378J216J192j830j96O49K05O90j288m25J564r46l74
976e92J213q60J4M22o04J097l39j626J393O38n88K28j177L42J588j342l35O95
994A67p23R31K14j417Q74M0n76J091o48l21Q80j036O80J098k014k8J266k07K77
1013E48r62n16J879o74j134J101m47j5O83q23P16Kj673J512J049j558p4J48N73
1032C35P95j921m1J696j019n5O64r65N58P5o97J120m99r09J362j53l86L56j091
1051g75O49J070j141K35J22p73J129j96j065Q76j42j12P12r93J28P32j086O49
1069A9P64j307J90O23j8K87j201l9J608p39o84P16l15K31P6q58Q95M8j190J053
$$ y = [-21, -485, 617, 263, -475, 161, -358, 152, 1145, -585, -930, 413, 184, 223, -162, -804, 481, 315, -550, 397, -168, -595, 485, 130, 230, 329, -1049, 167, 1359, -471, -667, -18, 187, 877, -411, -836, 728, -218, -592, 621, -239, -225, 197, -407, 690, 351, -1275, 118, 756, 168, 396, -781, -439, 1149, -193, -528, 167, -556, 375, 589, -828, 46, 86, -490, 601, -47, -368, 512, -524, 156, 1254, -760, -788, 478, 271, 548, -414, -930, 949, 275, -859, 242, -205, -220, 463, -360, 356, 358, -1315, 197, 1246, -312, -386, -238, 335, 1130, -791, -832, 864, -155, -210, 454, -511, 47, 122, -575, 545, 46, -863, 499, 346, -40, 316, -775, -126, 944, -197, 38, 160, -613, 516, 320, -745, 131, -11, -123, 589, -404, -276, 456, -630, 19, 783, -524, -334, 289, 271, 558, -643, -682, 926, 187, -497, 219, -96, 135, 211, -647, 248, 296, -894, 159]
1089A59O06q84j84j10O28N12j268K26J080p94K2J59o48O07O3l71O09n64m40R55
1109C63l27l97M35l53L62L38n93K98j4o05P63J48o73K97o1J55K07r73K76R03q32
1130b83KP67n93j38J72k9M11m82k03R98k78o49L45j22J64J49o27N41K71r47N05
1151b6M58q47J12K56R2L86o87M1Q14q12k23P77l60N6J46k30N11n53o04J061j74
1172A94o17N83j79J3L10q06L49N53q28M92N07p15K05l7j94N36o64P0R38q93j58
1193c41P83o82O0K36m33O84k38o46J081k90p61O53q1NL83p63N22L59j140N67M79
1214D37p46M06j36j34O49r35R7J049j034q1R06o09J98O0m85Q12m06o28J134l88
1234A66n35O85n38J35M05r07O85L45j044O91K81p20N37k96q9P63q38J12Q30j027
$$ y = [159, 765, -119, -303, -413, 215, 727, -541, -315, 765, -29, -7, 152, -496, 111, 174, -197, 412, -152, -592, 363, 36, -361, 74, -279, 83, 421, -172, 126, 112, -493, 270, 418, -255, 42, -19, 136, 343, -630, -354, 549, -283, -281, 486, -107, -245, -73, -102, 309, -173, -376, 622, 344, -305, 40, -82, 82, 231, -396, 145, 416, -531, -26, 432, -415, -303, -47, 45, 431, -256, -215, 599, -213, -436, 341, -19, 37, 183, -47, 464, -89, -693, 368, 194, -423, 160, -19, -6, 304, -502, -153, 400, -428, 64, 571, -144, 61, 24, -170, 366, -298, -228, 710, -183, -341, 442, -240, -180, 56, -377, 307, 69, -577, 504, 214, -547, 106, 25, 30, 413, -350, 172, 531, -609, -42, 437, -309, 97, -39, -173, 476, -459, -362, 687, -347, -428, 478, -131, 67, 127, -358, 454, 48, -580, 554, 166, -369, 316, -222, -87, 318, -589, 96, 441, -603, 88, 369, -351, 186, -110, -199, 564, -274, -162, 668, -359]
1254c59J01O63o21L54q5m19Q00n38m79J077n58l12P20n84K53L28q35O40K34q36
1274d56O18R1m43M25m49J01O10r46K87P31r45K44L67n07M40k50k74Q43n45l56
1294d14Q28m44j06L87m78L85J25p45O92Qo76N64o8k68M14m97J87N86q86K63N60
1315D17o53K45J82l76L83k05k03N61m95j02N71m59J8L03m92L35J56n57M74J8m39
1336c18M87r3k04K71k76J67L13n79J54M01m52J11J30l22L11j36j90L96k64j37
1356b30M51l02j5K94m21K66K18m31K05Q7k84L61j54k71L63k21l3L38m32P0L50
1377B09l65R1J68l45L32L1k67L02j59j63M60k53j59L43m05J62K82m85J26K25l28
1398a98K86j26k07L96j59j39M52m38j2M24l70J14J78m57L26J80n07K77p3j37M74
$$ y = [-359, -258, 405, -216, 138, 53, -366, 434, -104, -583, 494, -64, -376, 344, -240, 13, 341, -494, 146, 380, -456, 162, 253, -190, 235, -214, -113, 497, -449, -162, 569, -376, -132, 235, -272, 168, -82, -356, 487, -58, -414, 414, -30, -136, 251, -227, 158, 283, -462, 230, 238, -438, 126, 58, -210, 204, -293, -106, 480, -406, -143, 417, -236, 9, 191, -185, 198, -7, -210, 351, -144, -246, 325, -134, -116, 187, -305, 30, 186, -371, 103, 121, -318, 169, 76, -128, 143, -133, 34, 347, -232, -78, 323, -129, -18, 112, -210, 101, -35, -225, 171, -93, -230, 221, -81, -96, 198, -223, 43, 261, -170, 35, 122, -162, 199, 45, -226, 137, -84, -117, 221, -211, -141, 209, -156, -65, 103, -242, 90, 121, -146, 156, -3, -166, 294, 41, -118, 225, -180, -18, 264, -221, -95, 130, -198, 88, -38, -245, 151, -8, -147, 305, -133, -145, 279, -91, 23, 201, -256, 70, 250, -257, 20, -53, -190, 284]
1419B84m32j15M89m22N8M17m34J70J16l83M84o2n03M99q4j73L49n10O7N60n48
1440a73P1K52m76L84P4m05M78k37k38N91l56j71M71m81K57L55p16K33L13l78L31
1461A79k17k70O33l66k63N97m32l3M09n03M25J44p72N95J93n05K43k09Q3N91p59
1482b37q8O29n07J19K30m16M22l8m96N93j65l46N19k47Q9L06p31K66N23o31J94
1503a2Q9l19N19k59l49N89l32j69M68l96J66K54n90M19K71o44K94M7o1L71n33
1524a77j08O69m33j90L78l31K89M3m89M54K7m46L94K7j54K62m52J92M69o75P7
1545a74M32l91K49M4l49K82j33j90M01k36r2L34k84R2J43m22L51J98m00L15q0
1566I0k53L59k13j99L14j49L9J50l33J85J34m18K51K02k30J19m2J4K56m68m3N64
$$ y = [284, -148, -263, 226, -196, -138, 279, -155, 15, 131, -252, 232, 170, -333, 166, 82, -91, 258, -252, -185, 375, -173, -102, 150, -326, 58, 132, -273, 205, -32, -270, 321, -35, -206, 265, -216, 41, 396, -320, -87, 226, -152, 179, -38, -308, 325, -41, -304, 293, -139, -172, 237, -266, 159, 303, -469, 126, 319, -186, 57, -152, -69, 522, -237, -325, 304, -203, -84, 146, -270, 152, 114, -382, 211, 46, -300, 219, -28, 61, 367, -364, -98, 425, -206, -12, 77, -242, 277, 18, -331, 258, -74, -243, 225, -171, -5, 249, -341, 78, 349, -295, -1, 46, -15, 356, -177, -285, 384, -49, -239, 139, -192, 97, 140, -349, 105, 132, -314, 80, 107, -47, 215, -237, -45, 424, -251, -174, 258, -133, 116, 160, -189, 93, -40, -230, 171, -65, -157, 177, -107, -15, 128, -294, 57, 255, -145, 170, 90, -163, 196, -17, -216, 98, -51, -12, 138, -195, -10, 124, -294, -43, 159, -71, 48, 6, 20, 276, -192, -235, 329]
1588C29k90j14K17j56N5k0k49K87J3l15L29K4j73O6j98K29J79m48J77L64l24M
1610a4J03k04J46m5j43L30j26k01K58j84o7J59j74J78K01l38J72N3k86K35L9j99
1632a07K51r8n4J81l28J6K97k53M5J94k18P5pj52K90k09j48M88k03j64K34j99
1654f9N7J60l61K86J40m08K07Q3k56J82j44M1L44m18L9L99m24N5K42k86K34j6
1676H7k20L48j67l00M43k49o9L37l18J42J17m33K97Q9m23M60j6l07L50k40m4L50
1698B34m55J81L84n04J42J98l67K49r6j46M66l53j57M92l85l3L27l58K42J25m39
1719b53M27j8l82L73p1k22L53l49Q9L25n34J65L45m84K36J15k76L18j89j65M48
1740B51l29o8M39l75N9J82l42K71N9m22M28l8l61L47j59n9K82l54J92K43m66K08
$$ y = [329, 39, -75, 142, -14, 41, 21, -228, 59, 72, -243, 86, 110, -63, 3, -195, 34, 213, -235, -58, 306, -18, -14, 89, -115, 31, -14, -157, 173, 47, -154, 104, -80, -147, 12, -162, 16, 217, -121, 51, 104, -182, 53, 92, -107, 144, 46, -8, 173, -155, -139, 158, -95, -50, 144, -74, 1, -6, -158, 132, -77, -225, 263, 60, -104, 130, -69, -12, 148, -213, 73, 213, -195, 12, 95, -161, 21, -123, -82, 262, -156, -117, 282, -142, -87, 155, -131, 103, 87, -133, 215, 48, -252, 191, -58, -127, 210, -108, 34, 151, -282, 15, 104, -319, 141, 125, -182, 168, -72, -116, 234, -221, -40, 344, -160, -18, 180, -187, 62, -34, -180, 286, -67, -224, 268, -117, -150, 177, -181, 61, 186, -253, 174, 156, -226, 147, 76, -146, 207, -142, -53, 272, -262, -97, 248, -236, 0, 115, -161, 157, -32, -197, 251, -78, -146, 293, -82, -23, 159, -183, 88, 147, -275, 153, 115, -246, 101, -58, -117, 165, -189, 3, 246, -220, -12]
1762a2K08l81K77k7j78L19k63m2L86l89o6L34k78R4J17k37K53p4l06M05o6k03
1784a29K80j65k2J91l14K32J56m61K68J51l40J96l5j17K57k78L2L10l29lK63k06
1806f3Q7L3j81K64o4k31K85n5k02J82j32M2J27k15J43J40l59J56J48j62J24m4
1828B3p3J43j53j9K48k43k1K08j67M3Q0j62J60n1k13K44jj69J59ro3J02j90J60
1852C6J39l09Q1K01k01L6M9p4J43j25r7K42j95n7K39j64kJ51k21J69O8k89J97
1875A7Q6j84J86o8j28K40j99OK16k81L5J88k58J37P2k19K45j09r9K76j79j34L28
1898A74j65o4J53j91J80L4l30K81K4k39K20j38q0L05k68K3K66l26N5K77k82J60
1920F9M5k84L30j01j76K55j80m4K74l24N1K26l19J93J24l52L06l2k39L56j81j26
$$ y = [-12, 196, -185, 92, 65, -113, 206, -57, -99, 287, -102, -168, 166, -112, -18, 99, -138, 115, 41, -265, 140, 74, -129, 151, -14, -36, 155, -159, 73, 229, -232, 36, 187, -153, 43, 8, -109, 148, -130, -98, 212, -117, -120, 143, -63, 24, 57, -124, 140, 76, -155, 130, 75, -127, 55, -77, -35, 92, -123, 20, 160, -199, -43, 105, -57, 67, 23, -50, 93, -60, -79, 169, -74, -95, 113, -54, -11, 69, -93, 67, 16, -197, 47, 46, -123, 36, 27, -36, 66, -124, 36, 175, -134, -53, 148, -53, -17, 32, -42, 101, -24, -121, 121, -74, -131, 108, -56, -58, 93, -128, 41, 109, -180, 17, 103, -81, 105, 37, -91, 149, -50, -44, 172, -109, -74, 114, -144, -7, 65, -154, 91, -18, -117, 159, -20, -154, 174, 9, -55, 98, -93, 87, 121, -209, 72, 96, -143, 77, -61, -141, 164, -104, -81, 185, -141, -86, 191, -91, 69, 114, -170, 160, 59, -117, 138, -42, -86, 188, -136, -85, 141, -178, 15, 139, -213, 93, 61, -178, 178, -3, -129]
1942a29K63k17R6J92m19J99K20l95K29k4j75L59k85j27L86k33p4L01k76J31J01
1963A23l23L44K6l56K70o9p5K82l48K9L51m21P0K40l19J88P4k66L09j12k29L35
1985A23r0q3J99k93J74K07m22J43J97k70J67m0j62L35k35j16L31k80k2K79k59
2006a17J76J09l57K60L1k17K23j18q2K94k32o5K08k78J68J11k89J99Q9k87K52
2027G8o1j41K00j27M5J91k96Q5J86k34M2P5j17K16j58j42L01j42j56J83o8L9P6
2050G5j97J84J09l38J04J73j51J30p8p1J65k02n0K59j97RJ39j33Q0Qj77J78N2
2073G1j28J51m6r1R8q5l1J17r2Q6L7j80J02P6k05Q8N4n2Q5o9QJ29k19n6K83j37
2099fk7J33j25Q8j0j62J46J8j97J80j8m2P3j74M7J90k11N0J68j47O0Nj31J76j06
$$ y = [-129, 134, -83, 13, 205, -214, -15, 205, -190, 39, 15, -160, 199, -86, -213, 173, -60, -134, 167, -109, 22, 123, -200, 144, 170, -186, 84, 15, -60, 222, -126, -97, 254, -167, -97, 143, -176, 12, 86, -180, 129, 17, -212, 123, 33, -50, 149, -144, 30, 237, -185, -42, 155, -115, 52, 12, -150, 185, -50, -166, 165, -115, -137, 142, -117, 59, 168, -189, 71, 102, -115, 108, -10, -92, 202, -30, -95, 113, -165, 3, 114, -175, 24, 113, -174, 78, 17, -124, 76, -51, -6, 185, -111, -26, 160, -74, -32, 43, -74, 142, -16, -158, 143, 1, -155, 28, -40, -1, 75, -122, 62, 171, -167, -63, 110, -41, 89, 11, -60, 105, -97, -147, 112, -85, -76, 63, -70, 10, 18, -159, 19, 71, -57, 94, 48, -43, 55, -30, -61, 56, -36, 50, 87, -93, 9, 85, -120, -32, 22, -30, 55, -14, -6, 123, -96, -152, 131, -6, -33, 100, -25, 63, 53, -109, 37, 55, -142, 38, 20, -22, 51, -123, -76, 114, -97, -47, 121, -26, 34, 39, -92, 84, -22]
2124b2n4K45j73p4J95j42l8J45j94J40M6j75J85l2j89K26n7j29K24j40L6J09k70
2147a38R8J95k81J45M5j73J84j29q4K79k59MK76k15K2Q9j82J72N3k65L06o5k30
2170a53K27r2m3K09k72Q3K13l21J26J42k51J59k2j30K54j40n3K64k92mK19k12
2192h9J24Q3k33J70j2k19K55j21j15K63j43j9J61k27J35J06k86K28Q5k37J33o1
2214a9m5J91k36O3K49k77PK00k40J17J4j88K86j11j50K81j38r0J81j85Q9J04k16
2237a13J84J1k40J92%j41K14j39rJ50k40O8J67k40J00J39j54J19k1j40K19j26
2259@j00K29j35o2J25j35Q6Nj65K11K7k00J45jp1J14j26K7J24j33K7J19j83N1
2283b1N7j02J20l7q8J57j41k7J49j24RJ15q3O0J7j35J25M1j90J41K4j13R4o7J0
$$ y = [-22, -76, 169, -4, -78, 117, -25, -63, 82, -112, 28, 74, -101, 84, 52, -137, 89, 32, -97, 127, -13, 23, 132, -138, -40, 155, -126, 19, 64, -109, 75, -54, -138, 141, -118, -114, 162, -53, -31, 58, -124, 48, 101, -164, 142, 77, -153, 74, -18, -61, 148, -124, -41, 172, -149, -23, 119, -132, 27, 5, -125, 129, -11, -64, 200, -92, -96, 123, -89, 35, 118, -115, 55, 43, -176, 79, -42, -157, 106, -37, -56, 105, -122, 13, 119, -167, 61, 146, -91, 42, -19, -64, 127, -109, -46, 203, -74, -67, 133, -107, 10, 24, -164, 122, 11, -139, 142, 4, -86, 95, -90, -1, 103, -113, 71, 82, -158, 34, 34, -107, 107, -32, -41, 109, -131, -63, 104, -136, -36, 103, -51, 68, 47, -93, 126, 0, -100, 129, -6, -68, 57, -78, 8, 13, -152, 59, 86, -114, 31, 30, -41, 73, -53, -26, 98, -35, -8, 111, -72, -21, 36, -66, 54, 17, -71, 86, -55, -82, 67, -57, -48, 67, -16, 44, 61, -74, 51, 92, -98, 43, 67, -46, 48, -19, -9]
2308iP8j46L9J29j61M6P5o2OJo7J23J3j30J47q7k8R7q6J3O1p3jP4j09M6M7j17
2336h1J06l4m9J06n9lJ08j52K0J23q2RM4j01J08m9j36J58pj02J13p6K6P8j81J01
2362a2J30k04Q2Q7j50J27l2p4J59j41k8J15j34J4J51j42M8N1j32J03L0j41J72
2385G9p5q7J90j27j5J63k05P8R7k07J32P1j96J16l5n9J64j51J6J56j91K8J57j68
2409f9J03Pj44J96m6j65J93q6o4J93j86N4J28k09Q2N9j27J23l4j03J92j04m1J53
2433A05j58K8J33k19J17R6k10J67k8j31J85j19p0J86j52nJ61j79O9P9j60J90l2
2456E3j80K32l8j11J17j14N3R1j81O2J29j97R5L8j04J29m1j33K01j36nJ27j48
2479f1Q5N2j62J19N3j91J53l9n6J05p4m4J44j44K7R9j49J06L4j37J54l4j04J13
$$ y = [-9, 69, -77, -38, 91, -70, -24, 51, -11, -5, -4, -71, 52, 65, -65, 82, -5, -33, 64, -22, -9, 52, -21, -22, 52, -57, -11, 36, -81, 25, -9, -58, 48, -11, -14, 94, -58, -38, 85, 3, 12, 56, -45, 63, 14, -122, 36, 29, -73, 40, -36, -10, 68, -113, -12, 118, -86, -4, 83, -67, 60, 28, -46, 113, -28, -56, 59, -75, -61, 90, -52, -4, 47, -85, 18, 48, -93, 79, 4, -83, 107, -20, -35, 128, -77, 1, 98, -109, 23, 94, -102, 14, -21, -80, 84, -67, -51, 105, -86, -58, 99, -69, 34, 41, -103, 93, 47, -118, 75, -11, -75, 118, -68, -14, 114, -95, -13, 46, -81, 42, 8, -95, 97, -7, -48, 105, -53, -25, 108, -111, 6, 102, -108, 59, 31, -100, 85, -34, -104, 82, -70, -75, 86, -93, -24, 55, -105, 85, 53, -127, 105, 67, -44, 73, -41, 12, 103, -78, -16, 113, -84, 11, 49, -55, 74, 33, -100, 101, -35, -40, 87, -61, 24, 76, -86, 33, 86, -105, 48, 9, -47, 58, -16, -60, 84, -60, -33, 66, -83, 23, 57, -80, 74, 40, -64, 49]
2503D9m3m4J09r3K5J16k10M8J08j57R5J7r5J12Jr7Q0k7j5P1j16O8J16j68L6L3
2529A9p4Q1jr8J36n8l8M1l6MO9o6J8Q6q2PM4r1N6JlO4r1j6Q2n5n2O4m6K4Qo5Q5
2562A7N2j39Q0J2j3P2n0m7R0r3rN3p5M6P1j16P0jr4N9J1n9J07k3m5R1p3j7O3r1
2592e1P4O2j66R7N4j27P7k4m0J04j15RJ47j49qJ34j07N6K6j01J11l5j40J45j4
2617A9m9Q4o9j5Q8j57N6P9j28J34kj30J25k1p1J27q9j1J46j49M6P3j25N2Nj02
2643h4J67p7p8J41j48j9J81j28L2N3j41J64Pj85J59Nq8J17q9oJ06j84N6J46j56
2668d9O1P7j33O0k0p3J57q3o6J69j02j4P7j31P9M7j32J07L1j57J48m6p9J06p0
2693c6J1J04j33O5Q5j99J06J6r0J47q9j3J54j52n4J59j37O8K4q4J11rj79J95j4
$$ y = [49, 6, -38, 71, -22, 3, 119, -91, -43, 65, -92, 3, 20, -75, 37, 38, -59, 21, -6, -21, 50, -66, 2, 118, -50, -14, 19, -55, 26, 25, -73, 63, 5, -33, 8, -28, -24, 45, -21, -3, 83, 1, 8, 52, -39, 17, 18, 15, 79, -12, -28, 54, -1, -53, 11, -35, -11, -3, -68, 17, 69, -70, 10, 22, 9, 81, 31, -16, 74, -19, -28, 25, -50, -4, 67, -49, 21, 20, -74, -15, -4, -63, 44, 21, -24, 67, -6, -23, 40, -51, 23, 85, -81, 16, 70, -57, 20, -4, -44, 60, -55, -46, 101, -48, -56, 78, -29, 27, 53, -48, 63, 28, -112, 33, 19, -30, 54, -15, -30, 58, -99, -43, 36, -92, 42, 40, -90, 35, 14, -57, 70, -19, -30, 116, -33, 13, 86, -39, 13, 18, -84, 83, 6, -72, 69, -79, -98, 83, -45, -13, 40, -101, 63, 70, -115, 44, 49, -39, 78, -11, -17, 89, -95, -39, 107, -49, 12, 89, -44, 16, -4, -77, 80, -3, -69, 100, -2, -16, 61, -70, 9, 56, -76, 31, 62, -95, 53, 7, -72, 34, -36, -25, 79, -54, 11, 96, -103, 3, 19, -71, 76, -13, -26, 128, -24, -78, 81, -56, 12, 36, -48, 63, 54, -125, 70, 56]
2718E6j26J20j7k9P1j34P0N1j50R4Q4j23M5L4p8R3j01l6J73j22nQ6j15%Q1j19
2744i7J37Lj06J19k8p0P0j9l2L9l4N1M7j37L9O1p1RJ1k3N8l2k3J04j09K5P6q9
2772b1J2K5o4P9l9l6O1J9q5Q5k8k4L8l2L8J5o7O2M0p1LLl2M1l4j2Q4o4j6N1l6
2803elL7o1N7J4j13J20k1m2M0K0o7N6n8j3Q8j02L0Q9r4K0L1p7N7J5o9J26p3o8
2832f6J30n3k6N4o9M8M5j20Q9Mj25J18j5l4K9o6M6M7r0M2J07j34M0O3j14Q7k2
2859A5m7J39j14o6J15n4j4M8q3M4M7j19R8Oq9R8pm3J18j01J7J14j68O7O7j46Q7
2886B9K7j37J13k0p3J10q7j5J41j40K1Q8j24Q6lp6J21l3o6Q5k9m4Q4j03M0Q3j67
2913h9R4N8j37R0J9q2J41j13j6J26j17K4O4q9M1K2r1J31j4j52J42n5n0Q4n3JO6
$$ y = [56, -70, 50, 33, 4, 75, -59, 11, 62, -88, 6, 90, -33, 12, 46, -32, 61, -40, -76, 97, -25, -30, 56, -59, -59, 22, -97, 40, 43, -63, 56, 28, -42, 28, 9, -23, 16, -18, 33, 80, -57, -18, 43, -28, -19, -8, -31, 27, -5, -28, 76, -33, -8, 68, -21, -9, 16, -48, 31, -8, -44, 17, 36, -49, 36, 8, -16, 22, -10, 28, 43, -24, 38, 78, 7, 10, 13, -19, 22, -12, -24, 60, -4, -20, 31, -5, -8, 29, -32, 25, 39, -74, 46, 25, -17, 23, 43, -24, 32, -26, -39, 49, -53, -23, 66, -28, -8, 23, -54, 3, 18, -51, 75, 2, -66, 64, 11, -15, 39, -30, 18, 63, -57, 32, 36, -89, 29, 14, -20, 9, -57, -11, 36, -54, -12, 95, -39, 1, 64, -50, 37, 15, -32, 107, -7, -73, 42, -12, -26, 22, -61, -17, 30, -89, 9, 15, -74, 24, 17, -26, 92, -9, 8, 122, -46, 21, 88, -58, 29, 56, -81, 32, 12, -61, 49, -38, -53, 88, -52, -31, 57, -67, 19, 16, -60, 61, 28, -38, 47, 18, -26, 58, -45, -5, 78, -89, 5, 63, -74, 16, 35, -47, 94, -19, -35, 91, -26, -2, 62, -27, 14, 36, -55, 76, 62, -90, 52, -3, -53, 31, -22, -21, 45]
2940D5j26N5R5j42J35j4j45J35j0o6R9n0l8R9r8K7P3j34P0rp7J17l0k7P4o6k6
2967c4P7p2M6J1p9P9J4r1P6j3o8P7n0k6Q7n0J0N5r1L4J4n0P0j6p5R5j1l7L7l9
2997b0pO5m6J2Nm2L8J2n6O1Rn5M6l1j4N6p3K1P7p5J2K0j5L0l5l1M4j8j8N2k8m
3029hJ5l4K5L5n4M7L5q9K2L1n7P0m0j2O5m1l5P0o6K7J6l9K0M5o6K9J6o9Q0k5l1
3060a8O1m9l9R0m7j7O1r0L6M9m2K7j5o3R9l7l2N6l9J1N9q0M5K6j01O2K4q8P6N
3090C0p3P8m6j1J05p9m7P3p8M0K7n1R3l6r2R2j9l1O9o7J2Q7j17K5O7j28Q5ll3
3119b8R7o6m8J05n1n4J02j14P9K4q9P0Kj09J09l2m3R3m8l2P3p4J8K3p9J12j3p0
3147d3O7Qp7R1o3kP2o5j9J00r1J3J9o3P6rr7J36o0m7J03o9M2L7q8L6K9r6N9K3
$$ y = [45, -81, -26, 69, -73, 62, 48, -97, 38, 28, -38, 61, 11, -27, 72, -26, 1, 74, -60, 10, 1, -76, 41, 11, -16, 58, -8, -34, 43, -29, 17, 28, -51, 28, 42, -49, 27, 14, -54, 23, -27, -53, 34, -16, -6, 49, -42, -8, 6, -44, 26, 10, -65, 30, 19, -18, 19, -20, -27, 38, -8, 4, 9, -33, 5, 17, -39, 22, 31, -24, 22, -9, -23, 33, -40, -19, 58, -17, -5, 15, 0, 30, -5, -36, 8, -10, -28, 24, -4, -8, 7, -27, -2, 33, -21, 26, 61, -28, -6, 25, -32, 38, -2, -14, 51, 10, -25, 45, -21, 6, 22, -17, 3, 48, -18, 11, 27, -42, 38, 13, -18, 43, -6, -45, 45, -2, -19, 42, -48, -12, 37, -5, 22, 7, -56, 43, 6, -26, 30, -9, 2, 61, -19, 26, 52, -49, 13, 37, -51, 25, 30, -43, 35, -11, -22, 83, 4, -43, 30, -48, -8, 19, -32, 61, 25, -67, 25, 6, -25, 44, -23, -11, 76, -41, -16, 51, -77, 8, 5, -28, 69, 3, -45, 60, 9, -45, 57, -57, 22, 46, -43, 27, 29, -80, 29, -3, -46, 47, -1, -33, 40, -34, -16, 7, -72, 40, 27, -43, 24, 32, -45, 46, -17, -19, 53, -12, -31, 69, -22, -9, 10, -53, 23, 14, -83, 53, -7, -54, 49, -20, 22, 59, -29, 7, 36, -60, -1, 22]
3177B2m6P5n5k7J10j26J9P5q0L9L0r8O9K1j05Q4kl7P3m2k5Q8j12N5J7r2Q2ko3
3206e3R7k1o6O6l4K2N5p7M1L0r2MN3o1L2J0o3J23n3m7N9l7j7K0j9N4j3m5J4N1
3236C3p4O9k9j4L3j9oK8n2K6K3m0N2k5l3L6%j9K2ok9P8p6OL6m0K8K8m8j2J0k6
3268d0L0lm2L7Pk2J4k9L5K3k3j8N1Lk9K2j8L1j8n4O6J5n1K3J1k2N0o3J9J7l8L1
3300A5L2n0J6Nn1N2Oj6J4k6oK9m6PL4n6M0J2l9M9j7j5K5J2k5N1p5J1O6q2K4L9
3332C5n2N3k6k7M3j4l1R8o5l1M8m5JK1m3M9M1o4Rkm6Q1m0k6R5r2K2L3n4K1J8n3
3364d3O0qk7N8r8M9P2p1k1Q6q9O5ln1P2j8o9O8l2n7J23r5K1L0q0O4Ll8O4rm4L4
3396A6j8j1L6n7l1R3q7L2M7o2P3o2l2R6m1l4P9l4RK8n3K8M6q9O6Lr9Q4j3k6K6
$$ y = [22, -24, 51, -4, -31, 79, -47, -28, 47, -33, 6, 36, -62, 7, 28, -77, 7, 5, -32, 41, -1, -26, 62, -50, 5, 22, -70, 12, 10, -53, 44, 23, -43, 23, -11, 11, 66, -11, 30, 60, -32, -28, 25, -36, -4, 6, -57, 66, 13, -34, 25, -12, -29, -9, -28, 26, 13, -32, -18, 33, -41, 28, -1, -15, 18, -1, -7, 21, -31, -5, 18, -22, 30, 5, -28, 8, 8, -11, 11, 5, -24, 54, -22, -16, 20, -20, 8, 36, -12, -24, -14, -40, -10, -13, -55, -18, -11, -33, -19, -48, -13, 10, -13, -31, 20, 23, -6, 16, -2, 29, 11, -43, 23, 38, -13, 10, 21, -1, 49, -14, 5, 22, -16, 15, 47, -3, 13, 18, -33, 19, 25, 9, 23, -3, -9, 20, -26, -19, 15, -41, -1, 11, -28, 21, 4, -11, 14, 26, 1, 52, -23, -12, 54, -28, -4, 35, -17, 36, 10, -17, 26, 12, -19, 79, 14, -17, 31, -14, -13, 8, -35, 14, 55, -9, 0, -2, -48, 33, -7, -33, 62, -30, -8, 25, -29, -8, 10, -43, 17, 9, -18, 40, -58, -9, 63, -8, -29, 57, -32, 33, 30, -21, 51, 33, -36, 32, 0, -57, 66, -29, -8, 22, -58, 6, 9, -29, 35, 26, -18, 16, -2, -13, 23, -34, -65, 28, -59, -27, 20, -42, 31, -31, -63, 33, -8, -42, 37, 3, 12, 40, -13, 15, 61, -28, 38, 41, -58, 26, 13, -13, 13]
3427A3k4kM7o8J9Rl1O1J7o5J6Ok1P0p0oO1p3K3M4q8P2l4nO6k8m0O9l9kL0k4oO8
3461F5r4M8Om7L3j1l2O2m5K2o%k2M1m6J8L4l9M7n5J3K2j1k2L9k4J5j6m%J5j1O
3494Amk2K8j2j1L9k7K1kRj6K0qj9L7n0M3pk3jL2n6M6k1k6M3j7j0jj8K1L9m7J5
3528dKLJMK3j0Nm9Rk0K2M1oj5J5l7ML6k9mM6k9L3l0l9O1l3j9M1l7j1M9k6j1N4
3563D0p9M8K3p7O3l9LN4m7OK9m0M1ok7K2rk2L1j5l4O7l4j3N5l6nLl4N5j6n4O5
3596A8jj7K0l3j2M5n1M4j4l7N4rk9L1j9j8O5l4j6M2m4J5M6p4L5K9o2L6KmOj6J1
3629IL9l2l0N3p6N3J2n4Q5k2n1M5m6k3M3j7QL2j2j5Jk4M6l5j9N5n1K0K6l5L8K1
3661D4n8L7j2l3M3j8j4K7j1rO0n4k3N9n0RL8p2M0K3m6K9pm3N2l1K0J4Kl0J0k2
$$ y = [13, -11, -13, 34, -34, -15, -6, -37, 24, 41, -24, -8, -2, -23, 47, -23, -29, 32, -41, -18, 26, -62, 10, -24, -29, 37, 9, -31, 38, -1, -3, 27, 3, -3, 65, -29, 19, 25, -22, 11, 0, -32, 30, -15, 7, 1, 1, -21, 20, -26, -8, 26, -13, 34, -21, -8, 14, 3, -19, 20, -4, 11, -5, -9, -9, 6, -5, 1, -3, -25, 3, -9, -20, 19, -8, 13, 11, 20, 4, 24, 16, -3, 34, -16, 27, 20, -3, -4, 28, -28, 18, -3, -29, 14, -3, -13, -14, -32, -11, 28, -19, -4, -2, 1, 2, 6, 29, 19, 24, -25, -16, -36, -14, 27, 21, 6, 21, -16, -12, 24, -5, -9, 37, 8, 41, 11, -28, 33, 0, -19, 22, -15, -26, 23, -3, -14, 40, -39, 9, 32, -45, 18, -21, -18, 36, -11, -5, 24, -16, 25, 19, -8, 14, 5, -17, 14, -1, -35, 32, -2, -15, 40, 4, -1, 2, -32, 23, 7, -47, 18, 17, 0, 20, -13, -25, 20, -31, 13, -1, -38, 16, 7, -22, 9, -10, -28, 37, 3, -13, 29, -15, 0, 46, -28, 7, 36, -26, 10, 12, 8, 14, -2, 9, 48, 16, -14, 39, -37, 16, 28, -26, 59, 37, -14, 31, -15, -38, 5, -12, -4, 28, 16, 1, 2, -22, 24, -11, -30, 25, -26, -6, 20, -15, 23, 44, -14, 23, 11, -22, 21, 3, -11, 16, 5, -4, 56, 2, -21, 38, -12, -3, 35, -37, 3, 26, -20, 9, 2, -41, 11, -20, 0, 14, 16, -14, -4, -26]
3693b6J7J2l7L6qj8K5J6k1K4m0RL0j5J1J7m5M5k2oRLk2M5o2J5L9o7O7nl2j7N1
3726B8m7L4j3Rj1K0j6mk0Qj3oK4Kk3M7Ll5oOj6N3j9j0K7k1J5K1k5JK8l5j0M2m6
3761hK2l8J7J7k5j2M4knj3NPL0m2Mj4OJ8J0m6N2k3jOj6KL6n2L5L6o9K9lqL2j4
3797A7l1L1l9J6K7qlLm4K7K8k5J8Km3M8k2j5L2l3j4N4m3L7j3k8K6lj6N3m5m5P1
3830B0p%J1k8J3jl2M0J0l4O5n0Prk5mP8p3L0Jl8J2K3k6Rj6nO4m8jL7m0NL2n0K9
3866aL0n2M8l5j2L3k5nL5k0K2%l4J6K6l5L8L2p6O2n7J8mj8K6J4m4OL5n0M4Qn4
3899b9M7l2qL5n4K6L1l4L1J1n1M0K3m3L9k0l0N1n4PN8m9JjKK6nn7P9l2j3L3j1
3932A7j2Pl3K0%j1K7l3qK6K8k2J9k7k4N7l1j3J8%k7N0l6K2%k4%J3J5J2n3L4K1
$$ y = [-26, -9, 3, -34, 2, -6, -24, 1, 17, -4, 20, -20, -11, 19, 4, 15, 32, -13, 32, 10, 4, 13, 16, -6, 39, -23, -8, 31, -36, 31, 26, -6, -23, 28, -19, 15, 2, 11, 0, 20, 4, 0, -20, -12, -25, -31, -7, -5, -28, 19, 22, -13, -19, -13, -29, 24, 5, -5, 22, 1, 16, 37, 12, 13, 41, 6, -4, 38, -8, 14, -24, -7, 10, -15, -27, 17, 15, 10, -3, 2, 9, 39, -3, 1, -13, -7, 11, 21, -25, 27, 4, 3, 9, -7, -5, 31, -21, 14, 50, -19, 10, 7, -1, 31, 17, -14, 17, -22, -6, 21, 13, 10, 13, -31, -4, 24, -1, 17, 19, -24, 24, 2, -13, 19, -14, -28, 26, -17, 20, 7, -21, 5, 2, -14, 39, -6, -51, 20, 13, 13, 24, -4, 9, 8, -24, 16, 26, -8, 57, 7, 14, 5, -20, -24, 54, -19, 11, 12, -26, -14, 9, -17, -8, -24, -29, 35, -13, -14, 23, -17, -12, 20, -30, -1, 29, -23, 25, -10, -22, 11, -14, -19, 16, -4, 18, 18, -16, 0, 26, -9, 29, 61, -15, 47, -10, 8, 4, -14, 12, 26, -18, -12, 23, -27, 17, 25, -29, 18, -14, -22, 13, -41, -15, 16, -18, 13, 24, -27, 13, 36, -7, 32, 12, -18, 33, -21, -14, 44, -5, -4, -5, -3, 23, 18, -39, 40, 8, -5, 28, 17, 5, 12, -21, -1, -1, -12, 15, -18, -26, 0, 28, 6, 25, -2, -26, 31, 0, -13, 5, 5, -22, 28, -8, 14, 14, -10, -10, 3, 18, 30, -23, 11, 32]
3965C2m0mK0k0oK5l5K8J8m2ROpK9k6pj0L2j4K3k7K3Lj6J0Pl7M2l4lJ4PJ1Qj3j4
4001hJ0K3J1lm1PJj7L9kk6JK4n0L9J0j8%pNJ9o0K8K2o6N3nJ4nj0oL5j5l4L4j1
4037iJ3mk5P3l3m1N2j3j5L6m7J3K8o3K7K1n3L5Kk6N0m9QM5m1LJ1mk8N6k4k5J3
4070a4k8N0J4m3K0ooL4l6J1M6n6J5L1o4M0mj8M6j5j1lm2K6J9o5N4J8n0O7n9K5
4102dKpqJ3j1L6k1Rk9K6k2OJ7m6O8J0n8N6l3k1K5j2LRj3J9k0J7K0l6kP7p3J3J1
4137B1l8LK6j3L6l7j5J8pk3K8j6jL1l3L2Nk7L3jk6L4k5l5M0j0j0L7l0rL6k6J8
4170A6oq%K7mJol1M8l2n1L9l3K2L4l6L5jl4JM1m1J2JnQkNL4k0j3J6j4J4n0L3P
4207GJ0ONJ1l7j0j5J7LoJ6Qj0j8kL4K3m0mL5l3k9J9k3L4J5l9K6j0OnJ5k0J1j4
$$ y = [32, -8, -12, 8, -12, -18, 7, -28, 0, 18, -24, -15, -9, -16, 13, -13, -20, -30, 2, -12, 11, -16, 7, 10, -6, 4, 11, -26, 16, -18, -21, -7, 0, 11, 19, 6, -8, 2, 25, 36, 33, -8, -1, 0, -17, 22, 20, -6, -5, 19, -31, 8, 18, 0, 0, -7, -2, 17, -43, -15, 7, -59, -6, -11, 3, -2, -12, -18, 17, 2, -32, 2, -9, 4, 0, -25, 48, 15, -26, 26, 13, -2, 34, -13, 0, 28, -35, -8, 13, -40, -5, -3, -29, 21, -28, -20, 25, -16, -13, -2, -6, -34, 22, -2, -27, -14, -42, 8, 22, -21, -1, -7, -13, 21, -15, -4, 42, -14, 1, 32, -32, 8, 4, -14, 32, 17, 6, 3, -39, -13, 6, -59, -5, 13, -37, 30, -29, -4, -2, -9, -17, -4, -15, 21, 0, 9, -20, 6, -16, -10, 7, -39, 29, 39, -19, 37, 4, -17, 8, -4, -1, 8, -5, 14, -6, 11, 31, -5, -7, 70, -3, 10, 21, -17, -14, 12, -1, 35, -2, -17, 1, -6, -29, -1, -17, -18, 13, -20, 12, 17, -10, 23, 22, -4, 30, 5, -30, 10, 0, -10, 27, -3, -12, 24, -2, 16, 10, 2, 2, 29, 25, 26, 20, -11, 37, 5, -46, -7, -40, -18, 16, -20, 15, 14, -20, -19, 22, -19, -7, -6, -11, -3, -5, 0, 34, 14, 1, 17, 3, 17, -33, 0, 7, 17, 23, 28, 39, 2, -8, -23, -6, -3, -9, 7, 15, 5, -13, -15, 19, 42, 2, -2, 33, 0, -29, -10, -33, 1, 16, -23, 3, -7, -1, -6, 9, -11, 0, -14]
4242a4J6J3Nk2J2mqKRK8l4J9j0nl6L6mk3K2J1qNk9rO5m9L3l8kL5k5qK4j3J9Ko
4279IKj6k4KM4k4K4K3o6K9mRPJj4L5p1JM1j6PQj6J4l6K4K1k4J0j3K2J0j0n0L1
4314a0J7j0PLj5K8j6k3K8l3OK8mj5L6k9K4l0MJ8j3R%n0N4j0%Ok2k1QL3l7L0J0
4349A1m0L5j9J5Kk8K2nj9K4Qj0K6m6NK8kl3Q3n0k6K3k4K1J2j0K8j2m6N1J6n3M3
4382C0l6J6k4j7O0k3j7RK1l0Mpj8K7l3L7RJMj3j0j0oNJ4lJ0Mj0J2j1OOrNq%k2
4420b7M0OqK2m3pL4j2j9%Oj2J4k6L0k8K1NOP%NJ0l5lJ2K6m2K6j9pM4k2J7l0K0
4456A1k1K7jK0k3Jk3M8o3L9qj5nj1MK5Lnj9Mj9M3k0K3J0m3KL1kJ2k4j1KL1m6L1
4492Hj2jQJ3qMKj8L9q0L0M0l4L7k7k8L3JkJ0lk1Oj3NJ8J1l2J9j2Ql9M1qJ1m2J0
$$ y = [-14, 2, 15, 20, -2, 10, 6, -2, 0, 9, 37, 3, 22, 12, 7, -29, 7, 3, -20, 2, 13, 5, 10, -19, -28, 37, -12, 21, -17, -19, 16, -9, -17, 7, -6, 13, 15, 9, 11, -5, -29, -27, 17, -7, 17, 40, -26, 3, -1, 8, 15, 16, 2, 37, -34, -33, 8, -8, -1, 7, -9, 5, -31, -7, 14, -10, 0, -13, 9, 19, 9, -41, -10, 7, -3, 4, 7, -8, 20, 4, -19, 9, -24, -18, 10, 6, -9, 27, -2, 22, -8, -4, 14, 1, 10, 10, -40, 14, 4, 4, 10, -12, -33, -25, 8, -29, 1, 11, -29, 6, -13, 2, 4, -24, -2, -7, -26, -2, 6, -4, 22, -24, -19, 9, 7, -26, 57, 7, -19, 4, -20, 1, 13, 3, 31, 19, -27, 24, 40, -13, 30, -6, 10, -14, -31, 29, 6, -11, -2, 19, -11, -7, -14, -32, -5, -38, -1, 8, 9, 13, 0, -10, -20, -26, -21, -7, -10, 0, 4, -6, 6, -5, 1, 7, -2, 3, -5, -5, -27, 13, 19, 11, 33, -10, -17, 17, 5, -14, -14, -8, -20, -6, -32, -2, -30, -9, -4, 2, 9, 9, 14, 24, -11, -14, -2, 24, -18, 8, -11, -18, 26, 4, 21, -9, 11, -10, 17, 16, 36, 13, 14, -9, 39, -24, 15, 7, -8, -13, -24, -20, 5, 8, 3, -16, -12, -31, 12, -8, 15, 25, -18, -16, 15, 13, 25, 1, -10, -8, 23, -23, 8, -4, -5, 3, 16, 8, 12, 14, -4, 35, -45, -15, 25, -9, 28, 1, -27, 6, 7, 5, 15, 12, -9, -3, -16, -11, 7, 18, -14, 5, -7, 1, -38, 3, -5, 6, -36, -26]
4529b6L5OJl6J5J5KPk4K4qk8J6J8m6K9Nj3j2K3oK3j9j4K4j1OL1m2J7j4k5L0mk2
4564b3K4rj9L2j8jJ6m3L0njj1K0J5J5j1j6JLk0O0m9j3K8j7rJ9k2N2k2jpJ0k1K6
4599A3l4L3j0j0j2J9j1K4j5PJ9k9k7N2l4L1j8LkJ2l2MM6j2lK4m4J0rQJ7m5J7N7
4633D9o3J5K0m0J3J3j2jj1L4j2j9j5QnJ9pOJ8j6j5K2Oj4L5j3k6RQNok6J4J5j8
4668a0K9jj7Ql%oj3L0Km0KRMpL9j9KMl7K0j1J5j2K5k4NMj6J2jJ5l5J9j2M0j3K0
4706B7jj6j4K1J0j0l9K3jok2J0J3J3j6k1K7KoNRRk7J3lLk4J0Qj3L8j7k7J5L1n4
4742c0N7l9LK7n1O1k1j2jK2%Kl0J1Nj2LK2l1J7nj8K8l4jJ0OPJmlJ8rRlj4PpOK8
4782B5j2n3M8rK8J8o1K7nj6J3J1pK2pk7J1J2k4M3k5j5Ql7K4nj7j0L8l6O0j1j7
$$ y = [-26, 9, 15, 16, -20, -5, 10, 12, 19, -5, 19, 11, -17, -1, 17, -29, 0, 5, -8, -20, 3, -3, 20, 1, -13, 11, 0, 6, 37, -5, 12, -2, -27, 3, -1, -23, 1, -8, -27, 5, -13, -14, 2, -41, -11, -16, -17, -28, -8, 7, 22, 11, -5, -4, -1, -21, 39, -10, -23, 5, -12, -21, -2, -24, 28, 6, 5, -2, 8, -13, 13, -21, 12, 2, -8, -20, -1, -12, 12, -3, 4, 23, -6, -33, 19, -15, 16, -2, 1, -1, 11, -21, -17, 29, 17, 14, 38, -6, 4, -5, 3, 20, -25, -8, 49, -14, 1, 21, -19, -6, 7, -5, -6, -17, 17, 5, -14, -29, -21, -26, -7, -14, -8, 10, -6, -21, 1, 7, -7, 28, 15, -11, -2, 6, 11, 5, -21, -7, 8, -10, 19, 18, 1, 9, 6, 6, 0, -13, 17, 19, -21, -19, -10, -6, -13, 26, 7, 9, 13, -24, -4, -15, 0, -12, 13, -11, -6, -2, -18, -6, -7, 8, -27, -8, -20, 20, 7, 27, 26, 10, -4, 17, 27, 17, -22, 1, 0, -6, -28, -18, -5, 8, -8, -29, -2, 0, -6, -1, 8, 17, -10, 3, 0, 3, -21, -11, -3, -16, 22, 5, -22, -7, 24, -30, 27, -12, -9, 18, -33, 28, 7, -5, -6, 16, 16, 18, -12, -1, 4, -8, -5, 17, -14, 3, -2, -20, 8, -26, -27, -17, -11, -4, -3, -7, -10, 8, -1, 8, 5, -9, -2, -9, -3, 25, 13, -40, 8, -1, 27, 45, -16, 11, 6, -10, 3, 14, 7, 29, 22, -5, 6, 18, -6, 37, 12, -3, 5, -32, -8, -13, -30, -40, -2, -38, 22, 11, -6]
4815fK3l9OnRJ0K8m7N6j5o3M4J5jLk2NK4k1J6J5m9L4j8KK3j7j5K2k6%L4l8J9j6
4850a0KK6l2NK1%k0K0k7J5L0m2K3k2k8L1j5PL9l1j2L5mJ0J8n6j1L0qJRj7M4m6
4884a5QJ2k7lL2l1K0J4k0nL4m0L3mk0K4l3K3j5M7k0Ornj9OK0lqj6L1k1kpJ2mJ3
4921Hj4L5Kk8OmPkJrj1k9N3l1Pk3K0J8j7j1L5m1J9J8j5jNK9ll0K9l9K4pMj5K4
4958A4pK1k5k4J8j0K3l3K4j4Jl2N1j4Qoj3J8rjQj3lK7j1j5J9k0J0J7k0K1J9k6
4992Cj9J9J2Qk7RJ9j5J0knk5L4n1L8Nk7j1K4qLK4oJ3l7NJ4k2K9j0Mrk5nJ2M4m0
5029a5OLk0J4J1pQqn%j0N5l5mJ8j2jK2j2qL0l9RLj%k4mK2m5K7K3j2MJ6k3J1Ml7
5068c6N1m4OL0j2J7OJm2L4j1J2J6l4M9Pn3L9lm7L8k0k4N5l5K1Kl7L1m6K3k9J2
$$ y = [-6, 17, -22, -16, -21, -12, -2, 26, -21, 35, 20, -43, 1, 16, 15, 18, -4, 1, 25, 4, 20, 35, -14, 20, 2, 4, 27, 10, -5, 17, -9, -9, 25, -13, 6, -10, -8, 18, -14, -9, 12, 12, -8, 12, -15, 0, 30, -12, 11, -11, -39, -8, -23, -16, 23, -8, -20, 15, 11, 21, 39, -17, -28, 2, -6, -5, 4, -13, 31, -15, -7, 5, -22, -25, 7, -24, -4, 10, -10, -15, 19, -21, 12, 8, -12, 12, -21, 2, -13, 34, 14, 20, 11, 6, -13, -7, 13, 10, 2, -14, 17, -4, -6, -13, -1, -5, 8, -6, 29, 31, 3, 9, 5, 12, 10, 11, 2, -9, -38, 15, -16, -9, -32, -12, 6, -11, -22, 13, -28, -9, 9, -6, -7, -2, 27, 24, -6, 23, -16, 8, 1, 5, -10, 14, 7, 28, 3, -21, -3, -13, 10, -23, 1, -13, -12, -44, 7, -7, 1, -5, -18, 0, -9, -10, -2, -15, -18, 9, -2, -17, 2, -18, -8, 9, -11, 10, 29, 3, -16, 3, 15, 23, -4, 5, 24, 9, 19, 17, 12, -13, 21, -30, 8, 13, -14, -25, -1, -9, -6, 18, 12, 25, -12, -7, 7, -15, 14, 4, 8, -1, -26, -31, -19, 25, -15, -9, -6, -26, -12, -1, -8, 0, -8, -13, -13, -23, 32, -3, -7, 11, -1, -2, 20, 8, 0, 30, -9, 0, 3, 2, 2, -22, -26, -4, -49, -22, 1, -11, -7, 9, -14, -3, 1, -36, 15, -29, -23, 7, -5, 12, 18, 19, -23, 11, 0, 12, 28, -6, 43, 50, -3, 36, 33, -14, 24, 4, -20, 35, 0, 21, 23, -14, 17, -29, -6, -35, -23]
5101b3K9J6j8lj2lOK0k2j0M6n4J5L3l0L7J9m1j1J5K1l4qJ0kj1M3n2K3Jl7M1nl
5135dpK6j0q%l4JM2Rj4mrj6K8j5K9l9M1J1k9J4k7K3j9J3JJ8j9nnK5k1J6k6K5m
5171Gj9J3j6K6pk4L1PkJ3l6j4qL1Rk2rNK8pl5K7OPl9J5k0L3RokQl0L6k1J3J3k2
5209bj5K8j8LPj4K9l1K7j2k1RM0l2Kok4QjoPjON2o0J0K7j2jJpK4k8rN0j8l2L6
5247A6j3j1KLM0j8ok7L0k7L8j2n1L0J8lLj3%kj5mJ1k6K0KJ7pkm2O8m5J9J5j1J9
5283A6nj4J0l7L7j0j1K4k8K5j1%jM3l5j6j8K3J5k8K2J1K3n1j5N2l1j3K3LK7k9
5315Aj4J1l4J6K4qj6J8k1J5j3J1L4qm0K3Qj1J5J1k1J7Klj1j8%M0m5k2J0NL0j6
5349a0J7J4l7KQRj4pRJ5Pj8LlmJ6K7l8J2k3j0K8j6L4k8NLK8m3OK6j3Oj3l4O9o
$$ y = [-23, 6, 22, 4, 1, -11, -14, -8, 12, -10, -20, 26, -28, -13, 20, -10, 27, 46, 5, -6, 9, 30, -4, -12, -2, -4, -15, 28, -24, -1, 0, -37, 4, -1, -4, -11, 15, 5, -3, -3, -37, -36, 6, 15, 1, -3, -12, -28, 0, -15, 14, -25, 16, 27, -2, 12, -15, 8, -11, 2, 3, 21, 2, -3, -8, 17, -4, 12, -14, 11, 7, -12, 1, -15, 11, 4, -20, 11, 18, 16, 29, -7, -21, -29, 2, 11, -11, -20, -15, 13, 6, -29, -2, 4, 11, -28, -13, -33, 0, 9, 3, 1, 9, -21, 15, -6, 7, 20, -2, -17, 11, -7, -4, 3, -11, 18, -13, 14, 2, -19, -10, 30, -2, 0, -6, -30, -22, -23, -29, -22, -23, -17, 35, -25, -15, 12, 0, -1, 0, -7, 17, -11, -20, 30, 12, -20, 16, 3, -8, -6, -3, 37, 19, 13, -14, 16, -11, 27, 15, -36, -6, 12, 9, 12, -1, -1, -3, -18, -22, -11, -37, -17, -15, 2, -5, -7, -49, 19, -26, -7, 8, -3, 16, 11, -3, 7, -30, 7, -3, -14, 10, -18, 7, -4, -4, -5, 38, 3, -13, -31, -8, 7, -21, 1, 12, 35, -16, -31, 21, -10, -23, 0, 3, 30, 1, -13, -2, -36, -20, 4, -4, -20, -2, -23, -8, -21, -10, 24, 16, -24, -1, 7, -4, 11, 22, 1, 18, 20, 17, 6, -12, -12, 28, -17, -39, -29, -24, 6, -10, 7, 21, -16, -14, -6, 3, -11, -18, -9, 6, 13, -5, -2, -5, -9, 7, 34, -4, 8, -15, -25, 3, -13, 21, -7, -2, 1, 29, -14, -8, 18, 5, 11, -2, -36, 33, 27]
5386B7m2Mk8J7j8OJ2N4m6roK8j0J7l6PMJ2rqL0K8m1MOl3L2k%J6j6k7K5j1M2j7
5422A2j5qrL4k5J4qj3MJ3kk7M9j5k2j6N0k8oK1j2J7j0j4L8j2k3J7Kj3K3l9K3J6
5456A6J8m8J3OK6l5l7N2k8J5J8k6K9ll4J4Rl9K4JRK2j9j2K0k3K5l4j4L0nqPpk
5491b0J3JNrL6k7K1o3M0j7QK2qpJ9Nrj9K0j2K9m1NJ8l6M7m3pL1k4K8l9j6L0PK9
5527A7LJm2K5okPj4OLK3j3Nj6J5Mm3M4l0J2K2mk7J2jOK7l1j0l5J2K8RnkK0j9l
5565blj5K4j3MK1rppMJ2m9L1J2k1N5k1l3O%K8m0K7k3J6jkJ7lkj5n%Rj9K4J5k8
5603a3MK0l3K7KK6l8K5ppMk5K1nJ8j7RL2m0K0rj1K6jj0j5J8k7J5j2MjJ7k6L3j4
5639A0j2Qk8ORoJ2L2j2l3J3j0M2k9j1J3J9k5Kk0K8pJ1jk2J2K4j6%J6kRk9nOj6
$$ y = [27, -15, -11, -39, -22, -40, -34, -22, 32, -14, -23, -29, -1, -11, 6, -30, -23, -19, -7, -16, -24, 6, 34, -7, -3, 3, -30, 2, 0, 0, 16, 0, -27, -2, -13, 29, 12, -3, -11, -20, 14, -11, 3, -5, -18, -14, -1, -3, -30, 19, 4, -18, -34, 16, -12, -18, 3, -9, 8, -2, -16, 22, 10, -13, 4, 6, -7, 16, -23, 0, 16, 34, -14, -1, 5, 31, -4, -41, 11, -17, -2, 16, -10, 19, 16, -18, -4, 5, -34, -10, -9, 0, 22, 3, -9, 11, -12, 13, -21, -35, -5, -10, -18, -11, -18, -20, -7, -6, -1, -10, 26, -1, 20, -43, -3, -20, -12, 10, 2, -5, 14, 19, 10, -9, 11, -1, 28, -13, -8, 10, -26, 21, -22, -29, 2, -22, 6, -33, -49, -19, -12, 17, 20, 21, -21, 4, -2, -4, 3, -11, -5, -2, 21, 8, 13, -3, 12, 16, -27, 17, -13, -1, 21, 17, -10, 2, 1, 7, 34, 3, -7, -42, -30, -2, 7, 2, 0, 20, 1, -2, -5, -20, 4, -9, -5, 16, 7, 0, -7, -3, 9, -40, -9, 3, -18, 37, 16, -17, -11, -11, 17, -23, 4, -19, -3, -4, -6, 11, 8, 6, -9, -14, -14, -5, -24, 0, 15, -13, -9, 11, -22, 5, 7, 33, -5, 20, 13, 6, 10, -15, 6, 1, 19, 2, 11, 43, 3, 23, 14, 3, 29, 28, 18, 3, 21, -6, 9, -3, 1, 0, 17, -9, 24, 10, -2, 6, -22, -16, -7, -13, -1, 31, 19, -14, -1, -11, 31, 2, -9, 4, 23, -2, 0, -20, 8, 1, 12, 11, -11, 1, 25, 9, 9, 25, 23, 32, 3, -2, 4, -12]
5675a2kKK4kk7K2pj3J4J0j6j5L2j5K3l9NK2j7J9mj1J5k3K5oOnNJ0j5K1mj9QqJ3
5712A6j5j8M4l8L0o3O4pk8oJK8m7K6LK0Mj2j5Qj4L2j9J6Pm7M4l5K0OJ0rrK2l2
5747a3K8J0l1J8k3QK1J1m0K6l4L4j1k6%J3K9j9j4lK0j4L0k6k1L8Nl0Nj7RK7lj1
5781dL0k3j9J3J2mK5m0J7J2m4L3j1K1Nn3M2J9j5rj7j5K0lmK4k2oLJ1j4NRkK0l1
5817a5J6JppJ1J4Qm6N4Mj8Mk9K9%m1OjK4J1Ml9KkJ0K3m0K0J2l2J4J1Lrj0L5l6
5854a6J3j0K0mKnJ4mk0L8l2Qj0L1j0PJ3k5%j4J5k0K7j2j7J0jJ7m2OJ6JK9j9k1
5889a5J5Ml1J2PJ1j2j5M5l3k1JL0rLK3j0j0J4k5mN1m7L7kj9pL3k6lK1k9JJ3J8
5924B1l1K4j1l8K8NMOqNpj6K2j4Pj8K0K5l7qM6o1J5K7rkj6L8j6J6l5j5M2mMk9
$$ y = [-12, -14, -12, 12, 10, -17, 5, -2, -15, -1, 9, -7, -22, 10, -5, 18, -21, -16, 6, -11, 8, 4, -7, 8, -15, 10, 4, 10, 5, 10, 20, 5, 26, 22, 3, 11, 3, 16, 1, -17, 27, -11, 19, -44, 20, 13, -15, -21, -20, 8, -39, -13, -10, 10, 14, 2, -13, -5, -19, 13, -6, 10, 17, -30, 14, -21, -1, 5, 15, 6, -3, 19, -13, 15, 25, -6, 12, -11, -3, 18, 29, -11, 15, -19, 15, 4, -22, -22, -9, 20, 1, -13, -16, 4, -10, 20, -6, -27, 11, 16, -14, -9, -26, -17, 10, 7, -4, 26, 3, -16, -3, 9, 5, 30, -10, 7, 19, -25, 8, -3, 18, 23, -30, 12, 31, 16, 7, -10, -25, -5, -8, -12, 12, -10, -16, -13, -2, -16, -11, -2, -4, 16, -15, 1, 2, -5, -12, -1, 13, 21, -25, 29, 33, 15, 19, -10, 19, 19, -22, -16, -17, 7, 18, 22, -17, -15, -17, -7, 16, -24, -4, 8, -24, -10, 1, 4, -5, -15, 20, -16, -3, -13, 7, 3, 5, 0, 14, 10, -10, 28, -4, 4, -6, 25, 15, 22, 35, 10, 10, -4, 11, -9, 18, 6, -11, -1, -2, 15, -27, -21, -5, -4, 25, 6, -15, 0, 4, -27, -15, -8, 3, -9, -24, 21, -12, -33, -32, -2, -11, -8, 15, 5, -5, 9, -16, -20, 31, -16, 21, 19, 0, -7, 26, 0, -3, 18, -11, -10, 3, 21, -10, 14, 3, -35, -7, -2, 2, 8, 0, 5, -2, -18, 4, -10, -3, -21, -1, 24, -13, -21, 25, -36, -21, 6, -3, -5, -21, 17, 1, 17, -18, -33, 9, 5, 9, -20]
5960b0OK6QLjNm5J2K9l6Qj7lQO%K6k5K1pnPJ4j3j1ll0P1k7JK3l2LrK0k1j9L4J
5999HQj3Kk0J3K8qmKk7L6rm2L0Oj1%Qj9Rl2J1JMlJM4m7jLK2K8k7J1J2pk8QJ9n
6039A1mJ8l7K7ok3J4QRj2ok6PJ9MK1l0j2M3o0K8KJ1l1J8Oj4l0L9J7rJ9k5Lj1L3
6075B1l9j4K1J2j3M2k5Qj1nK6j9oj1Rj3K6k0J2kK4k3l7K4J7Jk3ORj2J5j6J0kp
6110a5LJ0J7k2M1o8L6L2m2J3Mj9J9k8N4j5j9J3j9j5K2J8m2L3j8Jk%j0J0J7lqo
6144hJ7jk5j0M3m9J2nJ9Jj5N4l2pJ0j1J8Lk4K3Jmj8L4j2j5qM2k7k0L8l3jK0k6
6179a6J3J0m4J7K2k5L8l4JJ1J3pl7L4k7L7Qj3k3L0J5mrk9L1J9l8QMj1J4k8J5j0
6213a5J6J7J2k2j8OJ2j3k5jJ2J4l0K6J9n5N5m3J1M3j8mj3PJ6JqjnJ2J%j1j1K9
$$ y = [-20, -14, 12, 20, 23, 22, 27, -18, -6, 23, -13, -5, -22, -25, -17, -11, -11, 15, -10, 11, 4, -1, 6, 20, 7, -4, -7, -37, 34, 7, 8, 31, -1, 2, -7, 13, -8, -27, 7, 8, 16, 3, 5, -15, -2, 26, 18, 14, 16, -11, 25, 16, -26, 4, 10, -1, -1, 7, -12, -3, -35, -24, -23, -19, -22, -21, 23, -24, -25, -22, 0, 28, 1, 12, 24, 17, -11, -3, 16, 11, 7, 25, -12, 15, 9, -14, 0, 8, 17, 5, -1, -27, -20, -1, 3, 24, -6, -18, 25, -35, -7, -5, 6, -25, -7, -1, -15, -45, -6, 11, 2, 21, -4, -1, -12, 21, -18, -32, -11, 1, -12, 30, 5, 13, 2, -3, 23, 4, -2, -13, -4, -17, 9, -11, 1, -1, 23, 0, -37, -13, 4, 5, -18, -12, -3, -15, 0, -16, -6, -8, -15, -12, -2, 15, -7, 34, -34, 2, 34, -8, 5, 9, -10, 9, -19, 35, 20, 1, 14, -5, -20, 2, 20, -22, 11, -7, -6, -8, -8, -18, -8, 9, 6, -2, -8, 9, 8, -17, -27, 16, -33, -21, -26, -7, -6, -21, 33, 1, -6, 4, -7, 11, 14, -10, 13, 14, 10, -8, 26, 14, -1, -9, 33, 6, -14, 24, -9, -10, 10, -16, -3, 7, -37, -20, 2, -23, 15, -19, -18, -7, 6, -1, -38, -4, -31, 6, 14, 1, -22, 8, 23, 19, 10, -19, 12, 31, -7, 1, 5, -6, 8, -20, -5, -15, 1, 18, 30, 8, -10, -4, 8, -5, -30, -31, -19, -5, -35, -9, 10, -45, 10, -33, -22, 21, 3, -1, -14, -7, 9, 10, 2, 1, -4, 8, 9, 9, -2, -13, 16]
6248A6k7J5M2m6K0l6K2j0J2J2k7MK0k8L4j8l0K5l2K7j7J8ojJ9j6MRLjk1kK6k2
6282a2J8ormL5kNm1L8Pk7j4RL2k1kk0j4KJ2J2m2K0Qk4L6j7K9%k6Rj3J9l3M8j1
6318Aj3j0LM0lj4LPj7JlRK2pk2jQj5PL1k4ol4ONK4L1k6OJ9m1J2j3kLj9J0J5J2
6357Emj0M4l1k5K9j3Qj0J1J3l0J4J8pKkj6M1n2K5l1J3kJ9j1PMj4j7J7k1K1oj7
6392b8L3oj7Loj9L0Ooj9L1jMj4joL2j6M9m5rK1j7m%pJ9NojMj2NJ0j8k0J7j0K3
6431DLj2j6KKK4k0J3pm1N1m7L2kJ4Pp%lJ8pPrj7L5k3KkJ7ok0kj4qJ6K9k8j5K7
6470cK0j9jMpj2Oj6QJ4K8o0J0L0j4j2K3j3J3loJ6j6RK7l6M0l5J7Nom5K5RnJ5m4
6507c4J5K9l5L4j8Qj3KJ8l3M4k6J4k6lj3M4pk4Oj2L6j7kMK6pKoL1m2J6Pk0rK5
$$ y = [16, -11, 4, 46, 0, 20, -16, 6, -4, 8, 20, -7, -3, 17, -11, 23, 5, -25, 0, -32, -5, -22, -4, -10, -11, 8, -8, -4, 5, 8, 7, -14, -16, 10, -12, 6, 0, -9, -13, 22, 20, 25, -16, 22, 29, 2, -12, -3, 29, 8, 6, -14, -28, -26, -14, -2, -44, -24, -16, -40, -4, -21, 8, 8, -18, -9, -22, -3, -36, 12, 1, -12, -22, -19, 21, 18, 4, 7, 14, -3, -2, -5, 4, 26, 19, -3, -4, 4, -11, -4, 27, 3, -3, -37, -31, -26, -2, 29, 3, 9, 28, -13, -1, -14, -16, -13, -32, -22, -7, 5, 1, -9, 35, 4, -21, 8, -5, 3, -7, 4, 17, -13, 1, 19, 12, 14, 12, -4, 37, -15, 10, -21, -8, -10, 9, -2, 5, 9, -5, -22, -5, -26, -5, -11, -28, 5, -1, -18, -15, -21, -40, -10, -4, -10, -29, 2, 1, 5, -9, -10, -16, 16, 0, 49, 4, -5, 16, -1, -5, -5, -12, 7, 12, 6, 5, 9, -3, 2, 12, -6, -26, -9, -19, 4, 7, -5, -21, -19, -17, 7, -13, 0, -7, -48, 3, -44, -12, -14, 0, 7, 0, 0, -3, 15, 8, 15, 6, -11, 24, 1, 3, 1, 18, 12, -8, -10, -24, -32, -16, 13, -15, -30, -3, 17, -2, -3, 1, -6, -18, -12, -28, -20, -6, 22, -38, -28, 2, -12, -24, -1, -14, -1, -4, -10, 6, -10, -1, 26, -10, 30, -5, 12, 17, 11, -34, -9, 0, -5, 10, -34, -19, 10, -25, 9, -9, -1, -14, -12, 6, -27, 17, -9, 5, -21, -24, -37, 7, 0, -24, -18, -30, 6, -11, -13, -9, 17, 10, 12, 6, 37, -5, 11, 18, -2, -11, 14]
6543A4Ql4J9QPnlJ9l7j6MK0j6Jj8NL7j9pkj1K1j5j7L3l6M8k5J1l3J3L5RnpJ1j6
6580APNJ7lj1j1ok6K0K6j1Rk6Lj6J1j2L1k9MJ5l3K3MoNLj8L8j3oJ9l9K9nqK2q
6618EJ7K1m0K0j3L0l3nj2j7L7krMk7j1K5jJ0kl3J3J4qLRj7oPlJ5L2l5j6M5m0J1
6655a2JJ8k0J1J5k2K1Rj5LJjK0n1J7k6J6Lk3J1K9j2rpJ4j7MqK5L5n3K5pOl1L3
6691Cj1QK5k7j4OJ8j4NK7l9QPqnK6k6kJ6Okk2MJ1j7L6K7o6L4kk9K0mrNj9L6l2
6729b0J4Ol0PJ8j3L4mJ5k2l5M8j9K7o0M8k5j6N6m6M2m3JOL8j8j1K6j1nk2JqK9
6763Hk1J7j6mPRj5j0K3j5J0k1K6Rj3K8m0L2j1%lLOk5j5K8j1L2l8N4j2m6M6rk6
6798a3J3J3m2J5L6n3J3J2k8J9J5j5J6j2j5J1K6k0kQj7K5Oj3%J8J2j8L6m0OK1k8
$$ y = [14, 22, -12, 7, 15, 22, 17, 14, 33, -4, -20, -16, 4, -12, -11, -29, -24, 13, -6, -13, -15, -26, -5, -20, -37, -4, -40, 8, -17, -6, -39, -26, 9, 18, 13, 6, 17, 1, 8, 13, 30, 27, 16, 5, -1, -27, -7, 19, 8, 17, -9, -6, -22, -11, -23, 8, -21, -17, -2, -35, -12, -8, -14, -9, -6, -24, 14, 1, -5, 14, -25, 4, -1, -9, 13, 5, 22, 43, 3, 23, 10, 40, 7, 2, -10, -27, 10, 8, -1, 3, -24, -35, -10, -11, -1, -3, -36, -23, -9, -17, -14, -5, -22, -28, -21, -24, -9, 23, -12, -28, 17, -23, -12, -11, 7, -13, -2, 13, -9, 12, 21, 6, 9, 10, 9, 29, -22, -5, -31, -15, -12, -35, -24, 5, -7, -16, -23, -9, -26, -22, -30, -5, 30, -23, 2, -5, 1, -30, 3, -8, 0, 25, -2, -16, -10, 8, -6, -1, 26, -13, -5, 2, -6, -11, 15, -11, -13, 3, 9, 7, -15, -11, 0, -17, 19, 46, -20, 14, 12, -17, 3, -1, -10, -5, -24, 12, -20, -6, 0, -30, -23, -5, -18, 16, 12, 27, 5, -30, 18, -1, 26, -34, 14, -11, -27, 29, -17, 25, -18, -17, -11, 27, 9, -2, 24, 13, 8, -14, -13, -21, 8, -13, 4, -12, -16, -9, 0, -15, -25, -2, -17, -7, -28, -2, 7, -6, 22, -18, 14, 3, 3, 0, 3, 9, -16, -31, -3, -14, 18, -20, 34, 22, -24, 22, 13, -13, 0, 13, -29, -14, 22, -31, -18, -6, -34, -15, 0, -15, 1, -11, -26, -15, 11, -9, -11, -3, -20, 5, 11, -2, -2, 16, 28, 10, 46, 6, 12, 33, 5]
6831Ej5L1rjJ2j9j1J4j0Oj2%rLL5o0M2j8N1n0K6nj1J5rmj3MJ6j1J9j3K5rl1K4
6867Hj2oLOJk5L3K9m9K6Lj8lL1j4j4Kj1nLJ9j8%JLLJ6l4J5kJKJ0Rj4MJ4l5M8l9
6907iRj2J4j8K0M2n3L5l9L2j2l9L1K0nj3J6Kqj0J0j2j5Nk0J2NL0m1K7k4K4K7m0
6941iPNj3J7Nj9K5j0Qj1Lk6K2J3k0QLkJ3j4K2k8oj6J8KJ9j3j5J2j9K4Ol1J7k4
6977b7pL5k1%J7MlK3m9J0J3j2RmJ5Qj5J5RRjl2L4Pj8m2K9kj7L2Nl0Kj0M2rl0l1
7015d2K7J3k4L9m2K6J4j4j1J2mK2l1k2N6ll1K5j3nKJ3jqQK1k7mK3mrj6J9oJj5
7051a1J9k6kjJ4J2k5OJLJ3J2l1NqJ7ONj5jJ6LlJ9mj1l5J9QpK4k9j5oK1%k0L3j1
7090ej1j6M2m5J6mK8J1k9lJ4k3L0k5K5j0mjQK%mnJ6j5K4k6J6k2M2Jrork8M4l6
$$ y = [5, -10, 21, 12, 11, 23, 4, -7, 7, -3, 3, -9, -9, -18, -15, 20, -40, 2, -16, 35, -15, 11, 6, -5, 10, 1, -3, -16, -12, 4, -7, 12, -1, 24, 15, -16, 8, -4, -10, -7, -1, 0, -25, 8, 37, -12, 14, 17, -1, -4, 27, 13, -1, 1, -10, -15, -12, 7, -11, -11, -10, -7, -4, 12, -22, -7, -9, -8, -6, 4, 13, -1, 3, 17, -18, 30, -9, 0, -12, 2, -16, 4, 46, -7, 28, -11, 21, 9, -30, 1, 21, 16, 3, 19, 21, 13, 3, 13, 1, -14, -9, -29, -17, -12, 18, -23, 4, -20, 4, 31, -9, -2, 3, -10, 7, 12, -7, 18, 8, 16, 5, 8, -18, 4, 17, -3, 5, 8, 6, 19, 5, 27, -1, -7, -23, -5, -3, 16, 3, -12, 0, -19, 5, 11, -20, -3, -27, -34, 1, -20, -20, -3, 1, -2, 21, -28, -18, -5, -17, -8, -12, 3, 11, -4, 11, 20, 29, 28, -4, 30, 37, 19, -23, 6, 4, -13, 19, 24, -6, -4, -14, 28, 19, -11, -42, -15, -2, -26, 13, -29, -3, 11, -3, -14, -2, -6, 16, -15, -37, 19, 16, -15, 10, -3, -8, -6, 7, 6, -2, 6, 27, 0, -4, 19, 15, 6, -10, 9, 3, 4, -11, 8, -18, -20, -21, -7, 5, -20, -14, -13, -10, 3, 15, -16, -11, -19, -2, 4, 9, -6, -7, 9, 12, 9, 28, 24, 13, -22, -3, 5, -2, 22, -7, -22, -28, -7, -7, -27, 6, -5, -16, -32, 10, -35, -19, -23, 5, 16, -13, -16, -2, -25, 5, -20, 5, -5, -9, -10, -2, 0, 0, -4, -9, 7, -8, 16, -10, 6, -16, 26, 27, 18, 12, 3, -25, 19, -17]
7127a7J4L9j8j4J3j3j8RK0k4k2K0J4mj1K4m0J6k5qK7K3m3O4l6J0nJ2QK4j3J1l7
7160@j2K5Nj6%L1k7Noj8N1l7nK6m6PK7Qk1j6J4j5J7QJ8mj9j4J7j8J4KLj6K6J3
7196B7j9l2M3Mk0jl4L9j8OpRj4K2M0n5K1Jk2J7nm3K3Pj4L5k4K1k8qM6l6rLNLJ6
7233amK7k1jJ1k1J0J2jj1K2qJ1qm5K9K5k3Qj6j4K9Oj0k3K5pRj0k8K2kLm7L9PJ0
7270Dj6oL1k3j2qM9k4nJ0lJj4K8mLJ7j6K4o1J4j3J6K6k2K0Mk4J4k1jRj7J8j4L0
7306A4l0l9M9L4m6K0%Lj1jj7L0j0k3J7M0j8Kk5J6k6J5OJ5J%l0K1j5L0l2J6lk2
7340a9PpJL5l4J3J4m5M0m3L3lj1J5jPJ6j7J6m4M4j7pqK9lmK3k5K2qqJ0J6m9J6
7376Dk8K6J0rJ4llmj5QrL8o3L5k6K8j6Jl8M6Jk1L0j3J3J6j5j2J9k3J5j2J4L2m2
$$ y = [-17, -3, 36, 18, 4, 17, 4, -14, -5, 15, -9, -31, -11, 3, -1, -12, 12, -28, -12, -37, -45, -18, 5, -38, 26, -10, 0, -5, 7, 15, 39, 26, 37, 0, -12, 13, 18, 2, 2, 33, 6, 11, 5, -13, 38, 1, -4, 22, -24, -17, 10, 18, -3, -19, -5, -20, -3, 5, 23, 19, 0, -14, 3, -15, -1, 1, 4, -12, 14, 27, 8, -24, 19, 23, 3, 2, -32, 7, -11, -5, -12, -3, -17, 5, 45, -10, 11, 12, -10, 7, 2, -41, -18, -11, -25, 10, -14, 7, -21, -29, 17, -19, -28, -25, -20, -17, -1, -5, 22, 1, 0, 11, -10, 0, 12, 11, 0, 22, 14, 25, 17, -28, 1, 26, 3, 11, -5, -19, 10, 16, 6, -17, 8, 1, 10, 0, -28, -6, -8, -5, -52, -13, -6, 4, -12, -18, 13, -10, -22, -30, 19, -5, -10, 0, -3, -2, -16, 12, 8, 11, 28, 12, 36, -25, -11, -24, -8, 18, -4, 16, 20, -4, 10, -11, -12, -3, -20, -2, -16, 14, -16, -55, -6, 28, -18, 2, 2, 5, -6, -7, -24, 6, -4, -27, -10, 30, 12, 14, -11, 5, -21, -6, 0, 15, 16, 16, -14, 7, -8, 22, -10, 6, 3, -19, -12, -19, -18, 17, -17, -4, 10, -35, 5, -38, -5, -8, -19, -4, -5, 2, 18, 1, 17, -27, 17, 0, -7, -15, 14, 11, 7, 30, 5, 27, 19, 11, 21, 37, -12, 4, -24, 2, 12, 3, 17, 14, 11, 7, -8, 0, -9, 29, -34, 1, -25, 3, -13, -12, -50, -4, -3, -24, 6, -7, 6, 22, 7, -5, 14, -9, 6, -6, 8, 40, -2]
7411bK5j2mrJ0J8m0jJ3QMnj4NJ4pj1jM8n9L6ll1M3l0K0k4K5k7Ml2N2pk0J6kkL
7449ANj5O%lNJKJ2%QJ0m4K0K3k3k9K9k0j1J7j5K3nJ7k9J0j6OMjnjJ7l9K8K9rr
7488akK1j6J0jLLrMJ9k8L7l7k1N6k4j8Qj6NKRjj6L2k4J1n3L8kJ7J6n4J3j2K6J6
7525A1Rl5K3j2LK6k3OJ0Kk5J1Jk2L2rj6Qk5L3j2NMlLK2k3j5l0N1k0nj3N0l4rj6
7562c7J4K4Kk9L5j3nJ2J5pk4M5j0j0j7M3l9J0lLK2n7RM6k6kk0M4j8l9J0M3l2L9
7596B8l0K5j6j7J1pj8L4k5K7jj4k3K2nK7Kj2rj3L8j7J8m0J8J6j3rK7l6JK6l0L0
7630A5k5M0j2j0kPk5lj2J0K7j4J3j1Qj6K0qRj8j0J4L2k4rRmK1j3Mj4MK4l0J0k
7666Ek7J1M0j0ml4M1l3J3k0L6%Ql2MQk1RRk0J5rK6m0KK5MKj6M5nl0jJ6Oj3k1J2
$$ y = [-2, 23, 11, 7, -2, 8, 26, -14, -15, -2, 6, 10, 5, -9, -4, 10, 3, -8, -9, 39, -20, 16, 13, -18, 25, -5, 15, -9, 16, -11, -7, -39, 13, 6, -14, 2, 0, -2, 1, 6, -9, -3, -3, -6, -1, 0, 2, 14, 14, 22, 32, -12, 8, 31, 8, -21, 8, -12, -23, -6, -21, 2, -3, 14, -15, -5, -21, -15, -11, -12, -17, -18, -1, -40, -12, 17, 8, -1, -3, 18, 2, 12, 11, 14, 17, 8, 12, 31, 3, 40, 3, -18, 38, 14, -4, 4, -12, -7, -5, 4, 3, -13, 19, -5, 6, -47, -9, -11, 6, 22, -32, -19, -31, -5, 11, 20, -15, 8, -4, -1, 25, 2, 8, 18, 20, -5, 6, 7, -15, 17, 8, -8, 0, -25, 8, -4, 1, 5, 2, 5, 27, 4, -11, -41, 10, -10, -15, -28, 22, -12, -21, -37, -23, 1, 3, -26, 9, -4, -9, 3, 18, 11, -13, 32, 22, 12, -5, 38, -1, 9, 6, 9, 31, -26, -17, 29, 3, 1, -19, 25, 7, -32, -22, 21, -11, 28, -2, 23, 7, -10, 1, -6, -24, 10, -15, 12, 11, -3, -26, -4, -9, 18, 20, 8, -1, -14, 24, 7, 25, -15, 3, 19, 6, -3, 24, -12, -11, 15, -15, 15, -10, 30, 18, 8, 6, 13, -12, -15, -27, -17, 10, -4, 9, -2, 6, -10, 10, 2, 11, -7, -17, -3, 29, 5, -4, 5, 1, 22, 9, 13, -1, 3, 27, -3, 7, 5, -22, -11, 29, 19, 15, -19, 22, -11, 2, -18, 18, 18, 26, -6, -2, 6, -15, -6, 3, -17, -2, -11, 15, -25, -23, 2, 6, 8, -8, 37, 32, 2, 1, 17, 23, 10, -11, 1]
7704AJ9mj2Lk9L7k4J2Mj1NK7k9nLj0NJ7Ql1K1k2r%M2j2K0k3Ljk0J7K8k0%J5l5
7741a0M4k5pJ1Jj1J0Kkk2J7Nk1%K6l6K9j9j1lJ3j3K0onJ5j9oMK9J5l0l2J5J0J6
7777DRjKJm6K3J3k2M2lj3L3n0J2rJ4Nk1QqJLj9K1k9K9j0lmj5K2K3k9K6Lj1rj1
7815a9J0J7m3N0J7n3L5mPjmL1l5J1j9LK4j6mj2K9m2J7nNOj9J1j1lL6J3k7j3J1
7850Ck0J7k0J3NKPj1J2k1M3l1J2j1L0k2Nk3J3J5k5K0k7L1j3k8J8NJK9nn4M3kq
7885Cj1J7Oj7OJ4k9QJ6l2j8L7mPJ9l2K5l2oJ0M0oMoj4J1j6ql6L2K5j4K9j8Lm5
7921c2M5k0k6J8J6j0j8K1J2k1pNmJ1LOJ5k9jOJ9j9J0j0pM4pl5J9k8J4j1J8NQN
7957A5k6J4j3j3M2j4J9j5k8L2mj1l4K1QM2l9M0m9K2qPk4J8K6k0kk0L9l1QJ0J5
$$ y = [1, 20, 16, 4, 7, -22, 15, -9, 3, 7, -4, 1, 28, -1, -6, -3, -13, -8, 9, 17, -14, 7, -15, -24, -24, 18, 6, 26, 3, 6, 5, -15, 2, 30, 10, 10, 25, -10, 34, 9, 2, 13, 14, 3, 13, 15, 13, -9, 8, 13, -8, -8, 18, -18, 11, -8, -19, -22, -9, -22, -2, -8, -13, 2, -17, -23, -19, 10, 25, -5, -37, -22, -12, 4, 13, 12, 14, 15, -31, -8, 5, -17, 25, 22, 9, 42, -8, 4, -5, 9, 14, -7, 1, -7, -6, -3, -22, -1, -30, -1, -11, -14, -18, -33, -11, 12, -17, 9, 12, 1, -8, -19, -9, 8, -35, 15, 32, -21, 14, 10, 17, 16, 12, 43, 8, 19, 0, 3, 27, 11, 7, -5, 24, -18, -1, -6, -1, 5, -14, -3, -14, -17, 19, 32, 5, -8, 3, -17, 0, -20, -7, -2, 0, 7, -4, 8, -13, 30, -1, 11, 0, 30, 8, 13, -10, 3, 18, -7, 13, -14, 17, 4, -24, -6, -1, 0, 29, 24, -30, 13, 11, 3, -8, 9, 15, -2, 4, 18, -11, -3, 13, -19, -37, 0, -4, 3, 22, -10, 15, -17, -23, -13, 27, 21, 25, 19, 5, 16, 0, -8, -44, -12, 13, -1, 28, 10, 13, -32, 13, -7, -33, -15, 1, -9, -27, -6, 6, -15, -22, -17, -21, -10, -7, -1, 14, -15, -16, -10, 9, -10, 0, -10, -17, 27, 20, -15, 4, -24, -10, -21, -3, 2, 10, 15, -11, 3, -10, -23, 19, 5, 24, 9, -19, 13, 9, -2, -36, -15, -7, 35, -4, 36, -13, 9, 1, 8, -16, 2, 28, 8, 6, -14, 25, -6, 2, 12, 27]
7990B7l5j9K6LLk2J0L2l8Qj9L3k0RJ3J9l9nM1l5kpj1k8O5m4K6jnJ3kONj4rL%j6
8028b9K3mOK1Lj2J0J4l6L0k5mNJ4j6K4l1J6J4l2RkNj1PK1m1Pl2M4k0Nlk5K7jK5
8065FJ0j8J4mJ8m2L0oj5K1KqJ7k1j0L3j1MJ4k3%Pk5Lj0oL4k1QK6j5J4m1J4j1L
8101iJ5n0N8Km7j6M3MK2j5lJ7nkj3j1J9KmJ0lk0K7qNm7M3k2qJ6Mj0lJ5l7M4j9
8138fLK2j6k5L4kk7K1rJ4Lk7MJ5L7m7J7ojJ4Jpk5K0oJ2Mnj9KRJ6j0K9m9K6l5J7
8176bK3j1lj8J5J9l5L2k3kmPJ1m5N7
$$ y = [27, -8, -27, -1, 2, 5, -17, -7, 25, -13, -5, -24, 9, -11, -2, 11, 30, -9, -14, 27, -8, -10, -17, -28, -56, 9, -35, -9, -10, -15, -2, -4, 2, 7, -7, -16, -13, -13, -29, -6, -10, -4, 17, 20, 8, 18, 32, -4, 26, 1, -3, 2, 16, 0, 24, -7, 9, 23, -9, 0, -2, 3, -8, -1, 20, -21, -14, -46, -2, -22, -17, -20, -45, -18, -19, 6, 16, -2, 12, 8, 26, -16, 14, 8, -7, 14, 16, 8, 25, 4, -6, 27, 16, 20, 34, 11, 11, 18, -7, -4, -14, -20, 14, -7, 1, 27, 12, 26, -15, -1, -12, -9, 6, -44, 14, 16, -31, -47, -4, 0, 22, 7, 4, 21, 16, 14, 1, -10, 9, 11, 7, 17, 14, -6, 21, 13, 18, -29, 14, -8, -16, 0, 4, -6, -9, 6, -31, 13, -6, -3, 19, 3, -22, 12, 10, -17, 4, -5, 9, 12, -15, -11, 4, 41, -6, 11, 5, 4, 18, 19, 12, -13, 7, 1, 13, 17, 12, -7, -5, 4, 20, 10, 39, -10, 16, -19, -2, 21, 10, 7, -11, 4, 23, -12, 20, -3, -5, -9, -2, 9, -36, 21]
8191B1
$$ Imaginary data points
##PAGE= N=2
##DATA TABLE= (X++(I..I)), XYDATA
0@%%%%%%%%%%%%%%%%%%%%%%Qj6J6j6J6j6J6k3L1l2L2l9M7m8N5o3O8p6Q7r5J04
43E6j18J29j39J52j70J90k09K28k51K78l07L40l76M16m67N26n94O78p82R15j093
64e98J341j712K322l499O516k7804n6629Q1472M9271l9781l6466J1907K6050l623
78H767j4493J0368p129j3034K1546J7628j5426k9653o954M4450J9015m6431j7209
91b8555K8729J1852l327j0541o463O807l79O523Q628k3548q044K9679P489k0291
105a441j2503Q221J4519q245m881J4122j2164j4076K0828Q291j3648p722J517
118g182J6897L933k2996j243J6483j989o337J688N059m668j2913J5076J8935k4406
132c663j6602K2239J2284j0599j3427J809J5699l478j0802Q996J16r071P795P147
$$ y = [0, 0, 0, 0, 0, 0, 0, 0, 0, 0, 0, 0, 0, 0, 0, 0, 0, 0, 0, 0, 0, 0, 0, 8, -8, 8, -8, 8, -8, 8, -15, 16, -16, 16, -23, 24, -24, 31, -32, 36, -40, 47, -48, 56, -62, 67, -72, 80, -90, 100, -109, 119, -132, 146, -161, 179, -197, 219, -248, 278, -316, 362, -420, 495, -598, 743, -969, 1353, -2146, 4370, -23434, -80063, 1409, 50680, 10899, -25567, -13660, 12390, 8767, -5726, 4642, -2487, -15521, 6025, 23653, 8227, -21426, -28380, 16070, 35085, -11346, -28555, 174, 12026, 8699, -1842, -8305, -1498, -1877, 4646, 13274, -10274, -18318, 11361, 18850, -1441, -13944, -5723, 8796, 551, -4330, 9792, -2372, -16448, 4380, 12671, -977, -8699, -7182, 9715, 13648, -9348, -10591, 5892, 3903, -2434, -746, 4313, -355, -13268, 1808, 20743, -3663, -20265, 1974, 14258, 3659, -9768, -7959, 7740, 4262, -6540, 2456, 2572, -6499, 1296, 8443]
146H443n224j0320l239J6428O729j8109m812J1279M033k679o756J027O852n304
160a652M91Q356r502n711J1894J755p683j970M466M621o372l167R579k870r590
175g355N587N930j563m303m066O966M370q845R87O555m637k249L941K351k993
190F76q571N153J3648q431j2511P245P825p09m717m111L476J521n43M666n025
205d08p460Q371O146m739n435l027Q137P681r623o268M908K667K355j573m557
220b825J314M91K679M149r294m582J1617K719o910l797O83P159N43o668K818Q93
236I89l311M830k99m639J445l64K433K249p341O05O926k260j875o98NM451l569
253d23k191O870m156m412O551o66l000J087o33L099j322m648N298K49m958M126
$$ y = [8443, 3219, -7101, -10340, 6088, 12817, -5292, -10104, 1175, 5208, 2529, -4227, -3200, 3652, -1652, -1161, 7195, -2307, -8018, 3876, 5631, -2052, -4022, 444, 5065, -1307, -4474, 5105, 2235, -7355, -1768, 4162, 2599, -1704, -5770, 1196, 5566, -3279, -2292, 4263, -374, -2623, 1318, 3669, 676, -7895, -2742, 10906, 2475, -10036, -2791, 5034, 4325, -392, -4503, -1027, 494, -49, 4617, -408, -7868, 503, 6649, 1910, -3525, -6552, 1585, 9266, -357, -6625, -1717, 950, 3305, 1732, -2825, -1511, -1020, 1659, 5808, -3486, -8068, 3549, 6268, -642, -4439, -3756, 3403, 3946, -2722, 96, 989, -2322, 2508, 2209, -2430, -985, -1349, 1084, 3333, -4008, -3403, 3523, 1263, -612, -1310, -1305, 3146, -423, -2614, 4256, 100, -4312, 2239, 1573, -1427, -340, -973, 2126, 804, -3844, 1454, 1703, -3255, 871]
269H71O2k147K292k883J660L934n781L08M243k873N12m56j296M083l237k046O034
286C280l766k776N876j739k146O97r51L790j569m647N514K21l693L660j938j294
302a481L943l095J16K298m260K214K521l849J242l58l47M330m381k038O099k704
318B50j768L269k633N88J424k020K539j809k716N443j531l619L356j435k2K641
334A957l956Q94L066k823J277K69k114K975j255j434L353l247n88M386l536j160
350a936L062j461P29k16k007L095r13j941L349k136j466L675j961o63J924k282
366a148J533J380l037J177L45r08K364k244j376L371j954m67K874k833n02K516
382A091j047L53p20j190K890p45j627K183j814l60L377k211j557J597j004J123
$$ y = [871, 933, -1214, 1078, -1805, -145, 3789, -1992, -1684, 2559, -314, 198, -258, -1554, 2529, -708, -2754, 3280, -486, -3262, 2614, 875, -1271, -574, -1525, 2265, 696, -3951, 1563, 1784, -1909, 1751, -187, -1481, 2462, -633, -517, 1781, -2479, -265, 2256, -1593, -351, -709, -1056, 3274, -1107, -3145, 2954, 250, -1518, 1751, -882, -294, 1130, -890, 1649, -160, -2876, 2567, 1036, -2583, 773, -662, -684, 1957, -1999, -1105, 1961, -862, 415, 684, -1430, 1545, 290, -1144, 2209, -1038, -1626, 2760, -776, -1936, 1126, -335, 394, 178, -1829, 1266, 353, -1588, 1761, -375, -1841, 1834, -127, -790, 1134, -1148, 385, 1765, -1272, -95, 250, -658, 1706, -538, -1914, 1457, -497, -964, 1910, -923, -1425, 1091, 44, 397, -323, -1513, 1377, 632, -995, 1188, -626, -986, 2391, 180, -1377, 220, -784, 339]
398C39R29k326M07J48Q9K416k081j989K749j52p8J017l213K06L429p59j060j237
416a166o44L318K4k516P73j016K74L409j859k564J243O18J699p7l493O79K212
433I14L10N85l027j614M191J38j881R27j800k57K998m80j100j186p99L749R24
450B592l462n53j19J933L374m013l132L743J208l61p61k724J534J863j153J091
466A060j266k267K802Q37p15J83l222J047M925j627k912n73N70L787j068l927
482b366K393N17j291K626j511k385J182K5K401J045m923k18L395J068J88m561
498b415j469O686K32l869M59j051R48K484k246j15J40j671L395P93l491j93p28
515b111K165M428m219l894L164J688J057j824l997L225K646j864O48k134j663
$$ y = [339, 1268, -1058, -651, -503, -414, 2002, -79, -2068, 681, 529, 451, 1468, -1745, -1539, 1890, 1131, 71, -1166, -1810, 1508, 1532, -984, -211, -1227, -953, 2456, 597, -1967, -724, -106, 1593, 1516, -1977, -1298, 914, 1224, 1809, -1218, -2832, 1359, 1497, -384, 543, -1257, -1514, 1484, 1004, -96, -1282, -2081, 1668, 2592, -870, -1423, -1542, 391, 3765, -248, -3380, 363, 1571, 1210, 449, -2275, -741, 1122, -31, 1060, -206, -2473, 329, 1166, 451, 634, -2588, -1541, 3384, 1757, -1155, -1728, -1158, 2629, 1561, -2366, 27, 544, -747, 1879, 368, -2017, -835, -810, 1591, 2636, -2287, -2505, 890, 1958, 2146, -2415, -3884, 2802, 3034, -835, -376, -1427, -479, 2005, -241, -356, -216, -1887, 1508, 2301, -1190, -1383, -2111, 54, 4482, 263, -3631, -467, 1221, 2278, 454, -3543, -318, 2328, 464, 1112, -1022, -2685]
530b685L755P6q52K69l429J731M629k245k813j181J720N261k646m936L006J254
546I14n60J112k544j14J805j240K188K86m538O93K596J070L65m766n11O193m20
563B529l236n55q24L168J621l289J91K9p98K988p42k576P56n26K227K418m608
580a227k018L012J568Q81k863k639M254J518k370l22j545Q61L116j709q34N50
596B33j989J493K246j611j310j181J743L883l021l551K633J419J61m91k604J553
612c94K243j742j10j74r75J557J01l05O01k247K02K837j221j095M60n31J548L58
630A113j887O25P0l33J604r40j056J272p16L0J212j403n24Q99J73R62j123j662
648a684J763O93p74L37j154L07K130j347r58R44q42L46J243n73m89q09J77K046
$$ y = [-2685, 1070, 1146, 294, 563, -2866, -1135, 3494, 1249, -1564, -2745, -1025, 4236, 1590, -3346, -340, 914, 354, 1466, -1078, -1192, 613, -627, 1561, 1847, -2691, -1998, 598, 1668, 2033, -2733, -3244, 2949, 2529, -707, -1262, -2086, 1082, 2703, -586, -395, -366, -1164, 1824, 1082, -1494, -738, -1264, 963, 3381, -1227, -3245, -233, 1335, 2216, -647, -3286, 968, 2486, 116, -206, -1751, -890, 2226, 517, -317, 233, -1756, -263, 1983, 372, -938, -2119, -376, 3507, 486, -3065, -432, 987, 1148, 657, -1947, -394, 1849, 107, -3, -177, -1152, 405, 506, 201, 802, -1445, -1243, 1594, 373, -722, -262, -793, 755, 1113, -774, -149, -79, -412, 1192, 252, -804, 468, -248, -218, 994, -409, -933, -34, 139, 1101, -22, -1684, 79, 772, -2, 335, -819, -512, 1618, 271, -687, 257, -585, -239, 1004, 431, -58, -867, -690, 1356]
666A356j203j750J613L44o3M15j639J85J530q13L03Q5j176J162M20r74M19r38
684g24m0K052r28j086R05n59L15N54j106O41J41o99J523p33j390J692k66p68J196
703G20r46k48J156q07K29P9j182J208J67q79J217j011p13K040r72q21J279q20
721c04M53Q53j469N12K03r76J474n04j234J736o63o71J216j369J28J470j106M51
739B00N0j259J705j40j442J488o59n04J823j469n94J390r52M62L28j454J391J67
757E31j357J314o84o39J948j242n31J489j202L64Q22j594Q82M10j088J334p50
774Gj030J916r10o77J369j278K85J168j504O52L62j082J395n31j024J819q13o63
792e39J469j441j3J439j389M18M53j155J123k35r83J543p87n41J578j329j58J441
$$ y = [1356, 153, -1597, 16, 360, 297, 712, -927, -742, 788, -25, 278, 363, -813, 349, 769, -205, 214, -724, -764, 1288, 360, -726, 179, -380, -65, 489, -617, 24, 165, -534, 989, 256, -1134, 558, 292, -476, 720, -226, -474, 682, -125, 104, 183, -999, 209, 376, -503, 714, -297, -1010, 1030, 58, -763, 516, -304, 149, 1002, -467, 45, 248, -728, 746, 242, -992, 744, 81, -590, 626, -743, -615, 855, -251, 200, 250, -1009, 696, 556, -886, 602, -57, -561, 1262, -207, -801, 589, -363, 99, 427, -1027, 364, 531, -826, 488, -196, -835, 1113, -129, -660, 829, -373, -9, 813, -781, 101, 511, -577, 757, 7, -1023, 893, -17, -694, 675, -603, -318, 850, -654, -2, 360, -722, 673, 142, -882, 937, 124, -539, 930, -511, -524, 915, -474, -56, 397, -758, 365, 130, -853, 690, -97, -638, 940, -389, -547, 894]
810H94j287L64P50j358Q96J20j026J198o17n97J450j086l22J322j151K11Q32j188
828e95P13K52r46J147m53q09J376p02l85J154j151P4J085j132K13M17p98Q75j80
847A55p42J009o60k71J355j100k43J165q51K32M53j006O81J79p47Q43m44o46J108
866D70m68l00O31r82M11J030j079M8M05n04Q02j69p65P71l05j61R55j063m19J162
886D70l68j48J04o39O45L02p17O09k50n89R88j99l91M94p71L96J015j174l21P90
906B46k36K72k08o15P72l40l25J100p42p60J065n7j1M4j042Q48Q63j045Q6K6l12
927c71J039m72p69Q30m89m4R76q78k10N38n39O85J13j087P09J39k08R71j260p42
947a069J787j35o72O1o03R21L47j352O79K19q78J074p1o02N10r13N58J537j756
$$ y = [894, -393, -29, 721, -637, 259, 379, -647, 551, -66, -663, 787, -299, -621, 701, -450, -239, 593, -595, 118, 370, -576, 571, 118, -691, 685, -17, -402, 752, -399, -325, 760, -372, -159, 258, -540, 335, 155, -587, 422, -238, -509, 846, -254, -497, 668, -183, 49, 502, -504, 177, 356, -391, 452, 8, -638, 470, 2, -298, 333, -649, -238, 792, -287, -239, 166, -338, 464, 295, -470, 301, -4, -165, 790, -273, -692, 470, 102, -46, 58, -581, 64, 366, -351, 258, 8, -581, 407, 208, -183, 311, -460, -64, 951, -223, -544, 246, 10, 282, 74, -541, 231, -109, -434, 666, -76, -836, 229, 172, 161, 205, -837, 11, 874, -171, -85, -59, -371, 668, 196, -573, 257, -232, -276, 700, -178, -388, 150, -389, 296, 409, -678, 31, 170, -38, 933, -327, -1069, 718, 583, -89, -28, -631, 290, 637, -715, -36, 183, -695, 379, 308, -294, 216, -697, -139, 1398, -358]
966c58o55J414J4J76p46q35J602k64j102J322m26o95Q65n55L67K96j584J080J284
985A200j256l7l17j41J652r06j134J274l59J14O47j432L64Q16r19P02j3r16R98
1004C37m44k12J307j537n58J945k79m60k50o94J603l6j731J071L29p34Q06n91
1022a28j06O41j375P94J535j755m08R14J30N11j267n66K061n36j009J046o77q7
1040b82P24q80O09K15j310J168L88j097M46l98P5J331j036m23Q40p22N94L86j358
1059g30P32M92o63N94n82m21J069p30q8J081j134k65J081k27m3n92k96J638l51
1078E65j318R00P5k85L53p59M41N78j200N86R44j178k83L95L13M80j027j68J354
1097G66o14n43N91m30K67M66o61L21m4p14Q94M0q24N20o9l4M57n98p1M47o02N04
$$ y = [-358, -1013, 401, 415, 591, -155, -990, 612, 348, -754, 568, 142, -553, 312, -243, 124, 420, -1164, -84, 1200, -56, -93, -410, -551, 1101, 195, -939, 335, -24, 90, 737, -695, -331, 485, -434, 268, 255, -661, 337, -107, -319, 988, -549, -1107, 838, 559, 99, -151, -845, 758, 722, -1009, 62, 391, -343, 463, -128, -234, 407, -968, -174, 1361, -394, -802, 112, 242, 753, -514, -1080, 981, 445, -564, 482, -195, -282, 442, -438, 171, 386, -924, 244, 632, -465, -19, -417, -342, 989, -47, -470, 370, -352, 242, 628, -730, 2, 494, -169, 425, -157, -578, 491, -239, -327, 754, -380, -645, 436, 209, 166, -426, -722, 916, 565, -753, 147, 222, -63, 290, -469, -28, 550, -650, -64, 880, -298, -581, -186, 127, 607, -420, -588, 766, 152, -391, 200, -230, 37, 503, -158, 163, 119, -595, 299, 339, -485, 35, -34, -68, 389, -209, -280, 167, -435, 69]
1119F9N04q74J53L49k19K57n77m8J086o56m97Q58l67m81M59o3J79j74l74Q37o1
1140C60r27M22K92j54K62m37J58N46q31J13P36p99j01N50q3J82m38l18Q65m63
1160f5o08R65j06l72L82k55J94o4o84Q67L25r72M61K21m67L58m89o9Q76p21RP74
1182E60p79r9M21l00M25j89l37Q98n05o51R69l22m62O23l82K51J52q17P34K05
1202C95j113O42L34l96M33n18K3P22r80J77R59q51Q1L49m65N28m20m26J135n95
1222A4o77J102l41l70M47m90M29J58q58R13Q6r26P28j07l52O51o59J00P90j064
1242d26K10P37q55K49K01m02O29m18l93J010o82l84J027n10j15M04o01N82k6q15
1262e78R31n3q38Q23k46l27O73p56J92O97r48L14N56o98L34Ml27P27n99k66J026
$$ y = [69, 573, -301, -148, 201, -18, 239, -338, -386, 700, 44, -453, 405, 38, -443, 16, -47, 132, -42, -416, 421, 360, -567, -145, 147, -7, 255, -182, -24, 522, -309, -196, 540, -259, -360, 190, 107, 289, -149, -467, 398, -65, -673, 292, 186, -186, 196, -59, 135, 71, -613, 254, 579, -393, 68, 289, -178, 180, -309, -378, 498, -223, -214, 560, -219, -318, 103, -197, 228, 39, -298, 600, 95, -556, 413, 91, -371, 252, -130, 121, 273, -544, 190, 395, -718, -76, 258, -138, 295, -223, -200, 522, -458, -281, 678, -173, -92, 257, -208, 320, -100, -526, 609, 14, -663, 439, 98, -272, 175, -315, 114, 272, -586, 327, 413, -513, 215, 108, -244, 407, -252, -152, 638, -426, -216, 521, -334, -85, 116, -286, 343, -75, -468, 542, -140, -524, 503, -7, -122, 282, -319, 263, 237, -578, 353, 300, -538, 285, 39, -288, 385, -371, -179, 518, -430, -116, 440, -258, 76, 80, -247, 480, -119, -385, 641]
1283F41p73k19P41n49Q3K34n78O87j02p49Q15n2n58N95l01RM53p04L23M74p97
1304c27L28L26n59L79j60k25O34n46k42Q23n32j67N01l93J25K04m06M54j26m12
1324c21O34k21l39M81l21NL85n64J44L94n93L09K20m69L04m2j31M43m67j13O63
1345D01m34j03L62k82J04R7l74L14m0k95M55j62k85L94k43o5M05m22K7L46k76
1366g6J19R7l35K95K4k67L71k61k07M83k90j52L53l10Q0K77m04J68R5k75L67k3
1388A29l48L61j38j34M57m18q8M26k86j6J49l21K78O2l30L38j36l04N12j67j62
1409a36L45l70R2L91n01P4K79k95L39j50m02N43j53l28N13l34j18L95l92K01K64
1430B57o09L63K76m73L45j94j90O54l78l30N47l97L7L69n09K36J28m57M93n5m82
$$ y = [641, -132, -351, 390, -159, -76, 158, -420, 267, 165, -584, 231, 179, -379, 216, -85, -76, 377, -327, -4, 470, -327, 1, 327, -232, 147, -13, -238, 396, -150, -392, 431, -101, -268, 233, -160, -35, 169, -237, 217, 91, -321, 313, 92, -247, 234, -87, -82, 303, -261, -117, 277, -316, -7, 213, -256, 48, 6, -125, 318, -149, -262, 401, -33, -136, 226, -56, 48, 145, -229, 85, 45, -250, 205, 43, -242, 152, -91, -156, 249, -173, -146, 200, -76, 43, 140, -195, 100, 124, -143, 228, -33, -240, 243, -47, -199, 154, -156, -76, 201, -203, -35, 60, -215, 152, 129, -219, 142, 4, -130, 327, -91, -179, 247, -39, -55, 94, -227, 51, 113, -217, 121, -15, -319, 193, 26, -136, 209, -161, -69, 322, -179, -105, 174, -121, 218, 68, -334, 209, 56, -272, 241, -93, -211, 184, -208, -7, 257, -352, 11, 287, -186, 159, -35, -225, 429, 51, -279, 268, -129, -92, 277, -232, 4, 132, -325, 168, 113, -369]
1451c69N81k18j71N19n37n8O14m07O4J06l96N16p4n48O10j78l70N06k75rL97o66
1473c63K59N43o52J43J40j55N36m93m23Q22k82l01M98l86O4K83o05L97J89n98
1493c84M44P8l24M16m47p4P38n32j56M81l63K63R3n63M86J1m63M85j66j70L66
1514B19m84J21N25o86O7M57k77K40k40l05O87j84m56N20j98n4K84m74J94L14n71
1535c01K68K18l34J86j96j9N00m76j69O84l41p2K66l66J55J51l41L59p5l11L52
1556A38j58j63K72k96J16M15m38N8J83l48L11K8l21L28rj29J64k38k8L06l46J4
1578a41L75k95J7J01j85K44k47j82N86j14l62L30p4j06J26k45J82J57l06J85J76
1599B22l31N6o1N5K45l05n1M64k68k22K89k08Q5J58k15K51k3l25K03J8k06K45
$$ y = [-369, 212, -6, -177, 342, -195, -253, 361, -46, 18, 124, -272, 244, 170, -378, 232, 54, -316, 190, -85, -94, 303, -363, -104, 439, -213, -70, 70, -85, 451, -42, -465, 357, 75, -226, 272, -114, -50, 233, -372, 25, 214, -384, 60, 138, -186, 230, -217, -291, 447, -85, -241, 240, -123, 140, 233, -330, 156, 167, -296, 189, 23, -147, 219, -265, -144, 381, -305, -238, 219, -58, 182, -58, -363, 324, 140, -316, 204, 6, -48, 236, -238, -44, 270, -301, -33, 185, -149, 37, -159, -178, 322, -154, -323, 361, 20, -52, 214, -152, 3, 154, -187, 172, 97, -214, 138, -20, -183, 89, -207, -91, 324, -114, -56, 127, -221, 90, 118, -203, 125, 116, -13, 151, -87, -115, 191, -155, -141, 234, -61, -44, 57, -128, 116, -131, -313, 273, 159, -203, 127, 53, -53, 73, -172, 10, 167, -139, 46, 222, -109, -53, -114, -59, 186, -119, -170, 294, 26, -196, 93, -115, -30, 128, -87, 164, 141, -184, 19, 37, -169, 76]
1621G6r8lK57l41pK47l29J52J77k54J64P8k24K14j57j67M67j62j77K74j80j10
1643a03J83k47K44l2k53L41Lm10L31n1j60L11k48R3K71m27N7K88k96J07P3j37
1665f2L21l24j96N06l11k19M28k08lJ89k86K54O6m32M30nl10L90j49j40K69l66
1687a58N4L40m51K16K24m74K62J0k53L94k36j07M98l44j63M27l55P1J86k92L27
1708A76q5l79M42j31k94M22j88o7K95l81J57K90n33K63K16m04L66j37j74M05l74
1729a15o9M66l78m0L16l34J60N3k90L76j10l44N29j66k64L82k62P3K34m33K48
1750C2K54m92K39Q9l21L17j80m7L47m11ML65l53Q6J97k36J90Rk43L77k12k58M93
1773B46k17j06K67k47M8J24l50K58J40l56K50Qj75K00j94RL05l54M9L49l30KJ71
$$ y = [76, -22, -25, 232, -109, -116, 131, -198, -46, 131, -123, 41, 119, -105, 109, -48, -215, 252, 90, -87, 187, 7, -103, 80, -167, 77, 45, -208, 133, 136, -274, 57, 6, -154, 157, -91, 2, 273, -154, -97, 191, -105, 2, 75, -62, 259, -65, -261, 245, -66, -285, 143, -65, -68, 121, -165, 89, 155, -277, 153, 148, -162, 228, 79, -61, 208, -158, -104, 236, -215, 1, 225, -249, 13, 23, -230, 164, -72, -179, 319, -25, -188, 239, -116, -45, 141, -151, 176, 91, -288, 154, 23, -271, 151, -37, -104, 191, -190, -33, 257, -276, -13, 203, -201, 165, 28, -146, 259, -115, -184, 282, -96, -136, 180, -154, 6, 59, -231, 145, 35, -309, 220, 54, -210, 172, -90, -17, 217, -216, 32, 286, -206, 33, 122, -199, 118, -62, -109, 238, -173, -169, 196, -157, -71, 126, -110, 80, 89, -154, 223, 11, -247, 246, 29, -77, 190, -57, -9, 115, -235, 23, 163, -193, 57, 65, -110, 90, -104, -95, 210, -144, -95, 254, -76, -74, 97]
1796I7k27K10p4j49L44k15k04L22j08r9K00k59J86J06l10K36P8l07K25pj11J80
1818A14j54j5K20k63l0K84j74m6J32j84J28j3j14K41r7j64K66j19o7J64j28N1
1840C2R1k75J56J45k87J62N1j79J37p6k3K23k32p2L26j74j13J86p7R3m3j70K23
1863A04m9k18K84o7j93K03j16oJ61k48O8K28j95L4Q9j82J76n2j37K66j80r9L27
1886A98k34p6K23j97J02P1k20K34l7l02L22qk25K33j05l4K12k91J16K17l19J25
1908ER2k50K92r5k39L54j96j48L36k15l4K56k90J31J51l05K67o5j87L44k05j65
1930a66L50k41j0K73l48J27J67l61K58M0k97K89p5j10K81k84J4L68l61LK05k41
1952a19K31l2l11L86p7l34L83j52q1K35k64J15K35l92J48J82k56K36j32j89M62
$$ y = [97, -130, 80, 6, -143, 201, -14, -218, 104, -4, -103, 97, -162, 24, 130, -180, 56, 134, -173, 52, 45, -66, 114, -40, -55, 165, -98, -128, 156, -18, -64, 68, -116, 12, -1, -115, 126, 29, -135, 131, 12, -55, 109, -19, 32, 123, -152, 4, 149, -138, 24, 75, -104, 33, -43, -66, 157, -75, -147, 179, 5, -108, 78, 1, 94, 51, -119, 104, 55, -163, 121, 54, -139, 64, -52, -58, 103, -145, -77, 151, -44, -10, 79, -103, 73, 21, -116, 150, -30, -129, 198, -36, -112, 111, -86, 16, 87, -133, 101, 64, -238, 84, 76, -149, 84, -21, -55, 157, -134, -18, 199, -120, 5, 97, -153, 139, 44, -195, 159, -37, -185, 151, -64, -98, 158, -132, -1, 150, -155, 112, 47, -140, 204, -1, -166, 184, -57, -67, 206, -142, -15, 152, -209, 49, 89, -208, 81, 6, -104, 177, -107, -93, 275, -86, -83, 122, -119, 112, 80, -231, 155, 78, -256, 127, -25, -106, 129, -135, -20, 215, -177, -29, 153, -103, 133, 1, -188, 274]
1973B74k71j62L54k59JK24k90J69O2l53L21K2k76K57j17n7L19l39j8L72l06N0
1995b3J54k73K59m2k80L34j10k15K97j89RK58l45Q9K33k49J29O7k13K43q2k03
2017a52K91j50m9J97k33O6J60k69J38J24k65J81Jj27K38k58k6K72j43j01K01j14
2039a8P5M3k58K58j1k69K17M1j13J24j82P0J70k87J5K69j39j2N2j21J27m8j27
2062a24K43m9j04J23r2o6R8j37R9J20k14R7M5j41J12j9r5J67l8k5J01j69K0J45
2086I7j85L3J40j23K0M7j17J39j07p8K45p3j25J57o5j5Q4j64J19J23j93O1R4j64
2110e0O3o1p1K34j61q3K70j52j04J33p4Q9K5j41J44k1j49J73o1j04J89j17j5J73
2134A29k03P1Q4k48J71N2j50J65m1j02J92j76m0K95k47kJ82j80P9Pj30K01q2j71
$$ y = [274, 3, -159, 195, -64, -63, 161, -129, 40, 102, -251, 70, 92, -184, 73, -44, -101, 218, -121, -139, 233, -73, -23, 131, -142, 117, 75, -205, 129, 19, -196, 101, -88, -79, 179, -166, -77, 156, -93, 36, 103, -110, 133, 51, -152, 139, -11, -60, 137, -96, -30, 130, -139, -1, 123, -142, 39, 40, -87, 151, -107, -133, 139, -4, -105, 96, -18, 57, 100, -158, 100, 89, -180, 37, 78, -35, 89, -93, -23, 147, -140, -125, 144, 5, -7, 45, -76, 51, 3, -124, 119, 70, -34, 89, -3, -69, 29, -108, -9, 111, -103, -6, 39, -102, 10, -9, -104, 63, 25, 0, 101, -68, -48, 97, -88, -55, 85, -38, -18, 29, -88, 51, -56, -134, 111, 38, -87, 70, 5, -10, 74, -90, 29, 152, -41, 20, 114, -50, 13, -48, -119, 115, -46, -129, 141, -11, -115, 18, -56, 33, 58, -83, 61, 40, -109, 64, 3, -101, 88, -29, -44, 129, -74, -3, 81, -167, 4, 56, -94, 71, 30, -72, 120, -56, -96, 199, -48, -50, 132, -48, 31, 38, -92, 109, 27, -144]
2158a44K88j12k09K60j51K1J53k30J52J19l00J73M6j76K02j15n3K72k74k0K71
2179A73k55%J98k35J98Qk47K72j16j72L05j18r2K10j95N3J19k46J91P5k67K32
2201I1k7j92K37j87j9K26k47P8K28l37J14J10j62K04j14j21L21j83j61K48j10
2222cn9J42j95J48Q2k61J74O2k64K29l8p5J99k01J5J74k33P9J55j97Q3L9j37J29
2246D7n3j09K33j82k9K36j90L0P1j63J59K0j81K06j8j66J62p8l1J33j86J08J26
2269A45k96J39R5j48M8J3o2J50n7q1J65j81J8J46j06MP0j22Q2mj22J39oj02J26
2294E3p4j6R4j27K1J24j60M1J24r0J3J8n5J07q6l8J84j37n9J37j03jJ9p3J39l
2320E2j27R2Np2Q5j3l1P1n5l0J27j32J7N9j01K4Q2j20R9l6p1J18p8m6J34l9n2
$$ y = [-144, 144, 32, -177, 83, -68, -47, 106, -124, 28, 147, -153, 20, 66, -110, 92, -23, -76, 196, -78, -98, 173, -82, -82, 116, -119, 79, 87, -160, 112, -4, -176, 129, 11, -81, 129, -66, -13, 106, -140, 51, 126, -141, 91, 64, -128, 109, -78, -97, 129, -118, -40, 188, -149, -35, 75, -87, 117, 3, -118, 203, 20, -141, 107, -3, -62, 80, -115, 33, 115, -146, 28, 90, -174, 55, 17, -58, 141, -60, -45, 129, -104, -25, 130, -67, 16, 55, -82, 47, -6, -115, 118, -64, -93, 143, -47, -17, 54, -109, 50, 70, -111, 95, 77, -89, 73, -5, -36, 97, -89, 19, 145, -151, -12, 83, -65, -17, -4, -66, 84, 27, -54, 111, -70, -52, 94, -12, -8, 62, -60, 22, 18, -104, 35, 29, -73, 53, -21, -37, 57, -70, -49, 75, -85, -44, 80, -10, 3, 21, -34, 73, -13, -51, 133, -4, -63, 74, -29, -30, -11, -84, 55, 52, -75, 17, 22, -50, 35, 22, -9, 62, 7, -23, 104, -28, -11, 48, -53, -29, 53, -67, 32, -4, -75, 43, -35, -81, 53, 14, -38]
2347c8J02q8L6P1j48O9O0j18J02jr1J14q1n2J76j82pJ78j32%O9r1R5j0j20J49
2373F2l9j13J98j16l4J46j72L5J17j61P1L0j30J55j9j32J71r0kJ49j94O2J48k13
2397g1K8J30j39J55n5j53J89j20p2K03j15p2J73j71J01Q3k26J77J0j69J54n1n1
2420f2J99j60l5J53j57N3R7j68J22j3j46J87q3o5J43j08kJ85k15O7R5j49J02M5
2444H5j80J65q0p8J75j00n7J50j65Q4O7j88J31M6j72J70j5q9J57j25l4J84j76
2467d5mJ15j16P2L0j56J68n4p4J28o6k6J20j34j2J46j80Q3L6j21J35k8j08J58
2491F7o9p4J38j06oR7j20R5N0j62R0M2j29J29o4j0J35j19n4J46q5nP7j44R0K8
2517C7j12J14k7o1Q9o2l0J33j02qP7o9J7L2q6P2L8j24N3M5p7O3l6j2Q1q7rQ2p1
$$ y = [-38, 64, -24, 12, 83, -65, 4, 64, -54, 48, 47, -44, 70, -11, -63, 113, -69, -76, 102, -30, -30, 39, -52, 43, 33, -87, 62, 23, -90, 108, -8, -42, 104, -68, -33, 84, -77, -6, 24, -106, 49, 30, -102, 69, -21, -23, 126, -68, -6, 142, -71, -43, 87, -52, 103, 48, -105, 84, -36, -108, 95, -20, -92, 81, -90, 11, 94, -132, 45, 55, -114, 40, -11, -62, 137, -23, -58, 95, -62, -9, 88, -80, 42, 29, -117, 70, -13, -78, 65, -43, -45, 140, -75, -8, 87, -62, 40, 85, -95, 70, -10, -88, 87, -13, -70, 80, -85, -1, 66, -122, 9, 55, -117, 53, 38, -51, 106, -19, -53, 131, -45, -49, 66, -50, 22, 52, -104, 64, 10, -64, 64, -2, -28, 92, -42, -54, 92, -88, -5, 31, -90, 45, 17, -91, 67, -2, -76, 62, -44, -50, 47, -73, 22, 72, -90, 0, 42, -87, 42, -22, -32, 103, -16, -70, 76, -9, -14, 63, -81, 9, 37, -75, 39, 12, -49, 40, -22, -52, 81, -21, -29, 48, -21, -4, 28, -58, 14, 52, -72, -19, 26, -51, 12, -24, -36, 45, -42, -51, 31, -40]
2546d0L6K3j2L3j3p2J08m0r2R6pl5N2j03M9O1j06J3J04n7k4M4n5N1j0j9M7j7k4
2575iP3q8J1M3p8O3K3q6O8rj13J22J6p1M3mjN8j10KJ33j14J7N4n2N3m4n0J10n1
2605Iq3J54o7m8N7p5P4J0j20J12O2j37R2m0n8J38j04%J08j42M4R7j35M5L6j12
2631h3J00j6m4J34o7r9J68j23J9P8j28J40jj82J85n1j31J67m1o5J19j15J0J05
2655G9j67O5J06j48Q6M6j11R0r0m9J90r9j7Q6j29K5O2j59J78J5j48J54j6j07J15
2680E7j08J8J18q9PJ19j98J02K8j09R8l7m5J33j17l8J86j99K9J31j26L6K9j01
2704g6J49o5j39J80nj19J43q5K0M0j14N8P4j34J06j0p1J15j05m3J59j36M6J05
2728I3j36L1N5j08P7L5r9J23o6r0J24l4r0J26p1nR9j04O5K5j39Q3M9p0P4p5J2
$$ y = [-40, -4, 19, 7, 40, 27, -45, 63, 23, -69, 27, 20, -15, 37, -66, -17, 44, -62, -49, 55, -2, -26, 18, -37, 14, 4, -15, 32, 15, -9, 64, -24, -13, 30, -48, 15, 38, -48, 20, 11, -102, 20, 36, -35, 8, 4, 3, 61, -49, -47, 86, -28, -11, 43, -9, 44, 0, -50, 60, 9, -74, 80, 13, -35, 22, -53, 21, 31, -89, 23, 85, -52, 40, 0, -58, 80, -24, -24, 84, -58, -14, 83, -52, -7, 29, -83, 17, 1, -43, 91, 24, -75, 93, -30, -11, 67, -61, 79, 78, -104, 81, 30, -101, 66, 25, -40, 79, -36, -26, 79, -88, -23, 83, -65, 21, 67, -44, 46, -44, -93, 97, -2, -19, 67, -62, -37, 25, -134, 44, 59, -89, 65, 49, -58, 57, -51, -33, 85, -4, 3, 122, -76, 26, 54, -55, 43, 6, -39, 94, -23, -61, 125, -74, -45, 86, -40, -4, 25, -76, 73, 8, -131, 49, 44, -75, 68, -17, 3, 43, -71, -13, 61, -73, 33, 23, -48, 67, -38, -81, 78, -58, -12, 93, -43, -12, 43, -65, 12, 47, -52, 71, 5, -85, 39, 5, -85, 41, -30, -35, 64, -40, 25, 50, -89, -6, 43, -27, 47, -28, -16]
2755a6O7r0L5O5o7l3R6r7N1j6m4R2m6m1J02n6k1M6n5J5M6p3M8K4n0N2rl5%Ol1
2786c5P0m9qO6p2qN9k1K0Rm5O2l9q2J14np1P8m0j2M7p4j1J13j38L7P2o6L9oj2
2817hN6o4k5R8p7l7Q5q5K8L9l1K7M5j14Q0Kp3Q0k2j9N9j13R0L7j12L7R4j17O9
2846B9Pq6J20o2n7J12q0o1J16q5M1N1j05J02lj37J42mr1P9n3j4Q0j11O5O6j69
2873a08R0N6q4Q6l0p7J24q6l6J20q6J0R8j07N7J7j02R2K2j09R1l2m6J23j24NN1
2900A5p6P8M0j53J18K9j09J08n3l1J32j50j8J43j20N0M4j05N8%p3J42p2r3J49
2925E3k2p9Q9r2P5N5j49P6P7j40P5%n7J08j02k2R6q5K7Q8j33O4O3j06O6k4m0J04
2953F5o8k9J13r4J0K9o8O9K1j17R5Jj04R6m4jM3n4oJ11j06M1P5r7L7K1q7J01o5
$$ y = [-16, 51, -39, -4, 61, -6, -39, 57, -40, 11, -5, -49, 43, -3, -44, 58, 2, -19, 27, -28, -13, 33, -40, 8, 32, -18, 34, 25, -10, -10, -4, -35, 35, -14, -22, 44, -28, -36, 23, 2, 22, 31, -14, 48, 9, -73, 41, 36, -35, 43, 3, -9, 38, -36, -47, 66, -72, -35, 37, -29, 10, 4, -8, 48, -16, -41, 57, -20, -57, 28, -57, -29, 10, -21, 6, 51, -63, 17, 19, -54, 26, 4, -15, 44, -69, 21, 58, -54, -17, 77, -40, 29, 36, -50, 70, 8, -49, 63, -17, -78, 38, -47, -6, 45, -60, 42, 39, -98, 44, 40, -51, 28, -25, -39, 41, -70, -5, 61, -108, -18, 38, -46, 40, 10, -67, 57, -29, -65, 55, -31, -21, 77, -30, 27, 44, -58, 34, 56, -53, 38, 6, -40, 83, -41, -36, 15, -61, 17, 57, -96, 22, 51, -58, 50, -3, -34, 98, -52, -70, 73, -47, 3, 47, -58, 0, 0, -73, 69, -3, -96, 53, 31, -48, 41, -51, 24, 79, -70, 6, 83, -57, 18, 18, -39, 69, -33, -55, 41, -44, -17, 71, -62, 2, 65, -41, 25, 1, -39, 65, -3, -32, 81, -13, -3, 26, -42, 27, 48, -69, 26, 27, -77, 19, -25, -26, 17, -37, -43, 68, -38, 3, 78, -19, 18, 39, -48, 53, -12]
2982a2k5Q3n3k1M8o7O6K1r1L1N8o0M6l3k3N6%OL0o1j8O5p2N6%q5M0N1n9O6p3j3
3014d3N5Ql7M5j8J5J7q2K4N5q4M1M2m6K2j3l0M4k7k6P0n5j3O2rj0L5r5O8M1j00
3045d4O2k9j9O2n3l5R0m5nL1m2K8J9m7P1kp4M1Pl2O4l3m1M4n9J2P8r2L3L4o6P4
3077C2l3m3P2j8m4N9o1J5Q0r5L9Jn2L7K4m3P3k0r5J35o7k5M5m1M7Oj06N6N7p3
3107c8P8n0j7R7j07L4N0j00%R3j12R0L5j37J15k1p3R0n2k6J18j24J6P0j00M2N6
3134B7r2J11l8o2Q3l0n1R7p0QQ8j19K8M6o7P5qn3R5m2o0R6r3NN5m7M0J3j13P1
3164gL9j35J14k3j5Q5q2JR1j13L8O5q3O4No2O4j8r6J08o3lO8r8L4O9j10O1K2o0
3194d0R0k3o9Q4l7k6Q2p8J7L2o0L9K9r8O3Mk4M2n5JQ3o8l9Q5l5J1K6m6L4k2m7
$$ y = [-12, -37, 46, -7, -28, 20, -47, 19, 40, -51, -20, 38, -22, 24, -9, -32, 24, 24, 30, 60, -1, -19, 46, -26, 30, 30, -55, -15, 36, -23, 43, -30, -43, 12, 20, -17, 28, 10, 25, 42, -40, -16, 39, -45, -4, 38, -8, 14, 1, -29, 15, -12, -38, 32, -23, -36, 26, 17, 7, 42, -53, 15, 56, -44, 18, -11, -30, 32, -21, -56, 34, -11, -16, 15, -27, 1, 20, -27, 44, 42, -32, 9, 16, -16, 48, 15, -26, 18, -41, -29, 49, -43, -10, 24, -42, 32, -1, -44, 28, 10, -34, 25, -36, -21, 59, -36, 3, 4, -48, -11, 13, -30, 43, 23, -72, 63, -4, -29, 16, -25, 22, 28, -78, -22, 35, -38, 40, -10, -27, 70, -37, -3, 47, -53, -53, 40, -72, 18, 53, -84, 31, 10, -63, 27, -25, -51, 67, -57, -41, 29, -71, -29, 27, -65, 46, 8, -54, 29, -1, -52, 45, -25, -17, 71, -48, -20, 26, -41, 34, 26, -27, 68, 26, -34, 62, -31, -26, 29, -18, 22, 35, -78, -7, 32, -103, 11, -12, -27, 58, -24, -23, 68, -45, -7, 58, -25, 39, 44, -18, 46, 28, -68, 40, -23, -26, 42, -56, -22, 47, -63, -2, 20, -40, 50, 27, -42, 42, 5, -21, 61, -17, 0, 32, -28, 11, 40, -58, 5, 9, -15, 27, -28, -27, 56, -12, -51, 34, -1, 10, 36, -10, 24, 2, -45]
3225d5O6J2r5J23m6l1K7n3RL1k8J5K9k7K4k5pL2l2rJ7J3j8N4n4PK8l5QL9o7N2
3257A4k7l9P1j0qJ0qmL8m9J2L0m5J0J7k7K5j3m0O1j5m5L8lPK7m8K9J7n5L6J6l9
3290a7J4K7l4KLk4M5m3J9J5k3pO9o1L8rk7N1j9j3M1n2m0Q4j4n7K6l3P3k7o2O0
3322Ej5l6N1j4m6Q5m1J8K6o9K5K9o1O2kn8R6o3o6J32p6J4J4m5L7O8r4K0N2j06
3352e8P9J1n8R3p6mP5j00N3L5q7J4L2o9O9l4j9P8n4k9P1m2J8M8q9M5L0o7M8kq0
3383f9J32o4k6R1p1NP6j23RO7p4O8Kn2O1m6l4P4k9%M7j01L3O7r4L2O8j19O9mk8
3414c3O0n2J5L6n1M3J4q4O7On1L5j0l1M0Nl6O6p0M4Pk5J7j2m0N4m3J3M0n5RM4
3446B2k6j2K5l9N5l2k0K7J8o9M9j6LM6n2J8K4k3nJ8lJ9J3m4L7m6k0J6J3k5J9j0
$$ y = [-45, 21, 33, -62, 61, 15, -16, 11, -42, -33, -2, -30, -15, 14, -13, 11, -14, -21, 11, -21, -30, -13, 0, -18, 36, -18, -11, 17, -18, -10, 29, -38, 14, -13, -52, 19, 9, 1, 11, 3, -1, 37, -12, 0, 30, -15, -5, 12, -15, 10, -3, -43, 18, 3, -42, -4, -7, 0, 27, -21, 8, 25, -30, 6, 22, -17, -3, 24, -10, -8, -5, -29, 16, -27, -8, 7, -16, -23, 46, -15, 23, 14, -13, 38, 19, 6, 47, -5, -45, 39, 25, -32, -6, -39, 34, 7, -55, 5, -10, -46, 5, -9, -55, 30, -11, 7, 33, -36, -11, 18, -43, 19, 17, -41, 55, -8, -74, 58, -18, -4, 10, -35, 2, 70, -24, -4, 48, -58, 21, 32, -26, 67, -9, -13, 62, -38, 15, 50, -37, -23, 9, -60, 9, -25, -44, 34, -20, -49, 22, -20, -2, 46, -43, 2, 32, -35, 13, 11, -69, 63, -1, -27, 64, -7, -2, 74, -49, -40, 27, -47, 21, 23, -29, 32, -14, -48, 26, -3, -3, 44, -57, -24, 43, -51, -19, 49, -70, -1, -5, -33, 27, -25, -10, 26, -25, 18, 32, -52, 15, 21, -30, 5, -5, -36, 4, 9, -27, 39, -31, 13, 20, -5, 12, 0, -40, 14, -29, -16, 24, -31, -22, 22, -4, -16, 9, -30, 25, -7, -27, 0, 18, -51, -2, -18, -15, 31, -21, -3, 21, -2, -7, 11, 8, 27, 40, -4, 33, -13, -33, -17, -4, -29, -10, -20]
3478b0PM4l7L9j3l9K2K8l7njj6K7Rm1L3k2LL6n0L6Mk1L1k7j6L7pj1K4Nj3kK9k6
3513A0J8n4K3L2k1j4j8JK7j0nJ7mn3M1kj5O8p3L7Lj3j6K8qJ2lj6L2k8k9L8k4n
3547b4L8o0O4Ql9K4Pj0prJ5K4m4j3M3m6JN0n3M7Kp1R6l4l7L5k3j9O7n3K6K8p4
3580d1L7K1l9M2Pn2M8l7nM9p8K2M9p1N5K1k9M0j6o1M9k4k0P6p5J7M0m5K8Qo0M4
3612@L6p0K9kk7P3l8KM1o9N4j2n9O8j1p2J20m8j8K7m6J1N5o8K7L3p2L3J5k3L4
3643B3k8j3N0n1J1J8j7LK9n7O3k8l2L0ll4K4j2JO2o2J0Ql2L5L7o1N3j0m7K9qm5
3676e4O2k3nK5k7K4J1l8J9L9m9N0pk2L1n4J1K8m2M3j8l0L7j0k5L7l1MLrPJ9rr
3710a2J9k8K2Qk3L5km1M0j8oL2o8L7K0l7K9J6l1K4k5LJ9m1%K1PmJ5j2oL1m2j6
$$ y = [-20, -13, 31, -6, 33, 20, -19, 3, 31, -6, -11, -12, -28, -1, 8, -33, 0, -22, -19, 17, -33, 3, 7, -14, 17, -10, -26, 11, 4, -7, 17, 22, 9, 7, 36, 10, 28, -26, -3, 29, 8, -6, -24, -23, 4, -6, -11, 6, 2, -51, -10, -12, -27, 41, -32, 5, 8, -5, -21, 7, -1, 11, 8, -8, 24, -4, -33, 5, -19, -24, 14, -46, 18, 26, -13, 11, 18, 8, 1, -8, 7, 31, -13, -26, 17, -29, -28, 22, -31, 16, 18, -53, 43, 9, -28, 7, -16, -35, 32, -21, 5, 33, -41, -4, 17, -22, 20, 27, -25, 23, -14, -19, 30, -48, -26, 23, -48, 7, 28, -1, 39, 23, -38, 11, -13, -33, 43, -32, -15, 25, -20, 8, 16, -44, 0, 36, -34, -5, -7, -34, 39, 1, 3, 44, -25, 29, 17, -42, 26, 15, -57, 63, 15, -3, 24, -22, -11, 44, -24, 3, 36, -36, -3, 12, -11, 23, -5, -18, 32, -19, -8, 10, -7, -4, 25, -32, 31, 3, -29, 1, -2, -36, -12, -24, -23, 39, -23, -13, -5, -37, -2, 35, -26, 27, 17, -30, -1, -9, -54, 8, -15, -20, 5, -22, 2, 13, -25, -6, 33, -16, 34, 27, 5, 36, -18, -7, 21, -21, 22, 4, -26, 11, 1, -24, 13, -18, -14, -11, -20, -13, 6, -3, -12, 7, -21, 1, 9, -14, 21, 19, -22, 18, 0, -6, 26, -42, -5, 15, -22, 7, 23, -8, 16, -9, -6, 13, -28, -28, -7, 0, -4, 11, -1, -7, 24, -18, -34]
3744c4K8oj2L1k2jKLRj5KM9j5j9J4j6J3K0l9K7j3n1M8K4m2J4Pk0K5K4l5K1k4J1
3778HKqpK8l9Nl3K2J7%k8L0j2l5N1J2l8L6n0P1nk2M4m2j5L4k8j1M1m6J6L4p3L9
3812bkj0K2l2ON0m2NK0j0j9N1o3K6Oo0Q1m0j3J6Nj2L7m7L9K5n6L2K2n4J1K8k9
3845iL2k3jL9k9j4J2j9NM8m8mK8m3N4m5k3O7n0j7N6k5K0Jm8N0%n0L8j0l7O0l3
3878a8LN4r5K8O7l0k8L8l7N3j8k3N2l8rJ8j0k4N3o6M2K8p6O5m9jJ5jK7j6n9O5
3910A0Mm9N2nl4K8Kk6M8m8j3N2l5KQJ6l0L0n0N0N%J2j7j1K0m0K7J1Nk8OkK8pr
3946A2nj6qK2j3%Lj7j2K0jjO1m9MPl3M3Pl2MJ6ml6M8mPk0L0m1j1K9k3K2jK2m6
3983a6N8l1j0J2qnJ4J2m1J1pj1L5o5N9oj0OlJ7j5lj1K7J1k2Nj3K5J9m8L5lo7M7
$$ y = [-34, -6, -12, -24, 7, -15, -16, -14, -11, -2, -17, -15, 34, 19, 0, 14, -2, 11, 31, -8, 19, 6, -45, 3, 27, -15, -1, 6, -14, 11, 35, 0, 21, -3, 8, 10, 2, -5, 23, -16, -11, -44, -22, -5, -5, -33, -3, -15, -50, 1, 13, -25, 11, -39, 32, 27, 5, 49, 7, -8, 26, -2, -13, 28, -18, -2, 32, -41, -2, -4, -14, 8, -24, -18, 32, -10, -5, 15, 5, -14, 37, -26, 0, 6, -54, 27, -13, -26, -10, -5, -17, 20, -27, 12, 37, -19, 13, 35, -19, -8, 20, -9, 23, 0, -1, 38, 9, -5, 7, -12, -7, 41, -7, -11, 17, -26, 28, -17, -40, 27, -23, -40, 16, -9, 11, 12, -36, 14, 14, -36, 2, -8, -45, 15, -18, -15, 39, -56, -28, 39, 9, -19, 19, -18, 35, 17, -6, 46, 8, -1, 17, 7, -17, 36, -30, 12, 40, -36, 29, -20, -21, -6, -7, 20, 4, -55, 10, 14, -35, 17, 12, -22, 6, 8, -18, 30, -18, -31, 21, -14, -12, -4, 12, -18, 12, -38, 12, 17, 17, 29, 12, 1, 21, -19, 8, 19, 24, -4, 2, 0, 28, 21, 12, 7, -9, -17, 5, -8, -8, -5, -22, -34, -14, -15, -16, 45, -4, 0, 7, -26, 17, 24, -8, -4, 12, 8, -28, 20, 16, 23, 3, 33, -8, -19, 10, -13, 9, 8, 30, -16, 42, 11, 1, 13, 5, 0, 14, 26, -15, -4, -11, -22, 13, -52, 7, 1, -9, -3, -6, 11, -4, -7, -18, 9, 20, -2, 3, -10, 15, 34, -14, 21, 18, -49, -2]
4018bRl%l2M3J4l4OJ8rK3j9k4K9j5j4mK8k4K3pj5K8j9l1N6n4L1nk1O4k1k2L9l6
4053@J2J2j8mK8l4J9k2k1N5l8J6M4n4l3O7m6J8j7jJ1J0j7J1NJ6j7j7M3j0l3J4
4085aL0n1J6J4j4L1j1o5N0k0RK3k4M1J0p6L5mK0J1%k7K2k9PK7k4JmQOj0oRj2j1
4121a9MRm4Q7n2LJ2j1joJ6OrNkJ9j9K8k8%L7n0J6Kk2J2jlJ9%l0Rj4K9J0qmK5j6
4160Ij8K4m0J1QnL2m4J7J4l5L6Nn6K5mMK5Jj3Jj3K0Mj5l4O0k2LMj5pjJ6NKk9O1
4198C6o3J2MQLPj3KNk1M1j1k6%K7k5K7kj5J8m7M7J0l5J2K0j4K1j5k1M1n0J8kL0
4233B9m1K9l7RrJ7J2rK2k7K1j6OOj2K7j8oj0k3K0rj1K0J7J4ljLj3k3M2k4rk1K7
4269ajj1K0pnL2k3oJoQJj6J3j2J0pk4K9L0n3J8L4m8J7nk6J4J2NL2n0K6J4j4oj
$$ y = [-2, 7, 4, 4, -28, 15, 29, -5, 1, 19, 10, 33, 14, -10, 19, 4, -10, -14, 14, -10, 13, 6, -9, 19, 0, -31, 25, -29, 2, -3, -24, 40, 19, -3, 36, 0, 12, 24, 6, 2, 30, -4, 15, -7, -28, 27, -11, 5, 49, -5, -38, 29, -17, 1, -16, -17, -6, 4, -13, -2, 3, 19, 2, -15, 28, 18, -15, -1, 29, -22, -6, 8, -6, 25, 14, -51, -1, -21, -12, 11, -13, 28, 38, -38, -3, -7, 13, 24, 24, -3, 19, -10, -3, 24, 0, 1, -3, 5, 11, 1, -5, 4, -8, -19, -15, -6, -50, 37, -15, -12, 0, -11, -12, -18, -2, 4, -5, 0, -2, 17, -2, 26, -2, -2, 35, -15, 1, 3, -19, -7, -8, -11, 8, 8, -22, -13, -27, 2, 12, 4, 0, 25, 9, -9, 15, -25, -14, -6, -11, 21, -23, -6, 8, -27, 9, 14, -42, -17, -21, -17, 8, 9, -4, -3, -16, 4, 8, -7, -41, 19, -3, 0, 4, -11, -18, -19, -3, 2, 4, -25, 36, -27, -15, -11, -3, 0, 7, -6, -4, 1, -20, 21, 10, -16, -16, 11, -14, 13, 11, -4, 14, -33, 14, 24, -11, 1, 21, 7, 28, 13, -8, 33, -17, 1, -1, 29, -12, 17, -20, -11, -20, -3, 9, 0, 22, -5, 16, 0, 6, 12, 0, 27, 9, 3, -7, -30, -10, -19, -30, -10, 7, 21, 18, 17, 20, 7, -16, 26, 2, -7, -28, -1, -2, -13, 7, 0, -5, 27, 4, -2, -1, -7, 1, 2, -14, -1, -13, -3, -10, -34, -5, 25, -28, -10, 24, -24, -7, -12, -38, -24, -12, -7, 25, -25, 1, 15, 1, -5, -6]
4306fj7K5lm0M3%k0K2Jlk2K0L2ln5L0ok0K7l4KM2j4Jj5J6j4pKK2J8k3%%n1N2k0
4343a8RM5o7nN1j7kOm7M4j6j0M3k3J2K4n7L4njPk0J7j1NlJ0j8onM0j2J0n0L3k3
4379b6J6K1mj2J8k4M0J7o8LQK8k3KMJ1m4K7K4j7L8rm3%RJ4rkl4M1j8oK5m4K1K6
4415A0m1K1nLj2K9%p2P8j6LrmJ9j7J9L5n3rK9j7K1Nk5qJ2rK4k7MJ2J7Prk4K1j9
4452gR%mj1j0Kj3M3l3Jj4N8j2Lj9J4jqJ2j7K8j8J9m1L1k4JMrJ3%jKNj6J2JOnq
4492gQJ9jn7M8l6QJ4j6M8j9kk0K8j2jmk0J1L5n4N0Rj7mnPQl3J8QqJ6qj9J9pk4
4530b0K6k5J3JJ8j0qMk3K0qM3l3j9M7l3rL6l0L3Lm2L4nk3M4m1RqLL1k3K6l1%O
4566FLRj5k4PPK1j4j1J8k5L6j0k1L2l6qNnK4K8m4OM7l6J2K6l7J6j8k8L1j0OJ6
$$ y = [-6, -23, 2, -1, -41, 2, 2, -18, 4, 5, 2, -20, 0, 32, 29, -26, 4, -2, -22, 5, -29, -27, 15, 1, 2, -13, 3, -11, -18, -16, 6, 24, 1, 1, 1, -50, 2, -18, -9, 36, -31, -36, 15, -2, -4, 2, -45, -1, -17, -27, 16, -7, 5, 29, -28, 6, 1, 0, 7, -13, 4, -7, -2, -5, 5, -13, -19, -24, 16, 4, 14, -36, -3, -26, -10, 11, 7, -5, 13, -11, 29, 46, -22, -19, -11, 17, -6, -4, 0, 11, -33, -6, 18, 1, 39, 30, -13, -13, -4, 10, 1, -1, -35, 6, -12, -18, 7, -37, -16, 10, -31, -10, -15, -12, -24, 5, 5, -67, 11, -5, -2, -11, -15, 4, -13, 6, 41, -12, -21, 8, -9, 12, 17, -8, -16, -4, -13, 11, -16, -12, 0, 17, 24, 15, -9, 12, -7, 2, 2, -2, -13, -23, -21, -34, 9, -24, -23, -37, 21, 9, 12, -7, 7, 6, -2, 10, -7, 21, 3, 22, -19, 12, -12, -11, -7, -16, -3, -3, -4, -2, 3, -13, -1, 0, 6, 1, -7, 1, 20, 19, -38, 10, -26, -18, -4, -20, 28, 9, 7, -13, 15, 3, 2, -2, -22, -11, 24, -30, 20, 29, 12, 8, 3, 10, 18, -15, 3, 11, 3, 19, 11, -8, 11, 4, -20, 6, -19, -6, -5, 13, 3, -5, -1, -24, -4, -12, 31, -2, -21, 26, -7, -16, 20, -10, 23, 26, -16, 18, 13, -10, 34, -7, 2, -6, -3, 28, 5, 31, 0, 0, 6, 9, 18, 3, -21, -14, -7, 14, 0, -11, 7, -18, 18, 8, -13, 19, -17, -25, -20, -25, -1, 27, -17, -11, 36, 0, 12, 38, 1, 17, -1, -29, 2, -8, -2, 14]
4601A4rkKk2OJ3kJ7Pn8J9pKO3p4K3%MLOk5j8O0l4J3k2K9j%j3K5j3jK8n5J1MkJ5
4640Fk3J7K7k4mmJ0Lj6oM1j1k4jJ3J4k3J0QQl3J9lJ8k0J2k8K8j6Nj9J8jL0Rl8
4676Bj7J5nK3rK7l3k0J1k1K5J5j8qK5k1nJ8klJ3l0OK9j7j3Kj1Rj8OM5j0j1rrj7
4713c6L3J4j4K3k4K5Kj9j6K6mj1Jl0K2J5k2K0J5l9M4k3j3O2p4L3j3K7k5lj7MK2
4746Ek7K3KJ4k3k1L8mk0K0Oj5Mj1J9M1n6K0j4Rk3J3kJ5j8J1Ml6K3J4J2k7J6mj2
4781dJ9m5L6mk2k1L6nL8n9M7Oj3kj6qJ4Lpj1L9l3PKK0rk3J8K8j9J2k1j8J8j6J0
4817cKJ0J8rl0K2Qn0N9nj8K4l0j0L2J1l2kj9M9k4RJ0Rk5kJ2pj6J3j8PJ4J2%l3
4853a2L5k2oRj9oK9j6K6j9m3QP3m2MQn3N0qJ8J2m7J6J2Nk5K2j6%K0jJ3l1k7L2
$$ y = [14, 5, 3, 5, -17, -11, 2, 0, 17, 24, -34, -15, -22, -20, 43, -31, -8, -8, -4, -1, 5, -20, -38, 22, -12, 1, -21, 8, 7, 7, -6, 19, 6, 5, 33, -22, -11, -7, -9, 6, -17, 0, 27, 3, -1, -5, 5, 8, -8, -14, 27, 16, -8, -9, 4, 18, -5, 5, 13, 21, -12, 7, 4, 22, 2, 14, -14, 14, -2, 3, -16, 2, 1, 31, 40, 2, -15, 0, -5, 18, 9, 36, 3, -17, -6, -27, -2, 13, -5, -13, 12, -9, -14, 4, 2, -1, 12, -18, -12, 17, 0, -13, -11, -22, -13, -31, -25, 20, 10, -1, -10, -19, -36, -3, 11, -3, 20, -4, 21, 23, 4, -12, 14, 10, -1, 0, -30, -8, 7, -15, 5, 20, -19, 25, 2, -11, 51, -23, 10, -3, 24, -1, -4, -21, -17, 5, -22, 1, 3, 17, -6, -27, 11, 7, -13, 7, 13, -2, 2, -9, 10, 51, -5, 15, 1, 10, -13, 0, -2, 13, -5, 6, 10, -26, -3, 11, 23, -4, 12, 8, -4, 15, -30, 6, 2, -20, -41, -5, -10, 28, -31, 16, 22, 9, 7, -9, -17, -3, 0, -7, -18, 21, -12, -5, -3, 17, 8, -15, 3, 31, 12, 24, 3, -15, 3, -13, -3, -1, 9, 27, 18, -12, 10, 18, -32, 27, 22, 4, 28, -2, -12, 20, 31, -1, -3, -22, 27, 3, 12, 22, 31, 6, 4, 16, 9, -7, 6, -12, -5, 9, 21, 21, -12, 23, 1, -5, 4, -15, -21, 8, -8, 18, -1, -44, -36, 37, -5, -1, 7, -46, 4, -4, 14, 26, -21, -5, 7, 12, -13, 9, -7, -7, 13, 12, 25, -6, -33, -1]
4888ajj5Mj1pO0l9K5oPkMl0K1mJ4oj8K3k7M%lKPj1rK8qmjPrjj4L2Jkj1K6Jn1J7
4931hpL6k6PJ%LK7n2L7j1j1kJ8Pk7J4m4M1j0Kj8K5j9M5k5qjJ9k2rL9j5j2l%J1
4968Bk7J0jlN7k2k7MKK4Nn5K3K5ok7K6k4%j8N4k7PqQnJ2j8%RL0o7L9jPj4j1J1
5006fK3m8K5J9k4K4k0qK4j5j5L7oMjk9N3m3l7O7k4pK7l7LK3l6KL7l2K5j0k4J4
5040a5K1j4K3j5k0J3QJJ9l1K0PRm1L0k5K4J0n1K6k3K3j9K8%J8k5K9rl6L2k7j3
5073b3M4l3K0Ll3K6j1j7kM2j8J7rk9L3j5mL1rl5O1k9Koj1MJ3j0Rj5j8J7%k2K3
5108dj6L0l2J7jRKk3L8k3K3l2J6j5L4j2Pl0J7Ol1K3pj2J6l2K7J8k7lK5j8J8j7
5142iJ4L2m7Rok0J4K1Mk0k9PL2Rlql5M7l5mM2l6j3oO4k1mjj8K6KRj7mJ0K0Jl9
$$ y = [-1, -2, -17, -13, -24, -31, 29, -10, 15, 9, 16, 14, 18, -12, 9, 5, 19, 13, -5, 18, -9, -5, -5, -8, -6, 1, -10, -19, 9, 1, -3, -4, 3, -6, -7, -21, 11, 12, 10, -1, 25, 26, -25, -8, -15, 21, -5, 2, 3, 3, 6, 33, -19, 18, 7, -4, -6, 12, 19, -8, 6, -38, 3, -7, -5, -23, 2, -17, 28, 3, -5, -6, 13, -9, -18, 21, 6, -6, -9, -9, 2, -25, -15, -16, -19, 38, 16, -11, -7, -5, 19, 24, -31, -8, 17, 11, -16, 10, -14, -14, -32, 22, -5, 2, -6, 2, -3, 9, -9, -9, 0, 30, -37, 2, 1, 8, -6, -17, -6, 17, -31, -6, 13, -11, 13, -7, -15, 9, -6, -21, 16, 10, 14, 13, -16, 37, -6, -43, 24, 0, -7, 20, -17, -14, 9, -27, -25, 12, -20, 5, -5, -29, -15, 6, -8, 15, 0, -20, -7, 1, 2, 21, -10, 10, 17, 26, -15, 15, -10, 14, 24, -27, -1, -24, -1, -20, 8, 8, 26, 1, 30, 21, -15, 17, -10, -23, 21, -12, 8, 11, -22, 4, -7, -24, -26, 16, -2, 15, 6, -23, 10, -5, -9, 22, 13, -22, 39, 10, 12, 6, -5, -1, 12, 2, 11, -4, -22, -5, -5, -27, -4, -20, 10, -22, -5, -6, 3, 5, -18, 20, -3, 20, -12, 4, -11, 23, 11, 18, -12, 5, 11, -20, 3, -4, -16, 0, -32, -5, 13, -14, -17, 8, -10, 8, -9, 5, 37, -10, -1, -7, -27, -13, 8, 12, -8, -37, -30, 2, 11, 8, 0, -35, 12, -23, -27, 15, -21, -34, -40, 24, 3, -1, -2, -20, 6, 8, 17, 0, -4, 6, 26, 27, -12]
5180a2LK4Rm2L0Lj5J3nmk5M6Lpj3k1K4l6M0k8J8j2mKJ4j2L6n3J2K4j3OJ5k5j2
5215a7L8j1K3ok6J9j3k0J6j3L4l2J2Ol2nN0j7o1N8J9k6J8j2k1J8ljK%K1oj8J6
5249A0k5MK7k3JK6k6jJ8Qj2Qj8j0K7l0K4Pj3J8m4QK8mppj4L3k1J9J0j5j7J1J7
5284A7k9RM4l3mk1M0l2j7K9l6N3k5L3m8M5j0k9J0j8J4J9rOj4K9k1j4NK8Oj0Nk3
5318aJ8j7j8K6k0K3pk0K2Lk9kJ9KJpMj%j4O7l6j9jK6k0k0L8j1pk5L0qoJK0LKk0
5357dK4Ql1J8j7QpoQok6M6l3jJJ3qM6l5k0K0%j4K6KJ3Kk2j5J9Kj1K1l5M8l8j9
5394b3K1K5k1qqmK9j4j0L3k7PLj3J8Qk6rLK2l2J5L6k5OmJ6k1K%KQjjJ0j2j2J6
5432Il6K0QK8l8K4k1lj0K8rK1m4L1rkJ1j0OPNj2mJ2l1L1KJ8l4pK8m2L4KrjJ6r
$$ y = [-12, -9, 15, 24, -18, 12, 15, 0, 13, 8, 4, -21, 25, 28, 21, 8, -13, 11, -25, 15, -13, 5, -7, -11, -9, 5, -7, 29, -24, -12, 12, -1, 5, 20, -5, -17, 21, 10, 33, 27, 1, 20, 7, -13, 3, -10, 24, -8, 4, 10, -22, -27, 23, 6, -55, 3, 22, -4, 14, 2, -19, -1, -4, -5, -3, -3, 18, 12, -6, 10, -15, -11, 16, -7, -6, 20, -6, -7, 11, 19, 7, 15, -3, -13, 14, -16, 8, 15, 2, 20, -24, -16, 12, 8, 1, -6, -20, 13, -8, 11, 21, 6, -11, 0, 17, -12, -3, 41, 8, 4, -17, 23, -9, -26, 3, -33, 20, -5, 28, -20, 25, 15, -14, -4, -22, -8, 11, 2, 8, -6, 23, 2, -12, -7, 21, 27, 17, 22, -1, 17, 0, -18, 8, -12, 11, 4, -16, 6, 9, -20, -22, -3, -1, 0, -7, -3, -4, -4, -18, 49, 13, -6, -7, 19, -1, -21, 17, 6, -1, -26, 4, -4, -10, -9, 11, 14, 16, -4, 20, 28, -3, 15, -2, 6, -1, -7, 1, -5, -31, 15, -18, -19, -18, -5, -13, 33, -2, -22, -2, -2, -16, 10, 12, 25, 27, 5, -10, 9, 11, 0, 21, -14, 34, -4, -23, -2, 23, 2, -6, -14, -18, 11, -3, -13, 20, -7, 0, 3, -10, 8, 16, -10, -19, -16, 6, -26, -11, 25, 0, 6, 2, 18, -3, -1, -1, 1, 9, 8, 7, 17, 5, -7, 9, -27, -7, 1, 29, -9, 15, -6, -9, -19, 9, 0, 21, -23, 8, -1, -3, 8, -2, 4, 11, 16, 4, 0, 12, -19, 12, 14, 32, -2, -9, 19, -23, 11, 13, 4, 3, 19, 10]
5470A0k4J1j4J9K5j8llj5J0K8Jj7k5rL7oKk4j3N6j0k3L3m2NJ4k0J7j4J9Mk4K3
5504A0j5J8j4KK2l6PkJ6j5j8kL2l6J7L1J0k8J9j1j2NK8rm5L0qNK0k9%j1Oj5PL3
5540A2j3mj3J8qlJ5j1LNQj1K6j6KKKj0Mj4L9l7l2O2k3oN6o9L2Qm7L5k7K4m2L4
5576Aj6JL2j2NJ5m1J8j0J0Okjjk3LNJ8l3K4J2j1Qj3j2K1J8k8J7k2MJK7k3mL4r
5613A9k8j4J2j0J5%MKok7L5l6M2lj6J6j6L7l2K5l3K3k9N2k9Nrj6L9k5jPJ0kJ0
5648B1j4nj3JJQJj0K2qk2K4J9m6lL2j6K9j7l1K7nK3Rl9jj1J0M3l0jj5lJ3j9K1
5684eJ0K%k9K2%J8j1jj0K4j3k9N1k8K5m1K3Rj4j1l2L1J9Rj9K1k5NQKk8L0Ol1J6
5720DOj0KoN3o1Nj2N4n6K8j1M7p1MJ6J6J7Orm7K9Jj7LJjnJ8MJqJ4j0k6J0j0K2
$$ y = [10, -14, -3, -17, 2, 27, 9, 6, 3, -12, -2, 26, 27, 10, -15, -24, 13, 7, 9, -15, -28, 28, 18, -5, 28, -14, -9, 5, -15, 2, -12, 7, 11, -13, 10, -5, 13, -1, 1, 23, -13, -6, -8, 8, -7, -25, -27, 5, -31, -14, 17, 27, -1, 18, 7, -5, 0, 28, 19, -26, 4, -4, 1, 21, -8, -8, -19, -13, -28, -21, 12, -1, -5, -18, 0, -8, -11, 4, -7, -4, 1, 9, -2, 24, 8, 10, 12, 14, 4, 8, -6, 33, -4, -36, 26, 3, -3, 53, -16, 16, 24, -23, 12, -15, 9, -33, 1, -15, -14, 18, 6, 11, 26, -15, 3, -7, 3, 9, 7, 6, 5, -18, -15, -10, 8, -25, -1, 11, 0, 8, -5, -17, 4, 22, -6, 11, -11, -7, -6, 21, -2, -6, 28, 19, -9, -23, -11, -21, -6, -6, -2, 0, -6, -33, 2, -34, 8, 5, -11, 5, -11, 26, -6, 19, -14, 9, -20, 32, 3, 8, -1, -17, 22, -3, -4, 3, 13, 11, 21, 7, 2, -11, -10, -9, -1, 0, -10, 12, 4, -18, 6, 25, -21, -24, 8, -8, 21, 4, -27, 0, -5, 18, 27, -12, -13, -24, -14, 29, -1, -2, -17, -20, -7, -26, -5, 5, 7, 7, -22, 0, 0, 18, 7, 6, -4, 20, 7, -22, 29, 1, 26, -15, 8, 17, 3, -8, -40, -9, 10, 19, 0, 21, -4, 1, 9, 11, -17, 13, 19, -12, 4, 10, 0, 2, -4, 49, -12, -7, -19, 35, -21, 7, -4, 43, -28, -24, -8, 8, 25, 31, 22, -25, 4, 5, -12, -9, -8, -9, -14, 4, 8, 9, 1, 15, 5, -21, -11, -21, 1]
5758Ak0M5k8qK0j8M6l2%Km4K8L3l3Qoj6K2l3K5PJ0j4k6L9nk3QL0m2jK0K0j4kk2
5794b3K5k1%J7l1M6k3J5j3K1k7PQJ3kk5k5J5k4L2J3kMJ8l5L6m0J2J1PJ7o3K0j2
5828b9N1m1MoJ9JOnQrqpj4K5K8k5jj1J1J1k7M5nj8l0L6mjKj5j3J3mK5Pk0kj1N
5867iK2qk9L4j8Oj0kK0qPj6J9j4K4m0K1RJj2nJ1J5J7k5j8M0o4L1J5k6k2M4j6q
5902a4K0Nj8j7K7j2MOj1J8k5mmJ1Nk2M4kl9M0mk2jJ7krMk8J8k8L6RqK1j6QqOl4
5941b9K1qJ9lmpj3J3J4k3kJ8kk6N1k5j5K8nLl9J7K8j1lMjJ4m3K2j0QK7m0L7k7
5977a2rN1k8nrJM%mLj4J3L3j0j9p%K9j0j1joJ3mJ0j6J0J6k6K0j3Lj4RJ5nJ2l2
6015a3K2lJ1l5jJ1j1K0O0p2pPqL5k5J1J4qk4L4mj4MlKJ8j2QOk8j0nL4Ok8mL2j3
$$ y = [1, -19, 26, -2, -10, 10, -8, 38, 6, 6, 8, -36, -8, 25, -8, 0, -6, -22, 0, -33, -8, -1, 9, -5, -31, 8, 3, -20, -12, 18, -24, -25, -5, 15, 1, -1, -23, 2, -19, -19, -2, -33, 13, -10, 5, -8, 13, -14, -7, 1, 14, 12, -13, -38, -23, -47, -15, -2, -4, 0, 18, -17, 19, -21, -9, 2, 9, 26, -37, -17, -29, 22, -19, -15, -21, -2, -1, 5, 0, 8, -1, -9, -16, -30, -5, 23, -2, -3, -14, -3, 8, -19, 26, 21, 3, -27, 9, 5, 4, 6, -9, -22, -9, -13, 12, 19, -1, -3, -14, -9, 13, 5, -24, 10, -8, -2, -12, -14, 6, -2, 5, -11, 8, -6, 18, -22, -1, 8, 9, -3, -8, 3, 18, 35, 10, -8, 32, -32, -1, 14, -12, -34, 10, -6, -14, 6, 11, -7, -24, 3, -9, -5, 1, -10, 8, -17, -21, -25, -14, -9, -31, 13, 11, -28, 12, 8, -14, -15, 2, 0, -9, -5, -33, -15, -43, -7, 2, -6, 15, -1, 7, -1, 5, -29, -8, -16, 3, 0, -4, -11, -24, -11, 3, -20, -22, -4, -6, -32, 19, -6, -21, 7, 2, 5, -34, -17, 11, 0, -3, 1, 0, 14, -29, -7, -17, -9, 18, -22, 15, -12, -21, 30, 2, -3, -12, -11, -7, -7, -11, -8, -22, -9, 24, 14, -5, -12, -12, 17, 7, -4, -5, -11, 2, -2, 8, -8, 2, 18, -8, 12, -1, 2, -12, -3, 12, 7, 19, -13, 9, 6, 17, -18, -19, -8, -19, 1, 61, -11, -18, -11, -19, 16, -9, 2, 16, 8, -16, 18, 14, 0, 4, 1, 3, 21, 9, 17, 23, -5, -15, -20, 14, 20, -8, -12, 20, 7]
6053Gj7K7nJ0k0L2k7k9N0l2nk3K2PK0l3jONMK2k8K6mj2j0j2L8n1L2j0nK9J3j6
6088A0jQm2K9k9K2J1j6JJ3Pk7K0qJ6nj6KlOL1Mrkj5j1oK9l2K5K0m4J9j1JkjJ0
6126DPl1L0Kj8K6k2L5k9kkJ0lk2J9j6K2Ol5L3j1jPk6K5K3j8k0j0K2j3pK1J2j3
6161EK1j7rQm5L2J6l7N7l6l2M7pJ9j2k2L0K3m4joK0J0m1L0k6K8lKk1Pj7L3MPn
6197A8j4J1k9L8pj5J4j3Jj5oK8j7Pj9K4m9N9n0L3j0Qj0K6Pl3J3J8m1K2qJ1N%J8
6232B5k5MRl7lJ5J1J0Rj5Rj3Pk1M1k0j1J6rk4L6J0j1Lj9oJONJ4l9L0moj6L2l1
6269a7J2L2j0j6MMJ4Qk8Qk3oJ0J2MlK1k3l0N7k4Mj1J5j1k1N6k8J1l2M3l9J9j4
6303bK3j9J9om7O8l4J0J9j2k1j5M5nk8L2k7J1J3m3L7Jj5K8nj7j0oK7j8j7K0J3
$$ y = [7, -10, 17, 12, 22, 2, 34, 7, -22, 28, -4, -9, -32, -10, -3, 17, -16, -17, -11, -6, -2, 20, -8, 18, 14, 2, -8, -20, 18, -33, -1, -11, -16, 13, 26, 10, 9, 17, -25, 4, -25, -3, 8, -8, -7, 6, 13, -14, 6, -2, 14, 9, -7, -5, -8, -2, 29, 33, 24, 22, 7, -4, -10, 19, -13, 12, 32, -12, 7, -4, -3, -5, -6, 4, 11, -20, 10, 12, -6, 20, -2, 33, 4, 2, 0, 10, 7, -15, 4, -12, 10, 16, -19, 14, 3, 2, 9, -17, 8, 31, 13, -7, -17, 5, -8, -15, 6, 18, 5, 26, 9, 0, 8, -37, -5, 11, -26, 31, -5, -37, 10, 3, 22, 10, -12, 18, 41, -3, -4, -10, 10, 20, -21, 9, -17, 11, 8, 10, -11, -4, -21, 12, 16, 23, 18, 4, 15, -14, 24, 17, 2, 16, 3, 4, -11, -17, 11, -6, 1, -18, 6, -43, 16, -34, -1, -11, -3, -13, 13, 20, -13, 0, 18, -23, -1, -9, 2, 7, 7, 25, 0, 4, 13, -24, -27, -12, -1, 9, 18, 3, 12, -1, 6, -15, 26, 6, -5, 11, 2, -22, 14, 24, 13, 16, -3, -9, -8, -2, 3, 17, -22, 8, 4, -2, -18, 14, -17, -5, 27, 17, 1, 5, 9, 23, 31, 3, 11, -12, -18, -8, 4, 8, 5, 26, 3, -27, 30, 6, 10, -1, 14, 3, -18, 38, 10, 21, -11, 32, -7, 12, -2, 21, 2, 21, 15, -32, 36, 2, 12, 31, 19, -2, -17, 28, 23, -5, 27, 0, 11, 24, -19, 18, 19, 4, 32, 27, 10, 0, -6, 21, 3, -14, 6, 19]
6336A9k0k1L1k3M3j5k1oj3K3k5N8l0J5Mj7J9k7ROl6M9j7k6m%K9k6K9kj2PrR%K4
6372B4k3JMlk0J4j8L4k8K5Qj5j7j2K5MmNK3rKj6KL2j1l1K7j9J9k2J5j3J2j1k2
6407a8L2j7PrMJqj8K5j6J5K3rkk2J6J1nJ3j4J7mk5mK3QO%ql4Kk4N8j1Mk5j3L8
6445A7j4J7k9pNKK0j8J0MJj0k8L1k0J0L1jrm2M4k1K2Jk3JKJ7k3K2qj4J8J0j7N
6481FPj1jJ3Kj3pJ3pMJ8k8J2rMpqPK9m8kN2j3n%J3l5KJ3k7L8nP%RJ4j9jk9J3n
6522dJ5j1J8l1K6j5ljJ2lLrj4J4k2K0K5l5J5J4j2l8M5J3k0j2RpJ9roK9l0j5K8
6557HOm1L0JJ3Lol5J7RNk5N3l0Qj7llOk9J3MK2j2Ojjj4K9j0JpOpqoK9j3j9L8j8
6598Bj0rK2Jk5L8OpmmJpJ0l0J3nK0k6QJ1J8j9JLOk2Jj4J5k1K1J2rRj1j5K3RJj3
$$ y = [19, -1, -22, 9, -14, 29, 14, -7, -13, -26, -3, -28, 30, 0, 15, 19, 2, 21, -6, 3, 9, -27, 22, 5, -21, -25, -25, 4, -22, 7, 5, -7, 0, -9, 0, 0, 24, 1, 2, 6, 3, -17, -3, -21, 13, -15, 10, 18, 3, -14, -26, -1, 3, -1, 4, 27, 18, 20, 4, 6, 38, 27, -4, 23, 4, 23, 1, 16, 3, 15, 4, -18, 14, -3, 4, -5, -1, 0, -8, -26, -1, -17, -2, 21, 12, 10, -12, 4, 15, 10, 23, 9, 26, 22, -3, -7, 16, 24, 30, 30, 22, -12, -10, -34, 24, 13, 17, -8, -21, 17, 3, 20, -9, -16, -11, -9, 11, -7, 3, 7, 8, -2, -30, 1, -19, -9, 22, 21, 12, -30, 14, -7, 15, 16, -7, -6, -4, 13, -10, 12, 4, -10, 8, 18, 1, 6, 13, 2, 1, 14, 16, 3, -4, 9, 2, 6, 24, -4, 8, -1, 3, -4, -12, -5, 24, -24, -26, 26, 13, 8, 8, 21, -14, -12, 1, -26, 12, 7, 14, 14, 23, 37, 18, 17, -12, 1, -4, 11, 0, 18, -13, 13, -2, -5, -6, 6, 3, 6, -3, -17, -3, -25, -5, 20, -15, 0, 14, 2, -36, 9, 22, 2, -10, -1, -8, 11, 2, -4, 25, -5, -20, 8, 14, -27, 3, 4, 17, 20, 14, -21, -4, 5, 10, -15, 38, 8, 16, -1, -4, -7, -1, -30, -17, -13, 9, -3, 3, 2, 1, -13, 16, 6, 7, 0, 6, -1, -9, -15, 14, 1, -18, 20, 2, -8, -17, 5, 6, -19, 19, 25, 18, 14, 10, 11, 4, 14, -16, -3, -8, 12, -14, -6, 5, 23, 4, 5, 8, 14, -8, -7, -21, -6, -27, -6, 6, -3, 6, -5, -20, 3, 12, 13, 0]
6638@L0n0K7Ok3NlJ5qJ9j6%J0j2j0PJ2j0NPj5JK4jk9j1J2M6m6Pj4J9KRMl7N4l3
6676Cj2L6kl7mk0J1L4l5L4Ql3PK6k1J7k4JJ5mK2j7OLk5nRJ8Koj7M7k9Lrj1K8j5
6714D%k3J7J6j9pNnJ4J0j4pK8j4J3j3j0J0noK7k6klLJ2k7PJ7mOK0k2l3J4OJ6j5
6752a0J7J0l6N1k2k3J4rjQK6j8j6K3l7N1j0Nj1Pj5qJ3jj6J6j2rL9j1k9L2j9j4
6786a5j5L2J9m4K3Olj3J8oj7J0Om6O7l3K0kj2nQPk0J7j1J1k2K3K4k1j4L5l1Ol1
6821b9L2MPqk2PJ9j4Lk6K9QMkoj3JoqPK5m3J8RJ6%j5j0Qj4J1J2MoJ5nnj3J6j6
6861fk7O9nl3k1M2l4K7k7M1j9joK4pk1Lj1L4m2MoK9l2L5l7L1Pm1K8KJL1j8l2J2
6897fQKj5K3j1M0n3J0J1j1Kk3J2J8j7J1pK2j5Rk0PNNl5K5jk3L2J9pPl1MK7l0o
$$ y = [0, 30, -20, 7, 13, -10, -5, -8, 7, -1, 18, 2, 2, 12, 0, -10, -3, 9, -1, 4, 11, -4, -3, 21, 20, -9, -20, -8, 38, -8, -1, -15, 4, 6, 15, 19, -18, 36, 3, -9, 27, 25, -12, -16, -36, -25, 9, -26, 8, 16, -17, -10, 16, -5, 12, -12, -11, 4, 0, 22, 5, 11, 14, -11, -16, -7, 11, 13, 7, -10, 37, 8, 11, 2, -9, 19, 4, 4, -19, -2, 14, -5, -12, -7, -12, 2, 12, -2, -9, 19, 5, 18, 5, -5, 5, 0, -6, 21, -5, -7, -10, -7, 5, -22, -15, 2, -2, 4, 24, 2, -31, -17, -11, 5, -10, 7, 17, -19, 32, 10, -13, 1, -8, -9, -1, 25, 7, -9, 14, -23, 28, 18, 23, 12, 19, 4, -4, 9, 8, -8, 8, -4, -13, 26, 15, -14, 18, -1, -15, -30, 2, 21, -23, 0, 6, 3, -10, 8, 2, -15, -5, 1, -45, 22, -11, 9, 7, -5, -10, -2, 5, -15, 2, -9, 2, -20, 3, 27, 6, -8, 27, -4, 2, -29, 3, 7, 14, 6, -16, -9, 10, -4, -1, -27, 2, 10, 14, 12, 6, -7, -6, -12, -20, -13, 12, -31, -13, -4, 12, 12, -3, -13, -5, -19, -8, 4, 8, 2, 17, 12, 7, -6, 10, -6, -33, 36, 31, -2, -23, 19, -15, 12, -15, 26, 7, 6, 0, 24, 17, -4, -1, -12, 22, -20, -16, -22, 7, -25, 10, -27, 4, 11, -30, -2, 0, 1, 32, 14, -18, -6, 2, 4, -11, 12, 1, 41, -12, -2, 9, -2, 0, -23, -11, 7, -10, 1, -6, 16, 1, 10, -10, -3, 2, 7, -28, -3, -4, -27, 5, 24, 17, 24, -7, -3, 24, -6, -12]
6934a2rJ6J5k9J2qJ8j3Mj6NjOL2k3qJ0MkLOj1k0L0pk9K2k6K8j4J8j9J2qJ9mqK
6972eJ0j3J5J0k0J4j1KqK7Kl4L7j6mrNnKrMj2J9qJQpK4j7Mj1L4k0j6j5J4jJ9k7
7011a7K6j9%%pK1KJ3k1%J5j9QL5k0Klj5J0j3mkjOk9jN5l2J4k3J9%k0L6lOk3LN
7050Dj2%J0k2QOk8NL7k2J1nK8k4K4l8K3k2K4p%J5j6K3qk3L6j4j9K4k8LPJ1j1p
7086gj0OrLK7k0%KK0j9K1m0K1lkKj7J5L3k7Qj5J8k3J8Jrj6K0j2J8K0j7k3MJ4q
7123flL0k6j1J3J5k2NKk0QJ3K5j8Rk2jnjK2KoJ5j2K0Kk9K0l2pJ4OokKj9K6MoJ0
7163Ik6K3j3K4j6j3K6qJ6%n0J2K2l7L3K7j2l0L7l1K4j1PJ9m6rL6rj7K3l0J5J6
7196A1k2K6j3J4k9%OK3ql8L9k8K6lok8L4KJ6k9J3K9m3K1Nkj0k6K9%J6l3j9J3J2
$$ y = [-12, -21, -5, 10, -19, -7, -15, 3, -10, -6, -22, -17, -18, -12, 20, -3, -11, -1, 3, 1, 4, 10, -1, -21, 9, 2, -27, -5, -31, -3, -17, 1, -18, -6, -14, 5, 1, -7, -5, 5, -8, 7, 17, -3, 11, 0, 2, -6, 21, 23, -11, 26, 10, 6, -3, 2, -3, -1, -10, -6, -18, 1, -7, -6, 2, -5, 19, 2, 6, -5, 29, 9, -7, -22, -8, -9, 10, -17, 9, -10, -10, -10, -17, 4, 6, 19, -2, -2, 13, -6, 2, 37, 17, 19, 16, 1, 11, -2, -6, -8, -9, -3, -32, -33, 22, -10, 4, -19, 0, 0, -20, 16, 13, 19, -4, -1, 4, -8, -8, 2, -20, -12, -6, -34, -29, 8, -14, -3, -8, 20, -4, 20, -18, 5, -17, 7, 0, 0, 15, -1, 22, 14, -9, 27, 13, -6, 18, -10, -7, 0, 11, 0, -7, -17, -11, -20, -17, 10, -10, -10, -8, 12, -7, 14, -26, -5, -8, -10, -8, -25, -10, 23, -4, 4, -11, 7, -16, 2, 3, -6, -22, -2, -14, 4, 24, 7, -16, -12, 2, -6, -9, 21, -5, -16, -3, 12, -10, -5, -3, -23, -15, -2, 23, 5, 14, -8, -9, -14, -15, 7, 9, 3, 18, 6, 26, 28, -1, 19, -13, -20, -6, 0, -6, -8, -6, -25, 1, 5, -1, 9, -17, 6, -7, 17, 1, -12, 14, 6, 22, 22, -28, -16, 6, -31, 2, 29, 17, -13, 24, -7, 17, 6, 13, 32, -14, -23, 13, 4, -13, 10, -20, -5, 11, -11, 15, 2, 16, -13, -13, -7, 16, 8, -30, 9, -19, 7, 4, -2, -30, 4, 6, 22, -7, 6, 35, -8, 13, 18, 16, 6, -20, 9, 9, 25, -8, -27, -14, -2]
7231bj1J6QJ6k0%m3M1jOpqjJ6m0J2K6m6L3J7j7k0NM3l8RQJ1l0J2JKj2L1l0KJ8
7268Gkj5%j1NL1j4QqqJ9j5j5J1K5k2l%lj1M0k6qK9k1J0j4QPj6pJ9jrQmOjnJ4j7
7309iJ7k2K9npj6M%jK3k0J5LLj8J7j5Jl9M3j4J9mJ1k5j6K6kOJ2k1J7j2OPk4qQ
7347a1k0K3kj0K4J0l2mON0m6L3l9L8k4kJ6Nk9j1L8j7j1K5m0N0j7mJ1j2j7K5j6
7380a0j6J4OJ0rJ0L8n1MK4rl4L4k1JJ2qJ0J3l4j3L7rk4K4J0Jql0M8m0L3lJ2k4
7415b%NJ4j3j4J9k7NJ0J8pj8QMk3rM2Jj4opL7mk3NMqJ3r%Ok5nkmL6lnOjjRJ1k2
7459AJk8K0J3k2j3K2JJ1pj8J7nkL7k2j8QJ3j3RJ2mJ2k8QK1Jl0j6RJ4k6J6J9j0
7495Cj3J4j4K2JoqJ6Nk4oJ6oPj7J7k2L9mn6M3lK1o6P0m4K5J1j9J4J0j9kj3Pk5
$$ y = [-2, -13, 3, 11, 27, 7, 7, -36, 5, 4, 10, 3, -5, -6, 10, -30, -18, 8, -38, -5, 12, -5, -25, -20, 23, -15, -6, 2, 13, -17, -5, -4, -2, -14, 17, -13, -11, 7, 5, -10, -10, -21, -16, 15, 1, 9, 1, -7, 12, -3, -18, -7, 18, -4, -7, -7, -10, -21, 19, -7, -15, 14, -7, 3, -11, -3, 4, -12, -19, 0, -1, -10, -2, -6, 0, -1, -6, 8, -9, 8, -14, 15, 10, 3, -13, -9, -9, -10, 13, -7, 8, 11, 14, -4, 13, -2, -1, -40, 3, -11, 8, 4, 15, -10, -26, 0, -2, 4, 16, -5, 12, 0, 6, 13, -11, -19, -11, -31, -8, -10, -20, 4, 14, -18, -22, -16, 34, -12, 21, -18, 20, -4, -6, 10, 15, -14, -25, 13, -4, -15, 10, -30, 20, 3, -1, 10, -2, -19, 6, -10, -26, -12, -6, 4, -5, 5, 43, -8, -4, 20, 11, -23, 11, -10, -9, 3, -5, 5, 18, -16, -29, 8, -1, -25, -1, 9, 10, 2, -28, 20, -20, 13, 10, 22, -2, -2, 3, 17, 4, -10, 9, -18, -13, -3, 15, 8, -10, -2, 2, -21, -30, 12, 13, -1, -7, -14, 23, 19, -4, 1, 5, -3, 10, 1, 1, 7, -18, -23, -25, -29, 7, 4, -1, 5, 4, 3, 12, 23, 1, 2, -26, -6, 7, -15, -28, -6, -5, 6, -1, -19, -2, -7, -9, 28, 6, -12, -4, 9, -4, 5, 17, 13, 25, -3, 5, 26, 27, -3, -19, -10, 4, -22, -6, 13, 3, -10, 4, -10, 12, 13, 7, -1, 15, 20, -4, -10, 6, 0, 7, -10, 7, -15, 24, 20, -36, 7, 4, 25, -41, 29, -15, 10, 21, 2, 16, 26, 7, 5, -8, -1, -26]
7531b6J6K7Kqj1J3kK7m4J0L6n6%K8N%j7Nj5KL0kJ8m0OJ2rRj5joL8k7l2J3J0j0
7568a4K0qlnK4j7k6K2j0MJ1K3m5L8k3K8k7J4qk0L4%k0j1J3pK0Ll1M9j3pK2jl0
7603aNoNPJ1l2oK4j8K0rK1l4K3k1J0lMnpJ5mj9J8qj8K9LpnQJ4qj9R%K1j3J0jJ3
7644B6j0k3J1J8K3l1l1L0Mj5nL2m6M0j4j3K0m0N2o2M2j1L7l6J0K1j2k8NLk7L2
$$ y = [-26, -10, 17, 19, 11, 0, 13, 11, 38, -6, 4, 40, -16, -16, 12, 17, 17, 0, 5, -10, -8, 22, 20, 38, -2, 4, 16, 7, 16, 1, 0, -6, 32, 5, -27, -14, -4, -14, 6, -2, -5, -10, 14, -3, -29, -7, -17, -13, -2, 21, -24, 14, -9, 19, -8, 6, -2, -22, 12, 12, -8, -19, -6, -13, 7, 10, -21, 28, 15, 8, 30, 29, -1, 4, -2, 3, 10, 21, -11, -17, 7, -11, 9, 0, 21, -13, 10, -11, -1, -4, 0, -5, -12, 3, -1, -20, -2, -10, -28, 1, 4, -3, -8, 0, 14, 6, -13, -4, -4, 17, 4, 14, 13, 26, 16, -7, 4, 22, 45, 14, -17, 13, 17, 2, -3, 29, -17, 23, 9, -4, 16, -24, 28, -34, 8, -3, 34, -2, 8, 29, 17, -11, -6, -3, -30, 2]
$$ [...]
8191a
##END NTUPLES=NMR FID
##END=
