##TITLE=1H_Pr MaT
 CDCl3
 8 sc, 
 23.3.2023
##JCAMPDX= 6.0         $$ Bruker NMR JCAMP-DX V2.0
##DATA TYPE= NMR FID
##DATA CLASS= NTUPLES
##ORIGIN= UXNMR, Bruker Analytische Messtechnik GmbH
##OWNER= root
$$ XWIN-NMR		Version 3.5
$$ Thu Mar 23 14:43:50 2023 Russian Standard Time (UT+4h)  she@DPX200
##.OBSERVE FREQUENCY= 200.13135
##.OBSERVE NUCLEUS= ^1H
##.DELAY= (6, 6)
##.ACQUISITION MODE= SIMULTANEOUS
##.ACQUISITION SCHEME= undefined
##.AVERAGES= 8
##.DIGITISER RES= 18
##SPECTROMETER/DATA SYSTEM= spect
##.PULSE SEQUENCE= zg30
##.SOLVENT NAME= CDCl3
##.SHIFT REFERENCE= (INTERNAL, CDCl3, 0, 15.7039)
##AUDIT TRAIL= $$ (NUMBER, WHEN, WHO, WHERE, WHAT)
$$ ##TITLE= Audit trail, XWIN-NMR		Version 3.5
$$ ##JCAMPDX= 5.01
$$ ##ORIGIN= Bruker BioSpin GmbH
$$ ##OWNER= she
$$ F:/spectra/data/she/nmr/H-F/1/audita.txt
$$ ##AUDIT TRAIL=  $$ (NUMBER, WHEN, WHO, WHERE, WHAT)
(   1,<2023-03-23 14:42:59.01 +0400>,<she>,<DPX200>,
      <created by zg, POWCHK disabled, PULCHK disabled
       configuration hash MD5:
       00 E9 B6 7A A2 85 ED C7 34 08 36 98 17 FE 4E 26
       data hash MD5: 16K
       48 44 9F 63 33 BD 4F 32 6F 14 83 98 F8 84 52 88>)
$$ ##END=
$$ 
$$ hash MD5
$$ 4A 2A 2E 2E E4 C1 A4 56 2E DE 61 DD 21 AB 0C 48
##$RELAX= 
##$RELAX= 
##$RELAX= 
##$RELAX= 
##$RELAX= 
##$RELAX= 
$$ Bruker specific parameters
$$ --------------------------
##$DU= <F:/spectra>
##$EXPNO= 1
##$NAME= <H-F>
##$PROCNO= 1
##$TYPE= <nmr>
##$USER= <she>
##$AMP= (0..31)
100 100 100 100 100 100 100 100 100 100 100 100 100 100 100 100 100 100 
100 100 100 100 100 100 100 100 100 100 100 100 100 100 
##$AQSEQ= 0
##$AQ_mod= 1
##$AUNM= <au_zg>
##$AUTOPOS= <>
##$BF1= 200.13
##$BF2= 200.13
##$BF3= 200.13
##$BF4= 200.13
##$BF5= 200.13
##$BF6= 200.13
##$BF7= 200.13
##$BF8= 200.13
##$BYTORDA= 1
##$CFDGTYP= 0
##$CFRGTYP= 5
##$CHEMSTR= <none>
##$CNST= (0..31)
1 1 145 1 1 1 1 1 1 1 1 1 1 1 1 1 1 1 1 1 1 1 1 1 1 1 1 1 1 1 1 1 
##$CPDPRG= <>
##$CPDPRG1= <>
##$CPDPRG2= <>
##$CPDPRG3= <>
##$CPDPRG4= <mlev>
##$CPDPRG5= <mlev>
##$CPDPRG6= <mlev>
##$CPDPRG7= <mlev>
##$CPDPRG8= <mlev>
##$CPDPRGB= <>
##$CPDPRGT= <>
##$D= (0..31)
0 1.2 0 0 0 0 0 0 0 0.06 0 0.03 0 0 0 0 0.0002 0 0 0 0 0 0 0 0 0 0 0 0 
0 0 0 
##$DATE= 1679568178
##$DBL= (0..7)
120 120 120 120 120 120 120 120 
##$DBP= (0..7)
150 150 150 150 150 150 150 150 
##$DBP07= 0
##$DBPNAM0= <>
##$DBPNAM1= <>
##$DBPNAM2= <>
##$DBPNAM3= <>
##$DBPNAM4= <>
##$DBPNAM5= <>
##$DBPNAM6= <>
##$DBPNAM7= <>
##$DBPOAL= (0..7)
0.5 0.5 0.5 0.5 0.5 0.5 0.5 0.5 
##$DBPOFFS= (0..7)
0 0 0 0 0 0 0 0 
##$DE= 6
##$DECBNUC= <off>
##$DECIM= 32
##$DECNUC= <off>
##$DECSTAT= 4
##$DIGMOD= 1
##$DIGTYP= 9
##$DL= (0..7)
0 120 120 120 120 120 120 120 
##$DP= (0..7)
150 150 150 150 150 150 150 150 
##$DP07= 0
##$DPNAME0= <>
##$DPNAME1= <>
##$DPNAME2= <>
##$DPNAME3= <>
##$DPNAME4= <>
##$DPNAME5= <>
##$DPNAME6= <>
##$DPNAME7= <>
##$DPOAL= (0..7)
0.5 0.5 0.5 0.5 0.5 0.5 0.5 0.5 
##$DPOFFS= (0..7)
0 0 0 0 0 0 0 0 
##$DQDMODE= 0
##$DR= 18
##$DS= 0
##$DSLIST= <SSSSSSSSSSSSSSS>
$$ [...]
##$SUBNAM2= <"">
##$SUBNAM3= <"">
##$SUBNAM4= <"">
##$SUBNAM5= <"">
##$SUBNAM6= <"">
##$SUBNAM7= <"">
##$SUBNAM8= <"">
##$SUBNAM9= <"">
##$SW= 18.05172834244
##$SWIBOX= (0..15)
0 0 2 0 0 0 0 0 0 0 0 0 0 0 0 0 
##$SW_h= 3612.71676300578
##$TD= 16384
##$TD0= 1
##$TE= 0
##$TE2= 300
##$TE3= 300
##$TEG= 300
##$TL= (0..7)
0 120 120 120 120 120 120 120 
##$TP= (0..7)
150 150 150 150 150 150 150 150 
##$TP07= 0
##$TPNAME0= <>
##$TPNAME1= <>
##$TPNAME2= <>
##$TPNAME3= <>
##$TPNAME4= <>
##$TPNAME5= <>
##$TPNAME6= <>
##$TPNAME7= <>
##$TPOAL= (0..7)
0.5 0.5 0.5 0.5 0.5 0.5 0.5 0.5 
##$TPOFFS= (0..7)
0 0 0 0 0 0 0 0 
##$TUNHIN= 0
##$TUNHOUT= 0
##$TUNXOUT= 0
##$USERA1= <user>
##$USERA2= <user>
##$USERA3= <user>
##$USERA4= <user>
##$USERA5= <user>
##$V9= 5
##$VALIST= <valist>
##$VCLIST= <CCCCCCCCCCCCCCC>
##$VD= 0
##$VDLIST= <DDDDDDDDDDDDDDD>
##$VPLIST= <PPPPPPPPPPPPPPP>
##$VTLIST= <TTTTTTTTTTTTTTT>
##$WBST= 1024
##$WBSW= 4
##$XGAIN= (0..3)
0 0 0 0 
##$XL= 0
##$YL= 0
##$YMAX_a= 484197
##$YMIN_a= -331105
##$ZGOPTNS= <>
##$ZL1= 120
##$ZL2= 120
##$ZL3= 120
##$ZL4= 120
##$ABSF1= 10
##$ABSF2= 0
##$ABSG= 5
##$ABSL= 3
##$ALPHA= 0
##$AQORDER= 0
##$ASSFAC= 0
##$ASSFACI= 0
##$ASSFACX= 0
##$ASSWID= 0
##$AUNMP= <proc_1d>
##$AZFE= 0.1
##$AZFW= 0.1
##$BCFW= 1
##$BC_mod= 2
##$BYTORDP= 1
##$COROFFS= 0
##$CY= 11.3945322036743
##$DATMOD= 1
##$DC= 2
##$DFILT= <>
##$DTYPP= 0
##$F1P= 2.36226072786647
##$F2P= -0.459571619588291
##$FCOR= 0.5
##$FTSIZE= 0
##$FT_mod= 4
##$GAMMA= 1
##$GB= 0.15
##$INTBC= 1
##$INTSCL= 1
##$ISEN= 128
##$LB= 0.24
##$LEV0= 0
##$LPBIN= 0
##$MAXI= 10000
##$MC2= 0
##$MEAN= 0
##$ME_mod= 0
##$MI= 1.114404
##$NCOEF= 0
##$NC_proc= 0
##$NLEV= 6
##$NOISF1= 3.799351
##$NOISF2= 2.8
##$NSP= 1
##$NTH_PI= 0
##$NZP= 0
##$OFFSET= 15.70392
##$PC= 1
##$PHC0= -19266.98
##$PHC1= 12.20075
##$PH_mod= 1
##$PKNL= yes
##$PPARMOD= 0
##$PSCAL= 0
##$PSIGN= 0
##$REVERSE= no
##$SF= 200.130013532006
##$SI= 16384
##$SIGF1= 3
##$SIGF2= 2
##$SINO= 400
##$SIOLD= 16384
##$SREGLST= <1H.CDCl3>
##$SSB= 0
##$STSI= 0
##$STSR= 0
##$SW_p= 3612.71676300578
##$SYMM= 0
##$S_DEV= 0
##$TDeff= 0
##$TDoff= 0
##$TI= <>
##$TILT= no
##$TM1= 0
##$TM2= 0
##$TOPLEV= 0
##$USERP1= <user>
##$USERP2= <user>
##$USERP3= <user>
##$USERP4= <user>
##$USERP5= <user>
##$WDW= 1
##$XDIM= 8192
##$YMAX_p= 0
##$YMIN_p= 0
$$ End of Bruker specific parameters
$$ ---------------------------------
##NTUPLES= NMR FID
##VAR_NAME=  TIME,          FID/REAL,        FID/IMAG
##SYMBOL=    X,             R,               I
##VAR_TYPE=  INDEPENDENT,   DEPENDENT,       DEPENDENT
##VAR_FORM=  AFFN,          ASDF,            ASDF
##VAR_DIM=   8192,          8192,            8192
##UNITS=     SECONDS,       ARBITRARY UNITS, ARBITRARY UNITS
##FACTOR=    0.0002768,     1,               1
##FIRST=     0,             0,               0
##LAST=      2.2672688,     0,               0
##MIN=       0,             -331105,         0
##MAX=       2.2672688,     484197,          0
$$ Real data points
##PAGE= N=1
##DATA TABLE= (X++(R..R)), XYDATA
$$ [...]
681a2109J6447M861j8580Q060J1199j7080J522J6830j2784p317J6639o684j1331
694a0327J7102n64j7916J3431Q748k0178N311J7595j6021o345J8354p414j1871
707a0095J6391N38j6368R757P584j4216L551J1254j1267l218J1504n241n599R596
721D171k287p809P798J701q249N478M349r464J780Q779o846m139Q502j778o879
736d893O029K576p066K123N027n215j350N736j979l528L735L45l471K101J293
751A463k844J428J507l826Q29L994k869j889L846j435k998M138Q48m639K284L146
767B983m493n14N031j909l648L112J310k862K95J350j070J38N71q95J77N14n80
784d90N40L99j017M86R24j507oK098r77j922J633J182j807m27J565j09j039K81
$$ plain form
681 -12109 4338 9199 -9381 -1321 9878 -7202 -5680 11150 -1634 -8951 7688 1004 -10327
694 -10327 6775 6211 -11705 1726 10474 -9704 -4393 13202 -2819 -9164 9190 1776 -10095
707 -10095 6296 6834 -9534 223 7807 -6409 -2858 8396 -2871 -6089 5415 174 -5425 4171
721 4171 1884 -5925 1873 3574 -4675 803 5152 -4312 -2532 6247 -599 -4738 3764 1986 -4893
736 -4893 1136 3712 -3354 -1231 3796 -1419 -2769 2967 988 -2540 1195 1540 -1931 170 1463
751 1463 -1381 47 1554 -2272 -1443 2551 -318 -2207 1639 204 -2794 1344 2192 -2447 -163 2983
767 2983 -1510 -2024 3007 1098 -2550 562 1872 -990 -695 655 -415 -277 294 -601 -424 90 -490
784 -490 50 449 -568 -82 842 -665 -671 1427 450 -1472 161 1343 -464 -891 674 565 -474 -193
802a93O10l38o16O23O22r32m29J287l83j355J346J049k047m23K031m05j614R85
820a82Q73j040k72P03J23j84j71K04N57l81p43J067L41j452N64J299j748p77K300
839A081n19k195J672J222k553K7K505j147j528J763M50j540N12Q53o86j7M62l79
857a7J02J90m73L81L63j082K03J432j217j092K085K03k449R05K077j900r33K274
875A052n36k083J870R01k450M37K000j426r43J715k12j110Q89R7o48J015k86r26
893f44J262N2j691J492J014k525J83K580j823j517K730l17k607J764J367k406
909a086L04K126j513j222J776M44j180R5M77l01j10L47J69l47j43J84K5j48K15
928A12K15j80k07n79M32J393r87j515J769M63k468J421K082l028m92L466k026
$$ plain form
802 -193 417 79 -537 86 708 -224 -653 634 251 -1104 242 1291 -756 -1179 852 447 -1167 -182
820 -182 691 -349 -621 82 205 21 -150 54 611 230 -513 554 895 -557 7 1306 -442 -1219 1081
839 1081 562 -1633 39 1261 -1292 -1265 1240 93 -1435 328 778 -762 -250 603 -83 -100 362 -17
857 -17 85 275 -198 183 546 -536 -333 1099 -118 -1210 875 1078 -1371 -466 1611 -289 -1222 1052
875 1052 516 -1567 303 1204 -1246 -809 1191 -235 -1178 537 325 -785 104 201 -447 568 282 -644
893 -644 618 670 -1021 471 1485 -1040 -857 1723 -100 -1617 1113 796 -1811 -47 1320 -1086
909 -1086 -782 1344 -169 -1391 385 829 -351 -256 221 -80 -190 157 326 -21 -164 20 45 -103 112
928 112 327 147 -60 -639 -207 1186 199 -1316 453 916 -1552 -131 1951 -1077 -1569 1897 -129
945a29k253M045m5m161K375K240l369P64K744k998o12L110j824r89K776j697j927
962a950L268n54k804L181O43m357J776L235l439k69L500k556k512M111N68l546
978a705J296K118k580o31K822l78j763J026K14j592J365J471j961o50J789j090
994b49q76K523o84k444K339L44l385K657K819m935k62M989l248k608N821j142
1010A659n443M489J847n425K949L742o183oN766l728j981N225k531l724N121l64
1026A413m151M284P17n966L063M010n063L01M420m203j855N547j467l682L992
1041A360L85m504K275L105l194o00K654j711j469K644M01k152O69P01j472N83
1057c25J778j400j133J674m97j616K177J013l027N36K127k392M3L713k615l050
$$ plain form
945 -129 -2382 1663 1618 -2543 -168 2072 -1297 -533 2211 -787 -1399 1711 -113 -1102 1674 -23 -1950
962 -1950 1318 764 -2040 1141 1784 -2573 -797 2438 -1001 -1270 2230 -326 -2838 1273 1841 -1705
978 -1705 -409 1709 -871 -1502 1320 942 -821 205 419 -1173 192 1663 -298 -948 841 -249
994 -249 -1125 1398 714 -1730 609 953 -2432 225 3044 -1891 -2153 2836 -412 -3020 2801 1659
1010 1659 -3784 705 2552 -2873 76 3818 -2365 -2371 3395 -333 -2314 2911 380 -3344 1777 1413
1026 1413 -2738 1546 2263 -3703 -640 3370 -1693 -1392 3028 -1175 -3030 2517 1050 -2632 1360
1041 1360 1745 -2759 -484 2621 -573 -1173 1481 -230 -1699 945 1346 -806 -137 564 -908 -325
1057 -325 1453 53 -1080 594 97 -1519 658 1671 -1356 -820 1307 -1085 -1042 2671 56 -2994
1073b994M183M57l973K849K185m750N78L926k962q56L809k425k644L872l7k880
1089a662K527J13l208K212J725l106J078K214l216j37L369j927j452K924q25k627
1105a998K190J208k017L28J007j361j61J458r7p35N6J03j05j7M78M84r86p01J013
1124A47L47l93K19m08p20R12P8o62Q82j71j635J288J238j846L76J651j822n44
1142a063K529j017j777K318R6k573J214J598j914o8J560j213o73J323j35n18O64
1159C51m58p91J012N36p29N4J64n67M16Q46o26o90O01J41p66M48J070j223j010
1178a221J544N17j631O40J115j566j32J914j072j209J817j90j716J339O40j680
1194h91P35J099j611J92J285j298J01J744j657r82K355n48j832J975M26k505J184
$$ plain form
1073 -2994 1189 1646 -2327 522 2707 -2043 -1465 2461 -501 -1357 2452 27 -2617 1255 1218 -1662
1089 -1662 865 978 -2230 -18 1707 -1399 -321 1893 -1323 -1460 1909 -18 -1470 1454 629 -1998
1105 -1998 192 1400 -617 -289 718 -643 -804 654 557 -178 -122 -19 -124 -141 337 821 -165 -866 147
1124 147 494 101 320 -88 -808 104 182 -480 402 231 -1404 -116 1122 -724 -348 1303 -519 -1063
1142 -1063 1466 449 -1328 990 1086 -1487 -273 1325 -589 -657 903 -310 -983 340 205 -313 351
1159 351 -107 -898 114 650 -79 -25 139 -428 -12 834 208 -482 119 260 -506 -58 1012 -211 -1221
1178 -1221 323 840 -791 -151 964 -602 -734 1180 108 -1101 716 526 -1190 149 789 -891
1194 -891 -156 943 -668 -476 809 -489 -388 1356 -301 -1283 1072 524 -1308 667 1093 -1412 -228
1211b28J848k136k71J950j371j062K088j14j917J055Q77j249K92R02r49r5Q95
1228E15o52j42Q51n64p54J180R1j290P75Q42j289M0J319j024p39J564j68j580
1246a025R52R41j538P2J476q31r14J131M4q08P93Mq75O60L90r10L72O23j053K28
1266b68J008q49m40J307o78r43J375K04j619P10J000j206k46J308n96q28J011
1283B50P6q28N02L59o33K90L49n63R8L17l33J36L40n68j15Q40l61o64P72J81r91
1304e46M10P68p48m52Q63m9p28N77L30p34P2N52l18k38K81m3j86K23m5q6J77j59
1326g9RL39j82m33L98M02o56n5P29m49m79P09J70q59L58N47p04j92O84j78n83
1347e04M63K15l40l3L29j02j42J71j6L8kj38R7K73l30j93M67j14m49L69K22o01
$$ plain form
1211 -228 1620 -516 -787 1163 -208 -1270 818 704 -1213 -158 719 -530 -238 664 -285 -380 515
1228 515 -137 -279 572 8 -746 434 525 -765 10 852 -437 -397 922 -102 -841 723 555 -1025
1246 -1025 -73 868 -670 -598 878 47 -867 264 308 -500 293 297 -578 82 472 -438 -66 557 -496 -268
1266 -268 740 -109 -549 758 80 -863 512 716 -903 -193 807 -399 -645 663 67 -761 250
1283 250 326 -502 0 359 -274 16 365 -198 -100 217 -116 20 360 -208 -323 517 156 -508 264 445 -546
1304 -546 -136 632 -116 -568 295 246 -482 95 425 -309 -237 315 -3 -241 40 -3 -189 34 -11 -97 80 -79
1326 -79 -70 269 87 -346 52 454 -202 -257 472 23 -456 253 423 -436 -78 469 -235 -427 257 79 -504
1347 -504 -41 174 -166 -199 130 28 -114 57 41 79 77 -61 36 309 -21 -214 253 139 -310 59 281 -320
1369c20L5O14l42l99N72P9n97J31O11m33l32N81m9m12K49K83l95j8L48j83j26
1390a03K08j47L9K18l05p9M43k64m39O16J42p90L86N81p94j66R85m58p03Q21J82
1411C73r06M01O06p21p6O31l17k27M65j20k58K13K0j90K97o7l82K44L14m51j5
1432a66N51l90m57O69P5p17L15O43q29k57R52r7q32N87L98q94J92Q13n48l74P08
1453C42l02m53P18n1n90M81Q1o69N94M01r96K42P88j050r7J249p00p15J118l0
1473C61j130R54N87j158N3Q43o10k01P85l61n20M63Lk00J90J7k66J12P4j12J82
1494F6J60m11p5L17O2k25J50K07m22j36N80N1o69L09L94q76J40R75n18n69Q10
1515C20j03q11Q96L80j017K03M81o66J56P45p44j34N67n29k02J003m12p47Q42
$$ plain form
1369 -320 -285 329 -13 -412 160 239 -358 -227 384 -49 -381 200 151 -261 -12 271 -124 -142 206 23 -103
1390 -103 105 -42 -3 215 -90 -169 274 10 -429 187 329 -461 -75 506 -288 -454 531 73 -630 191 373
1411 373 -533 -132 474 -247 -323 308 -9 -236 229 109 -149 64 84 -106 191 124 -258 -14 300 -151 -166
1432 -166 385 -5 -462 207 282 -435 -120 523 -306 -563 389 292 -540 47 445 -449 -257 556 8 -366 342
1453 342 40 -413 305 254 -336 145 226 -443 151 552 -444 -202 586 -464 -561 688 -12 -727 391 361
1473 361 -769 185 772 -386 -333 510 -100 -301 484 123 -397 66 69 -131 59 76 -190 -78 -4 -116 66
1494 66 226 -185 -260 57 119 -106 44 251 -171 -307 273 324 -345 -36 358 -518 -378 597 79 -490 320
1515 320 217 -594 302 682 -335 -132 349 -317 -161 584 -160 -294 273 -256 -458 545 133 -614 228
1534B28k6q36Q33M98j210J42Q39n40k65R15l25o94M89J77k48N2J85l39q0J04J09
1555HJ37j46o2m8KJ31J48q7l8j20k06K11L17l04q5L60n36q8R96l18p68P27Q4r27
1579f12O60P24j130o0Q60o54k38J062m37p34P10j18m74P37M0q41M76K45o90N21
1599D7N90r59K4P92o46k62R80l31p15M58K55n17K78L51m89j36K88P7k0k4Lr2j38
1622a86N9L80j44k57L7L9k4J78%j48O7r1j50M97j19m63M44M2n28M18M16o38j3
1645a84O61o03k68Q47j95p34N59Q5n41M13J97m73J19J98l49L28K63m73j13M31
1665A68k95m6N73l44l81M41P4l84K66K65n10l6L19p7p4O2k4p9NjP2R3k02N1J83
1690A19k41L3K78k22j48K50p3n8O0Q9r3M4j38O7K33k85k7K22j19k13L79Nk98J5
$$ plain form
1534 228 202 -634 199 697 -513 -371 468 -72 -337 578 253 -441 48 225 -23 29 214 -125 -205 -101 8
1555 8 145 -1 -63 -111 -109 22 170 83 45 -75 -281 -70 247 -57 -142 218 -318 -406 590 272 -496 231 315 -612
1579 -612 48 772 -358 -418 442 -212 -450 612 175 -559 151 33 -441 296 336 -505 -29 216 -474 47
1599 47 637 -322 -298 494 -152 -414 566 235 -480 -22 233 -284 -6 345 -144 -280 8 85 65 41 44 -48 -186
1622 -186 -127 253 109 -148 -111 -72 -96 82 82 -66 1 -90 -240 257 138 -325 119 161 -367 51 467 -171 -184
1645 -184 477 -126 -394 453 258 -476 83 168 -373 40 237 -236 -117 81 -268 60 323 -150 -263 168
1665 168 -127 -173 400 56 -325 116 190 -194 72 337 -173 -209 110 33 -41 21 -3 -82 -77 -78 -6 87 -115 -64 119
1690 119 -122 -89 189 -33 -181 69 -4 -62 -2 87 -6 38 -100 -33 200 -85 -112 110 -9 -222 157 162 -136 -121
1714a21K09j73K7K89k22k49K40M9j50M4K2L2k5l9Q2J56k48m3K50p1k43K04R1j45
1738c4J5J25j26M5k0P0m1j18J4J18r5j28K17k0k59J49K47k39o7K60q5j42J77K1
1762H4j96J25P2p4K3O4n3m4J4KO8l7k19Q7K57k65o3K99p2k44J63R2j57qJ88p1
1788C5j73J34Ln1M4O9k9q0O5N9Nj01%J6np9J37L7p3j41K10N1j99O2Q8j30q4K21
1816I1q8j11J27O3j74RJ77m9j55J52J4n8m4K6K5j5j5n2J20l8j29J91J3j54JJ86
1842A13j54j11K26p3k03J96J21k17PK42p5r7J07j0p8k0N0l6JL6r4J67q8m3j3J26
1868H0j56Q8J03j70j14J97kk10J20J72j40n6J67pj25MJ62j89OJ71r0r7J32lp3
1893c0N3l4J0M2k8j05J51k1j25M7J27j62l1K38j04k71L07Pj97J30J11j77l0J49
$$ plain form
1714 -121 88 -85 -58 231 9 -240 0 49 -101 -57 -35 -3 -28 -67 15 171 -77 -120 130 59 -184 20 111 -34
1738 -34 -19 106 -20 25 5 75 34 -84 -70 48 -47 -175 42 22 -237 -88 159 -80 -147 113 28 -114 63 84
1762 84 -112 13 85 11 34 98 45 1 15 17 85 48 -171 -84 173 -92 -155 144 72 -172 -9 83 -74 -82 106 35
1788 35 -138 -4 -1 -52 -8 61 32 -48 17 76 81 -20 -20 -4 -9 -88 49 86 13 -128 82 133 -66 -4 84 -46 -130 91
1816 91 3 -108 19 82 -92 -83 94 45 -110 42 56 -2 -46 -20 5 -10 -25 -77 43 5 -124 67 80 -74 -73 113
1842 113 -41 -152 74 1 -202 -6 115 -102 -95 147 72 -25 82 72 -6 -26 24 -12 -11 25 -69 98 10 -33 -46 80
1868 80 -76 12 115 -55 -169 28 26 -184 -64 108 -32 -88 79 72 -53 -49 113 -76 -70 101 11 -86 46 43 -30
1893 -30 23 -11 -1 41 13 -92 59 38 -87 -40 87 -75 -106 132 28 -243 64 71 -126 4 115 -62 -92 57
1917E7M4k09J45K6j38O7K5l0j3L9p5N4N2r1j4J73j44o1K06o3j60O4J70j77p8K02
1943G1m1j03R4M6j31kJ64n8j20R8N5j52N7O8p1N0J1l4m4Q2n9m5L5K8j01J82k2
1970E8j46R7R4k34P9J94j45j68K82K1k35J60J05k51J9J93j32o1R9j5j03J07m3
1993b5r8J67k2j14J48l0j07L6J32j85n3K77j17j03J25L7j20L4J75j27j10J65l9
2016D6j56Q9J32r0j18R9l1l2O9O3j44O5K8r1O5P4j07mJ38j65k1K36j48j85K41
2041E3P6k87K10P1k66K3K61j69j03K12n1j59J33O0p3K7m0l9O7jm9N0l2p8N9J66
2067A21j15nO1o2o9M7J38q6j5nQ7k44J09J79j68q2R0R7j82Q2J25j80j3J51p5q1
2093i5J50m5j28J34k8p4J69m8r3J32L8j72R7J35k55J9K00j17j13K10p2k07J51
$$ plain form
1917 57 101 -108 37 63 -75 -8 17 -13 -26 13 -62 -8 44 -47 -61 112 -32 -93 113 50 -110 -46 124 -53 -131 71
1943 71 30 -73 21 67 -64 -66 98 40 -80 18 73 -79 -22 46 -25 25 36 2 -42 40 -19 -64 -29 -1 -102 80 58
1970 58 -88 9 103 -131 -52 142 -3 -171 111 132 -103 57 162 -89 -70 123 -9 -70 29 14 -89 18 -25
1993 -25 -123 44 22 -92 56 26 -81 -45 87 -98 -151 126 9 -94 31 68 -52 -18 157 30 -80 85 46
2016 46 -110 -21 111 21 -97 2 -29 -61 8 71 -73 -8 20 -71 -6 68 -39 -43 95 -70 -91 145 -3 -188 53
2041 53 129 -158 52 123 -143 -120 141 -28 -131 81 30 -129 4 64 -9 18 -22 -61 6 5 -44 6 -26 -104 -45 121
2067 121 6 1 62 0 -69 -22 116 30 15 10 97 -147 -38 141 -27 -109 -19 78 -104 -22 103 -77 -90 61 -14 -95
2093 -95 55 10 -118 16 -12 -86 83 35 -58 74 112 -60 37 172 -83 -64 136 19 -94 116 44 -163 -12
2116a2J04j00j25J74j26%O0J8Q9j26o2L4R5p4M8K8o5M6L4J5l1k7o3K5L5k5Q3j8
2144C4j15O9L5r7N4J90j45j86J91Mj45J44R6j91K6Q5p4L4L5q3nJ15o5k1J18r5
2170Hp9J00m9m4J32l1j28O3J04j11n9J21r1OJ6O0k0m4N9No8L9J02p2p0O9K8r0
2198d4l4J26Lo2K5nJ9qp3Q0o1j0j7J63j24r9J73j9j79J98Jj40K5R8j3j13J29n0
2226a1l9MM6M6k0mpM7o1j4O2pr4M5O3j13%J03m2j22J59j9o1M9KJ0r5O9J21j49
2256c2l1J03l4j3M2J1n6j15Q0R0m3m4L2J4m3L3K2k5o3L4J04k1j08Q7%j22Q1O4
2284D7p5o5J29j0j17J00K4p4OP4J0p6K9o3J10r6l6J31k5k7L6P8j90l3J18l2r5
2311a22J65nm1m4Q1L9j61Q7J2l0k7K3N6p4K6R1o8l7kL4M1n8p3J11j9r3J12M6q3
$$ plain form
2116 -12 92 -8 -133 41 -85 -85 -25 -7 82 -44 -106 -72 23 -51 -3 25 -40 6 40 55 24 -3 -66 -41 -6 -31 52 34
2144 34 -81 -12 23 -74 -20 170 25 -161 30 34 -111 33 129 -62 -36 49 -25 9 44 -39 -44 71 6 -15 103 8
2170 8 -71 29 -20 -64 68 37 -91 -28 76 -35 -94 27 -64 -58 -42 18 -2 -46 13 18 -50 -11 91 19 -51 18 46 -44
2198 -44 -78 48 51 -11 14 9 28 20 -53 27 -34 -44 -61 102 -22 -121 52 33 -146 52 53 -87 -62 36 23 -90 39 -11
2226 -11 -50 -46 0 46 26 22 15 62 1 -13 49 42 -52 -7 56 -57 -57 46 4 -118 41 22 -39 10 12 22 -73 -4 117 -32
2256 -32 -63 40 6 -7 35 46 -10 -125 -45 45 2 -42 -10 4 -39 -6 16 -9 -72 -38 66 45 -63 24 24 -98 -17 47
2284 47 -28 -93 36 26 -91 9 33 -41 -35 39 49 -27 2 -61 49 -47 -83 48 23 -4 32 110 -80 -113 5 -27 -122
2311 -122 43 38 -3 -47 34 73 -88 -1 11 -19 -46 -23 33 -41 -15 76 8 -29 -31 3 44 -14 -87 24 5 -88 24 70 -13
2340a3r6J58j4j35J16O0j20J5J21j00j05J45K4j51P8J19j35j7O0L1p7M3k0QK9
2365B4m4j2K9qk7J04%j62R2Q5j59kJ90m6k13J97N5j49nJ00k4r5P3L4j51Q4K6k2
2393b6Pj1J8n9Q8o5M4K7o3j5J42q8p8J09Q4j78k7K38j43j42K67qk38J77P1k43
2419a12J13J51k06l3J93j28m6J04q8l5O6L2j43J78o6r1J19L0j58O2J68j12j46
2442a48K09J1k16J97O6j50l5J60l0j44J13J06j92QQ5j5r9O6Po2P3K5j06O5j2k4
2468d2M8J26j90K7J88j94r5K69m3k55J68K25m33J66K76l19j26M04j90j87K79q8
2490A4j73J57O6j30K6J47k47J34J05j91J03J60k74j0K56r6j77J56P7k40R4J92
2512A49j54o1N4O0j36M4J74j55j25R7J01j11J9J76j65m2J41k0r9J25o1j50K13
$$ plain form
2340 -13 -109 49 35 -100 16 76 -44 -29 92 -8 -113 32 56 -95 -17 102 -33 -50 10 41 -36 7 -13 -5 24
2365 24 -20 -32 -3 -11 -38 66 66 -96 -4 81 -78 -80 110 64 -149 48 103 -46 -51 49 25 -70 3 37 -114 -30 -4 -26
2393 -26 -19 -30 -12 -71 17 -48 -4 23 -40 -55 87 -1 -79 30 114 -64 -91 147 4 -138 129 121 -117 60 131 -112
2419 -112 1 152 -54 -87 106 -22 -68 36 -52 -87 -21 11 -132 46 -20 -111 8 38 -120 -58 110 -2 -148
2442 -148 61 72 -144 53 119 -31 -66 94 64 -80 33 139 -53 -45 40 25 -74 -8 -1 -63 10 35 -71 -6 -18 -42
2468 -42 6 132 -58 -31 157 -37 -132 137 94 -161 7 232 -201 -35 241 -78 -204 200 10 -177 102 14
2490 14 -159 -2 64 -66 -40 107 -140 -6 99 -92 11 171 -103 -113 143 47 -130 26 103 -137 -43 149
2512 149 -5 -66 -12 48 -88 -44 130 -25 -150 -53 48 -63 -44 132 -33 -75 66 46 -53 72 11 -139 74
2535G4mj82K45kl19J78J98k92J05K36l54p3L76j68k19L02pk99J79J39k35O7J35
2558H0k54Q5J57r8K4N7q8q2K58j00o5J49r5j40J57O9k04N1R2n4rQM5r0m2Q4J05
2585A00j43j9J93j17j71K04P5k02J24N1j99N5R0o2l1J10k12J49J49k23k7K99k27
2608c4j90L23r1j79K94K2l38J37K47k95L2K52k25o2J50k4o8J33p7n1Q5n1p4J92
2632A08j29q6K13n1r2J6L0n9K0R0n5q9K4N9k1qrJ13p1j30J83M0j64P9P3j65l3
2659a14K02p6j21J92l9r5Q6mj07J21q5l1J56J2j83J62K5k45J08K04k26j31K53
2682F4j02n3J32M5j37O1j6L6p5Q8kk1n5l4J35n8o8J06K5j47J7J22r6O6L9o7l4
2709b9L0mM4m3o3J00J3r8RJ45j62nJ79r7j11P7J03j68Q8N7q5k8R2lQo4l6M4O0
$$ plain form
2535 74 70 -112 133 131 -188 -10 188 -104 1 237 -117 -190 186 18 -201 101 94 -205 -26 113 -122 -55 80
2558 80 -174 -89 68 -30 -6 51 -37 -119 139 39 -26 123 28 -112 45 114 -90 -39 53 -1 -10 -2 43 -47 -89 -5 100
2585 100 -43 -62 131 14 -157 47 122 -80 44 95 -104 -49 41 -21 -52 58 -154 -5 144 -79 -106 193 -34
2608 -34 -224 99 8 -171 123 145 -193 -56 191 -104 -72 180 -45 -107 43 19 -49 84 7 -44 41 -10 -84 108
2632 108 -21 -107 106 55 -37 -21 9 -50 -30 60 5 -84 -60 -1 -22 -30 -39 74 3 -127 56 96 -68 11 84 -81 -114
2659 -114 88 12 -109 83 44 -51 35 31 -76 45 -40 -71 85 97 -86 76 101 -144 -36 168 -58 -189 64
2682 64 -38 -91 41 86 -51 10 -6 30 -45 43 41 20 -35 -69 66 8 -60 46 71 -76 -59 63 -33 33 72 5 -29
2709 -29 1 -3 41 -2 -65 35 48 -50 -41 104 -58 -63 116 19 -92 -15 88 -80 8 65 -20 -48 44 41 49 -15 -51 -7 53
2738E3j58J13N0j05K6J19j64o7J91l9r8R5K8p7k7J35N3j12o3J40l4Qj01P7k0o9
2764d6Q3L3p3l8R8q8k4L8M2r2k0P7K3o3K6M7l4l0N3J9p7K3J01j0j22P4M9q6RP9
2794G1p4p2Q9j2l0J9l5L6Mo1J4L5ml0P9j4p4M6R7j66O9O8l4j04O7M1n2J4L6k4
2824am6Q7m1J2l4L2kM3m7J0mj3l9M3M9j08M0J18q1l7K2R5j86J24R5j80J1J26j15
2853b7o7J25P0j55L8N0l6qoK1jOl0JM7p0K7Q1r8m6R4K9j19J9J68j33m6J39K9j83
2883h1Q1R6j94N5J09r8j0M1J4j8rJj5j7M3KL6n4k9O5l3o5nJ26l5o7P8J02j57q6
2913a24K22q8j24J35M9j74O8J55j42m4J17Rj45N6M4j3L6k6n8Q1o3K5O1n0o1J3
2939d1O9o6j7J52j15j35J91O6j96J02J38j51p0P6P1j43kM9l2k5K8R7m4n9J3J6
$$ plain form
2738 53 -105 8 58 -47 -21 98 -66 -133 58 19 -79 16 44 -33 -60 75 128 16 -47 93 59 67 -34 43 23 -46
2764 -46 37 70 -3 -41 57 -31 -55 -17 25 -67 -87 -10 13 -50 -24 23 -11 -41 12 31 -46 -23 78 68 -54 20 69 -17 -8 71
2794 71 -3 -75 14 2 -28 -9 -44 -8 -4 -65 -51 -16 -20 -50 29 15 -59 -13 84 -82 -13 55 21 -83 -16 25 -27 -13 23 -1
2824 -1 -47 40 -1 11 -23 9 7 50 3 13 9 -4 -43 0 49 -59 -19 99 18 -19 3 98 -88 36 131 -49 -38 88 -27
2853 -27 -94 31 101 -54 -16 34 -2 -10 -16 5 4 10 -20 -19 28 -42 -15 66 -32 -78 16 45 -74 -55 113 -20 -66 73 102 -81
2883 -81 0 96 -98 -43 66 -32 -42 -1 13 -5 -14 -13 -28 -45 -2 0 36 -18 -47 18 -15 -80 -85 41 6 -61 17 119 -38 -124
2913 -124 98 10 -114 21 70 -104 -36 119 -23 -67 50 59 -86 -30 14 1 37 11 -47 34 -29 -4 57 7 -54 -41
2939 -41 28 -38 -55 97 -18 -153 38 104 -92 10 148 -3 -73 3 74 -69 -71 -22 -54 -79 -51 46 2 -57 -44 -28
2965b8N7k6n0Q4l1n6J35n1n6rJ34j17j10J79L4j74P5Q4j61L0J89j00j67J12R4
2990G1j67P6M9r3N1N1j08O4O9j05j4P0l0kP9k8j17J31O3k14J21J08j58n4J31J7
3016F1r5j1J22j45L8L3M0j07M0QjK4O0l0o2Kj7KR2q5L6M5o6m9P6N2j22L6Q7j51
3046h7o3K50j21m9J26N1k02J12J17j87J6R4p3n3J35n1m4L4L1j6j8j3l2M7Jo1R0
3073C4L7j06qJ17j12PK9nl1m1J04J1r5K8J3oK1NM2j29J19nn4J5J27n6p6N8p7N3
3103A9N1p2l3R9o7m8J38o9j46J27K8j27O5J07j62oJ41m1o2J11j6r2L7L6k0K9p2
3130d5Q0k8n9N6R4j28l5J33p2r0R8N5r8n7J21J5mj9l3NPo9O2L7o9L2N8j44J17
3159B0N2n3m2Q7m8k6M6n0n9O0L4n7J18p5n8Q0Pj19Q3mJ3k1N6n3k7J13j11n6Q7
$$ plain form
2965 -28 29 3 -47 37 6 -50 85 34 -22 -31 103 -14 -124 55 89 -85 -10 74 -87 -57 132 32 -135 -23 71
2990 71 -96 -20 29 -64 -13 38 -70 -6 63 -42 -56 14 -16 -18 61 33 -84 47 110 -104 17 125 -33 -87 44 61
3016 61 -34 -45 77 -68 -30 3 43 -64 -24 -16 -17 7 67 37 -25 -23 -40 -38 54 -31 5 50 -16 -65 11 63 -59 -23 64 -87
3046 -87 -150 100 -21 -70 56 107 -95 17 134 -53 -37 57 -16 -69 66 15 -29 5 36 20 2 -11 -43 4 5 -56 34
3073 34 71 -35 -43 74 -38 -31 -2 -7 -38 -79 25 36 -59 -31 -18 -24 -3 2 44 -85 34 29 -25 -10 117 61 -15 43 -34 19
3103 19 70 -2 -35 64 -3 -51 87 18 -128 -1 27 -100 -35 72 -90 -96 45 4 -58 53 37 -55 -18 18 -2 27 -45
3130 -45 35 7 -52 4 98 -30 -65 68 -4 -94 4 59 -39 -96 25 40 36 17 -16 -11 -4 -73 -11 26 -43 -11 47 -97 20
3159 20 72 19 -23 64 16 -10 36 -14 -73 -13 21 -36 82 7 -51 29 36 -83 0 -4 9 -12 44 -9 -36 77 -34 -90 -3
3188cL8l5Qk1P3mr8OQ0J1o0ork2J8O5j18%R0l5mK3O4o5rJ1k1O9m5j5MK4PL7j6
3223D2m1L7k7l7M2N5n7l1M6J7q4M3j8l7P0p8L0N7q1L0Qm0j9Q3on2L8O3q2j3Q1
3254C9p2m6J04on5J8K9Pj3l2J3M7q0O9QK2o4M9o0nL2M2k3%j00R3l6J1L3L1j38
3285h3M8J04m7k8OJ2j14P4PLoQpj3L1j3j7K0n4L8N1j9k0N7m6p9J42l5n8P6K4l
3317E9j18J16Qj12N1j6jML5m1K5k3nN0k7l7J2K4n2M2l0J1K6k1O7m7p2O5N6j05
3347e6P1K6o5NR0q0l6N1M3n1k1KM8p4K4K6l8ML6J6m7O1n4J8L5p2PP3r6K9Q0p8
3379b3JO8r5j0mJ12q1mJ4kqJ00k3j10M6M1l2o1J13m2JK2m3L6l0M5n9N0j0Jl1J6
3411bj7L6K0l0p8P7mn3M7K3q0K8P2m8q4N5jk7O0J2j8N2j7p2M9K9n1k3P7r2N3P7
$$ plain form
3188 -3 35 0 8 -13 60 56 -42 -36 44 55 -5 -11 -20 -42 -24 41 -77 -77 13 -22 -26 -3 61 -4 -13 -2 -23 46 1 -14 -10 14 21 58 42
3223 42 1 38 11 -26 16 71 14 -17 29 46 -38 5 -13 -50 20 -58 -28 29 -52 -22 -14 -54 -73 10 4 -48 -10 53 -29 -42 39
3254 39 -33 -79 25 19 -36 -18 11 18 5 -27 -14 33 -47 22 30 52 -12 37 -23 -28 4 46 23 23 -77 16 -20 -9 24 55 -83
3285 -83 -35 69 22 -6 0 12 -102 -28 -21 -18 -24 -16 -23 -36 -5 -18 -35 -15 -69 -31 20 1 -19 38 -8 -87 55 20 -38 38 62 59
3317 59 -59 57 65 -47 4 -12 -13 -9 26 -15 10 -13 -18 32 5 -32 -20 4 -48 -6 -36 -25 1 -20 47 0 -72 -7 49 -56
3347 -56 15 41 -24 -19 71 -9 -45 6 49 -2 -23 -21 27 -47 -23 3 -35 -31 5 21 -26 35 -19 -1 34 -38 -31 42 -54 -25 55 -23
3379 -23 -22 46 -49 -59 -63 49 -32 -36 -22 -24 -32 68 45 -65 -19 22 -10 -71 42 0 1 23 -20 16 -14 31 -28 22 12 13 -18 -2
3411 -2 -19 17 37 7 -71 6 2 -51 -4 19 -61 -33 39 -9 -93 -38 -39 -66 -6 6 -12 40 23 -49 0 29 -22 -45 32 -60 -7 70
3443G0m7p0N1Om5L9L9q0Q0j8l8l8Q2kp9O6n3N9r%j7k9NL4j2QNnKk5lM8%p8%O7
3479A3l0qN5P6r9p2P4j9o0N4L2m4k0J24p7k7J2Pm3Q1o3K5J9k8M2j2Ol8M3j9j21
3510a17J28Ln8L5NRk7L3p3NM8MoM7o7K7N2j5o3P3n6O0j4NJn7P9m8k2NO6m3k3K0
3544A6j0J4j4J6k1j7J4L7j15RR7k4n1N1ol6O4J3rj2Q3j02K4K8n8J7ol9O1Lr9N8
3576a4R9j09L8L9n1q9J27j3k3rj1k0%M1k8J06l2m1M6n4J1l0K9l6J3P6m3Nl9Jl
3607a4O2m1k1O3r4M4k2r0N6Q4n1k0O8j9o9Q6J9n8J9P9n3m4lL2o7N9J5m4QQJ5P1
3639G8q5k1L3K2rqk2Kj3N8m9J1k2Nj0MN8ll4l6R7n3L4kK1j07P4k3MMnj4q7P7K4
3674Cj8JL3m9j3nM6J5k0J6O7n7l5qJ23p4k5jRj4L0k5j9L5o0K4J2J1L2p2KlJ9l0
$$ plain form
3443 70 23 -47 4 10 -35 4 43 -37 43 25 -13 -51 31 29 -50 16 -37 22 13 13 -4 -33 -28 6 -6 2 7 2 4 -21 -24 24 24 -54 -54 13
3479 13 -17 -25 30 106 7 -65 9 -10 -70 -16 16 -28 -48 76 -1 -28 -16 -9 -52 29 -34 -9 10 -18 24 12 18 -20 23 4 -117
3510 -117 11 14 -44 -9 -4 5 -22 11 -62 -57 -9 -5 -11 36 -31 -4 48 33 -30 43 -13 47 33 38 39 -18 61 13 -9 -4 62 19 -4 16
3544 16 6 20 6 22 1 -16 -2 35 -80 -71 26 2 -49 2 -4 -40 24 37 28 16 99 -3 21 49 -9 8 2 -37 24 27 -72 -14
3576 -14 85 -24 14 53 2 -87 40 27 4 -5 -16 -36 -36 5 -23 83 51 10 56 2 13 -17 12 -24 -11 65 22 27 -12 -11 -14
3607 -14 48 7 -14 49 -45 -1 -23 -113 -57 27 -24 -44 24 5 -64 22 41 -17 2 81 28 -16 -19 13 -54 5 20 -24 -16 -8 7 78
3639 78 -7 -28 5 27 18 10 -12 -10 -23 35 -14 -3 -25 -20 -30 -26 32 29 -5 -41 56 3 37 35 56 -51 23 0 4 8 3 -11 -98 -21 3
3674 3 -15 -14 19 -30 -43 -48 -2 13 -7 9 76 19 -16 -24 99 25 0 -1 8 -6 24 -1 -20 15 -45 -21 -9 2 34 -38 -36 -39 -20 -50
3708e0L1m3RM0m9P7n1KKP4l1J9n0L3l7l9N4Pj4J5rql8O6Lr4P8L%l4qJ6k1j6P1
3743Hk1K4l4N4n1pJ8J8nn6P0m2J4M0Qm6J4k6J9k4K3o7N1RJ0Jm4L1l6N5k8J9N1
3776E0j17N0R6n7k5l%N2n7LK1L8o1Pj6L5n8O2J0k1P%m9N0j2m6J0L0k9O5q3M4j9
3809b3j8lR1k8o5M1l4k6O0k7P5J0k5j2m8J4Mj7mN0l0L1o7N1k0K1J6m6M9j3j8Q4
3841G3o6n1K8L7n2K1N3Lp7K8J2k3n8P8k2J7m3K0j8N2L2n7j3M2L%J8m9%L3o6N2
3873GK1M4r0M9n4l4Q9K2p7J8O6m1l2N9p1J6mk7J8J0J2k3L3pl7L9k8J6M1q1J05
3904E9p0l5L8j2m9J19o8l7J13j5p3MN7J2p9L3ooj1N1k4n6M2Lj1oJ4JK2j5J0n2
3936d7N6j4J2l2j4j8R7n8j8K9j2m2P7K4o1K5K5k8l3R8l9l7M1Pp4nL3J5k2J3J8
$$ plain form
3708 -50 -19 -62 -53 -13 -62 15 -36 -34 -32 42 11 30 -20 13 -24 -63 -9 -2 -16 -1 -10 -18 -56 10 13 -81 -3 0 0 -34 -42 -26 -47 -63 8
3743 8 -13 11 -23 31 -20 -27 -9 9 4 -52 18 -24 -10 30 38 -8 6 -20 -1 -25 -2 -69 -18 -9 1 2 -42 -11 -47 8 -20 -1 50
3776 50 -67 -17 79 22 -3 -6 -6 46 -11 -8 13 51 -10 -3 -19 16 -42 20 30 9 16 16 -33 17 5 -41 -31 -1 -30 35 -48 -4 -23
3809 -23 -41 -44 47 19 -46 -5 -39 -65 -5 -32 43 53 28 16 -32 -18 -14 -31 -35 15 -15 16 -51 0 -20 1 17 -29 20 7 -11 73
3841 73 7 -44 -16 21 -31 -10 43 46 -31 -3 9 -14 -72 6 -16 1 -42 -22 -40 12 44 -13 -26 16 19 19 37 -12 -12 21 -45 7
3873 7 28 72 -18 31 -23 -57 32 54 -23 -5 61 20 -12 47 -24 -8 -12 -39 -21 -11 1 -22 11 4 -33 6 -22 -6 35 -46 59
3904 59 -11 -46 -8 -20 -69 50 -18 -55 58 43 -30 -26 31 43 -36 -3 -9 -15 -26 25 1 -55 -13 -10 -21 -27 -13 -12 10 -5 5 -47
3936 -47 9 -5 7 -25 -39 -57 40 -18 -36 -7 -19 -61 16 40 -21 4 29 1 -32 66 27 -10 31 38 -36 -41 -8 7 -15 -2 16
3967A6J3o9K1M7j8o1O3J0l8j4M2nn5O3k9K2l1K2J0o3N4kK7p6N0K4l4J6M8r0O7
3998C0m1mM0J1mm7O0j2l1M4Mo7R1j06m9R0K1l8o3Q9l5k9O0ol9J2N2l4JPj7%j6
4031b6M8Qm1k4J3L7rj4Q7k9j20Q8k2L3n1m0J04p3n3J09Lm8kP2o7L5M0o1l4N8k8
4062gJN7o6m1O5lkM1l3k5Qnl9P3J6K0j21R7m0l8J14n8m8N0K4n9M9k6o7O9J1k4
4094gK7K1q9O4m1qL6k7k3R4p8M5l7OMOM1l7k6M3n9K7P9r2PO6q1NQ4k2k4O8lr3
4128b4N1m7Rj8P9qp2M9j9JL7n4k0J02j39M3R7k3o2M0k6m3N0K8m4%Q7o2l8Q1j5
4159D0l6n5j3O0rK2N6p6oJ3N4p5k2O0Kq7J02rj5k3L9p4N0Rm9R1q1j3L9K8p3K3
4191b8N3n7l4J08p5LN2j2l2J0ql2N4m1LN7m6K2k0M3k6mN3k4k5qk8L1M3N3p4k4
$$ plain form
3967 16 29 -40 -19 28 10 -51 12 22 -16 -30 12 7 -48 15 -14 8 -23 -1 9 -54 0 -2 25 -51 -1 23 -11 5 53 -37 30
3998 30 -11 -15 25 36 32 -15 45 33 2 46 50 -17 74 -32 -81 9 30 -8 -71 18 -17 -46 14 8 -31 -19 33 -1 0 7 -10 -10 -26
4031 -26 22 30 -11 -35 -22 15 6 -8 79 50 -70 18 -4 29 -22 -62 42 -31 -84 25 28 -20 -22 50 -17 18 58 -3 -37 21 -7
4062 -7 -6 51 -15 -56 9 6 4 45 12 -13 -5 -10 -49 24 40 60 -61 36 -4 -42 72 14 -34 16 40 -19 30 4 -63 6 17 -7
4094 -7 20 41 -48 16 -25 -33 3 -24 -47 47 -31 14 -23 -17 -13 -7 34 -3 -29 14 -45 -18 61 -31 -24 42 -39 -34 50 28 4 72 69 -24
4128 -24 27 -20 -11 -29 50 42 -30 19 0 1 38 -16 -36 66 -73 -30 67 44 -18 22 -4 -47 3 31 -13 -13 74 12 -26 55 40
4159 40 4 -51 -64 -4 -13 9 65 -11 -17 -4 50 -25 -47 13 15 -72 30 21 6 -17 22 -52 -2 7 -42 49 -32 -45 -6 22 -51 -28
4191 -28 25 -32 -66 42 -33 -30 22 10 -22 -12 -20 -52 2 -39 -36 21 -25 -3 -23 20 -6 -10 43 19 -6 -14 -42 -11 32 85 11 -13
4223a3MK2l3j9O7m3J8L7j5l3k9K3Kk6J7L7p4M4n6M9l5R6m8K2l9K1O1m2r4J08P
4254C6n1J8J7j2l9M4l8k8K2N7o5J6O7l5n0M5m7M1L1kn8J6Oj0J6OL4K2j11L4O8
4285E0m1j22Q4O6l8j4L2K8qm9L1J8k1k3P3q2KLJ8j2j1J1j7L7kmm3Kj4Q7o7L6J1
4318B1l6j2O4l9J2Rl3L9n3M3N4l3k6Rk2l2M8J9o0N8Rm9L9l1j1M0k8m4J3O6r9J9
4350d6K4N3l4K9j2l4K3k4J5m1L6j4k3L9LK8q1K8M7k7m3O2oj4oL3K5l9LO3p4j9
4382b6J5M3j8m5L7J8l4L3Jm3L8k1k3J6Rj2OMq8M8j6J9K4J9n3M0N9j7o4L7j6l0
4414d0K2L2j0n9N7J8k1n0N3K7o6KL6Jq9P0L6q8N7Pk5ON7K3m8n9M0L6l3j8J4j1
4446b3lJ5Rrl5J12o0lk2L3l7k7Q5n9j0O9j5l1K2l2L4J0r5M9N8o2L3j3R3q5l3Q2
$$ plain form
4223 -13 -9 13 -20 -39 28 -15 3 40 25 -8 -37 -14 -12 -38 -21 16 -58 -14 -70 -21 -56 40 -8 14 -25 -4 57 15 -79 29 36
4254 36 -15 3 20 8 -31 13 -25 -53 -31 26 -39 -23 44 9 -41 4 -43 -2 29 27 -31 -15 -9 -19 -3 3 37 59 -52 -18 50
4285 50 9 -113 -29 37 -1 -15 17 45 37 -12 19 37 16 -7 66 -16 -14 -11 7 -5 -16 -5 -22 15 13 9 -34 -32 -46 41 -26 10 21
4318 21 -15 -27 37 -2 10 19 -14 25 -28 15 69 36 10 19 -3 -35 13 32 -28 30 39 -10 29 -2 -13 27 -1 -45 -32 34 -65 -46
4350 -46 -22 31 -3 26 14 -20 3 -21 -6 -47 -11 -25 -48 -9 -6 22 -59 -31 16 -11 -54 8 2 -12 -18 15 40 1 4 67 -7 -26
4382 -26 -11 32 14 -31 6 24 -10 23 24 -19 19 -2 -25 -9 0 -12 -6 -2 -90 -42 -58 -39 -15 4 -49 -9 50 33 -31 6 -10 -40
4414 -40 -18 14 4 -55 2 20 -1 -51 2 29 -37 -35 1 2 -87 -17 19 -69 -12 -5 -30 -24 33 56 8 -51 -11 25 -8 -26 -12 -23
4446 -23 -26 -11 -2 -11 -46 66 6 3 -19 14 -23 -50 35 -24 -34 35 20 -11 11 -21 13 23 -72 -23 35 -27 6 -7 86 1 -32 50
4478E0mj21J22o1l8M0K7k8n2R4Nn8L7ljp2K4L6k9j3K3k3J9rN3Nl9K8j3QJ6o8J08
4511F3p3k0J27p1l6k7N8p4k9N9L7p2Q2j6Qk7M2k5n2J0K8L4o3QRj3J3Jj2%L7M2
4543D8K6q7J2j2lj7mO7jm2K3Rm0M0l0n4O1J3NK6%m0Nm4N8J2m5K4j5rJ3J3l1K8
4577Ir1Q2O0j08K2L5Jo4R1n6m7Q0j1L0n9Q2l9Lj4k6K9kkM9J7j01M3K1n9L0J5l1
4609a1l7J2M2j2l1M8l8k7O8l2M9o0lP8n8o2P7K7n6OL9n4J1jK3k5lMN8m1K7k0L5
4642C3o2L8J3j2k3M3l5J3N3l5k1n5Q4j8m7J5P8q3N8n8Nj4LM0j1lj9K8r1R4j0l
4674bo3Q8k8Nnm8P2K1o9K6M4j1JRl4o1L9O3r6O7j0o2M0pP1j15L2Q3p5k5nM3J5
4707Cl6jJ4K5j6N4m8m4L9K3m8L0K0Qn6O5pm5L0N6q4M2J3m2K7M7n6K0p2M3mO1p6
$$ plain form
4478 50 46 -75 47 -14 -52 -12 15 -13 -65 29 34 -24 13 10 9 -63 -39 -3 -32 -45 -22 -45 -26 -35 18 23 -16 12 -1 7 23 -45 63
4511 63 -10 -30 97 26 -10 -37 21 -53 -82 -23 14 -58 24 8 16 -11 31 6 -46 -36 -8 26 -37 -29 -20 -33 -20 -19 -31 -31 6 48
4543 48 74 -13 -1 -13 -16 -33 -37 30 29 -13 10 19 -21 19 -11 -65 -4 9 14 40 40 0 5 -39 19 31 -14 10 -5 -14 -1 12 -19 9
4577 9 -82 0 60 -48 -26 9 10 -54 37 -19 -66 14 3 33 -26 56 17 20 6 -20 9 7 5 54 71 -30 13 34 -25 5 20 -11
4609 -11 -48 -36 6 -6 -37 11 -27 -54 14 -18 31 -29 -32 46 -12 -74 3 30 -26 -20 19 -35 -24 -25 -2 -27 -30 -26 32 -9 18 -2 33
4642 33 -29 9 22 10 -13 30 -5 8 61 26 5 -50 34 16 -31 -16 62 -21 37 -21 -16 -30 -27 13 2 -1 -20 8 -83 11 1 -2
4674 -2 -65 23 -5 0 -5 -53 19 40 -29 -3 41 30 31 40 6 -55 -16 47 -49 18 8 -54 -14 -21 50 -65 -33 50 -25 -50 -55 -12 3
4707 3 -33 -34 -20 5 -11 43 -5 -49 -10 13 -35 -5 15 23 -33 32 25 -20 10 66 -18 24 37 -5 22 69 13 33 -39 4 0 61 -15
4740a5k0PL2K2m7MN9m3j5k3k1K5N1l8l7Q1K0l1m2P6o6Kk4J04q5M0J5k9k9K2l8
4771d3O4k0N8l2nK8p4N9k6o6O6k2j7K2N3n5K6M2j26M6J2J8l7j2K2JL3Mk6j0k6
4802d3N9KJ9m6K4L8l5Jn0Kj7O4k2n9pJ25l4rK5p6L9lj5J9k2M6m4k3J12q2K1m0
4834c1OlJ5j9LL7n3J9K7j9j3rR0m2j5KK2kKL5l6Nn0K0K1K7Ll4pJN1m6L2j6Lm8
4870b2K1J3qJ8n1K0K8n1M1%l7pJ7J2Ql2M3pl5pJ8n0K4Q3j06M8N1m3LL2j6j0l0
4903c2k0P1lK9Mk1m6K7j9J3kl5Q0k9LJl8jlPK1P1j05J5j2PM7Noj2K4j6o8M9N4
4938F0j00LR0n1K1k7pL8n0N9j6n2QN3n0n3Q3j6qL9J7m5j8O9j6m4m3L7L6m8M0l1
4970b2m5N6lJ2J7o3N8M7j40P2pN0q7M1N7o5M3K5j8m9kJ9j5j6L3K8n3K0OL3j02
$$ plain form
4740 -15 -35 -28 4 26 -21 -17 42 -1 -16 -39 -60 -35 16 -22 -59 22 42 11 -31 45 -21 -19 -43 61 -24 16 31 2 -27 -5 -43
4771 -43 21 1 59 27 22 50 -24 35 9 -57 9 -13 -30 -8 45 -10 16 58 -68 -22 -10 8 -29 -41 -19 -18 15 19 -7 -17 -43
4802 -43 16 18 37 -9 15 53 18 19 -31 -29 -46 18 -4 -63 -70 55 21 12 37 -39 0 -3 -18 1 -21 25 -19 -42 70 -12 9 -31
4834 -31 -25 -28 -13 -32 -29 8 -45 -26 1 -18 -31 -40 50 8 -7 -5 17 15 17 52 16 21 -29 -9 12 39 42 8 1 2 53 7 39 23 26 -22
4870 -22 -1 12 4 22 -29 -9 19 -32 9 9 -28 -35 -18 -6 2 -30 13 6 -29 -36 -18 -68 -44 39 -67 -19 32 -11 -8 24 8 -2 -32
4903 -32 -52 19 16 45 49 28 -18 9 -10 3 1 -34 46 17 20 21 -17 -18 -21 -14 7 78 -27 -12 -24 -17 30 35 29 17 41 25 -43 6 60
4938 60 -40 -37 53 2 23 -4 -11 27 -23 36 20 -32 -24 29 -21 -74 9 -7 -15 24 41 -4 -22 47 31 -13 -56 -19 17 -31 9 -22
4970 -22 -67 -11 -14 -2 15 -48 10 57 -83 -11 -18 32 -55 -14 43 -22 21 46 28 -21 -23 -4 -19 -35 -2 26 -27 -7 -1 32 -70
5001g0j2M1KO4q3K0j5K0K8j2K0nM1m9l1L9O0q5K6L9q4RJ2K5LJ2N5j44P9K0roo4
5034e4P4l4Mk1K8j4j6P8j8j5n6N3n7L0JO2r2J3J2k0J1K3K0jl6J8MK3l6K7J4j31
5066a06J38K3r6M3M7m4j8L3Jp7k3N8L6L0l2j3j3N1o5P1J8q7N8J0r8J9O3q8J8N0
5096GJ3p3J1M4k1Oo5N4L6J6p4Q1r8K0K8Nj0j5R3p9J8J3J3m3k6P9j0kl9L6k0m9
5128e1O6%l1j1K7Kn0RL7m9O0L7o7K3Pl5L6n7J4M6n4P1kM7j13P8j0o6M0j8J0Jk6
5161b9N8j0k6M2m8j6L2k0O1j8%j22M5J07p6lpL0j4RJ2K2m0%K2m5MO3j12R0J6k5
5193BJ1m4J8l5O0m6L3lJM4r3J06n1k4M9k7j2J3L3l8JJ4m2J8Pj6L9q2O5J0kj03
5225i4N1J05p0k0%J7j4L8mJk3M9m1QL5k8N4j18M1K6K2p0KL6L1Jk2j9oPk4J2k1
$$ plain form
5001 -70 -82 -41 -39 25 -58 -38 -53 -33 -5 -17 3 -2 39 -10 -41 -2 58 -27 -1 38 -46 -37 -25 0 3 15 70 -74 5 25 16 10 -54
5034 -54 20 -14 -10 -31 -3 -17 -33 45 27 12 -44 9 -48 -18 -17 45 -47 -34 -22 -42 -31 -8 12 11 -25 -7 -3 20 -16 11 25 -106
5066 -106 32 55 -41 2 49 5 -13 20 21 -56 -79 -21 15 45 13 0 -13 38 -27 44 62 -25 33 43 -55 -36 27 -61 -43 7
5096 7 20 -53 -42 2 -19 -13 -78 -24 12 28 -46 35 -63 -43 -15 -10 -20 -35 58 -21 -3 10 23 -20 -46 33 23 21 -18 18 -2 -51
5128 -51 15 15 -16 -27 0 2 -48 -39 -2 -51 9 46 -21 2 9 -26 10 -47 -33 13 -41 30 28 75 -38 40 30 -36 4 -14 -4 -3 -29
5161 -29 29 19 -7 35 -13 -29 3 -17 44 26 26 -96 -51 56 -20 -23 -30 0 -14 -5 7 29 -11 -11 11 -34 -30 33 -79 11 27 2
5193 2 13 -31 -13 -48 12 -34 -1 -4 -3 41 -52 54 3 -21 28 1 -11 2 35 -3 -2 12 -30 -12 -5 -21 18 -64 1 11 9 -94
5225 -94 -43 62 -8 -28 -28 -11 -25 13 9 10 -13 36 -5 3 38 10 64 -54 -13 13 35 -35 -33 3 34 35 13 -6 -12 -5 -29 -17 -38
5258c8M7m1R5j10O8l3K6pj2K3j9Rl8J7l5J9j1J07%lnr4K2nj1RP3l3o5J8%Lj1L3
5292bj3J9%J8k4p1M7jn1Q1J4k9L6k7j7k5L9J1mp5O5O3j10J5JR3j02O8k4J7J2J4
5324C8n7N2n0J9Ml9M2O4p1n7N2K5m9j4KP0k0m2O4q9K1K8RN0p8K8l1l1M7nL2k8
5356a4K4Kj6J5J3l3nk4N7k8NNM1q8O0j8qJOqJM8Pn9M7l7K9k3K9o2L2j9jJ6l4K
5392c7N0Pl3l4M4NqQj4J2k1L5Ln1J9J8J4j5k1N1k0k5J2J07j20m7P0J7m4J1R6m8
5424D1p4j4R1m7L3JJ0n6L0j8j6j6P1l0m3N8o0K3k7M8Nj8o0M7J1k0k1M0K5m8O8
5455C4Qn5L5kk5LN9p0J9l4nM6J0K0l7k8lk7P7K4q1KK4l4O4k6oQJ3l1J2JoknL9
5491B1k0l9mPP0j03Q0l1O8l2J4k1Jk2K0j1K0j4m0j6J1J7O7n2L4m6K9o5J3L6p0
$$ plain form
5258 -38 9 -32 63 -47 21 -12 14 7 -5 18 -1 8 -30 -13 -48 -29 -40 67 67 64 59 -35 -13 -18 -29 -20 53 20 -45 -27 -27 -24 -35 -2
5292 -2 -15 4 4 22 -2 -73 -26 -27 -78 3 17 -12 24 -3 -20 -45 -6 5 1 -74 -9 54 -56 -41 -40 53 -49 19 -5 12 24 38
5324 38 -19 33 -17 2 6 -33 9 73 2 -55 -3 22 -27 -41 -39 31 11 -31 33 -56 -35 -7 2 52 -26 2 -29 -60 -13 -18 14 -14
5356 -14 10 12 -4 11 24 -9 -14 -38 19 -9 -4 1 42 -46 14 -4 -12 -11 -5 -13 -12 36 43 -16 31 -6 23 0 29 -33 -1 -20 -21 -5 -39 -37
5392 -37 13 20 -13 -47 -3 2 -6 2 -12 0 -21 14 17 -34 -15 3 17 2 -19 32 12 -13 -1 106 -14 -61 9 26 -18 -7 89 41
5424 41 -33 -47 44 -3 30 31 41 -15 15 -3 -19 -35 36 6 -37 21 -39 -16 -43 5 10 -8 -68 -21 -10 -30 -51 -11 14 -34 34
5455 34 42 -13 22 20 -5 -2 57 -13 6 -28 -33 13 23 43 6 -22 -25 -52 25 49 -32 -30 -6 -40 24 -2 -8 0 13 -18 -6 -5 -11 -13 -18 21
5491 21 1 -38 -42 -35 35 -68 12 -19 49 17 31 10 11 -11 9 -2 18 4 -36 -52 -41 -24 43 -9 25 -21 8 -57 -44 -8 -78
5522g8P4j5L8rMj2l2M7k7j0j4Q2j3m1J3m3J03q6k5L9L3m5K9k9l3P5m7K4NJ9k8
5553bqJ7n7Q3k3k2J1J7Pn3Q2p2J4j2pJ8M7m5K3J7m5Rrj3N3o0L7m7L8M5m7mqJ4
5587bM8K7p2J2j6k3J3K2l0O7m7j6L2Qq4M5J4N8q2k4O7j6Lj3M4q3J3J1j2mN7m6
5619b9L8m4L4kJ0l3J5K3J1o1K4O0l8J5j4m4P4l8j3k2P9l9K8p0MM0Jk9J4N7r0R
5651c0O2o8RK2q0N0P0l0k5J9M3Mr1O9l3n4J0Q3K6j08J2M4nRK4Mp3N4J3l4n8O3
5683AK5n4P7p5K4l1mM5rj3k2J1j9L7Nk4nPR7j38J07mk9q6P2LJ7Nk3m%j8O1J4n3
5718cj7L3k7j6O4n6N9n3J5l0J8nPo0O8qk8J5j3L4J0J0o8K2J9OK5k2j2L0rnJ8l0
5752iQMk0N7Pl6oK9m4kj0K0rk7N7j2JK9Oo3L7j3l5P3l7l9Rl3P9n6M2k1O1l7l2
$$ plain form
5522 -78 -4 -19 19 10 14 2 -30 17 -10 -20 -34 48 35 -6 7 -36 67 -19 -44 -5 28 -17 12 -17 -50 25 -22 2 7 26 -2
5553 -2 -10 7 -50 33 10 -12 -1 16 23 -30 52 -20 -6 -18 -25 -7 40 -5 18 35 -10 -1 -10 -23 30 -30 7 -40 -2 43 -4 -8 -16 -2
5587 -2 46 73 1 13 -3 -26 -13 9 -21 46 -1 -17 15 23 -61 -16 -2 56 -26 -50 17 1 4 -9 35 -48 -35 -24 -36 -40 17 -29
5619 -29 9 -35 -1 -3 7 -26 -11 12 23 -38 -14 46 8 23 9 -35 39 1 -12 -34 45 6 34 -36 -32 8 9 -20 -6 51 -39 -30
5651 -30 32 -36 -27 -5 -85 -35 35 5 -20 -1 42 46 -45 24 -9 -63 -53 30 56 -52 -40 4 -1 8 32 36 -37 17 30 -4 -62 1
5683 1 26 -28 49 -26 -2 -33 -37 8 -1 -14 -36 -25 -44 -7 -2 -26 -31 -24 73 -65 42 38 9 -77 -5 -2 15 20 -3 -7 -7 -25 36 50 -3
5718 -3 -20 13 -14 -30 34 -22 37 -16 -1 -31 -13 -18 -11 -71 -3 -11 -39 -24 -37 -3 7 17 -51 -29 -10 -4 21 -1 -13 17 8 3 21 -9
5752 -9 -1 3 -17 40 47 11 5 34 -10 -12 -22 -2 -11 -38 19 7 8 37 43 -20 17 4 -31 42 5 -34 -25 -58 21 -35 7 -14 47 10 -22
5787b2K6rM2o4nL7n4P0l8M5l5j2K6k0K4k5%K0QK5jo7K8N0n8L6ol6j1O3l6L6m0
5820cJ9Mm6O0l2ok6j9J03q0J4P0p8K1K5l3lJ8%L1m5pJ8k0j8M2N0jo7M7k5m2K7
5853bJ0J1m8O6p9qN4k5nO0m2j6k4K0L6Mj8k3J4K7l1L2Oj3kLK6l5K2j4m5jN1l6
5887b5n2Q4rl4O8o7O3j5m1N7j1o6L9O4J3j00N6J2%k1j1kk3J7K8l8KN0m4j7O1q1
5919d3J1NoO0m3k1L4%m9R0k2j9l4K2K3K4j8qK1m3PL6oj4J5K6l5l2K7K1j3j6l3
5952c3J3m4M5K1l7J6J2N7o6L2j3%k2O1m2K9m1J1K1Rm2K9Ooj4o4M5M8L8n0k2k2
5984b5M1m5m5P8K8o3Q6p8K9L3j8m6K7NMk5l7N2Pk5J7l9N2k1L2ln6J2K8M5n7NJ1
6017Ik0jM4l9m9J13Rj04j7M8O6o3pM7o6Q6k6j0j2Jj2qk9j4N4m7K0K3m1M9m3K2
$$ plain form
5787 -22 4 -5 37 -27 -32 5 -49 21 -17 28 -7 -19 7 -13 11 -14 -14 6 14 39 38 -29 -1 49 -9 27 21 -15 -26 37 1 37 -3
5820 -3 16 20 -26 34 2 -4 -30 -49 54 -26 -12 58 -20 1 26 -7 -10 8 8 39 -6 -13 5 -15 -33 9 59 58 -9 38 13 -29 -2
5853 -2 8 19 -29 37 -42 -50 4 -21 -26 34 -8 -24 -48 -28 8 12 -6 -29 -15 12 -19 13 19 6 4 7 33 -2 20 6 -39 -40 11 -25
5887 -25 -77 7 -2 -36 32 -35 28 13 -28 29 18 -48 -9 55 68 -32 24 36 36 15 4 2 -21 -4 24 -14 -12 38 -6 -23 38 -43
5919 -43 -32 -27 -33 27 -16 -37 -3 -3 -52 38 16 -3 -37 -15 8 32 14 6 27 -16 -9 27 21 7 22 48 13 -19 8 29 16 0 -33
5952 -33 -20 -64 -19 2 -35 -19 -7 50 -16 16 3 3 -19 42 0 29 -12 -1 20 29 -13 16 22 16 2 -62 -17 31 69 19 -3 -25
5984 -25 16 -29 -74 4 32 -31 55 -23 6 39 21 -25 2 7 11 -14 -51 1 8 -17 0 -39 13 -8 24 21 -35 -23 5 50 -7 -2 9
6017 9 -11 -12 32 -7 -56 57 66 -38 -55 -7 59 -4 -11 36 -30 56 30 20 8 9 -3 -11 -40 -54 0 -47 -27 -4 -45 4 -39 -17
6049a7l1k2R3k0K5l0M5j3l0l0M6Mm2M9j3K2l5%l3M0p4N4Om9Q8m4K6mll4J3l8l0
6082h1O4pK7k5M4k7L9r0P8k8M5m7L4K7m1L2n7O6n2j3j0J7k4L9j6N5n5Oj8J9lJ2
6114A0J8Nk7M6l0m1L5pqm0L5N0l7m4M1k4j7J6L5o0J9J6j4L2J0l0J4L1k7K6p6L0
6146a3k7L9j0K9L2k0k6J8K9ln0K0l5J5qo3O0n1K1O0k9L9k1o5RM0l2M2j8j4K2N9
6178D9q7N6l1l2P5Ll4J1rJ3k0K8J5ll8O2n5jn1J1L5N9l6l2M1l9M0p3jN5J7k6k7
6211b5N6l6J3o8K2L8j0M9q2j4L8k5L6Ok0mL3q9Q8L2l9J9l1K3k1N3m3K6p7R8l8
6242Hl9J8k7P8k4mq2P6l0kL7n4RM7k8k5L7J5j4qk5O2q5N9LOnk1M3o2M2Nq4O0J3
6277aRm6k2M4J9m7N0m1L0L5n3N8n7M1k8Kp3M3L1M4j2Ro8m3M5L6qj2L3L5q0O2%
$$ plain form
6049 -17 -48 -70 23 3 28 -2 43 30 0 -30 16 20 -22 27 14 36 1 1 -32 8 -66 -12 -6 -55 33 -11 15 11 8 -26 -13 -51 -81
6082 -81 -17 -24 3 -22 22 -5 34 -56 22 -6 39 -8 26 53 12 44 -13 53 1 -12 -22 -5 -29 10 -6 49 -6 0 -18 1 -2 10
6114 10 28 33 6 52 22 -19 16 9 1 -39 -4 46 9 -35 6 -18 -35 -19 16 -44 -25 -9 -23 9 19 -11 3 34 7 33 -43 -13
6146 -13 -40 -1 -11 18 50 30 4 22 51 48 -2 18 -17 -2 -10 -73 -13 -64 -43 17 -12 27 6 -59 -50 -10 -42 0 -18 -32 -10 49
6178 49 -38 18 -13 -45 30 33 -1 10 1 14 -6 22 37 34 -4 58 3 2 -49 -38 -3 56 20 -12 29 -10 30 -43 -44 11 28 2 -25
6211 -25 31 -5 8 -60 -38 0 -10 39 -43 -57 -19 -44 -8 -2 -22 -26 7 -82 6 38 -1 18 -13 10 -11 42 -1 25 -52 46 8
6242 8 -31 -13 -40 38 14 10 -72 4 -26 -28 9 -45 -36 11 -17 -42 -5 10 -4 -12 -37 25 -60 -1 2 8 3 -18 25 -37 5 10 -74 -14 -1
6277 -1 8 -38 -60 -16 3 -44 6 -35 -5 30 -23 35 -22 19 -9 -7 -80 -37 -6 38 26 35 -33 -76 -31 5 -3 -15 18 53 -27 35 35
6310C5qo5J7O5q3P2m7Rl0jN3l1jq2J01n7L3J8j4j5L4P1o9l4K3lk8K7j7j1K2l9
6342e5J3OL3k3J1m2K2K7j2L0PJ8j6l3j2O5k2k7O3o6L0M1r0K7m2Q3r4L9N6o1K4
6373@K9o9K2%M5l6nk0K1L0l4J2J3m7L6Rp3P0m2P2o4L4lK3k1pk6N7n3m2R7l9k5
6406c6P5qn7O0l6K3p1N0M4j4m7kM9pm8L4Om5Qk7k2P9j5Mn7L8L6nl0nK0J5K9n1
6440a3MJ5nO4q4J0O8m9K2p3Q2m4m3J8N0M4m2oll6J7k0k2O6k4j3M3j1ok4nJ3k6
6473c3J5K7km2M1J8jk5l0L2k8LP6j3m5mkO5J3n0M4n3j3k9P7n1J6KQk6j3K2OL8
6507D3r1M6l5QM9j7l5l1LL3l4N0k8L8QL5n7J4o9N1J1K3%k2j7m1R6n4L5l3L2n1
6539d0L4P4o6J5lp0M5Kl2L7j3j4N0oj5J2k8L6n6jO2o1L7j7M2m4N0p4N6k7KL6p7
$$ plain form
6310 35 27 -38 -21 44 -39 33 -14 -5 -35 -36 17 -14 -15 -97 4 -53 -20 -2 -16 -31 3 74 5 -29 -6 -9 -37 -10 -27 -38 -16 -55
6342 -55 -42 -36 -3 -26 -15 -57 -35 -8 -20 10 17 35 19 -14 -26 39 17 -10 53 -13 17 58 -32 -5 -47 36 -58 -19 37 -24 0
6373 0 29 -40 -18 -18 27 -9 -14 -34 -13 17 -17 -5 8 -39 -3 6 -67 3 -39 33 -31 3 0 23 2 -5 -31 26 -27 -69 28 -11 -36
6406 -36 39 31 -26 34 -2 21 -50 0 44 30 -17 -19 30 23 -25 9 15 -30 -22 -49 -71 8 -7 -3 -60 -22 14 9 -21 -26 -6 9 38 -13
6440 -13 -9 6 1 65 -19 -9 59 10 32 -41 41 -3 -46 -28 22 66 24 18 15 -21 -4 -24 -46 20 -4 -17 26 15 9 -15 -20 -7 -33
6473 -33 -18 9 7 -35 6 24 23 -2 -32 0 -28 -25 51 38 -7 -11 -13 52 65 15 59 6 -7 -36 41 -10 6 8 16 -10 -23 -1 5 43
6507 43 -48 -2 -37 -29 20 3 -32 -63 -60 -27 -61 -11 -39 -1 7 42 -15 -1 -70 -19 -8 15 15 -7 -24 -65 31 -23 12 -21 11 -40
6539 -40 -6 68 2 17 14 -56 -11 -9 -41 -4 -17 -31 19 13 -2 10 -18 18 -38 -39 23 -38 -1 -18 24 -20 30 -44 12 -15 -13 23 -54
6572e4M7%K0m1N6j10L7N0NOo4l0J06p0KL2lM7n3L2K4j28Q2J5N4p5K1k5RK7qk0
6604i%RJ1k7K0L9m4l9J06o9L2o6L0L2Kln0L0M4m9j5J9l1K6j01L6Q1jl2QP2q2q
6637b9K2Rl4M1J0j9kj1l9Q8m6K2nk0j6QL6j6NK5ln5J3j5J8j8K0L7lm3P2l7p5L0
6671c0J6L2n8Q0j7o7P3m8Rl9N6j3J7j7mj4Ln6O8J5l2J6q9R1k2M5m2Q9j4n7J5M8
6703E4l0k9L4o3L7O5or0j5PL7l0M1L3l4l4L9j6l5M6j6Nl0KK7m9O5o6N2L8j8n7
6735c6L8j2jJ3LJo0mM6lN9Kr8J5J1L4oL3p4MJ3J0J4k4L9k6M2l8njK0oQk9j7O5
6771C0m0J1RQl0j5L4n9M4L8m0j2L7OL8k5l3m9M8J5j9qN3q0J6l0M6L6l4J6k1k2
6803c2J2L5j1L5o1M5m6M4Jo1K8pkJ7J5m7K5K0n6M2RJ2k6pM1q3O1j1k4jM0K5ro2
$$ plain form
6572 -54 -7 -7 13 -28 28 -82 -45 5 10 16 -48 -78 28 -42 -40 -8 -11 36 -17 15 39 -89 -7 8 62 -13 8 -17 -8 19 11 -9
6604 -9 -9 0 11 -16 4 43 -1 -40 66 -3 29 -37 -7 25 27 24 -26 4 48 -1 -16 3 -28 -2 -103 -67 14 13 -19 -11 61 -21 -29
6637 -29 -7 2 -32 9 19 0 -2 -13 -52 36 -10 12 7 -13 -29 -21 15 -1 4 29 26 -29 -16 -31 -13 -31 -11 26 23 -20 52 15 -60 -30
6671 -30 -14 18 -40 40 23 -44 29 -19 -10 -49 7 -6 11 -6 -10 -24 -21 -77 -9 6 -26 -10 -99 -8 -30 15 -27 62 48 -9 6 54
6703 54 24 -5 29 -34 3 68 62 -28 -43 -36 1 -29 12 45 11 -23 16 0 -35 11 -5 0 -30 -28 -1 -50 15 -51 1 39 21 -36
6735 -36 2 -10 -11 2 5 6 -54 -58 -12 -15 44 46 -52 -37 -26 8 2 35 -39 -35 -22 -12 2 -22 17 -9 33 -5 -10 -11 9 3 11 -18 -35 30
6771 30 -10 1 10 18 -12 -27 7 -52 -8 30 -10 -22 15 21 59 34 1 -48 0 15 -4 -12 41 -39 -23 -53 -7 29 -5 11 -10 -32
6803 -32 -20 15 4 39 -22 23 -23 21 22 -39 -11 -18 -20 -3 12 -35 -10 10 -46 -4 5 17 -9 -16 25 -58 3 -8 -32 -33 7 32 23 -39
6837c9L5K3l1mM2ml0M1p3J2nQP0q2J28r8K7L2j6l0Lp2O4l7M0m9L1P3rm4l2L6j
6870IJ5k6J2nk7M0j6L4l0L4L6m8ol1K3j8n1J12o8mO5j9n8J5j5J0%K3lJ2l9n6O4
6903a6oj7N7J3j04K9NO8j8MLpN5m3l9J0%M3l4OK6oq0MJ1O6j0Mj4n1M9m8N2q8L1
6938d5O3Jk3O4%l1Kl1J0l6K9J4j9QNj8j9O4o7Q3l8j2Kj7k7N6j7m6J0O6q0N9Rk0
6972aL2m7L2l0l0L9m8P7j7k9O1%m3Rp8R1l6J0lm9N7j6kQNl1K3m9M3L6o7L6J6n9
7006f0N4K7m7K1J0k4J1M0l2mJ1LM4n4k1M5j9m8JJ02r3L9k6O3o8N1n5N8j6k9K4
7037HJ7o4J2O0rj4k9OK3Lk2J9m1K5oLrJ9k4J6K8J3q3K9J5K8o4N9K2o4Qk9O6l7
7071a6poJ4J5m0L5J1lKm8L2oN2lm8j6J2Qj0N8n5k3L7%J7n4M5J8K3p2ON5q2N3j1
$$ plain form
6837 -39 -4 19 -12 -16 26 22 -8 33 -40 -28 -33 -25 45 -37 91 -7 20 52 36 6 9 -63 1 -36 4 -45 -14 59 50 6 -26 10 9
6870 9 24 -2 10 5 -22 18 2 36 6 40 76 28 22 -9 14 -4 -55 57 -11 -15 50 31 -27 -12 -27 -17 -17 6 3 15 -24 -80 -16
6903 -16 -22 -39 18 31 -73 -44 -39 29 11 15 18 11 66 23 -16 -6 -6 37 3 9 35 29 -51 -47 -36 30 20 24 10 -41 8 -40 12 -76 -45
6938 -45 18 19 -4 60 60 29 31 0 10 -26 3 17 -2 6 11 -7 -26 38 -29 54 16 4 6 -11 -38 18 1 -45 -35 31 -49 10 19 -1
6972 -1 31 -16 16 -14 -44 -5 -53 24 7 -22 39 39 -4 5 -73 18 -18 -8 -11 -60 -3 -19 -21 -13 -8 -39 -16 -65 -22 14 -53 -17 -1 -60
7006 -60 -6 21 -26 -5 5 -19 -8 32 0 -4 7 10 54 0 -21 24 5 -43 -42 60 -33 6 -20 43 -25 26 -29 29 13 -16 8
7037 8 25 -39 -27 33 24 10 -19 -13 10 13 -9 10 -31 -6 -12 -9 -18 1 -23 -7 21 34 -49 -20 -5 23 -41 18 40 -24 -16 -45 21 -16
7071 -16 -23 -29 -15 0 -40 -5 6 3 5 -43 -11 -17 35 32 -16 -32 -20 -12 -22 36 -19 -42 -5 -5 12 -42 3 21 44 -28 -22 33 -49 4 -7
7106gJ9jk6j4L6L1o4m3Q4k5O4p2%j0qK4j6M7J3l5j5K5l8K1M6m6j7K7K4l7j8O2
7138C1m1J3l0N2j7n0N3j7qk3K6NK6l3J6pJ6J6K5q7L7K6J2%l8J6%j2K9Ln9j4K9
7171eN%k4N3n8O8m3j4M0On9J7P6q3k1L5qj2Nk6P6l9K1k5k4j8J8J8K1mj3J9K4O
7205C2o0M2J6m8J0J3K7m1N4k4J3p2P0m4J2L5rpLj3j8Mk6K9oJ5k8K8kO0j5n0J2
7238A2k8L7j5k6L8j4%mKm1M8kq3M6R0j02O0ml7j6O3k8Nnk0j2QMNM6nk6J3J0k9
7273a0J8oJ8m0j2j8PJ1j0jN5o0L3Oj5N5m0m1L9QL8n6L1L9j8n9L7l4L5j8k3K5P0
7306F4k7l7M9r0P1k5L9k5n1M5k5MlLK5k7k7mK7k5J2K1J2K2k0j3j1P4l8Pn2L0m5
7339d0PQ0m9l1K2O4m7rJ3n5K5j1L2L7oj3j6L8J9n9m6L0L0J2j7jj0K9o8K6M4l9
$$ plain form
7106 -7 12 11 -15 -29 7 38 -26 -69 15 -10 54 -18 -18 -28 -36 -12 -28 19 32 -3 -18 7 -31 -10 36 -10 -27 0 24 -13 -31 31
7138 31 -10 3 -27 25 8 -42 11 -6 -14 -37 -11 -6 20 -13 3 -4 12 28 53 -34 3 29 41 41 3 19 19 7 36 39 -20 -34 -5
7171 -5 0 0 -24 29 -29 39 -4 -18 22 28 -31 -14 62 -21 -42 -7 -15 -27 -22 -48 28 -11 10 -15 -39 -57 -39 -21 0 -4 -17 2 26 32
7205 32 -28 14 30 -18 -8 5 32 -9 45 21 34 -38 32 -12 0 35 26 19 22 9 -9 -5 -31 -2 -8 7 -21 7 5 65 50 0 12
7238 12 -16 21 6 -20 18 4 4 0 2 -39 9 7 -76 -30 60 -42 18 14 -23 -39 24 -4 1 -4 -24 -36 -28 -24 -19 27 22 -4 9 19 -10
7273 -10 8 2 20 -20 -32 -50 -43 -32 -42 -43 12 -48 -15 -9 -24 31 -9 -50 -11 -3 35 -21 10 49 31 -28 9 -25 10 -8 -31 -6 64
7306 64 37 0 49 -41 30 5 44 19 -32 13 -12 -8 -11 -8 17 -10 -37 -41 -14 -39 -27 -6 6 28 8 -5 -16 58 20 27 -25 5 -40
7339 -40 -33 47 -2 -33 -11 53 6 -3 10 -45 -20 -31 1 38 32 19 3 41 60 1 -45 -15 15 27 10 9 -1 28 -40 -14 30 -9
7371iM0j9L9m2j3Pll2N2po0M5l5Q7o6N4p2m9O9RK2J8r9P5mL5j1m4rj5J7NrL3%
7406IL0m3k0N7p4J1P7r2mL7jJ6m6K8L4Mn2M6l0jmL9k2J3k0PJ7rqK1m2pNJ5K4l5
7442b0J0K8lm1O6l3L3lq8M2k7k1J8M1%k7P2j12K4L6l0M1L8n6K0mL2o7M3L4n2l6
7474d2O3J3j4lJkL6n5P6q5P8n4L4n9K5k4j6R0r1N0l6M4k0Lk3L7o1J5pK9K2j3J5
7507B6m1K0j0O0Lm4k6Jj3RK4k1%L7r4J19l3o9O2k2J3%J7oo%K7k0J8qn1nNJ5J7
7542DJ3L1r1P9n4K6pj7KQn3P6n4N0K5m0Jk4K1L6j4j1j8N5m9N6o8J3Nm0QO8k3m5
7576c1N2Rm0J3K6o3L7k6N9l1k0m1R4o7M5k3L5j2k0J0Oo8O5J9o0M8j2lM0M1o8J6
7608C0l4l6N4j2L2k2kJ1m2L1J7k9MoL8k4rK3l6K9k8N7n1m4J0K5lJ1J1k5K0j2k5
$$ plain form
7371 -9 31 12 51 9 -4 3 0 -32 20 13 -47 -2 -37 50 -16 38 -34 -83 -14 -5 17 35 -64 11 7 42 31 -13 -22 -37 -20 -15 -24 9 9
7406 9 39 -4 -24 33 -41 -30 47 -45 -49 -12 -13 3 -43 -15 19 23 -29 17 -13 -14 -18 21 -1 12 -8 -1 16 7 -1 20 -22 -29 -24 -9 15 -20
7442 -20 -10 18 15 -26 40 7 40 37 -51 -9 -36 -57 -39 2 2 -25 47 -65 -41 -5 -35 6 44 -12 8 4 36 -31 12 46 -6 -42
7474 -42 21 34 20 17 18 16 52 -3 73 -12 66 12 46 -13 12 -12 -28 62 -29 21 -15 29 9 12 -11 26 -35 -20 -27 2 24 11 26
7507 26 -15 5 -5 55 58 14 -12 -11 -24 -15 9 -12 -12 25 -69 50 17 -52 10 -12 1 1 18 12 6 6 33 13 31 23 -28 -33 -28 -13 4
7542 4 17 48 -43 36 -18 8 1 -16 -14 -6 -59 17 -37 13 38 -2 -1 -25 -4 32 18 7 -11 44 -5 51 -17 -4 1 -39 -31 37 14 -31
7576 -31 21 30 -10 3 29 -34 3 -23 36 5 -15 -56 38 -29 16 -7 28 16 -4 6 12 -56 9 28 -32 16 4 1 41 82 14 30
7608 30 -4 -40 14 2 34 12 10 21 -21 10 27 -2 2 -4 34 10 1 24 -12 17 -11 46 -5 -49 -39 -14 -17 -6 5 -20 0 -12 -37
7641c7L4K7k5kO9k9l4J3l8L9l3J1K1K7q8ML8l1J3pK2M6p6l4N0n6J24m9j4NN8q4
7673c6L0LJ1pJL9o5L4p1O3k0K8j0J4k5L5j9j6N0m5N2k7L0k1L0k0p8M6j6K9k9J6
7705F%l1P4k7j1J0l8QJ1K7l0kj6J3rlN2m8L3k8N0Ql1l2J3Mn0J1j5J17o8M6l1o
7739GL9m8M5l3j7j0J6k9l5J0Q3m9J2N8m4K9o4NKoN5n1O2o7Q1o6j7L9j8%OL4n9
7772c0L8j8K4p3M3k2M4m3QP1q3P4k5J9j1J4j9Pj4KJ1JJ1om7K4m6qP8j7Ln9M1J3
7806El1k2lN0k1L4n1M4nK7rj9M5k9ql8L2J0o1Q3k6Mk9rLK1lkL7m0J5K3j4pp1O1
7842dL8m7o0P4m2L7%k7L4J6j4L7k3jKq5O2NJ8J1m9N0Loj8L5m9LL0n5L1K7o0N4
7876B7m1j0L2j6j0L4pM5n7k3MJ8J9kok7L0j4J1n3J04p9K9j2K0l1%K4j7L6k3kM2
$$ plain form
7641 -37 -3 24 -1 -3 66 37 3 16 -22 17 -16 -5 16 43 -45 -41 -3 -34 -21 -28 -6 40 -36 -70 -20 -76 48 -1 -15 -10 48 -36
7673 -36 -6 -3 8 1 2 41 -24 10 -61 2 -18 10 0 14 -11 24 5 -11 39 -6 46 19 49 28 58 38 -40 6 -10 19 -10 6
7705 6 6 -25 49 22 11 21 -17 -9 2 29 -1 -3 -19 -6 -15 -18 34 -14 19 -9 41 49 18 -14 -1 3 -47 -36 -51 66 -2 44 13 7
7739 7 46 -2 43 10 -7 -17 -1 -30 -65 -55 28 -21 -9 49 5 34 -30 -25 -23 -29 26 -25 37 -30 51 -15 -32 7 -11 -11 -5 29 -30
7772 -30 8 -10 14 -59 -16 -38 6 -37 -29 42 -41 33 8 27 16 30 11 18 4 6 17 18 29 23 -24 0 -46 -54 24 7 10 -49 -8 5
7806 5 -26 -48 -51 -1 -22 12 -39 5 0 27 18 -1 44 15 7 -31 1 11 -50 33 7 11 -18 -27 -24 -3 -6 -8 29 -11 4 27 13 6 -65 -4
7842 -4 34 -13 -73 1 -41 -4 -4 -31 3 19 5 42 19 18 20 -65 -3 2 20 31 -18 32 35 29 11 46 -3 0 30 -25 6 33 -27 27
7876 27 -14 -24 8 -8 -18 16 9 54 -3 -26 -22 -4 15 13 7 -20 10 -4 7 -46 58 -21 8 -4 16 -15 -15 9 -8 28 5 3 45
7909D5n4Mqk0LRJ0j9L2ooL6Kl2Lj9RK3L2m8k1J2K6Kk5J7M0p5J4M1j0m9M6Rom3
7945b6M7k7K6NJ0p1N6k7%j4N1J7m7k9P2o5P1k1j6P%k4j3L0l3j2jP6j2k1j0j4O7
7978E2mj08P2ONrK6m1j6L9oJ0n3Q2k5J8n0J3N0n9j0J6P8o8L9Ol5j4j7pl6M6l7
8011c7K5K9L5n8K0k2M8m3l1M4oJ9N9j01Q4q2L3m1l4M7Qj9qL5j2L0L4k6k5Ql5M
8043a8J6N1pn5k2L9l9N2k4j4K6o2R7n1p5J02k3M3n0%K0k3m3R3j3l4kK9K3j4Pq2
8075e3L6l4M2K2K4j4Pm1NKrLNK0PK4l9M3o8M8m4K2l2J1M1mq7M5k9J5pJ8kkP5o2
8111a2J5J4n1L5M0m1m1O6ln5J7J3L4KLjk8k9K1J6k9kK3m0K5Rk3O5o8j9M3j6lM7
8145B7J9j09K0P2Qn3M4K3p7L4j9O6m7m0J2j9L0j8N3k8rK3k7KN6j3l3m3P5o2M6
$$ plain form
7909 45 -9 -5 -13 -33 -30 -21 -11 -30 2 -4 -10 26 28 -4 -1 -20 -11 12 44 -4 -25 -13 13 15 -10 7 47 -28 -14 27 17 -32 14 23 17 -26
7945 -26 21 -6 20 25 35 -36 20 -7 -7 -21 30 47 0 -29 43 -22 49 28 12 19 19 -5 -18 12 -21 -33 -34 42 30 9 -1 -15 52
7978 52 48 -60 12 18 23 14 40 -1 -17 22 16 26 -27 55 30 48 -2 11 61 2 -8 8 86 18 57 63 28 14 -3 -10 -46 0 -37
8011 -37 -12 17 52 -6 14 -8 40 -3 -34 10 4 23 82 -19 65 -17 16 -25 -59 -12 -4 -23 -31 4 -8 22 56 30 5 13 -22 -18
8043 -18 -2 49 42 -13 -35 4 -35 17 -7 -21 5 -57 40 -11 -86 16 -7 36 -14 -14 6 -17 -60 33 20 -14 -16 13 36 22 29 -53
8075 -53 -17 -51 -9 13 37 23 30 -11 -6 -4 -13 -10 -5 15 22 46 7 50 -18 30 -14 8 -24 -13 28 24 -63 -18 -47 -32 -39 -21 -23 -25 50 -12
8111 -12 3 17 -34 1 41 0 -41 25 22 -33 -16 -3 31 33 36 35 7 -22 -1 15 -14 -16 7 -33 -8 1 -22 43 -25 -44 -1 -17 -20 27
8145 27 46 -63 -43 29 37 -16 28 51 -26 8 -11 55 8 -32 -20 -39 -9 -27 26 -2 -11 12 -15 -13 43 30 -3 -46 29 -33 13
8176A3j8k0M4k3K2p1K4NJ2JlOJ7j9K7
$$ plain form
8176 13 -5 -25 19 -4 18 -53 -29 -24 -12 -11 -14 -8 9 -10 17
8191A7
$$ Imaginary data points
##PAGE= N=2
##DATA TABLE= (X++(I..I)), XYDATA
0@%%%%%%%%%%%%%%%%%%%%%%MqJ2j6J6j8K2k9L7m0M3n2O1p0Q1r3J08j23J37j52
42h0J69j91K15k38K65k94L24l58L95m35M78n23N71o23O80p40Q02q63R22r74J004
63E06r90Q83n70k63K597j0815P8765M14084n20463k94839N04256j13097k43104
76a83050L20242q7632k78590L56557N8062m36045J53569L37841k81741r6286K60342
87A23269j44318q2092K58644j43640j88270K86570M0803k88857J06229J68263
97A36601j88596L5379J71961k20088m9921K76265r4439j96195J70804L5187j64529
108h7571J31492P7742k46327N5363K25207j72316o6673K05708j34048j46290K65176
119A07463R480k87014J64846J92190l04123l0106L05223j22226j61679J90540
$$ plain form
0 0 0 0 0 0 0 0 0 0 0 0 0 0 0 0 0 0 0 0 0 0 0 0 4 -4 8 -8 8 -10 12 -17 20 -20 23 -29 32 -38 43 -50 58 -65 72 -80
42 -80 89 -102 113 -125 140 -154 170 -188 207 -228 250 -273 298 -325 355 -385 417 -446 476 -498 506
63 506 -484 399 -171 -434 2163 -8652 70113 484197 -36266 -331105 173151 60054 -183050
76 -183050 137192 49560 -229030 127527 185589 -250456 -96887 240954 -40787 -137073 123269
87 123269 -21049 -103141 155503 11863 -176407 110163 150966 -137891 -31662 136601
97 136601 -51995 -16616 155345 -64743 -114664 161601 67162 -129033 41771 76958 -87571
108 -87571 43921 121663 -124664 -69301 155906 -16410 -83083 122625 -11423 -157713 107463
119 107463 116943 -170071 -5225 186965 -117158 -147264 157959 35733 -125946 64594
129F4594l6434j57830J89888M0074k45667J15242J88655k19940n5757J98907p7035
140D697p1395J47317p0734j34445J57072N3359j56382N5778P5837j21335L6540
151b3691R8473j13924j5038J22683o6912p3826J09442j641r4270O7513K3950q7082
163e4323O1628N3507j12165j108J06759m0153n9197O4249k248n8708N4301K3236
175C5778p1131K3221N7117m9338l0442M7942p40k7487L3682o41m8766K6822L4976
188C0993l7731l236L6297k3094k6877L5409M508l2983K6533J6064m7236M807M3657
201B7111j7689k5574K0930N328j7001J0495K796j6698J4689J0580k2200m10J8229
214A0586m191j1519M575O544l437k357p29q9L661l104l627M450K824l607p506
$$ plain form
129 64594 28160 -129670 60218 100292 -145375 -30133 158522 -61418 -117175 81732 4697
140 4697 -66698 80619 9885 -124560 32512 85871 -70511 -14733 61104 -60231 -23691
151 -23691 74782 -39142 -54180 68503 1591 -72235 37207 35566 -58704 8809 32759 -54323
163 -54323 7305 60812 -51353 -52461 54298 14145 -45052 19197 16949 -41759 12542 35778
175 35778 -35353 -12132 44985 -4353 -34795 13147 12407 -15080 18602 17961 -30805 -3983 30993
188 30993 -6738 -9974 26323 3229 -23648 11761 16269 -16714 9819 25883 -21353 -16546 27111
201 27111 9422 -16152 4778 10106 -6895 3600 6396 -10302 4387 14967 -7233 -7643 10586
214 10586 6395 -5124 -549 5995 2558 201 -528 -617 3044 -60 -3687 763 3587 -20 -7526
229g526M222J0315r462o003J4078k984j6155J1757J3310j8610j116K0445j5230
242b959j1243K4395l908j8940J6042M572k0050J0229J2716k0650L289J9103k0035
255g439n783K4241j0433j3703J8912k845j5272J7853J562k3582J8682J6114l3676
268a5369K389L4846k0444k2341K9174M183k5657J2457J2266k0570O497J6001k0560
281g128j906K3018j1994j5039J9163K240j7081R855P060j4802P165R709j6713
294f453K039J6283j3282q149J8275m204j6033J4983O228j8940O549J4448j4367
307b623m617J4765l932q836P931Q70o690N834K1p433P200L182r811K931O871p448
323a785j225P544n603m287R426k901r369R247M963j1563Q41J0960m776p699P587
$$ plain form
229 -7526 -3304 7011 -2451 -8454 5624 2640 -13515 -1758 11552 -7058 -8174 12271 -2959
242 -2959 -14202 10193 6285 -12655 3387 7959 -12091 -1862 10854 -9796 -6507 12596 -7439
255 -7439 -13222 11019 586 -13117 5795 2950 -12322 5531 7093 -16489 2193 18307 -15369
268 -15369 -12980 21866 1422 -20919 8255 12438 -13219 -762 11504 -9066 -2569 13432 -7128
281 -7128 -9034 13984 1990 -13049 6114 8354 -8727 1128 8188 -6614 551 10260 -6453
294 -6453 -4414 11869 -1413 -9562 8713 4509 -11524 3459 9687 -9253 -2704 11744 -2623
307 -2623 -7240 7525 3593 -5243 2688 3558 -3132 2702 2723 -4710 2490 5672 -4139 -1208 5663 -1785
323 -1785 -3010 4534 -1069 -5356 4070 1169 -8200 1047 6010 -5553 -4712 6248 1472 -6227 1360
338A360L918p773j11O135k456m410L480L220n191j334O114j543n978L985L833
353C249n667j069M978k463k085M705k301l072O244o36n623N197J715o502M334
368A004L080r822M142J0310j2624m784J6682m747j3397J3495M550j5924O593J0534
382I092j5155M46J6084j1251q545J5297l003j0531J2481L94j3541J0897N557j7350
396i128O953J3929j7577k287J9050j2289j0873K2324k770k1298J7405J0761k4772
409a0572N499K1016j9587q190K4367q931j8971K0667M757k2570J0923J3435j9827
422g984K956J6884j8424l566K5131j2694j8572K4031J513k3661J7900J1299k7277
435a2464R315K1428k8796l975L5483j6720k6109K8741L171k7576J9913J2450k9798
$$ plain form
338 1360 5278 -2495 -2606 3529 1073 -3337 143 3363 -1828 -3162 2952 1409 -4569 -584 3249
353 3249 -2418 -3487 1491 -972 -3057 1648 -653 -3725 2519 1883 -3740 1457 3172 -3330 1004
368 1004 4084 -5738 -1596 8714 -3910 -8694 7988 3241 -10156 3339 7889 -8035 -1442 9092
382 9092 -6063 -5617 10467 -784 -9329 5968 2965 -7566 4915 5309 -8232 2665 8222 -9128
396 -9128 -2175 11754 -5823 -8110 10940 -1349 -12222 10102 7332 -13966 3439 14200 -10572
409 -10572 -5073 15943 -3644 -11834 12533 3602 -15369 5298 10055 -12515 -1592 11843 -7984
422 -7984 -5028 11856 -6568 -10134 14997 2303 -16269 7762 9275 -14386 3514 14813 -12464
435 -12464 -3149 18279 -10517 -14492 20991 4271 -21838 6903 10074 -17502 2411 14861 -14937
448a4937J0755K2719k8997l348L3324j5979k0350K5308k811k0074K1960K930k7036
461a6536J7293J6198k9657L130K7668k0193j2769K6559p341k0145K2449M631k5973
474a4686J1961J8196k1420k908K1577j2252j4131K0346K696j8856P826Q882j4717
487g486K823J4724j0402n870J2659p134q919J7740J020j8816R254Q795j8358N995
501c975J9709j8852j0617K4754n441k1318J9481J0169k2989M638J4883j6825j473
514g856J9591r803j1699J3727j777r591J2186J216j3221O950N431j0789N645R082
528I092j3310l451J3783l183p870R116M83j3264L938J4443n208j2417N517O348
542D017p553P51R599p140p621J1774J64j2573R293Q929j3611K47R579j1049P66
$$ plain form
448 -14937 -4182 18537 -10460 -13808 19516 3537 -16813 8495 5684 -14390 7570 10500 -16536
461 -16536 757 16955 -12702 -9572 18096 -2097 -14866 11693 4352 -15793 6656 11287 -14686
474 -14686 -2725 15471 -5949 -8857 12720 468 -13663 6683 9379 -9477 -1651 7231 -7486
487 -7486 -4663 10061 -341 -6211 6448 -686 -9605 8135 9155 -9661 -407 8388 -9970 -3975
501 -3975 15734 -3118 -13735 11019 5578 -15740 3741 13910 -9079 -4441 10442 -6383 -7856
514 -7856 11735 1932 -9767 3960 2183 -7408 4778 5994 -7227 -277 5154 -5635 10 9092
528 9092 -4218 -7669 6114 2931 -4939 4177 4660 -8604 -4666 9777 4569 -7848 -2331 4017
542 4017 -3536 -2785 6814 -326 -7947 3827 3991 -8582 711 9640 -3971 -3724 5855 -5194 -4428
557d428J6396j1679j0577J7557m556j5727J9380N973k3116P894J2009k0119P254
570c739K3291k3759j4536K8408k376j9259J8260K208k3807J4654J6084k3221K94
583g498K1035j6068j0223K2981l892j8019J5163M794j9052R305J3895j8392j339
596g310J9311j2823j2885K1313J014j9750J2671Q754k2488O108K2441j8164r965
609a1773K2908j0217j8590K7289O337l1116R833J8964k2634K923K4295k2227j1908
622a5916K9659q981k1274K6158J845k8451J8361J3217k9297J0866K4205l0462
634a0070n848L4290j6706k0676L0890k470k8449K3000J0900l0815J2874K3853
646B0773k9443o409L0384j1917j6473K2806l825k1358J8989R040k2770P440J4998
$$ plain form
557 -4428 11968 289 -10288 7269 2713 -13014 6366 12339 -10777 -2883 9126 -10993 -3739
570 -3739 19552 -4207 -18743 9665 7289 -11970 6290 8498 -15309 -655 15429 -7792 -7498
583 -7498 13537 -2531 -12754 10227 6335 -11684 3479 8273 -10779 -1474 12421 -5971 -7310
596 -7310 12001 -822 -13707 7606 8620 -11130 1541 10295 -12193 -6085 16356 -1808 -11773
609 -11773 11135 918 -17672 9617 15954 -15162 -5329 13635 -8999 -6076 18219 -4008 -15916
622 -15916 13743 4762 -16512 9646 11491 -16960 1401 14618 -14679 -3813 20392 -10070
634 -10070 -15918 18372 1666 -19010 11880 9410 -19039 3961 14861 -15954 -3080 20773
646 20773 -8670 -15079 15305 3388 -13085 9721 5896 -15462 3527 12567 -10203 -2763 12235
659A2235j9619j354K0813j1680j1060J8848m276j7736J7030Q879k1307M355J5961
672A1089j5861m140K0074q641j4326J7217J571j8034J1863J0784j8759J666J5909
685A0412j3420n174J8212p796j3092J5828L26j5051J2825N873j8903P375J4359
698A1774j7829j876K0187j1544j2756J8368o61j6039J2866O418j7569N177J2748
711I264j2903j880J3717q252p599J2338j219r192Q177J629r459N556N100q790
725c513K007O750q137j334R620m603o841Q161J128q048M381M871o930o2O461l810
741A01l302N796l50n008L082K031l940J063K487k875R1K347k850l69M178k029
757D53l072L543K65l638K956K116m677P58M149l584j847N016q18m534K681K545
$$ plain form
659 12235 -7384 -8738 12075 395 -10665 8183 3907 -13829 3201 12080 -9227 -4872 11089
672 11089 -4772 -8912 11162 2521 -11805 5412 6983 -11051 812 11596 -7163 -5497 10412
685 10412 -3008 -8182 10030 2234 -10858 4970 5296 -9755 3070 8943 -9960 -2585 11774
698 11774 -6055 -7931 12256 712 -12044 6324 5663 -10376 2490 8908 -8661 -3484 9264
711 9264 -3639 -5519 8198 -54 -7653 4685 3466 -5726 2451 4080 -5379 177 5277 -3513
725 -3513 -1506 5244 -2893 -4227 5393 790 -6051 2110 3238 -4810 -429 4442 -2488 -2550 3911 101
741 101 -3201 2595 2245 -2763 319 2350 -1590 -527 1960 -915 -824 1523 -1327 -1696 2482 453
757 453 -2619 924 1189 -2449 507 2623 -2054 -1296 2853 -731 -2578 2438 1620 -2914 -233 2312
773B312l160m12K268q64n34R29o30k04Q38m59l2N97q98p9J016j034n54J885n74
792D11k094J336J533j750o83J719J74j197J27R47k24o75N56O61p97o06J144K9
810F11j340Q36J227j873p85K141m3j866P35J221j138m77Q97J80m08o2J32L83k49
829A22o86O74O17j234O6J350j081j079K008J55k239J159J715k149o01K576o36
846G37k047J511J011j786M2J274p09n01O06k52k72M83l60N3N39p68q1J364p23
865A21j261J746P32k348L40K290j427j593K204J10k234J227J463k272k94K377
881A181j033j541J761K94j538P60N81p80M93K17j067Q09O37j573P02J454k086
898g29n15K788j133k113K466N57k843J151K079k232n63K338r95j688J718P78j566
$$ plain form
773 2312 -848 -1260 1008 144 -390 539 -91 -295 543 84 52 649 -249 -328 688 -346 -900 985 411
792 411 -1683 -347 1186 -564 -1247 472 646 -551 -424 523 299 -376 180 841 44 -562 582 611
810 611 -729 107 1334 -539 -1324 817 774 -1092 -357 864 -274 -751 146 326 -82 -144 -12 371 122
829 122 -564 110 727 -507 -441 909 -172 -1251 757 912 -1327 -168 1547 -602 -1203 1373 737
846 737 -1310 201 1212 -574 -532 742 33 -468 138 -114 -386 97 -263 -210 329 -439 -520 844 121
865 121 -1140 606 1338 -1010 -670 1620 193 -1400 804 914 -1320 -93 1370 -902 -1196 1181
881 1181 148 -1393 368 662 -876 -116 465 -315 178 395 -672 137 774 -799 -97 1357 -729
898 -729 -1244 1544 411 -1702 764 1321 -1522 -371 1708 -524 -1087 1251 256 -1432 286 1064 -502
915e02j28Q08k15k36L81P3l49j44K38J46o0J63R2j91j96j45K69J026o33j617J392
936A72J012k198M43K442k384j461L415o61l038L197J060m330J304L436l099p11
952a401L279k190j635L295o42k183K462k96k635K749P83l300J994J920m125O10
968a315L997k741j935L650j283l100L508J697m159L95K923k088j198K842Nk392
984a194P76J025j355O89J616j727j254K070j63j478J922K05k736J500J594l028
1000a538J157L284m003j763N292j557m011M907O68o065L038L933n336N84N019
1015C609n023j971O380j960m080M897m28m809M245J793m947K467K637n583J280
1030a493N351m343k000N001k505l277N309J39m959K832K157m481J063M026k979
$$ plain form
915 -502 -630 178 -37 -273 108 181 -168 -312 -74 72 12 175 267 76 -120 -265 4 1030 397 -1220 172
936 172 1184 -1014 -571 1871 -513 -1974 1441 780 -2258 939 1999 -2331 -1027 2409 -690 -1401
952 -1401 1878 -312 -1947 1348 706 -1477 985 689 -1946 803 1586 -1714 280 2200 -1925 -1315
968 -1315 2682 -59 -1994 1656 373 -2727 781 2478 -1681 -1286 1637 -451 -1649 1193 1198 -1194
984 -1194 -418 607 -748 -59 1557 -170 -1424 646 483 -995 927 1132 -1604 -104 1490 -1538
1000 -1538 -381 2903 -1100 -2863 2429 872 -3139 1768 2436 -3629 -591 3342 -1994 -1410 3609
1015 3609 -1414 -3385 2995 1035 -3045 1852 1424 -3385 860 2653 -2294 173 2810 -2773 -1493
1030 -1493 3858 -485 -2485 2516 11 -3266 2043 2182 -2777 55 2212 -2269 -1206 2820 -159
1045a59j916L060o34k118K453J010k520J14J397j083J5J790j165j522J628K79
1061F29j729J425J405k816l29K737j443j072L130j386l585L457K014m341J205
1076f99L325m095q07M712j814k607L637r01l426L469J341l649J358J677l183J194
1092d68K676k837l86K805k406j138L504j031k548K528K65k992J686K076k251n21
1108a038J736r98m92J521m0r74RK88O6J1L13K36p99p01J072O29q26j04K2o24O83
1129a0N03q98M16K98j317O93J580j526n24J930j165j248K326j94k305J678J045
1146A282k654O13K221j661q08J801n99j184J358L17r80M23np84Q32O71r58k75
1164c90M17k76J66O95n48q26N59M92o29J09R17p77r92J364Q95j692J14J469j212
$$ plain form
1045 -159 -2075 985 351 -1767 686 1696 -824 -710 687 -396 -381 1409 244 -1278 350 629
1061 629 -1100 325 1730 -1086 -1415 1322 -121 -1193 1937 551 -3034 423 2437 -1904 -699
1076 -699 2626 -1469 -2276 2436 622 -1985 1652 751 -2675 794 2135 -1514 -156 1521 -1662 -468
1092 -468 2208 -629 -1015 1790 -616 -1754 1750 719 -1829 699 964 -2028 -342 1734 -517 -1038
1108 -1038 698 -300 -792 729 689 -285 -276 12 78 89 402 638 -161 -862 210 839 13 -91 -69 -693 -10
1129 -10 493 -405 11 309 -1008 -315 1265 -261 -785 1145 -20 -1268 1058 864 -1441 237 1282
1146 1282 -1372 -759 1462 -199 -1007 794 195 -989 369 686 -294 129 124 -660 172 843 -115 -390
1164 -390 27 -249 -83 612 64 -762 -203 289 -340 -231 686 -91 -1083 281 1176 -516 -402 1067 -145
1183a45p31J839m55j673J483N79j982P72J350j694J12J532j332m57J563p95o66
1200g00J645q89j445K120K81k283J312J289k420M35K360j814j149K158n27j623
1216a250J840M60k138O68J409j177k37J124p54n67J039k42o23P57k13r04R62M01
1234E55j248M13J097j043l80J352n22j066J308L52j661N39J316j267m46J553n49
1251C03j196J135L85j041M13M05r03L78O11q31K5Q26q14j35J088n75p64J186k28
1270B68j086J073N66j578K70J469j031o73J341j90j132R16L77r50K40M65n67k8
1288b50M97l01j43L93l02p6M21l32l12P50r4p66N75M31q92J55R17n53o71Q36J81
1309D64q83L28N30o99r9O33k28m29L58J54l63J37J67j89J38q9p7L54l5n02K73
$$ plain form
1183 -145 -876 963 508 -1165 318 897 -1085 -313 1037 -657 -545 987 -345 -802 761 -34 -700
1200 -700 945 56 -1389 731 1012 -1271 41 1330 -1090 -655 1705 -109 -1258 900 373 -1250
1216 -1250 590 1050 -1088 -420 989 -188 -425 699 -55 -622 417 175 -448 309 96 -808 154 555
1234 555 -693 -280 817 -226 -606 746 224 -842 466 818 -843 -304 1012 -255 -701 852 303
1251 303 -893 242 627 -414 -1 404 -499 -121 490 -341 -316 510 -304 -439 649 74 -690 496 268
1270 268 -818 255 821 -757 -487 982 -49 -722 619 429 -703 213 590 -360 -120 345 -222 -250
1288 -250 247 -54 -197 196 -106 -182 239 -93 -405 345 251 -515 60 491 -401 -246 671 118 -553 283 464
1309 464 -419 -91 439 -260 -359 274 46 -383 -25 129 -234 -97 70 -119 19 -70 -147 207 172 -330 -57
1330e7N09n69j72P02k74n83N65L39p75P3P20n28l44O99o8o06L45L78m57j05L21
1351A13k6j91J56o1p3J00j64J06K55k80j85M31J0n25K95M11n92l8O21j61n99M70
1373G3M06o82n8O64l01m53M00K08n03J01M37l82j53M20j95j71K29l6j27K23l2
1394F8l12M13j1n11M82L48q00Q0Q56o75m39J004k26r60P26M91r37J79P48n67l77
1415d20O66q6m90M52O6m12K30J17k72K49J27m08J70L75m48r7N34k62n11N15L38
1436D33p42N2P26o23m22R16O5q75L25O38p60r7Q50m00o08P12L2o53N78K39o33
1457b47K43L52o91L94M88q69q6R34o79l41J134l27j078R80M15j222N54Q68j194
1476c72k62J046l51n75P66j04o70M35L54m01J70J67l44O3L25k46J4L09m11j46
$$ plain form
1330 -57 452 -117 -289 413 139 -444 121 460 -315 -242 478 -50 -394 305 237 -369 -24 354 -103 -208 113
1351 113 87 -104 52 -9 -82 18 -146 -40 215 -65 -250 181 191 -334 -39 372 -220 -258 363 202 -397 73
1373 73 479 -203 -261 403 102 -351 49 257 -246 -145 292 -90 -243 177 -18 -189 40 4 -123 100 68
1394 68 -244 169 158 -353 129 477 -323 -243 613 -62 -501 503 277 -683 43 534 -403 -224 524 -43 -420
1415 -420 246 160 -330 122 188 -224 6 123 -149 100 227 -181 -11 364 -84 -181 353 91 -420 95 433
1436 433 -309 -257 469 -154 -576 340 405 -470 -145 493 -267 -364 486 86 -522 190 222 -431 147 386 -247
1457 -247 -4 348 -343 51 539 -330 -416 518 -161 -502 632 305 -773 207 622 -600 -46 822 -372
1476 -372 -634 412 61 -514 252 148 -522 -87 267 -134 36 203 -141 -78 247 1 15 324 -87 -233
1496b33M30Q4l58M8K33l18k45O07O9o91J73M84n78j43R64k61q39P33K42q35M96
1517F2O97j014j59P99m71j87P07m41n29P87k41m08Q65j36r90O30M60q71L82P40
1537F82j082j65J049l89m95P90q4q73M66M67m23O6J65k72j82K54K33m7n4j69L2
1558c1M1M9J94j86j84Q3j30J56L13l28j96L42k85j39P46j24r45N91L96q30L64
1579a03Q51j015l53J023l50m67Q99j30r69O80K73o52M44K82q30K28N73o18J56
1598g8O52q41k02Q68l93m80Q29o0q92M02N52m95P7L37l49j90L96P9j21j3n5j08
1620h5PJ72J71j64k85R9J59r0J30l5j81M9J5j16M02p2n20K95K39m25J59N46o13
1643a43k39P62l40m73P41O6q03L27M32o22K53M05m96j31M43k90P6L87m36k54M96
$$ plain form
1496 -233 197 281 -77 -29 204 -114 -359 248 317 -374 -201 283 -295 -438 526 265 -574 159 401 -434 62
1517 62 759 -255 -414 385 -86 -273 434 -7 -536 251 10 -398 467 331 -659 -29 431 -440 -58 682
1537 682 -400 -565 484 95 -400 390 306 -567 -101 366 -57 9 174 -98 -280 -26 207 160 106 -63 -31
1558 -31 10 59 253 67 -117 -34 -164 -8 305 -23 -219 123 -162 -301 445 321 -624 -33 363 -467 -103
1579 -103 748 -267 -620 403 53 -414 485 355 -614 66 339 -313 131 413 -417 -189 384 -234 -78
1598 -78 574 -267 -469 399 6 -474 355 295 -597 -195 357 -138 -61 276 -73 -263 133 212 91 78 23 -85
1620 -85 -78 94 265 101 -184 -85 74 -16 114 79 -102 -53 -38 -154 248 176 -344 -49 190 -235 -76 470 -143
1643 -143 -382 380 40 -433 308 374 -429 -102 330 -292 -39 366 -130 -261 182 -108 -32 355 -81 -335 161
1664A61j15k75M72j83n52N23K68n38K39K89l88j38M40nk15J4J6m2J05j06J29P
1686A06j90P8J08p0j17K29j42j49J81j5k16J77J05j75j5K4RK11j35j33K25K3k91
1709a72K84J55l54KK60j99k2K35j42k12K01J33j91n0O9l8L8n8M0J06j51o6K32
1732A00k9k18J08J67j55k1J68j06k9J17q2l1J3J4P6j05r4K08mk25N2K71j93j80
1756a78K51N9k69J65J21j99j0J75j47l5Q3l2K0j1k5J3P4j34L0J82j58p6K08j5
1780I2k58J53J80k45rJ29l9r5J22J1j15L3N5N8j42P5O7o1m4PN9L3n9J7L9p8m2
1807e7J33J09k26K0J46j18j49K10j5j01RJ29j02j26K39r2j03P6L0l2k1O9m3J8
1831Ckj7R3jj51J00J28j90k7J53k6j51J46K5j94J00K53k05j96K60q4j06N3Q4o9
$$ plain form
1664 161 46 -229 243 60 -492 31 299 -239 0 289 -99 -237 203 198 -17 -3 13 -29 76 -30 99 106
1686 106 -84 -6 102 32 -85 144 2 -147 34 19 -197 -20 85 -90 -105 -81 -72 139 4 -129 96 119 -172
1709 -172 112 267 -87 -85 175 -24 -46 189 47 -165 36 169 -22 -72 -3 -41 -3 -61 -21 85 -66 -132 100
1732 100 71 -147 -39 128 -27 -48 120 14 -15 102 20 -11 2 16 92 -13 -107 101 97 -128 -76 195 2 -178
1756 -178 73 132 -137 28 149 -50 -60 115 -32 -67 16 -16 4 -7 -32 -19 55 -79 -49 133 -25 -101 107 92
1780 92 -166 -13 167 -78 -87 42 3 -92 30 41 -74 -41 14 72 -70 5 72 11 -33 -26 33 66 7 24 63 -15 -57
1807 -57 76 185 -41 -21 125 7 -142 68 53 -48 -39 90 -12 -138 101 9 -94 -18 12 -20 -41 28 -15 3
1831 3 1 -16 77 76 -75 25 153 -37 -64 89 63 -88 58 83 -111 -11 242 37 -159 101 17 -89 -36 48 -21
1856b1L0K3j6J6j9n1L5Kn4K1J35j50K3J66j61j42J93P7k01J2J68j27j17J82M0
1881F4j47k6K02j52j6J22K4j06L4P4l1j8J4%M1l0m8N1M6j33J2J67j68q0J48K1
1907F5k81J68J97k84K2J79r7j51J79O5k00J40N9r6O0L4n7l3P0k4n7J27n0j00J39
1932G4o7p7J25Qj11m6J62j10p7J85l9j78J26M7j29L1J37m8r9N5J14j38l7J83j18
1957b7K3M1m3k9Q5n2l5M5J7j04J05Q2j62M6J21j54m0K31r4k46K50O1k57O3K28
1982A55k22j2K37j15j28J20J6j63J22O1j34J36k8j02R9M7j56N2M5k6o1Q5oj43
2006a21R6N1q2l4J68j2j73R8J20j25j1J80j53o4J57l2q5O0po8JJ05q9MJ43k18
2032i1K3J20m3j07J81q5j49J71Q0k43J32J36k11j05M01j52k20K48q0j31J42J07
$$ plain form
1856 -21 9 32 16 32 13 -38 -3 -1 -55 -34 101 -49 -26 140 -21 -163 30 107 -94 -82 86 -41 -158 24 64
1881 64 -83 -109 93 -59 -75 47 71 -35 -1 73 42 24 38 38 79 49 1 52 98 -35 -23 144 -24 -104 44 65
1907 65 -216 -48 149 -135 -113 66 -31 -182 -3 62 -138 2 61 -35 25 59 2 -31 39 15 -42 85 35 -65 74
1932 74 7 -70 55 63 -48 -94 68 -42 -119 66 27 -151 -25 22 -107 -76 61 13 -86 -31 83 -55 -92 91 -27
1957 -27 -4 37 -6 -35 50 -2 -37 8 25 -79 26 108 -54 -8 113 -41 -81 150 56 -190 60 121 -136 -73 155
1982 155 -67 -79 158 43 -85 35 51 -112 10 71 -63 73 45 -57 42 89 -67 -15 30 4 -57 28 22 -121
2006 -121 -25 26 -56 -90 78 66 -107 -9 111 -14 -25 155 2 -62 95 63 -22 38 31 -37 -36 69 -20 -16 127 -91
2032 -91 -68 52 9 -98 83 -2 -151 20 100 -143 -11 125 -86 -191 210 58 -162 86 6 -125 17 124
2054A24j28L3L1j46P1O7o0j9J07j06n4J82rj76J27%j65J15N5jr4K8Q8j33K2J23
2080H2q3j20J82L7j88M9J10j10n6J30j2l4P4k7j07O9L9l3J7L3j48R6J13j39k4
2105e0J94k00q2J71M2j50J36P4k13P6J37j63k7P0K4r9R3Po0qj2L2L0p8L6O0j22
2132h2OJ01J1o9k6M3N8j8m4M3N9j62P3Q1p3J4N7j5j67J62K5j72J24M2j39k9J93
2159I6q0j0Km9L1P0r6L4K9r6QJ79l1j34R5%j49O4J32o8o2N8nj33J12O9n2Ml3J3
2189bN5o2N5m4m4L6K2lm5M9J2p2j0P8m4O9j17O5O6n9p5J63q4j19J32L4j23M1O0
2218C4j05p5K25m1j35J01J6o7O5K6J3q1M7J8J6n1r4J80rj44L1J32j48J2J41n3
2244E4p9M0N5q2l5M2L0r9K8R1k8j20N3L2l4OJ04l7p1L8N3j1k3K0l3K9pL9k5m4
$$ plain form
2054 124 -4 29 60 -86 -15 52 -8 -27 80 -26 -80 102 93 -83 44 44 -121 -6 49 48 -46 -18 70 -63 -41 82
2080 82 -1 -121 61 98 -90 -41 69 -41 -97 33 21 -13 61 34 -73 -4 35 2 19 52 -96 0 113 -26 -50
2105 -50 144 -56 -138 33 75 -75 61 135 -78 -2 135 -28 -55 15 39 -60 33 40 -20 -28 -40 -8 22 -56 -20 40 -82
2132 -82 -76 25 36 -33 -59 -16 42 24 -20 23 82 -80 -7 74 1 15 72 57 -110 52 77 -95 29 71 -68 -97 96
2159 96 16 6 8 -41 -10 60 -36 -2 27 -69 -61 118 87 -47 48 48 -101 -37 95 27 -35 23 18 -115 -3 66 14 18 -15 -2
2189 -2 53 -9 46 2 -42 -6 16 13 -32 17 29 -43 -53 25 -19 50 -67 -2 64 5 -70 93 9 -110 22 56 -67 -26 34
2218 34 -71 -146 79 38 -97 4 20 -47 18 44 57 -24 23 41 57 6 -88 92 83 -61 -30 102 -46 -34 107 54
2244 54 -25 15 70 -12 -47 -5 25 -74 -46 45 17 -103 -50 -18 -52 -46 58 21 -50 -12 41 30 7 27 -6 23 16 55 30 -14
2274a4rQ8l6p0K7P1q7j4J18q9p8P9R0j44M8M6p5L3Q3m1p5P4k6L3k6l8M7jj20J05
2304aR5j55p9K27m2j03l2J26n6k6J06pj18P4L1j7j08J11K0j36P1P6jj02K7O0M3
2331H4j06K1M2J6o9K6M6k6j11R4j6p3K9P2o4p2J28o8j05J25J22j14k2J19r0l5
2357d7P6L7l6ql1J1L0j8m8J9j9l1J03M2j48N4Q5r3n0R7J0k08J38J60j97l2J54
2384E0j04n1J30L4j12kP4k8k1lPK6j8pK3J6N4j29J02rj09Q6R0k03J8K61k33q4
2412a42J84M9k61J48J29k06M9J53r9j41K51q1o6M9M6p8O0K1j16N9P8k00P1J93
2436A50k65j4J79m2j51J68N4k15L5K18j16j02K02Jj37%J58j19n6J28l9j03R9L7
2460G0q2JP7o9n1Q2j3n9J27j46j08K43l0k12K77k3k88J58K87l01j04L35j87k14
$$ plain form
2274 -14 -23 65 29 -41 -14 57 -30 -44 74 -15 -93 -14 76 -68 -20 26 -49 -16 67 26 -49 25 -1 32 6 -32 15 14 -106 -1
2304 -1 94 -61 -140 87 45 -58 -90 36 -20 -46 60 53 -65 9 40 23 -85 26 46 -90 -19 57 56 -46 -19 41 84
2331 84 -22 -1 41 57 -12 14 60 34 -77 17 1 -72 -43 29 -35 -107 21 -47 -152 -27 95 -19 -41 78 -12 -47
2357 -47 29 66 30 22 -9 2 32 14 -34 -15 -34 -65 38 80 -68 -14 71 -22 -72 25 35 -173 -35 125 -72 -104 50
2384 50 -54 -105 25 59 -53 -55 19 -9 -30 -33 -26 0 -18 -25 -2 14 68 -61 41 32 -77 9 99 -104 -86 175 -58 -142
2412 -142 42 91 -170 -22 107 -99 -50 103 4 -137 114 33 -33 16 62 -16 44 65 -51 8 86 -114 -43 150
2436 150 -115 -129 50 8 -143 25 79 -136 -101 117 1 -101 101 102 -35 -35 123 4 -52 76 37 -66 33 70
2460 70 -12 -11 66 -3 -54 28 15 -44 83 -63 -171 72 42 -170 107 84 -204 -46 241 -60 -164 171 -16 -230
2484b30L31N0k45J32M7k04J52Q3j99N4J24j39j0J91j78rJ61j46j96L62m9k23J71
2507C0M4k21J31J20r3j32R2J14j43L9J43o7j92J08J71j57r4J97r1p4J15Rj43J52
2531E8o1j55J58N0r4J45K5k96J47J85k23p4M11l33j59M08L1m33K14J39l29P0K66
2554A50j86o7J79j27j2K16j68j03K11j39o7K32l3k06J68J6k38K34R6k11n8J49
2576C6K6j14R9K2k5q6K8J26j03p4J31n2j63J45P3j76P2J74k44L5J39j00K7O6j22
2601f0j5J47r8q4K49j13k14L28N4l30J45J78l65O3L95l32m6J93n9j83K09j7q9
2624d4R8o9l9J47l2j31J29J7j56J34K6j34K5J21j24k8J48p7o6L6M7k7MJj5P8j37
2651f8R7O6j96M1J23j34j2J66n3j37J06K4o9K3J01j05J08p7m9J18K3j37J27K4
$$ plain form
2484 -230 101 151 -94 38 85 -119 33 116 -83 -29 95 -44 -54 137 -41 -50 111 -35 -231 131 82 -141 30
2507 30 74 -147 -16 104 11 -121 -29 85 -58 -19 124 57 -135 -27 144 -13 -107 90 -1 -75 40 49 -94 58
2531 58 -3 -158 0 50 -44 101 126 -170 -23 162 -61 -135 276 -57 -216 192 223 -210 4 143 -186 -116 150
2554 150 -36 -103 76 -51 -63 153 -15 -118 93 -46 -113 119 86 -120 48 64 -174 60 156 -55 -113 36
2576 36 62 -52 47 69 44 -42 -14 112 9 -65 66 14 -149 -4 69 -107 -35 139 -105 -70 69 -31 -4 62 -60
2601 -60 -75 72 -26 -110 139 26 -188 140 194 -136 9 187 -178 -115 280 -52 -98 95 36 -147 62 45 -44
2624 -44 54 -15 -54 93 61 -70 59 76 -80 54 80 -54 -29 92 -32 -60 88 11 -55 -19 28 1 5 6 -9 69 -68
2651 -68 29 95 -101 -60 63 -71 -83 83 30 -107 -1 23 -46 -23 78 -27 81 4 -45 73 96 -41 86 110
2675A10k40Q1K21j96j41K26%k04J82J5j02JQ2p3KL6l3J7j6L4J4L1r6N6P8j00l6
2702e1J26q8k8J34j2j23M5N8o1QL2NK0r3pM6n2k3J21j5j49J11P5j56N2J54j37
2729hk5O2l6l4N7m1O0J2j06P2K2q7J4R1k1j27R6M0j24M5J39j34j1Q7K3r0Q5m1
2757B0qj8J5N9k9j01Q0M1j35R8O2m8j07P0N5r4OR1l4l0m2J20n1q3J5J35j09p9
2785a01K06j01j18R7J19j43N3J08p7j05J08l1J0Ml2P4np4k3Q0r2J4O3L1j50N0
2811c5P6k5q2Q7l7r1Q5N0l6p9J13l3m3J20j1o2k5N6J6K8r7Q6n0p1N7k4N6j17O3
2840b5J09l5q9O9j0p9OJ41o8r5J94p1j44J16N7o3r8J36l1q1k4O5l4M9l3lN9j5
2868CMJ7k0r7J38K4j23nJ56j39k3J02P0j74%J99j52k2P1J7j02Q6j6l5L8j1J3p3
$$ plain form
2675 110 -130 -49 172 -24 -165 61 61 -143 39 54 -48 -47 35 -38 -36 0 -33 -16 -32 2 16 47 -49 7 85 -15 -51
2702 -51 75 -13 -41 93 81 -42 3 61 0 8 40 45 65 -28 -35 11 -41 -64 57 42 -107 4 79 -77 -25 129 -8
2729 -8 -33 29 -7 -41 16 -25 35 47 -59 13 35 -52 -38 53 32 -95 1 41 -83 -38 101 -33 -44 43 66 -24 61 20
2757 20 12 -6 9 68 39 -62 18 59 -76 22 84 36 -71 -1 54 -40 -34 57 23 -7 -49 71 20 -63 -48 87 -22 -101
2785 -101 105 4 -114 -17 102 -41 12 120 43 -62 46 15 25 29 -3 71 66 -8 -31 49 -43 -29 34 65 -85 -35
2811 -35 41 16 -66 21 -16 -107 -22 28 -8 -87 26 -7 -50 70 59 -3 -28 28 44 72 -25 61 11 -60 -3 -27 29 -88 -25
2840 -25 84 49 -40 29 19 -60 -54 87 19 -76 118 47 -97 19 76 13 -85 51 20 -61 -85 -20 -54 -5 -38 -41 18 3
2868 3 7 24 4 -93 45 69 -54 -59 97 -42 -65 37 107 -67 -67 132 -20 -42 29 46 -56 30 14 -21 17 6 19 -54
2896e4L1K4j0J9k3K5L8o3m9J16l8j13Q4R6n0r7J42j1j60J15M9r8o8J30k2l0J16
2923I9l5r5N0L0q4Q9m7k5M1o0l0N0Q7j26jJ33j04m3J48o4q0P9J00j29j03K05j6
2950F9j53P9Q8j33MJ03m1p1P0M0q9K8N6rk4KpL8p6j1N4L0n2m2Q6k5j14J09P8j72
2980h5L7J09m8j38K25o8j17mJ47q2J7L3o2j9J22j06m9J07r5L9O7l8rO9m6j20J68
3007E4M3j70J04Q0r6j01J55k7p3R7%k0p8L7OkqJ2k9m8R4k6o7J5M5JJ1Rr3M9K0
3038fq8J23J2m1j3O9n7j0J55r5j48J58M3j43L6Q7j20q7K05n0n8O8m5m7O4l1QK3
3066A2kj24J71m8k0J5O3j37nJ49m2l9K6%q9M5N8rn6k5R1N5j32J06m3o7OO6n1J6
3096a0M5ro3M3L5l2K9J6p9J4j3PQ4j5k20J81N6j51O0J15j46lJ08r1m1M0M0o1N3
$$ plain form
2896 -54 -23 1 -9 10 -13 12 50 -13 -62 54 16 -97 -13 83 33 -64 78 67 -93 22 71 -27 -95 35 13 -17 99
2923 99 64 -31 19 49 -35 54 7 -18 23 -37 -67 -17 70 -56 -57 76 -28 -71 77 13 -67 12 112 -17 -120 85 69
2950 69 -84 -5 83 -50 -46 57 16 -55 15 55 -34 -6 50 41 17 19 12 50 -26 -37 17 47 -5 -47 39 14 -100 9 87 -85
2980 -85 -48 61 13 -125 100 32 -85 -89 58 -24 -7 26 -36 -55 67 -39 -88 19 -76 -37 30 -8 -17 52 6 -114 54
3007 54 97 -73 31 111 15 -86 69 42 -31 66 66 46 -32 5 11 9 1 13 -16 -64 30 4 -63 -48 -3 -2 9 18 -75 -26 -6
3038 -6 -94 29 41 0 -13 56 -1 -11 144 49 -99 59 102 -41 -5 82 -38 -125 80 30 -28 40 -5 -52 12 -19 -11 12
3066 12 10 -114 57 9 -11 4 67 -70 -75 74 32 -7 19 19 -70 -25 33 24 -32 -57 34 89 -43 63 20 -47 -41 25 -26 -10
3096 -10 35 26 -37 6 41 9 38 54 -25 -11 -24 -17 67 52 -168 13 69 -82 -22 93 -53 -56 52 -39 -80 -40 0 -61 -8
3125hL2J1n4L2j8k9M9k2J01j0q3mR1j01N3M9p8p8P5J7J0o7N9L3p6m8Q7L0j40J2
3155g5J27q7j2M0j4p5J01J9k1j6O6q2J6O1o3N3n6o7J00Op1P4K8j09k2J17K6j29
3183f5Q2M4p2l7Q2Qn9O5l1OK2n8oj9K2K7ro1M6Q3q4rL6J5j02P8K2o2J8J5m4RK9
3216ij8L5j0r0J72Lj36N6K4q3M7Q5o2o7R0j4k4N3p4O2m1j6lK1j5k5M2k6J5Pk2
3247b3n2O6Q1j06qM7o4K8O9J6On1MkK6r9J35o7m0K4L8J5n9M8k9l0RN1nj1n9N2
3279A0m2m1L5M9l3J9K1or6N1L9k7RKK4lJ5j3J1n9N6K7q1L0l1R1n3k9J14m1o5K4
3311Gj3NqL1p3J1N8J4p9J3J03j47P6J8J2o3NJ6j4J4k2N7j6J3l7L9o3k4M4L8o2
3342d7j2O5km8M6Rm2OO9n7l2Q9Qq8L3Q1o3j6qK5lJ7K6j15J00r7N1Nqk2j6Q4j2
$$ plain form
3125 -8 24 35 -19 13 -5 -34 15 -7 94 84 1 -3 88 -13 40 89 11 -67 8 25 35 -32 27 60 -16 -64 23 53 -87 -75
3155 -75 52 -35 -47 -7 -21 -96 5 24 3 -13 53 -29 -13 48 -15 38 -18 -85 15 21 -50 24 52 -57 -79 38 64 -65
3183 -65 17 61 -11 -48 34 42 -17 48 17 23 45 -13 -19 -38 -16 11 2 -59 -13 70 -14 -23 13 28 -74 4 26 -36 -18 -3 -47 -38 -9
3216 -9 -27 8 -2 -92 80 83 -53 3 27 -56 -9 76 14 -53 37 23 -1 52 -22 40 -1 -17 -20 1 -14 -39 3 -23 -8 -1 -23
3247 -23 -75 -9 72 -34 -42 5 -59 -31 38 54 60 9 13 11 37 -62 73 6 -34 -10 28 43 -16 32 3 -27 -18 33 28 17 -42 10
3279 10 -32 -73 -38 11 -22 -3 18 12 -84 -33 6 -21 -12 -10 14 11 26 13 24 -35 21 48 -33 -3 -34 57 4 -25 89 48 -17 7
3311 7 -6 -1 -9 22 -51 -40 18 32 -47 -34 69 -78 -2 16 28 -35 -30 -14 -28 -14 -36 21 5 18 -19 20 -43 -67 -23 15 -47
3342 -47 -59 6 4 -44 2 11 -31 -25 44 -13 -45 44 52 -36 -3 78 15 -1 -9 16 13 30 56 -59 41 -56 -5 0 -8 -30 -46 38 26
3375B6o3R8q3k0O1Mp1Q3noj8K8m2k6L2N6m4LPJm3N1j9k4K1oj9J6m0J9N1pl1J3
3409CK1r2N0M6o1m4J34k3o9m0J51j13KPM0p7Q0j8%o7N7k4K8L5M8q9Km2pJ17l7
3440A8o1O7ko2Q8Rq7M5M9l4l2L7Mj00Q4l2KN7m4l4Rn1M0L5Nj2NL0J1j8m7K3m9
3473d7N5J9j9J9m0M1m4L4O7j18M2M0j3j15J02Kn7RO2m7j0NL2n0P7n6kJ5mk0K1
3504@prj4J22p0o8P0j22J12N9o4l0M3mq7P0N5p2j6k9R2m8N5l1P8n4m6O1L8j15
3534c1K0K4lJ3jj6j1j4j3Q5q5J6J8K0o6M0L4o1KO6j16jJ37j4j40M5P4n1M1rl8
3565c5lM0L4j4L2n1m5O3l5K5J17j26m8J16n7OJ2l9j01R8K5J3r6N9j2J1PpJJ0m7
3596d7K4Oj8J2P7q4k4J00Op9jO4m2QkL2%m4kO0n0j7N7n4l3N3K0r9J21Ko7j0J6
$$ plain form
3375 26 -37 61 -22 -42 19 23 -48 35 30 24 6 34 -8 -34 -2 54 10 13 20 21 -22 29 10 -14 7 1 -18 -2 -42 -23 28 21 -10 3
3409 3 24 -68 -18 28 -33 -77 57 34 -35 -75 76 -37 -35 -28 12 -65 15 -3 -3 -70 -13 -37 -9 26 74 -15 -13 -55 -62 55 18
3440 18 -43 24 22 -40 48 57 -30 15 64 30 -2 35 39 -61 23 -9 -7 50 6 -28 -19 -70 -30 5 10 -2 3 33 44 26 -21 2 -47
3473 -47 8 27 8 27 -13 28 -16 18 85 -33 9 49 36 -79 23 25 -32 -23 39 -8 -18 -13 19 -31 46 -10 -12 3 -1 -21 0
3504 0 -7 -16 -30 92 22 -46 24 -98 14 73 9 -21 22 18 -69 1 56 -16 -32 -61 31 -17 38 7 85 31 -15 46 84 -31
3534 -31 -11 13 10 23 22 6 -5 -19 -32 53 -32 -16 2 22 -44 -4 30 -31 -29 37 -79 -80 57 43 -97 -52 22 -29 12 3 -35
3565 -35 -38 2 36 22 54 3 -42 21 -14 11 128 2 -46 70 13 19 31 -8 -109 -11 14 27 -69 -10 -22 -11 -4 -11 -10 0 -47
3596 -47 -23 -17 -35 -23 54 -30 -54 46 52 -27 -28 36 -6 2 0 32 32 -12 -14 46 -4 -21 36 -18 -51 2 22 -77 44 46 -21 -31 -15
3629a5J0LL2q2K1M6m0J8lL1j3K0n7n5O6N1q3M8RQm5K7lj4l1M8O4k8NQmj10J23
3662E5j4n2L2k1O0k0o5%L3M1o6NrK9K4J9j10Q6n0J1m2M5nk3M5J8j1r8J13k9k9
3693b8L8On3O0rN4p9J1Jl0O4k8J4l0K7J4Jl5nQj3nLNK8n9J6N6k9l1J4OMk5N6n0
3729b3k7M8J1m3N7Ln1K6%L3k7rlJ6KpK8l7jK7l5%NN6n9j4N1Lo5J08l0j6n9nL7
3764@L4l7j8P2k8jJ3k8k7L9L2o3Pk9M2j0K7l4O3r3J00m2l3L3j3kk6K1L2m2k9Q5
3796D5q8K9Q3q8Mn9O0lk6K6K9k4l2m2N9M6m1k4N4J4k8N8m8j6k0O8m5l6oL2QN6
3828D5m1OK4k9jrJ0k1M7j8l5L4m4J7qM9m5J4M0j21P8oL2Mm3OLl6N1Lpm6Q4jo9
3863c3J4L6K6J1o3J1m2K5OM7o1N1j7N4q8j2O0p1N9J0Qk4j8K7o3M2j6L0rj5k1O8
$$ plain form
3629 -15 -5 -2 30 -52 -31 15 -25 -7 -10 21 8 28 -29 -84 -18 33 -50 -2 7 15 -30 -3 -6 -20 -51 -3 61 33 38 46 42 -68 55
3662 55 41 -11 21 0 60 40 -25 -25 8 49 -17 -12 -21 8 32 51 -59 27 -23 -12 -54 -9 -14 -37 8 26 15 -83 30 1 -28
3693 -28 10 16 -37 23 14 68 -11 0 1 -29 35 7 21 -9 18 32 33 -2 -7 1 -12 -17 -14 -9 19 -40 -24 32 3 -28 -14 -8 -4 -29 27 -23
3729 -23 -50 -2 9 -34 23 26 -25 1 1 34 7 -2 -5 11 13 6 34 -3 -4 23 -12 -12 -7 49 -10 -24 27 30 -35 73 43 27 -32 -37 0
3764 0 34 -3 -21 51 23 22 35 7 -20 19 51 -12 -5 -34 8 -2 25 -9 54 -39 61 19 -14 19 6 4 -22 -1 31 -11 -40 45
3796 45 -43 -14 69 -19 -15 -74 -14 -17 -43 -17 12 -12 -44 -86 -27 19 -22 -46 8 22 -6 52 4 -12 -32 36 -9 -45 -51 -19 -11 45
3828 45 4 10 34 5 4 -5 5 -16 31 13 -22 12 -32 -15 -23 26 -19 -5 35 -86 -8 -14 18 22 -21 -15 -12 -48 3 6 -1 -47 37 36 -33
3863 -33 -19 17 43 54 -9 2 -40 -15 -9 38 -23 28 11 65 -23 -35 25 -46 13 23 31 7 -11 16 -47 -5 -21 9 0 -15 -36 32
3895C2k4OL5m0k9ll5N1m3N1M2o8O4n3L6Om3j2J0K3O8p8j05J25p4O5m2M7l4Nj1
3926b8L2k3j3N1k3nL0m0J1K7o0R3j14M5l4P2l7K8oM4k5oK6n0k5P4q6L9R9n2j06
3957f2M2J9QOk0J6mm7J8K6L0J2j01O6Lk7L0k1J7n0K9nLK1M0p8j3N4kK6l4J0Po9
3991e0N6pK1P4j12J4J4%j5Qk2m0J35r6K6nL2o4O3Nq6N2Q8q1k3N1k7QM7n7l3l6
4023f0P1m4M6k5MJ9Nj1O2oj18R4Qlo2L2rj3M6mol5J7m3K5j4L5L5q4J7L1j08O1
4056c7N0l4k8J9oK2L3k3m7J12m6n0L0rm3J6P6q7R1k2J3o6N2J0l9P4k3j22L0R9
4086D5q2lJ12p4K3q4O2J3m1J9j1MoJ6K9o5L9L1l7L9k6K8p2L7l0K6l8m7J30m6o6
4117g5L5O9j4l2O8m6l4o%m0N7O6n0ljLo0O7j7m2LO5j1J7m1m9J27l9Pl6J7k1L9
$$ plain form
3895 32 8 14 49 9 -20 -23 -58 -7 -50 1 43 -25 39 -14 22 28 -15 -27 -17 6 74 -4 -109 16 -58 7 -35 12 -22 -17 -28
3926 -28 4 -19 -32 19 -4 -9 21 -19 -8 19 -41 52 -62 -17 -51 21 -16 12 6 50 25 19 45 -5 -30 44 -42 -3 96 44 -62
3957 -62 -20 -1 7 13 -7 9 5 -42 -24 2 32 44 -57 9 12 -15 15 -6 11 -39 -10 -15 -12 9 49 -29 -42 12 10 36 2 12 19 -50
3991 -50 6 -1 20 94 -18 -4 10 10 -5 3 -19 -59 76 -20 6 1 33 -31 32 37 -49 3 91 10 -13 38 11 19 66 9 -24 -60
4023 -60 11 -33 13 -12 -8 11 16 5 67 61 -57 37 45 42 -20 12 3 -10 36 32 26 -9 8 -35 -10 -24 11 46 -38 -21 10 -98 -37
4056 -37 13 -21 -49 -30 -36 -14 19 -4 -51 61 15 -35 -5 -14 -57 -41 35 -52 39 17 30 -36 16 26 -13 61 38 -84 -54 45
4086 45 -37 -40 72 -2 21 -63 -1 12 -29 -10 -21 -17 -23 -7 22 -43 -4 27 -10 29 3 31 -41 -4 -34 -8 -46 -93 37 -9 -75
4117 -75 -40 29 15 -17 51 5 -29 -35 -35 -75 -18 48 -2 -5 -6 -3 -63 4 -13 -55 -52 13 2 19 -22 -71 56 17 24 -12 5 -16 23
4150B3K3n1jKM8j2n4M6o1L0K8l7M0k8L6L1q8M7K3o7l8O9J7q6M2K7k3L4o3N8j9
4181dJ9p1O4l3k6P5K4q4K8K1j6K2n2QrJ03Nj18M2l3P7J4o1J3J17j43j0Q6m3m2
4211b7N7K5r1PN5oq0O9l7mL6k6OQ1q8n9O8k1J1O9n2k4M9j3n4J11j8o1N2n4M4k
4243B3k8j1qL1m2M5oom2O5qOrL0n1LJ3%n7J7M5k8O2n6oJ7K3Nl4pLN2l9k8M6k2
4279bl4J3J7oKO4q7ON0k6L5p4M6j7mJ5k0N3n3O2k1p6L6L3j6oN2Lr2N3l9J5J0n6
4313f4M1K7j4K7j6k3N6K4nk4n1L0k9L3nm0J8K2lk2M7n5O6o1QM4K6n3n9Q2J5r5
4345e3K5J07j10j9R6n0m2M3j8l1K6k2L8Oj7mk6KK6M3J2r2O4n0k6R9k9L4l4n3O5
4376A0rk9K7L7n3P5j7m2qK0k1PJ7l9j3K4M1p5Q8l4j1m2K8N4l0K8pm0J2oj4L4r
$$ plain form
4150 23 46 -5 -6 -4 44 32 -22 24 -37 -7 21 -16 24 -4 32 63 -25 22 45 -22 -60 9 26 -60 -18 9 -14 20 -43 15 -4
4181 -4 15 -56 8 -25 -51 24 48 -36 -8 13 -3 19 -33 -25 -34 69 74 -44 -2 -35 42 56 -5 8 125 -18 -28 58 15 -27
4211 -27 30 55 -36 -29 26 20 -60 9 -28 -32 4 -22 -16 65 -23 -82 -14 -35 -24 45 -7 -31 18 5 -49 62 44 -17 35 -19 25 23
4243 23 -5 -16 -24 7 -35 10 4 -2 -44 21 13 19 10 40 -11 -8 5 5 -52 -35 10 -18 44 -12 -18 -1 22 27 -7 -14 -11 41 2 -26 20 -2
4279 -2 -36 -23 -6 -12 -10 54 -33 -27 23 -3 32 -42 4 -13 -17 -2 -22 31 -22 40 19 -57 -21 12 -4 -10 42 45 -47 6 -33 -18 -8 -64
4313 -64 -23 4 -10 17 1 -22 34 58 53 29 -22 8 -21 12 7 -33 -15 7 4 -18 29 -26 40 -21 -13 31 57 4 -55 27 42 -53
4345 -53 -28 79 -31 -50 46 -4 -46 -3 -21 -52 -26 -48 -10 -4 -21 -25 -51 -49 -23 20 32 -60 4 -46 -72 27 -2 32 -2 -55 10
4376 10 1 -28 -1 36 -17 58 41 -1 -9 11 -10 -3 14 -25 -38 -14 27 -48 40 6 -5 -47 -19 35 5 33 26 -14 -2 -8 -22 12 3
4409Cl7oJ7J6l1Q4m9o5R5qj7J6k1J3J8j0nK7k8L0n4JL7p8Q2j02Q5K4n0L1j5J2
4441A5k1l4N5j1j0J3k9R7r4KN9q1j5M3Qr4Q7kJ9J0j1n2N8j9l0M8j1LL1m6M7m4
4473inK2m0P3o2M2n4J5L2l0K6k6J4L7j3m8k3N0K0n3lJ7o6Q0L0o0Nj0Q1m4J7K4
4505C9l1Rj3k5M2k1J6L3jq9J9J03j16J8OJ4j00J14K3m7pK4o0O2K6m5k5J9L2qj1
4536@L1p1J7j4K1J8j6L2q3R4j1kj4M9jp6J0M3k8J0lk5J6O9n7j6JL7p1qQ4k7J4
4569B3m7M8q5M3M4Km4K2k2N0l0K0K7m0o8O5l6NpL1qkL3j8l9N9l1n8O0M0Km1J2
4602A0RM1j17R1n2P2r4K3O8r1K7M6l2j7k1O7n7l5J12q0L0Oj2K8r3N2L8l9J3R8
4632I1o3rq2J20m4k4J0j7J6m6N0M4r5J3J13j00l1L8O9j56R4O0o3qN7k4o5j5N0
$$ plain form
4409 3 -34 -40 -23 -7 -38 46 -3 -68 27 19 2 18 -3 10 28 18 13 40 12 42 -12 -11 26 -52 30 -72 13 37 -13 18 3 15
4441 15 -6 -40 15 4 -6 7 -22 75 -19 -17 42 -39 -54 -11 -3 -97 -10 -12 7 17 6 -46 12 -7 -37 11 0 3 34 -12 35 -9
4473 -9 -14 8 -32 41 -21 21 -33 -18 14 -16 10 -16 -2 35 22 -26 -49 1 21 -32 -35 -18 -84 -4 26 -34 -29 -39 42 -2 15 39
4505 39 8 17 4 -21 21 0 16 49 48 -41 -22 81 -35 -17 -11 3 -97 17 40 -7 -14 10 -50 12 38 -7 -32 -13 19 11 0
4536 0 31 -40 -23 -37 -16 2 -14 18 -65 29 18 16 2 51 50 -26 -16 27 -1 9 6 -19 -3 66 9 -7 -6 31 -40 -48 36 9 23
4569 23 -24 24 -61 -18 26 28 -16 6 -16 34 4 24 51 11 -57 8 -28 -23 -30 1 -7 -9 24 6 -33 26 -5 -63 -3 37 39 -2 10
4602 10 19 60 -57 34 -18 54 -40 -17 51 -40 -13 33 1 -16 -37 30 -27 -62 50 -30 0 6 -6 22 -71 -19 19 -20 -7 91
4632 91 28 19 -63 57 13 -11 -1 -18 -2 -48 2 46 -49 -36 77 -23 -54 -16 53 -103 -9 51 -12 -20 37 13 -52 -67 -17
4661a7J4l0K0L1K7o2%N0m2j6J2J9n6M7L9l6k0J8l2M1q2Q4j9NJ4k0j6N5l7j0m1
4692f0N6krP6m4N9n8o3P9Lml1j3j0n6R2J4k2o9P3p9M1oQ6j07M7KN3o4OJ4k3K7
4725HQNJ4j6l3J7l9QO9k1o9N0k3oK6J5Kl7j8K8j7rMM2k8MJ7NK0m2N3m0K1K9r5
4760d8J5J4J7l4l7P0k3J1M4k7j0j5J5J3N0p6N1o6PK9nrk0R1l8k2J1k8Mk9Q7l6
4792Fm4l8P5Nk1mP6n9j0J2k2ORNl1QM4j8j6O3q5J4M7j6K8k6k2RL1Nj08J01ln5
4826c4N4K6r8P6k1K2o0K6J8%m3M3L8n7m8nP2j0k5L5oJoL4m1j9Q4r4K5K6L0p3L4
4859D%k9PmN3K5o8l5N7k3J1ok6L7Jmk6l7J08m6o1N0M5o2J3n5R4j2k2N3j4r2R0
4892B6Jk6J8n9L7OpjK8qk2j0L2k6Pn0P1j4N4k6n6N2j9j3K2l9N7o7J5j4Q2q9J2
$$ plain form
4661 -17 -3 -33 -13 18 45 -17 -17 33 -9 -25 -13 6 -50 -3 36 0 -20 -2 -34 7 -75 9 -10 -5 9 -11 -27 28 -9 -19 -60
4692 -60 -4 -6 -15 61 17 76 18 -45 34 37 33 2 -11 -21 -77 15 29 7 -62 11 -68 -27 -33 53 -54 -7 -5 48 -16 -10 4 -19 8
4725 8 16 21 35 19 -14 3 -36 -28 41 20 -49 1 -22 -28 -2 13 15 -22 -40 -12 -29 -38 -34 8 -20 -16 1 6 26 -16 37 -3 18 47 -48
4760 -48 -33 -19 -2 -36 -73 -3 -26 -15 29 2 -8 -23 -8 5 55 -21 30 -36 -29 0 -5 -14 -34 57 19 -3 8 -20 -16 -45 42 6
4792 6 -38 -76 -1 4 -17 -21 55 -4 -14 -2 -24 -18 -9 -4 -35 -27 17 -1 -17 46 -39 -25 22 6 34 8 -14 -5 26 31 -77 24 21 -34
4826 -34 20 46 -52 24 3 25 -35 -9 9 9 -34 9 47 -10 -58 -63 9 -1 -26 9 3 4 -2 32 -9 -28 56 -38 -13 13 43 -30 4
4859 4 4 -25 -18 -22 31 56 -12 -47 10 -13 -2 -8 -34 3 4 0 -26 -63 45 -1 -62 -12 33 -29 -16 -71 23 11 -11 42 28 -64 26
4892 26 27 1 19 -40 -3 3 -4 -5 23 15 -7 -17 15 -11 -4 -54 17 3 57 31 -25 27 8 -5 17 -22 35 -32 -17 -31 51 -38 -26
4925b6N2m9Kj1PK1KJ6jm0O1j5l9J3LJ1m4J09q5K7n5O5J4m8lL6lo7K9J08r9m2L8
4958a3lKJ4L9q4j4Q9m7PjQP1n7k4j4N8k6j5L9n9J7K3J9n0M5l2LL5mJ9n0K7J2m7
4992a3n7R3o6M3l6K4jJ1mK2j4Lj3K9nk0K8m1L7j1j6j8J1j5M5J8o3M7j4n6J6L8
5024Bo0O6N1j4n3qM9n1L4Mj7L7J7o3QJ6J8k0J7l5J5J3p8J0M0k3k1P3o7J7LP5o8
5057a3q6M4R9j6p3R6o9n1J17l9k8LK6K5k9J6L5o4mL2m3l3O2l2M2l7M1k0J5o9J7
5088c6J00m3K2l0n1oO2n5O7K8l1l2N4o0j3k1K1J2P1p4J7oo9R7k5Nk3j2O2k7o4
5119f0P6l6Moj5J8Q6j20L2M4M8k6r1P9n7L5Mk6K9J0k3Ok4J7k4j3nJ8PrO8o3ml3
5153e4R8km8M2K7o4j7rJ7j6Q3m6l8N5j7l2NM1j9J7l3N5p1j3pL9K8Lm3L0n7N2m
$$ plain form
4925 -26 26 -23 -21 -32 -25 -4 -2 14 13 -27 34 19 -20 -7 -4 7 -37 72 -13 14 -41 24 38 -10 -13 23 20 -47 -18 90 -9 -51 -13
4958 -13 -16 -14 0 39 -45 -59 30 -17 -10 -11 -3 68 11 -13 -27 31 5 -10 29 -30 -13 10 29 -21 24 -8 -5 30 26 45 -5 22 34 -13
4992 -13 -70 23 -43 0 -36 -12 -13 -2 -6 16 2 5 -8 21 16 -4 24 -17 20 9 -7 -25 -14 -29 16 34 -29 18 4 -52 -36 2
5024 2 -58 8 59 45 -8 -16 33 -18 16 20 3 40 57 -6 2 18 36 16 33 -2 13 26 -52 -42 -2 -25 -46 27 -40 -23 -20 55 -13
5057 -13 -99 -55 44 28 -45 51 -18 -69 48 9 -19 -16 10 35 6 22 57 -7 -11 21 -22 -55 7 -25 17 -20 21 1 16 -53 -36
5088 -36 64 21 43 13 -38 -44 18 -37 30 58 27 -5 49 -11 -24 -45 -24 -12 59 -15 2 -4 -73 24 -1 4 -19 -31 31 4 -60
5119 -60 16 -20 -16 -22 -37 -19 67 -53 -21 23 71 45 -46 33 -24 11 15 -11 18 28 5 11 -13 4 -20 -33 -38 -20 -13 -22 46 -17 -21 -54
5153 -54 44 42 -6 36 63 -1 -18 -27 -10 -26 57 11 -27 28 11 -21 -16 25 6 23 -10 45 -26 -39 -46 -7 21 24 -19 11 -46 6 2
5186Bk9KL4j6M6p0jO0j1MNjm5K5nO2n5J5k7k4L6pl3l8M4L5Qm7L8m5J2jO4p2n8
5221i3J03Nq3P0L6k0k2m1L7K0Jk6j6oK8Rj0k4M9L3o5rL6n2K8rL7k0J7L3k6k7N0
5254D3m1l6K7J6ml0k1N4j0p5O0L1rm0j2R2p8lJ1L7l5P7p5J9j9L7m4L2n6N6j1r
5286a6J0K7K0j5k4L5Lk6J7m6K5Lk6mP1l1Rl9nK1j1J6k2k0L7l4P0l9p2M2j0KmL6
5320@k4j7N6M9o2j2O2j4q9K0N8n9N1oK9p9L5l4j6M7j8K%O1r1L7K2K8q1P1p2RL7
5353@l9j7L6mJ2j6N2j0k0NmM1q8O2Po9RP9%m4PrL8m5nN0p5M0K8n0L4Pk0Jn6N4
5389iJ9n4N8o5N1o9Q5J0p5N2M4l7o7O3lll3kk0KJ4K1j9N8nkm1K4K4l3lLL3k0k1
5424b0J7P8j55J03j2k2j8O1n3l4P1mjo3P0j7L4m8K6J8o9K5Kj1jJ8LK9m1NM5l1
$$ plain form
5186 2 -27 -25 9 -7 39 -31 -32 28 17 21 26 25 -20 5 0 62 7 22 -5 -29 7 0 -33 -71 -27 8 16 -31 7 -38 -26 -27 37 -35 -93
5221 -93 10 15 -68 2 38 18 -4 -45 -8 12 13 -13 -29 -35 -7 2 -8 -32 17 50 -15 -24 12 -40 -12 -21 16 -4 13 46 20 -7 43
5254 43 2 -34 -7 9 5 -25 -46 8 -2 -77 -17 14 5 -35 -47 45 -33 -36 -25 12 -23 54 -21 -2 -21 16 -28 4 -52 4 -7 -16
5286 -16 -6 21 41 26 2 37 40 14 31 -15 10 13 -13 -17 54 23 32 -7 -12 9 -2 14 -8 -28 9 -25 45 6 -66 -24 -34 -32 -36 0
5320 0 -24 -41 15 64 2 -10 52 38 -51 -31 27 -32 19 13 42 -37 -2 -36 -52 -5 -23 -21 -21 40 -51 -14 8 36 -45 26 -46 -37 0
5353 0 -39 -56 -20 -24 -12 -28 24 14 -6 -1 -5 36 -52 10 17 -52 -43 36 36 -8 -1 -10 28 -17 -22 28 -47 -7 21 -29 5 12 -8 -7 -63 -9
5389 -9 10 -44 14 -51 0 -69 16 26 -49 3 47 10 -57 6 3 0 -33 -35 -55 -53 -39 -18 -37 21 16 14 -27 -3 21 -12 -15 -12 21 1 -20
5424 -20 -3 75 -80 23 11 -11 -29 32 -21 -55 16 12 11 -52 18 1 35 -13 13 31 -38 -13 -11 -22 -23 -5 -2 27 -14 -9 36 5
5456ENNk5M3k5K3k1j8L9n2j0L3k3J2%%oj7N0K0j0m7K4J6m6j4L2N6l7m0N0r1kL4
5490c7R2p3j9O5m7K6kJ9Lj02J09j1kK5L0j02L3K8k2k6K4n6N0k5J2K6l7J4j8Q2
5520E9n5l9N5Pl8J2j8l2Rj3R7n2J9ml5K5K7k2K3k9L0Jk8K7N6j15Pj7N5k9l7R2
5552C8m6JjK4p2J1P6Kn4J2L0j4j9L3j3j0oK1olJ8j6o2P7k3pj7qK1NK2N3l8J6l2
5587A3j6J4L0L0qq1L6K5Jp0J2NK8l3J1L2j3Qm9oO5n4K1L0m3M1Mq1kN3L2q9P7n2
5621b9J2l3P6k4J3m2L1j0J2nNJ7l3N0j5l7pM5l6M1k9M5l5j0K9m4LKN6op9qL5J
5655ij5O1l4L1o9M9m9k7P5K0m0m3P9q5J04m9N9o4l6J2LK6j7K7l4K4Nnm6O6l3k6
5687d0lM9rJ1kNj8oRJ8K4o2J1m0N3oK5l7M6p8O6Nl6oJ4j8J1j0jj4Q8k7M0o0q2
$$ plain form
5456 5 10 15 -10 33 8 31 10 -8 31 -21 -31 2 -21 -9 -9 -9 -15 -32 18 38 28 -19 5 21 -25 -39 -7 49 12 -28 22 -69 -71 -37
5490 -37 55 -18 -37 28 -19 7 5 24 27 -75 34 23 21 46 76 -26 7 35 13 -13 11 -45 5 -20 -8 18 -19 -5 -23 59
5520 59 4 -35 20 27 -11 1 -17 -49 -40 -53 44 -8 11 7 -28 -3 24 2 25 -4 26 27 -1 26 82 -33 -26 -43 12 -17 -54 38
5552 38 -8 -7 -8 16 -56 -45 31 33 -21 -9 21 7 -12 21 8 -2 -8 13 7 4 22 6 -56 21 -2 -9 -26 -34 -13 -8 14 67 29 45 13
5587 13 -3 11 41 71 63 -18 18 43 44 -26 -14 -9 19 -14 -3 29 16 24 -25 -31 34 -20 1 31 -12 29 33 -48 -50 3 35 -54 23 -29
5621 -29 -17 -50 26 2 15 -27 4 -6 6 1 6 23 -10 40 25 -12 -19 26 -10 31 2 47 12 2 31 -13 -10 -8 48 42 -37 -45 -10 -9
5655 -9 -24 37 3 34 -35 14 -35 -62 13 33 -7 -50 29 -56 48 -1 58 -6 -42 -30 -27 -1 -18 9 -25 -1 4 -1 -47 19 -14 -40
5687 -40 -43 6 -3 8 6 11 -7 -13 -4 14 38 -24 -13 -53 0 -6 19 -18 28 -50 16 21 -15 -21 -7 -25 -14 -24 -25 -39 49 22 62 2 -80
5722h0Q6l6M0Lm1K6J1%k2J6j1M1n8mJ1L8n4K8k3L3l6N6j8l8M0K5m6n3R7J2j6j8
5754IK5l7l1O0JRj9l9M5oj4oj5l6L3M8k6l9P5m4N2p8L9J3l5K5j6K7K9o7m1O9l1
5787b1Q1r3qO2L8j37Q8Oo4M5j0N7n1L4k4m6K3Mk2L4j4L1J2k7j7M9p6R2p9O6n3
5818b0J3pMqJ8K6Nq5L8N9q2J0j3L8MQjo1M4J9j4N1rq8N0L9l6J0LJ4j4n7L2l1M5
5853DJn8N3L0n2j1R4p1k8J2P3m4n2P5r0N6K3j8l6K5k0O2l8oK6L8q1M4j1l2Pj9
5885d4j6N3j1j5N1n0L2mpL4k7L6k4J0n9k2P1k5lpJLMJ1mJ0J3n6L9L0l6n6J32n3
5919A1o4M0K2j5Lk7L7O1p6k8P0n0M6l2m7J9M9mj5k7L3Mk4J6k6OlJ3Qk2KMJ5K9
5953B8l6N2r0O0n1M4q8O0M8m6Ok9R3n7N1J2l9OLL0m9%l5L6pl0K0M0k7L8j8j6k6
$$ plain form
5722 -80 6 -30 10 13 -28 -2 9 9 -13 3 -8 33 -25 -29 -18 20 -34 -6 -29 4 -32 24 6 -32 8 33 -13 -66 31 43 27 9
5754 9 34 -3 -34 26 27 36 17 -22 23 17 3 -3 -18 -54 -21 27 1 -38 37 -7 45 -33 6 19 -16 9 -7 20 49 -18 -59 10 -21
5787 -21 60 -33 -41 21 59 -78 10 16 -48 -3 -13 44 -7 27 3 -43 -20 -16 -38 -4 -18 13 25 -2 -19 30 -46 46 -33 33 -20
5818 -20 -7 -14 -10 -18 0 26 31 -54 -16 43 -39 -29 -42 -4 0 8 7 -54 -10 9 -5 46 37 -51 -1 38 2 12 15 29 15 -42 -10 -41 4
5853 4 5 -53 0 30 -22 -33 61 -10 -38 -26 47 3 -49 26 -64 -8 15 -3 -39 -14 -34 28 -10 -16 10 48 -33 11 0 -32 -25 -44
5885 -44 -60 -7 -18 -33 18 -32 0 -4 -11 23 -4 32 8 18 -41 -63 8 -17 -20 -27 -26 -23 -19 -8 -12 -2 11 -45 -6 24 -12 -68 64 11
5919 11 -53 -13 9 -6 -3 -30 7 68 -8 -36 34 -16 30 -2 -49 -30 19 15 0 -27 6 10 -14 2 -24 -18 -21 -8 0 -22 -20 -16 -1 28
5953 28 -8 44 -46 14 -37 7 -81 -21 27 -19 -13 -42 51 -6 45 57 18 24 27 57 8 8 -27 9 2 -28 -8 32 5 43 25 9 -17
5986a7J8K7k7K0m0l2P4n3Mj4MN7j0o0O9op7N8pK6l5Mj4M6rL6J7j08NN1j3l3J2
6019b7j0N4K6l1j2j4K1J9n3pJ8Q3m3l8J6l8N1nkj4l7L4M3r4K5%K9QK8NJ2p6N7
6052B8qo9K8jJ2K1j3L1Lk0K6K1m6J3qo8jM5J1J9JQl1k7j8J08o4M0k1JL4k6l2p
6086a0K4L0n5L9MK8o5k8R5o0LK2m0M0lk8L4rk1j6M2l0J4M2p6L5j2j5N9o5KJ9K0
6119A9k9M8m8l8J9L7MJ6Nk3qj7L6m3o0R4mPj4K3j9l2N7O7q9K1No4K4N7m3l9J0
6152b1M5l4pL9l0K4m0k3O3j8m6N4j1L3n6N1o4kQR5m6l4K8n7JM0k3k3L8j4L5lK
6185DK4k6J9j5O7j28pO3%M6l7Pm6j3M7m6j9N6l4J9mJ0oM6q7P0J0J4m5K7K0m7j3
6218b4L5k4qL9j5lJ9lm3j4P8j2q0LP3n4K0Lk1O3m4J5Mk4nj3K8k5JoL9m9M6J1j02
$$ plain form
5986 -17 1 28 1 21 -19 -51 23 -30 -26 -40 -36 21 11 -49 20 14 -63 -5 -12 14 -21 -17 -31 15 6 42 59 -49 -44 7 -6 -39 -27
6019 -27 -37 17 43 12 0 -14 7 26 -27 -34 -16 67 24 -14 2 -36 15 10 8 -6 -43 -9 34 -60 -35 -35 -6 2 30 35 47 -29 28
6052 28 20 -49 -21 -22 -10 11 -2 29 32 12 38 59 13 26 18 -50 -51 -6 5 24 25 33 2 -25 -43 65 1 41 20 21 55 29 -3 -10
6086 -10 14 44 -11 28 32 60 -5 -33 62 2 5 27 -13 27 24 -4 30 21 0 -16 26 -4 10 52 -24 11 -1 -16 43 -22 -20 -1 19
6119 19 -10 38 -10 -48 -29 8 12 28 33 10 2 -15 21 -22 -82 12 8 15 1 24 5 -27 30 97 8 29 34 -30 -6 51 8 -31 -21
6152 -21 24 -10 -17 22 -8 16 -24 -47 16 -2 -48 6 -5 28 -28 23 -41 -43 -35 60 14 -20 8 -49 -48 -8 -31 -54 -16 -30 5 2 4
6185 4 28 2 21 6 73 -55 -62 1 1 47 10 17 -29 -42 5 -41 -60 -4 -38 -19 -23 -13 -19 27 -60 10 20 34 -11 16 36 -11 -24
6218 -24 11 -13 -21 18 3 0 19 16 -27 -41 37 25 -55 -52 21 -33 -13 -10 -31 32 -12 3 7 -17 -22 -35 -7 -32 -31 -37 2 -47 -1 10 -92
6253i2J37j0r7N0l3MJ9K3PJ2J3n1L8j2k%Mk3JK6k2M4j5l1M4q7L7kN5k9J5%l0Q3
6287G6m9On5K6j5m9M0k8L0KqM6q6qO3k6J6L4l3mL2k7Q8q0j8O1l2j4J2%K6j6J5
6320B5j4l3M5j1lJ1j7j0j2nN8pOn3L5j01R2J6J0K1n1J5K4m7M0k5l3N8j2k1j6j
6352a6K1n1jL9L9m4J2N5p8J5L8j9rj9J3l0N3mLm7M1K1m2j2N4Jn3j0J4J3rM9n6
6385a9j7j2J14j00L7N2k7j4n5N0%L0l6l3J5QL5k2j1N7l5j7o6O2RL4n2J9J0j7j4
6416a5LJ8k2J0K6JQn7J0j2j3Q5o9n0R9l2k9J5L7p9L5L2J3J8j6J8Rk3n5L3rj1J1
6449a1j8LK3k6L5m5Q5r1J00p2n3P4k0j9K5O2l1o1N2rl7R8l9l5j8O2j3K8m3rk1
6480b4kR0l9l0m4nP7l9L4%k7MK8O0q2m5O1noNo8LM2oj5L1n%L3j1k4M3k5l6N9K8
$$ plain form
6253 -92 45 35 -62 -12 -45 -41 -22 1 8 20 33 -18 20 8 6 6 10 -13 -12 14 -8 36 21 -10 34 -53 -16 -18 37 8 23 23 -7 76
6287 76 27 33 -22 4 -11 -60 -20 -48 -18 -16 -24 22 -64 -72 -9 -35 -19 15 -18 -22 10 -17 71 -9 -27 34 2 -12 0 0 26 10 25
6320 25 11 -22 23 12 9 20 3 -7 -19 -24 34 27 33 -20 15 -86 6 22 32 53 2 17 41 -6 34 9 -24 34 22 1 -15 -16
6352 -16 5 -46 -47 -8 31 -13 -1 54 -24 -9 29 10 1 -18 -5 -35 18 14 17 -30 11 32 -10 -22 32 33 -20 -30 -16 -3 -12 37 -19
6385 -19 -36 -48 66 -34 3 55 28 14 -41 9 9 39 3 -30 -15 -7 28 6 -5 52 17 0 -66 -4 5 39 -13 6 16 -1 -15
6416 -15 -12 6 -16 -6 20 21 29 -28 -18 -30 -43 42 -27 -77 22 -10 -39 -24 13 -66 -31 1 14 32 16 34 43 20 -35 -2 -11 -22 -11
6449 -11 -29 -26 -3 -29 6 -39 46 -45 55 -17 -70 4 -16 -35 -10 52 21 -40 12 3 -34 64 25 -10 -28 34 21 49 6 -3 -24
6480 -24 -26 64 25 -5 -49 -54 23 -16 18 18 -9 -5 23 83 1 -44 17 12 6 11 -57 -54 -12 -18 -33 -2 -7 -7 26 15 -9 34 9 -27 32 60
6516F0j24Q0l3JJ5k0j9KM0N2Rp2o4P4L0o0QL3j3kL8j9l2L0Kk6Nj3o8J03k9k0M6
6549A4p4N2J3rk4O0n2n4Q7K2n2k5Q2j5m7K7j0J0o5N5K2k1lJ9K5PNm2J9rJ2J0l2
6582GP4l9j3Pl9J3o6N0n7J09m0J0N7j00K4NK5j2n3N5Ropm7K9pO1j6m7J5k5jj7
6615d2M8J0l9K8l4K8K7Kj7jK3k2j5nqQj5J6J4M0r3Q5r0O4j2nmk5KL3N0j28J05
6648B8n6L5j6j5J8oK7Rr9L7L1j9M9p7O1On9P3kk3J3nRnn7P0m3M7l8k%l2rM8J4
6683A2p2qQ7p5K3M0K4l0J6Qj03Q9l9l1N1M0oj2m6O6k0m3kM4j5OO2o7P1k7r1KP2
6716B6J1n7mj0n4R2j2L2m0J8K4o9M1K1n3pM1m3O0L2p6K9pPMl0J2l6O2j2j5Rmj7
6750b5MOJ9K2k2qK8l6J4m0L3PlkOj3L8k5j9j4P7j49J11n3L1qQK0oN6m6k4m3KR0
$$ plain form
6516 60 -64 16 -17 -16 -1 -21 -40 -38 2 54 63 -9 -73 1 31 -29 -21 12 -1 -3 35 16 -16 14 16 -10 -5 -18 -86 17 -12 -32 14
6549 14 -60 -8 5 -4 -28 32 -20 -74 13 35 -17 -42 40 25 -22 5 -5 5 -60 -5 17 -4 -7 12 37 44 49 7 26 17 29 39 7
6582 7 81 42 29 36 -3 10 -56 -6 -63 46 6 16 73 -27 -3 2 27 15 -38 17 26 20 13 -34 -5 -12 49 33 -14 1 -24 -25 -42
6615 -42 6 16 -23 5 -29 -1 26 28 11 10 33 11 -4 -9 -17 -9 -24 -8 6 46 -47 38 -52 12 0 -5 -9 -34 -32 1 51 -77 28
6648 28 -28 7 -9 -24 -6 -12 15 24 -75 -38 -7 -26 23 -54 7 13 -46 27 25 2 15 10 19 14 -43 27 -16 31 -7 -9 -9 -41 -50 -2 12
6683 12 -60 -68 19 -56 -33 7 31 1 17 25 -78 11 -28 -59 -8 32 26 14 -32 34 14 -29 -31 13 -2 4 66 -1 70 43 -48 -46 26
6716 26 37 -20 -24 -34 -88 4 -8 24 -16 2 26 -43 -2 19 -34 -41 0 -43 17 49 -27 2 -5 2 6 -24 -12 -48 14 2 -13 -4 -8 -25
6750 -25 -21 -15 4 26 4 -4 24 -12 2 -38 -5 2 -1 -3 3 -10 28 3 -16 -30 47 -102 9 -44 -13 -21 -13 7 1 57 11 -13 -56 -54 36
6785C6m3mMJ3k5J9O3p4k9M5m7K5K1l8J5m1M0MK8J8m8J0mo9L5M6MJ3o3k6J03r2
6817f1P1k7Mn0P5Jn8J5J2K8m0Q6n5M1j12Q7J0pnL4j4n7qP3l0Nl6N7m4o5N3L2l7
6850b2OK8m6M4k1K0l6M1mm0J2k7L7k9K3J0Jo1O0n1Q2JJ5k0m5J9pqKOL9k0k4ON2
6885D3Pn0k2J0Rj4l5M7L1Mn0J0LJM2l7J8j8j2Ol0L1K6l6J2M0k6j9JK3l8KL4o2
$$ plain form
6785 36 -7 -11 -7 6 -19 0 63 -11 -40 5 -42 -17 4 -34 -19 -60 -20 -16 12 30 -18 -8 -12 -81 -46 0 4 17 -46 -72 31 -61
6817 -61 10 -17 -13 -63 12 13 -45 -30 -18 10 -30 56 1 42 -70 17 27 20 15 49 35 -22 -30 43 13 18 -18 39 -5 -70 -17 15 -22
6850 -22 -16 12 -34 10 -11 9 -27 14 10 -30 -18 -45 -8 -37 -14 -4 -3 -64 -4 -55 27 28 43 23 -22 -3 -10 -18 -16 -10 29 9 -15 -9 43
6885 43 50 0 -22 -12 -3 -17 -52 -5 26 30 -20 -10 -7 -6 36 -1 17 -1 -13 -7 -37 -6 20 -16 -4 36 10 -9 -8 15 -23 -21 13 -49
$$ [...]
8191A2
##END NTUPLES=NMR FID
##END=
