##TITLE=1H_Pr MQ
 200.13MHz,CDCl3,
 8 sc
 
 1.7.2025
##JCAMPDX= 6.0         $$ Bruker NMR JCAMP-DX V2.0
##DATA TYPE= NMR FID
##DATA CLASS= NTUPLES
##ORIGIN= UXNMR, Bruker Analytische Messtechnik GmbH
##OWNER= pz
$$ XWIN-NMR		Version 3.5
$$ Tue Jul  1 15:54:41 2025 Russian Standard Time (UT+4h)  she@DPX200
##.OBSERVE FREQUENCY= 200.1313
##.OBSERVE NUCLEUS= ^1H
##.DELAY= (6, 6)
##.ACQUISITION MODE= SIMULTANEOUS
##.ACQUISITION SCHEME= undefined
##.AVERAGES= 8
##.DIGITISER RES= 18
##SPECTROMETER/DATA SYSTEM= spect
##.PULSE SEQUENCE= zg30
##.SOLVENT NAME= CDCl3
##.SHIFT REFERENCE= (INTERNAL, CDCl3, 0, 14.3821)
##AUDIT TRAIL= $$ (NUMBER, WHEN, WHO, WHERE, WHAT)
$$ ##TITLE= Audit trail, XWIN-NMR		Version 3.5
$$ ##JCAMPDX= 5.01
$$ ##ORIGIN= Bruker BioSpin GmbH
$$ ##OWNER= she
$$ F:/spectra/data/she/nmr/H-C/1/audita.txt
$$ ##AUDIT TRAIL=  $$ (NUMBER, WHEN, WHO, WHERE, WHAT)
(   1,<2025-07-01 15:53:29.60 +0400>,<she>,<DPX200>,
      <created by zg, POWCHK disabled, PULCHK disabled
       configuration hash MD5:
       00 E9 B6 7A A2 85 ED C7 34 08 36 98 17 FE 4E 26
       data hash MD5: 16K
       50 16 DD EC 85 2E EF 76 3D 3B AA 98 A9 70 E6 03>)
$$ ##END=
$$ 
$$ hash MD5
$$ 65 72 D9 4B 56 45 E4 EA 17 E9 7D 2B EC 46 03 4F
##$RELAX= 
##$RELAX= 
##$RELAX= 
##$RELAX= 
##$RELAX= 
##$RELAX= 
$$ Bruker specific parameters
$$ --------------------------
##$DU= <F:/spectra>
##$EXPNO= 1
##$NAME= <H-C>
##$PROCNO= 1
##$TYPE= <nmr>
##$USER= <she>
##$AMP= (0..31)
100 100 100 100 100 100 100 100 100 100 100 100 100 100 100 100 100 100 
100 100 100 100 100 100 100 100 100 100 100 100 100 100 
##$AQSEQ= 0
##$AQ_mod= 1
##$AUNM= <au_zg>
##$AUTOPOS= <>
##$BF1= 200.13
##$BF2= 200.13
##$BF3= 200.13
##$BF4= 200.13
##$BF5= 200.13
##$BF6= 200.13
##$BF7= 200.13
##$BF8= 200.13
##$BYTORDA= 1
##$CFDGTYP= 0
##$CFRGTYP= 5
##$CHEMSTR= <none>
##$CNST= (0..31)
1 1 145 1 1 1 1 1 1 1 1 1 1 1 1 1 1 1 1 1 1 1 1 1 1 1 1 1 1 1 1 1 
##$CPDPRG= <>
##$CPDPRG1= <>
##$CPDPRG2= <>
##$CPDPRG3= <>
##$CPDPRG4= <mlev>
##$CPDPRG5= <mlev>
##$CPDPRG6= <mlev>
##$CPDPRG7= <mlev>
##$CPDPRG8= <mlev>
##$CPDPRGB= <>
##$CPDPRGT= <>
##$D= (0..31)
0 0.7 0 0 0 0 0 0 0 0 0 0.03 0 0 0 0 0 0 0 0 0 0 0 0 0 0 0 0 0 0 0 0 
##$DATE= 1751370808
##$DBL= (0..7)
120 120 120 120 120 120 120 120 
##$DBP= (0..7)
150 150 150 150 150 150 150 150 
##$DBP07= 0
##$DBPNAM0= <>
##$DBPNAM1= <>
##$DBPNAM2= <>
##$DBPNAM3= <>
##$DBPNAM4= <>
##$DBPNAM5= <>
##$DBPNAM6= <>
##$DBPNAM7= <>
##$DBPOAL= (0..7)
0.5 0.5 0.5 0.5 0.5 0.5 0.5 0.5 
##$DBPOFFS= (0..7)
0 0 0 0 0 0 0 0 
##$DE= 6
##$DECBNUC= <off>
##$DECIM= 32
##$DECNUC= <off>
##$DECSTAT= 4
##$DIGMOD= 1
##$DIGTYP= 9
##$DL= (0..7)
0 120 120 120 120 120 120 120 
##$DP= (0..7)
150 150 150 150 150 150 150 150 
##$DP07= 0
##$DPNAME0= <>
##$DPNAME1= <>
##$DPNAME2= <>
##$DPNAME3= <>
##$DPNAME4= <>
##$DPNAME5= <>
##$DPNAME6= <>
##$DPNAME7= <>
##$DPOAL= (0..7)
0.5 0.5 0.5 0.5 0.5 0.5 0.5 0.5 
##$DPOFFS= (0..7)
0 0 0 0 0 0 0 0 
##$DQDMODE= 0
##$DR= 18
##$DS= 0
##$DSLIST= <SSSSSSSSSSSSSSS>
##$DSPFIRM= 0
$$ [...]
##$SUBNAM0= <"">
##$SUBNAM1= <"">
##$SUBNAM2= <"">
##$SUBNAM3= <"">
##$SUBNAM4= <"">
##$SUBNAM5= <"">
##$SUBNAM6= <"">
##$SUBNAM7= <"">
##$SUBNAM8= <"">
##$SUBNAM9= <"">
##$SW= 18.0517328524113
##$SWIBOX= (0..15)
0 0 2 0 0 0 0 0 0 0 0 0 0 0 0 0 
##$SW_h= 3612.71676300578
##$TD= 16384
##$TD0= 1
##$TE= 0
##$TE2= 300
##$TE3= 300
##$TEG= 300
##$TL= (0..7)
0 120 120 120 120 120 120 120 
##$TP= (0..7)
150 150 150 150 150 150 150 150 
##$TP07= 0
##$TPNAME0= <>
##$TPNAME1= <>
##$TPNAME2= <>
##$TPNAME3= <>
##$TPNAME4= <>
##$TPNAME5= <>
##$TPNAME6= <>
##$TPNAME7= <>
##$TPOAL= (0..7)
0.5 0.5 0.5 0.5 0.5 0.5 0.5 0.5 
##$TPOFFS= (0..7)
0 0 0 0 0 0 0 0 
##$TUNHIN= 0
##$TUNHOUT= 0
##$TUNXOUT= 0
##$USERA1= <user>
##$USERA2= <user>
##$USERA3= <user>
##$USERA4= <user>
##$USERA5= <user>
##$V9= 5
##$VALIST= <valist>
##$VCLIST= <CCCCCCCCCCCCCCC>
##$VD= 0
##$VDLIST= <DDDDDDDDDDDDDDD>
##$VPLIST= <PPPPPPPPPPPPPPP>
##$VTLIST= <TTTTTTTTTTTTTTT>
##$WBST= 1024
##$WBSW= 4
##$XGAIN= (0..3)
0 0 0 0 
##$XL= 0
##$YL= 0
##$YMAX_a= 362491
##$YMIN_a= -442225
##$ZGOPTNS= <>
##$ZL1= 120
##$ZL2= 120
##$ZL3= 120
##$ZL4= 120
##$ABSF1= 10
##$ABSF2= 0
##$ABSG= 5
##$ABSL= 3
##$ALPHA= 0
##$AQORDER= 0
##$ASSFAC= 0
##$ASSFACI= 0
##$ASSFACX= 0
##$ASSWID= 0
##$AUNMP= <proc_1d>
##$AZFE= 0.1
##$AZFW= 0.1
##$BCFW= 1
##$BC_mod= 2
##$BYTORDP= 1
##$COROFFS= 0
##$CY= -3
##$DATMOD= 1
##$DC= 2
##$DFILT= <>
##$DTYPP= 0
##$F1P= 0
##$F2P= 0
##$FCOR= 0.5
##$FTSIZE= 0
##$FT_mod= 4
##$GAMMA= 1
##$GB= 0.15
##$INTBC= 1
##$INTSCL= 1
##$ISEN= 128
##$LB= 0.25
##$LEV0= 0
##$LPBIN= 0
##$MAXI= 10000
##$MC2= 0
##$MEAN= 0
##$ME_mod= 0
##$MI= 1.114404
##$NCOEF= 0
##$NC_proc= 0
##$NLEV= 6
##$NOISF1= 3.799351
##$NOISF2= 2.8
##$NSP= 1
##$NTH_PI= 0
##$NZP= 0
##$OFFSET= 14.38212
##$PC= 1
##$PHC0= -1204.714
##$PHC1= 13.5922
##$PH_mod= 1
##$PKNL= yes
##$PPARMOD= 0
##$PSCAL= 0
##$PSIGN= 0
##$REVERSE= no
##$SF= 200.129724274929
##$SI= 16384
##$SIGF1= 3
##$SIGF2= 2
##$SINO= 400
##$SIOLD= 16384
##$SREGLST= <1H.CDCl3>
##$SSB= 0
##$STSI= 0
##$STSR= 0
##$SW_p= 3205.1282051282
##$SYMM= 0
##$S_DEV= 0
##$TDeff= 0
##$TDoff= 0
##$TI= <>
##$TILT= no
##$TM1= 0
##$TM2= 0
##$TOPLEV= 0
##$USERP1= <user>
##$USERP2= <user>
##$USERP3= <user>
##$USERP4= <user>
##$USERP5= <user>
##$WDW= 1
##$XDIM= 8192
##$YMAX_p= 0
##$YMIN_p= 0
$$ End of Bruker specific parameters
$$ ---------------------------------
##NTUPLES= NMR FID
##VAR_NAME=  TIME,          FID/REAL,        FID/IMAG
##SYMBOL=    X,             R,               I
##VAR_TYPE=  INDEPENDENT,   DEPENDENT,       DEPENDENT
##VAR_FORM=  AFFN,          ASDF,            ASDF
##VAR_DIM=   8192,          8192,            8192
##UNITS=     SECONDS,       ARBITRARY UNITS, ARBITRARY UNITS
##FACTOR=    0.0002768,     1,               1
##FIRST=     0,             0,               0
##LAST=      2.2672688,     0,               0
##MIN=       0,             -442225,         0
##MAX=       2.2672688,     362491,          0
$$ Real data points
##PAGE= N=1
##DATA TABLE= (X++(R..R)), XYDATA
$$ [...]
1814C50j93l08N40l60k09M52k26M8l4k59R9j31l6M01j45k4K12j6k19J57l91L08
$$ 350 157 -151 389 29 -180 272 46 94 60 -199 -100 -231 -267 134 -11 -35 177 161 -58 99 -292 16
1836A6p0j31L52J03o44K92N28r11N13j11l85O78k08QJ2k37K62j15J1J53P2l86
$$ 16 -54 -185 167 270 -374 -82 446 -465 48 -63 -448 230 22 30 42 -195 67 -48 -37 116 188 -198
1858a98M64j20l03M06m21K54P8j08K09j11j26k72j9P3K21Pk66J31Q3l69K72J20
$$ -198 266 146 -157 249 -172 82 160 52 261 150 24 -248 -267 -194 27 34 -232 -101 -18 -387 -115 5
1880Ej1N15n38j13L15j88J14k4r3J14k58mJ71R0j59k03K12J49o9m28M14r7j27
$$ 5 -6 509 -29 -142 173 -15 99 75 -18 96 -162 -166 5 95 -64 -267 -55 94 25 -403 11 -86 -213
1903b13N23l8m69K88k68Q1J21K16k49M1l35J17J83k25J18K97j55j42K70n18R2
$$ -213 310 272 -197 91 -177 -96 25 241 -8 33 -302 -185 -2 -227 -109 188 33 -109 161 -357 -265
1924b65O11m17K57k40p0J65j65J33J84l33L86Rn08k8J86l4N33n53r7N48m08R6
$$ -265 346 -71 186 -54 -124 41 -124 9 193 -140 246 255 -253 -281 -95 -129 404 -149 -246 302 -106 -10
1946a0m6o0K85M5k70J27J8j96R0J21n72Q68m43j38M96o71N18l93J28k4M6M0O4
$$ -10 -56 -116 169 214 -56 71 89 -107 -17 104 -468 400 -43 -181 315 -356 162 -231 -103 -127 -81 -41 23
1969B3J69j42K9L20m74O8r2L5L13j57m18M58l26J12J63j40L7r3M9k3p8J03K55
$$ 23 192 50 79 399 -75 -7 -99 -64 249 92 -326 132 -194 -82 81 -59 -22 -115 -66 -89 -167 -64 191
1992A91k63J56J40M2rO3m25M28m48Q4O8M0m11K44R0nO4PL7p8k33J30L13l36J66
$$ 191 -72 84 224 266 257 320 -105 323 -125 -41 27 67 -344 -100 -10 -15 49 56 93 15 -218 -88 225 -111 55
2017E5K58m69O50k95l70M73n25K24J5k54L49j04m35K08O0k31L13K35j87K82M6
$$ 55 313 -156 494 199 -171 302 -223 1 16 -238 111 7 -428 -220 -160 -391 -78 157 -30 252 298
2038B98k86J69j73J00K25l98K65k44l26L11K64k45j41J64k04J32R9%L27n03L19
$$ 298 12 181 8 108 333 -65 200 -44 -370 -59 205 -40 -181 -17 -221 -89 10 10 337 -166 153
2059A53m7l50L03k83K0J97N1j02K56o3l38J03J6K39o4j02L6O8j92K13j25j54K03
$$ 153 106 -244 59 -224 -204 -7 44 -58 198 135 -203 -100 -84 155 91 -11 25 93 -99 114 -11 -165 38
2082C8K38k72J29k16L84k0l93M6q0P8k5K27j86J30k78K33O7k7j21J05l10M56N9
$$ 38 276 4 133 -83 301 281 -112 -66 -146 -68 -93 134 -52 78 -200 33 100 73 -48 57 -253 203 262
2105B62l01j82K21j85r5L76k15K99m51K27n2k93L83l3k01K52J74k57R0J92l8k8
$$ 262 -39 -221 0 -185 -280 96 -119 180 -271 -44 -96 -389 -6 -39 -240 12 186 -71 19 211 173 145
2127A45k29K8J82l47R6J80k75K35K58m18K83j3o27P17j63Q7l08k9K68k5J30k46
$$ 145 -84 -56 126 -221 -125 55 -220 15 273 -145 138 125 -502 215 52 139 -169 -198 70 45 175 -71
2149g1K82k15J96J04l84L56j03m04L16k00L61r0k21j49K43k56J8K01q5K28Q6k54
$$ -71 211 -4 192 296 -88 268 165 -239 77 -123 238 148 -73 -222 21 -235 -217 -16 -101 127 213 -41
2171d1J13J83l61K6j7OR8j10J53J36ol25J55j32P4J29r9J88j69J08j79K7j34N64
$$ -41 72 255 -106 -80 -97 -91 7 -103 50 186 180 -145 10 -122 -48 81 -18 170 1 109 -70 -43 -177 387
2195C87o19L11k30Rj8M4K01oj61N9K00k81k49M60j83N0L4M4qk17P5p8M58l64L04
$$ 387 -232 79 -151 -142 -160 -116 85 79 -82 -23 177 -104 -353 107 -76 -26 8 52 44 -173 -98 -176 282 -82 222
2220B22L4k0q1r9k04J24k1o8Q1j02J4lK05K28l77k29J64L45j59J30Q1n34L80p3
$$ 222 256 236 155 56 -148 -24 -45 -113 -32 -134 -120 -123 82 310 -67 -296 -132 213 54 184 265 -269 111 38
2244C8r7L95l61j66L07k14l6j16OL57k22l4L04n36L68M2k32J18J95j63o5nJ97
$$ 38 -59 336 -25 -191 116 -98 -134 -250 -244 113 -109 -143 161 -375 -7 35 -197 -79 116 -47 -112 -117 80
2267H0Q9k36j65L10k9M1M2k04j04M46m43L81l45P7O5m2k2ok7K46J57k01q9mJ31
$$ 80 169 -67 -232 78 49 90 132 -72 -176 270 -173 208 -137 -60 5 -37 -59 -65 -92 154 311 110 21 17 148
2292A48l6o9m15N38k42j22J13J33k44L64l08J44K65l96QK94J45k28j15Q7K43l56
$$ 148 112 43 -372 166 -76 -198 -85 48 -196 168 -140 4 269 -127 -119 175 320 92 -23 64 307 -49
2314d9j37K13k34N6L41l70P7K02l25M22j95k37L26j46J15J9K5k29K16M1o5Q0n14
$$ -49 -186 27 -207 -151 190 -180 -103 99 -226 196 1 -236 90 -56 59 78 103 -126 90 131 66 146 -368
2337c68L66L5j08KL4k00M15k57M4K12k81L42j50l3P9ml4J48M0l42J63M3p8j55
$$ -368 -2 33 -75 -73 -39 -239 176 -81 -37 175 -106 236 86 53 132 128 94 242 282 -60 103 146 68 -87
2361h7j26O0L58m02J71J21j41L4K03r6j2J4k03N30m80J87j15j58J86J72K13l72
$$ -87 -213 -153 205 -197 -26 95 -46 -12 191 95 83 97 -106 424 -56 131 16 -142 44 216 429 57
2383E7q6R2j65K95k71M4R3k22N4L24k53O3K20k68L99k92N5n9L0m3J30j85Nj17
$$ 57 -29 63 -102 193 -78 -34 59 -163 -109 215 -38 25 245 -23 376 84 139 80 110 67 197 12 17 -100
2407a00k3K62l22J72Lk78L50Q3m60L33q4J98p0J4q4J12m4k82K06k41j02N92m80
$$ -100 -123 139 -183 -11 -8 -286 64 147 -313 20 -64 134 64 78 -6 106 62 -220 -14 -255 -357 235 -245
2430b45N0K90j22J50j53j15K97J96k62K3j78LK41k27K71k13K4O4m06J94J59j52
$$ -245 -195 95 -27 123 -30 -145 152 348 86 109 -69 -66 175 -52 219 6 30 94 -312 -118 41 -111
2452a11m3K78l96J51QL79j57j64J62k06K32J6l7l4j57L6K27j14J49j31m88K59
$$ -111 -154 124 -272 -121 -113 266 109 -55 107 -99 133 149 112 78 -79 -43 184 70 219 88 -400 -141
2474a41K81k95L57k96k6J46j57K09o7k67M81j68OJ07k20Ojn9K89o3O0j75K37k68
$$ -141 140 -155 202 -94 -120 26 -131 78 11 -256 225 57 63 170 -50 -44 -45 -104 185 122 182 7 244 -24
2498b4N3k65MM21M8l24J27Q9M9P6m66K28K34m20P7j00l8J30j2R3k01q3J70K35
$$ -24 29 -236 -232 189 237 -87 40 129 178 254 -212 16 250 -170 -93 -193 -231 -101 -113 -20 -221 -304 -134 101
2522A01m19K96J11k06K23O5k61L90j78o4l1n8O8L13n91K71l72L38J93l81n4J85
$$ 101 -318 -22 89 -117 106 171 -90 300 122 58 27 -31 37 350 -241 30 -342 -4 189 -192 -246 -61
2544f1j13m3K90L3k46L61j69Lj5o9J01J47l28L64K8l68K25k98L76k87M0m0K44
$$ -61 -174 -217 73 106 -140 221 52 55 40 -29 72 219 -109 255 283 -85 140 -158 218 -69 -29 -69 175
2567A75j62m0L3K73l58K5K7j72K02k72L41k01N6J99j52j30J65k71J09K06j71J94
$$ 175 13 -27 6 279 -79 -54 -27 -199 3 -269 72 -129 -73 126 -26 -156 9 -262 -153 53 -118 76
2589G6j56kJ22O2m01J24K9K64J37j17l77L73p3j02J3R5J70o6m59O69o01o2K62
$$ 76 -80 -82 40 102 -299 -175 -146 118 255 138 -239 134 61 -41 -28 67 237 171 -288 381 -220 -282 -20
2612b0J32m61N54j92j74K28k32M06p0p9j19J25r8J44j27j9qj73J30J8j86n7K38
$$ -20 112 -349 205 13 -161 67 -165 241 171 92 -27 98 0 144 17 -2 -10 -183 -53 -35 -221 -278 -40
2635d0L7L61l22j40J43k1m6J51p1l86K42QO4m3N0J79k13k24J99J67j6j39j1Pr2
$$ -40 -3 358 36 -104 39 18 -28 123 52 -334 -92 -84 -20 -63 -13 166 -47 -271 -72 95 79 -60 -71 -64 -156
2660a56O0Q1Ko2M44l81L3l8K53k13m6J30k67J89k07J88K9n9R8k91J37q6L25j59
$$ -156 -96 -15 -13 -75 369 -12 21 -17 236 23 -23 107 -160 29 -178 10 39 -20 78 -213 -76 -162 163 4
2684DK19k36N4L0l25L23J01j28P2r2K01l38K29o9j3r7M1R7J17k51R6k0j30J56
$$ 4 223 -13 41 71 -254 69 170 42 114 22 223 -115 114 45 32 -65 -24 73 190 -61 35 15 -115 41
2708D1j18J08P6l5k1J60l11K12l67J29J06k13J16K15Q0k41K59m63K55J4M8J09
$$ 41 -77 31 107 72 51 211 -100 112 -255 -126 -20 -233 -117 98 178 -63 196 -267 -12 2 50 159
2730A59k17K87j70Kk74K93Kj27J79m47J53P2L79m54Nk54O66j93k88J14K61p4J00
$$ 159 -58 229 59 61 -213 80 82 -45 134 -313 -160 -88 291 -163 -158 -412 254 61 -227 -113 148 74 174
2753A74j10j52L46q0k10M3k67J48K08j30J31j06k07L37j55j1R7J06n2j57j17j61
$$ 174 64 -88 258 178 -32 11 -256 -108 100 -30 101 -5 -212 125 -30 -41 56 162 110 -47 -164 -325
2775c25L06k92L54R2n70L56N3q7l1J60m7Q4j4k81J64r8J86K07k29J26j89M3K34
$$ -325 -19 -311 43 135 -435 -79 -26 -113 -144 16 -31 53 39 -242 -78 -176 10 217 -12 114 -75 -32 202
2798B02k68k54M39l8j08n5M6R6k38k47N79j59J44q6L5k87K58l5K2J22j51K22J9
$$ 202 -66 -320 119 81 -27 -82 -36 60 -178 -425 154 -5 139 53 88 -199 59 24 46 168 17 239 258
2821B58j48r6j39J43k0p1q1N3L27n59K35M4L10mj61j76j05K82J7J44l70K15J03
$$ 258 110 14 -125 18 -2 -73 -154 -101 226 -333 -98 -54 256 252 91 -85 -190 92 109 253 -117 98 201
2844B01k92K31j45O3j17j71kK80N4j29L11l87k8K57j46J67k86K61m4k86K75l9
$$ 201 -91 140 -5 58 -59 -230 -232 48 102 -27 284 -103 -131 126 -20 147 -139 122 78 -208 67 28
2866B8j57N0J34k58L25j52O37r02K90j77K60k43J49K88l12K43m4q4J05J7k97K96
$$ 28 -129 -79 55 -203 122 -30 607 -295 -5 -182 78 -165 -16 272 -40 203 159 75 180 197 -100 196
2888A96n9j20J97k72k88K70J39k58J98j54K22j34k66L49j15m3K44O0j64K25k11
$$ 196 137 17 214 -58 -346 -76 63 -195 3 -151 71 -63 -329 20 -95 -138 106 166 2 227 16
2909A6k85K88k2j0K1k27K15M1j04J9J04j63L42l24J42j9j95J22J23j30J79M2P3
$$ 16 -269 19 -3 -13 8 -219 -4 37 -67 -48 56 -107 235 -89 53 34 -161 -39 84 -46 133 175 248
2932B48m13L57j71J42k32k29L4L24j77J92n0j65J56J48j38J11n8pJ67n87M17q6
$$ 248 -165 192 21 163 -69 -298 -264 60 -117 75 25 -140 16 164 26 137 79 72 239 -348 69 -17
2954a7LK22M2l54K38k67j40Q9J54J2R1q7j04O2N3N8J96l41K39j50K13j5l98O21
$$ -17 -14 208 250 -104 134 -133 -273 -184 -30 -18 73 -14 -118 -56 -3 55 251 -90 149 -1 212 197 -201 420
2978D20k90n12L90k59M03k37m4R4N9J07Q1j22j33p1J59r9n4K9q6O8K95k01k42
$$ 420 130 -382 8 -251 152 -85 -129 -35 24 131 212 90 -43 -114 45 -54 -108 -79 -165 -97 198 -3 -245
3001b45M31k06K3J09j47O1j96K68k12j42L76j46Mj24K90r3j06K37m65L6J32k0
$$ -245 186 -20 3 112 -35 26 -170 98 -114 -256 120 -26 -22 -146 144 51 -55 182 -283 -247 -115 -135
3023a35K85l43l5J71Q3j67J32M54o88L56K05l37P4j14J88o8j57M88m89N0J33O1
$$ -135 150 -193 -228 -57 26 -141 -9 445 -243 113 318 -19 55 -59 129 61 -96 392 -97 -47 86 147
3045A47K9k5j00nl19L03R1j08o6R0K4k40N3J14K3J04k75L33k06J58j52L5R9j98
$$ 147 176 151 51 46 -273 30 121 13 -53 37 61 -179 -126 -12 11 115 -160 173 -33 125 -27 8 107 -91
3069i1J48j33N5J25j13n4R0J55j88k24M14j40k7j60k1K76O1l4P6n6k94q3J10J71
$$ -91 57 -76 -21 104 -9 -63 27 182 -6 -230 184 44 17 -143 -164 112 173 139 215 159 -135 -218 -108 63
3093F3j02j37O7L10ql81L29j34J78q4K34l22K63l89q5Q2N4K1q0r8L03j88J75j65
$$ 63 -39 -176 -109 201 193 -188 141 7 185 101 335 13 276 -113 -198 -116 -62 -41 -121 -219 84 -104 71 -94
3117i4R4j69q1J09O2k93J61K20O3m52M87n6p9J14J44l06R8R9j60J5l8J99l78J94
$$ -94 0 -169 -250 -141 -79 -372 -211 9 72 -380 107 51 -28 86 230 -76 22 121 -39 -24 -62 137 -241 -47
3141d7K21n03M41k80J89j26K12k25n7N1mk04L00K95m29K75l18j5L52l08K77r6
$$ -47 174 -329 112 -168 21 -105 107 -118 -175 -124 -128 -332 -32 263 -166 109 -209 -224 128 -180 97 1
3163Ak49N02k21o2K14k84J95j78L0K04k18M6K65m52K13P6k35K52J35j17J4j28
$$ 1 -248 254 33 -29 185 -99 96 -82 -52 152 -66 -20 245 -207 6 82 -153 99 234 117 131 3
3185CK29k41J81N6l04o5J17K40m7j44k01L33k34N28k69j55j26J29j64K44O7m33
$$ 3 232 -9 172 228 -76 -141 -24 216 169 25 -176 157 -77 451 182 27 -99 30 -134 110 177 -256
3207b56O7N0K41K4r2L4l68J14OL7J48nK56l00K59m2o19N22q0K45j9j93n0K8J13
$$ -256 -189 -139 102 126 34 68 -300 -186 -180 -143 5 0 256 -44 215 173 -446 76 -4 241 222 29 -21 7 120
3232A20K29k42k10K45l31L97j03j3j86k22K88J55k87QL42j90j30L60Q3j96Pk89
$$ 120 349 107 -103 142 -189 208 105 92 -94 -316 -28 127 -160 -152 190 0 -130 230 313 117 124 -165
3254a65L11k36O6j23J85m85M69m9m3J21r2K03l04J33Q3o8l82L10P7O0P3J43n30
$$ -165 146 -90 -24 -147 38 -447 22 -27 -70 51 -41 162 -142 -9 74 6 -376 -66 11 71 144 287 -243
3277b43J38j83L69k55J41Q5k0J3m51N68m14P6Q3L0J31j70j41J30J21O4l30L25
$$ -243 -105 -288 81 -174 -33 52 32 45 -406 162 -252 -176 -93 -63 68 -102 -243 -113 8 72 -258 67
3299F7N0k50j21J28M4K05o6m13N18j51j99J31lJ3M9mj61J53j81L04l78R1J53J24
$$ 67 117 -133 -254 -126 -82 123 57 -356 162 11 -188 -57 -60 -47 2 -2 -163 -10 -191 113 -265 -174 -21 103
3323A03l83J41j11L08J03p8k61J31J22J06j81J87l28J14J46j12K2k00J79K7j26
$$ 103 -280 -139 -250 58 161 83 -178 -47 75 181 0 187 -141 -27 119 7 29 -171 8 35 -91
3344i1M6J81l19nK01k48K28N6J27n1l2l27K16L3k99N26j39J57k22j06P8R0k86
$$ -91 -45 136 -183 -188 13 -235 -7 49 176 125 93 -234 -18 15 -284 242 103 260 38 -68 10 100 -186
3367a86N00n11p9J24k7K8K49j73L48l33J56k50j3K60p2j33L5Q4l5O7L2j07J27
$$ -186 314 -197 -276 -152 -179 -151 98 -75 273 -60 96 -154 -167 93 21 -112 -77 7 -28 39 71 -36 91
3390I1r0k8o1j47K61m8m0j18K66QP6l61K48Q0k09j33J28q4K30k22J03K19j64q3
$$ 91 1 -27 -88 -235 26 -22 -62 -180 86 94 170 -191 57 137 -72 -205 -77 -161 69 -153 -50 169 5 -78
3414g8k11K49N1j89K54ooj47R9J01k90P0O7pJ41k62L78p7l06J45l95O30l8p4m6
$$ -78 -289 -40 11 -178 76 70 64 -83 16 117 -173 -103 -36 -43 98 -164 214 137 -169 -24 -419 211 173 99 53
3439E3j8r0j20J49P9M2j28qn0J8J97l64K8O8K45j62k5L80l09m1n6n1M1J81n9J25
$$ 53 35 -55 -175 -26 53 95 -33 -41 -91 -73 124 -240 -212 -144 101 -61 -86 294 -15 -56 -112 -163 -122 59 0 125
3465A25O0j35k70K11n4LL14l54J88l05M3L03m5l56L11j00j92L65k93L10j97N23
$$ 125 185 50 -220 -9 -63 -60 254 -100 88 -217 -174 129 84 -272 39 -61 -253 112 -181 129 -68 455
3487D55n16P5k9o4l52N76j86J17q4P0J00m43O5M17m4l14J74j25N08j55j61j57
$$ 455 -61 14 -15 -79 -431 145 -41 76 -8 62 162 -281 -216 201 157 -157 17 -108 400 245 84 -73
3509g3J88N2n9J9k04q0K5L43j26J59j56ML02m42N4O9m1l3J26j25k24L32k36k2
$$ -73 115 167 108 127 -77 -157 -132 211 85 244 88 92 394 -48 6 75 34 1 127 2 -222 110 -126 -148
3533a48J22o4lK88k81K03r8O4q4k7k09j8M01k57L24l14r9R4j49J49L42k81q9K47
$$ -148 -26 -90 -93 195 -86 117 19 83 -1 -28 -237 -255 146 -111 213 -101 -200 -106 -255 -106 236 -45 -134 113
3557A13j24pL9j53P5p1L02Q5k05M2l14R5P8J27J5O4j74M5N8N4Q6l25J00k26K49
$$ 113 -11 -18 21 -132 -57 -128 174 259 54 96 -218 -123 -45 82 97 161 -13 32 90 144 230 -95 5 -221 28
3582B8M4r5K06o32M30K45k52j1n6Jj79J96K39r1J30m67L79k1j94K6N9m8k97M93
$$ 28 72 -23 183 -449 -19 226 -26 -37 -93 -92 -271 -75 164 73 203 -264 115 94 -100 -74 -15 -63 -360 133
3606A33j20k77O4L9J41N1n7m0K40m58J61N6K23K5o2j31k92M60j61r8J02kj88o9
$$ 133 13 -264 -200 -161 -20 31 -26 -66 174 -284 -123 -67 156 181 119 -12 -304 156 -5 -103 -1 -3 -191 -260
3630b60M16j54%n9L28j67r4j6J99j58P1k11K70j82Q7J10j80k38kL22r7M32m93
$$ -260 156 2 2 -57 271 104 10 -6 193 35 106 -105 165 -17 70 180 0 -238 -240 82 -15 417 -76
3653g6J48k64K33k05L02R3l31L48k77j7K6LJ33J91Nn15J25p3J13R5L4j72J05m2
$$ -76 72 -192 41 -164 138 231 -100 248 -29 -46 -20 -17 116 307 312 -203 -78 -151 -38 57 91 -81 24 -18
3677a8J22Q7j39q0K0J56n6j0ok26J3K2j55L49k95L19j42k06K83l63M12R1M7j93
$$ -18 104 191 52 -28 -8 148 92 82 76 -150 -137 -115 -270 79 -216 103 -39 -245 38 -325 87 178 225 32
3701C2o5K4J45j88K7K60k25j86j53K84P6j89K72j62J0l6J62o4K53l17K36l37M11
$$ 32 -33 -9 136 -52 -25 235 10 -176 -329 -45 31 -158 114 -48 -38 -74 88 24 277 -40 196 -141 270
3724B70j46k60J98j54K23J21m54J02O5n0J63j79k28L94R8k41J19j51K42l4k9o6
$$ 270 124 -136 62 -92 131 252 -202 -100 -35 -85 78 -101 -329 65 163 -78 41 -110 132 98 69 3
3746CJ79j01k14K47k4k17p7P4R6J58j01l41J32Q9o1K28Q4r2P3m2k37j8J43kJ60
$$ 3 182 81 -133 114 90 -127 -204 -130 -34 124 23 -318 -186 -97 -158 70 154 62 135 93 -144 -162 -19 -21 139
3771A39j80r8M19k82rK9r3J21k61q4K52m6q3K88j2l47L59m09J46J28o5n5J73o1
$$ 139 -41 -139 280 -2 -11 18 -75 46 -215 -299 -47 -93 -176 112 100 -247 112 -297 -151 -23 -88 -143 30 -31
3795c1J37k5j62N08p20L82k6q6m0J88j60m2J32J44k50R5o3L0J88l88Q8l4j43J53
$$ -31 106 81 -81 427 -293 89 63 -23 -63 125 -35 -77 55 199 -51 44 -19 11 199 -189 -101 -135 -278 -125
3819a25j41M27j61j18M1K92k69l06L31L9O5l29L49J83j36j08k63J83K58ol88P7
$$ -125 -266 161 0 -118 -77 215 -54 -360 -29 10 75 -254 95 278 142 34 -229 -46 212 206 -182 -105
3841a05J3lK0Q0k24J61j92K03K7n3K02j74j20L41q3k20k2J50j04J42M9j13j2o
$$ -105 -92 -95 -75 5 -219 -58 -250 -47 -20 -73 129 -45 -165 176 93 -127 -149 1 -103 39 88 -25 -37 -43
3865d3J20k72J64R0J34k88Q6J27k09j49J92j75K10l9m7J90j1l11L36l34K29j36
$$ -43 77 -195 -31 59 193 -95 -9 118 -91 -240 -48 -223 -13 -52 -99 91 80 -231 105 -229 0 -136
3887a36J87k2j56J46j83J23o4k86M88l28L28k23K32k1j77K67j43J4j18K99l15
$$ -136 51 29 -127 19 -164 -41 -105 -391 97 -231 97 -126 106 85 -92 175 32 46 -72 227 -88
3908h8L3r1K25j41r5J44J17m7j78K92l11J05J92k15l0L21q3J22j29j76Q5j32J05
$$ -88 -55 -146 79 -62 -157 -13 104 57 -121 171 -140 -35 157 -58 -88 233 150 272 143 -33 52 -80 25
3931B5k28J14J96q1j14j3lK11J10j80j08R8J2k23L40l29J43K10j10k08R6K3r4
$$ 25 -203 -89 107 26 -88 -101 -104 107 217 37 -71 27 39 -184 156 -173 -30 180 70 -138 -42 -19 -113
3954a13K11j47jR7l36J53J93k66K15l2j10J81N2R3l27J48o7J42n0k3KR1m2j82
$$ -113 98 -49 -50 47 -289 -136 57 -209 6 -26 -136 45 97 190 -137 11 -56 86 36 13 15 106 64 -118
3978a18M4j95N08M5l36J20n8j84J95j33K22M5k17K34l35j96J11Q8K30j94P3L2
$$ -118 -74 -269 239 284 -52 68 10 -174 21 -112 110 155 -62 172 -163 -359 -248 -160 70 -124 -51 -19
4000a9N9L7N4k83L51k59J85L5L3r6j10p0j45l4L35o4J14k2J45j92k45M16j12j86
$$ -19 40 77 131 -152 199 -60 125 160 193 97 -13 -83 -228 -262 73 9 123 101 246 54 -191 225 113 -73
4024g3J77jJ19m23J88M9Q0l9M7n3r8L0k18M23j35j82L79l41j62Q5J49Q4k93K1
$$ -73 104 103 222 -201 -13 36 116 77 124 71 -27 3 -215 208 73 -109 270 -71 -233 -148 1 85 -208 -187
4048a87K53L3J3k39n5O3K34j2j55j22K00K76o08J26K41K4pJ34n55N1L71j02J20
$$ -187 66 99 112 -127 -182 -119 115 103 -52 -174 26 302 -306 -180 61 85 78 212 -343 -292 79 -23 97
4071I7l4j4K1m8j7q2l6J74L1j69K6K1r8K10q5n7j16K17K10J58o33L69j76k3k0
$$ 97 63 49 70 22 5 -77 -113 61 92 -77 -51 -30 -128 82 -3 -60 -176 41 251 409 -224 145 -31 -54 -74
4096g4O5j88L04j19j86K10J76k68r3j06M4q6L09N9k30N9N5J93Q9j71K28l57J26
$$ -74 -9 -197 107 -12 -198 12 188 -80 -173 -279 -235 -321 -12 47 -183 -124 -69 124 213 42 270 -87 39
4119C9q3K90r5j78j55J51j32r1K08J6J72j70N0q3j26K13Jj63L01j97j0J45n7r7
$$ 39 -44 246 151 -27 -182 -31 -163 -254 -46 -30 142 -28 22 -61 -187 26 27 -136 165 -32 -42 103 46 -51
4143e1J75k6QQ3j86kj28J49J40r6n2J62l9j97L4j02R2o9K74j06j80K43j95J66
$$ -51 124 98 106 189 3 1 -127 22 162 66 14 176 137 -60 -26 -128 -36 -105 169 63 -117 126 -69 97
4167I7j04J17J17k56R5K4N3j47j64O4J36M1O3p9p8p4J8p9N1lJ18j81p1J54J33
$$ 97 -7 110 227 -29 66 90 143 -4 -168 -104 32 73 136 57 -21 -95 -77 -156 -105 -108 10 -171 -242 -88 45
4192D5j06P4k73K69K9rJ10j16L4n3o4J19R8k58J60r7OQ4q5j44Q5J14Q5j15r6P1
$$ 45 -61 13 -260 9 38 29 139 23 57 4 -60 59 157 -101 59 -38 -32 52 -33 -177 -92 22 107 -8 -104 -33
4218c3Q4N7l08K75K7k78K42Q6M5rl35K29M2l9K7J1j95L08j39Pm6j04J22k05R9
$$ -33 51 108 -200 75 102 -176 66 152 197 188 -147 82 124 85 112 123 -72 236 97 104 58 -46 76 -129 -30
4243c0k4J0q4J29p7%l4K63R4m35L07j91r1p5M86k30k99K10K58j82J34l18N9J27
$$ -30 -54 -44 -128 1 -76 -76 -110 153 247 -188 119 -72 -163 -238 248 18 -281 -71 187 5 139 -179 -120 7
4267Gj48J89pj16M0J00J0j35M1j21L3m4K40l80K14R2M7k01O3J24k25K20j90N4
$$ 7 -141 48 41 -75 -35 65 75 -60 -19 -140 -107 -151 89 -291 -77 15 62 -139 -76 48 -177 43 -147 -93
4291i3J93O7j41j62J81j37P9k96K92p3M43o46M48K4l76J31j9J98j07l5J43L6k52
$$ -93 100 167 26 -136 45 -92 -13 -309 -17 -90 353 -293 155 179 -197 -66 -85 113 6 -29 114 150 -102
4314a02j62N28n8j10n3J92j82k31Q8R1J09j61M67j53l62j1L02J3q9j16l2p6L33
$$ -102 -264 264 206 96 43 235 53 -178 -90 1 110 -51 416 263 -99 -110 192 205 116 0 -32 -108 225
4337B25L5l75O0j20J67L5K3k1j87L0K48j15J13j76N3j14J23J5Qj31J11J89k35
$$ 225 260 -115 -55 -175 -8 27 50 29 -158 -128 120 5 118 -58 -5 -119 4 19 27 -104 7 196 -39
4360c9P5j16o6J86k25J04n2o4J62J66r4K2k54J59j66K52l9j53J21j7J8J78k51
$$ -39 36 -80 -146 40 -185 -81 -133 -197 -35 131 37 59 -195 -36 -202 50 11 -142 -21 -38 -20 158 -93
4383i3J08K34k13p4J06j48K50k36K21j46k53J65J30p6J8O6j58K56l38K73j27J58
$$ -93 15 249 36 -38 68 -80 170 -66 155 9 -244 -79 51 -25 -7 59 -99 157 -181 92 -35 123
4405A23l56K39L8J46l70K59k35R8K07l63P8K13j97K12N1k49K35l48M77m35L67
$$ 123 -233 6 44 190 -180 79 -156 -58 149 -214 -136 77 -120 92 143 -106 129 -219 258 -177 190
4426A90k48m9j13K18k2J49k48N30k79r5j41M6J7K62j48j01K02j86lK6J40k99L54
$$ 190 -58 -107 -220 -2 -24 125 -123 407 128 33 -108 -62 -45 217 69 -32 170 -16 -19 7 147 -152 202
4449B02l61M1L00k19j0j87K43K34k77J5j47J5J84j79L29m4q4P6k96J21j01L26
$$ 202 -159 -118 182 -37 -47 -234 9 243 -34 -19 -166 -151 33 -146 183 139 55 131 -165 -44 -145 181
4471A81M7l24P0N2p3N0j31K88l46L83m33R3LR0J01k14L1K77k92J56J52R2k88j4
$$ 181 228 -96 -26 26 -47 3 -128 160 -186 197 -236 -143 -140 -50 51 -163 -132 145 -147 9 161 253 -35 -49
4495d9j53J35K6P9J62k04j29K98j64P0m8oR6k62K1J92j00j8J98j34Q8j61j7J58
$$ -49 -202 -67 -41 38 200 -4 -133 165 1 71 23 17 113 -149 -128 64 -36 -54 144 10 98 -63 -80 78
4519G8j00J4j69k4J73m4K32m54O68j44qq0j66j31l4L50j12j75p8K37r8j39L17
$$ 78 -22 -8 -177 -201 -28 -72 160 -294 374 230 222 142 -24 -155 -189 161 49 -126 -204 33 -65 -204 113
4542A13j2L5L25j64m63K20l58J97J21l3R6j80l2K56qn3L4k20L92l27LM09l79m5
$$ 113 101 136 461 297 -166 54 -304 -107 14 -19 77 -103 -135 121 113 60 94 -126 266 -61 -58 351 -28 -73
4566g3Q6K6k12J83K5l16K71j15J20j28L3Q2K63q6m8L9o9j35O5j2m0jp4L01l15
$$ -73 13 39 -173 10 35 -281 -10 -125 -5 -133 -100 -18 245 159 111 150 81 -54 11 -1 -41 -42 -116 185 -130
4591a30J66K6k26J68k4J44q7q3J73j41K0j07N7O7j58Q9n4L5O5j04k19K82n1K70
$$ -130 36 62 -164 4 -20 124 37 -46 127 -14 6 -101 -44 23 -135 -46 -100 -65 0 -104 -323 -41 -92 178
4615A78j33p8j31R8J49J10l8k4j71L5k13K29j08J35p9K64j18J09j75j11o8M5Q0
$$ 178 45 -33 -164 -66 83 193 155 131 -40 -5 -218 11 -97 38 -41 223 105 214 39 -72 -140 -95 -15
4638a5o0j57L8J29m5N7j77O2n2K61j34J50j47J38k11N7K26k32J07K21R1l08P4
$$ -15 -75 -232 -194 -65 -110 -53 -230 -168 -220 41 -93 57 -90 48 -163 -106 120 -112 -5 216 307 -1 73
4661G3j59R5J23j72J65l4o2L5J10o4k1p3K20l75K09j06M88m30k5j20L03k47J63
$$ 73 -86 9 132 -40 125 91 29 64 174 110 89 16 236 -139 70 -36 452 22 -3 -123 180 -67 96
4684I6l07M3O7L97j34j24K7jj66J10Q3j99k90M00r0J81J46J24m13r0J67k0Q6j40
$$ 96 -211 -168 -101 296 162 38 65 64 -102 8 91 -108 -398 2 -88 93 239 363 -50 -140 27 7 93 -47
4708d7L8R6p0K0j01j0J28k5q4L11j89j80LK57j01q4j60K9J69J69J4p7l95K19L2
$$ -47 -9 87 17 37 -64 -74 54 29 -55 256 67 -113 -110 147 46 -38 -198 -169 0 169 183 106 -289 -70 -38
4733c8K86m87L43l14J17K85k02j41K34j27K72p2k13n0K59Q3l64J32Np5O3j4J1
$$ -38 248 -239 104 -210 -93 192 -10 -151 83 -44 228 156 -57 -107 152 235 -129 3 8 -67 -4 -18 -7
4756gM4j27k7lkr3K36j79Q5L00j26p2j73J76K11k38J03k15p2L39J02j96O9P2k12
$$ -7 37 -90 -117 -120 -122 -215 21 -158 -73 227 101 29 -144 32 243 5 108 -107 -179 160 262 66 135 207 -5
4781ej80L55l5j64j55k8L38k43M0R2K5L9p6j69K11j8J69Oj21j50l4j42K86p6m3
$$ -5 -185 170 135 -29 -184 -212 126 -117 -77 15 40 79 3 -166 45 27 196 202 81 -69 -103 -245 41 -35 -78
4806g8j00Q3L94l80K16j54P3p4r7R8J24j34L52k44j65j20K02K29p5j69j82R1p4
$$ -78 -178 -95 299 -81 135 -19 54 -20 -117 -19 105 -29 323 79 -86 -206 -4 225 150 -19 -201 -110 -184
4829a84O2J69PpQ0k08J99j16j88J48K28n12K25Q3R5j64K25j76M8q6J9M06l34J13
$$ -184 -122 47 54 47 127 -81 118 2 -186 -38 190 -322 -97 -14 81 -83 142 -34 14 -72 -53 353 19 132
4853A32j16L6L7k06J48O7q5m4k1K18j05O5k54l2J92k82K36Q7K4l37L00l5l9r6
$$ 132 16 52 89 -117 31 98 13 -31 -52 166 61 126 -128 -160 32 -250 -14 73 97 -240 60 25 -14 -110
4877a10o6l3L38l2O8j33j17j0r8L16j33J16K1k38K01j53NPj43L25Mj87j34J53
$$ -110 -176 -209 129 97 165 32 -85 -95 -193 123 -10 106 127 -111 90 -63 -58 -51 -194 131 135 -52 -186 -33
4901c3P4k73L27N1j12O1k57K21n0l1J06k61O4K03j83O7K05m3k92R4K8L30l60J38
$$ -33 41 -232 95 146 34 95 -162 59 9 -22 84 -177 -113 90 -93 -26 179 136 -156 -62 -34 296 -64 74
4925G4j39j76L5K84o6J04r1j59R2J53M5l11m3J27j04O5O2k15M09j01P4k49N3K29
$$ 74 -65 -241 -206 78 12 116 25 -134 -42 111 156 -155 -198 -71 -175 -110 -48 -263 146 45 119 -130 -77 152
4949A52k21j67J91K31k05j54K7J94Q4l63L7m4M27J14j51j59J71j37M1k34J69l81
$$ 152 -69 -236 -45 186 -19 -173 -146 48 132 -231 -194 -238 189 303 152 -7 164 27 68 -166 3 -378
4971c78L85K29j89r8p1k4J24NJ22m30J12K61k32M25j64N0j81J10j74K6J27QK3
$$ -378 7 236 47 -51 -122 -146 -22 -17 105 -325 -213 48 -184 241 77 127 -54 56 -118 -92 35 43 66
4994F6j06J78j05M1k71K88J56l63R5P3qL07j97k29N6J09j52j07K08j48K74o0j3
$$ 66 -40 138 33 74 -197 91 247 -116 -21 52 44 351 154 -75 -19 90 -62 -169 39 -109 165 105 92
5017I2Q7l32K11l5j99P8J15J2J2k27P5K68k05J5q7p7J73J32K16k78p7P7J99n17
$$ 92 179 -153 58 23 -176 -98 17 29 41 -186 -111 157 -48 -33 -120 -197 -24 108 324 46 -31 46 245 -272
5041b72J11J86N6j17O2M8k21M3NJ26L6J04q0m10M13k14n3J44J03r7j39L38l27
$$ -272 -161 25 81 -36 26 74 -147 -104 -99 27 63 167 87 -323 90 -124 -177 -33 70 -27 -166 172 -155
5064a55L36k80J48j37j41J68J15J70m55n0K20j19J21Q1j45J33k42Q5L17k53K01
$$ -155 181 -99 49 -88 -229 -61 54 224 -231 -281 -61 -180 -59 22 -123 10 -232 -147 170 -83 118
5085A18q1P9p2r3K41k02K35k69K4j08K85j64r4L04j31P8m83M00q7n0O9J68Mk87
$$ 118 37 116 44 -49 192 -10 225 -44 -20 -128 157 -7 -101 203 72 150 -333 67 -20 -70 -1 167 171 -116
5109a16n4J90o2J48j44p7K24j90K00kj28j23pJ21J46N2p0k09J23nJ2k24J04o4
$$ -116 -170 20 -42 106 -38 -115 109 -81 119 117 -11 -134 -141 -20 126 178 108 -101 22 17 29 -195 -91 -155
5133a55L07j85J18J8k39j8p0K07L02j73l60M7J4K39K8j69J08J01j84J49k39P0
$$ -155 152 -33 85 103 -136 -154 -224 -17 285 112 -248 -201 -187 52 80 -89 19 120 -64 85 -154 -84
5155h4R4q4m0P0L9m02N85Q3m27J01k5M9J7K74P9j16k96K13R3k68J82ON2n3J38
$$ -84 10 -74 -114 -44 -5 -407 178 261 -166 -65 -90 -41 -24 250 329 213 -83 130 223 -45 137 143 195 142 280
5180B80k39O7O8n46K03O3J85O4k27J28k2j4K11j23k38J00L71L5l65K78n03J38
$$ 280 41 108 176 -370 -167 -104 81 145 -82 46 24 10 221 98 -140 -40 331 366 1 279 -224 -86
5202h6N8L16m41K55mK5n3k10K12L6m70M26Or0J60j96j73L11J2q8k00J80K41j81
$$ -86 -28 288 -153 102 98 123 70 -140 72 108 -362 64 70 -20 140 -56 -229 82 94 6 -194 -14 227 46
5226D6k46K74L3l5K64m88J3J93J6k64L31j15o5l7J06k91O3K46ok58L94j26j25
$$ 46 -200 74 107 72 336 -152 -139 54 70 -194 137 22 -43 -80 26 -265 -202 44 38 -220 174 48 -77
5249g7M41n81J58K42j25m0R0MM1k45J7O6m1L60o39J38N93l84j8j9K6L4l72L12
$$ -77 364 -217 -59 183 58 18 108 112 153 -92 -75 -9 -50 310 -329 -191 402 18 0 -19 7 41 -331 -19
5273a9j95L12k43j06K38L30k18j45k46M20P6l54K43m07J67J30R5n2J05m12L24
$$ -19 -214 98 -145 -251 -13 317 99 -46 -292 128 204 -150 93 -314 -147 -17 78 26 131 -281 43
5294D3M7j47J25j05J05k90R7K25kl18L23k01J11n7K8J65j15j28L07m22K48p9l08
$$ 43 90 -57 68 -37 68 -222 -125 100 98 -220 103 -98 13 -44 -16 149 34 -94 213 -209 39 -40 -348
5317c48K98O5O1k14K49p3J7lJ55l06Q3N4l42M87p4j04j82J17l8J52j29R3q7J67
$$ -348 -50 15 76 -138 111 38 55 52 207 -99 -16 38 -304 183 109 5 -177 -60 -98 54 -75 18 -69 98
5341I8k29J89j11L7p5k3M2K05j8j08o9n0J91k59J89j22L66k05o4j40L37l54L57
$$ 98 -131 58 -53 -16 -91 -114 -72 133 115 7 -62 -112 79 -180 9 -113 253 48 -16 -156 181 -173 184
5364A84PP8m27K07o2r4R4k33K87j70J19J70j29p2j4J96O1j26J33j46l40L40j58
$$ 184 191 269 -158 49 -13 -107 -13 -246 41 -129 -10 160 31 -41 -55 141 202 76 209 63 -277 63 -95
5387i5J28p7J0n9K40L2k31K33M5k35J03M0N9P6l10q3k07N48j09k54n1J31J63k45
$$ -95 33 -44 -34 -93 147 179 -52 181 226 -9 94 134 193 269 -41 -124 -331 217 108 -146 -197 -66 97 -148
5411a48L75j11k54l9K67j62K01n2J7j62L46l93l1K20N3Q6k98O6r4J80o7MOJ47
$$ -148 227 116 -138 -177 90 -72 129 77 94 -68 278 -115 -146 74 127 213 -85 -19 -113 67 0 4 10 157
5435A57k26J9q9L1J39p6k9K42M0k45j4J24j81K70j68R7M5o3qK04q7j90R2K79m92
$$ 157 -69 -50 -139 -108 31 -45 -74 168 208 -37 -51 73 -108 162 -6 91 136 73 65 269 182 -8 84 363 -129
5460a29J55j4j69K4J35O4K1m43L69M9L4J19k48l9J50o4M8k61K82L1q9J73l64K35
$$ -129 26 12 -157 -133 2 66 87 -356 13 62 96 215 -33 -72 78 14 62 -199 83 114 25 198 -166 69
5484F9k55K19q7k1M4j3o7J56q6L1J59k7o3R9l36K33J22j28j05J36k50K85r8l9
$$ 69 -186 33 -54 -75 -31 -44 -111 45 -41 -10 149 122 59 158 -178 55 177 49 -56 80 -170 115 17 -22
5508b2j20O9M15k60l3r5L01p4r3o1O3r3J27p7R0k22J29J6k1J48l29j28K56j70
$$ -22 -142 -73 342 82 49 -46 255 181 88 27 90 -3 124 47 137 -85 44 60 39 187 -142 -270 -14 -184
5532a84L04J06Q3l03R0m45K63j21q3M61m74J47oJ80J76j62O5l24j55L08m4J41
$$ -184 120 226 309 6 96 -349 -86 -207 -290 171 -303 -156 -162 18 194 32 97 -227 -382 -74 -118 23
5554B3l30L90j11J22j16lk22L09L04j37l94o6M66k16J59k80J25k02k3K77n6k6
$$ 23 -307 83 -28 94 -22 -25 -247 62 366 229 -165 -231 235 19 178 -102 23 -179 -202 75 19 -7
5576gj00ln1j01L98K18k05k06p0K25Q3j10n7R3l37K49J23M1j05j48j87Q4J77j70
$$ -7 -107 -110 -161 -262 136 354 149 -57 -127 98 181 71 14 107 -230 19 142 183 78 -70 -257 -173 4 -166
5600a66M3O2K33j57P8j91m0J69j03P5p4k27L74k13K57j69L8K3j51r3K85J44k83
$$ -166 -123 -61 172 15 93 -98 -138 31 -72 3 -71 -298 76 -137 120 -49 -11 12 -139 -232 53 197 -86
5623h6J08q4J57o8l1j13K11J9l11k4J38K15j88J80k18J73k84J49J90k61J05L0
$$ -86 22 -62 95 27 -4 -117 94 113 -198 -222 -84 131 -57 123 -95 78 -206 -57 133 -128 -23 7
5645GJ58j63L11j05r1l20J67r4j57J84j88J75O2j44K60J45m40N9M43l39L05j40
$$ 7 165 2 313 208 117 -203 -36 -130 -287 -103 -291 -116 -54 -198 62 207 -233 -174 269 -70 235 95
5667I5j33r7L6J42M6q9K3J04m64N36n51K62K10K6J93l84j0K23l24L02m8r2J7M6
$$ 95 -38 -135 -99 43 89 0 23 127 -337 199 -352 -90 120 146 339 -45 -55 168 -156 146 98 6 23 69
5691F9q7j13J44K3k13K44j69K02N2k30Q3l2K60l90PJ15K91l87J91j67J71j1j42
$$ 69 -18 -131 13 36 -177 67 -102 100 152 -78 5 -27 233 -157 -150 -35 256 -131 60 -107 64 53 -89
5714h9J43j81r2K31q5K20M6k77K21o2l08l3L59l51L99k0q8j14r9L5MJ49K12k05
$$ -89 54 -127 -219 12 -73 147 193 -84 137 75 -233 -266 93 -258 141 121 33 -81 -180 -145 -141 8 220 15
5738A5j29L40j80JJ89k75J35k00K69r9N4M8r3M1j57K8r7j28J66J99L1k58NK05
$$ 15 -114 226 46 47 236 -39 96 -104 165 66 120 168 75 116 -41 -13 -110 -238 -72 127 158 -100 -95 110
5762A10j95R9l7j34J16Jr0L63j94j03r3J36J11k16j17K15J51j81K83j25k4n0R5
$$ 110 -85 14 -23 -157 -41 -40 -130 233 39 -64 -157 -21 90 -126 -243 -28 123 -58 225 100 76 26 121
5785A21j91K27m5m0o6l35K29j18J24K02l14K62p6K62k30K0k50N66j60o6k61K42
$$ 121 -70 157 112 72 6 -329 -100 -218 -94 108 -206 56 -20 242 12 32 -218 348 188 122 -139 103
5807A03j54K02p4Lo2pJ07n1j33M9J84O1k45J50kj58J08pj13q0j8L18n0J48j28
$$ 103 -51 151 77 80 18 11 118 67 -66 -17 167 228 -17 133 131 -27 81 74 -39 -119 -137 181 131 279 151
5832A51j43Pq3R2J72k31Q3k02RN1P1J42k09k92L72j13K60j65j02L42l17K21l73
$$ 151 8 15 -68 24 196 -35 48 -154 -145 -94 -23 119 -90 -382 -10 -123 137 -28 -130 212 -105 116 -257
5855b57J65j09K87O0l80L54J46m16R1J18j9j48J91J14k36q0N9J28Oj80J55J1j44
$$ -257 -92 -201 86 146 -234 120 266 -150 -59 59 40 -108 83 197 -39 -119 -60 68 74 -106 49 60 -84
5878h4Q2J58j56n7J04l39L8K97k52J57J14j40M8o3J63N7q1j09k38K33L3p2o0j9
$$ -84 -2 156 0 -57 47 -292 -254 43 -209 -52 62 -78 -30 -93 70 127 46 -63 -301 -68 -35 -107 -167 -186
5902a86J73J40M6m71K16j34j43N10o8K29k87K0j49L45j22k03K54l8r0j55J02M8
$$ -186 -13 127 173 -298 -82 -216 -359 151 83 312 25 45 -104 241 119 -84 170 132 42 -113 -11 37
5924C7p6j08o3o9L75j67j83K72J0M0k57M48n05K07j73m8M06k96P1m2mJ34M9j36
$$ 37 -39 -147 -210 -279 96 -71 -254 18 28 68 -189 259 -246 -39 -212 -260 146 -150 -79 -121 -125 9 58 -78
5948g8N10n51J03l6J74m8j36j62K21K34m11m2M37j1j82O6k68J35P3j8J84k31n5
$$ -78 432 -119 -16 -52 122 74 -62 -224 -3 231 -180 -222 215 204 22 88 -180 -45 28 10 194 -37 -92
5971i2J1kQK7J75k5j4r0j43M79m68P6P8k09J77j74L25l93J80j75J19M8J02L55
$$ -92 -81 -83 -75 -48 127 102 88 -2 -145 334 -134 -58 20 -189 -12 -186 139 -254 -74 -249 -130 -82 20 375
5995C75n12K17j98J39n7o0L25R0j95J4k37J19K9l9j16J43k0J21k83J36N6k27R7
$$ 375 -137 80 -118 21 -36 -96 229 319 124 138 -99 20 49 10 -106 37 17 138 -145 -9 47 -180 -83
6018h3m2r6k4L27l20L58p8m3r1L0M9Mn7J71j47L4L9Ork9Qk7r6j41K08j50L33J
$$ -83 -125 -221 -245 82 -238 120 42 -1 -92 -62 -13 -9 -66 105 -42 -8 31 37 28 -1 7 -20 -116 -257 -49 -199 134 135
6046A35l57L31j36q4m4P3L09k43j27J14m6K51m3j58R1M7l8N3j32K34k66j98O9
$$ 135 -222 109 -27 -111 -155 -82 227 -16 -143 -29 -75 176 133 -25 66 113 75 128 -4 230 -36 -234 -165
6069a65J73q5J0Q5N9l27J18K06r1J42l90L08k9O5J50k41m9p3L76l71J20J60j63
$$ -165 8 -77 -67 18 77 -250 -132 74 -17 125 -265 43 14 79 229 -12 -61 -134 242 -129 -9 151 -12
6092a2J49l54L05k42QK06M3j07j4J04K95l08R6pj07j73J74o1J31p2r4q1J52o6
$$ -12 137 -217 88 -154 -146 60 103 -4 -18 86 381 73 169 162 55 -118 56 -5 126 54 -40 -121 31 -35
6116c5K54m13K45k33K85p3j71K11l06J42l5O3l2j06L07p3j3r6J54r0L9N9p5R3
$$ -35 219 -194 51 -182 103 30 -141 70 -236 -94 -129 -66 -98 -204 103 30 17 -79 75 -15 24 83 8 101
6140A01k60M20j73l33K27J03j36P3k17J27K86j50l92J77J95l67L45O5j19qJ2m4
$$ 101 -159 261 88 -245 -18 85 -51 22 -195 -68 218 68 -324 -147 48 -319 26 91 -28 -36 -24 -68
6162f8J62k43J39J7Q2L6P0l77J51K12m8o0LJ35k76k26K55J08p9j15L19ll06J44
$$ -68 94 -149 -10 7 89 125 195 -182 -31 181 133 73 76 211 -65 -291 -36 72 -7 -122 197 194 -112 32
6186C2J15k05R0R2j77L12l30Q3K0l5pJ96j48j81L16p6j5j28J15K2n6k8p9j00K75
$$ 32 147 -58 32 124 -53 259 -71 12 32 -3 -10 186 38 -143 173 97 82 -46 69 91 35 7 -72 -172 103
6211A03k27M65k70n7k6k9M6kJ2J05M8n2k78L08l5j14k89O1K01k20L77J66j63j30
$$ 103 -124 341 71 14 -12 -41 5 3 15 120 168 116 -162 146 111 -3 -292 -231 -30 -250 127 293 130 0
6235@L2l3j10J78p3j7N8p1j20M7J54k55N9k89L75J20j38K87k34k9m8K13m2j00
$$ 0 32 -1 -111 67 -6 -23 35 -36 -156 -109 45 -210 -151 -440 -65 55 -83 204 -30 -59 -107 106 64 -36
6259c6K30j01J38l62M4J21p7K79k32j24J10n3J71j32jj8K5k11L88n0p5N4L5k32
$$ -36 194 93 231 -131 -87 34 -43 236 4 -120 -10 -63 108 -24 -25 -43 -18 -229 159 109 34 88 123 -109
6283a09r6J78K07k28L6P8l6jk97R5L37L1m22K94J1j94j28J81J01j25N8J31j1k16
$$ -109 -205 -27 180 -48 -12 66 30 29 -268 -173 164 195 -227 67 78 -116 -244 -63 38 -87 -29 102 91 -125
6307a25J9M5Q8K14k96J25J68k61L9L5mM4M4k77K60N4j76q0r1J73L35k31k57K15
$$ -125 -106 -61 27 241 -55 70 238 -23 16 51 47 91 135 -142 118 172 -4 -84 -175 -2 333 102 -155 60
6331F0j49J36J85m2j67n1j4K8J02l57L57k57m5MK81j52j88K79j1J54j71L2p4J74
$$ 60 -89 47 232 190 23 -28 -42 -14 88 -269 88 -169 -214 -210 71 -81 -269 10 -1 153 -18 14 -60 114
6355A14j49j26Q2Q6J42k22J22j34j14L05L2l35J26j5P1R6j68%J11o2J32m0j17
$$ 114 -35 -161 -79 7 149 -73 49 -85 -199 106 138 -197 -71 -86 -15 81 -87 -87 24 -38 94 54 -63
6378f3p5K40J18j94N4j11k1J89j16N3P0k66K46n0J63l3k63J81k59J52k55K02k3
$$ -63 -138 102 220 26 80 -31 -52 137 21 74 144 -122 124 74 237 204 -59 122 -137 15 -240 -38 -61
6401f1N8K5N6O5l94O9k5L8J25p1Q9J19j27o2J47M3l8m7j08J16O0J9j30K49k08
$$ -61 -3 22 78 143 -251 -182 -207 -169 -44 -115 -26 93 -34 -96 51 94 56 9 -99 17 77 96 -34 215 7
6426Gj33J42p5J84j59O1l40J44J30k3J02k92K84j32M4M2L0jJ9j68M04l57J05j66
$$ 7 -126 16 -59 125 -34 27 -313 -169 -39 -62 40 -252 32 -100 -56 -14 16 15 34 -134 270 -87 18 -148
6450a48J12O0k88L14o4pN2N2Q3j30j19Q4J32J10m52K54j19N1n8J35j58M28l09
$$ -148 -36 24 -264 50 -14 -21 31 83 166 36 -83 1 133 243 -209 45 -74 -23 -81 54 -104 324 15
6473A5n0L72m16j03J47J30l15K83K50l70l48L93j72j8P6L10k10O5J10l94K52q8
$$ 15 -35 337 -79 -182 -35 95 -220 63 313 -57 -405 -12 -184 -202 -126 184 -26 39 149 -245 7 -81
6495h1q4K20J67j59j28K83m13n1K75l35K45j5Nlj04J94l47J93o4J49J89j87J66
$$ -81 -165 55 222 63 -65 218 -195 -246 29 -306 -61 -76 -71 -74 -178 16 -331 -138 -202 -53 136 -51 115
6518A15j64R4k76R6K39JM7j13m7j55K78k8j83J26Qq4p6k03J72J24J93N0m42J52
$$ 115 -49 45 -231 -135 104 105 152 39 -8 -163 115 87 -96 30 38 -46 -122 -325 -153 -29 164 214 -228 -76
6542g6J85J20j91r8J63j92J21R7j91L1m4K68k72R4L8M0J33j13k96J95k56J47L60
$$ -76 109 229 38 -60 103 -89 32 129 -62 -31 -75 193 -79 15 53 93 226 113 -183 12 -244 -97 263
6565B63n44J84J02j21J28J1K4K05k52J22j5l8n0j45J69n9q7K9n3K20M8rJ34k41
$$ 263 -281 -97 5 -116 12 23 47 252 0 122 107 69 19 -126 43 -16 -103 -74 -127 93 141 132 266 25
6589B5K45p7j27n0j33%L8J07P1k9R6j89m8L60n43M90q5j00P5l7n4J07j74J91r0
$$ 25 270 193 66 16 -117 -117 -79 28 99 70 166 -23 -71 289 -254 236 151 51 126 89 35 142 -32 159 69
6614F9j49L0jk47L41K3J51j45j78KL21l78J73K21l25q6Q2k00J79j9Q5L4n1p1p0
$$ 69 -80 -50 -51 -298 43 66 217 72 -106 -104 217 -161 12 233 -92 -178 -96 -296 -117 -136 -51 -17 -68 -139 -209
6639b09K54k14J71m2P4j92M5L59j48J0k2M8l33R0j11P1K10J3k11K03M3p5r1K3
$$ -209 45 -169 2 -40 34 -158 -113 246 98 108 86 134 -199 -109 -220 -149 61 74 -137 66 109 34 -57 -34
6663c4Q6o6l22L16J23j70N7j70J78m9p1K6j72J71J58K10l42m1M05k40j00K21m81
$$ -34 52 -14 -336 -20 103 -67 -10 -180 -2 -51 -122 -96 -268 -97 61 271 -71 -112 293 53 -47 174 -307
6686c07L52m7l2rp4R8q9K85k23j73K88O4jj43O5J94j56l0j02L29j90l87J34j07
$$ -307 45 -2 -34 -43 -117 -19 -108 177 -46 -219 69 133 132 -11 54 248 92 62 -40 289 99 -288 -154 -261
6710b61K63R1m36K60j88K40Lj80J32J54j35k66M07k24K81k90K57J62k92%k9K26
$$ -261 2 93 -343 -83 -271 -31 -28 -208 -76 78 -57 -323 84 -140 141 -149 108 270 -22 -22 -51 175
6732A75r0j12m2J58R6jj60j86R0l4K0J24j65j80L04Q8M5k71J41K55l39L15%m21
$$ 175 85 -27 -69 89 185 184 24 -162 -72 -106 -86 38 -127 -307 -3 85 130 -141 0 255 -84 231 231 -190
6756a90J08J67r8j31J58r9N3L7j30KR7r3K58l97n2J78r3q4M40k86M39p7l81K99
$$ -190 -82 85 -13 -144 14 -85 -32 5 -125 -123 -26 -119 139 -258 -310 -132 -225 -309 131 -155 284 207 -174 125
6780A25j16Q5O4k61L99l45Q9L7k78l3Q6k4K08p0k39O38k34j68j00L06J6j39m6
$$ 125 9 94 158 -103 296 -49 40 77 -201 -234 -148 -172 36 -34 -273 365 131 -37 -137 169 185 46 0
6803@k53J98l6J60P0j45O4k74J18K50j58k41M25j80nO6l10K60r2M9K82Mj39k28
$$ 0 -253 -55 -91 69 139 -6 58 -216 -98 152 -6 -247 178 -2 -7 59 -251 9 -83 -34 248 252 113 -115
6827a15J78K34m62R5j65K62J06r1j36l1O8K20j31j72K48L4q1m5L9j99O5k74O19
$$ -115 63 297 -165 -70 -235 27 133 42 -94 -125 -57 163 32 -140 108 142 61 16 55 -144 -79 -353 266
6850B66j40j61J03J0J45j89j54j09J28j15K78j63K14k57R0J42M6q3j73K64k69
$$ 266 126 -35 68 78 223 34 -120 -229 -101 -216 62 -101 113 -144 -54 88 134 51 -122 142 -127
6871a27J99o4J47l66J27r6J14J58o2r5J91k37J18O2l30L59j35M6k22M31j92jk26
$$ -127 72 8 155 -211 -84 -180 -66 92 30 -65 126 -111 7 69 -261 98 -37 9 -213 218 26 25 -201
6894b01J53Q8p5k49M26n22M76N9j56Q7j2o5J01l10K81j2j96J16O8J1j23K05j92
$$ -201 -48 40 -35 -284 142 -380 96 155 -1 86 74 9 110 -200 81 69 -127 -11 57 68 -55 150 -42
6917d2kk1j55J53K21j94j22K93j54O2r8J41Lj68K93p7M1n37K75J19O9j61J52k82
$$ -42 -44 -65 -220 -67 154 -40 -162 131 -23 39 -59 82 85 -83 210 133 174 -363 -88 31 100 -61 91 -191
6941a91K72j12j92J43L6J53Lq5K3k50J79K84k34j76J19rK9J05j35o5j49K84q1
$$ -191 81 -31 -223 -80 -44 109 112 27 50 -200 -21 263 29 -147 -28 -37 -8 97 -38 -103 -252 32 -49
6964d9J59j6J33n24N57j94J9j94J87K03m37K92l86J13J85K30n25J17K03j91L52
$$ -49 110 94 227 -297 260 66 85 -109 78 281 -156 136 -250 -137 48 278 -247 -130 73 -118 234
6985B34k06k26L25P5l18Q9M1J97l57L23N1j48J25k50j15M4N0k6j79J99R9k6N0
$$ 234 28 -198 127 202 -116 -27 14 211 -146 177 228 80 205 -45 -160 -116 -66 -92 -271 -72 27 1 51
7008E1J63j98J19n3R0o9j03K40l03K10j88Q5J04j46j58k0K68o3p4J72k41K80l45
$$ 51 214 16 135 82 172 103 0 240 -63 147 -41 44 148 2 -156 -176 92 29 -45 127 -114 166 -179
7031a79L27k15J16r9J70q4Pj46J46Q4Kj64j68J51N9NP3r9j9R5l08Q2o6K47L49
$$ -179 148 -67 49 -50 120 36 43 -103 43 127 129 -35 -203 -52 7 12 85 -14 -33 62 -246 -164 -230 17 366
7056C66q0l93k95M10j22L4L9j02K52L59n53L28k89k36L68n4p1J5K46pk37J1Q3
$$ 366 286 -107 -402 8 -114 -80 -41 -143 109 468 -85 243 -46 -282 86 32 -39 -24 222 215 -22 -11 72
7079G2j03j65L93k12J61l72L75o7r2k65J13K82k2j69K36q5j48O6q5mJ92r3j84
$$ 72 -31 -196 197 -15 146 -226 149 82 -10 -275 -162 120 98 -71 165 80 -68 -2 -87 -91 101 8 -176
7102a76Q1RL58m63K56J50ll60J59J16n8j28k0L42j48l73l1L63P1j38J9r4r3K19
$$ -176 -95 -86 272 -191 65 215 212 -148 11 127 69 -59 -79 263 115 -258 -289 74 145 7 26 -68 -161 58
7126E8n8j43J53L9j72J90m63K45k4N52k86k99j15K66k43J1L21j99pK65j40Q2J04
$$ 58 0 -143 10 49 -123 67 -396 -151 -175 377 91 -208 -323 -57 -300 -289 32 -167 -174 91 -49 33 137
7149A37k16K88k88M03m22J07K75l07J35j5j5m20L72j08K56j22k57J63K30k46p9
$$ 137 -79 209 -79 324 -98 9 284 -23 112 97 82 -338 34 -74 182 60 -197 -34 196 -50 -129
7170a29pO0Kn0J69K6k00NL30m16M5J68o8J01k45J84l29M05P8p6M9P1R7k50L4j83
$$ -129 -136 -76 -74 -124 45 71 -129 -124 206 -210 -165 3 -65 36 -209 -25 -354 51 129 53 102 173 270 20 54 -129
7196a29P8K67k78J7J04J15j51m6J91k49J34J67j58j44r0J34o4K20j75P2k70M80
$$ -129 -51 216 -62 -45 59 174 23 -23 168 -81 53 220 62 -82 -172 -38 -102 118 -57 15 -255 225
7218B25j46j28Q5j60l0K73N7j52J6m2k10QJ86J70p1k7k87J31j19J18N0p9K46q8
$$ 225 79 -49 36 -124 -154 119 176 24 40 -2 -212 -204 -18 152 81 54 -233 -102 -221 -103 -53 -132 114 26
7242B6K4p5j19J20J1Q9j70J13k0j43K90k14K08m3l83M83m6q8Q7L0l82L01j40j05
$$ 26 50 -25 -144 -24 -13 76 -94 19 -1 -144 146 -68 140 97 -286 197 151 63 150 180 -202 99 -41 -146
7266a46K94j37R1n9K32o0j83j41J05J24R8j49k2p0J68q7m7k31K38l43L40r1n2
$$ -146 148 11 102 43 275 215 32 -109 -4 120 218 69 47 -23 145 58 11 -220 18 -325 15 -76 -128
7289a28R5L39k07P1j11K32n06K59m9q0Q7p6R5oJ04j41K49k91J70j57j5kK9m3J50
$$ -128 -33 306 99 170 59 291 -215 44 -5 -85 2 -74 21 15 119 -22 227 -64 106 -51 -66 -68 -39 -82 68
7314F8J13%l2l42M2K44k23J91m4jR3l56J4L03l5M2J08J25l25k00Q9J46K2l26L14
$$ 68 181 181 149 -193 -151 93 -130 61 17 16 109 -247 -233 70 35 77 185 310 -15 -215 -126 20 42 -284 30
7339C0p6K97k96l2q5J42O1J35j83o8Km7J20k2N9O2l21K56Q8j2q0L2QJ34k71M68
$$ 30 -46 251 -45 -77 -162 -20 41 176 -7 -75 -73 -120 0 -22 37 99 -222 34 122 110 30 62 70 204 -67 401
7365D01k11k29K29j63p4J71l7q5R3j56J18Jmj76J54J62l62RJ57p5j45M18j56L01
$$ 401 190 -39 190 27 -47 124 87 2 95 -61 57 58 54 -122 32 194 -168 -159 -2 -77 -222 196 40 341
7389C41n40J28J89j93q3K7L18j59j05J73j86k29N62m20K72k80J75m3jJ32j32r8
$$ 341 -199 -71 118 -75 -158 -131 187 28 -77 96 -90 -319 243 -177 95 -185 -10 -53 -54 78 -54 -152
7411a52M7P3J56l01L25k86M7r3J72J86m70K22l15M01kk16j18L67j10j1J4K8J47
$$ -152 -105 -32 124 -177 148 -138 -91 -184 -12 174 -296 -74 -389 12 10 -206 -324 43 -67 -78 -64 -36 111
7434A11k48m5J79K06o1l3J97k44q7K4J05k08J49J20l24J83Q9KNj82m4K5J81q0
$$ 111 -137 -182 -3 203 142 109 306 62 -25 -1 104 -104 45 165 -159 24 113 115 120 -62 -106 -81 100 20
7458B0k9q7K26j45J81o6l23J42p3L87l31K79k13j85J28J33Q1k21K02q5j9j09L06
$$ 20 -9 -96 130 -15 166 100 -223 -81 -154 233 -98 181 -32 -217 -89 44 125 -96 106 21 2 -107 199
7481A99l7k30P8P9l36L81k01k4l3K32N5M3k19K7k5p5Q5K04k38l4N25m14J2k1N6
$$ 199 162 -68 10 89 -247 134 -67 -91 -124 108 163 206 -13 14 -11 -86 -1 203 -35 -69 456 42 54 33 89
7506H9l5J2j72O3J10O2J25q1j46M9P2j63n5O2r9j5J23j57q1K86j0n7K42j93k67
$$ 89 54 66 -106 -43 67 129 254 173 27 76 148 -15 -70 -8 -107 -122 1 -156 -237 49 39 -18 224 31 -236
7531b36K00j90M56q3p3l18K70K13Rm03L68l43J02k7N8P6O6k94K23k49P3jJ10O7
$$ -236 -36 -226 230 147 74 -244 26 239 248 -155 213 -130 -28 -55 3 79 145 -149 74 -175 -102 -103 7 74
7555G4j18K52l12N8K5jL9P7l2l25K48nmO6m6j01l3L79l86L25j14j34J60j95k83
$$ 74 -44 208 -104 -46 -21 -22 17 94 62 -263 -15 -20 -24 42 -4 -105 -138 241 -145 180 66 -68 92 -103 -386
7580c86M75L6l20K75O5j06l1L2j47K33j35k05M28k5l90L44j39K1L6r8L1Q3p4j54
$$ -386 89 125 -195 80 145 39 8 40 -107 126 -9 -214 214 189 -201 143 4 25 61 -37 -6 77 3 -151
7604a51J50L6k85K90k71M69k82p8o1J57K7m4K83j11R5p3j23R2l40J37L36l50L04
$$ -151 -1 35 -250 40 -231 238 -44 -122 -183 -26 1 -43 240 129 224 151 28 120 -220 -83 253 -97 207
7627B07j78j56j40J22K84K5J3j33k0j4L9j11k7L24j81k16M4mJ44o9K10k1k80j50
$$ 207 29 -127 -267 -145 139 164 177 44 24 10 49 -62 -89 235 54 -162 -118 -122 22 -47 163 142 -138 -288
7651b88N57n04K01L0l4K3J15j10K68o6r7k6j88R3mO6J18k64n9J07j50M84l59K04
$$ -288 269 -235 -34 -4 -38 -15 100 -10 258 192 95 69 -119 -26 -30 36 154 -110 -169 -62 -212 272 -87 117
7675A17k39Q5N9K87l12L60l62jK4j38k69J67M04k52J93k86J15P9o5J8Rq7J56k77
$$ 117 -122 -37 22 309 -3 357 -5 -6 18 -120 -389 -222 182 -70 123 -163 -48 31 -34 -16 -7 -94 62 -215
7699b15K07j42kJ68j16K11k62P7L0j68M11Rj99j75M5K81m3k17J65Mj48jk4J07
$$ -215 -8 -150 -152 16 -100 111 -151 -74 -44 -212 199 208 9 -166 -121 160 117 -100 65 69 -79 -80 -104 3
7723CJ08k06k16M86l53K81n2O0j37J54L29l77J13l8l65M31j34J03l56P9K00j89
$$ 3 111 -95 -311 175 -178 103 51 111 -26 128 457 80 193 155 -210 221 87 190 -166 -87 113 -76
7745g6N7j7k20J54R5l3K3K90K3q0j73n9O3j25M45m68j31K57rK20k15O2j25M4k7
$$ -76 -19 -36 -256 -102 -7 -40 -17 273 296 216 43 -16 47 -78 367 -101 -232 25 16 236 21 83 -42 2 -25
7770b5J25k47LJ3R1o8K44j97m7J6p5M59m18O9L71m08l9Q0o6J88J17k37J36l3J29
$$ -25 100 -147 -144 -131 -40 -108 136 -61 -108 -92 -167 292 -126 -57 314 -94 -133 -53 -119 69 186 -51 85 52 181
7795A81m63M22q3ML1m3L1l58J54K95j73p6j46J46K24r4J20k34K4n5P6p9jo2q6
$$ 181 -282 140 57 61 92 49 80 -278 -124 171 -2 -78 -224 -78 146 52 172 -62 -38 -93 -17 -96 -97 -159 -245
7820b45J46J19j48k7K02J0m3j4m0Q5O5N4k30K11l9m0J6j26Q2n8N6J44j20J7k1
$$ -245 -99 20 -128 -155 47 57 14 0 -40 45 110 164 -66 145 106 66 82 -44 38 -20 36 180 60 77 56
7845E6j7J79q8k9J85l53L38k52L7j2O9K8j59j10n4K58j85K16m4N7p1j97J50j38
$$ 56 39 218 130 101 286 -67 271 19 56 44 113 141 -18 -128 -182 76 -109 107 63 120 49 -148 2 -136
7869a36K24j86J54O8j22J03l0P7o3l4k1P3M0j38j65K45j16n9J91j54N8k46K4J47
$$ -136 88 -98 56 124 2 105 75 152 89 55 34 107 147 9 -156 89 -27 -86 105 -49 9 -237 -213 -66
7893f6J83O4l29N5K5Lj21J36J52k95L94l36J84l04K30k1j1N20o00K17l18J89K37
$$ -66 117 181 -148 -93 -68 -65 -186 -50 102 -193 201 -135 49 -255 -25 -46 -57 463 -137 80 -238 -49 188
7916A88j40r0m7J54p4j09J60j53J11o9K16J97k47M4k38K27k13L31j63p8L6j1j6
$$ 188 48 -42 -89 65 -9 -118 42 -111 0 -69 147 344 97 141 -97 130 -83 248 85 7 43 32 16
7939A6j98N72m25o2Ll5K38j55j11K58j83J59m22N12n07K32J73k05M9K06mq0M0
$$ 16 -182 390 -35 -97 -94 -129 109 -46 -157 101 -82 77 -345 167 -340 -108 65 -140 -91 115 111 31 71
7962G1k86N15l37m5K05j83L98m29P1J88j00j72n9J01R1k3J16j55j52J82j48M15
$$ 71 -215 300 -37 -82 123 -60 338 -91 -20 168 68 -104 -163 -62 29 6 122 -33 -185 -3 -151 264
7984B64j66l58K66o5r1J64p7K22l66M4K47j44N8l22P5L37P8k14P5k36P1M8k1L83
$$ 264 98 -260 6 -59 -150 14 -63 159 -207 -163 84 -60 -2 -324 -249 88 166 -48 27 -209 -138 -90 -111 272
8008B72k18M3KJ96m66K80j29J13k60O6J24k5o2J69l59L98Lj88l3RO1q3J72j20
$$ 272 54 97 99 295 -171 109 -20 93 -167 -101 23 -2 -64 105 -254 144 147 -41 -74 -65 -4 -87 85 -35
8032c5N2R3l08K80j16o1J98K15k38r9K21k77K33l7l5k2q6J70k53J40jj28j09K41
$$ -35 17 110 -198 82 -34 -95 103 318 80 -19 202 -75 158 121 86 64 -22 148 -105 35 34 -94 -203 38
8056C8k75K70j10L33l42J32j12K03j11j80N2K70n92K96l1J10J08q6j09q2K02k93
$$ 38 -237 33 -77 256 -86 46 -66 137 26 -154 -102 168 -424 -128 -159 -49 59 -27 -136 -218 -16 -309
8078c09L02l36L26K05M6l76L89l26N2l8n7M3p2J28q1J96M9l25J87J40j16j40l3
$$ -309 -7 -343 -17 188 234 -142 247 -79 -27 -65 -122 -79 -151 -23 -104 92 141 -184 3 143 27 -113 -146
8101a46j27K52l2p1n0M51l8l15o9L3J85J1k60J38J91j75K8J5k41Q6L7K9Rq0P8
$$ -146 -273 -21 -53 -124 -174 277 239 -76 -145 -112 73 84 -176 -38 153 -22 6 21 -220 -134 -97 -68 -59 -139 -61
8126f1qk0L60k76N5N3l27o7K31J04N6K53m69K98p5N6j73J7K44k05k04m2L75q3
$$ -61 -69 -89 271 -5 50 103 -224 -291 -60 44 100 353 -116 182 107 163 -10 7 251 46 -158 -200 175 92
8150I2p2j68QJ7j62L21r7K41k50O3M60l58j28QJ2L67n54K3Q1J55p5J23j05K45
$$ 92 20 -148 -140 -123 -285 36 -61 180 -70 -7 453 95 -33 -25 -13 354 -200 -177 -96 59 -16 107 2 247
8174B47k36j93j08K06K2J88Jj99K68j3j35KJ3j87lK79M1
$$ 247 11 -182 -290 -84 -62 126 127 -72 196 183 48 50 63 -124 -127 152 193
8191A93
$$ Imaginary data points
##PAGE= N=2
##DATA TABLE= (X++(I..I)), XYDATA
0@%%%%%%%%%%Qj6J6j6K4l2M0m9N7p2Q8j04J28j52J76k08K41k81L27l75M30m92
$$ 0 0 0 0 0 0 0 0 0 0 0 8 -8 8 -8 16 -16 24 -25 32 -40 48 -56 72 -80 96 -112 129 -152 175 -200 230 -262
32b62N59o33P16q08R09j019J141j275J421j582J757j948K155k381K630k903L200
$$ -262 297 -336 380 -428 481 -538 603 -672 749 -833 924 -1024 1131 -1250 1380 -1523 1677
49A677l526L886m280M716n199N740o350P037p823Q732r793J1052j2580J4476j6901
$$ 1677 -1849 2037 -2243 2473 -2726 3014 -3336 3701 -4122 4610 -5183 5869 -6711 7765 -9136
64i136K0134k4684L1601m3522O9671k30960J74147L75240l70253j83680J67715
$$ -9136 10998 -13686 17915 -25607 44064 -186896 -12749 362491 -7762 -191442 -23727
75b3727J86447r9112q0041P628O62m2588Q5702L9783j05867j17780Q3073J86483
$$ -23727 162720 63608 -16433 -8805 -8143 -50731 34971 74754 -31113 -148893 -65820 120663
87A20663L587k20834k8018J85423N2946j04347m4023J3925J5115k966K8302N240
$$ 120663 124250 -96584 -124602 60821 113767 9420 -34603 -20678 -5563 -8529 19773 25013
99B5013q7556j6546J41326K6737j36365l6970J11273N1942o8916l0427M7091l1605
$$ 25013 -62543 -79089 62237 88974 -47391 -84361 26912 78854 9938 -20489 26602 -5003
111e003l9157P4405R994r5315m96P2319J5540m1836l4785M2553N5258l9706m2491
$$ -5003 -44160 30245 40239 -55076 -55572 16747 32287 -9549 -44334 -1781 53477 13771 -28720
124b8720M1800L4145m8561n0125N8603N8559q9260o1471R4800M4480o8356k3150
$$ -28720 13080 47225 -1336 -51461 7142 65701 -23559 -85030 9770 54250 -14106 -37256
136c7256M6016K5456l0952k1777L4611R13l8609J9194K1815l2850j7739K0471
$$ -37256 8760 34216 3264 -18513 16098 17011 -21598 -2404 19411 -13439 -31178 -10707
148a0707K6500Kk6812P112K6554j3921j2684J2118P372r955l0482K500M0743k0045
$$ -10707 15793 15795 -11017 -3905 22649 8728 -3956 8162 15534 5579 -24903 -22403 18340 -1705
162a705m0585L5726K9918k6649p430K4275R026k0323o601K5004r340l3096J4325
$$ -1705 -42290 -6564 23354 -3295 -10725 13550 22576 2253 -4348 20656 11316 -21780 -7455
175g455J6216j5133j364K359k557N975j207Q782J2056j9760j0201K0766J1090
$$ -7455 8761 -6372 -7736 -5377 -7934 -1959 -3166 5616 17672 -2088 -12289 8477 19567
188A9567j4195k9138K820M2975n092m2365P305K8438L253m447j0105m891O007
$$ 19567 5372 -23766 -20946 22029 16937 -25428 -18123 10315 13568 9121 -984 -5875 132
201A32R612R806k1230k6384K3283K0122k1611r516M499P140J6205l372j2953L614
$$ 132 9744 19550 -1680 -28064 -4781 15341 -6270 -15786 -11287 -4147 12058 8686 -4267 -653
215f53N778P798K163j2939o019l092J773J6019j3455k6982K1438K4808j3354j5321
$$ -653 5125 12923 15086 2147 -3872 -6964 -5191 10828 -2627 -29609 -8171 16637 3283 -12038
229a2038K432J7502J0215j3285m744k00n270J3132L25k2985L393J4194r7J6p263
$$ -12038 -9606 7896 18111 4826 82 -118 -5388 7744 8069 -14916 -11523 2671 2574 2590 -4673
244d673j866J6522K048r785p286p22J3837m568j8710J1950P480j6336P998J1481
$$ -4673 -6539 9983 12031 2246 -5040 -5762 8075 3507 -15203 -3253 4227 -12109 -4111 7370
258G370p426o24M939N828j630j2367N421O221j2716K314M489j1954M077N911m088
$$ 7370 -56 -680 4259 10087 8457 -3910 1511 7732 -4984 -2670 1819 -10135 -6058 -147 -4235
273d235M803j736k933R879L78m255q42j771R162m083j6512J1668Q664j5470L255
$$ -4235 568 -1168 -4101 5778 6156 1901 1059 -712 8450 4367 -12145 -477 8187 -7283 -4028
288d028Q250n346q25J360M031J70r724P246O010j3736K971P620r204K582M151
$$ -4028 4222 -1124 -1949 -589 3442 3612 -6112 1134 7144 -6592 -3621 3999 -5205 -2623 1528
303A528m086M831j42k357N645k420j168P70n559O550n60j4536Q039P648j2090
$$ 1528 -2558 2273 2131 -226 5419 2999 1831 2601 -2958 3592 3032 -11504 -3465 4183 -7907
318g907K321P130j835R19q4L883J876q660O332M347j3381K194O595q378J885K390
$$ -7907 -5586 1544 -291 628 544 4427 6303 -2357 3975 8322 -5059 -2865 3730 -4648 -2763 -373
334c73m061M546J195j633K634k646K073J060p157N911K481j1597N688O174q348
$$ -373 -4434 112 1307 -326 2308 -338 1735 2795 -4362 1549 4030 -7567 -1879 4295 -4053
349d053K201M972j114J08k297L262J956q431L778M598j1070J685O294p052J515
$$ -4053 -1852 3120 2006 2114 -183 3079 5035 -3396 382 4980 -6090 -4405 1889 -5163 -3648
364c648L424j792L384r19K38L190k754K471K097r189L288N165r042J434L695n523
$$ -3648 -224 -2016 1368 449 687 3877 1123 3594 5691 -3498 -210 4955 -4087 -2653 1042 -4481
380d481J575L742j467r02j410N261L017q717K717N602o982K404M360q193l89N210
$$ -4481 -2906 836 -631 -1533 -2943 2318 5335 -3382 -665 4937 -2045 359 4719 -3474 -3863 1347
396A347L71p39k502N64L724k524R17Q27p043M046N550p949q97L707k069K788K580
$$ 1347 1718 979 -1523 -959 2765 241 1158 1985 -5058 -1012 4538 -3411 -4308 -601 -2670 118 2698
413B698k757j74k63M219K881p387m17M405m677r4K687n261R00L427m36l09j966
$$ 2698 -59 -233 -496 3723 6604 -783 -1200 3205 -1472 -1566 1121 -4140 -3240 187 -249 -558 -2524
430b524J456M276k860J019K724o687O71O343m505j551K761k451JK449Q00j496
$$ -2524 -1068 3208 348 1367 4091 -2596 -1925 4418 -87 -1638 1123 -1328 -1327 1122 1922 426
446D26l940L182M883n045j744K828m832L088O591p116l612M733L303J138l204
$$ 426 -3514 -332 4551 -494 -2238 590 -4242 -1154 5437 -1679 -5291 -558 2745 3883 679
461F79k880L021J266K059m90q410Q97P918l415l252m29j469M308L922l817j622
$$ 679 -2201 820 2086 4145 3655 -4755 -3858 4060 645 -2607 -3036 -4505 -197 3725 -92 -1714
477a714p72K979N548n538k537M403j757l63K825m089k913K193K400J931l736j989
$$ -1714 -2486 493 6041 503 -2034 2369 612 249 3074 -1015 -3928 -1735 665 2596 -1140 -3129
493c129M946j447n12K606n269r52O751k533j906L052k146j484K017K445M39m449
$$ -3129 1817 370 -142 2464 -2805 -3757 2994 461 -1445 1607 -539 -2023 -6 2439 2878 -1571
509a571L18O421m044l868L230l332l32N474j825j664o41j853M620L224l487k699
$$ -1571 -1253 5168 1124 -2744 486 -2846 -3178 2296 471 -1193 -1834 -3687 933 4157 670 -2029
525b029p83O830N519j0244o651P065L893j021m257m048N514L843l046j335k723
$$ -2029 -2812 4018 9537 -707 -7358 -293 3600 2579 -1678 -5726 -212 3631 585 -750 -3473
540c473Q85O034j444l339K546l099J80N867j933m768j078L976O147m550o329L871
$$ -3473 -2588 3446 2002 -1337 1209 -1890 -1710 4157 2224 -2544 -3622 354 6501 1951 -4378 -507
556e07J668k77R82n026k17O051k367j830J297k017R36J892M86J691l544p6N106
$$ -507 1161 884 1866 -3160 -3377 2674 307 -1523 -226 -2243 -1307 585 1071 2762 -782 -858 4248
573D248k850l282K836j632K50K494l123k3P95k492J802R85k5K132l270k36N198
$$ 4248 1398 -1884 952 -680 -430 2064 -1059 -1082 -287 -2779 -977 8 -17 2115 -1155 -1391 3807
590C807k807l884K226J169J383k6l060Q24Q87l90J323k774j095M294j395j346
$$ 3807 1000 -2884 -658 511 1894 1868 -1192 -368 519 129 1452 -1322 -2417 1877 482 -864
606h64K566m040o75M493j245j165M73K92K376j011j396J839k088J76L377k931
$$ -864 1702 -2338 -3013 1480 235 -930 -457 -165 2211 1200 -196 1643 -445 -269 3108 177
622A77j905K364r71m09L96j674J449K48o33K260j143j175K725j602j017K524q73
$$ 177 -1728 636 -335 -744 -348 -2022 -573 -325 -958 1302 159 -1016 1709 107 -910 1614 741
639G41r94R82q59O94o40j188K020j105k42K686k990j749L591p73j891K027m46
$$ 741 -253 729 -130 564 -76 -1264 756 -349 -591 2095 -895 -2644 947 174 -1717 310 -136
656a36k47J118l59p30k78J133K064k148j689K775j312j756K560j142j460J455
$$ -136 -383 735 376 -354 -632 501 2565 417 -1272 1503 191 -1565 995 -147 -1607 -152
672a52j71J32j73j691K153R08j005J231j756l13L099j240k296J729J78mm13j477
$$ -152 -323 -191 -364 -2055 98 1006 1 1232 -524 -837 2262 1022 -1274 455 633 629 216 -1261
690a261J278j8j096K231j685j419L026k93k357J706M26r03O79J18l74j4K17J188
$$ -1261 17 -1 -1097 1134 -551 -1970 1056 763 -1594 112 538 -365 314 432 58 44 261 1449
708A449p79j241J656r27j775K192j13j762J076k2k83K0p51J559N35j325J369j76
$$ 1449 670 -571 1085 158 -1617 575 462 -1300 -224 -246 -529 -509 -1260 299 834 -491 878 702
726G02j402K026l65j909J789k83r18O32q81k0L42m71J244l01j620K219l70j778
$$ 702 -700 1326 961 -948 841 558 -360 272 -609 -629 -287 -758 486 185 -1435 784 414 -1364
744a364K073P5j767J659N4m10K61j276Q96P63j688J502j15j761J889o92j867J968
$$ -1364 709 784 -983 676 730 320 581 -695 201 964 -724 778 663 -1098 791 99 -1768 200
762B00l19o87Q66p23K51J183j285J124k05j003K061k32k345J965J81j463N75p00
$$ 200 -119 -806 60 -663 -412 771 -514 610 405 -598 1463 1231 -1114 851 1032 -431 144 -556
780e56J04N45j202Q51M44j090J291K16j936J827K84j554J791m56j000J148q06
$$ -556 -452 93 -1109 -258 186 -904 387 603 -1333 494 778 -776 1015 559 -441 707 -99
797i9L99Kq53J391n30j854J878j25j458J599p9r91R78n76K01N59j189J337M85
$$ -99 300 302 -551 840 310 -1544 334 209 -1249 350 271 -720 258 -318 -117 442 -747 590 1075
816A075j838J325M62j796J635k86j411J163n73k27N43p38N87O5j014J333nj375
$$ 1075 -763 562 1024 -772 863 577 -834 329 -244 -471 72 -666 -79 -14 -1028 305 300 -1075
834a075J744k25j435J299J39p80R19p82K90N05j305J005J42j296J207k11j376
$$ -1075 669 444 -991 308 447 -333 586 -196 94 599 -706 299 441 -855 352 141 -1235
851a235J306j11p83J259o72L16P31j083Q33K40j089J183k89j280J265q5j058O82
$$ -1235 71 -40 -823 436 -236 80 811 -272 561 801 -288 895 606 -674 591 506 -552 130
869A30k35o98R26o29K95K95r37R57N48j498J290j25q26J452j06j262N73Q1K64
$$ 130 -105 -803 123 -506 -211 84 -853 104 652 -846 444 319 -507 945 839 -423 150 231 495
888D95n1q83M39K48j235J244r2j332J145K51q66N25J66n31Q60m25K95J16j153
$$ 495 444 -439 0 248 -987 257 165 -1167 -22 229 -637 -112 54 -477 383 -42 253 369 -784
907g84J275K29q05O02j90q80P37J93q87L80o00P41M98j187O61J91o41J121k0j707
$$ -784 491 720 -85 517 327 -553 184 377 -510 -130 -730 11 509 -678 -17 174 -467 654 634 -1073
927a073J285O39m99l6k66k28J71n0L06o7j249P49P47j096O44N2j135J689K53j086
$$ -1073 212 851 352 316 50 -178 -7 -57 249 182 -1067 -318 429 -667 -23 29 -1106 583 836 -250
947b50k27K47O58L47j088K03P21j070N84M32j291L17Q19j035O31n2o62P27K6J03
$$ -250 -477 -230 428 775 -313 -110 611 -459 125 557 -734 -417 402 -633 -2 -54 -716 11 37 140
967A40j86n03P89P62j383M33O24j185M64K42l98L29m40j76P82o10QJ92q42J387
$$ 140 -46 -549 240 1002 -381 52 676 -509 -45 197 -201 128 -312 -488 294 -316 -308 -116 -958 429
987D29N19j962N93R06n85P03m60m68R33j78l30L15r74N73K98r92P43L20j169N95
$$ 429 948 -1014 -421 485 -100 603 143 -325 608 430 100 415 -559 14 312 -680 63 383 -786 -191
1007a91N98q40L13o83M94J162j031L3P61l02l3O1o94O12L08p01N63l07o50M97
$$ -191 407 -433 -120 -803 -309 853 -178 -145 616 314 281 342 -352 260 568 -133 430 123 -527 -30
1027c0n56O42K69j055P78J000j578K49P70j083O99M55o66O28l04l2p4n13O32K08
$$ -30 -586 56 325 -730 48 1048 -530 -281 489 -594 105 560 -106 522 218 186 112 -401 231 439
1047D39j211P63O47j282P27l67n85R64lp17R31k93k25O73o88K48K37r40J041L19
$$ 439 -772 -9 638 -644 83 -284 -869 95 92 -625 306 13 -212 461 -227 21 258 -682 359 678
1067F78j108N06l09p9K96o91L92R48r85K07O55r61J76P24q80P84R2m63O79m72
$$ 678 -430 76 -233 -312 -16 -707 -315 633 -352 -145 510 -451 -275 449 -431 353 445 -18 661 189
1087A89q2O0o46N20P97j286K99Q29j545O17P29j139R42j86n05L05OK97M93p59
$$ 189 107 167 -479 41 838 -448 -149 680 -865 -248 481 -658 284 98 -407 -102 -96 201 694 -65
1107f5J96P73r60Q1L76o50L75k14n57R66k57l87N80o68J61M43n15M10L47o14L56
$$ -65 131 904 -56 25 401 -249 126 -88 -645 321 64 -323 257 -411 -250 193 -322 88 435 -179 177
1128A77L97m33J40o18M30J80n16L8O69r49K01O60o08j05N97n03K57J34m75Q16
$$ 177 574 141 281 -337 93 273 -243 -205 464 -485 -284 376 -232 -337 260 -243 14 148 -327 489
1148D89n17q4K98m1j37N80r10L76M3o25M17M50l60l09L02k22K18m20K33O34m27
$$ 489 -28 -112 186 145 8 588 -322 54 97 -528 -111 339 -21 -330 -28 -250 -32 -452 -219 415 -12
1169a2j3L15o37O64K34n74j1K34l41L47r8m36K83l4l0M03o80J81M65n26K4M40
$$ -12 -25 290 -347 317 551 -23 -34 200 -141 206 108 -328 -45 -79 -109 294 -386 -205 260 -266 -242 198
1191A98n49K02K98j88L67m91k64J089r21j64O08l01J5K02j18k25R3o5O14k93l29
$$ 198 -351 -149 149 -39 328 -163 -427 662 -259 -423 185 -116 -101 101 -17 -242 -149 -214 400 107 -222
1212b22L12n5m56R02n61P5O18o65M54k08q7l35N86n22L98m34j89N00n07k61Q51
$$ -222 90 35 -421 481 -80 -5 613 -52 402 194 107 -228 358 -164 234 -200 -389 111 -396 -657 194
1233A94m55K62N61o82L54M9m27M41j5n17L72p7j13M34m92j83N11m18n8K52k29
$$ 194 -261 1 562 -120 234 283 -144 297 282 -235 137 60 -53 381 -111 -294 217 -201 -259 -7 -236
1254b36K57p1k56L72j94nM28k26j78M60m19r2L78k07o1J53m44N81j81l79L49l62
$$ -236 21 -50 -306 66 -128 -133 295 69 -109 351 -68 -160 218 11 -50 103 -341 240 59 -320 29 -333
1276c33L6N28m81M7P08q62K42L71j79L8J59m08P35n04j55O19o21j68M07o9m18
$$ -333 -297 231 -250 -203 505 -357 -115 256 77 115 274 -134 601 97 -58 561 -60 -228 179 110 -308
1297c08L46k58J67J30l99K82K82l73P10k49j27M43r07J87O15o89J87J74m63M26
$$ -308 38 -220 -53 77 -322 -40 242 -131 579 330 203 646 -261 -74 541 -148 39 213 -250 176
1317A76j68k45K91l33K2N99l86k22M73l26J63K12l32K51k06M6N9o3n54P47l77
$$ 176 8 -237 54 -279 -257 342 -44 -266 207 -119 44 256 -76 175 -31 15 74 11 -543 204 -173
1338a73n2L40j54p3J12l0k02K36k03M39l7k31L14k62l2K77l58j56N09l21J44P6
$$ -173 -225 115 -39 -112 0 -30 -232 4 -199 240 203 -28 286 24 -8 269 -89 -245 264 -57 87 163
1360A63j47j98n0r6M77k33q0L84m23o1Q69n57RL29l99K46K21n41K61P9l44K97
$$ 163 16 -182 -232 -328 149 -84 -164 220 -203 -264 605 48 57 386 -13 233 454 -87 174 253 -91 206
1382B06l54K1K50l63r5N27n13M46k6l43L54q3R7L09q4n33O63m29p0L47l68j39
$$ 206 -148 -127 123 -240 -335 192 -321 125 99 -244 110 27 124 433 349 -184 479 50 -20 327 -41 -180
1404a80L66k6n37M37m11L91j7j45L58j21k91L97k24k53N88l40J59p1j94k43M82
$$ -180 186 160 -377 60 -351 40 23 -122 236 115 -176 221 -3 -256 332 -8 151 80 -114 -357 125
1425A25q1j81K73l99M33k59k83O23n21L3L98k25K21Q6m35K55K36k89%J08j98N19
$$ 125 44 -137 136 -263 170 -89 -372 251 -270 -237 161 -64 157 243 -192 63 299 10 10 118 -80 439
1447D39n18J1N7p5m2K32m15J00J19j18J60k37K9M17J08k22K66k18k03L53JL9l67
$$ 439 -79 -68 -11 -86 -128 104 -311 -211 -92 -210 -50 -287 -258 159 267 45 311 93 -110 243 244 283 -84
1470h4l85N92l29J37J85j87k23M13J6m49J10L65l53L45k55Q4J95k81L12m02L01
$$ -84 -469 123 -206 -69 116 -71 -294 119 135 -314 -204 161 -192 153 -102 -18 177 -104 208 -194 107
1491A07L69o83nM09k75j37K21j81J24J20l62K72K58o2K28k1p4j11J67l59M11m75
$$ 107 476 -207 -212 197 -78 -215 6 -175 -51 69 -293 -21 237 175 403 382 308 197 364 5 416 -59
1513e9P1J48j67m1K50l10m6J55r5J20k00k53M45J31k76J05K30r0J09k23L78j36
$$ -59 12 160 -7 -48 202 -108 -154 1 -94 26 -174 -427 18 149 -127 -22 208 118 227 4 382 246
1535B46k05J30Jm7N1k23k37L12j04k38O79k38l59L80m30O75k24m17N80j11l33
$$ 246 41 171 172 125 176 -47 -284 28 -76 -314 365 127 -232 148 -282 393 169 -248 332 221 -112
1556a12L67k14j75M65o29L49L44o06L31J0n00M52P1k34J76j90P1K47K3l48L76
$$ -112 255 41 -134 331 -298 51 395 -211 120 130 -370 82 153 -81 95 -95 -24 223 246 -102 274
1577B74k11M02k44n31L06N9k24r0K94m19M43j71j7J77k96L15pk31M86j73o12O84
$$ 274 63 465 221 -310 -4 55 -169 -259 35 -384 59 -112 -129 48 -248 67 60 -171 315 142 -470 214
1599B14j28l74N48j93j13L16k68J3j18j48M76l78Q0J61J03m71N90r9m56O44m55
$$ 214 86 -288 260 67 -46 270 2 15 -103 -251 225 -153 -73 88 191 -280 310 211 -245 399 -56
1620e6K25J74l59J29j64k71O30k09l66L60Q1l69n1K52l10N25k42K70j16j70N3
$$ -56 169 343 -16 113 -51 -322 308 99 -267 93 174 -195 -246 6 -304 221 -21 249 133 -37 16
1641A6J35m24L07K08l19L18j70j38L29k27n32L56j15K58j59r5J98k18K13n7Q3
$$ 16 151 -273 34 242 -77 241 71 -67 262 35 -497 -141 -256 2 -157 -252 -54 -272 -59 -116 -33
1662c3j16J88K6J05k32lJ94q9m7J43k4m11K66k12J7l5L25j15J86k63k8K55j42
$$ -33 -149 39 65 170 -62 -65 129 40 -7 136 112 -299 -33 -245 -228 -263 62 -53 133 -130 -158 97 -45
1685d5m4p7J08J25K95n66K94R2l53K45M5l23O10k45j55q7J06J29k03k28M04J14
$$ -45 -89 -166 -58 67 362 -204 90 182 -171 74 119 -204 406 161 6 -81 25 154 -49 -277 127 241
1707B41m58M22k46J40K47j73r2K02l59J57Q4n10RL89k98K83q3N6J93j07l45K65
$$ 241 -217 205 -41 99 346 173 81 283 -76 81 165 -345 -336 53 -245 38 -45 11 204 97 -248 17
1729A7J27j43J87l17N37j40m76M18j97n07N83l9j26K96j03m07K04j47j6M71n61
$$ 17 144 1 188 -129 408 268 -208 210 13 -494 89 50 -76 220 117 -290 -86 -233 -249 222 -339
1750c39N27n4j77K73j77j9K71k65k16K00j72J73m6j26J92j28j60L16R4k84J74
$$ -339 188 134 -43 230 53 34 305 40 -176 24 -148 25 -21 -147 45 -83 -243 73 167 -117 57
1771E7P5j81P2j53J45K32k31j01N21m29k02K63j73K09j02j24pJ1J88K86n78J46
$$ 57 132 -49 23 -130 15 247 16 -85 436 7 -195 68 -105 104 2 -122 -129 -118 70 356 -222 -76
1793g6K82j25J57K9p7q3K21k28r4J52l13J34J42j7M4m20K14K34l16J36P9K5J19
$$ -76 206 81 238 267 190 107 328 100 6 158 -155 -21 121 104 148 -272 -58 176 -140 -4 75 100 219
1816B19k28j51K18k49K00L38l98J81K1m89K08L32l25K62J13o92M45j34j35J96
$$ 219 -9 -160 58 -191 9 347 -51 130 151 -338 -130 202 -123 139 252 -440 5 -129 -264 -68
1836f8j72K42K20n22N47k85n5K80j67l3K83l77P4L7O1r0K8l71K45Q6j77K92oj41
$$ -68 -240 2 222 -300 247 -38 -93 187 20 -13 270 -107 -33 4 65 -25 3 -368 -123 -37 -214 78 72 -69
1860f9L10m8n82P64o12K82M7k07L09J3j54q4J48j38p0J74l52L31r2p0L76n19J62
$$ -69 241 193 -389 375 -237 45 92 -115 194 207 53 -31 117 -21 -91 83 -269 62 -30 -100 276 -243 -81
1883h1LJ52P0K03m89K73K29l31K9k8J10j93l5j66J80K8O4K88n46O8L93l17q6M41
$$ -81 -78 74 144 347 -142 131 360 29 58 30 140 -53 -88 -254 -74 -46 18 306 -240 -172 221 -96 -182 259
1907B59k50J8J6l56N36k27p0L31m24nK75k20P3P8k54K60J71l74J13j70O3L39j53
$$ 259 9 27 43 -313 223 -4 -74 257 -167 -172 103 -117 -44 34 -220 40 211 -163 -50 -220 -157 182 29
1930B9q8P3p8mK42j61M43j35j97j90Q4j00K12k2k33J03l03K82J22k69K84J82l55
$$ 29 -59 14 -64 -68 174 13 456 321 124 -66 18 -82 130 108 -125 -22 -325 -43 79 -190 94 276 -79
1953g9L16j53j09J60O1l69M86j93j34J89j16j13M8%j34P0K24k28J17m2q8J75R6
$$ -79 237 84 -25 135 196 -173 313 120 -14 175 59 -54 -6 -6 -140 -70 154 -74 43 1 -87 88 184
1976A84Ml25LM64l11j5K60l00RL06m59K90k53j66M96m66L94J62p72N6O55m09L23
$$ 184 188 -137 -134 330 19 4 264 -36 -27 279 -180 110 -143 -309 187 -279 115 277 -495 -439 216 -193 130
1999A30L7j70m3Q3j37K25n3k88L89m79J24L7j35P9M6M1L28j88j26J52p6j36L21
$$ 130 167 -3 -46 37 -100 125 72 -216 173 -306 -182 -145 -280 -201 -155 -114 214 26 -100 52 -24 -160 161
2022A61n51N45j32n09N20k46QK03J60m55L76k93PJ57j02Q7K07k36k6L34k2l67
$$ 161 -390 155 23 -486 34 -212 -204 -1 159 -296 80 -213 -206 -49 -151 -64 143 -93 -119 215 193 -174
2044a74K94j37K46J13l14j02L50n06M34m34L71k57j77O1J48j87M04j06j82J98
$$ -174 120 -17 229 342 28 -74 276 -230 204 -230 141 -116 -293 -232 -84 -271 133 27 -155 43
2064D3j75J99N69n83J03K04n33K42j53l73M70O4p2k73K40j87j84M18j21K17j97
$$ 43 -132 67 636 53 156 360 -173 69 -84 -457 13 77 5 -268 -28 -215 -399 19 -102 115 -82
2085h2L6K13l75m1L74k7k02J80j63kL3o0j64L40k57K01k25j38O11k51j1J95j28
$$ -82 -46 167 -208 -249 125 98 -104 76 -87 -89 -56 -116 -280 60 -197 4 -221 -359 252 1 -10 185 57
2108E7J88q9k69K47m9l23Q3K02m53O39m59K81J75o86K51K32l79J82p7J91J95k03
$$ 57 245 156 -113 134 85 -238 -155 47 -406 233 -226 55 230 -456 -205 27 -352 -170 -247 -56 139 -64
2130f4j00J77qJ29M9l35L3K17k94M4L72l90L06n3j60J86j12k63N21n80L14NK5
$$ -64 -164 13 5 134 183 -152 -119 98 -196 -152 220 -170 136 83 -77 109 -3 -266 255 -325 -11 -6 19
2153A9NM8J25j00R3j65J1P8l51K98r4l7J15j81P0J30k09j48Q8J92J9j21J2J16
$$ 19 24 72 197 97 190 25 36 114 -237 61 -33 -70 45 -136 -66 64 -145 -293 -205 -13 6 -115 -103 13
2177A3rj39N14m22J75J14j93k0k0p6K79O4n57L10k14L0q7K01o5J86M5k09M92n61
$$ 13 4 -135 379 -43 132 246 53 33 13 -63 216 280 -277 33 -181 -151 -238 -37 -102 84 129 -80 412 -149
2201a49J47K94j45O2o6l21L85n00L39K27l33p1J37j96J37J94j58J13j45Q5j13
$$ -149 -2 292 147 209 143 -178 207 -293 46 273 -60 -131 6 -190 -53 141 -17 96 -49 36 -77
2222g7J43k13N91k85j08L5j65J11L00j63k37J47l33J21J40j18L5J95j32J1J16
$$ -77 66 -147 444 159 51 86 -79 32 332 169 -68 79 -254 -133 7 -111 -76 119 -13 -2 114
2243A14j02K15l79L12J64k31j15J85l76K42rk56K17m5J25p8K9o5L08j57k70L01
$$ 114 12 227 -152 160 324 93 -22 163 -213 29 20 -236 -19 -64 61 -17 12 -53 255 98 -172 129
2265A29l1j54K47k58J99j70J07K91j63m56L29l70L39J6j25J40m7r1J88k16M2n8
$$ 129 98 -56 191 -67 132 -38 69 360 197 -259 70 -300 39 55 -70 70 23 -68 120 -96 -54 -112
2287a12J53k66K22q4J29J08O7j90l3L0pj39l4J49j04K7K21o7j95K60k67j36M46
$$ -112 41 -225 -3 -87 42 150 217 27 -6 24 17 -122 -156 -7 -111 -84 137 70 -125 135 -132 -268 178
2310A78k13J19j32p9L28l49N6O4J65k61P1J86k73L2o1J78J9k22L28L7k44J4L5
$$ 178 -35 84 -48 -127 201 -148 -92 -28 137 -124 -53 133 -140 -108 -169 9 28 -194 134 171 -73 -59 -24
2333b4j38K27K7l84N80m77J12O1K30l19p2L5l7L00k19K7P6O7QM4r2J99l70M22
$$ -24 -162 65 92 -292 288 -189 -77 -16 214 -105 -177 -142 -179 121 -98 -71 5 72 80 124 32 231 -139 283
2357B83l61m7K40J19k01J30j02k83L02o5K2l4k68J00J09RK33l35M6M19j90m8K6
$$ 283 -78 -125 115 234 33 163 61 -222 80 15 37 3 -265 -165 -56 -47 186 -149 -103 316 126 78 104
2380A04K48m94K99p2J61l18J07j31J82K50k75j39j79L96k71O0K75k28qK95l31
$$ 104 352 -142 157 85 246 -72 35 -96 86 336 61 -78 -257 139 -132 -72 203 -25 -33 262 -69
2401f9J07lr0R7N9j03j24J95l60J82R4K8L6j23M0Jk06J15J10j18J21j5O8r3N8
$$ -69 38 35 -55 42 101 -2 -126 69 -291 -109 -15 13 49 -74 -34 -33 -239 -124 -14 -132 -11 -26 42 -51 7
2426GP9J01m60K59R2j5l9j3k7j8j07n4L26l48K9J92o9j63J83J74j83J87j1k9L32
$$ 7 86 187 -273 -14 78 63 24 11 -16 -34 -141 -195 131 -217 -188 4 -65 -228 -45 129 -54 133 122 93 425
2451D25m24Q9j94l8O0j9J38J45k71q1R5n3R5L1j35K06k5k07J87J71k59J27j84
$$ 425 1 90 -104 -142 -82 -101 37 182 -89 -170 -75 -128 -33 -2 -137 69 44 -163 24 195 -64 63 -121
2474a21q8J99j06M1J10r1K96k60k04K57J11l58L53j20J9j66J37L39l31j58m8M83
$$ -121 -209 -10 -116 -75 35 -56 240 -20 -224 33 144 -214 139 19 38 -128 9 348 17 -141 -189 294
2496B94l33M12k59j51K4J1j30L71j66ok19R4k50L03K4K0K71k70J81J29k79k14
$$ 294 -39 373 114 -37 -13 -2 -132 239 73 67 -152 -58 -308 -5 19 39 310 40 221 350 71 -143
2518a43L60m79M40k44J48k34J05k10J44J43j48J89k77J28J0j07K80J46j47j89
$$ -143 217 -262 178 -66 82 -152 -47 -257 -113 30 -118 71 -206 -78 -68 -175 105 251 104 -85
2538h5J46K6N9l33L14k07k04K40l6m5N8Q5j52J94k54Q8K47l10K46n6K25m03M07
$$ -85 61 87 146 -187 127 -80 -284 -44 -80 -125 -67 18 -134 60 -194 -106 141 -169 77 21 246 -157 250
2561B50j68J8Jl79M56k77J12K26j58j52J69M9l67K06J00j87j32N8L64j3l44L25
$$ 250 82 100 101 -278 178 -99 13 239 81 -71 98 147 -220 -14 86 -101 -233 -175 189 176 -168 157
2583A57k56K0K52J29m40K51k8j38K50k68q9L31k89m3J91j98J91O3n2K90k32J71
$$ 157 -99 -79 173 302 -138 113 85 -53 197 -71 -160 171 -118 -161 30 -168 23 86 34 324 92 263
2605B63N7l76q5N0q2L04K3l81L71j37q0o5j93K38J86n2K59o0j79j35P6J35l68
$$ 263 320 -56 -141 -91 -173 131 154 -227 144 7 -73 -138 -331 -93 93 41 300 240 61 -74 2 137 -231
2628b31Q3K31nn7J05N8k74j48J62R7R4j82K71o7J19m83M62J00j16k30p8L09l44
$$ -231 -148 83 78 21 126 184 -90 -238 -76 21 115 -67 204 137 256 -227 235 335 219 -11 -89 220 -124
2651a24J00KP0k53J91j4l6N9J08n18L86j55M4L46k49j10K15l44O0K79j36K79k21
$$ -124 -24 -22 48 -205 -14 -28 -64 -5 103 -415 -29 -184 -140 206 -43 -153 62 -282 -222 57 -79 200 -21
2674b1j6L60l62j29O9J55K7k3q6j49J58o5J63J09l60L27j1m3j58j11M41l71P6
$$ -21 -37 323 -39 -168 -99 56 83 60 -26 -175 -17 -82 81 190 -170 157 146 103 -55 -166 275 -96 -20
2697b0j11K40l5J79j66j49r8K62m91N56o3k23K16j36J76N8l19L54l04J29q2P0
$$ -20 -131 109 74 253 87 -62 -160 102 -389 167 104 -119 97 -39 137 195 -124 230 -74 55 -27 43
2719D3n91P49L6n19M48j42P9j60k4K07k35J05N5K63k51j11M27m72N4Q9q9K19p2
$$ 43 -548 201 237 -282 166 24 103 -57 -81 126 -109 -4 51 314 63 -48 379 -93 -39 50 -39 180 108
2742A08j14J45l79K21j61J55mn0Q6K1n2j53K58O1j87L32j30k0pj64J18J59l66
$$ 108 -6 139 -240 -19 -180 -25 -29 -79 7 28 -24 -177 81 142 -45 287 157 137 130 -34 84 243 -123
2765a23K73k36J34K0l1l53L74j55K01O2k45K26j6l49L52Oj20J89k45k23L71k0
$$ -123 150 -86 48 68 37 -316 58 -97 104 166 -79 147 131 -218 134 140 20 209 -36 -259 112 92
2787I2k57J55K1l11M84n0j23J09m18N22j68j00M2k17K23J47o9l35J84M5m5J2m8
$$ 92 -165 -10 11 -300 184 134 11 120 -298 224 56 -44 -2 -219 4 151 82 -253 -69 -24 -69 -57 -105
2810a05J62k04P1J99q6j66K4Q7k14J04Q1Q6k0j32K94l16J9K19Q2l34J42M8j11
$$ -105 57 -147 -76 123 37 -129 -105 -18 -232 -128 -47 39 19 -113 181 -135 -116 103 185 -149 -7 41 -70
2833g0j56K62q4J57j80j78K29J52j00N8k64N05m15N5J63k38J5J74k77K09K25o39
$$ -70 -226 36 -48 109 -71 -249 -20 132 32 90 -174 331 -84 -29 134 -104 -89 85 -192 17 242 -397
2855c97K77L20k86O4K05m1j85Q0k88N0K85L5j32LJ5K5m40L31J70k26jj3K80k85
$$ -397 -120 200 -86 -22 183 142 -43 37 -251 -201 84 119 -13 -10 5 30 -410 -79 91 -135 -136 -149 131 -154
2879a54K41m93M12k26o4O74l20k50J1J19J5L54m79N64n38K33K3j81j39L84j9j81
$$ -154 87 -406 6 -220 -284 390 70 -180 -169 -50 -35 319 -160 404 -134 99 122 -59 -198 186 167 -14
2901a4q1n5K24j9k14m8J07j5K39l2k3J49k64J16J7J51j93j4k32Q3Q5M3K6k93L29
$$ -14 -95 -150 74 55 -159 -207 -100 -115 124 92 69 218 -46 70 87 238 45 31 -201 -118 -33 10 36 -257 72
2926G2q6J8J50J48j47k82J61n6J44k53Q7K89j41j46j04J39k44K42O1r2J56k88
$$ 72 -14 4 154 302 155 -127 34 -22 122 -131 -44 245 104 -42 -146 -7 -251 -9 52 -40 116 -172
2948a72J29k4q2L3N7j65J19J03j3j16J55l93K81P4J46k5j23Ll2K36k46Nk9M6L28
$$ -172 -43 -67 -149 -116 -59 -224 -105 -2 -15 -131 24 -369 -88 -14 132 107 -16 -13 -45 191 -55 -50 -79 -33 295
2973B95j62k15K78k57O8m1p1K20j04K32j02n8L32r0m85L32k83o0K17j7j34J10
$$ 295 133 -82 196 -61 7 -34 -105 115 11 243 141 83 415 325 -160 172 -111 -171 46 29 -105 5
2995Ek3K93l88J2K49r2j18mJ92n3L10k48j35K12l38P6k4n2R6j46K7K55j79R1J41
$$ 5 -18 275 -113 -101 148 56 -62 -66 126 73 383 135 0 212 -126 -50 -74 -126 -30 -176 -149 106 -73 18 159
3020A59m3k92L04nj99J70K00m97M01j05j28l8R7oL8j25l67L58J4J77k41L1K31
$$ 159 116 -176 128 123 -76 94 294 -203 198 93 -35 -73 24 18 56 -69 -436 -78 -64 113 -128 -97 134
3043A34r5J3q1n1J14K07m19L37k08J19j32O6j12J59n2O0o8jOJ23l2K14l31O1j33
$$ 134 39 52 -29 -80 34 241 -178 159 -49 70 -62 4 -108 51 -1 59 -9 -10 -4 119 87 301 -30 31 -102
3068a02L59l93J50j34K13j41j05l6L58o1j52%p8M01m98Q4N38m51K6Lk7J17J34
$$ -102 257 -136 14 -120 93 -48 -153 -189 169 108 -44 -44 -122 279 -219 -135 403 -48 -22 -19 -46 71 205
3091B05o5n5K9j9K47k17j66K41j64J25j03j7j7J35j86j2o8J46o9J45J83k68k3
$$ 205 140 85 114 95 342 125 -41 200 36 161 58 41 24 159 -27 -39 -107 39 -30 115 298 30 7
3114GJ77l80K88j66Q0k5J4K1k1P8p0J1j22J48j97K39l0m67O28j77l7l6k78L08
$$ 7 184 -196 92 -74 6 -19 -5 16 -5 73 3 14 -108 40 -157 82 52 -415 213 36 -1 -37 -315 -7
3138gJ16K43k46k0p9J71Qm16K20q8m9o2J59mO3r2n8K70m3J53j44p4p8J31k25L21
$$ -7 109 352 106 86 7 178 186 -230 -10 -98 -147 -209 -50 -54 9 -83 -141 129 86 239 95 21 -57 74 -151 170
3164A70j32pj52J57N1l09K34k84L79l29L38J96l87j71J61pJ15L2r8Q9n9R0j11
$$ 170 38 31 -121 36 87 -222 12 -272 107 -222 116 312 -75 -246 -85 -92 23 55 -43 46 -13 77 -34
3187c4p3K05p7J36m4j72k26K57J87j80J08J42k39J14J96o46L34j48K4M05k89N3
$$ -34 -107 98 21 157 113 -59 -285 -28 159 -21 87 229 -10 104 300 -346 -12 -160 -136 269 -20 33
3209C3j21j67K07r0J26K39m88J3M23j2j91L41l11Q4J42l06K9L7Q6K31l80J75j05
$$ 33 -88 -255 -48 -138 -12 227 -261 -248 175 163 -28 313 2 86 228 -78 -49 -12 74 305 -75 100 -5
3232eJ41k97J49LJ20r9q1q1J18n0J62J38j62Pj5k80L33j79P5k90K16M29m28k16
$$ -5 136 -161 -12 -9 111 12 -69 -150 -32 -82 80 218 56 63 48 -232 101 -78 -3 -293 -77 352 -76 -292
3256b92M02k6k3J7j91J40n4P3q3K24k38m2L25j25j63rj86K30p9J44j8Lk07k8K44
$$ -292 110 84 61 78 -113 27 -27 46 -37 187 -51 -93 232 107 -56 -65 -251 -21 -100 44 26 29 -178 -206 38
3281C8j04J56l57K23K32k55L0L3R2Q7k29k6J63qP1j69j76K23l44J16L7l2K36K52
$$ 38 -66 90 -267 -44 188 -67 -37 -4 88 175 -54 -80 83 75 146 -23 -199 24 -320 -204 -167 -199 37 289
3305B89n57K21O0j38K70k46N5j12M27l65N6J59N8k08J66j9j02j33M7J53j97J09
$$ 289 -268 -47 13 -125 145 -101 -46 -158 269 -96 -40 119 177 -31 135 116 14 -119 -72 81 -116 -7
3327gk59R8P9L26k72r3K63M2j87m2K27r7j51J09J1k13k0K12n1k48K71l0k23M08
$$ -7 -266 -168 -89 237 -35 -128 135 177 -10 -52 175 78 -73 36 47 -166 -186 26 -25 -273 -2 -32 -255 153
3351A53k62k3K1J07J97lM5m33J51k9K07l1P3r6o5o0k5m1K06l64Q7J55K09k9j78
$$ 153 -109 -132 -111 -4 193 190 235 -198 -47 -76 131 100 173 77 12 -48 -73 -114 92 -272 -185 -30 179 150 -28
3376b8n9j8M9r3M70m47QL42n08N14k07J4J1k8K9j24K23j72J40P4j93J02j01n1
$$ -28 -87 -105 -56 -149 321 -126 -118 224 -284 230 23 37 48 20 49 -75 148 -24 116 190 -3 99 -2 -53
3400e3NJ95q3k31J61p2n4K79j05K2O6k53N0j18K71M1k56M4l6J78k74K57j15o4
$$ -53 -48 147 64 -167 -6 -78 -132 147 42 64 130 -123 -73 -191 80 121 -135 -91 -127 51 -223 34 -81 -145
3424a45k13L96j57N9O3qLJ58k82L0K49k78l7j2K87N0k23K0N6k98P2M59j93k97
$$ -145 -358 38 -119 -60 3 -5 -2 156 -126 -96 153 -125 -162 -174 113 163 -60 -40 16 -282 -210 249 56 -241
3448b41J41J65k83K84k48J86N1o9j83R7J64J9Mj24J53K3j77J94j93k98M50l64
$$ -241 -100 65 -218 66 -182 4 55 -14 -197 -100 64 83 87 -37 116 139 -38 156 -37 -335 115 -249
3470b49M71j51k68J76m3J8J5Q7k37L80l96J43k09J42P1J40j48j32N25k31k56J29
$$ -249 222 71 -197 -21 -64 -46 -31 56 -181 199 -197 -54 -263 -121 -50 90 -58 -190 335 104 -152 -23
3492b3K11n14L06L62l89R8J74k91J14j30j74L82j75K12k30K48p1l24J54rJ83k37
$$ -23 188 -326 -20 342 -47 51 225 -66 48 -82 -256 126 -49 163 -67 181 110 -214 -60 -69 114 -123
3514a23P7P0J63l02j7J46o5J7J66k25L0K33l37j98K25K45k87K54j11K34k97K0
$$ -123 -46 24 187 -115 -132 14 -51 -34 132 -93 -63 170 -167 -365 -140 105 -182 72 -39 195 -102 -82
3536h2j6J83k04j4J77j58J88j55K7R0K58l64k29K30J9q0l5L06k68J59J41k08K61
$$ -82 -98 85 -119 -133 44 -114 74 -81 -54 36 294 -70 -299 -69 -50 -130 -165 141 -127 32 173 -35 226
3559B26m4P1k94L20l78J11J78o5n2l17JL89j80o9K96q0k21J57j30j3m4L67k56
$$ 226 182 253 -41 279 -99 12 190 125 73 -244 -243 146 -34 -103 193 113 -108 49 -81 -94 -138 229 -27
3582b7j7J74p8p1n8J94j05k51M95n78mM03r8M1l8J32k22L6j52K01o7K53l7j22
$$ -27 -44 130 52 -19 -77 117 12 -239 256 -322 -326 77 -21 20 -18 114 -108 -72 -224 -23 -90 163 126 4
3606Dp9M99n11j03J77j03K31n61J42N37n46L49j9k2R6k91J06Q5O2r3L31m72K3
$$ 4 -75 424 -87 -190 -13 -116 115 -446 -304 233 -313 36 17 -5 91 -200 -94 -9 53 -40 291 -181 -158
3629a58J83o1j93K44K28j93j0K54l07L1K43k85j50L1J61n4J43j53K57o5k45J78
$$ -158 25 -36 -229 15 243 50 40 294 -13 18 261 -24 -174 -143 18 -36 107 -46 211 146 -99 79
3651G9l36J48k2J85o5J3J66j17J12l14J78J12j88j16m0K81L9k9Q3k74K91k94J80
$$ 79 -257 -109 -131 54 -11 2 168 51 163 -151 27 139 -49 -165 -205 76 115 86 169 -105 186 -108 72
3674G2k43K47K6j26o3K38Jj43j02L6rJ33j54l41N46j44j92K46j58J73j81K12j16
$$ 72 -171 76 102 -24 -87 151 152 9 -93 -57 -66 67 -87 -428 118 -26 -218 28 -130 43 -138 74 -42
3697d2q0M8L4l6K36q6j44J03l1n7P0n8j84L11j49L8j20K4K2K4k8K10J57j67oq6
$$ -42 -122 -74 -40 -76 160 74 -70 33 2 -55 15 -43 -227 84 -65 -27 -147 -123 -101 -77 -105 105 262 95 89 3
3723CK56j28P3l92J96R5Q7j9m41K03j33n6J74J88j69J86j79j51L80l20J53K12
$$ 3 259 131 204 -188 8 103 190 171 -270 -67 -200 -256 -82 106 -63 123 -56 -207 173 -147 6 218
3745B18n16R4O8J16N9J39n2J8p9l0qj4m6J67j37N2m8j81Lr8L40K4K4R9l50K11
$$ 218 -298 -204 -136 -20 39 178 126 144 65 35 27 13 -33 134 -3 49 1 -180 -177 -275 65 89 113 212 -138 73
3771G3j43k9J88r4R5j83j9J52R0j5k22L14l39j40K96J15m8j82J2K08J7p3j01j2
$$ 73 -70 -99 89 -5 90 -93 -112 40 130 115 -107 207 -132 -272 24 139 91 -91 -79 129 146 73 -28 -40
3795d0l5K95k78K2k32L14j58K7K28P2p4j07J65k53R7k01J45J01O4j60j0k8j73
$$ -40 -75 220 -58 -36 -268 46 -112 -85 143 215 141 34 199 -54 43 -158 -13 88 152 -8 -18 -46 -219
3818b19L28oj70J73O4j67m4J3J9K7k41M28l27K13M1J7l15J33j04K49m9o3M2j30
$$ -219 109 103 -67 106 170 3 -41 -28 -9 18 -223 205 -122 91 132 149 -166 -33 -137 112 63 0 42 -88
3842h8K97k53J57p3j01J87K3l24K62J28k60K5J67j14K08k15k35j11K5L38k33K21
$$ -88 209 -44 113 40 -61 126 149 -175 87 215 -45 -20 147 33 241 26 -209 -320 -295 43 -190 31
3864C1K55k40J45J3l18jJ77rkJ67K4j29J63m54R1K52k30J85o9j01J86m27K11M0
$$ 31 286 46 191 204 -114 -115 62 53 51 218 242 113 276 -178 -87 165 -65 120 51 -50 136 -291 -80 -40
3888d0K58k07m9K84q5k49M94n57K10j27MJ39K66j86k36j2J16j74j5J40j99J3J52
$$ -40 218 11 -38 246 161 -88 406 -151 59 -68 -64 75 341 155 -81 -93 23 -151 -166 -26 -225 -212 -60
3911f0K08j13j90j17q2N19j73L6J02k09J43m04K00J23J32r8j4K01k92L50l28K59
$$ -60 148 35 -155 -272 -354 165 -8 28 130 -79 64 -340 -140 -17 115 17 3 204 -88 262 -66 193
3933A93p9k20L97j36j30j72K88p8j36k2M57m53L77k58k08J72K05l1m87L46J34
$$ 193 114 -106 291 155 25 -147 141 63 -73 -95 362 -91 286 28 -180 -8 197 166 -321 25 159
3954A59k45r4R9r0J25J75m1l08K2L46J12Qm44M3M0J9k27K9K75qk9Q5j81J72k39
$$ 159 -86 -180 -81 -171 -46 129 88 -220 -198 148 260 268 -176 -133 -93 -74 -301 -272 3 -5 -34 51 -130 42 -197
3979a97K77l14M4K65J1J48l07J77q5k63J85l0J82l5k53J02j30K54K07j04p3j01
$$ -197 80 -234 -190 75 86 234 -73 104 19 -244 -59 -89 93 58 -195 -93 -223 31 238 134 61 -40
4001d0q7%N4J93j56K54p4J45n6k16N5l1p9o1k01L46j33j08K73l9K0p2L5r9J21
$$ -40 -127 -127 -73 120 -36 218 144 289 233 17 72 41 -38 -99 -300 46 -87 -195 78 39 59 -13 22 -77 44
4026D4N8n5P5o4j5J37j63K44k32j20J46k33L56J9l29N3J95k59P5K10K0Ml8O1k43
$$ 44 102 47 122 58 43 180 17 261 29 -91 55 -178 178 197 -132 -79 116 -143 -68 142 162 166 128 189 -54
4051e4mj99K4L75l35L23k84O1J83l4k05R2j20K95k08J66QN9m7J93k23j04p4K75
$$ -54 -58 -257 -233 142 -193 130 -154 -93 90 56 -149 -57 -177 118 -90 76 84 143 96 289 66 -38 -112 163
4075A63k71R6n7J25l03J57L00l83p3L39j23J14J10j10R7kj23K70m55j32K35J52
$$ 163 -108 -12 -69 56 -247 -90 210 -173 -246 93 -30 84 194 84 181 179 56 326 -129 -261 -26 126
4097A26n9P3M6j53n7k13K46J28k20J83j72P7J97p4j0l77L64j94K43n05M05k6n6
$$ 126 67 140 186 33 -24 -237 9 137 -83 100 -72 5 202 128 118 -259 105 -89 154 -351 54 28 -28
4120b8L45l75J57nN3P1j51l2N8j33K22r1l24L83n9j88K87k12M9P3l31J08K23o1
$$ -28 317 -58 99 94 147 218 67 35 93 -40 182 91 -233 150 91 -97 190 -22 27 100 -231 -123 100 39
4144C9rr6k60K58l70L88R9n36M21J28L94m60k6j9K19j48m2Pr9j11K05J34k25p7
$$ 39 30 -66 -326 -68 -438 -50 49 -487 -66 62 456 -4 -30 -49 170 22 -20 -13 -112 -223 -18 116 -109 -186
4168a86L36j63r2K81j73N9j11j20Q7J55K40l23j47J40k0k63L79j48K53j96n4K82
$$ -186 150 -13 -105 176 3 62 -49 -169 -82 73 313 -10 -157 -17 -37 -300 79 -69 184 -12 -66 216
4190B16l9m28r2L35j21K48j38R3L9l7k02LJ47j17K51m0P2Qj35k7l0R9k26l5J70
$$ 216 177 -251 -343 -8 -129 119 -19 74 113 76 -126 -123 24 -93 158 118 190 198 63 36 6 105 -121 -156 14
4215A4K55l60l7J70j25j73J25Q8m7K98k07O4q8q3lN8J71pj77q9K14o8R0k38K59
$$ 14 269 -91 -128 42 -83 -256 -131 -43 -90 208 1 65 -23 -106 -109 -51 120 113 -64 -153 61 -7 83 -155 104
4240A04O7J3L3j75N1k70K22k8K55l12p7M25m16R2oq7r7J76R9j10k2J01j14J27
$$ 104 171 184 217 42 93 -177 45 17 272 -40 -117 308 -108 -16 -22 -109 -206 -30 69 -41 -63 38 -76 51
4264E1k85K77J95p3k61j68J35J22j6k32J18J83m1n1J67j92K01j7P6p3j31K3j41
$$ 51 -234 43 238 165 -96 -264 -129 -7 -23 -255 -137 46 5 -46 121 -71 130 113 189 116 -15 8 -133
4287a33M8J25m77M75J7l7j21n1l5J34L99p66K69K10n18L72m6R7j03L7L08k06L0
$$ -133 -85 40 -437 38 55 18 -103 -154 -189 -55 344 -422 -153 57 -461 -89 -135 -38 -141 -104 204 -2 28
4310B8j64K07J09k22l5N8k13N9J97Q5J9j10k55P2J73J63k60J41j36O7j63n8P0
$$ 28 -136 71 180 -42 -77 -19 -232 -173 24 109 128 18 -237 -165 8 171 -89 52 -84 -17 -180 -238 -168
4333a68Q5J64j88J24jL1j19J57j71L53k34J28Mj66n2M7r2p6K37j29Lk8K75j70
$$ -168 -83 81 -107 17 16 47 -72 85 -86 267 33 161 165 -1 -53 -6 -98 -174 63 -66 -63 -91 184 14
4357A4j94L29l98J83R7K21k09j82L30k13j01J59Q0j77M01l28J4m2k08J70l37N71
$$ 14 -180 149 -249 -66 31 252 43 -139 191 -22 -123 36 116 -61 340 12 26 -16 -224 -54 -391 180
4379A80l4l50K38k66K59j76K32j32M1l1K5j11J41j73L17k27L35l26Q4j69L59j43
$$ 180 146 -204 34 -232 27 -149 83 -49 -8 -39 -14 -125 16 -157 160 -67 268 -58 26 -143 216 73
4401G3j92J40o4J42l16J41J50q0J75k17O8j8J37l66N48j46K6l35p4K52k97L79
$$ 73 -119 21 -43 99 -217 -76 74 -6 169 -48 20 2 139 -227 321 175 201 -134 -208 44 -253 126
4423A26l41J71R4j73L23j26k33K32j87R2K2j05j61L26k73L38J33m20J95J87j83
$$ 126 -215 -44 50 -123 200 74 -159 73 -114 -22 0 -105 -266 60 -213 125 258 -162 33 220 37
4444C7N1L3k70O9K49l64M21ol97J73Q1o7M6Q9j14j91m3Q5J68p8o4K05l34L67j49
$$ 37 88 121 -149 -80 169 -195 226 220 -177 -4 77 10 56 145 31 -160 -203 -118 50 -28 -92 113 -221 146 -3
4469cPJ00l62J99K56k13l9K63j09m3j19q6J63k1k5k5M0n2K70j10k9k54N4j34L35
$$ -3 4 104 -258 -59 197 -16 -55 208 99 56 -63 -149 14 -7 -32 -57 -17 -69 201 91 62 -192 -138 -272 63
4494F3l15K37K02k10NN8K1j23P9J09J26k53J01j14J62l8r6J20k54K35J20k97K48
$$ 63 -252 -15 187 -23 -18 40 61 -62 17 126 252 -1 100 -14 148 110 14 134 -120 115 235 -62 186
4517A86k17k3J26l7M1k39K55J03l72P4J19J09O7j36l56L35k30O5J96q4K93n15
$$ 186 -31 -54 72 35 76 -163 92 195 -177 -103 16 125 192 56 -300 35 -195 -130 66 -18 275 -240
4539b40K60l9K22j07K5l70M07l06J20L6j20o0N2K29K2m09M3K50M5J7j87K23J05
$$ -240 20 -19 203 96 121 -249 158 -148 -28 8 -112 -172 -120 109 131 -278 -235 15 60 77 -110 113 218
4562B18k09m0R7L5m5r3K22m94J94N4p3o9K30J34J89l39j99QK87j04p8J61j12k
$$ 218 9 -31 66 101 56 -37 185 -309 -115 -61 -134 -203 27 161 350 11 -188 -180 107 3 -75 86 -26 -28
4586b8r7K08k03M4R0j39K03q6o1M1j12K38Mk9q0n2q4Q9J34j54L50l56j19L33j8
$$ -28 -125 83 -120 -76 14 -125 78 -8 -69 -28 -140 98 102 73 -7 -59 -143 -54 80 -74 276 -80 -199 134 116
4611A16J39m19K3M2J43J19J11k98K0N3p8q1K52J88k40j0l32K68r3Q7Q7J24k9k49
$$ 116 255 -164 -141 -99 44 163 274 -24 -4 49 -29 -110 142 330 90 80 -252 16 -77 10 97 221 192 -57
4635e7j93L79k25M6J25N5k8o8N9j08p3J40lQ8j24n9J92q8l94K15O5M2o0j3J76
$$ -57 -250 129 -96 -50 75 130 102 34 93 -15 -88 52 49 137 13 -46 146 58 -336 -121 -56 -14 -74 -87 89
4660H9q0L0O6j17q0J88k00K4Q4J04o6J64k80j74K05K2M9j10n1J75J05j64k00M65
$$ 89 9 39 105 -12 -92 96 -104 -80 4 108 42 206 -74 -248 -43 -21 28 -82 -133 42 147 -17 -217 248
4684B48k90q4m7J6J36M4Q4l7L5Q4k94QJ45M1j38O2n0K2J65k47K95l56J16r8q6
$$ 248 -42 -126 -173 -157 -21 23 107 70 105 189 -105 -97 48 89 -49 13 -37 -15 150 -97 198 -158 -42 -140 -226
4709b26K81O5O7k95K08n5P9j17O2k29m6L30j98M0l7r2J26J40q2N1k63Q1J28np
$$ -226 55 120 187 -108 100 45 124 7 69 -160 -206 124 -74 -34 -71 -163 -37 103 21 72 -191 -110 18 13 6
4734FJ6j7O2k35j56K84k7J0K50k83O9M00m65l5qK60j80J48j1J4j90Q5j42K32k44
$$ 6 22 5 67 -168 -324 -40 -67 -57 193 -90 -21 379 -86 -121 -129 131 -49 99 88 102 -88 -3 -145 87 -157
4759a57J40N6K1r6J77j8o6p8j90M32m69K71J57m54M51j90j58J28J5L53l77J08
$$ -157 -17 39 60 -36 141 123 57 -21 -211 221 -248 23 180 -274 177 -13 -171 -43 -28 325 -52 56
4781E6n8J48k17K87n51K34J82k73J95q2O9q3k10K68Q0j30L95l35p4J03J04p2j41
$$ 56 -2 146 -71 216 -335 -101 81 -192 3 -79 -10 -93 -303 -35 45 -85 310 -25 -99 4 108 36 -105
4804a05K03j50q8O0L07n79M87j14J30M4l97J98nj25K06k13J27K09k65M9K3J86
$$ -105 98 -52 -140 -80 227 -352 135 21 151 195 -202 -4 -9 -134 72 -141 -14 195 -70 -21 2 188
4826A88k29n9l0J33o7M4L70j34l03J36J38j81k10Q7K71k40L2J01j59n1K01n5j3
$$ 188 -41 -100 -130 3 -64 -20 350 216 -87 49 187 6 -204 -117 154 -86 -54 47 -112 -163 38 -17 -30
4849c0qlJ52k17L61m68K09j24K43j92J21j90p8J54K9J55k85MO9J16nj32R3M78
$$ -30 -38 -41 111 -106 255 -213 -4 -128 115 -77 44 -146 -224 -70 -41 114 -171 -167 -98 18 13 -119 -26 452
4873D52m93K86p0j20m6Q9mL14m94J32j97q2L06j83M08k72p2k8N8j21o5M09k54
$$ 452 -41 245 175 55 9 98 94 408 -86 46 -151 -233 73 -110 298 26 -46 -74 -16 -137 -202 207 -47
4896d7K30m54M77j11j68j26K44J59k12J00k99J71o5j3J31J37r0mj70M4R6J2j34
$$ -47 183 -271 206 95 -73 -199 45 204 -8 92 -207 -36 -101 -114 17 154 64 60 -110 -66 30 42 -92
4919i2M42l81J04j73n8J21p9j67QK85KJ30j83m9O9J5k16L77j81J01p7J88r1R7
$$ -92 350 -31 73 -100 -158 -37 -116 -283 -275 10 12 142 -41 -90 -21 -6 -222 155 -26 75 -2 186 95 192
4943A92j51qJ8j38o3J47q8N6k3K08l34J60J72k47R8J73l82RK74n7j74L30M2k72
$$ 192 41 33 51 -87 -150 -3 -91 -35 -58 150 -184 -24 148 -99 -1 172 -210 -201 73 16 -158 172 214 -58
4967e8J41k00J47P1J1L6r1J45j93k08J66Q9J98l50J52k03J45L4J91j77Q3k06J0
$$ -58 83 -117 30 101 112 148 57 202 9 -199 -33 56 254 -96 56 -147 -2 32 223 46 129 -77 -67
4990f7K17l40K59L5k17P2j54J17r8K63J05m5ok78J45k91M33j86K12o1j37r5J83
$$ -67 150 -190 69 104 -113 -41 -195 -78 -176 87 192 147 141 -137 8 -283 150 -36 176 115 -22 -117 66
5013F6q2J0k22L0M6k4m5J49OK06k86J41J12m4J83m66M0J9M30o7l48J45j34R9Q9
$$ 66 -16 -6 -228 -198 -152 -176 -221 -72 -66 140 -146 -5 107 63 246 -220 -180 -161 269 202 -146 -1 -135 -36 53
5038E3j39j65K46K38k87p1K26l27J34J69j77O2j23p0L34Qm6J18j35j68Q3m6k61
$$ 53 -86 -251 -5 233 -54 -125 101 -226 -92 77 -100 -38 -161 -231 103 111 65 183 48 -120 -37 -83 -344
5061c44N07j44n3K28o4j6J07k74K6j55L12l00J29J52j79n2K11k04K3k3J99j78
$$ -344 163 19 -34 194 130 114 221 -53 -27 -182 130 -170 -41 111 -68 -120 91 -113 -90 -113 86 -92
5083i2R1J76j13j50j7K32j04j57J14Q6p6j63R9K5QR4L2j94k9K11J36k32l8P9m6
$$ -92 -1 175 62 -88 -105 127 23 -134 -20 66 -10 -173 -74 -49 -41 53 85 -109 -138 73 209 -23 -61 18 -28
5108b8M4j28J05k1J9J04j42P5k06J08j6J36l08L85K20m77O5J52r5p4K75l4l99
$$ -28 16 -112 -7 -28 -9 95 -47 28 -178 -70 -86 50 -258 127 347 -130 -65 87 -8 -82 193 159 -240
5131b40K42L2j33N9O5q1L88n44K16N5o8r6L79l47L20k91P7J09l58L49qN5k12N8
$$ -240 2 34 -99 -40 25 -56 332 -212 4 59 -9 -105 274 -73 247 -44 33 142 -216 133 125 180 -32 26
5155B6l04L57l2kr5L2J54k66J70J26qj4p8n9k86L24j99J56r4J61l05J31J50j37
$$ 26 -278 79 47 45 -50 -18 136 -130 40 166 158 144 66 7 -279 45 -154 2 -92 69 -236 -105 45 -92
5179i2J71j64J69o3q4L15O2l56m0K64p6j13P1K4l4j76K7J65K2l5J28m7N5k20M1
$$ -92 79 -85 84 21 -63 252 314 -42 -82 182 106 -7 64 88 54 -122 -95 70 92 57 185 138 193 -27 14
5204A4K32k79j66J64j91O1K51l17K22j8L59l56K30j8j5o9k34n7j00L63k10K68
$$ 14 246 -33 -199 -35 -226 -165 86 -231 -9 -27 332 -24 206 188 173 104 -130 -187 -287 76 -134 134
5226A34K6o2k64K31j60p8K33q7j13n9J43J38j82L70j87l6J61k51K69r7l15j5J66
$$ 134 160 98 -166 65 -95 -173 60 -27 -140 -199 -56 82 -100 270 83 47 208 -43 226 129 -186 -201 -35
5249c5J19j28J61o5k1k3K14o58N69k39J77j42J7k6K23J17n20J19K27j21j53J38
$$ -35 84 -44 117 52 31 8 222 -436 133 -106 71 -71 -54 -80 143 260 -260 -141 86 -35 -188 -50
5271e0J35K89j47k14Q6K22l13j62K60m59K29J66k40J44P5L7L9J28j94l13K62M3
$$ -50 85 374 227 13 99 321 8 -154 106 -353 -124 42 -198 -54 21 58 97 225 31 -282 -20 23
5293B3R7Q2m20K54j8j93M43j63l6k0L9j66L37k73N2l2N1KM1N5l03K01%j76r6N00
$$ 23 120 202 -218 36 18 -175 268 105 69 49 88 -78 259 -14 38 6 57 59 100 155 -148 53 53 -123 -219 281
5319B81j61j19m0J04j00J80L0m5M3j43j22R1K2R5k49L9J76Q5k7p6k94J61L3M8
$$ 281 120 1 -39 65 -35 145 175 130 173 30 -92 -1 21 116 -133 -94 82 167 140 64 -230 -69 -36 12
5343A2J30k15P5Q0k86R0J86q6J76j54j46NO4MJ71j88K39p0m65L06n0M15l68MK91
$$ 12 142 -73 2 82 -204 -114 72 -14 162 8 -138 -133 -69 -65 106 -82 157 87 -378 -72 -122 293 -75 -71 220
5368B20l91K43j28l2J57q8k3K2Q6m2M5l5N8j92K14k00K06o4o6o1J06q3m2J18J20
$$ 220 -171 72 -56 -88 69 -19 -42 -20 66 24 69 34 92 -100 114 -86 120 56 -10 -71 35 -48 -90 28 148
5393A48j17J8R5K84k00p4r8j55K66n38M57j0k56J29N3O5O7kk42J72J77m99K54
$$ 148 31 49 144 428 228 154 56 -99 167 -371 86 76 -180 -51 2 67 134 132 -110 62 239 -260 -6
5416fL4j15J23l4J41J2k82O4n2K49J37P9m62J77n6k24K88P3p8j94J93l17K24L9
$$ -6 28 -87 36 2 143 155 -127 -63 -115 134 271 350 -112 65 9 -215 73 146 68 -126 67 -250 -26 13
5440A3l8J11j0N9o5M1j18q6K9%L9J87k15L69k70k5j96L71j11J2j14j9k12J10j24
$$ 13 -25 86 76 135 70 111 -7 -93 -64 -64 -25 162 -53 316 46 21 -175 196 85 97 -17 -36 -248 -138 -262
5465b62J24J18J50n0q3M7kj42J37l61J49J19j35L55n7K08j43l10N0J06j13mK50
$$ -262 -138 -20 130 80 -3 44 42 -100 37 -324 -175 -56 -191 164 107 315 172 -138 -88 18 -95 -99 151
5488A51j35M2l8LK70j80j00Oj64j34M45j92k04K50p3Qr7J38%j28P1J76oj22k85
$$ 151 16 58 20 23 293 113 13 19 -145 -279 166 -26 -230 20 -53 -45 -142 -4 -4 -132 -61 115 109 -13 -298
5513b98N75l17j42M1K5K2J18l5j64K45J20Nk36j68K26q1L20j7l30K03L1K14l31
$$ -298 277 -40 -182 -141 -116 -94 24 -11 -175 70 190 195 -41 -209 17 -64 256 239 -91 112 143 357 26
5536B6K0m5O2j72o5L14k86M04l01q4O7K94m36M16R3m45p6J64L16k41P7l3l66K61
$$ 26 46 1 63 -109 -174 140 -146 258 -43 -127 -60 234 -202 214 307 -138 -214 -50 266 25 102 69 -297 -36
5560c6R8o9J53J06k18k7O2q6L4l4j35K18j56J82j05M3l28L74r6J6k23M55Pl17
$$ -36 62 -7 146 252 34 7 69 -17 17 -17 -152 66 -90 92 -13 30 -298 76 -20 -4 -227 228 235 -82
5584h2L40m17omK06J30l06R7n9j37J73J18%j78j10J13m4N8Q9l1J87j63O0Qk17
$$ -82 258 -159 -165 -169 37 167 -139 -42 -101 -238 -65 53 53 -125 -235 -122 -166 -108 -19 -50 137 -26 34 42 -175
5609a75L76M7k45J85j96Q6p7J25k28K74M4l26M22j64J03k94J23j87l2Q7J05k85
$$ -175 201 248 3 188 -8 78 1 126 -102 172 216 -110 312 148 251 -43 80 -107 -139 -52 53 -232
5631b32L5L11Lj59J88l6j92j50K47J40j9n3jl15k6L01j12L6j25K60j35k2P8k8
$$ -232 -197 114 117 -42 146 110 -82 -232 15 155 136 83 82 -233 -259 42 -70 -34 -159 101 -34 -56 22 -6
5655fj68n8J59m4K21j31m9j40K25k52K70k11L56k00j23L22M4k87o0J59k53K23
$$ -6 -174 -232 -73 -117 104 -27 -76 -216 9 -243 27 -184 172 -28 -151 171 215 -72 -132 27 -226 -3
5677cj46J51M8J45m60K51k38K19r4J13O2k0L6k38L88o6k94K27p9r8K51Ln86M97
$$ -3 -149 2 50 195 -265 -14 -252 -33 -127 -14 48 28 64 -174 214 148 -146 81 2 -96 155 158 -428 69
5701F9pr9o7K50j86P5k6Q7q2L9O6O6k87j10J49n2J56J58n8j36l14L87j06l2K93
$$ 69 62 -37 -104 146 -40 35 9 96 14 53 119 185 -102 -212 -63 -115 41 199 141 5 -309 78 -28 -60 233
5726B33l23J6J47K21k56p4K11k74l0K04n4p8j45J33O7o6j04J74K6n3j01j99L53
$$ 233 -90 -74 73 294 38 -36 175 -99 -129 75 21 -57 -202 -69 -2 -68 -172 2 28 -25 -126 -325 28
5749B8M5k38J83j05j68M29l25N03m15K19k23q8J30l8n5j7K07N6l06M38l14l5L27
$$ 28 73 -165 18 -87 -255 174 -151 352 -63 156 -67 -155 -25 -63 -118 -135 72 128 -178 260 -54 -89 238
5772B38m48J10J34J00O0m3l31K74k00K20L1Rl16K25J4k22O7K76j70o2K0j49J93
$$ 238 -210 -100 34 134 194 151 -180 94 -106 114 145 154 -162 63 77 -145 -78 198 28 -34 -14 -163 30
5795C0j38k02K80L8l39K21N19l91J08nm0M4j09l9P0J29k54o9R0j74J59r4J60q7
$$ 30 -108 -310 -30 8 -331 -110 409 18 126 121 81 125 16 -23 47 176 -78 -147 -57 -231 -72 -166 -6 -93
5819i3K03P7j37k10L06k85J32j62L23l3m8P8l06o7J02K13j9%o1j34k4K17N9l67
$$ -93 110 187 50 -160 146 -139 -7 -169 154 121 73 151 -155 -222 -120 93 74 74 13 -121 -145 72 131 -236
5843b36L24p8k37J11J55j63K27k27O7K71l16J84l77J64j8M08k96j39L86l4rl02
$$ -236 88 10 -227 -116 39 -124 103 -124 -57 214 -102 82 -295 -131 -149 259 -37 -176 210 176 167 -135
5865a35M2J11j8K39k01N3j71J3K25k11k33K09j39J50J81r7O7j25P3L4k34J8M7
$$ -135 -93 18 0 239 38 91 -80 -67 158 -53 -286 -77 -216 -66 115 18 85 -40 33 67 -167 -149 -102
5888a02K34j40J45j35k67j55L26J94k26q8L07K1J70j8m12M34n09L75J30l26m5
$$ -102 132 -8 137 2 -265 -420 -94 100 -126 -214 93 114 284 266 -146 288 -221 154 284 -42 -87
5909h7L6L02k63J34j05L2j21L54o5o2k15kK47m2k30Q7R6l46N71l70j1K49p2j31
$$ -87 -51 251 -12 122 17 49 -72 282 217 155 -60 -62 185 143 -87 0 96 -250 321 -49 -60 189 117 -14
5933a4R6j39jK19j90n5M79l76J73Kl36qJ31L85o0j72k02O5r2k8Q9m5K54l4q3J39
$$ -14 82 -57 -58 161 -29 -84 395 19 192 194 -142 -150 -19 366 306 134 -68 -3 -95 -123 -34 -79 175 141 58 197
5959A97l96Q6O6M8j6j22L90k22j71J41j43R9q8K34j03Q4K5p6Q0j69K43k26L7J01
$$ 197 -199 -113 -47 1 -15 -137 253 31 -140 1 -142 -43 -131 103 0 84 109 33 113 -56 187 -39 -2 99
5983I9o6lJ52j93J14k76P6KJ24k40J08J6O4J91m34L16J16m15L33q1r6K72p4k3
$$ 99 33 30 182 -11 103 -173 -97 -95 29 -211 -103 -87 -23 168 -266 50 166 -249 84 3 -93 179 105 82
6007H2l3k97L23o0J14k26K30q2R3l00J40J25j43N5L6P7J6l9q4J67j18k76J34L83
$$ 82 49 -248 75 15 129 -97 133 51 144 -156 -16 109 -34 21 57 134 150 111 27 194 76 -200 -66 317
6031C17q8k22j78nL7J00P6k93J08l7L54M2m10L84j3j20j4j44J44j24p5L41J93
$$ 317 229 7 -171 -176 -139 -39 37 -256 -148 -185 169 211 -199 185 172 52 38 -106 38 -86 -161 180 373
6054C73n08K99j15m8q9K07p2k9p0J4K68m4r2l45L80k25r4N50l81q2M5J34rK13
$$ 373 -135 164 49 1 -88 119 47 18 -52 -38 230 186 94 -251 129 -96 -190 360 -21 -103 -58 76 67 280
6078B80l52J04k30M67k81J50k7j01J3l0K7J4l0l93N94n2l87K36r9J20J34p6J00
$$ 280 -72 32 -198 269 -12 138 111 10 23 -7 20 34 4 -389 205 153 -234 2 -97 23 157 81 181
6101A81j85K2L9J05o0j45J88m1N1m39J00J07L16j17k62o2J59Q9j7R0K60n80J83
$$ 181 -4 18 57 162 102 -43 145 104 155 -284 -184 -77 239 122 -140 -202 -43 46 29 119 379 -201 -18
6124a8K35m91J76Q0J27R5j92J25l99K63q8p6L1J5K2J15j37Q6M2j38K75PM0j23
$$ -18 217 -274 -98 -18 109 204 12 137 -262 1 -87 -163 -132 -117 -95 20 -117 -31 11 -127 148 155 195 72
6148G2n2j50Q3J17k08L19l55Q4J52j18l8J57Nr6Q4M7q2N5k63p8K13j71J18K76
$$ 72 20 -130 -47 70 -138 181 -174 -90 62 -56 -94 63 68 -28 56 103 21 76 -187 -265 -52 -223 -105 171
6172A71k85k4K97R2j39k66J2J24Q4J36k0m6M2k11J91q3L1k51J01J65l03N3K55
$$ 171 -114 -138 159 251 112 -154 -142 -18 66 202 182 136 178 -33 158 75 106 -145 -44 121 -182 -129 126
$$ [...]
8191E1
##END NTUPLES=NMR FID
##END=
