##TITLE=1H_Pr MPTP
 CDCl3
 8 sc, 
 17.3.2023
##JCAMPDX= 6.0         $$ Bruker NMR JCAMP-DX V2.0
##DATA TYPE= NMR FID
##DATA CLASS= NTUPLES
##ORIGIN= UXNMR, Bruker Analytische Messtechnik GmbH
##OWNER= root
$$ XWIN-NMR		Version 3.5
$$ Mon Mar 20 15:00:17 2023 Russian Standard Time (UT+4h)  she@DPX200
##.OBSERVE FREQUENCY= 200.13135
##.OBSERVE NUCLEUS= ^1H
##.DELAY= (6, 6)
##.ACQUISITION MODE= SIMULTANEOUS
##.ACQUISITION SCHEME= undefined
##.AVERAGES= 8
##.DIGITISER RES= 18
##SPECTROMETER/DATA SYSTEM= spect
##.PULSE SEQUENCE= zg30
##.SOLVENT NAME= CDCl3
##.SHIFT REFERENCE= (INTERNAL, CDCl3, 0, 15.7039)
##AUDIT TRAIL= $$ (NUMBER, WHEN, WHO, WHERE, WHAT)
$$ ##TITLE= Audit trail, XWIN-NMR		Version 3.5
$$ ##JCAMPDX= 5.01
$$ ##ORIGIN= Bruker BioSpin GmbH
$$ ##OWNER= she
$$ F:/spectra/data/she/nmr/H-F/1/audita.txt
$$ ##AUDIT TRAIL=  $$ (NUMBER, WHEN, WHO, WHERE, WHAT)
(   1,<2023-03-20 14:58:51.71 +0400>,<she>,<DPX200>,
      <created by zg, POWCHK disabled, PULCHK disabled
       configuration hash MD5:
       00 E9 B6 7A A2 85 ED C7 34 08 36 98 17 FE 4E 26
       data hash MD5: 16K
       77 9A 8D 06 0D 69 45 F6 CA D9 62 7A 2F E5 0F DB>)
$$ ##END=
$$ 
$$ hash MD5
$$ 37 98 1B B7 A3 5C 25 7A 0E B1 55 EE 26 24 6C 5B
##$RELAX= 
##$RELAX= 
##$RELAX= 
##$RELAX= 
##$RELAX= 
##$RELAX= 
$$ Bruker specific parameters
$$ --------------------------
##$DU= <F:/spectra>
##$EXPNO= 1
##$NAME= <H-F>
##$PROCNO= 1
##$TYPE= <nmr>
##$USER= <she>
##$AMP= (0..31)
100 100 100 100 100 100 100 100 100 100 100 100 100 100 100 100 100 100 
100 100 100 100 100 100 100 100 100 100 100 100 100 100 
##$AQSEQ= 0
##$AQ_mod= 1
##$AUNM= <au_zg>
##$AUTOPOS= <>
##$BF1= 200.13
##$BF2= 200.13
##$BF3= 200.13
##$BF4= 200.13
##$BF5= 200.13
##$BF6= 200.13
##$BF7= 200.13
##$BF8= 200.13
##$BYTORDA= 1
##$CFDGTYP= 0
##$CFRGTYP= 5
##$CHEMSTR= <none>
##$CNST= (0..31)
1 1 145 1 1 1 1 1 1 1 1 1 1 1 1 1 1 1 1 1 1 1 1 1 1 1 1 1 1 1 1 1 
##$CPDPRG= <>
##$CPDPRG1= <>
##$CPDPRG2= <>
##$CPDPRG3= <>
##$CPDPRG4= <mlev>
##$CPDPRG5= <mlev>
##$CPDPRG6= <mlev>
##$CPDPRG7= <mlev>
##$CPDPRG8= <mlev>
##$CPDPRGB= <>
##$CPDPRGT= <>
##$D= (0..31)
0 1.2 0 0 0 0 0 0 0 0.06 0 0.03 0 0 0 0 0.0002 0 0 0 0 0 0 0 0 0 0 0 0 
0 0 0 
##$DATE= 1679309931
##$DBL= (0..7)
120 120 120 120 120 120 120 120 
##$DBP= (0..7)
150 150 150 150 150 150 150 150 
##$DBP07= 0
##$DBPNAM0= <>
##$DBPNAM1= <>
##$DBPNAM2= <>
##$DBPNAM3= <>
##$DBPNAM4= <>
##$DBPNAM5= <>
##$DBPNAM6= <>
##$DBPNAM7= <>
##$DBPOAL= (0..7)
0.5 0.5 0.5 0.5 0.5 0.5 0.5 0.5 
##$DBPOFFS= (0..7)
0 0 0 0 0 0 0 0 
##$DE= 6
##$DECBNUC= <off>
##$DECIM= 32
##$DECNUC= <off>
##$DECSTAT= 4
##$DIGMOD= 1
##$DIGTYP= 9
##$DL= (0..7)
0 120 120 120 120 120 120 120 
##$DP= (0..7)
150 150 150 150 150 150 150 150 
##$DP07= 0
##$DPNAME0= <>
##$DPNAME1= <>
##$DPNAME2= <>
##$DPNAME3= <>
##$DPNAME4= <>
##$DPNAME5= <>
##$DPNAME6= <>
##$DPNAME7= <>
##$DPOAL= (0..7)
0.5 0.5 0.5 0.5 0.5 0.5 0.5 0.5 
##$DPOFFS= (0..7)
0 0 0 0 0 0 0 0 
##$DQDMODE= 0
##$DR= 18
##$DS= 0
##$DSLIST= <SSSSSSSSSSSSSSS>
$$ [...]
##$SUBNAM2= <"">
##$SUBNAM3= <"">
##$SUBNAM4= <"">
##$SUBNAM5= <"">
##$SUBNAM6= <"">
##$SUBNAM7= <"">
##$SUBNAM8= <"">
##$SUBNAM9= <"">
##$SW= 18.05172834244
##$SWIBOX= (0..15)
0 0 2 0 0 0 0 0 0 0 0 0 0 0 0 0 
##$SW_h= 3612.71676300578
##$TD= 16384
##$TD0= 1
##$TE= 0
##$TE2= 300
##$TE3= 300
##$TEG= 300
##$TL= (0..7)
0 120 120 120 120 120 120 120 
##$TP= (0..7)
150 150 150 150 150 150 150 150 
##$TP07= 0
##$TPNAME0= <>
##$TPNAME1= <>
##$TPNAME2= <>
##$TPNAME3= <>
##$TPNAME4= <>
##$TPNAME5= <>
##$TPNAME6= <>
##$TPNAME7= <>
##$TPOAL= (0..7)
0.5 0.5 0.5 0.5 0.5 0.5 0.5 0.5 
##$TPOFFS= (0..7)
0 0 0 0 0 0 0 0 
##$TUNHIN= 0
##$TUNHOUT= 0
##$TUNXOUT= 0
##$USERA1= <user>
##$USERA2= <user>
##$USERA3= <user>
##$USERA4= <user>
##$USERA5= <user>
##$V9= 5
##$VALIST= <valist>
##$VCLIST= <CCCCCCCCCCCCCCC>
##$VD= 0
##$VDLIST= <DDDDDDDDDDDDDDD>
##$VPLIST= <PPPPPPPPPPPPPPP>
##$VTLIST= <TTTTTTTTTTTTTTT>
##$WBST= 1024
##$WBSW= 4
##$XGAIN= (0..3)
0 0 0 0 
##$XL= 0
##$YL= 0
##$YMAX_a= 138362
##$YMIN_a= -134517
##$ZGOPTNS= <>
##$ZL1= 120
##$ZL2= 120
##$ZL3= 120
##$ZL4= 120
##$ABSF1= 10
##$ABSF2= 0
##$ABSG= 5
##$ABSL= 3
##$ALPHA= 0
##$AQORDER= 0
##$ASSFAC= 0
##$ASSFACI= 0
##$ASSFACX= 0
##$ASSWID= 0
##$AUNMP= <proc_1d>
##$AZFE= 0.1
##$AZFW= 0.1
##$BCFW= 1
##$BC_mod= 2
##$BYTORDP= 1
##$COROFFS= 0
##$CY= 11.3945322036743
##$DATMOD= 1
##$DC= 2
##$DFILT= <>
##$DTYPP= 0
##$F1P= 2.36226072786647
##$F2P= -0.459571619588291
##$FCOR= 0.5
##$FTSIZE= 0
##$FT_mod= 4
##$GAMMA= 1
##$GB= 0.15
##$INTBC= 1
##$INTSCL= 1
##$ISEN= 128
##$LB= 0.24
##$LEV0= 0
##$LPBIN= 0
##$MAXI= 10000
##$MC2= 0
##$MEAN= 0
##$ME_mod= 0
##$MI= 1.114404
##$NCOEF= 0
##$NC_proc= 0
##$NLEV= 6
##$NOISF1= 3.799351
##$NOISF2= 2.8
##$NSP= 1
##$NTH_PI= 0
##$NZP= 0
##$OFFSET= 15.70392
##$PC= 1
##$PHC0= -19103.94
##$PHC1= 7.800751
##$PH_mod= 1
##$PKNL= yes
##$PPARMOD= 0
##$PSCAL= 0
##$PSIGN= 0
##$REVERSE= no
##$SF= 200.130013532006
##$SI= 16384
##$SIGF1= 3
##$SIGF2= 2
##$SINO= 400
##$SIOLD= 16384
##$SREGLST= <1H.CDCl3>
##$SSB= 0
##$STSI= 0
##$STSR= 0
##$SW_p= 3612.71676300578
##$SYMM= 0
##$S_DEV= 0
##$TDeff= 0
##$TDoff= 0
##$TI= <>
##$TILT= no
##$TM1= 0
##$TM2= 0
##$TOPLEV= 0
##$USERP1= <user>
##$USERP2= <user>
##$USERP3= <user>
##$USERP4= <user>
##$USERP5= <user>
##$WDW= 1
##$XDIM= 8192
##$YMAX_p= 0
##$YMIN_p= 0
$$ End of Bruker specific parameters
$$ ---------------------------------
##NTUPLES= NMR FID
##VAR_NAME=  TIME,          FID/REAL,        FID/IMAG
##SYMBOL=    X,             R,               I
##VAR_TYPE=  INDEPENDENT,   DEPENDENT,       DEPENDENT
##VAR_FORM=  AFFN,          ASDF,            ASDF
##VAR_DIM=   8192,          8192,            8192
##UNITS=     SECONDS,       ARBITRARY UNITS, ARBITRARY UNITS
##FACTOR=    0.0002768,     1,               1
##FIRST=     0,             0,               0
##LAST=      2.2672688,     0,               0
##MIN=       0,             -134517,         0
##MAX=       2.2672688,     138362,          0
$$ Real data points
##PAGE= N=1
##DATA TABLE= (X++(R..R)), XYDATA
0 0 0 0 0 0 0 0 0 0 0 0 0 0 0 8 -8 8 -8 16 -16 16 -24 24 -32 40 -40 48 -56 69 -80 88 -104 119 -135 152 -172
35 -172 192 -216 243 -270 301 -337 373 -413 459 -507 561 -618 682 -753 829 -913 1006 -1109
53 -1109 1226 -1352 1497 -1664 1851 -2072 2332 -2642 3024 -3506 4134 -4994 6245 -8244 11977
68 11977 -21374 101268 119418 -45282 -2662 88250 138362 50327 -38183 -53019 4244 7401
80 7401 -45837 -91962 -64361 -33896 -52100 -101456 -94041 -32972 11775 -17871 -55474 -32319 38515
93 38515 67342 37499 12500 44996 88146 78953 28239 13888 57700 88221 39607 -39299
105 -39299 -52469 8687 45493 -7102 -91465 -103306 -36660 10902 -22813 -79579 -77528 -22571
117 -22571 13293 -2338 -26021 -7713 33930 43438 17242 9688 42498 70318 49427 9885
129 9885 6768 38547 51276 16169 -23300 -18389 10105 7428 -31682 -56209 -33543 -1179 -10617
142 -10617 -51924 -63873 -21877 20490 8008 -34554 -38334 8020 47429 34249 -2191 -4518
154 -4518 30154 53307 34958 6791 9302 30883 31138 4290 -14743 -2651 14903 -37 -33271
167 -33271 -40396 -14690 1519 -18936 -45570 -38398 -6557 7512 -12648 -30291 -11531 23079
179 23079 28788 3294 -9535 15215 46794 41603 8147 -5270 19089 42136 26540 -8684
191 -8684 -18295 1866 13330 -5630 -31548 -31294 -11830 -6768 -25468 -39362 -24352 -112 -331
204 -331 -19294 -22142 4096 28001 20280 -774 2139 29641 43461 25515 2823 7299 28690
217 28690 31075 4492 -18747 -10773 9955 4652 -25043 -40868 -24332 -2882 -9504 -33607 -37185
230 -37185 -12699 7618 141 -15990 -8997 16528 29240 16900 3721 13919 35762 36344 13699
243 13699 -64 12582 27666 15894 -11652 -21637 -6375 4341 -11268 -35357 -35292 -14052 -3806
256 -3806 -18350 -33884 -22693 3298 11957 -3429 -12662 4998 30012 29926 10078 3571 21189
269 21189 36573 25932 2545 -2124 13054 19132 1115 -20995 -19558 -3057 -1015 -20668 -35831
282 -35831 -24289 -3291 -3708 -21720 -26613 -6242 13892 9785 -6456 -4704 16460 30521 19765
295 19765 2745 5921 24530 29382 10813 -6878 -1300 14786 12035 -10630 -23712 -12393 2312
308 2312 -4644 -24647 -27959 -11153 2372 -5475 -20639 -16685 4953 15291 3663 -8593 744
321 744 21170 24849 7598 -3407 8801 24644 19152 -1797 -9051 4248 14344 3616 -15796
334 -15796 -17840 -2709 4929 -7963 -23790 -18683 -179 4788 -9482 -19523 -7598 10770 11198
347 11198 -4062 -8864 5797 20619 14730 -1446 -3082 11815 21099 9732 -6851 -5893 9945
360 9945 13352 -3060 -16727 -9772 5535 3931 -12633 -20857 -8549 5489 1157 -13980 -15883
373 -15883 -15 11992 4577 -8749 -6669 10959 18725 6530 -6207 885 16478 17179 1261
386 1261 -8452 628 13002 8213 -8711 -14401 -2921 6609 -1386 -16320 -16418 -2040 6192 -3954
400 -3954 -16020 -10025 6707 11017 -1834 -9287 819 15423 14613 1012 -4849 6811 17664
413 17664 11375 -4249 -7368 5225 11759 839 -13905 -11935 1893 5187 -8492 -18564 -10721
426 -10721 3433 3640 -8772 -13975 -2534 10920 8301 -4045 -5735 7955 17942 10133 -2761
439 -2761 -1598 11855 16431 3806 -8709 -4168 7782 7163 -7080 -15754 -7748 2905 191 -13152
453 -13152 -17152 -4913 5461 357 -11184 -9422 5109 12972 4500 -5280 304 14199 16764 4678
467 4678 -3271 3662 14309 11583 -2694 -9009 -532 8104 1514 -12973 -15171 -3378 3318 -5761
481 -5761 -16786 -13071 885 5402 -4236 -11529 -3325 9858 10997 629 -4060 5750 16350 12992
495 12992 513 -2268 8094 14603 5725 -6823 -6630 3954 6231 -4711 -14627 -10450 322 686
509 686 -10472 -16309 -7182 3963 2086 -7999 -10074 2105 11840 7045 -3388 -1493 11122 16290
523 16290 7115 -2535 1510 11590 12355 482 -7871 -2446 6612 3742 -8943 -13938 -5657 2637
537 2637 -2574 -13491 -13726 -1995 4897 -1894 -10105 -5783 6629 10341 2176 -4309 2212 12828
551 12828 13128 2494 -3018 4746 13233 8224 -3934 -7246 1987 7227 -1021 -12013 -10459 -959
565 -959 2584 -5978 -13897 -8722 1868 3516 -5231 -9736 -1317 9196 7677 -2064 -3620 6362 13527
580 13527 8209 -1978 -1450 8060 11563 2738 -6342 -3930 4800 5333 -4823 -11704 -6470 2666 839
595 839 -9263 -12312 -3305 4821 1131 -7506 -6823 3268 9455 3674 -3948 -924 8926 11755 2980
610 2980 -3856 739 9473 8182 -2344 -7538 -746 6050 1370 -8726 -9891 -1463 3799 -2240 -10521
625 -10521 -8316 1514 5187 -1451 -7565 -2561 7268 8721 244 -4297 2593 10907 8362 -1598 -3716
640 -3716 3710 8793 2965 -6021 -5920 1559 4594 -2439 -10047 -7362 1375 2753 -4912 -9851 -3770
655 -3770 4989 4156 -3821 -5915 2359 9337 5928 -2012 -2093 6036 10255 4279 -3917 -2507 5730 6997
671 6997 -1255 -8082 -4214 3543 2035 -6715 -10204 -3787 3352 58 -7594 -7780 735 6021 1892
686 1892 -4729 -2672 6378 9339 3223 -3016 929 8955 8724 285 -4390 503 6722 3514 -5413
701 -5413 -7616 -1684 2908 -1729 -8949 -8761 -1113 2597 -2523 -8221 -5012 3769 5797 -605 -4390
716 -4390 1076 8527 7763 24 -1953 4414 9506 5642 -2359 -3075 2957 6054 34 -7494 -6083 898
732 898 2228 -4969 -10172 -5609 1553 1318 -5301 -7741 -1034 5536 3561 -2843 -3015 4094 8858 5180
748 5180 -1302 -355 6770 8718 2343 -3668 -1128 5237 4438 -3245 -7245 -2739 2507 -177 -6710 -8583
764 -8583 -2347 2422 -1021 -6864 -5950 1932 5458 476 -4412 -1028 6403 7572 1195 -2480 2244
779 2244 7991 6323 -752 -2865 1940 6047 2419 -4729 -5263 496 3011 -2096 -7673 -5887 748
794 748 1914 -3550 -7262 -2906 3594 3095 -2363 -4130 1372 6544 4695 -1428 -2351 4149 7629 3372
810 3372 -2752 -2049 4326 5524 -437 -5320 -2600 2888 2448 -4076 -6774 -2761 2260 827 -5153 -6463
826 -6463 -175 4188 1228 -4379 -3198 3290 6185 1328 -2904 -353 5526 6014 407 -3415 498
841 498 5047 3609 -2516 -4838 -301 3691 663 -5228 -5442 408 2819 -1392 -5679 -3855 2300 3321
857 3321 -1117 -4139 -595 4525 4575 -1030 -3003 1425 5822 3569 -2102 -2924 1965 5162 759 -4516
873 -4516 -3324 2029 3123 -1847 -5588 -2995 2236 2184 -2770 -5181 -822 3626 2550 -2505 -3472 1985
889 1985 5426 2366 -2738 -1885 3595 5196 702 -3355 -1596 3133 3412 -1443 -4902 -1853 2595 1561
905 1561 -3568 -5169 -624 3317 837 -3797 -3524 1944 4319 794 -2964 -1134 3652 4727 257
920 257 -2727 -79 4664 3333 -1847 -3965 130 3601 1249 -3915 -4325 33 2760 -532 -4876 -3335
936 -3335 1558 2903 -860 -4089 -1145 3516 3861 -673 -3177 1115 4992 3596 -1568 -2373 1790 4578
952 4578 1559 -2904 -2286 1587 3081 -821 -4533 -2824 1651 1981 -2636 -5048 -1792 2844 1609 -2927
968 -2927 -3937 588 4138 1702 -2154 -1444 2614 4983 1573 -2301 -741 3277 4321 -139 -3155
983 -3155 -811 3058 2241 -2413 -4268 -565 2506 441 -3973 -3944 109 2379 -414 -3833 -2547 1901
999 1901 3118 -258 -2837 -418 3757 3573 -242 -2014 1107 4605 2936 -1395 -2106 1389 3694 774
1015 774 -3174 -2553 941 2119 -1227 -4599 -2818 1301 1524 -2276 -4588 -1081 2985 1702 -1830 -2525
1031 -2525 1161 4175 2031 -1407 -959 2803 4379 1276 -1917 -1093 2959 3195 -816 -3678 -1140 2435
1047 2435 1462 -2859 -4207 -786 2039 -70 -3336 -3218 451 2630 274 -2687 -1414 2583 3413 328
1063 328 -2097 60 3652 3258 -429 -2131 687 3403 1393 -2145 -2824 549 2130 48 -3666 -2669
1079 -2669 955 2040 -830 -3699 -1795 2076 2496 -1073 -2586 -163 3331 2378 -1125 -1661 1412 3457
1095 3457 1454 -1754 -1691 1531 2764 54 -2987 -1885 1652 1758 -1535 -3271 -1166 2091 1379 -1738
1111 -1738 -2840 141 2910 1315 -1932 -1844 1411 3503 992 -2435 -1025 2193 2814 -409 -2681 -1022
1127 -1022 2248 1690 -1956 -2935 -462 2227 649 -2477 -2654 581 2571 381 -2254 -1579 1905 3133
1143 3133 156 -2102 -278 2519 2382 -929 -2184 279 2386 1242 -1974 -2233 50 1900 221
1158 221 -2735 -2653 720 1939 -578 -2828 -1501 1866 2104 -533 -2252 -292 2809 1847 -598 -1752
1174 -1752 1215 3242 1598 -1676 -1580 1409 2578 -35 -2774 -1769 1392 1423 -1409 -3162 -1540 1394
1190 1394 1212 -1836 -2832 -317 2061 1227 -1722 -1480 1502 3301 1175 -1462 -549 2673 2937 555
1206 555 -1628 -459 2483 1927 -1094 -2594 -484 1670 490 -2206 -2916 -431 1620 -97 -2967 -2005
1222 -2005 1115 2054 -208 -2222 -655 2214 2474 -166 -1477 513 2842 2233 -650 -1446 809 2938
1238 2938 1000 -2024 -1901 825 1719 -442 -2594 -1766 610 1048 -1625 -2793 -1196 1477 1303 -1260
1254 -1260 -2110 137 2632 1479 -1268 -1134 1636 2908 935 -1414 -631 1813 2324 -72 -1924 -894
1270 -894 1379 1485 -1546 -2649 -840 1351 891 -2320 -2404 168 1728 -9 -1857 -1432 1400 2074 213
1287 213 -1408 -570 1944 2290 -163 -1435 266 2172 1528 -933 -1815 585 2003 200 -2017 -1865
1303 -1865 951 1489 -439 -2103 -1379 1202 1445 -627 -2041 -690 1698 1414 -1065 -1593 433 2198
1319 2198 1233 -1374 -1413 983 1850 183 -1642 -1244 1259 1465 -641 -2151 -695 1295 1420 -948 -1817
1336 -1817 -108 2000 1037 -1502 -1779 892 1842 402 -1625 -1355 1084 1368 -83 -1805 -792 1428
1352 1428 1325 -759 -1827 -206 1653 1159 -1077 -1578 580 1858 670 -1538 -1059 1411 1873 -79
1368 -79 -1550 -435 1311 1531 -595 -1950 -431 1273 969 -1507 -1826 30 1817 388 -1528 -1340
1384 -1340 673 1480 222 -1467 -605 1300 1882 -307 -1379 -177 1612 1620 -714 -1259 5 1428 740
1401 740 -1044 -1619 483 1415 199 -1872 -1032 713 1218 -389 -1638 -884 1203 1474 -708 -1683 -70
1418 -70 1677 852 -800 -1203 629 1907 384 -1004 -844 823 1634 -6 -1542 -903 960 1131 -759
1435 -759 -1677 -477 1249 886 -1100 -1457 290 1588 496 -1346 -1231 575 1584 361 -1507 -529
1451 -529 1267 1435 -119 -1693 -556 1664 950 -932 -1265 -185 1296 732 -1336 -1206 587 1463 133
1468 133 -1426 -936 976 1583 -310 -1506 -438 1128 1159 -983 -1368 91 1311 598 -963 -1048 215
1485 215 1202 294 -1297 -845 920 1357 -28 -1324 -600 1369 1350 -487 -1183 58 1283 889 -699
1502 -699 -1082 489 1344 405 -1232 -1172 659 1131 -293 -1539 -936 908 1011 -635 -1363 -35 1106
1519 1106 750 -872 -1158 442 1616 973 -658 -845 817 1608 184 -1025 -717 841 1088 -178 -1526
1536 -1526 -425 964 850 -928 -1628 -308 913 303 -1515 -1299 270 1085 211 -1201 -540 1030 1484
1553 1484 433 -963 -205 1417 1328 -16 -780 180 1084 998 -861 -1433 94 943 19 -1375 -1383 36
1571 36 783 -470 -1380 -807 497 698 -459 -962 -174 1395 1219 -520 -713 585 1648 875 -757 -690
1589 -690 667 1641 263 -1036 -763 541 529 -749 -1640 -499 655 319 -896 -1432 -452 936 759
1606 759 -657 -890 583 1200 503 -1100 -584 1243 1659 278 -920 130 1109 836 -470 -1073 -225
1623 -225 722 527 -1092 -1209 -256 975 21 -1254 -1048 391 1214 -66 -1006 -507 866 1157 -105 -929
1641 -929 384 1203 838 -486 -821 423 1053 216 -785 -951 624 1019 170 -1261 -905 829 743 -334
1659 -334 -1015 -429 913 824 -400 -711 -39 1225 864 -431 -640 550 1208 245 -1016 -540 383 840
1677 840 109 -942 -876 754 571 -518 -1275 -269 896 684 -563 -777 363 1379 445 -742 -626
1694 -626 743 1274 126 -655 -341 587 837 -337 -997 -193 739 364 -633 -1066 28 953 259 -998
1712 -998 -971 480 995 150 -685 -354 983 907 119 -354 -78 1131 723 -382 -661 360 973 624 -870
1731 -870 -820 176 750 -87 -1060 -628 -98 572 -517 -1068 -439 440 531 -429 -845 189 1018 626 -421 -546
1751 -546 617 1178 314 -435 -112 433 806 -247 -894 -449 416 446 -646 -1094 -406 698 -126 -1065 -928
1770 -928 21 731 338 -627 -539 696 1141 186 -646 -102 1016 1362 21 -411 228 1002 924 -469 -858
1789 -858 -196 725 -34 -870 -881 72 337 -146 -1266 -950 275 422 -221 -944 -250 883 665 -312 -419
1808 -419 401 1037 444 -376 -407 730 947 596 -415 -349 590 724 -376 -1017 -626 427 344 -603 -989 -288
1828 -288 612 165 -611 -864 -139 727 8 -522 -396 779 1041 549 -373 -125 622 796 -175 -667 -111 824
1848 824 468 -730 -897 -388 286 -42 -618 -868 72 352 -217 -790 -568 459 442 -263 -865 -126 807 780
1868 780 -205 -347 324 781 177 -390 -740 82 555 -95 -689 -473 380 311 -468 -1074 -484 551 530 -601
1888 -601 -721 -167 974 379 -431 -453 87 787 485 -443 -202 431 735 250 -567 -437 692 471 -276 -695
1908 -695 -402 580 478 -509 -807 95 527 243 -585 -319 330 463 67 -306 -155 471 656 -218 -742 -201
1928 -201 583 519 -297 -554 -249 654 18 -544 -606 -144 460 -49 -848 -304 491 624 -168 -443 -265 527 131
1949 131 -47 -444 190 751 273 -322 -402 318 418 354 -558 -317 148 589 -52 -784 -401 406 82 -282 -869
1970 -869 -336 583 243 -664 -305 -89 566 402 -257 -115 755 593 112 -312 0 634 554 -147 -565 -288
1990 -288 256 -5 -506 -824 -438 206 -222 -524 -1071 -75 339 -27 -574 -355 753 684 20 -225 151 809
2010 809 683 -111 -77 331 956 450 -392 -457 -208 403 -179 -739 -703 -37 14 -386 -1016 -483 176 197 -293 -398
2032 -398 -33 487 291 -148 -63 357 985 595 48 -13 600 808 72 -412 -415 249 368 -417 -932 -357 -32
2053 -32 -106 -988 -691 -289 198 84 -623 -270 314 830 286 -306 202 991 749 352 -154 368 742 328 -54
2074 -54 -471 -13 507 -81 -590 -617 -325 218 -244 -768 -543 -36 -22 -149 -336 -317 241 466 78 -355 461
2095 461 620 481 -121 -170 500 487 76 -340 -517 226 367 -421 -571 -264 298 95 -437 -408 -269 239 148
2116 148 -377 -291 -7 282 -2 -204 -252 365 594 139 -195 -192 441 477 -85 -320 -217 166 134 -427 -669 -129
2138 -129 448 138 -557 -541 379 458 251 -398 -142 281 353 -78 -213 -122 322 432 42 -404 177 732 308
2159 308 -187 -243 -32 425 50 -369 -278 219 273 -232 -423 -247 3 286 45 -353 30 121 345 -268 -91
2180 -91 307 404 496 -158 -156 249 460 134 -479 -240 210 311 -493 -581 -285 179 190 -163 -347 139 384 57
2202 57 -458 -317 256 474 202 -400 -245 531 476 -100 -299 -106 377 431 -152 -709 -332 326 -83 -312 -639
2223 -639 -144 59 -189 -555 -224 34 339 19 -372 -118 258 639 165 -230 401 394 280 -246 146 511 245
2244 245 -154 -237 -245 34 375 -51 -337 -521 59 -137 -509 -372 -82 211 298 -261 -462 240 276 218 -148 -71
2266 -71 272 377 335 -146 55 460 510 51 -464 119 146 288 -505 -231 -405 185 206 -339 -494 -114 76 -207
2288 -207 -362 -9 374 214 296 -257 -46 571 281 -194 46 -67 310 340 -286 -105 258 248 91 -530 -342
2309 -342 -200 126 -393 -320 -388 6 89 -250 -190 -225 90 306 -23 -94 207 336 64 -290 -108 439 362 15
2331 15 182 72 228 261 -249 -188 -288 149 -82 -370 -126 -182 314 -328 -383 -156 53 282 23 -4 -160 181
2353 181 153 131 -172 -51 350 -55 -163 -320 219 116 -81 -270 8 100 182 -1 -523 -262 120 29 -3 -317
2375 -317 -260 145 -19 46 -656 270 249 256 -225 -206 121 274 0 -252 -202 -36 495 -59 -12 -204 442 259 -421
2398 -421 -142 124 273 92 -279 -519 104 274 28 -17 -276 -51 253 -34 -111 185 115 318 -36 -135 -281
2419 -281 187 98 -375 -201 133 -16 30 -364 -249 239 159 -55 -12 -199 6 493 133 -42 -12 346 285 -96
2441 -96 -176 114 351 -78 -142 -252 262 122 -203 -92 -134 -200 122 -163 -135 147 254 264 43 -394 15 240
2463 240 290 -207 -249 291 406 209 8 48 275 362 -183 44 82 34 -58 -202 -162 -244 207 -173 -274 -65 190
2486 190 151 59 -281 -117 281 379 -2 -26 112 372 437 -199 -101 51 458 87 -354 -266 -163 -44 -20 -407 5
2509 5 -61 93 141 6 -261 97 41 -215 -65 -247 264 303 -44 -105 90 333 192 94 -246 282 168 110 -125
2532 -125 43 0 201 -183 -161 -95 141 220 -29 -203 28 79 77 -127 -13 6 113 212 -63 -135 169 164 -117 -158
2556 -158 57 441 333 7 -148 113 15 110 -231 -24 57 300 -107 -403 -125 -43 105 45 -278 -119 166 -155
2578 -155 -158 -268 -22 655 223 -105 -95 -49 433 -2 -414 -130 333 378 49 -132 -15 146 -72 -38 -260 -56
2600 -56 -61 186 -60 -182 58 47 -77 -184 -198 -63 286 96 -77 -66 209 46 -74 -91 0 -69 -2 -260 252
2623 252 -53 364 184 -155 -75 -33 130 -128 -108 -27 34 101 178 -270 -212 395 214 -135 4 23 265 100 168
2646 168 -222 267 130 35 -162 -78 -133 437 -47 -141 130 144 150 41 -81 -70 272 111 -20 85 265 51 97
2669 97 -134 30 75 233 -124 -230 44 230 161 -142 -166 -157 147 51 -47 -301 124 56 67 40 -127 166 -40 237
2693 237 -240 -109 93 32 -43 -149 -61 196 208 33 -132 -329 156 -14 -71 -250 -149 105 40 -399 84 142
2715 142 343 61 44 -67 18 29 43 -287 -240 195 131 298 -9 -146 -94 153 63 -269 -38 -10 -66 -189 -77
2738 -77 -122 -75 -258 -399 -50 122 60 -212 -140 61 9 -13 89 41 -76 265 37 31 -186 -76 8 -7 -240 1
2762 1 133 59 61 -186 -275 108 -23 -297 -59 -360 225 -10 -245 -60 169 -49 49 54 92 58 -219 -68 -226 -78
2786 -78 388 0 48 -174 37 54 -129 4 -291 147 -89 112 -92 -33 185 -27 -14 112 -24 -99 44 99
2808 99 -163 41 50 179 -227 -89 27 69 -85 178 -119 135 29 -21 -49 -69 218 -148 -241 -64 -118 22 252
2831 252 -106 141 -7 40 38 -6 -21 -54 27 62 -314 -12 129 69 -160 99 -131 161 36 -77 -122 318 326 -49
2855 -49 -69 -32 286 -10 21 -144 -73 57 160 69 12 -14 -7 31 -19 -135 -187 40 124 -261 9 129 84 -34 -342
2880 -342 68 62 128 10 -88 -35 237 51 -193 -126 163 37 71 -420 179 192 44 -210 -157 -69 -55 -434 -68 -317
2904 -317 -105 -146 -71 -54 -193 -218 226 -96 -335 58 127 332 164 56 -1 135 50 -71 -116 154 273 168 34
2927 34 -68 134 375 -50 -301 -307 62 -90 34 94 -203 45 135 39 11 9 282 171 -299 -150 76 140 13
2950 13 -224 -174 25 253 48 52 -161 -87 326 -257 -237 -215 161 124 -34 -238 -29 163 158 -100 -90 26 255 -104
2974 -104 -143 -82 7 175 66 -174 -80 59 161 -80 -227 -60 98 -10 -185 -241 -45 23 109 -137 -122 -60 -16
2997 -16 -31 -82 16 57 437 9 116 -41 202 64 -112 -326 50 79 50 -119 -194 35 36 -172 291 21 328
3020 328 170 271 66 -153 -323 153 -76 -77 -151 -42 -215 31 -46 255 145 25 -293 -112 177 173 -124 136
3042 136 7 -213 30 -136 -263 -53 328 -238 -115 -39 35 -100 87 -306 -55 235 20 149 -130 161 306
3063 306 51 -407 -184 -12 -63 -61 -60 -111 -112 -22 14 -144 -195 133 137 -50 -115 101 44 318 96 -240 -45 25 -61 53
3089 53 -191 -18 436 127 -269 85 147 221 174 80 194 -172 145 -186 -183 72 272 -11 0 22 150 122 137 21
3113 21 -84 51 342 78 -251 -416 56 104 -91 -16 -64 94 -59 -171 -118 -11 -52 190 36 -119 85 111
3135 111 -183 -131 43 173 197 1 137 198 111 133 -51 15 121 150 43 -92 -67 37 191 -134 -357 -118 8
3158 8 203 -205 -150 -227 20 124 42 -150 424 217 256 -73 -73 26 189 220 -57 -84 47 172 37 37 -10 89 32
3183 32 -50 -12 -79 109 -178 -356 -17 29 83 41 -41 -210 -21 316 172 -58 -136 -1 201 91 -63 216 97
3206 97 107 -161 -46 -13 231 23 71 -249 -340 145 -45 -145 -231 47 29 237 -325 -333 44 25 119 -95 306 143
3230 143 114 -258 -17 235 -89 139 -2 -71 -34 146 46 -2 -205 173 -62 -4 -196 -98 86 114 -193 -66
3252 -66 218 213 -39 22 -135 -25 -27 -98 69 -306 -27 -159 52 285 -156 -21 92 -250 -158 -44 198 -244 63
3275 63 -77 35 245 18 -176 -24 256 280 125 102 296 20 -25 -67 -124 -216 -97 237 -33 144 106 131 185
3298 185 -76 55 345 73 -195 -40 253 28 -42 -40 -319 -156 90 28 113 -199 -61 136 -342 -202 -295 -30
3320 -30 137 33 -53 51 82 188 49 -87 150 -6 17 -105 84 41 25 82 -179 -85 25 41 -10 -76 14 -7
3344 -7 -94 -177 -9 14 -137 62 -143 -79 13 -138 -47 -249 -50 -138 357 -215 127 -378 381 231 -131 35 149
3367 149 186 143 280 58 166 -190 74 187 87 28 298 232 -152 49 -44 26 43 -63 21 208 185 -84 41
3390 41 16 167 1 -39 -146 197 -14 121 7 384 -5 -84 -51 -384 -191 -255 -130 -76 -60 -76 -190 0 -44
3413 -44 -213 -90 -108 40 -30 -198 166 0 -22 -24 -199 55 357 -47 -251 52 81 249 -62 117 5 91 125
3436 125 -94 -49 100 -186 -68 -205 -250 181 -86 -207 160 -304 300 259 -62 -286 8 151 231 -298 -127
3457 -127 10 -102 -3 -51 -6 -177 19 -104 -302 -63 -89 -120 2 -139 -122 219 -126 -148 27 -326 175 74
3479 74 136 -216 -119 161 -78 -337 -38 -63 193 17 -99 69 173 -113 -86 -49 229 250 57 -288 -162 -158 42
3502 42 27 19 -128 438 334 -342 14 -195 238 -226 -64 -248 -215 -204 16 -151 -383 24 -147 -53 -341 -147
3524 -147 -80 273 71 -96 -76 82 -35 -85 -26 -124 141 265 137 -55 40 -51 68 -440 -122 -27 -172 -239 -301
3547 -301 -146 -92 224 -60 -160 16 142 345 -246 -52 -206 159 233 -70 -22 213 81 -80 -94 291 163
3568 163 237 -225 -358 120 -150 -72 11 33 -220 -223 -18 41 -114 -2 222 259 9 -49 -157 229 204 -227 -84
3591 -84 51 300 -15 -173 27 48 98 13 6 -120 78 94 -15 -39 -112 91 135 -242 37 95 -124 -26 -2 17 126
3616 126 -162 -19 32 54 171 268 -105 49 67 393 -166 39 -281 110 290 -127 -165 -196 212 -239 180 -47
3638 -47 -25 195 244 -22 -5 86 88 49 106 -151 145 83 -87 -32 145 319 -226 -181 110 -171 -155 98 6 -184 40
3663 40 173 36 53 76 144 136 -102 -76 129 -52 386 -146 -261 64 325 4 -181 -137 192 265 57 -14 -293
3686 -293 74 66 97 -128 -136 62 54 -149 -181 -190 435 -16 46 41 -82 120 23 204 -210 34 -31 169 129 -403 117
3711 117 -26 -15 -5 43 100 -45 113 -11 -12 145 124 -78 -95 -131 81 124 -36 37 188 198 -6 -184 -8 56
3735 56 -87 71 -131 -73 44 141 -75 -358 117 180 -90 -152 199 78 63 229 -24 -328 130 207 -191 -120 -56
3758 -56 151 -4 -59 -145 -169 -13 259 -49 -70 44 353 207 2 -64 -87 -6 -125 -126 -113 -52 291 85 -269 -223
3782 -223 106 -93 117 -353 121 -133 11 -240 -259 80 237 120 -138 -276 132 63 -335 -76 55 152 -6
3803 -6 -209 -217 40 236 -106 129 -54 148 84 76 88 -41 162 50 -23 -74 296 -55 -118 246 -5 -291 64 -29
3827 -29 -77 -181 49 81 -106 196 227 -98 53 50 -67 30 -29 126 11 -120 343 162 -79 -88 3 -112 123 212
3851 212 -277 -14 -385 -18 78 110 -63 -74 212 -174 138 194 133 83 -54 179 229 156 337 -20 321 -1 117
3874 117 6 -230 -219 24 36 10 -278 -269 62 -235 22 -10 -98 192 -1 13 -100 -179 55 16 -286 155 58 102
3898 102 124 -68 -54 105 147 -155 159 -187 179 256 -118 -110 -219 109 179 -22 -115 280 48 196 -99 -358 -13
3921 -13 20 35 97 -29 9 -206 -193 -91 -283 67 -68 -272 -11 0 -233 141 -92 -263 15 -342 66 15 307
3944 307 101 201 -212 -60 -172 70 150 -73 190 -44 78 -100 -141 -203 394 72 74 -331 -176 265 120 -160
3966 -160 -74 -306 -164 -199 10 54 323 -20 -25 -83 -40 208 63 80 44 -60 6 -175 8 255 198 33 -161 148
3990 148 -110 143 170 -28 -80 -35 8 -37 38 189 -66 -70 -76 -93 -119 -160 335 188 200 -13 55 81 16 -257 -83 4
4016 4 -66 110 60 72 -58 260 -81 -203 -204 -48 -78 -21 -217 -258 96 -258 -32 -205 -31 85 97 18 147 47
4040 47 70 211 40 246 5 199 111 -66 -257 -171 143 -393 357 -77 45 146 -174 -64 165 53 -99
4061 -99 -16 -45 370 222 88 -147 -69 245 319 215 -107 64 258 -130 -143 -33 -148 11 -20 18 -124 171 -198
4084 -198 -84 -16 -16 71 -49 -112 -1 -31 -234 69 -163 -73 -4 180 -153 -145 -188 -88 38 -33 -77 -122 90 86 -221
4109 -221 -34 -261 35 69 -107 246 208 -217 177 -299 -82 167 63 95 -201 32 274 -28 134 -49 36
4130 36 213 29 67 -108 -55 168 -89 -13 43 98 -52 75 47 36 266 -71 74 29 -182 -162 115 -35 -56 -21
4154 -21 -227 1 130 79 -126 209 -20 -36 19 -143 62 105 -206 -123 22 -215 65 -46 -308 225 83 -214
4176 -214 -260 -220 352 34 -192 -172 88 -59 279 63 95 -21 382 -138 119 97 -152 -6 238 175 -176 14
4198 14 -222 -58 -18 96 -278 -105 5 -122 4 -156 -106 92 -121 262 135 16 121 -159 27 115 76 0
4220 0 137 199 -141 -196 29 -61 258 -79 111 155 289 217 -245 29 176 25 262 113 -40 -33 92 18 -13 -74
4244 -74 141 -81 -60 23 -161 125 -9 115 -25 -56 -145 51 75 -53 -43 129 -14 -25 -50 -178 103 -105 161
4267 161 18 97 2 93 423 -236 22 -1 -5 26 -36 -149 -83 -43 -203 -346 73 -88 -355 -361 -19 -37 -138 -240
4291 -240 -123 -158 79 -227 65 149 125 -138 -311 -153 75 129 190 -47 -262 221 16 353 94 166 182 -160
4313 -160 -119 56 -108 97 116 -94 -246 -219 -135 87 227 -130 -65 23 112 -53 112 -16 95 -74 -68 56 -36
4336 -36 70 -15 -198 -107 134 10 -56 -5 -206 -152 4 33 -71 -170 6 10 -228 300 67 309 -123 -163 -82 -60
4360 -60 106 87 66 -102 -37 130 -152 83 16 56 94 9 -108 -51 45 60 99 -258 278 113 -72 57 -150 -98
4384 -98 82 -80 150 -40 109 -44 -40 52 -45 -38 38 90 -82 -23 -37 -34 -47 -5 -82 71 105 -156 -73 145 -28 46
4410 46 69 12 192 160 -34 118 -223 134 6 -239 71 132 113 103 -109 -116 -60 -226 58 -212 39 85 164 -252
4434 -252 -24 -75 79 -150 29 -103 -14 100 64 9 103 223 -19 61 35 -380 86 301 -335 -99 -239 48
4456 48 -14 -80 99 -76 123 -155 60 132 -193 35 -42 -178 29 10 -202 -167 85 155 75 -130 38 -65 -66 51
4480 51 145 -274 53 -119 -64 219 -82 69 211 134 108 204 -11 198 -166 62 56 38 17 -49 -23 -17 219 -79 -122
4505 -122 -44 0 126 95 -28 33 230 -16 -87 82 -120 -11 43 -17 66 -88 -173 73 -3 -71 -42 90 -69 87
4529 87 -285 121 168 199 276 -83 -2 71 -64 102 -170 6 -140 -89 -383 161 233 116 73 13 -223 -227 -239 -223 7
4554 7 89 247 -122 219 22 -17 126 10 -143 -60 73 75 131 34 99 45 15 3 -82 -214 87 -106 -122 112 104 128
4580 128 144 -3 -11 -360 84 -178 33 208 115 237 132 -30 -24 -180 -18 11 -10 55 -18 -113 18 132 59 -40
4604 -40 -60 47 -38 -7 240 -90 -80 112 82 107 -25 -27 -45 -144 212 38 -118 202 -117 -213 -112 -61 76 78 20
4629 20 -184 -116 -167 137 42 184 -66 80 -9 3 160 -35 -58 -81 -95 -105 -38 -173 -14 168 38 317 79 52
4653 52 42 36 126 245 378 -73 1 189 91 49 -52 -48 -44 8 -62 -39 -39 194 204 -51 100 -117 26 51 21 60 -115
4680 -115 -45 -17 -336 133 26 -98 8 -45 99 -43 -127 -217 133 -107 30 -271 -27 -28 -33 161 98 208 -84
4703 -84 -161 -64 60 -27 160 138 90 -202 -9 -196 -103 99 -62 58 -5 -376 -123 142 182 -17 -63 -287 95
4726 95 126 173 -35 -249 -32 174 -9 -83 16 132 53 -51 -35 -185 -30 -13 207 214 -115 62 42 144 4 107
4750 107 -15 51 120 67 -106 243 28 179 -215 -50 88 -147 190 -25 -63 2 -133 -183 -18 -21 -165 265 51
4773 51 -88 -26 67 -278 147 156 74 -32 -42 -138 -231 -25 -144 94 -146 -111 204 -152 -301 -115 -287 -136 -158 61
4797 61 5 -95 -150 -222 -219 40 -22 73 5 173 -114 56 69 -164 48 132 63 -15 130 227 117 79 266 -217 -143
4822 -143 96 -2 29 194 335 -133 -48 -233 -253 55 -93 -207 -44 -173 80 147 -129 -6 239 136 -99 0
4844 0 -66 -2 -195 -188 141 75 13 67 -58 -147 -58 83 -197 -3 116 30 -217 -62 -138 13 -34 -118 -86 -124 -46 271
4870 271 -26 214 -84 99 83 -160 22 -16 -4 104 -3 -154 110 -57 -9 60 129 -212 6 112 -281 126
4892 126 -161 -271 -38 -101 -30 -232 -287 -2 181 -285 -38 7 101 281 252 -69 60 -66 35 -15 -215 247
4914 247 57 269 -238 -36 -63 -332 14 -94 98 206 190 -95 -105 -131 -66 -23 123 39 7 196 -34 145 132
4937 132 102 -86 -36 0 159 54 -144 -54 202 -169 28 210 45 -108 -125 -83 -141 -28 -10 103 -97 -175 264
4960 264 -90 63 40 -48 122 -200 161 61 -78 -105 -160 22 -206 173 -48 -82 88 -108 -285 -94 -179 -171 -7
4983 -7 -84 -149 126 -177 -49 236 -207 33 -2 -315 -145 -214 54 0 -102 -328 72 79 119 -103 69 21 -298 308
5007 308 -268 108 -214 -165 14 117 -171 -240 94 -77 24 60 -12 -167 34 126 -215 147 -212 276 13 -36
5029 -36 -100 16 -288 -178 11 -75 -249 -70 46 207 30 141 -58 205 -111 -8 165 -98 171 37 75
5050 75 -253 -217 -168 -260 187 -92 187 30 -97 115 -82 12 85 66 218 261 333 -293 136 333 86 271 58
5073 58 -105 74 92 -192 58 94 195 78 -194 86 70 38 202 -90 121 67 107 -6 3 32 -111 356 99
5096 99 -69 142 -93 26 211 58 -39 -70 35 1 162 -104 71 -180 37 -176 -221 42 -103 64 -30 62
5118 62 -110 -182 14 -134 20 -23 -233 -62 -57 -30 3 -118 119 40 -170 206 343 -63 100 136 -132 -70 -74 -168
5142 -168 -167 -174 75 147 -98 -292 93 -35 -79 388 -33 36 13 173 -33 -134 -160 84 -156 -114 44 -85 -42 -228
5166 -228 -267 -179 -88 194 236 123 -207 -166 -142 17 -58 -170 -3 129 -198 -317 -146 -135 133 48 -14 -72 -218 -66
5190 -66 23 2 44 284 -30 104 53 -144 38 -215 165 130 -49 -14 -108 159 129 -108 -58 -83 116 16 24 -220
5214 -220 -43 -74 56 279 -171 103 -223 -10 57 73 61 -149 -119 -67 -197 177 -106 81 5 -89 63 79 41
5237 41 -159 -83 -168 109 3 -281 91 -124 -220 -98 -88 25 182 202 -1 -33 -90 -132 -46 29 67 85 -118 258
5261 258 113 -108 110 -21 -45 15 -96 120 84 -86 -17 141 -177 -19 128 -160 -90 -77 91 26 109 40 25
5284 25 62 -26 -340 266 -47 43 -101 98 -123 112 323 51 1 -143 -139 41 -132 127 -146 57 -68 -226
5306 -226 106 155 131 271 -41 215 0 -208 -8 -137 135 -27 146 85 59 -165 66 -44 -85 48 40 -11 46
5329 46 0 188 148 -48 -90 390 168 161 -8 -113 -122 -14 -111 84 -10 -164 -95 5 27 203 100 92 -159 -38 46
5354 46 68 172 -92 -142 16 163 -32 -40 110 143 226 -112 -187 133 -400 -84 35 43 110 -79 -288 159 190 170
5378 170 18 75 125 -366 -215 -175 -62 -79 -103 -35 2 138 187 -32 -101 51 48 -179 -26 72 4 110 58 -70 255
5403 255 -420 6 239 5 191 -32 46 62 -108 140 -20 184 -121 107 -170 6 223 187 -36 -46 -48 -269
5425 -269 -112 44 -7 81 105 -164 117 -142 73 102 117 27 -169 -6 86 -160 -130 121 92 39 50 4 28 -60 1
5450 1 171 42 -10 -80 -64 -68 46 26 -187 2 -84 176 67 125 -287 -32 90 -160 -2 -342 136 -83 -8 -88
5474 -88 -54 -21 -64 -103 134 173 -223 118 -61 106 114 -155 223 -116 136 183 -49 -79 209 87 52 -100 117 123
5498 123 80 -111 -21 -176 -208 -177 219 201 -94 -218 32 -124 -70 -18 2 -20 310 -76 98 87 -172 174 -242
5521 -242 53 55 266 63 -192 57 218 -70 17 -193 -20 177 212 121 189 -134 -168 -167 25 57 74 -10 106 23
5545 23 146 -90 41 143 -56 48 -22 83 330 -78 120 143 254 166 198 -515 184 211 53 -40 -24 -186 -26
5568 -26 -136 -175 21 365 21 -79 -141 142 273 86 226 -117 137 -26 -230 -10 113 -88 -57 55 -84
5589 -84 10 -42 19 9 -78 -78 -87 -23 -60 -71 -174 -74 -10 259 9 9 8 -3 4 -322 -102 5 -166 121 -113 -48 -12 -302
5617 -302 -112 145 91 49 30 -129 11 -81 -339 53 -226 -12 121 -158 23 83 143 -126 -48 -337 179 -54
5639 -54 243 -41 -124 110 176 -240 -2 -5 93 12 -20 89 192 96 119 -3 -77 80 44 118 141 -71 0 -103 -100 101
5665 101 -121 -7 47 -68 -67 218 97 7 -156 -97 56 -33 -6 -300 -68 -274 75 -150 -107 72 181 209 59
5688 59 192 -34 37 18 -89 53 -4 -184 -26 24 -167 -67 33 63 -51 189 -90 -91 37 -268 154 98 -56
5711 -56 -75 89 182 42 -151 -121 3 78 146 170 222 -17 65 -189 -45 -160 -179 138 -114 210 142 172 -60 36
5735 36 -70 168 -144 -59 -46 19 -2 92 -44 239 50 4 -136 -288 108 -224 78 64 189 222 48 -164 -277
5758 -277 32 -74 46 -14 76 -143 276 -14 -9 -3 16 -73 -153 46 11 -88 -39 80 161 40 -175 11 57 128 134 62
5784 62 -174 -1 -119 -37 35 35 23 -105 162 -8 -66 25 -271 141 324 -69 215 65 -9 47 -282 223 216 47
5808 47 -89 -123 -29 115 3 127 -254 152 106 -28 -77 -57 81 -107 -71 -238 -243 -150 37 -70 -25 -40 -130 -111 -86
5833 -86 38 -46 54 138 -537 48 118 90 -26 65 -160 -205 182 -212 -181 -67 -100 -88 86 -149 121 220 113 261
5857 261 127 71 -226 280 -244 -3 59 141 77 63 64 -300 113 107 -7 -58 46 221 3 -240 107 -165 106
5880 106 -80 -171 120 -93 39 -91 77 -390 -40 111 28 51 23 -216 46 109 24 86 -207 59 -156 81
5902 81 -107 76 150 -40 64 30 62 201 94 15 41 9 267 177 173 -118 -253 126 66 155 -41 -254 -113 -151
5926 -151 -124 -44 -180 -235 -154 -140 -98 10 -39 -218 -52 -121 49 -185 -135 -30 -24 47 324 62 -85 -19 -58 210 -78
5951 -78 -46 -216 5 164 10 -248 154 10 -109 157 79 -229 135 -64 178 6 -5 205 43 131 -163 96
5973 96 -178 78 -70 -128 190 107 -76 153 107 -263 -159 52 116 262 310 -264 -212 230 49 11 -111 -237 249
5996 249 34 26 -29 199 -202 -202 -184 119 -99 77 -134 137 171 9 168 -27 -79 140 -91 -21 64 -36 36 -59
6020 -59 -261 -119 130 -134 153 0 74 -19 -2 86 75 97 61 168 42 97 -326 -37 99 -192 110 -50 264
6043 264 -108 -150 -154 165 95 77 10 10 -87 -265 124 -43 133 39 -11 -48 -1 150 63 -260 -58 4 165 -93 -198
6068 -198 -86 124 -18 112 191 68 314 -215 -124 48 235 -127 -26 -73 -66 32 134 -59 -11 48 -27 -114 -8
6091 -8 312 -129 -133 -196 -264 -201 -113 90 63 -12 116 -39 -110 17 89 -111 -2 45 49 -93 -22 139 99 135 20 -63
6117 -63 227 -17 -108 97 141 -98 -68 35 -265 -90 -126 -177 -49 -385 -76 -203 253 -15 -97 -87 -227 -3 -232
6140 -232 -66 49 -126 -32 64 18 -80 47 -14 -124 -100 -105 -48 26 -165 -55 -72 52 144 -70 -306 -9 186 -297
6164 -297 -141 -296 -153 60 -58 143 -34 -148 271 122 -1 67 -29 -406 35 138 -166 -139 -257 57 312
6185 312 27 -107 -213 -154 104 32 258 200 111 129 -84 80 -99 -378 -59 362 7 54 184 32 -168 -17
6207 -17 -74 158 150 259 -210 231 -108 -270 67 -215 -65 246 -47 20 202 -161 -217 -134 158 57 104 256 -23
6230 -23 -75 184 120 -156 78 -1 13 -178 43 -38 12 54 -34 74 -79 95 11 116 -121 -52 55 -256 -17 36
6254 36 11 63 -226 -139 41 -136 -130 -1 -6 247 -79 90 15 33 -128 -362 -104 -209 21 -84 -62 -239 -88 -175
6278 -175 341 8 -31 -134 128 -39 -47 94 -100 28 66 -61 -146 201 -159 142 -93 39 140 35 -24 118
6300 118 -255 -21 190 103 -204 305 70 -267 -119 -294 116 -15 -61 -108 -160 87 18 132 -69 125 6 10
6322 10 87 -111 -70 92 -72 309 -33 115 6 -180 -74 128 -46 356 -43 89 -26 -129 -15 20 31 -52
6344 -52 3 -152 -357 -29 -25 203 -208 -124 -239 -51 138 -342 338 152 163 -136 -162 -74 5 102 92 -49 38 26
6368 26 195 -84 -25 42 55 -28 -38 199 -88 -167 33 48 -116 -139 -198 124 65 -14 -84 -129 147 -28 109 229 -108
6393 -108 -44 43 310 228 -6 -8 -152 50 187 171 13 -64 -30 54 -206 62 -289 304 218 92 -125 36 -124
6416 -124 -253 146 -131 226 -134 -43 -16 6 48 94 -89 26 227 -109 -245 319 41 236 294 -114 -177 -4
6438 -4 40 -279 -83 -356 -178 -76 52 78 77 -187 -32 -60 -75 -80 235 67 -54 105 -183 102 29 91 -165 -36
6462 -36 -92 -35 36 234 -78 -153 51 -124 -8 258 36 -116 -266 -186 73 -46 -53 161 40 -114 -222 265 28
6485 28 -247 58 -173 5 2 149 210 -76 -44 162 -149 -320 113 253 -122 -104 -39 -34 -167 -62 -115 -217 -44
6508 -44 -23 -81 29 -66 122 -9 84 -423 35 -275 -41 -64 17 -97 137 -72 -85 34 -255 -46 -6 21 -64 63
6532 63 32 10 -72 53 95 77 -60 -40 167 12 39 -147 279 -98 -56 -60 -140 -18 66 140 -3 141 -135 159 14
6557 14 -11 -131 -9 -221 -49 -73 194 180 -152 50 -69 90 -72 84 5 -68 48 -134 -71 -87 148 200 -168
6580 -168 66 158 -178 159 -61 48 74 -6 -283 -96 37 11 101 161 69 -79 -51 -33 66 -74 214 -224 -129 94
6604 94 246 -96 84 -363 85 132 80 57 -182 -92 -92 -238 -293 -34 -32 -106 -3 113 42 105 -236 -157 -162 -36 123
6629 123 164 -225 48 176 48 27 109 -43 74 107 -53 90 462 20 -70 141 -105 -110 -95 58 35 -172 43
6652 43 -98 16 36 -42 -252 -338 165 -166 -341 -17 -318 -328 -46 -158 313 -53 152 -145 2 18 -17 11 -1
6675 -1 222 51 -54 -56 -139 64 25 11 7 -97 -46 -327 100 -110 -37 -3 127 -97 47 172 -176 -159 -160 -47 173
6700 173 211 349 -22 -108 210 1 -115 97 110 109 -72 -29 -157 -61 -11 -176 -279 157 -88 100 35 125 251
6723 251 -86 172 -13 35 -179 250 -36 76 49 65 -60 2 -208 377 -225 -65 -59 -132 18 194 276 -194 95
6746 95 168 124 -183 98 168 -149 -27 102 -19 -57 -130 110 -176 -6 93 -222 192 142 105 -43 -10 -30 24 -9
6770 -9 74 -51 233 -179 107 230 192 331 -38 163 7 159 42 42 165 213 178 13 -54 165 3 -100 -110
6793 -110 141 148 -49 -170 -141 62 43 170 355 -237 -47 -99 44 120 115 -14 -9 -57 -129 117 193 119 -44 11 140
6818 140 269 67 -7 -123 -17 -97 133 -49 80 15 33 85 -223 67 -30 -1 6 -24 112 349 -121 133 -107
6841 -107 12 -16 -28 -144 10 52 -21 15 58 -60 -187 225 -10 -40 -6 163 -215 -67 -248 139 272 60 -23
6864 -23 -22 -102 16 93 33 -45 -81 -6 141 -91 91 -95 -341 63 -147 154 -131 43 109 141 -32 -181 99 -176
6888 -176 -259 147 -57 -5 302 67 77 136 -140 266 70 154 227 186 120 -54 -2 -88 119 -240 -124 196 -82
6911 -82 134 151 -155 25 34 -111 -89 155 -40 51 -22 -62 113 -181 -82 16 101 -186 176 75 8 -57 -221 64
6935 64 -18 221 226 68 296 -98 39 -39 -17 -50 25 -129 -21 116 121 -202 -82 36 165 97 -25 113 -315 -46
6959 -46 58 -108 -213 -88 93 -154 -166 -104 -27 -172 92 -19 62 -165 -224 112 -75 -38 44 -60 30 2 -80 -9
6983 -9 73 1 51 20 -91 262 -106 8 -79 4 43 -68 72 237 29 -230 -65 -139 260 28 -138 -126 -196 144
7007 144 171 -74 -75 -5 101 120 113 -100 101 156 70 100 155 57 -90 -9 -159 -176 -37 -34 -89 101 -75 -95 -33 -16 -19
7034 -19 -22 -20 -17 -64 272 -63 121 8 134 105 13 135 -94 317 222 232 -50 2 -52 -191 -42 -82 -188 212 -236
7059 -236 86 68 0 -295 -80 -62 -517 407 240 -126 97 -95 -212 42 42 29 111 20 -40 91 -191 -130 -130 138
7083 138 35 -159 -84 -293 -67 -35 -149 14 -99 184 -51 -21 86 113 -221 153 58 191 64 64 103 171 108
7106 108 61 104 17 -8 105 130 -194 -146 262 7 162 65 26 -86 -295 -143 41 -214 -100 97 186 -43 211
7129 211 -124 175 61 -280 125 153 136 -219 -175 -50 197 -165 58 -132 47 422 -96 13 248 80 -197
7150 -197 -34 -87 -54 230 -247 21 106 45 -83 103 209 -203 139 -21 234 -111 232 -215 152 92 118 57
7172 57 105 -112 -66 -63 49 312 -19 37 -57 306 174 -61 51 464 -91 12 -195 -17 -342 -76 144 -1
7194 -1 -232 71 -14 -21 319 219 114 -183 -113 50 151 335 -359 -95 169 -43 275 -155 -97 57 93 -146 19
7217 19 -38 -179 49 -16 34 22 -14 22 -277 -1 -174 53 -110 35 159 94 -85 165 23 31 -212 -222 168 -148
7241 -148 204 241 97 -153 0 -224 160 42 -101 79 85 -68 -184 51 56 -15 9 216 134 -50 -140 24 28 -177
7265 -177 95 23 -64 -18 128 36 37 -66 48 84 273 101 -28 30 247 -19 66 -28 -29 211 1 65 -204 -72
7289 -72 -26 147 151 83 -203 -54 -78 55 -125 9 -207 -27 -92 -50 156 -188 -136 9 -253 93 -31 45 112 29
7313 29 206 138 -57 -3 46 131 69 -32 -40 -127 32 -22 -163 20 -156 242 151 259 88 26 -257 -57 -17 -103 -126
7338 -126 134 -315 -72 139 -37 -25 -92 286 -91 -2 -143 -126 22 -179 16 -154 -60 0 120 -135 -114 -205 115
7361 115 -1 -192 -183 -69 95 251 -158 180 -213 131 -29 30 -261 -13 -42 -144 -199 44 -103 -31 125 -179
7383 -179 218 -89 -5 -43 165 152 101 -98 -119 219 59 -293 277 67 -3 -186 -25 -55 -83 -136 -122 -242 -219 -68
7407 -68 -58 -23 -166 47 313 136 -143 165 30 68 -58 112 216 102 265 -38 -18 -128 106 114 -9 94
7429 94 56 -93 -33 -16 120 -2 5 198 -114 149 -129 -60 -127 82 -59 -45 -42 51 84 133 -27 -48 91 63 -51
7454 -51 -74 -39 208 -106 171 63 -78 108 6 3 84 -71 148 131 27 74 -123 134 147 127 212 108 -21 -127
7478 -127 -244 61 147 42 -167 41 -13 -7 46 -55 92 -126 248 160 -57 -161 53 -12 335 62 -136 64
7500 64 -21 -108 47 -72 155 -113 233 208 18 212 -203 -37 250 -164 144 2 -31 50 -174 -15 -113 -124 137
7523 137 78 -49 -178 160 -3 -8 -36 2 -90 -287 -191 25 129 46 53 -74 6 153 223 19 -138 48 -72 -117
7547 -117 9 6 -71 -348 121 -219 118 -94 -46 -103 91 -29 99 113 -122 249 156 87 -107 -100 -157 133 -124 -233
7571 -233 -96 -60 -210 -6 -85 -136 20 52 30 -409 -197 42 -26 22 -16 -286 260 -223 -89 -230 -53 -171 -156
7594 -156 51 7 -147 395 -24 -150 39 -48 143 -146 -58 159 151 -258 172 50 -96 -168 192 47 89 203
7616 203 -184 259 20 -170 -17 -50 -216 61 -73 -60 81 47 59 63 -63 146 -139 63 -58 -180 155 7
7638 7 -117 44 -230 -101 190 131 68 -92 88 112 82 -30 -177 -64 61 -36 -76 -54 112 143 153 -215 -147 173
7662 173 -240 -48 50 26 252 276 -48 -354 34 -74 256 -234 -277 392 85 188 -296 -44 247 108 218
7683 218 405 58 109 -241 253 -148 -232 -50 98 -87 -62 332 -62 -238 2 302 124 -48 5 99 149 -232
7705 -232 -145 -37 -13 -26 -118 252 -51 -6 51 -25 93 -142 -239 134 341 193 116 -138 -132 222 193 -172 -115 106
7729 106 291 43 -75 79 -279 417 244 18 -187 -32 52 36 101 66 -27 -24 108 206 97 -170 160 -25 -91
7752 -91 -33 182 34 -80 -2 -67 16 -37 96 170 199 170 192 -170 228 -64 297 25 -75 -26 35 15 238 -85
7776 -85 98 264 0 200 190 312 141 -154 155 27 -45 -151 -183 321 63 -22 36 -80 -246 -77 101 46
7798 46 -106 -112 66 -77 -34 -112 -106 26 -40 -67 31 -90 -192 24 49 32 193 -82 130 45 -9 -104 23 -353 241
7823 241 -4 -76 48 -62 -151 240 89 -132 76 -282 -54 -85 -250 -143 1 -81 118 -17 76 -60 -127 115
7845 115 143 -5 67 47 -117 -164 129 95 88 -23 42 -60 -111 147 202 183 6 -93 -189 90 -44 166 148 -37 -76
7870 -76 -31 -195 -65 116 157 70 52 -3 111 212 147 -193 -33 -170 -119 273 -71 -35 -65 -249 -196 115 66 -50
7894 -50 70 -133 -69 85 -5 -166 0 320 112 -235 18 -91 149 -234 38 -77 49 -191 34 -19 -99 -118
7916 -118 -16 106 121 111 -13 259 157 41 -152 -55 -148 -60 118 -12 103 -47 -121 192 -82 -106 -75 203 60
7939 60 -193 88 102 -31 -104 53 133 -17 -94 121 102 -128 424 301 -56 137 121 105 94 -99 59 79 -80
7962 -80 -75 245 -323 -134 -120 -40 134 -272 160 -205 88 78 266 127 -170 -103 52 -79 -82 -267 66 -189 111
7985 111 -10 54 77 -7 54 236 65 -56 -6 190 -24 -123 133 25 114 -311 -54 -73 200 -47 -144 -13 -36
8008 -36 182 20 91 -77 -112 -117 -96 -132 130 36 127 -242 -153 86 139 109 -368 -5 46 -27 31 -9 -129 -30 249 -260
8034 -260 212 -89 -51 -255 -31 3 59 181 -242 83 36 -34 -241 129 -182 210 114 39 23 -179 12 -130 -155
8057 -155 261 48 125 -44 -207 -43 -104 83 -374 -64 -202 -260 0 -2 160 57 -7 -40 230 -60 -29 220 76
8080 76 -17 73 44 113 88 -83 -6 -21 -70 -46 8 -176 114 -93 39 61 55 37 -12 -106 -151 64 -177 46 119 -93
8106 -93 301 8 -64 -165 -9 -111 -149 -34 5 -142 -239 88 -19 113 -141 155 -83 -103 -25 115 217 -101
8128 -101 -201 -101 166 1 -260 -197 19 218 286 -59 88 -291 -92 233 -50 117 -44 -3 -115 71 129
8149 129 280 -85 53 -128 -485 -2 224 -40 -76 164 45 -123 -3 25 -110 43 89 -100 37 6 -64 -80
8171 -80 149 -32 74 99 59 -33 -253 123 -87 -46 127 95 -229 -146 -134 -153 -35 -117 -56 -29
8191b9
$$ Imaginary data points
##PAGE= N=2
##DATA TABLE= (X++(I..I)), XYDATA
0 0 0 0 0 0 0 0 0 0 0 0 0 0 0 0 0 0 0 -1 8 -8 8 -8 8 -8 16 -16 16 -19 24 -25 32 -33 40 -43 49 -56 61 -69 77 -85
40 -85 95 -108 117 -130 143 -159 175 -193 214 -235 259 -285 315 -347 383 -424 474 -529 592 -668
60 -668 761 -876 1024 -1217 1493 -1904 2593 -3957 7723 -40375 -134517 -48735 81619 116467
74 116467 30425 -31279 7989 91122 102683 47293 13724 45889 71211 35474 -19741 -19835 21174
87 21174 26027 -35572 -88960 -70384 -17894 -16753 -66689 -90981 -51910 -8060 -16502 -49514 -36308
100 -36308 26718 63159 26617 -18768 10252 90434 118723 57490 -10854 3843 74298 95349
112 95349 29913 -40315 -37817 6915 13355 -32699 -72834 -62687 -32837 -36566 -67112 -68669 -29680
125 -29680 -1864 -17866 -38589 -16249 33494 53750 29173 10002 35526 73049 69428 31966
137 31966 15310 39321 58232 29850 -19825 -32631 -781 16365 -21536 -73431 -73815 -29369
149 -29369 -5803 -33747 -68691 -56538 -10711 13705 -1930 -17439 3056 37964 45138 26990
161 26990 21477 43015 60746 43616 12179 9479 31814 34381 782 -31256 -26389 -4205 -7528
174 -7528 -39371 -58486 -39284 -11527 -15182 -41550 -44934 -11358 20277 12632 -12916 -9559 27661
187 27661 52716 36213 8044 11654 38605 47124 23104 -2183 -35 16371 12307 -14782 -31422
200 -31422 -19485 -4710 -16342 -40278 -41588 -16841 -361 -13962 -32454 -20792 10762 22538
212 22538 5678 -8045 8554 35640 37035 13609 516 17196 37631 27107 -3284 -14000
224 -14000 4270 18776 1174 -27355 -30108 -8180 1546 -15906 -34802 -26420 -3188 2634 -12972
237 -12972 -22015 -5655 17241 16108 -1971 -5377 15739 33156 21662 48 868 21041 29608
250 29608 10615 -11351 -7007 11905 12839 -9471 -26469 -16307 2810 187 -22366 -31349 -13043
263 -13043 6617 -471 -20456 -20054 2949 18247 7574 -8904 -3016 19746 27384 11070 -3066
276 -3066 6264 24906 23134 2160 -9754 2519 17725 8052 -15850 -21390 -4322 6149 -7474
289 -7474 -27320 -24495 -4315 3803 -10165 -23626 -13473 8535 13306 -2046 -10603 4700 24414
302 24414 21928 3021 -1570 15286 28035 16886 -3792 -4672 10747 16334 -615 -18729 -15620
315 -15620 677 2109 -16385 -28564 -17386 879 -254 -17745 -21902 -3975 13211 8047 -7455
328 -7455 -5472 14309 25297 14505 -184 3741 20598 24576 7250 -7336 -895 13674 10361
341 10361 -10125 -20464 -9741 3317 -3830 -21843 -24583 -8108 3242 -4953 -18396 -13453 5276
354 5276 13763 3498 -7225 1539 19945 22221 6128 -2810 8633 22124 16215 -2894 -9002
367 -9002 3498 11866 783 -16717 -17421 -2983 3095 -9210 -22407 -16675 1011 5196 -8339
380 -8339 -16195 -3897 13422 12260 -1800 -4978 8889 21181 14492 -1001 -2188 11656 17890
393 17890 5747 -9125 -7352 5774 8260 -7009 -18683 -11432 2660 1597 -13475 -19025 -6192
406 -6192 6619 2692 -10070 -10353 4931 14985 7659 -4869 -1752 13179 18722 6239 -5587
419 -5587 -72 13720 12614 -3025 -12264 -3155 7820 2351 -12892 -16837 -4615 4941 -2772 -15179
433 -15179 -13837 1205 8487 -1096 -10630 -4686 11038 14062 1839 -5716 3794 16322 13578 -397
447 -397 -5250 4846 13303 6167 -8031 -10324 1213 7056 -3140 -15805 -12762 331 3691 -8013
461 -8013 -15982 -7981 5858 6020 -5927 -9454 2018 13398 9505 -1924 -2941 9216 17082 8620
475 8620 -3735 -2398 9836 12621 294 -11054 -5911 5161 3863 -9471 -16276 -7587 2858
488 2858 -590 -12445 -14253 -2579 6798 1578 -8368 -6199 7131 13788 5204 -3891 2081 14057
502 14057 14813 3219 -4015 3031 11945 8355 -4340 -9354 -1139 6060 -775 -13243 -14340 -3175
516 -3175 2960 -5892 -15633 -10894 2343 5806 -3529 -9475 -949 11067 10567 873 -3035 6666 15952
531 15952 11313 -462 -2591 7079 12569 3780 -7899 -7069 3214 5045 -5940 -14679 -9374 601
545 601 402 -9752 -14205 -5329 4909 2826 -6609 -7435 3554 12391 6886 -2407 -717 10343 15090
560 15090 5745 -3353 363 10040 9721 -1356 -8595 -2850 4860 1539 -9327 -13616 -4847 2748 -2355
575 -2355 -11947 -11194 -243 6002 -425 -8084 -3281 7907 10562 1974 -3357 2549 12330 11177 970
590 970 -3879 3151 10584 5563 -5619 -7798 582 5355 -2186 -11688 -9734 -61 2734 -5058 -11547
605 -11547 -5999 3848 4857 -3058 -6974 811 9593 7678 -1508 -2958 5760 12227 6143 -3616 -2495
620 -2495 6039 8422 -105 -8209 -5148 3333 3591 -5767 -11485 -5562 3334 1536 -7907 -9640 -1090
635 -1090 7069 2952 -5330 -4378 5497 10388 3805 -3348 -293 8184 9465 1417 -5075 -831 6550
650 6550 5037 -4685 -8859 -2554 4248 50 -8778 -9713 -1029 4193 -1402 -8360 -5551 3786 6548
665 6548 215 -5153 -4 8535 8707 635 -3736 2984 9681 6493 -2664 -5069 2146 6379 598
680 598 -7760 -7273 408 3037 -3790 -10050 -6280 1871 2954 -3973 -7956 -1699 6505 5344 -2103 -3728
696 -3728 4104 9861 5779 -1833 -1365 5569 9044 2466 -4457 -3097 3925 4657 -3256 -9042 -4961 2165
712 2165 945 -7132 -9570 -3082 3071 601 -6203 -5959 1915 6739 2724 -3487 -1276 6847 9364
727 9364 3069 -2486 1202 8145 7733 -546 -4947 117 5651 2060 -6195 -8099 -1870 2199 -2172
742 -2172 -8778 -7674 -520 2958 -2283 -7434 -3604 4416 5658 -171 -3590 1717 8643 7129 113
757 113 -1756 4139 8467 4576 -2958 -3294 2753 5141 -709 -7143 -5697 892 1572 -4798 -9151 -4831
773 -4831 1864 1072 -5342 -6805 -79 5485 2962 -2594 -2366 4531 8324 4254 -1634 -49 6339 7545
789 7545 1275 -3910 -956 4870 3587 -3718 -6680 -2312 2233 -87 -6545 -7448 -1710 2406 -987
804 -987 -6039 -4754 2193 5530 752 -3792 -307 6253 6793 710 -2505 1845 6874 4857 -1577 -3288
820 -3288 1511 4910 1215 -5071 -5312 271 3074 -1708 -7138 -4816 1428 2519 -2885 -5709 -1665
835 -1665 4211 3425 -2351 -3162 1784 6094 3838 -1757 -2185 3062 6268 1837 -3599 -2399 3154 4307
851 4307 -1392 -5667 -2455 2539 2093 -3626 -5505 -1180 3029 1507 -3827 -4582 965 4715 1319 -3397
867 -3397 -2611 3602 5546 562 -3410 -579 4459 4472 -1187 -4049 -241 4181 2142 -3039 -4790 -127
883 -127 3533 392 -4625 -4378 1392 3822 -289 -4719 -2368 3560 4089 -848 -3719 -122 4337 3793
899 3793 -1389 -3256 884 4665 2426 -2981 -3465 1374 3881 32 -4422 -3315 1669 2895 -1634
914 -1634 -4835 -1870 2744 2543 -1984 -3808 -255 3889 2584 -2074 -2767 2021 4977 1668 -2644 -1645
930 -1645 3001 4492 100 -4000 -1488 2700 2545 -2135 -4592 -1278 2464 1294 -3671 -4359 -390 3168
946 3168 803 -3493 -2952 1931 4397 571 -2667 -480 3831 4507 231 -2720 433 4296 3170 -1589
962 -1589 -3273 418 3197 623 -4118 -4423 435 2139 -1623 -4974 -3092 1083 2246 -1291 -3801
977 -3801 -959 3428 3262 -628 -2439 1559 5013 3439 -1032 -1821 2099 4696 1315 -2971 -1856 1817
993 1817 2480 -1343 -4456 -2702 1540 1176 -2721 -4892 -1684 2150 1256 -2711 -3443 698 4179 1576
1009 1576 -1986 -1373 2967 4636 1528 -1666 -454 3685 3843 4 -2775 -666 2942 1803 -2563
1024 -2563 -4061 -789 2101 19 -4195 -3872 299 2512 -774 -3691 -2049 2173 3130 -188 -2583
1039 -2583 110 4011 3559 -285 -1933 1526 4087 2399 -1540 -2091 1203 3083 191 -3114 -2507 806
1055 806 1902 -1519 -3895 -2242 1611 1336 -2118 -3519 -698 3145 1894 -1969 -2263 1325 3716 1736
1071 1736 -1891 -1172 2195 3353 569 -2393 -1008 2233 2618 -918 -3492 -806 2172 1290 -2416 -3635
1087 -3635 -69 2220 447 -2911 -2481 1282 2654 370 -2466 -1392 2390 2960 115 -2518 -68
1102 -68 3140 2746 -1150 -2697 363 3018 1008 -2356 -2501 831 2166 123 -3064 -2178 1130 2229
1118 2229 -483 -3158 -984 2853 2405 -1147 -2331 458 3240 1886 -1694 -2060 894 2908 742
1133 742 -2429 -2064 1353 2537 -624 -3273 -1485 1722 1968 -1425 -2796 -545 2442 1423 -1616 -1975
1149 -1975 1049 3118 1357 -1655 -1320 1479 2773 704 -2278 -1123 1890 2389 -848 -2782 -1248
1164 -1248 1951 1007 -1899 -2783 -505 1929 493 -2535 -2304 1227 2505 603 -1956 -977 2113 2995
1180 2995 220 -1555 161 2956 2362 -1182 -1917 77 2080 987 -2070 -2555 25 1639 -254 -2936
1196 -2936 -2641 555 1503 -689 -2895 -1099 1888 1844 -640 -1748 515 3101 2271 -490 -1022 1211
1212 1211 3277 1367 -1386 -1427 1077 2372 8 -2743 -1772 996 1482 -1678 -3082 -1111 1074 943
1228 943 -1875 -2546 -178 1961 1214 -1338 -1359 1558 3047 1041 -1152 -640 2303 2790 2 -2011 -180
1245 -180 2016 1495 -1158 -2294 -740 1475 241 -2209 -2430 -276 1329 -161 -2571 -2026 912 1888
1261 1888 -52 -1902 -327 2106 2263 -297 -1055 716 2784 1644 -616 -1270 704 2408 381 -1811
1277 -1811 -1784 884 1625 -837 -2741 -1472 1103 992 -1200 -2554 -521 1530 1049 -1257 -1875 592
1293 592 2033 1044 -1288 -1321 1315 2258 268 -1358 -943 1597 1675 -256 -1943 -629 1580 1329 -926
1310 -926 -2229 -201 1616 803 -1551 -1924 538 1889 238 -1853 -1134 1083 1661 -279 -1667 -476
1326 -476 2000 1472 -864 -1581 -341 1717 1132 -1009 -1677 548 2110 540 -1930 -1125 1047 1631 -195
1343 -195 -1736 -829 1166 1540 -535 -1774 42 1789 1100 -1107 -1821 320 1881 462 -1591 -1524 835
1360 835 1660 40 -1678 -774 1235 1400 -342 -1530 -56 1661 1267 -606 -1324 393 1944 709
1376 709 -1319 -1502 756 1885 155 -1496 -990 992 1184 -728 -1969 -780 991 1203 -954 -1900
1392 -1900 -82 1556 906 -1354 -1375 555 2095 367 -1107 -679 1145 1691 358 -1356 -530 1193
1408 1193 1151 -749 -1959 -527 1345 810 -1345 -1654 51 1410 258 -1559 -1377 711 1436 -291
1424 -291 -1439 -570 1607 1556 -234 -1302 -251 1712 1179 -888 -1398 245 1542 581 -1159 -1199 680
1441 680 1596 -5 -1829 -814 850 1590 -552 -1645 -638 1365 1127 -843 -1633 84 1730 717
1457 717 -1225 -1271 448 1428 272 -1352 -939 842 1351 -144 -1112 -590 1039 1071 -558 -1601 -240
1474 -240 1609 790 -1134 -1348 303 1477 409 -906 -887 641 1262 13 -1348 -751 943 1304 -532
1491 -532 -1452 -443 1396 776 -739 -1456 97 1387 673 -1159 -658 1000 1602 238 -944 -471 1083
1508 1083 1673 -186 -1037 -425 1403 840 -653 -1534 -215 1128 287 -1154 -1262 86 918 -38 -1300
1525 -1300 -1009 777 1607 -136 -1155 -147 1444 1476 -544 -953 141 1533 994 -520 -837 502 1334
1542 1334 295 -1554 -875 238 600 -510 -1793 -1184 542 586 -674 -1499 -224 1190 824 -642 -992
1559 -992 528 1523 741 -472 -416 919 1578 395 -960 -501 815 881 -283 -1236 -664 741 529 -1402
1577 -1402 -1525 -344 835 -25 -1298 -1001 367 1199 152 -825 -691 904 1458 325 -864 125 1448
1594 1448 1168 -108 -949 282 1311 620 -962 -1141 195 658 -70 -1308 -1197 357 643 -539 -1648
1611 -1648 -769 772 838 -259 -992 -25 1506 831 -203 -772 501 1382 371 -630 -724 423 921 297
1629 297 -1336 -576 786 634 -504 -1442 -282 898 313 -750 -943 22 827 534 -804 -253 593 1131
1647 1131 141 -694 -467 629 1128 -128 -887 -397 717 511 -334 -1201 -321 696 497 -877 -996 15
1665 15 884 282 -1013 -699 539 834 -19 -811 -442 1084 893 -339 -732 118 738 697 -579 -1250 334
1684 334 736 111 -1247 -867 334 719 -7 -958 -774 529 820 -466 -679 -65 1229 874 -298 -814
1702 -814 462 1297 737 -558 -964 320 848 102 -1088 -855 590 729 -383 -1052 -616 617 490 -563
1720 -563 -934 42 821 689 -489 -516 334 1263 487 -211 -289 835 1333 187 -602 -198 852 534 -430
1739 -430 -823 -280 254 109 -953 -1092 92 595 -91 -950 -926 346 900 230 -549 -148 989 1105 -109
1758 -109 -401 156 1201 905 -246 -644 355 590 349 -756 -777 24 427 -298 -1023 -826 283 473 -504
1777 -504 -1010 -476 769 609 -308 -585 -65 1271 583 -179 -297 661 1277 474 -260 -165 730 578 -161 -723
1797 -723 -456 442 515 -577 -1185 -255 413 122 -877 -1175 115 748 157 -821 -463 592 949 292 -215
1816 -215 -6 941 1026 225 -442 247 823 592 -682 -624 89 370 -30 -685 -811 152 522 -327 -1023 -669
1836 -669 221 264 -513 -992 10 629 628 1 -624 207 556 558 -427 -287 723 991 398 -651 -438 227 477
1857 477 -317 -934 -405 258 808 -360 -811 -51 714 363 -394 -515 25 395 354 -125 -288 487 1066 99
1877 99 -748 19 1037 818 -113 -643 -42 563 417 -543 -735 -3 454 313 -608 -729 116 636 -154 -679
1897 -679 -288 779 529 -144 -484 -57 925 558 -239 -310 93 622 405 -526 -633 303 497 -111 -739 -322
1917 -322 252 544 -86 -916 -356 626 474 -154 -607 280 730 570 -281 -472 488 605 398 -333 -304 180
1937 180 560 -44 -457 -832 319 343 -444 -527 -354 526 250 -521 -707 204 569 -64 -309 -178 459 832
1957 832 299 -286 -64 727 750 98 -590 -157 570 458 -622 -570 89 261 84 -839 -910 -88 641 -62 -738
1978 -738 -428 231 506 -133 -385 -160 623 519 -130 -380 399 528 273 -203 -260 306 734 20 -630 -399
1998 -399 19 239 -461 -870 -674 364 77 -501 -608 -240 242 294 -127 -458 342 823 306 -31 -124 581
2018 581 642 248 -343 -152 516 386 -306 -712 -241 227 302 -720 -764 -106 182 -199 -467 -524 134 495 -75
2039 -75 -319 -124 559 856 97 -1 175 778 496 -188 -121 131 669 463 -416 -524 303 359 -150 -685 -665 156
2061 156 -30 -382 -649 -743 365 335 -322 -246 210 605 434 2 -1 381 673 456 -44 -197 268 667 37
2082 37 -400 -186 514 313 -354 -693 -136 305 -59 -425 -783 -125 441 17 -437 -456 231 474 195 -51 -98
2103 -98 610 417 268 -418 -93 583 527 53 -8 148 293 81 -639 -750 -105 155 -105 -654 -232 252 260 -177
2125 -177 -407 -15 547 89 178 -106 380 654 364 -52 -185 253 569 231 -241 -186 -10 138 -74 -587 -561
2146 -561 -31 214 -176 -519 25 280 332 -289 -247 98 739 -111 -157 -32 176 685 152 -319 -87 355 91
2167 91 -10 -290 113 272 26 -364 -548 22 466 -50 -519 -427 257 138 -199 -191 -72 395 328 -132 -152 -63
2189 -63 495 270 -89 -306 -267 492 106 -306 -251 -58 183 117 -471 -69 -59 165 107 -398 -49 132 320 -193
2211 -193 -322 86 347 318 -109 -16 144 515 305 -269 -104 373 347 43 -465 -146 203 134 -431 -477 -265 -27
2233 -27 26 -340 -370 -60 151 286 102 -283 727 448 294 -214 -27 268 409 14 -91 -94 48 226 -119
2254 -119 -210 43 67 123 -573 -592 7 124 37 -174 -484 413 105 -260 -237 34 301 239 93 -115 176 291
2276 291 306 -212 -66 -53 405 264 -300 -79 374 253 -114 -58 -275 262 -11 -262 -513 -10 69 -173 -378
2297 -378 -479 118 306 34 -140 176 259 236 284 -193 -41 170 602 14 -439 -17 338 -2 -141 -400 -220
2318 -220 222 -92 -229 -552 -208 296 -31 -284 -342 -14 255 -170 -57 218 357 234 -91 -173 253 271 -122
2339 -122 -261 -233 199 74 -10 -502 -339 280 217 -221 -120 3 303 -5 -203 -375 299 122 147 -17 -95 309
2361 309 242 -71 118 9 -85 329 257 -167 102 268 286 -89 -358 -5 43 165 -234 -212 208 314 -25 -338
2383 -338 -165 20 188 232 -357 -248 375 298 40 -328 -202 585 17 -94 -37 92 157 -54 -4 -306 -61 55
2405 55 84 -131 -352 87 232 -106 -188 -13 318 80 -132 39 233 406 59 -99 -375 -25 198 9 -253
2426 -253 -56 218 92 -182 -266 -63 143 267 -91 -254 85 397 -98 -146 -76 59 -111 59 -71 -128 27
2447 27 378 -92 -296 -259 11 208 -213 -304 120 -125 -14 -150 -148 174 154 50 -432 -310 5 240 21 -149
2469 -149 83 254 460 192 -386 186 177 118 -40 -66 -22 221 -143 -331 -148 18 94 -163 -250 -70 -18 59 58 -226
2493 -226 -188 -75 275 -37 -219 171 182 251 -97 237 227 476 17 164 -162 178 281 -337 -60 204 81
2514 81 68 -91 -352 -248 313 -64 -158 -72 -36 224 -192 -189 -208 403 357 -63 -99 -1 406 206 -214 223 -122 336
2538 336 264 -111 -136 271 112 -14 -398 -248 -22 102 -196 -62 -157 -66 238 -240 -204 -51 442 118 -218 -135
2560 -135 -19 408 -80 69 73 -24 282 -40 -173 171 80 32 -89 -347 -106 369 41 190 -195 117 225 82
2582 82 -42 110 -52 158 56 -184 46 121 -111 -18 -47 238 230 137 -197 -211 160 16 339 45 -281 45 158
2605 158 -140 -224 -427 101 138 -217 -395 -231 233 263 -210 42 279 -24 -85 93 -235 325 79 -141 -15
2626 -15 -172 7 255 -17 -346 146 209 152 102 8 -163 365 281 -82 -63 -31 327 121 -348 127 364 238 100
2649 100 -208 38 147 148 60 -143 85 -44 -99 189 -111 18 211 -26 -268 -343 80 317 140 -60 -88 183
2671 183 64 -170 -6 -144 -4 97 -78 -208 -38 99 -104 -184 -30 -90 -9 52 6 -119 21 249 -18 -203
2693 -203 -56 122 -79 -88 -1 75 468 170 148 -411 12 135 38 -385 -190 -74 89 -46 -246 -26 251 -112
2715 -112 -98 -265 77 204 -75 -80 -190 11 273 -3 44 53 489 337 -154 -227 176 378 182 29 213 -82
2737 -82 155 -55 -103 -43 -77 -35 38 -234 -43 -136 -251 -238 -241 -126 232 206 -47 -152 253 250 238 -26 -210 -21 267
2762 267 241 1 -76 -87 180 103 -84 -242 -98 -116 -173 -158 -291 86 123 -194 -57 41 38 -30 15 -175 222 29
2786 29 26 72 83 269 19 151 -14 -94 19 139 -109 -130 -114 203 13 -79 -107 30 74 -225 -345 -138 152 181
2810 181 196 -169 -179 27 199 -57 -176 -38 315 341 -190 -159 25 250 40 -118 -171 144 -83 -130 38 -34
2832 -34 225 323 71 -304 -59 -13 152 -45 0 217 79 200 -123 -342 -21 205 -162 -44 95 15 201 -43
2854 -43 -125 -316 181 101 -72 148 51 53 85 -420 -517 28 245 111 -203 -96 -51 45 -51 -405 -229 -24 -59 41
2878 41 -167 -129 198 -2 31 -67 161 1 173 -121 152 42 240 -41 -250 -149 297 409 64 58 -203 -15
2900 -15 -85 -1 -5 163 235 63 -94 -272 78 66 -234 -285 -30 142 62 165 -160 -5 133 263 40 -138 -193
2923 -193 60 52 -19 227 -87 353 141 -25 -176 -172 -273 -137 -134 -96 -159 65 89 -68 -17 2 168 -50 -379 -17
2947 -17 255 -19 59 158 35 154 103 -17 281 92 417 18 -78 88 226 14 -71 64 215 -172 205 -326
2969 -326 0 154 129 76 -126 -355 70 80 -92 -98 -146 97 24 10 -73 -66 -51 63 -117 -224 172 8 74 -429
2993 -429 -3 89 -22 186 -167 -96 203 -122 -106 -188 55 -20 56 89 -47 14 26 -62 -315 8 40 124 200 115 -83
3018 -83 90 39 18 -53 163 161 113 8 -100 -174 -209 252 -81 -164 156 149 127 50 -212 198 166 257 -268 159 -218
3043 -218 -26 41 -239 102 209 -9 -22 -121 66 372 80 83 -29 208 207 -51 216 193 176 172 -422 -209 79 17
3067 17 45 -89 -270 24 46 57 -6 2 -71 -41 -50 23 -107 333 266 53 -176 174 135 79 -111 -185 82 421 -211
3092 -211 -28 85 244 101 167 36 -12 68 71 -102 10 100 53 -201 -116 -73 -50 14 35 -107 -168 10 -72 293 -82
3117 -82 133 64 344 101 -314 -164 143 408 168 -46 -154 -97 83 147 -205 38 123 19 -145 -64 137 -16
3139 -16 -78 1 -69 110 30 -52 -205 192 238 294 -159 -274 157 148 13 74 -65 -43 -21 -74 -52 -316 112 -67 -151
3164 -151 31 41 1 58 87 -305 47 31 -57 -330 -26 0 271 275 58 -32 238 55 72 -27 -233 285 165 -35
3188 -35 -320 -125 175 62 -166 99 214 388 -58 -236 -237 50 31 12 4 -290 284 30 -265 82 112 137 250
3211 250 -259 123 144 59 59 -79 54 -34 -223 -9 52 -10 225 50 -284 -35 119 -107 -171 -30 104 118 218
3234 218 -91 11 -36 227 118 -118 -82 -23 140 125 -93 -121 -114 238 -187 -130 -78 62 187 -77 -209 -197 -208 -233
3258 -233 50 -60 243 204 190 22 -83 -149 -66 -159 -258 69 -58 52 26 -111 102 42 165 221 -7 -207 -109
3281 -109 78 -72 -85 -174 99 -36 -4 -68 -137 166 70 -274 152 183 171 30 -157 -18 22 -83 -84 127 -303 15
3305 15 65 -195 -113 -145 151 2 -117 166 -57 68 152 4 50 201 -156 -271 -38 121 -106 -142 -81 -152 -33
3328 -33 -72 81 -34 108 -188 179 253 -141 -143 -12 43 30 -163 -208 194 225 -20 -352 -108 -14 101 240 -98
3351 -98 301 185 -187 33 -33 -42 214 51 -190 -181 -98 -93 28 -32 -28 203 204 -69 158 -15 24 115 -112 123 -8
3376 -8 40 7 -146 -92 106 268 -11 95 -212 -175 25 -77 -34 -154 -223 -141 -8 -51 126 85 7 21 -119 -77 -4
3401 -4 30 -40 165 257 275 51 -289 45 44 151 -71 -13 49 -19 -69 -360 -194 -150 92 -40 -203 -78 354 145
3425 145 -144 -97 27 9 165 32 21 -120 -63 142 -141 -79 -28 201 64 -1 -280 156 -60 56 35 25 442
3448 442 449 153 -520 -76 -82 -6 -252 1 8 378 -21 -118 -172 94 49 -150 -215 -122 125 -60 -215 -234 58 96 187
3473 187 -42 -34 212 -23 4 131 32 -19 228 -113 -374 -9 -97 250 -32 161 118 189 59 83 153 223 128 -180
3497 -180 -173 -245 102 -203 320 133 -31 25 12 -239 37 52 -39 11 -15 -6 -49 -117 136 137 -333 17 -24 94 -229
3522 -229 -30 241 -21 -91 -25 -190 172 197 -204 129 -4 -27 164 -110 -12 197 118 54 -65 -104 284 -5 -7
3545 -7 65 -52 93 -134 -205 -292 87 -65 -146 -416 -243 36 12 -145 -203 -130 8 79 10 8 52 43 -38 189 53 2
3571 2 -91 118 -48 -169 -52 194 47 -223 -347 115 247 -267 92 -214 -83 210 94 161 244 157 209 114 -172
3594 -172 -103 99 101 20 -6 -249 -24 -33 122 19 301 243 -183 -343 -72 53 -164 34 -93 88 -94 22 -93
3617 -93 -323 34 -16 8 -346 -189 151 52 -29 -8 -47 -38 283 25 -88 -109 53 185 -53 -76 -182 -218 -45 102
3641 102 -98 61 -27 156 -75 80 166 28 242 6 -85 -156 16 -167 -101 31 75 184 21 -230 -24 268
3663 268 8 -65 -227 112 111 -154 110 -212 159 222 -147 94 -9 105 26 -94 3 219 -9 6 -62 -274 65
3686 65 -13 -213 -12 -16 -2 157 -21 -197 62 233 43 -100 -161 -40 37 -80 -155 55 260 -106 52 -56 4
3709 4 -56 44 -87 -51 -102 243 139 -375 -161 289 263 25 -221 76 -33 -31 31 142 -45 -15 18 195 -34 -49
3733 -49 40 -123 61 -160 -72 12 -18 164 -204 227 -85 -109 -2 -3 175 -94 105 223 -77 -123 67 173 -114
3756 -114 -34 149 208 -85 193 4 -115 20 189 74 -27 298 61 -87 115 116 98 74 -184 -10 -106 7
3778 7 38 64 -11 -37 39 -299 -123 -188 -162 -51 -208 -174 75 131 5 -84 -52 115 -12 46 -189 43 105 38 153
3803 153 -127 -136 7 -166 -76 -182 287 11 214 -115 -143 21 178 -138 -150 -269 -393 30 130 -277 -124 89
3825 89 70 252 -66 -165 -107 87 -101 -84 46 49 -35 -5 -255 -79 -10 -206 -37 -268 77 195 -24 262 -132
3848 -132 210 -188 -243 147 -125 16 37 146 52 119 141 -46 81 -133 -88 -129 -245 -18 23 -42 -13 276 23
3871 23 -66 -9 7 -219 -232 143 -96 -23 -201 67 236 79 65 -111 -3 -79 57 79 -76 -58 -301 -246 77 55
3895 55 -47 -36 358 270 -48 86 131 -150 -31 34 112 202 -94 68 -127 106 -88 -64 -73 9 -113 71 28 211
3919 211 181 64 -69 -19 85 28 -172 -298 -204 33 211 -117 11 -11 67 175 -109 -146 -85 21 -16 -8 -34 114
3943 114 30 -22 -137 41 84 120 175 -78 -6 229 181 103 -114 51 -138 174 -216 -155 158 365 99 -48 -75
3966 -75 41 91 -164 -44 -209 -157 -283 -62 -63 -73 73 431 144 -25 -33 283 440 -63 -40 72 247 -44 2
3989 2 -11 162 95 -79 -215 -208 13 -117 15 -37 10 -114 -89 -227 -183 294 37 92 11 -66 58 25 9 40 -112
4014 -112 -70 59 49 -86 127 182 107 32 -130 -38 65 157 209 -165 220 108 66 2 -355 30 84 38 3 -332
4038 -332 -65 -114 61 -349 38 124 50 -111 -3 103 -91 -50 38 11 102 192 67 -180 -110 1 -239 -129 -183
4061 -183 -39 0 -121 -186 0 56 32 47 -165 -17 34 295 -27 108 -94 -234 298 96 209 -23 -74 42
4083 42 -202 -144 124 -149 65 44 -184 -54 160 -72 -73 -231 440 174 126 89 197 -84 167 221 -80 7 47
4106 47 58 136 118 208 238 318 -40 -46 134 97 99 -135 -1 114 92 81 -195 -71 -11 53 292 55 -67 -237 -228 -218
4132 -218 54 -87 46 203 -45 139 9 98 36 25 -202 5 247 -74 110 159 80 35 -32 -288 -30 -15 -110
4155 -110 267 -11 -160 -73 22 171 -268 -87 -160 -29 -43 56 -124 53 68 -203 -31 -150 273 9 -152 -24
4177 -24 46 -111 139 56 -168 -34 67 82 30 129 171 104 -144 52 435 79 -264 72 -107 55 -138 -146 -283
4200 -283 -131 -288 83 -157 -79 13 64 -64 -139 -246 276 40 -2 55 34 -100 -19 66 -121 -177 4 135 -124
4223 -124 -73 201 -66 -49 -286 8 0 41 68 -151 12 -280 50 34 81 -71 -38 -74 95 415 -56 6 292 9
4247 9 -105 176 170 -34 69 68 -236 -102 47 -237 84 124 -39 104 -72 127 149 -106 -84 206 218 161 133 87
4271 87 -16 -26 175 -59 -31 -76 27 -24 117 159 -34 -142 26 -1 -141 31 -49 -72 78 -11 60 43 129 -120
4295 -120 117 -400 46 114 -35 -17 29 145 271 -85 349 81 147 1 28 -154 37 -47 10 -107 -98 167 -34
4318 -34 76 35 -126 -370 -101 105 -102 94 163 -207 -29 -279 23 99 88 -161 12 141 -23 -174 51 70
4340 70 96 -90 -43 -176 -6 19 -381 52 -101 231 -108 106 128 -309 -21 -143 -45 138 -50 6 109 -6
4362 -6 -198 -1 58 -223 -39 -50 -18 249 -67 -125 -12 -8 98 -88 56 185 389 51 -150 8 37 -179 -235
4385 -235 -232 6 51 73 85 -136 109 9 -128 27 -195 152 187 -109 -145 -63 295 -11 -61 -22 178 -5 -92 -180
4409 -180 -140 -28 91 190 172 -36 0 83 -73 -141 -37 -38 -60 -200 88 39 57 -36 -122 139 52 -53 -3 166 -175
4434 -175 -115 77 -228 -312 -63 -168 9 -224 14 -112 286 329 244 -230 -56 221 91 -43 -50 108 56 67 -107
4457 -107 -80 -13 -73 -59 148 49 -153 -19 -140 172 27 43 100 78 102 11 58 220 196 157 110 139 13 -8 102
4482 102 32 -104 -1 -120 -151 -226 -52 7 104 -21 -46 -42 -72 235 -34 -84 4 -5 -155 265 314 -166 -156 172 22
4507 22 70 51 -100 46 71 41 -64 -10 -216 -62 146 -89 -114 116 -40 157 -47 -172 237 -63 153 9
4529 9 189 42 -154 -38 93 -332 -34 198 -16 -33 39 218 -14 -114 -109 -147 56 -38 -165 -80 -135 46 -99
4552 -99 -18 100 122 9 -212 47 28 61 -55 49 -89 -72 -61 400 -61 66 -261 -15 290 -289 177 59
4574 59 35 -170 36 -89 -132 -314 48 5 125 149 173 -37 -153 86 -308 128 -360 18 196 -75 54 11
4596 11 4 301 280 34 38 66 198 36 -199 23 -109 -20 99 -148 63 -17 -29 124 176 21 68 60 35 -70 28
4621 28 -4 66 -20 -208 -121 -337 230 -159 -308 -122 -32 30 229 -292 106 -171 -56 -124 228 -63 79 101 -168
4644 -168 261 -98 -82 60 -50 11 201 -1 224 -109 -36 123 -141 18 -10 -52 62 -66 110 70 115 -60
4666 -60 199 119 66 -101 144 -34 -114 139 -212 134 258 -61 69 204 49 -96 55 53 11 35 -148 -62 -327
4689 -327 -20 -120 -76 68 287 -252 -55 2 196 -80 -12 -152 43 105 61 34 -105 -19 -54 33 87 78 -87 15
4713 15 2 70 51 271 201 3 -111 -181 -264 102 57 -297 6 81 53 -2 -157 -19 50 -152 -218 -116 -17 76 -54
4738 -54 28 -88 230 188 -351 -180 301 -14 -46 -185 186 -109 263 -75 92 -197 13 329 -118 -126 47 125
4760 125 -179 -48 -163 103 125 -315 -107 35 31 130 -210 -94 117 -284 -2 -57 -37 6 26 -31 -148 -188 -4
4783 -4 69 1 -134 29 108 -57 -13 -77 118 -4 124 -6 -33 163 -82 97 35 94 -19 57 -145 -130 -67 25 83
4808 83 -111 6 -134 103 -2 276 -7 -2 -44 166 37 -29 -157 -127 49 -11 50 -127 -103 -203 230 -228 41
4831 41 75 128 123 362 -91 -23 -182 -88 75 -29 -59 -354 -160 -71 -145 -224 -29 106 -60 -17 -105 -5 -52 164 -138
4856 -138 -68 -21 126 181 220 202 -12 -136 88 116 -201 -78 -255 54 32 418 -115 18 108 108 7 -16 173 72
4880 72 -53 13 43 9 -45 82 153 -105 6 -18 164 -45 20 64 21 -88 -38 68 -78 88 185 210 58 -148
4904 -148 -293 -28 16 261 23 -162 -63 -19 -117 -112 229 216 -114 261 30 21 208 -53 -43 135 -183 197 -16
4927 -16 -193 -80 64 125 22 2 -112 -12 122 -209 42 72 -242 -130 -249 12 145 74 -26 -110 11 -230
4949 -230 45 28 -75 253 -114 43 15 79 54 64 -7 22 -61 -147 -21 152 229 63 -79 92 -118 85 -46
4972 -46 115 -128 70 -45 149 -251 -160 6 -191 -75 57 40 62 -79 -94 1 -88 -89 -196 153 -223 -241 128
4995 128 267 -34 -150 122 56 12 -33 -20 -34 -196 38 -93 -26 -181 -297 36 82 94 -32 147 159 -3 -5 59
5019 59 93 -118 101 -3 112 -141 248 -236 -167 -38 -223 -76 -76 23 -127 93 -223 -105 192 45 158 -261
5041 -261 169 -125 -248 -7 159 234 19 -158 0 -65 -173 -73 -61 51 -127 69 17 297 -163 83 -99
5062 -99 91 4 -55 133 -329 -173 -32 92 -89 -180 -196 -50 110 8 13 -96 -11 -159 -16 93 199 208 217 148
5086 148 -4 -36 -180 -47 -97 -208 -211 34 -131 -89 98 46 -26 95 -128 -37 89 138 25 182 201 -76 -135 96
5110 96 -30 79 155 113 74 -47 -13 -172 64 199 -357 -67 20 43 -109 -24 154 3 -115 -69 71 -86 82
5133 82 -39 163 -174 40 -58 204 -118 92 186 64 293 165 117 95 -305 -34 -138 -209 -40 50 -92 170
5155 170 70 -10 72 -124 293 72 -24 -145 154 4 -72 -46 -190 156 -228 -71 -90 38 70 -73 401 -46
5177 -46 -135 -91 156 226 -151 109 110 103 90 100 -96 -99 -20 135 -67 -159 92 130 3 -20 -4 -64 -234 49 -51 -169
5203 -169 -217 -75 -99 79 -38 61 -34 2 -179 173 5 430 -87 -145 14 -26 -84 -109 -17 -108 -355 48 36 -36
5227 -36 -98 -51 100 -45 -45 46 76 -21 -52 17 98 39 -17 23 -155 -23 240 -34 -324 270 26 25 30 135 -158 -199
5253 -199 22 6 159 -60 179 -40 36 53 2 22 80 -154 -30 -158 5 -163 -88 87 55 -157 277 152 -18
5276 -18 163 295 385 86 10 92 -130 29 -88 -27 189 45 26 -69 82 -38 -58 422 238 -19 -99 159 -73
5299 -73 -35 -197 93 -27 3 -21 56 -2 17 70 306 -123 -158 46 200 -18 -5 88 167 -154 10 -208 29 115
5323 115 7 130 17 53 -198 -63 130 110 -165 24 76 54 99 -12 127 -201 -190 -50 169 156 -70 0 -75
5346 -75 -231 -207 -14 95 -19 -155 162 -204 98 -155 -97 -51 -99 -129 78 215 -51 -37 -129 -142 61 73 163 203
5370 203 -10 -64 169 -39 -107 36 -13 35 110 -203 213 -87 -155 34 16 -69 -43 109 208 113 -175 -29 -204 -4
5394 -4 137 158 -159 -179 152 158 -85 87 52 -139 -96 -126 257 -114 71 -33 -35 24 -37 -100 93 49 -35 53 -79 -298
5420 -298 -230 98 206 -10 29 -102 133 169 -37 119 50 -357 -273 -48 -268 -57 114 173 249 44 -71 -4 52
5443 52 32 87 293 162 -165 -235 -249 -279 -84 -7 3 30 26 72 -182 -196 -143 -120 -316 -23 157 306 26 87 -160
5468 -160 -153 58 -8 -80 216 59 124 -64 -216 -81 -123 -94 -96 -48 -179 -80 -4 -138 31 -304 -84 -35 -97 71 27
5493 27 -22 62 -70 -211 48 -63 -144 180 146 311 45 63 4 70 -124 119 -76 -112 99 8 -136 -19 98
5516 98 -152 118 22 402 -113 -33 81 88 160 76 53 -118 -99 -72 -91 -52 -68 196 194 331 114 -58 -59 -11 226 30
5542 30 -94 -411 22 21 -145 -151 -50 -122 -14 -48 -117 38 -73 71 216 -157 -24 -112 -99 99 227 165 14 245
5566 245 -81 115 199 100 -84 -21 103 128 69 -126 -16 -19 -265 -19 -103 23 -2 0 -69 66 131 240 -61 -163
5590 -163 64 -36 -109 13 -111 -46 41 -4 96 -205 -19 -72 -244 -133 104 74 19 265 -4 -53 -138 -8 250
5613 250 -39 84 16 181 -44 54 -173 170 14 14 -68 246 88 -41 -77 49 -128 -132 -263 64 -126 -157 42
5636 42 -156 51 -8 147 -99 77 53 79 91 116 16 -112 -102 -108 157 -178 -121 130 -80 27 4 87 -259 10
5660 10 45 -112 173 43 17 -240 -120 179 33 -20 33 -135 179 -74 127 91 -274 -157 -75 226 -13 -15 -128
5683 -128 -42 -143 184 32 -142 -160 -93 177 -80 -162 242 -136 -61 311 -10 -86 42 -221 -193 -128 -58 57 70
5706 70 27 -54 -151 -11 -9 -72 174 183 -120 -76 -172 -193 -38 205 -25 -74 -276 -166 -109 122 45 92 101 -61 -316 46
5732 46 74 -184 -60 -156 89 183 -51 -107 -73 33 277 -9 -53 -92 36 88 -132 -33 151 -279 60 -125 251
5755 251 34 -70 -186 -213 72 -111 324 -19 -177 42 -91 71 248 -44 96 49 -43 66 -187 -92 130
5776 130 -111 21 137 -192 -126 -221 -157 -133 66 -198 -24 -83 -21 230 -160 235 279 101 28 14 -316 -80 2
5799 2 -61 -12 11 47 17 -345 -69 -116 -181 -13 -185 -65 18 -116 -3 31 90 45 53 -2 -69 -65 136 99 -97 36 -26
5826 -26 -32 304 17 -94 7 81 200 115 306 62 -29 159 231 -127 -135 96 7 187 56 -82 -110 28 189 -284
5850 -284 -148 -55 208 59 -333 73 64 -22 -172 -125 49 -6 -89 187 70 -3 25 18 -44 -195 23 0 -28 292 159
5875 159 184 148 -5 -250 -22 288 -146 50 67 43 -252 126 -118 104 198 31 -52 144 146 258 136 87 -220
5898 -220 -161 217 58 -101 -222 -131 105 -155 71 77 -16 228 -39 46 -97 148 -288 84 90 173 -5 225 -206
5921 -206 -136 60 -15 -7 -58 -241 129 -41 -192 24 24 6 -36 -223 -133 -52 196 -95 -162 17 7 -51 -71 -107 -20 38
5947 38 83 171 -123 -285 -112 185 4 167 -95 6 19 178 -110 -209 211 -186 244 -159 -28 23 124 42
5969 42 -73 -172 -103 78 -185 -270 -39 67 -59 48 56 -222 311 -303 128 -33 -178 73 22 -169 178 -21
5991 -21 -90 182 157 57 -134 157 -111 2 248 231 -21 87 157 -169 -40 21 -374 356 5 70 -202 139
6013 139 -19 -135 -172 88 37 -135 95 133 -105 -238 -262 -99 154 -115 -57 131 -140 -8 -27 32 -112 112
6035 112 39 295 66 -240 -192 3 -40 143 -64 -251 -81 -97 226 150 240 -375 -12 -31 -79 -258 -16 -16 -176
6058 -176 255 -93 -220 -198 37 40 -17 -41 120 13 -135 254 79 143 22 -141 -122 14 73 298 -10 -121 3
6081 3 -96 -27 -64 -79 29 -234 13 -147 108 24 -98 26 62 -87 -151 -14 82 46 -26 77 137 117 -54 104 10
6106 10 90 -121 -102 215 140 -102 -24 73 11 82 62 -173 151 110 -88 -63 131 -7 395 -230 -47 104 17 272
6130 272 131 119 -30 157 -339 16 84 64 253 -197 215 103 -198 212 -86 75 284 -125 16 -171 180
6151 180 256 86 119 -24 -127 -260 -175 200 59 -267 60 47 -126 244 145 235 102 205 180 -6 -20 192 43
6174 43 168 -104 -202 -216 -51 91 -147 -24 227 -72 -130 128 87 147 201 -71 -122 -65 -106 61 -133 172 -300
6197 -300 -130 126 43 -181 -138 -149 -26 108 -183 -47 -140 -23 -173 -168 -75 -47 152 7 -46 -106 -116 2 -86 71
6221 71 -201 117 197 55 -189 19 171 175 -22 -19 12 -79 -214 -40 -157 33 -156 -86 -116 -81 262 105 -221 -23
6245 -23 10 181 -29 17 -240 -42 149 -88 58 -119 -17 55 -190 13 13 76 113 -278 -111 -8 169 -112 45
6268 45 80 103 -42 164 -132 -14 64 131 144 -246 -115 32 -5 107 26 -28 38 242 -52 -9 175 -140 -132 0
6292 0 -45 -77 -135 -92 200 -24 -14 33 19 200 -3 60 -22 152 70 7 -50 -117 -5 88 78 -58 29 196 -42 -68
6318 -68 50 -176 -71 -138 -53 -65 234 -204 -64 -24 377 39 241 -23 -86 135 21 408 -25 -142 -102 -71 0
6341 0 0 52 -36 -142 -160 76 -222 -55 90 -211 -4 72 -149 45 -117 276 -87 -116 -222 39 -21 163 -107
6364 -107 47 -88 55 -156 206 -58 -60 38 -95 108 -193 -77 19 2 -264 111 83 165 -2 -100 -27 -137 -72
6387 -72 -177 -84 -120 -95 237 -4 21 -22 -332 -55 82 163 138 101 -47 86 205 -10 74 -20 -253 88 -77 239
6411 239 293 -43 64 -18 369 -155 -43 208 -210 145 -61 -45 101 -45 -401 -1 1 -15 9 83 -27 92 235
6434 235 -202 -169 234 97 134 -70 112 32 27 -166 112 -159 -97 73 6 115 -99 44 -83 -48 -119 -7 20
6457 20 -261 213 -74 16 -189 -164 54 37 29 -53 -24 -134 -15 50 -161 207 141 178 163 -83 144 9 -179 -61
6481 -61 -77 94 376 141 107 -115 -115 52 72 -25 19 -4 -174 -104 -288 69 306 94 49 5 -203 -235 -120 5
6505 5 160 -88 60 -164 -113 71 19 290 127 1 32 -91 37 -207 -94 274 43 -165 14 -56 190 -79
6527 -79 13 128 -85 -11 88 107 -4 241 95 -250 -125 -161 15 13 -108 -82 92 -48 64 -22 8 171 46 52
6551 52 133 92 -4 -81 -66 58 59 16 -140 213 3 49 73 76 -25 -86 73 -67 -26 -117 -96 15 45 150 -26 -111
6577 -111 -7 7 44 223 -111 28 -16 -95 -9 -152 150 -194 0 -7 -146 128 148 99 -96 -186 66 -62 0 -56
6601 -56 84 -14 -20 -17 140 -121 41 289 189 -12 -62 68 69 30 170 -207 -14 -79 -108 9 -43 40 4 41 132 -86
6627 -86 274 80 8 -49 -109 -17 -91 204 -248 -321 -78 -154 150 -94 -47 -85 -75 134 -19 -259 71 214 -90 220
6651 220 -109 16 5 -21 90 34 -257 82 -162 -122 7 -153 -76 -17 40 -44 -148 18 -68 37 252 -34 -298
6674 -298 -4 325 -100 -74 -96 -16 139 -42 -62 -291 129 -72 -227 -17 255 -37 -37 146 -122 -127 -193 16 -19
6697 -19 14 -61 26 14 -10 -214 -298 301 89 -189 37 90 -164 -156 -90 119 -51 30 72 -224 -106 114 -166 9
6721 9 9 -179 95 34 155 -123 33 -118 -132 -106 76 -37 254 -170 122 124 83 17 -240 28 52 -100 7 -75
6745 -75 -126 -29 25 -24 89 74 154 131 -427 21 -41 351 43 110 -137 13 -55 56 114 171 239 70 150 72 -194
6770 -194 -129 -139 132 -114 -63 262 -27 -21 121 29 -85 -72 -161 59 -16 290 -1 135 227 133 -92 -44 -226 1
6794 1 217 166 97 24 139 191 -26 -305 25 177 75 -128 100 -47 -154 -56 -102 -185 125 25 -291 166 -109
6817 -109 -213 -75 -79 -130 45 18 166 56 88 -231 -45 71 -146 -12 117 -206 94 138 -53 -13 -193 228
6839 228 -16 36 -60 -66 -52 -126 117 -47 -69 -157 -395 61 -57 163 57 -160 -160 -188 180 21 -13 73 221 -224
6863 -224 46 -204 -161 -67 175 11 -22 -55 8 -123 58 -25 -54 -19 -150 -10 -228 -167 200 -62 71 56 -45
6886 -45 -7 19 -106 153 -50 17 18 71 100 162 -62 -175 -173 -93 -164 -113 81 -58 142 -273 12 -140 56 67 -277
6911 -277 186 -9 129 -53 -69 26 -36 158 160 -113 13 141 -122 164 -112 19 85 -52 25 -68 121 39 -63
6934 -63 -201 -72 -164 28 -119 -99 11 -31 -130 -26 135 50 70 123 230 -362 18 55 -143 34 32 -13 44 120 101
6959 101 269 203 -195 190 163 118 -286 37 89 166 -202 91 48 -119 210 5 -169 20 18 252 2 141 86
6982 86 19 -13 -47 40 112 32 -112 -1 -93 59 -80 177 -90 27 133 3 135 95 29 110 -135 -135 27 162
7006 162 301 261 -112 -126 60 -25 -71 -243 214 -139 171 -131 155 128 -16 -15 181 34 139 -17 274 -216
7028 -216 -25 -135 -104 266 -116 53 186 44 163 -132 21 13 -42 102 -114 152 165 139 -141 -17 -130 -36
7050 -36 -373 -70 -111 263 30 -133 -19 -1 220 113 96 89 -25 -59 -2 -240 -122 134 5 -106 187 113 135
7073 135 -46 204 136 -142 48 231 150 -155 -5 -140 -54 40 107 -71 -18 53 -115 -72 -117 -88 -108 69 -51 -339
7097 -339 281 -72 -96 -30 129 261 10 -133 111 -22 -154 -15 101 61 134 -83 83 78 -248 -79 -206 17
7119 17 -11 210 -91 -151 90 42 -101 -82 108 -165 34 43 -83 4 177 -4 -165 71 84 277 -12 -40 -124 58
7143 58 -125 -58 121 -46 -91 148 -104 41 -45 -36 252 -35 3 274 -129 -44 151 70 -177 123 -33 4 50 32
7167 32 -141 -134 0 135 150 43 -12 165 69 -148 209 64 19 155 108 95 -23 35 -44 -103 100 92 37 -224 209
7192 209 -71 -26 -98 -193 -26 -96 -89 160 115 75 -46 -43 101 -30 261 -243 42 -43 29 138 57 -12 -34 65 186
7217 186 -78 -102 -213 69 -28 104 -163 -312 -168 246 27 39 -39 8 143 -37 226 -319 -306 -169 -10 -226
7239 -226 -91 103 170 40 66 66 180 135 -1 -9 -50 -283 -344 151 138 50 43 -305 61 -20 15 -218 -76 -18 244
7264 244 -53 -110 98 -274 53 99 125 71 -167 24 24 47 119 120 49 -218 -79 -23 -267 -60 -195 -154 103 -69
7288 -69 -109 -63 -105 -183 -123 176 -158 281 -111 -41 186 162 -301 91 180 1 236 -59 -97 -137 -126 8 -62 -98 -205
7313 -205 280 39 -22 -81 -163 455 114 96 125 -77 48 -66 -297 -97 -52 6 106 -85 -80 -4 35 137 28 -15
7337 -15 -5 -171 -47 101 -136 -77 35 -7 -91 28 -44 7 125 0 258 -75 78 148 -48 -70 -355 -67 -102
7360 -102 -38 -43 -42 -234 -290 -185 -182 -38 -37 -156 -53 -9 72 -16 132 102 18 -24 310 23 -276 -40 98 -308 -104
7385 -104 -91 380 454 -41 -433 36 -23 -203 -220 43 -13 43 -49 17 136 207 241 149 17 85 99 89 -51 -295 -2
7410 -2 10 -32 16 152 46 356 10 -18 180 -11 260 -189 28 5 -7 -57 5 102 -59 131 -60 -112 48 149
7434 149 3 40 2 58 -67 68 -63 -41 19 -119 162 -50 -194 390 167 -53 -81 219 -46 -3 -46 -134 -157
7457 -157 49 207 -278 89 235 3 -167 215 217 -13 29 -104 -9 -313 214 153 -99 133 -108 -153 -49 -24
7479 -24 202 -335 -109 -127 45 -201 96 70 -84 -4 -214 -44 6 69 -71 86 -40 25 90 -248 -129 399 -121
7502 -121 84 -77 100 27 146 -36 -62 -266 -238 175 -26 138 -187 182 110 472 20 -38 -16 107 0 6 -111
7525 -111 -116 -176 41 45 -308 111 -134 -176 32 3 50 105 58 41 204 -65 -71 137 -170 241 -207 -134 66 -8 -152
7550 -152 -34 35 209 -211 -228 237 -196 -254 189 -258 -95 -45 149 60 22 -190 -115 86 52 -106 -23 -200 -80
7573 -80 11 -49 -18 52 53 163 83 2 -212 -18 -399 42 -27 173 -31 19 41 -205 -37 237 -164 108 143 -271
7597 -271 -12 217 -32 121 -26 -182 149 -150 69 -34 -161 52 -117 -308 -79 62 19 167 -209 50
7617 50 148 0 33 -199 -118 -58 234 -15 -122 -33 37 -39 99 162 88 31 -130 -100 140 -17 25 147 72 -129 -146
7642 -146 53 129 -112 -193 354 -73 -137 -150 -45 157 -223 -110 120 -17 60 90 22 77 -137 -151 19 -156 224
7665 224 -79 -584 45 -13 -151 104 39 -38 -67 41 -192 171 -68 7 -174 -249 63 -192 3 -44 10 -196 26
7688 26 -62 0 -179 65 -81 144 44 -292 42 -190 19 -86 -120 192 310 -154 165 117 -27 224 512 -24
7710 -24 27 107 -112 146 -170 -166 132 -259 47 -321 182 8 -90 6 56 286 -33 49 -125 229 -34 -44 -66 77
7734 77 -190 111 -128 -334 -186 -3 -359 -268 126 -112 96 -154 81 -19 57 -139 194 -124 40 -249 21
7755 21 68 -37 -76 -73 -232 156 10 -22 -95 179 -29 -150 101 173 40 56 -149 -88 -4 -107 290 65 2 -5 159
7780 159 38 113 -132 -13 51 324 152 187 189 -7 -307 130 -74 24 138 83 -85 208 45 -12 123 88 -48
7803 -48 -40 -169 -246 122 -72 -65 52 57 -46 -57 -184 -104 -153 122 -209 -170 -22 129 -71 -185 175 -145 -139 73 -82
7828 -82 13 163 -157 82 75 -100 -224 -151 -64 161 -185 -132 217 -195 -97 239 159 -35 244 -96 -244 -13 -491
7851 -491 -200 -222 -53 92 -133 -177 -11 -4 141 -28 106 -66 98 10 156 6 77 -87 336 35 -24 -8 118
7874 118 -90 28 101 -256 116 21 108 -190 88 8 195 88 160 -86 -23 -329 -208 -153 -108 -112 -107 -18 50 -2 35
7899 35 122 8 216 129 -50 -159 -17 118 15 133 -30 -104 -112 136 122 74 -219 10 159 -210 -76 99 107
7922 107 26 87 -308 -66 -114 -46 -105 -79 0 -94 -67 -105 -9 251 152 -109 105 66 58 18 -265 -244 -24 -14 -90 -233
7948 -233 -83 65 -156 -34 22 -157 69 12 203 -12 74 131 57 8 54 87 -43 46 251 61 92 -176 11
7971 11 29 -93 160 -114 273 -124 -92 -35 165 151 -145 0 32 106 27 -105 142 -63 4 254 -37 -159 102
7994 102 -321 86 135 77 -254 91 137 24 -102 119 -110 -117 -25 29 241 -138 -159 -41 -131 292 324 -49 176
8017 176 -48 23 -27 250 -138 -179 83 -299 -53 -170 -120 44 -255 -209 196 -43 89 16 246 -205 -58 -3
8039 -3 62 -204 -141 -11 -32 162 -276 -121 232 -113 -196 -281 -75 254 43 -47 -339 81 -99 28 51 9 -42 -3
8063 -3 200 38 -3 41 181 -70 106 -143 56 -92 135 30 -105 35 -170 159 -7 88 19 162 -134 79
8085 79 -122 -50 51 -105 -106 -1 153 -224 -152 57 -172 56 214 0 -85 -124 -1 -212 73 101 -85 -32 -82
8108 -82 -206 28 84 -8 13 7 -121 228 182 99 -6 98 99 313 -43 218 -12 2 17 -78 -223 -23 404 -39
8132 -39 -86 -214 -202 -13 126 -99 53 196 -163 -9 -48 -124 -49 120 94 7 -32 -48 102 -102 72 -186 -82
8155 -82 -37 -35 145 -15 -204 120 -38 33 107 128 -74 -107 -15 -145 -67 107 -181 255 154 180 -132 -148 229 -39
8179 -39 146 -116 2 74 -16 -118 -164 -68 -117 -119 -243 -23
8191b3
##END NTUPLES=NMR FID
##END=
