##TITLE=1H_Pr MC
 200.13MHz, DMSO,
 8 sc
 
 14.8.2025
##JCAMPDX= 6.0         $$ Bruker NMR JCAMP-DX V2.0
##DATA TYPE= NMR FID
##DATA CLASS= NTUPLES
##ORIGIN= UXNMR, Bruker Analytische Messtechnik GmbH
##OWNER= pz
$$ XWIN-NMR		Version 3.5
$$ Thu Aug 14 16:33:15 2025 Russian Standard Time (UT+4h)  she@DPX200
##.OBSERVE FREQUENCY= 200.1313
##.OBSERVE NUCLEUS= ^1H
##.DELAY= (6, 6)
##.ACQUISITION MODE= SIMULTANEOUS
##.ACQUISITION SCHEME= undefined
##.AVERAGES= 8
##.DIGITISER RES= 18
##SPECTROMETER/DATA SYSTEM= spect
##.PULSE SEQUENCE= zg30
##.SOLVENT NAME= DMSO
##.SHIFT REFERENCE= (INTERNAL, DMSO, 0, 14.3821)
##AUDIT TRAIL= $$ (NUMBER, WHEN, WHO, WHERE, WHAT)
$$ ##TITLE= Audit trail, XWIN-NMR		Version 3.5
$$ ##JCAMPDX= 5.01
$$ ##ORIGIN= Bruker BioSpin GmbH
$$ ##OWNER= she
$$ F:/spectra/data/she/nmr/H-C/1/audita.txt
$$ ##AUDIT TRAIL=  $$ (NUMBER, WHEN, WHO, WHERE, WHAT)
(   1,<2025-08-14 16:32:15.54 +0400>,<she>,<DPX200>,
      <created by zg, POWCHK disabled, PULCHK disabled
       configuration hash MD5:
       00 E9 B6 7A A2 85 ED C7 34 08 36 98 17 FE 4E 26
       data hash MD5: 16K
       CB 41 EF 4B 83 ED DF 12 34 4C 97 48 7A 89 26 A4>)
$$ ##END=
$$ 
$$ hash MD5
$$ B3 F6 8D DF 7B 5C FF 54 79 18 13 52 FE E7 1D 92
##$RELAX= 
##$RELAX= 
##$RELAX= 
##$RELAX= 
##$RELAX= 
##$RELAX= 
$$ Bruker specific parameters
$$ --------------------------
##$DU= <F:/spectra>
##$EXPNO= 1
##$NAME= <H-C>
##$PROCNO= 1
##$TYPE= <nmr>
##$USER= <she>
##$AMP= (0..31)
100 100 100 100 100 100 100 100 100 100 100 100 100 100 100 100 100 100 
100 100 100 100 100 100 100 100 100 100 100 100 100 100 
##$AQSEQ= 0
##$AQ_mod= 1
##$AUNM= <au_zg>
##$AUTOPOS= <>
##$BF1= 200.13
##$BF2= 200.13
##$BF3= 200.13
##$BF4= 200.13
##$BF5= 200.13
##$BF6= 200.13
##$BF7= 200.13
##$BF8= 200.13
##$BYTORDA= 1
##$CFDGTYP= 0
##$CFRGTYP= 5
##$CHEMSTR= <none>
##$CNST= (0..31)
1 1 145 1 1 1 1 1 1 1 1 1 1 1 1 1 1 1 1 1 1 1 1 1 1 1 1 1 1 1 1 1 
##$CPDPRG= <>
##$CPDPRG1= <>
##$CPDPRG2= <>
##$CPDPRG3= <>
##$CPDPRG4= <mlev>
##$CPDPRG5= <mlev>
##$CPDPRG6= <mlev>
##$CPDPRG7= <mlev>
##$CPDPRG8= <mlev>
##$CPDPRGB= <>
##$CPDPRGT= <>
##$D= (0..31)
0 0.7 0 0 0 0 0 0 0 0 0 0.03 0 0 0 0 0 0 0 0 0 0 0 0 0 0 0 0 0 0 0 0 
##$DATE= 1755174734
##$DBL= (0..7)
120 120 120 120 120 120 120 120 
##$DBP= (0..7)
150 150 150 150 150 150 150 150 
##$DBP07= 0
##$DBPNAM0= <>
##$DBPNAM1= <>
##$DBPNAM2= <>
##$DBPNAM3= <>
##$DBPNAM4= <>
##$DBPNAM5= <>
##$DBPNAM6= <>
##$DBPNAM7= <>
##$DBPOAL= (0..7)
0.5 0.5 0.5 0.5 0.5 0.5 0.5 0.5 
##$DBPOFFS= (0..7)
0 0 0 0 0 0 0 0 
##$DE= 6
##$DECBNUC= <off>
##$DECIM= 32
##$DECNUC= <off>
##$DECSTAT= 4
##$DIGMOD= 1
##$DIGTYP= 9
##$DL= (0..7)
0 120 120 120 120 120 120 120 
##$DP= (0..7)
150 150 150 150 150 150 150 150 
##$DP07= 0
##$DPNAME0= <>
##$DPNAME1= <>
##$DPNAME2= <>
##$DPNAME3= <>
##$DPNAME4= <>
##$DPNAME5= <>
##$DPNAME6= <>
##$DPNAME7= <>
##$DPOAL= (0..7)
0.5 0.5 0.5 0.5 0.5 0.5 0.5 0.5 
##$DPOFFS= (0..7)
0 0 0 0 0 0 0 0 
##$DQDMODE= 0
##$DR= 18
##$DS= 0
##$DSLIST= <SSSSSSSSSSSSSSS>
##$DSPFIRM= 0
$$ [...]
##$SUBNAM0= <"">
##$SUBNAM1= <"">
##$SUBNAM2= <"">
##$SUBNAM3= <"">
##$SUBNAM4= <"">
##$SUBNAM5= <"">
##$SUBNAM6= <"">
##$SUBNAM7= <"">
##$SUBNAM8= <"">
##$SUBNAM9= <"">
##$SW= 18.0517328524113
##$SWIBOX= (0..15)
0 0 2 0 0 0 0 0 0 0 0 0 0 0 0 0 
##$SW_h= 3612.71676300578
##$TD= 16384
##$TD0= 1
##$TE= 0
##$TE2= 300
##$TE3= 300
##$TEG= 300
##$TL= (0..7)
0 120 120 120 120 120 120 120 
##$TP= (0..7)
150 150 150 150 150 150 150 150 
##$TP07= 0
##$TPNAME0= <>
##$TPNAME1= <>
##$TPNAME2= <>
##$TPNAME3= <>
##$TPNAME4= <>
##$TPNAME5= <>
##$TPNAME6= <>
##$TPNAME7= <>
##$TPOAL= (0..7)
0.5 0.5 0.5 0.5 0.5 0.5 0.5 0.5 
##$TPOFFS= (0..7)
0 0 0 0 0 0 0 0 
##$TUNHIN= 0
##$TUNHOUT= 0
##$TUNXOUT= 0
##$USERA1= <user>
##$USERA2= <user>
##$USERA3= <user>
##$USERA4= <user>
##$USERA5= <user>
##$V9= 5
##$VALIST= <valist>
##$VCLIST= <CCCCCCCCCCCCCCC>
##$VD= 0
##$VDLIST= <DDDDDDDDDDDDDDD>
##$VPLIST= <PPPPPPPPPPPPPPP>
##$VTLIST= <TTTTTTTTTTTTTTT>
##$WBST= 1024
##$WBSW= 4
##$XGAIN= (0..3)
0 0 0 0 
##$XL= 0
##$YL= 0
##$YMAX_a= 110933
##$YMIN_a= -133180
##$ZGOPTNS= <>
##$ZL1= 120
##$ZL2= 120
##$ZL3= 120
##$ZL4= 120
##$ABSF1= 10
##$ABSF2= 0
##$ABSG= 5
##$ABSL= 3
##$ALPHA= 0
##$AQORDER= 0
##$ASSFAC= 0
##$ASSFACI= 0
##$ASSFACX= 0
##$ASSWID= 0
##$AUNMP= <proc_1d>
##$AZFE= 0.1
##$AZFW= 0.1
##$BCFW= 1
##$BC_mod= 2
##$BYTORDP= 1
##$COROFFS= 0
##$CY= -3
##$DATMOD= 1
##$DC= 2
##$DFILT= <>
##$DTYPP= 0
##$F1P= 0
##$F2P= 0
##$FCOR= 0.5
##$FTSIZE= 0
##$FT_mod= 4
##$GAMMA= 1
##$GB= 0.15
##$INTBC= 1
##$INTSCL= 1
##$ISEN= 128
##$LB= 0.25
##$LEV0= 0
##$LPBIN= 0
##$MAXI= 10000
##$MC2= 0
##$MEAN= 0
##$ME_mod= 0
##$MI= 1.114404
##$NCOEF= 0
##$NC_proc= 0
##$NLEV= 6
##$NOISF1= 3.799351
##$NOISF2= 2.8
##$NSP= 1
##$NTH_PI= 0
##$NZP= 0
##$OFFSET= 14.38212
##$PC= 1
##$PHC0= -1563.183
##$PHC1= 11.59228
##$PH_mod= 1
##$PKNL= yes
##$PPARMOD= 0
##$PSCAL= 0
##$PSIGN= 0
##$REVERSE= no
##$SF= 200.129724274929
##$SI= 16384
##$SIGF1= 3
##$SIGF2= 2
##$SINO= 400
##$SIOLD= 16384
##$SREGLST= <1H.CDCl3>
##$SSB= 0
##$STSI= 0
##$STSR= 0
##$SW_p= 3205.1282051282
##$SYMM= 0
##$S_DEV= 0
##$TDeff= 0
##$TDoff= 0
##$TI= <>
##$TILT= no
##$TM1= 0
##$TM2= 0
##$TOPLEV= 0
##$USERP1= <user>
##$USERP2= <user>
##$USERP3= <user>
##$USERP4= <user>
##$USERP5= <user>
##$WDW= 1
##$XDIM= 8192
##$YMAX_p= 0
##$YMIN_p= 0
$$ End of Bruker specific parameters
$$ ---------------------------------
##NTUPLES= NMR FID
##VAR_NAME=  TIME,          FID/REAL,        FID/IMAG
##SYMBOL=    X,             R,               I
##VAR_TYPE=  INDEPENDENT,   DEPENDENT,       DEPENDENT
##VAR_FORM=  AFFN,          ASDF,            ASDF
##VAR_DIM=   8192,          8192,            8192
##UNITS=     SECONDS,       ARBITRARY UNITS, ARBITRARY UNITS
##FACTOR=    0.0002768,     1,               1
##FIRST=     0,             0,               0
##LAST=      2.2672688,     0,               0
##MIN=       0,             -133180,         0
##MAX=       2.2672688,     110933,          0
$$ Real data points
##PAGE= N=1
##DATA TABLE= (X++(R..R)), XYDATA
0 0 0 0 0 0 0 0 0 0 0 0 0 0 0 0 0 0 0 -1 8 -8 8 -8 8 -8 16 -16 16 -23 24 -25 32 -34 40 -46 50 -57 65 -72 80 -90
40 -90 100 -110 123 -134 149 -164 181 -202 220 -244 267 -297 324 -358 397 -441 490 -546 612 -692
60 -692 789 -908 1058 -1263 1548 -1974 2689 -4103 8012 -46289 -133180 -59030 58899 110933
74 110933 44491 -53159 -90830 -34686 46694 82396 41174 -36904 -85421 -48793 43230 97066
86 97066 44490 -60364 -101800 -29723 72374 91637 11389 -72766 -73772 -1817 61870 61414
98 61414 6093 -51472 -62411 -14074 53342 72539 15095 -64505 -77100 -3273 76496 69664
110 69664 -14254 -78092 -53153 24493 67651 39005 -21933 -55055 -36437 12711 51739 44746
122 44746 -8202 -59277 -51117 15823 70137 46909 -31000 -73071 -32179 41686 64298 17917
134 17917 -40354 -50847 -12883 30867 43718 18555 -23823 -47631 -26121 27265 56931 24569
146 24569 -38837 -60834 -13620 49193 54672 -647 -49632 -41404 7077 40789 31686 -3443 -31372
159 -31372 -32104 -4862 30828 40397 7105 -39201 -45636 888 49187 41654 -13821 -51387 -29777
172 -29777 21453 43094 18493 -19303 -32740 -16146 11112 28520 22618 -6060 -34449 -29260
184 -29260 10657 43386 27673 -21782 -46596 -17717 30088 40549 6455 -29330 -29573 -2184
196 -2184 21412 23297 6546 -14887 -26047 -13808 16044 33674 14825 -24303 -37947 -7188
208 -7188 32297 33645 -3539 -34020 -23799 9545 27350 15713 -6383 -19097 -15874 -914 17207
221 17207 22429 4127 -23036 -27440 1107 30948 25270 -11045 -33569 -17069 17426 27984 8194
234 8194 -16071 -19604 -6099 9277 15484 10748 -4073 -18888 -16317 6810 26113 16350 -14390
247 -14390 -29534 -9829 20861 25513 1202 -21393 -17572 2419 15156 12134 646 -9477 -13258
260 -13258 -6039 9329 18999 8182 -15047 -23062 -3581 21604 20999 -3945 -22889 -13716 8736
273 8736 17992 7619 -7276 -11718 -6929 1683 9735 11528 1443 -13467 -16439 905 19462 15510
287 15510 -7616 -21488 -9475 12698 18242 3058 -12754 -12406 -1178 7497 8572 4265 -3074
300 -3074 -10235 -8595 3740 15069 9607 -9191 -18146 -5448 14282 16284 -504 -14786 -10612
313 -10612 3393 10840 6307 -1777 -6241 -6539 -2454 5445 10361 4371 -8889 -13961 -1629 13521
327 13521 12921 -3546 -15090 -8277 7269 12216 3581 -6116 -7492 -2347 2444 5541 5552 277 -7886
342 -7886 -8963 904 11749 9068 -5196 -13709 -5534 9200 12022 878 -8912 -7243 779 5903
356 5903 4568 1356 -2692 -5537 -4183 2787 8840 5429 -5499 -11284 -3226 9088 10233 -878
370 -878 -10132 -6491 3511 7641 3228 -2515 -4291 -2967 -488 3476 5418 2344 -5373 -7877 -873
385 -873 8429 8029 -2493 -9610 -4887 5360 8185 1891 -4710 -4938 -820 2510 3417 2403 -562 -4185
401 -4185 -4855 671 6589 5204 -3387 -8497 -3227 5949 7711 355 -6341 -4555 1324 4394 2765
416 2765 -342 -2182 -2940 -1657 1712 4830 2810 -3402 -6848 -1402 5688 5965 -737 -6453 -4010 2792
432 2792 5377 1695 -2159 -3227 -1212 405 2060 2872 956 -2983 -4488 -293 5044 4676 -1762 -6041
448 -6041 -3070 3525 5273 825 -3552 -3523 -56 2206 2007 751 -403 -2532 -2215 443 3860 2783
464 2783 -2223 -5271 -1804 3819 4664 385 -3756 -2869 1053 2843 1772 -366 -1628 -1500 -812 1278
480 1278 2580 1230 -2165 -3595 -865 3382 3639 -779 -4094 -2372 1892 3380 1260 -1906 -2292 -731
496 -731 808 1279 1383 112 -1915 -2549 6 3228 2487 -1237 -3509 -1736 2043 2966 309 -2333 -2200
513 -2200 484 1702 1448 268 -765 -1467 -1388 556 2279 1603 -1566 -2991 -869 2008 2554 -196 -2808
530 -2808 -2114 858 2111 1189 -300 -1125 -808 35 959 1393 327 -1488 -1969 -325 2331 2203 -356
547 -356 -2653 -1427 1026 2237 630 -1189 -1630 -577 929 1085 934 -166 -929 -1115 294 1870 1391
564 1391 -815 -2265 -985 1231 2160 471 -1352 -1553 3 1207 1089 151 -793 -839 -416 660 1459
581 1459 704 -864 -1420 -394 1005 1594 82 -1378 -1152 494 1405 863 -426 -934 -389 -57 1159
598 1159 865 125 -990 -1021 -8 1063 986 -79 -1654 -745 728 1419 434 -604 -935 -434 648 990
616 990 437 -526 -740 -438 384 1180 850 -453 -1197 -388 559 1244 334 -846 -755 -172 916 625 -81 -500
636 -500 -866 167 673 741 370 -676 -840 -431 937 770 -111 -779 -732 342 826 615 -396 -831 -679
655 -679 165 745 458 -287 -536 -584 331 659 572 -237 -872 -201 328 690 165 -678 -1008 -295 287 622 319
676 319 -144 -567 -372 360 495 291 -295 -454 -261 399 834 122 -355 -586 -200 560 644 22 -540 -430 -38
697 -38 331 334 183 -414 -622 216 469 597 -19 -565 -208 123 470 332 -183 -561 -304 297 512 152 -29
718 -29 -266 -452 258 738 37 -12 -562 -199 396 345 17 -516 -367 -197 484 406 46 -443 -498 -198 243 448
740 448 -27 -347 -305 -149 354 378 159 -287 -698 -75 149 434 75 -313 -193 -69 450 303 -200 73 -517
761 -517 -37 107 244 -196 -198 -193 -92 236 78 -87 -429 8 86 202 343 -360 -398 -113 290 327 47 -173 -249
784 -249 -158 129 185 26 -88 -345 -214 321 177 93 -216 -334 118 434 191 16 -111 -3 -79 163 237 -22
806 -22 -178 -131 -106 170 150 -233 -508 -235 46 256 202 -87 -95 -253 -234 -23 319 -78 -193 -161 -71 194 163 163 -490
831 -490 82 282 199 169 -277 -124 24 135 40 113 -100 -280 -17 84 414 89 -92 -342 149 99 61 -45
853 -45 -205 106 -142 76 86 -60 -37 -342 58 207 185 265 43 -154 324 -62 162 -148 -174 36 223 48
875 48 -101 155 63 -249 25 -40 107 -38 -96 -158 96 220 -157 47 48 -444 -41 272 16 -127 -156 -77 80
898 80 182 75 -143 -178 -23 196 188 70 -240 -141 -87 156 131 -107 -88 -65 273 -1 -48 -4 -198 -256 28 101 214
923 214 127 74 -613 -13 228 39 -171 -199 -49 242 223 35 281 50 -248 -462 412 169 -401 -107 -212 86
945 86 7 -307 189 134 -77 -14 45 -95 112 -47 48 -186 117 114 49 -67 -239 -25 334 -57 112 -38 148
968 148 217 232 -495 -15 -195 -76 152 78 -117 -149 -169 -277 -242 -210 86 9 -252 -154 101 208 60 -235 -41
991 -41 149 105 59 63 2 -204 -116 -59 478 212 63 -250 3 -56 38 -115 -140 83 34 -22 -89 14 133 74 37 141
1017 141 -53 -82 -323 163 -124 133 -88 41 -12 -19 93 -30 -56 -185 80 29 301 190 72 -277 22 -127
1039 -127 188 71 -46 -27 -263 22 -14 -68 -239 -115 117 212 -36 -263 -88 331 216 -237 -66 70 -9 -227
1061 -227 -161 30 -61 -75 -161 -152 91 121 -56 70 -86 -10 47 50 -14 -97 -149 -96 -98 -177 194 159 -7 69 -93 115 -40
1088 -40 -53 -101 -2 67 45 16 240 204 166 -301 13 312 -119 -340 -183 -119 360 141 -43 94 157 -155 262 10
1112 10 -35 429 -124 -21 -132 380 114 -193 -19 -254 298 43 50 -103 129 -31 -91 -48 -181 -156 142 -87
1134 -87 -169 -212 129 -61 -303 -149 134 110 7 27 -129 -98 152 323 -41 -144 -28 123 -27 -26 14 -144 -399
1157 -399 168 20 117 -239 -162 -61 -108 93 91 70 43 -115 -251 -102 -12 225 78 -86 -19 122 147 75 -405 197
1181 197 145 -437 -178 -230 80 -269 -54 -12 23 -43 144 107 -82 -44 -25 73 -81 52 -24 201 127 -90 54 -170
1205 -170 -39 87 -27 71 35 102 -153 -144 -133 23 15 -100 -89 64 -72 100 -103 -18 52 -83 51 -94 -73 130
1229 130 -46 -179 29 -290 -262 1 168 180 310 -25 115 178 6 134 -44 -250 -33 -196 1 0 34 -115
1251 -115 5 -63 78 187 -394 43 293 148 79 -67 -37 125 -100 -12 0 -304 -211 56 34 -127 -93 157 -100
1274 -100 -157 167 198 3 -53 127 -126 -40 -261 180 -86 -103 24 -323 3 32 -198 -102 281 -156 -204 -3 16
1297 16 185 90 72 17 30 186 110 174 -174 55 22 48 123 -144 -99 79 98 137 -53 144 -171 -244 -105 38 101
1322 101 -201 132 46 -118 65 -144 104 218 55 -272 36 148 -143 -358 -250 282 46 77 -57 6 91
1343 91 -46 0 40 -110 116 -87 259 68 -72 202 94 52 253 101 -104 -129 -351 27 27 -100 225 -42
1365 -42 -190 -24 109 -121 8 67 261 52 -34 35 -69 -135 112 14 -58 -56 -40 -46 114 -31 101 102 -85 82 96
1390 96 -225 -208 317 35 -38 -219 65 31 -236 -225 195 -12 256 6 38 -1 -17 146 -215 254 13 17 71 -48
1414 -48 -152 76 381 -99 209 103 38 70 -128 222 61 -19 122 47 128 -20 -113 -22 -10 -321 -153 -90 10
1437 10 -102 80 34 -92 -156 18 201 -134 91 -116 84 17 75 93 -42 -115 91 -60 279 -66 23 292 171
1460 171 65 18 208 63 151 58 212 -112 -215 -151 63 -112 -225 -88 -39 -328 -66 -192 -92 -135 192 9
1482 9 -141 -19 19 109 153 24 -257 192 261 -131 177 98 210 101 123 -151 -168 97 368 110 -142 60 -68
1505 -68 57 19 -158 82 49 -306 -93 4 -158 -52 -85 -202 22 70 -169 -145 -248 -216 129 -96 -207 -35 46
1528 46 135 163 46 179 -48 -217 -167 71 -208 128 1 207 142 22 23 83 -77 193 81 -7 57 -44 -52 -149
1552 -149 264 -39 -164 125 42 -155 15 131 -222 -106 120 118 94 -199 57 -54 -62 -159 -224 29 67 -197 -118
1575 -118 90 -121 300 -48 -123 -59 84 -176 -167 -80 52 339 -101 149 70 22 -143 189 -44 10 284 -142 6
1598 6 -90 -82 -38 -360 -15 -40 -20 76 -143 -140 284 257 -203 74 49 131 70 -259 -266 -36 70 78 -126 -38 -15 290 22
1625 22 -183 -40 35 -80 -239 227 196 37 -119 19 -85 7 15 -103 -50 242 564 -11 -63 11 -105 57 -64
1648 -64 -101 134 52 88 -186 76 352 62 -277 -157 27 174 36 -313 49 316 221 -176 -112 89 -114 -86
1670 -86 -107 71 -53 171 -211 50 55 237 -136 -171 92 190 -79 -111 -194 76 172 -75 -116 -141 272 71 -91 -334
1694 -334 59 171 90 8 174 311 82 -63 -233 -86 56 -214 -113 -62 164 251 202 -162 103 94 161 -176 -231
1717 -231 130 263 -2 -174 -58 207 28 -192 -343 13 47 138 -170 -207 81 491 -446 -495 196 153 79 -338
1739 -338 -34 168 207 -222 199 -18 142 -314 -214 -185 -173 158 343 -251 -49 122 158 -247 -178 349 383 -74
1761 -74 -400 38 -5 -64 -262 -335 112 342 -39 -121 188 121 342 -263 -271 106 203 319 -225 -246 288 259 171 -13
1785 -13 -23 246 -119 161 50 81 255 67 -312 -179 143 40 -428 -4 120 288 -67 -186 246 252 72 -17
1807 -17 -152 300 251 -130 80 -14 113 164 -111 -5 190 192 338 -221 -212 135 129 -430 -263 284 419 -320 -316 0
1831 0 47 210 -108 -179 -95 281 25 -428 144 340 355 -107 -197 139 185 129 -28 101 17 440 -176 -105 150 320
1855 320 188 -330 -159 117 -20 0 -139 59 313 39 33 -91 67 191 -18 -127 257 290 112 -207 -203 65
1877 65 403 -43 -166 -215 107 110 -323 -113 235 412 170 78 83 69 313 -187 -63 184 191 46 -82 -104 208 324
1901 324 -210 -353 61 101 33 20 -126 199 -72 -211 74 40 499 -42 -183 -143 -6 276 34 -432 -25 462
1923 462 162 -4 -395 -99 143 197 -283 90 316 84 -187 -408 310 201 -99 -258 34 211 -48 -249
1943 -249 -338 -120 141 -28 -148 -150 211 129 -30 -362 170 253 57 -101 -397 168 344 -99 -413 186 -149 81
1965 81 -154 -250 78 135 -86 -74 129 354 206 -267 -503 100 255 -192 -3 -439 -25 156 -20 6 -118 85
1987 85 -322 35 -97 230 -15 103 -320 -98 238 -144 -51 2 273 150 302 -178 54 326 -28 -348 -2
2008 -2 197 -78 163 -89 -55 99 265 -243 -25 -122 299 -12 -204 111 224 199 -240 -84 -94 26 148 -175
2030 -175 95 169 67 -104 -88 410 103 -119 -270 -61 135 413 -212 -166 -226 180 24 -118 -36 316 180 23
2052 23 -7 -114 88 4 -442 32 332 159 -84 -352 -70 206 212 -70 -11 -54 307 -152 -318 -77 -68 131 -2
2075 -2 -110 218 468 289 -288 40 201 -5 -337 -66 -89 -30 57 88 -69 265 329 263 -362 42 237 146 -274
2098 -274 265 59 173 -16 -236 24 105 -58 -126 -99 23 64 8 -66 -21 279 70 -65 -102 123 176 240 36
2121 36 -98 63 36 -7 -186 -16 369 106 -289 -155 77 71 -256 -136 12 204 -73 -281 -35 17 313 69
2143 69 -277 130 28 21 -134 -191 127 137 -205 -282 -140 -18 40 -102 34 63 364 9 4 -101 398 76 66 46
2167 46 -50 149 172 -101 -46 181 182 -333 -246 308 185 -78 -62 -210 -19 405 -322 -298 -199 40 79 40 -10 -65 262
2192 262 -162 -212 -17 52 43 -140 8 347 -51 126 -305 53 159 -96 -192 -40 115 27 -109 -196 269 55
2214 55 182 7 -41 214 45 225 -102 -36 257 21 -124 -18 72 310 21 -114 -49 -39 -26 -49 -9 154 110
2237 110 133 34 17 179 -57 -97 33 -124 325 -113 -18 100 364 136 -46 -172 43 -74 20 -141 -27 276
2259 276 -147 170 -297 42 175 -4 31 -229 136 62 -156 -176 178 -164 -93 -279 -260 301 -1 -192 -119 -38
2281 -38 157 -65 110 -243 25 192 51 -80 -54 24 111 -59 -25 -66 49 -42 -143 -58 -208 252 -248 89 -147
2304 -147 170 -151 -104 164 165 160 -196 -173 123 -246 8 -65 -183 22 82 128 38 -198 -48 10 247 50 -28 -91
2328 -91 -83 118 108 298 -133 150 -115 255 -210 337 -232 74 -173 58 -146 -291 -19 180 -256 88 16 138
2350 138 -146 -256 -337 120 163 137 -199 -140 18 57 -90 -72 -6 167 242 -53 -118 141 -49 -105 83 -240 212
2373 212 -291 -30 -367 -75 -19 -5 -187 -102 -38 188 -176 -222 -5 -7 174 3 70 113 -49 94 -33 232 51
2396 51 -94 -116 208 130 69 -126 -51 132 131 -2 -1 -57 142 158 -159 174 39 118 15 -82 132 -115 249 31
2420 31 99 162 29 47 185 -419 -36 -237 -193 20 -45 -59 -22 58 -44 375 149 36 -23 27 -239 72 48 16
2444 16 -34 20 -50 -173 -346 71 10 -110 -472 8 13 -143 77 -161 -13 79 -19 -81 36 -59 -132 181 242 198 321
2469 321 -116 -125 -13 97 -44 -14 95 32 134 207 -128 1 61 -104 -215 -94 -47 -252 -11 -69 10 -21 17 324
2493 324 54 -160 145 370 279 -6 22 -169 -242 21 -26 -179 45 140 -131 -96 -199 -97 6 -51 49 24 -183
2516 -183 -116 304 135 -197 16 -403 48 -161 -5 -234 62 238 116 17 -28 -139 -116 -10 139 119 -79 -77
2538 -77 -246 -198 -215 -30 45 -187 151 137 -4 -111 -39 -13 -47 122 139 -97 96 50 -33 -41 142 -308 -144 -36
2562 -36 -18 -163 -81 -206 -171 -315 204 90 -81 -31 -37 -38 -166 322 -50 11 -53 183 -98 117 -17 -135 75 67
2586 67 387 136 39 117 -70 38 6 47 7 -237 -31 80 290 76 38 -51 38 5 -41 -67 59 39 76 -49 -214
2611 -214 69 65 295 26 -70 267 -45 -68 95 41 129 -49 61 -396 -38 -7 55 -246 -50 -50 -66 151 -45 -43
2635 -43 130 -7 97 -78 -90 -16 134 -5 39 -52 30 -45 48 128 39 -96 -142 83 381 -273 -142 208 -60 2
2659 2 4 -141 165 101 -16 -17 23 117 3 -66 -189 18 -90 16 -236 71 -2 -165 -200 -248 86 78 177 117 59 -16
2685 -16 89 -66 -92 117 -174 -96 -47 -142 -58 148 -26 191 -382 48 -53 -76 74 -174 82 -415 -155 30
2707 30 -282 -103 -24 -129 61 181 175 -262 -64 22 20 -110 45 -79 89 16 -25 -11 -147 0 -49 -146 -161 91
2731 91 -140 -90 131 152 -60 -189 83 -12 -16 -169 -68 37 -78 -111 -98 -87 1 -105 145 135 -478 68 117 -8
2755 -8 -70 27 72 -68 53 14 -161 -4 101 -227 87 36 22 70 45 171 203 48 -57 216 131 52 4 107 -10
2780 -10 131 -22 -69 33 83 -8 203 -34 43 84 -182 -11 71 148 -129 -189 95 -301 9 228 -92 131 -44
2803 -44 -91 158 -53 -65 134 -38 -175 -60 368 -229 -129 64 -131 -195 -147 -246 -65 -71 61 -80 -329 79 33
2826 33 63 15 -125 -163 151 -20 238 229 87 180 198 21 -511 74 279 183 -49 79 141 -69 314 158 -5
2849 -5 -101 214 54 -62 -148 43 60 -1 19 206 454 -21 -147 -44 53 -131 32 24 -46 133 0 108 37 -343
2873 -343 266 68 68 42 101 -57 -80 126 -93 -111 -171 43 -27 -38 84 -12 51 -37 -50 -304 114 -15 68 279 -91
2898 -91 21 38 6 42 24 -1 107 -2 -39 48 -26 -106 -106 154 -4 363 25 360 18 -119 52 -243 -101 -36
2922 -36 -67 -54 32 -102 4 -168 -27 -143 64 -4 58 -285 29 -42 196 -57 180 12 60 60 193 60 -30 -148
2946 -148 117 57 -496 -2 258 120 -26 -3 -119 -213 70 -174 -45 37 4 -101 151 159 46 41 -98 120 -89
2969 -89 78 140 245 -117 -208 -21 -24 -190 -139 22 117 -170 88 182 -110 -216 -4 -37 -178 74 -155 -140 -117 309
2993 309 173 239 -85 -103 123 -7 1 106 64 45 -136 135 -44 -8 25 -175 -113 -82 0 -21 -152 -185 18 -36 -48
3018 -48 -16 31 14 -47 -71 -14 -72 -52 -60 157 306 45 25 -158 182 52 -106 45 -6 299 25 -13 47 92 19 40
3044 40 11 270 -215 -198 -38 108 96 -164 -15 -315 -24 59 -99 -119 -97 -70 47 -235 114 226 89 96 13 -48
3068 -48 -66 -27 108 486 -71 25 -100 1 -121 42 84 -47 -441 -272 100 -58 27 3 74 -32 -76 37 52
3091 52 288 79 125 5 38 -226 111 193 -233 248 -80 150 55 152 -86 -142 108 -56 57 88 124 39 30 15
3115 15 317 -7 31 -304 -305 15 71 -259 -235 8 70 125 113 192 -163 251 -122 13 56 -80 -197 156 -70 -61
3139 -61 -186 -136 66 -80 -7 202 -125 208 -39 -185 177 22 -297 295 -116 -98 253 37 145 92 -264 -249
3161 -249 -145 248 -19 7 -85 -74 123 -13 -43 76 8 132 64 1 -41 -30 15 -146 232 42 177 -71 -16 66
3185 66 -76 -217 -83 111 -18 141 -176 -53 177 263 177 -52 10 -5 40 142 120 287 -173 303 517 46
3207 46 22 -174 -181 -5 38 175 80 -135 -70 185 74 -28 -127 78 118 -102 -14 43 91 -161 -36 -22 60 150 -2
3232 -2 90 85 120 -88 -47 -11 176 141 123 339 -238 -193 81 -103 68 167 -80 -26 112 75 -158 22 -47 58 -50
3257 -50 102 46 87 -234 16 -52 -102 -238 -173 136 -221 -231 145 422 167 -241 112 148 56 188 128 218 -199 -132
3281 -132 -100 -175 -172 102 225 196 86 -192 -153 213 -156 -123 55 -82 -30 -141 204 68 -89 61 -55 -6 -54
3304 -54 -221 148 93 -168 -288 -117 160 4 72 23 -166 383 -68 12 -76 102 78 274 -44 18 148 -122 95
3327 95 278 -155 66 87 -75 -64 -19 -76 -91 30 237 77 57 -162 -130 -58 -79 -125 -64 61 -139 -32 108 188
3351 188 30 5 -40 -18 83 129 -121 92 72 54 126 -155 210 -72 -162 74 10 308 -51 -129 -80 131 -10 7
3375 7 -110 85 201 -128 168 -58 -89 43 99 -25 -2 -90 241 -134 42 -95 -43 129 -170 -24 -130 125
3397 125 129 -112 118 166 150 85 -68 -57 64 59 -169 140 -71 100 -247 -7 -151 -182 -74 31 -208 141 -72
3420 -72 17 114 -125 -36 -12 6 263 -148 84 -70 -191 81 -88 -81 -69 -146 -1 179 134 100 -88 15 13 -110 76
3445 76 231 116 183 -125 189 -57 58 -97 -128 -187 44 12 24 28 -13 375 122 -58 -91 72 168 -34 100 3
3469 3 -166 149 21 25 38 189 -254 12 -68 90 -119 46 -199 175 -139 -106 214 171 55 -325 -19 -24 -22 203
3493 203 333 120 -79 44 -87 -181 118 -115 77 109 -294 31 -38 100 -196 108 197 -122 2 -43 -335 -161
3515 -161 -65 -8 -149 -128 58 24 17 19 -202 83 -2 -72 85 -23 48 -148 48 -2 0 -104 -210 -117 -113 -326 14 24
3541 24 51 -37 167 68 -75 -96 -194 328 -240 18 -168 156 66 227 -23 -124 -59 70 -247 158 -244 44 -137
3564 -137 -139 4 122 -143 8 128 -98 42 74 -160 1 123 14 -46 -129 -357 -7 -48 -326 97 11 50 48
3587 48 -114 50 -71 307 31 -70 34 34 -75 79 -193 -51 65 15 105 100 26 218 -147 27 85 -38 315
3610 315 1 -26 88 -198 159 -73 12 -315 -86 202 235 -152 4 61 -276 244 64 8 -109 -355 -24 -40
3632 -40 -200 35 -202 211 -125 106 103 -44 9 -86 196 0 10 -60 73 286 101 233 302 4 -64 79 214
3655 214 100 69 123 -105 -275 74 -153 -34 -151 -63 1 -143 -58 -12 174 -24 -86 74 -98 -248 -124 -17
3677 -17 -54 258 183 183 13 -83 212 -66 -197 86 -73 -200 46 163 -6 100 240 -72 171 -6 -161 173
3699 173 -53 68 -36 -177 -105 232 7 12 160 -238 -41 -12 111 -34 -314 -92 140 59 -45 165 -85 -131
3721 -131 -152 -7 -81 -16 2 -215 36 -27 -133 135 98 17 -124 386 11 -88 203 -73 92 -68 -68 52 53 -108
3745 -108 -125 157 149 54 -27 75 -100 -47 58 103 -44 -332 125 141 112 229 64 22 64 -79 144 -120 26 23
3769 23 -31 -3 83 9 -40 -77 120 -8 136 119 55 -62 -220 86 167 289 196 -42 6 104 -62 -285 -49 -140 137
3794 137 5 161 227 -168 2 -82 -10 197 -104 -49 108 151 -190 -26 -150 108 -89 -160 -166 137 -163 -27 268
3817 268 17 -128 64 -89 -171 51 -132 118 -265 200 66 89 -105 -243 202 -263 89 -396 -131 -112 -115 -208
3839 -208 62 -102 -82 -104 -164 -26 93 98 39 161 -190 80 132 -85 32 -25 -1 101 144 85 -82 -132 33 -41
3863 -41 -53 -30 52 -5 218 146 169 190 137 -44 -117 115 -188 190 -104 -99 -159 -215 54 179 11 218 -129 8 -108
3888 -108 -173 75 193 -37 -97 -197 95 132 35 -106 -72 63 217 84 -173 4 -153 26 71 184 -307 -130
3910 -130 -227 -8 131 146 -44 -169 -9 15 -207 7 -130 169 126 -114 -22 261 90 -197 -34 -185 -141 62
3932 62 98 60 148 35 -85 17 -114 68 37 266 -105 28 163 -151 -33 198 -293 13 134 -32 -239 318
3954 318 -163 -5 -34 -12 162 -15 103 -134 73 157 128 -107 202 -164 71 190 -265 -135 -138 165 79 -144
3976 -144 -156 67 -44 -248 -202 -109 -6 108 280 -309 -122 17 -4 207 179 -2 -122 70 37 8 -281 -212 49
3999 49 -64 68 240 -254 -122 -189 85 -173 -81 -250 168 122 -279 -14 -228 24 -80 -224 -36 -104 -72 -125
4021 -125 169 -62 157 66 -13 -137 106 -55 -116 47 104 271 19 55 54 80 258 -17 81 -115 -45 38 2 19
4045 19 46 -8 -385 -164 183 178 -51 52 -229 -104 279 -123 -185 -67 -54 -125 58 43 46 -76 -76 -187 37 -212
4069 -212 143 -222 -126 -39 -224 182 9 -169 136 36 -66 -176 182 118 132 260 -146 64 -122 277 -116
4090 -116 -68 31 95 -258 -186 -17 290 120 92 72 210 -84 32 63 -193 -289 196 86 -43 163 129 127 -126 139
4114 139 -64 -121 144 -186 92 -5 14 -79 -173 54 -278 -41 141 230 58 -141 -4 -39 185 100 115 219 47
4137 47 102 86 200 82 -112 -103 239 -132 -113 -142 21 -32 -24 181 4 -58 -210 -214 104 -152 -47 -25 -53 32 78 191
4163 191 49 -30 183 -182 209 -15 -81 67 -189 338 -4 -244 -254 140 143 11 -37 22 127 -248 -133 -41 110
4186 110 -55 195 65 -60 -114 71 56 -268 -93 -30 -132 -52 -119 -32 26 196 -107 13 173 13 -110 257
4208 257 -83 -26 3 55 149 -333 -165 163 117 5 27 -54 -307 -56 66 3 33 41 -89 -66 -81 235 108 142 269
4233 269 -91 -157 128 -63 -132 -43 166 35 -154 -40 -14 71 -20 285 184 142 43 -44 -258 19 -36 14 -55 -135
4257 -135 98 -40 -220 -141 -81 176 -67 -25 -99 280 143 96 -5 73 171 -104 -65 -477 -151 232 183 13 -190
4280 -190 -41 167 29 -351 -66 -138 75 -61 -162 -113 -87 -150 -9 4 -103 93 -64 83 -41 -3 -34 45 228
4303 228 -109 -244 -312 118 79 81 -24 53 -124 91 300 4 -22 65 141 149 152 -14 -182 60 -200 22 88 -101
4327 -101 -71 178 112 77 -43 -218 -67 -175 59 -50 -35 -55 213 -23 -237 30 -96 -203 49 -368 -85 -286
4349 -286 287 -105 -94 244 76 -290 -282 164 -198 36 -198 101 -227 55 -15 158 -88 -113 -210 -67 126 6
4371 6 129 -162 -91 -240 -220 106 272 -193 164 37 -91 161 51 -126 -138 85 -31 -48 101 240 -115 56
4393 56 86 -118 -50 -35 295 242 161 95 68 -127 -91 -101 20 170 287 -194 -155 79 256 82 222 -121 -55 -108
4417 -108 -24 31 -153 -238 -102 -60 41 199 108 19 167 41 -41 -127 120 -206 -55 -169 -202 -199 101 20 65 187
4441 187 -183 -57 80 23 2 114 99 -136 138 4 161 11 16 33 -35 125 -151 -4 -220 17 -63 8 -141
4464 -141 -63 -183 136 -162 107 116 -136 18 -181 2 -131 145 33 -352 -150 103 -27 -281 -210 132 -1
4485 -1 76 100 129 176 -155 -35 -266 -145 -50 358 57 -154 -122 51 54 121 153 -18 -103 -42 -82 -65 -127 -187 74 33
4511 33 -64 70 -63 -94 -15 -69 67 79 45 123 -272 -17 -50 -143 163 144 253 137 -36 83 231 -62 -172 -50
4535 -50 -37 1 -161 148 -178 -135 256 153 115 161 -1 123 -173 11 -184 -37 138 -189 96 -96 -10 314
4557 314 83 4 -133 56 305 300 107 94 -50 207 -86 -116 146 30 46 43 -84 -180 -211 -105 67 152 119 1
4581 1 -168 227 -111 -99 -127 2 -301 129 -17 63 102 127 -161 -4 6 14 109 -144 198 96 -155 -32 -155 44
4605 44 -189 -122 121 -154 197 -138 -143 -62 265 -16 204 -89 75 -107 -172 -194 14 56 79 148 8 -134 -145 59
4629 59 366 143 -17 60 -240 -140 49 -50 11 267 -226 78 29 198 -33 176 -46 15 -18 -6 -135 -70 -103
4652 -103 119 -21 309 208 129 -217 -265 -19 -87 -16 59 34 16 -1 97 -77 147 -90 68 -142 89 -67 -51
4675 -51 -247 -180 98 -30 -14 -164 64 168 234 63 -185 -81 -316 -215 152 233 -318 48 -39 -71 118 31 125
4698 125 -13 42 23 174 -230 -50 7 -30 -131 -301 -75 -159 -102 140 134 32 -28 -23 -143 115 -35 54 -91 15
4722 15 -163 115 -275 30 -258 87 14 9 24 -82 -9 94 -263 86 -29 87 -242 65 68 -193 -91 -207 -22
4745 -22 -192 126 -126 3 -108 -42 -242 144 59 -75 119 26 -65 -17 -246 356 -177 71 349 193 15 -9
4767 -9 -132 12 -325 -82 -17 131 140 2 207 36 -132 -79 249 -54 -12 -86 -279 -43 339 -170 -95 85 -99
4790 -99 283 49 -70 -253 -105 -32 24 -7 44 170 133 -189 69 213 -119 102 14 -102 2 -47 240 127 13
4813 13 220 -110 166 271 64 158 121 67 74 -81 15 -66 -117 -226 156 273 109 -175 57 39 156 -110 -96 157
4837 157 -61 22 -212 -197 29 105 -56 69 -200 143 -57 26 191 -162 21 72 65 135 -141 358 -109 -152 73
4860 73 45 -80 -334 75 -28 90 -256 14 -183 143 -22 12 -27 -40 119 -243 -4 -45 -171 -28 167 -63
4882 -63 -71 0 -69 -159 56 -18 162 -129 -96 -187 -168 -57 -146 162 13 211 67 -5 51 80 -280 -77 24 -120 135
4907 135 -10 42 338 -257 -160 199 -216 146 -27 80 104 14 -101 -24 426 -98 -15 -44 141 53 -119 -427 121
4930 121 67 58 197 26 59 99 86 -138 -68 -176 -73 -20 85 97 33 -342 -128 -41 118 240 -185 -42 -25 -107
4954 -107 -244 31 -155 -27 15 -138 -200 -166 -88 46 142 -8 72 -125 -61 131 121 -100 128 107 219 -45 62
4977 62 64 93 23 -201 -64 13 106 15 115 150 52 239 -206 -276 8 115 57 22 -53 180 -12 100 -161 248 240
5002 240 -143 -17 -77 154 -31 32 168 -44 14 66 -66 -162 -85 -12 238 24 -80 53 131 -64 92 94 225
5025 225 -275 -54 235 65 125 109 3 -52 94 -37 -37 134 92 -54 -374 135 124 -5 -127 -120 99 190 -47
5048 -47 -69 -82 288 -79 138 53 -214 238 -85 -71 -141 -164 19 10 19 -178 -85 -212 121 -151 -35 -96 -218 -131 -222
5073 -222 30 -91 108 -123 -39 -14 87 -81 39 -7 -158 -37 120 54 -82 -283 118 265 -110 -228 -117
5094 -117 182 -153 203 -65 -84 -1 -61 -261 178 -89 -37 185 -83 -89 21 -9 -16 210 -57 168 -192 -158 -51
5117 -51 235 -162 29 18 -46 -274 31 -121 -119 24 -81 -211 64 -289 -16 -79 0 22 103 24 -190 -351 193
5140 193 -31 39 -131 -305 288 156 -15 115 77 304 -43 -37 -181 73 130 36 47 -32 -141 -191 90 -101 159
5163 159 82 95 58 -43 91 52 103 -84 116 219 -66 116 -207 -314 125 -185 51 90 74 149 87 -109 140
5186 140 -55 -17 95 119 -150 -68 -131 74 -217 76 -48 74 -105 -52 4 -93 -25 252 63 -60 202 -187 263
5209 263 299 -191 44 9 75 96 -66 -6 -57 -203 -30 156 151 8 72 126 24 -105 -50 -89 -174 92 -77 -5 282
5234 282 123 -108 16 129 -71 -66 -56 62 103 -190 128 29 -93 -237 -314 -161 45 -18 134 -442 -97 -69 112
5257 112 -51 -252 71 -8 108 2 -84 215 198 -123 148 -177 -157 118 -87 41 190 -98 217 -114 12
5278 12 9 34 188 17 132 -11 -19 180 35 -83 -117 -124 -88 204 7 83 407 -135 -45 -251 186 -95 -67 -45 -53
5303 -53 -134 -270 -74 -90 -138 188 -105 -22 -18 166 110 87 19 84 -209 -34 -75 -193 223 -136 -105 6 39 175 -4
5328 -4 94 239 67 62 114 -104 62 45 84 -60 -177 22 140 171 -26 -208 43 -52 20 -103 -2 125 42 -138
5352 -138 133 -305 62 -57 55 66 -160 -75 79 106 -86 121 148 121 -30 68 -119 -157 -123 14 -118 126 -85
5375 -85 44 -230 -149 -57 394 -105 -21 176 -42 -27 -127 25 -121 -126 207 -71 46 125 158 -200 -24 -233 73
5398 73 73 32 -139 -24 -96 -16 -74 239 -236 -36 162 199 64 -206 48 -140 17 169 -48 -109 7 -2 12 111
5422 111 177 -60 56 210 -179 -81 56 23 -27 -261 -10 334 -54 27 152 119 14 69 127 66 8 -131 -110 -83
5446 -83 -218 128 -26 -89 13 -72 -163 -63 -190 147 -27 8 74 -73 -203 -222 191 147 133 128 -120 86 -100 -34
5470 -34 -255 -101 108 -82 69 111 -9 49 -23 28 57 5 96 -35 -152 -116 -26 68 -110 113 -39 39 35 -39 93
5495 93 -250 27 22 -82 70 45 126 -81 -60 101 126 31 167 -167 37 166 -15 -29 116 121 -163 -117 -49 309
5519 309 -98 262 -145 -45 -290 27 82 56 -2 39 16 -19 -88 31 112 -119 74 -79 9 -364 61 -62 -89
5542 -89 -140 -262 -215 -345 82 60 141 -9 175 45 -14 66 -54 107 270 22 -17 40 -79 -28 126 -194 59
5565 59 19 62 90 122 114 -241 -235 132 -10 -122 86 81 20 8 60 -4 -214 -30 -143 259 -144 -75 -45 56 22 27 -125
5592 -125 -260 -124 70 50 -113 60 -3 7 86 201 255 50 12 -81 -9 -197 186 241 113 -104 -266 -324 -35
5615 -35 139 -49 74 -25 -218 253 53 96 -29 44 49 -127 219 -316 -29 202 15 -171 -88 -111 -289 -112 -193
5638 -193 65 -139 67 -23 -1 -52 -114 -180 215 -43 -123 79 85 -92 103 110 70 -154 -222 -162 229 -34 -140 -223 42
5663 42 -279 130 106 -24 -204 147 -72 83 -178 163 254 67 114 206 8 78 164 364 -12 64 362 115 -82
5686 -82 -42 43 -48 -41 260 242 -41 -35 -162 -99 -63 -4 -171 84 1 -23 17 -196 -142 -11 79 -251 -108 1 -46 107
5712 107 146 53 9 6 -110 290 -22 -119 -51 200 48 -34 50 27 -1 -36 51 20 118 -56 -24 -71 62 75 74 6 -66
5739 -66 -91 -102 -24 241 214 -205 -177 -342 160 -72 -169 5 -99 -36 -45 -25 -137 -48 -174 -62 255 2 113 157
5763 157 -273 -31 -85 -132 32 31 3 0 -104 267 -162 -52 -29 -59 -64 -16 -183 -248 -14 -147 89 20 146 125 -218
5788 -218 -64 187 76 -64 -48 -109 3 55 -83 -50 2 -114 -64 -146 74 -78 -252 -189 50 141 -151 -199 -106 97
5812 97 -12 248 -187 -94 -64 198 -121 203 117 270 2 -325 -101 -129 167 -117 147 113 -302 -2 -162 48
5834 48 -172 -155 -68 -1 41 125 -218 220 -308 119 47 -139 5 -42 196 65 137 320 41 -45 -152 149 289
5857 289 26 -256 -228 -212 115 -187 -169 -161 -10 51 40 -128 177 222 -29 25 94 -9 140 1 67 254 135 -109
5881 -109 -195 151 64 -41 -105 78 95 17 -195 -37 56 -177 -63 -18 140 409 14 212 -83 14 -62 93 57
5904 57 -215 -297 64 7 -78 241 -41 194 -31 98 -126 -42 -74 90 157 -150 -218 -283 -137 -54 -138 -233 104 -56
5928 -56 -13 -28 243 -17 11 -240 -105 -107 -96 129 -43 70 -52 288 192 -101 -29 -247 204 -12 157 -138 -232
5951 -232 253 -97 -170 -49 182 -247 -97 15 109 20 -2 -30 -49 28 -217 64 -79 51 102 -265 -148 50 149
5974 149 -9 190 22 -150 -80 29 264 50 -129 -201 188 120 19 138 218 -237 -113 -2 101 123 -88 -112
5996 -112 32 -86 -271 30 14 45 -121 98 197 29 26 150 -49 171 -112 124 90 -89 -95 42 -24 219 -51
6019 -51 -40 -89 131 -128 245 -87 142 118 -211 -15 -136 71 -148 -243 100 73 24 -164 -267 268 25 -156
6041 -156 43 -37 -277 -120 -212 264 61 240 -13 99 141 50 -58 -271 147 86 29 -72 254 77 157 -79
6063 -79 -110 149 -102 -228 104 -69 -4 -100 -170 -311 -61 -47 -145 94 -54 -50 -14 196 -42 205 178 -330 -325 307
6087 307 -138 114 -36 98 -58 34 55 54 -68 -55 -38 280 83 79 -97 245 -107 -18 137 7 173 -10 256
6110 256 -206 56 202 159 -76 115 -42 -379 64 132 -17 220 -102 2 32 -183 -100 54 -84 -54 72 -27
6132 -27 189 -178 -143 -69 63 28 15 130 1 -134 274 -40 -36 21 13 104 188 -249 85 89 -207 -120 -58 110 304
6157 304 310 104 -73 -94 72 -219 -277 160 1 -183 191 54 88 -74 124 184 337 -227 146 -108 -24 87
6179 87 -175 85 -49 158 -63 130 47 84 -183 102 -50 -134 151 -185 -64 6 249 -6 -17 49 179 29
6201 29 -8 -83 59 13 -128 -65 -138 -97 -35 -107 -110 55 17 9 -100 -144 21 182 199 -11 42 79 296 276 146 35
6227 35 99 -208 -22 -168 -132 -88 217 -6 -84 -46 -256 -32 -32 -160 215 33 102 311 -218 47 62 70 -232 168
6251 168 -32 -12 -280 -299 134 -118 -177 -99 -47 -221 246 -34 61 -103 -144 -71 153 -27 21 -235 -250 203 -36
6274 -36 -211 67 270 16 96 53 -142 461 -277 152 -33 85 -124 -59 139 137 -80 -176 12 140 -159 18
6296 18 -107 -2 73 19 79 -4 -253 -229 111 -64 32 408 216 -25 -77 209 -76 -29 294 253 -35 -138 -37
6319 -37 -57 19 -67 -26 -20 147 -77 264 -263 123 170 -179 166 248 -157 -68 -174 -26 36 107 55 129 264 136 156
6344 156 -193 -120 231 -191 96 103 -21 82 89 -195 4 -140 -100 -148 383 180 -124 -104 -98 23 -344 -81 -55 -149
6368 -149 38 11 -237 -290 79 -51 66 215 119 -185 -220 -53 235 51 175 262 -196 11 162 -147 235 63
6390 63 152 186 -296 -7 -127 -85 -95 142 -23 95 -6 -2 -63 -64 125 -257 174 175 225 -64 -21 1 6 192 116 153
6416 153 -89 -78 -239 39 -204 93 106 133 470 -47 -80 122 78 -51 -125 112 173 337 69 84 -152 176 55
6439 55 -33 45 128 179 -122 -19 27 66 -60 -61 -241 -93 23 73 -73 128 133 -197 -80 -284 31 -334 113 252
6463 252 -9 -64 -84 60 -319 84 44 174 222 169 80 -14 -197 105 51 -219 -1 -115 142 -117 138 212 -38
6486 -38 -63 -111 -98 -100 -78 -106 -89 -6 -75 -242 -125 -173 6 -162 83 -72 58 180 56 -79 229 -139 -136 200 -68
6511 -68 23 91 -165 234 70 128 -48 -313 21 170 5 66 -2 24 83 168 -94 42 -288 73 -179 -118 -75 -320
6535 -320 11 73 279 -129 -112 -53 -97 -200 166 211 4 -133 -94 53 16 -43 -190 -93 -28 126 210 125 -74 -107
6559 -107 183 83 16 -400 18 17 59 61 -24 13 32 91 -67 76 237 -3 384 42 147 250 285 74 -31 150
6583 150 -149 132 72 185 89 -4 122 204 241 -3 -103 102 -311 -147 -218 194 -139 50 124 61 -15 74 101 274
6607 274 148 141 -27 173 107 -124 -121 139 168 46 -54 -40 -44 -88 68 161 72 -92 87 -70 -187 79 -137 -31
6631 -31 -176 -24 166 -252 -26 -302 71 -34 275 93 -228 37 -119 93 -180 181 110 -58 -59 -199 -26
6652 -26 -121 174 -83 154 59 60 -73 11 47 -229 -11 107 -19 -209 -160 85 11 176 -318 174 235 -76 14 87
6676 87 62 140 -87 246 236 -15 146 -85 -76 82 -43 -78 151 -32 -78 -19 43 -201 -76 164 26 89 70 -114
6700 -114 143 15 53 183 28 32 105 -117 155 -229 246 111 6 -4 118 155 -21 -118 -168 -91 49 -9 -51 -25
6724 -25 61 72 -101 -159 -58 -30 209 -1 105 -104 -167 -138 8 -197 -170 89 22 -169 3 -244 -185 -106 2 -6
6748 -6 -41 -13 135 -103 141 122 -31 -216 52 -96 -152 193 102 -1 -26 38 -12 -10 -202 133 -117 -15 279 226
6772 226 -120 111 -38 -149 93 -67 -180 137 227 7 -83 -55 -6 -276 -421 -242 -220 66 229 56 212 -64
6794 -64 169 186 -70 42 -35 -29 -86 177 -146 -61 256 230 -35 87 143 218 76 58 -49 163 -61 -84 253 55
6818 55 -208 -75 -171 -257 205 47 168 -68 -50 27 32 -111 43 -162 18 -36 -20 -109 20 2 62 -171 -28 -75
6842 -75 -35 -140 -6 -52 209 -42 165 73 -144 251 -72 166 145 -220 -36 -209 -309 -50 43 -68 -181 78
6864 78 17 -132 -155 -150 111 73 -47 -75 -271 -105 -32 -211 -187 112 153 138 112 -47 -102 -103 -44 -76 159 -204 -152 170
6890 170 -145 158 199 432 -18 -54 173 -378 61 -33 47 -47 -26 75 50 34 81 -137 68 -143 58 294 33
6913 33 -57 -146 -331 -111 -116 16 -147 79 -36 100 175 68 278 -143 97 -36 39 210 -75 -50 -315 24 -212
6936 -212 2 -7 31 153 -169 211 179 -151 -104 175 -95 -158 -197 -28 -308 70 149 -13 -86 -157 -199 -12 -37 -25
6960 -25 179 -53 -202 -26 -16 -162 201 -80 151 90 123 97 -204 89 -120 309 -23 -70 -146 32 15 -97 301
6983 301 191 46 -150 -179 -32 -147 -348 -148 106 -66 -155 -64 -53 136 -139 75 126 -64 -160 70 159 154 141
7006 141 89 163 19 47 -64 248 -8 76 -132 91 -38 178 195 -70 206 92 -152 5 117 -49 3 -103
7028 -103 -113 100 56 -73 -100 -300 -139 196 224 106 54 -261 -204 -251 75 118 16 94 -163 271 -37 76 110
7051 110 144 -65 261 -189 66 81 -127 389 -74 -32 -151 -152 212 -99 94 -105 173 250 -159 30 -220 -161
7073 -161 185 47 90 24 -27 -383 55 -125 44 32 19 -2 2 -151 -2 -107 10 176 -41 52 -6 -19 -83 87
7097 87 295 67 101 249 -88 -160 228 -32 -64 75 -92 -128 -119 203 141 70 -314 20 140 -42 41 -86 -32 -46
7121 -46 283 1 94 -207 -117 29 116 204 153 -91 -12 -46 36 -78 -31 -272 -82 -45 298 -12 1 -35 -122 50 167
7146 167 156 -154 219 -256 239 -370 -145 -225 68 7 51 9 8 44 -223 109 -412 45 89 -77 49 -137 -97
7169 -97 -72 54 303 54 -116 -41 124 -115 43 44 10 -34 -169 -25 -34 -40 -24 -122 50 72 -59 -52 -12 -23 -169 193
7195 193 47 90 -104 -95 111 -230 -457 132 4 72 -324 -271 -303 -83 -96 101 7 -101 -141 15 80 129 -18 69
7219 69 -180 -189 67 -60 88 97 9 124 106 97 265 91 61 -16 -1 121 236 81 -152 317 -237 -239 31 -169 -114
7244 -114 -54 177 -162 131 -78 71 228 104 -190 -47 -75 31 93 104 97 154 -156 -26 248 -23 -78 -82 68
7267 68 -95 -9 -98 300 -24 -79 -215 -10 45 118 -97 -89 6 -130 -278 104 -57 51 -61 147 -29 -53 14 -6
7291 -6 -66 -53 328 22 69 -42 -39 85 73 -243 87 -26 109 128 162 142 -107 -42 -42 80 58 155 -86 74 -130
7316 -130 207 20 -132 -170 -244 27 152 -13 35 -178 -194 -6 131 -158 204 236 -57 297 -55 -34 -92 99
7338 99 69 -47 -105 -80 173 16 -123 -125 234 -114 53 163 -67 -304 67 12 18 191 138 -293 299 -86 172
7361 172 175 -16 -186 -108 17 -126 182 -82 -10 -90 -122 100 -29 -110 157 228 94 61 187 -107 226 -31 -22 -89
7385 -89 37 202 -96 -91 -190 200 -389 -39 24 -106 -26 8 106 -207 -176 159 -1 -26 -9 -50 -49 39 70 -73 -78 149
7411 149 175 134 28 116 235 328 -154 -266 99 103 -86 -70 -210 -60 156 26 164 337 -119 -131 114 204 133
7434 133 153 154 154 15 -112 -18 -20 88 -362 -16 -35 -26 -30 -186 -13 -125 -99 84 -4 38 -42 468 83 141 33 108
7460 108 -5 105 -125 -62 203 -218 -106 50 73 -143 5 -120 -109 46 105 -58 -43 -115 -38 108 109 187 75
7483 75 -117 -48 -32 -282 -21 -271 -298 -327 -231 -175 78 -342 245 -109 -122 121 -79 69 -75 70 120 144 84 245
7507 245 32 85 -144 -66 96 122 16 216 138 63 -96 -65 74 -72 141 160 38 -10 164 24 -101 -50 -218
7530 -218 -283 151 -17 -11 -125 72 2 -151 -10 -9 312 144 134 126 -135 135 -90 -106 151 35 44 98 185 34 -161
7555 -161 8 -108 -108 60 -73 -92 -131 238 43 99 -266 -137 -214 32 -334 -100 -285 -154 150 221 382 -22
7577 -22 38 -129 -39 -172 34 -67 -202 72 32 146 -53 72 116 -22 -333 14 18 -51 -68 -148 282 159 -65
7600 -65 33 -68 -62 -36 85 -217 -106 67 228 55 -43 -74 271 -29 159 100 -90 -195 20 -114 82 -28 -105
7623 -105 18 202 21 175 -196 -75 86 -183 -154 152 -129 55 139 140 47 -36 -262 -99 56 -231 -119 21
7645 21 162 316 -92 154 201 33 -124 -94 -116 -79 45 78 116 167 235 -151 140 -126 34 127 60 44 -88 -27
7669 -27 -189 -214 247 181 129 191 122 -83 106 170 -12 -48 -12 -33 26 -110 21 -83 -48 267 133 -152 -76 -196
7693 -196 -32 -192 -80 28 -370 -115 172 -221 165 177 21 -62 153 53 -16 -16 -20 235 21 -19 -193 -233 -63
7716 -63 -119 118 -156 29 40 -17 53 101 10 -209 -30 234 -96 70 98 -58 104 -111 250 -93 62 158 221
7739 221 -302 -65 202 60 66 -19 86 -59 273 -33 -12 553 -53 129 294 -38 -167 73 7 7 -32 -24 106
7762 106 -159 -157 -12 57 -180 43 80 -157 -127 -86 -269 160 -211 -29 -164 -50 120 109 374 78 -9 -131 106
7785 106 13 130 -97 -112 268 -94 -201 233 52 -62 78 54 -67 88 90 109 -74 51 -118 -101 176 -223
7807 -223 -90 93 82 254 199 49 33 122 115 110 -60 -149 -141 -73 -93 -121 -42 86 188 151 -191 16 -92 -106 -117 52
7833 52 -150 5 -81 59 177 108 -201 -55 50 -204 -175 -79 -165 35 225 -10 -21 -197 -34 138 -4 -137
7855 -137 -36 -54 239 3 134 10 318 96 221 -171 -2 -383 6 -83 -283 -105 70 216 -121 334 -34
7876 -34 142 191 156 7 -30 -451 113 -81 -63 -122 -202 75 -20 -46 -179 211 -45 25 -50 33 15 -121 -29 -107 -52
7901 -52 -116 94 1 59 -211 92 79 -86 -142 193 58 -124 -58 -88 0 145 38 -114 70 345 176 72 75 222
7925 222 -92 -135 -80 -55 -64 130 14 7 -222 -17 26 85 -95 75 -129 -275 41 -5 138 -80 -56 52 227 110
7949 110 -118 101 150 -98 24 128 -59 -73 -162 193 101 15 -113 -97 -185 -142 -47 122 -91 106 34 -108 190
7972 190 314 24 21 34 15 -129 207 -46 -53 -83 -38 154 -289 -224 110 179 56 98 -223 212 -170 83 69 91
7996 91 -6 -28 -127 80 123 -69 83 -107 119 83 239 44 62 18 -266 -49 219 37 95 -45 8 25 -91 23
8020 23 -92 -222 -8 31 -73 -88 47 -122 113 24 142 53 63 -319 -111 -13 -67 -141 379 117 -181 186 -112
8043 -112 83 124 -84 62 -56 -100 31 -141 244 -114 -24 -233 -4 -227 -164 -41 -49 43 204 -182 -83 160 -23
8066 -23 147 111 116 14 -4 26 107 -278 -79 128 111 -39 172 -156 194 84 -65 41 241 154 270 231 225 -68
8090 -68 -39 287 68 -56 187 93 84 -102 -31 111 -114 -54 163 -210 -103 48 -57 -70 14 175 178 214 -19 -151
8114 -151 187 109 -155 73 -291 -39 32 190 90 123 81 357 -56 -104 254 -55 104 -16 -194 201 -213 0
8136 0 96 -61 102 -90 249 6 -48 -55 -137 -87 281 54 64 -162 40 -117 80 44 -164 -11 37 55 -130 -103
8160 -103 -60 198 -80 -53 -293 -28 -57 -96 -52 -169 -215 -243 150 54 93 285 16 6 126 -290 39 192 163 -34
8184 -34 -78 7 -66 417 213 103 0
8191@
$$ Imaginary data points
##PAGE= N=2
##DATA TABLE= (X++(I..I)), XYDATA
0 0 0 0 0 0 0 0 0 0 0 0 0 0 0 0 3 -8 8 -8 8 -14 16 -16 24 -24 29 -32 40 -44 49 -57 65 -77 88 -97 112 -124
36 -124 140 -158 177 -196 220 -244 269 -301 331 -365 404 -444 490 -540 594 -654 721 -795 879
55 879 -972 1079 -1203 1347 -1513 1715 -1963 2274 -2680 3234 -4041 5324 -7700 13616 -65438
70 -65438 -35059 106719 88916 -3785 -96489 -75237 7732 81216 66887 -1137 -70799 -71620
82 -71620 -5515 76931 82933 1587 -89222 -81871 15520 97218 67449 -32971 -93103 -49436
94 -49436 38667 78701 37628 -32198 -66944 -40427 21593 67216 49230 -22510 -77248 -50916
106 -50916 35318 86330 41032 -50458 -83209 -22997 57028 69536 10261 -50235 -55687 -10062
118 -10062 39416 51717 17828 -35208 -58916 -22887 43681 68220 16644 -56980 -67500 -1314
130 -1314 63927 54909 -12191 -58934 -40502 14283 47088 33996 -6678 -39712 -38375 24 43911
143 43911 47018 -2344 -54622 -48000 14582 61833 38679 -26784 -58517 -24142 31365 46893
155 46893 15219 -24805 -36723 -17084 15831 37258 25490 -14471 -45432 -29204 23088 53173
167 53173 22788 -34819 -51664 -9311 40232 41773 -512 -35276 -30294 958 25847 27155 6292
180 6292 -21079 -32839 -12369 25811 40482 8885 -36302 -41389 1949 42403 32610 -12615 -39395
193 -39395 -21465 14188 29997 15796 -8108 -22764 -19308 1266 24459 26595 -1853 -32606
205 -32606 -28600 10077 39606 22905 -19816 -37896 -12330 23269 29014 5002 -18297 -20750 -6080
218 -6080 11011 19436 12155 -8854 -26108 -17057 14371 32990 13583 -22966 -32784 -4180 27758
231 27758 25437 -4172 -24620 -16696 5010 16659 13082 775 -12380 -17523 -5885 15472 23838
244 23838 5187 -22822 -25231 2298 27551 19970 -10450 -26155 -11353 12752 18861 6534 -8120
257 -8120 -13643 -8617 2122 13657 14356 -1250 -19175 -17104 6528 24740 13677 -14157 -24159
270 -24159 -5803 17120 18352 240 -14041 -11929 -706 8102 10331 5518 -5353 -14131 -9299
283 -9299 8677 19799 7795 -15118 -20654 -1449 18785 15816 -4480 -16757 -8948 5736 11381
296 11381 6024 -1709 -7404 -8425 -2591 8804 13429 2616 -13859 -15612 2109 17585 12239 -7965
310 -7965 -17011 -5801 10027 12170 2029 -6898 -7810 -2829 2730 7663 7202 -1130 -11248 -9577 4275
325 4275 15123 8136 -9600 -15497 -3034 12229 11501 -1730 -10390 -6681 1510 5994 5339 2028
339 2028 -3226 -7627 -4861 5394 11418 4304 -9619 -12542 -338 12485 9588 -4014 -11552 -5568
353 -5568 5167 7507 2941 -2411 -4785 -3927 -549 5053 7388 1142 -8201 -8959 1815 11346 7102
368 7102 -5437 -11012 -3377 7163 8052 347 -5384 -4766 -785 2403 4012 3451 -1198 -6290 -5706 2901
384 2901 9010 4770 -6128 -9721 -1659 7965 7201 -1747 -7022 -3899 2003 4126 2885 -171 -2416
399 -2416 -4242 -2538 2801 6817 2295 -5530 -7687 33 7704 5810 -2945 -7790 -3054 3977 5290
414 5290 1202 -2563 -3208 -2095 293 2842 3890 519 -4972 -4820 1195 6883 4347 -4189 -7329 -1888
430 -1888 4828 5229 41 -4296 -3006 462 2010 2074 1265 -676 -3609 -2688 1801 5516 2777 -3768
446 -3768 -5805 -1071 4911 4623 -1154 -4550 -2644 1709 3160 1306 -669 -1789 -2245 -599 2066 3456
462 3456 1043 -3361 -4400 318 4845 3431 -2016 -4854 -1774 2794 3383 490 -2019 -1899 -647 570
478 570 1751 1869 -32 -2926 -2522 798 4207 2451 -2456 -4201 -1143 3249 3382 -62 -2694 -1915
494 -1915 417 1749 1101 588 -807 -1981 -1112 1173 2864 1147 -2742 -3545 23 3118 2597 -1016
510 -1016 -3323 -1943 1201 2286 821 -698 -1364 -1058 92 1582 1693 231 -2110 -2476 332 2903
526 2903 1941 -1434 -3171 -738 1880 2242 454 -1598 -1378 -59 770 1300 1019 -356 -1525 -1352 651
543 651 2094 1589 -1418 -2513 -617 1729 2118 -60 -1785 -1121 389 1243 1004 321 -1117 -1229 -566
560 -566 841 1566 714 -1344 -1857 306 2119 1758 -528 -1796 -1128 893 1680 538 -631 -987 -939 239
578 239 1079 957 -80 -1384 -1355 201 1694 926 -583 -2019 -682 871 1654 160 -914 -942 -10 588
596 588 716 398 -531 -1169 -436 763 1244 103 -963 -1363 -326 1017 947 123 -1243 -949 271 1085
614 1085 747 -249 -833 -774 -158 671 824 409 -1207 -709 -211 1025 1293 -213 -930 -601 478 917 588
633 588 -603 -843 -569 602 593 370 107 -894 -649 341 698 492 -413 -957 -463 810 959 289 -584 -690
653 -690 -274 544 511 380 -320 -541 -146 307 549 188 -424 -871 11 738 534 71 -800 -566 -30 466 407
674 407 -179 -393 -624 21 653 623 137 -310 -409 45 665 366 -170 -385 -387 232 544 148 -578 -251 -238 38
696 38 524 365 -457 -694 -342 303 760 209 -318 -558 165 306 449 233 -143 -643 -56 398 394 331 -438 -425
718 -425 -100 210 558 -42 -342 -477 15 387 140 -136 -479 -366 102 155 231 -72 -351 -179 0 254 344
739 344 120 -541 -157 35 570 172 -19 -366 -246 280 21 185 239 -318 -134 75 135 140 -120 -230 -310 229
761 229 544 201 -320 -608 -175 109 554 164 -367 -310 -147 288 434 -71 -176 -85 -482 292 366 -57 -401
782 -401 -214 102 231 340 -180 -227 24 -146 241 235 -70 -248 -210 -49 184 17 -5 -302 -365 126 420 248
804 248 146 -161 -186 27 317 284 -46 -282 17 5 21 8 -108 -54 -249 -53 288 85 29 -210 -136 322 274
827 274 9 -237 -245 26 188 147 -324 -242 -19 304 95 -165 -106 -49 -370 -26 -172 124 -300 -281 -185 -164 -81 10
851 10 -151 -6 -205 86 187 84 196 -142 -99 124 288 253 -138 -212 121 183 280 -90 -152 -105 -81 373 95
874 95 207 -104 -277 -124 180 218 42 145 -482 -37 82 194 281 -369 -104 31 201 93 -37 -163 -256 79
896 79 216 88 268 -98 -61 -188 107 41 74 -47 -87 284 513 153 -318 20 -43 213 -22 -80 -121 -183 -326
919 -326 -40 316 136 -162 -101 -321 -59 344 4 -67 52 66 127 -115 -88 -264 273 148 -12 -58 147 17
941 17 -146 -162 463 435 168 44 -210 22 202 -13 -193 -296 40 62 -83 97 90 -297 -234 -39 66 442 82
964 82 -117 -129 196 -171 -130 -129 -111 47 31 58 -225 21 37 -3 -52 -100 119 -317 -208 96 36 -67 85 -254 -165
989 -165 -28 -61 -68 -193 -187 105 -74 -134 192 242 -146 -189 81 87 127 19 -95 -146 56 -106 -264 -139 -92 248 -216
1014 -216 -172 40 -182 59 -70 18 -24 158 -51 -293 -92 74 203 -88 -71 -234 236 -56 86 98 208 321
1036 321 13 -197 97 190 -92 11 26 200 130 -310 27 -148 249 287 -80 -111 137 8 -46 -81 25 -119
1058 -119 96 -83 -236 19 375 80 -126 196 21 128 97 -166 -93 96 72 216 -67 -54 113 34 -27 5
1080 5 99 224 -208 -72 162 290 -162 -151 -220 -43 97 -258 -85 491 262 51 0 -97 -38 55 -209 -289 258
1103 258 311 -161 -42 43 160 26 114 82 -171 -74 158 -57 -164 113 40 -63 -126 163 58 26 -70 -20 -10 54
1127 54 94 -299 36 2 -5 51 -226 12 194 23 -231 77 157 76 -10 -190 136 163 -24 -295 -12 62 -35 -14
1151 -14 -108 66 27 -180 131 337 -61 275 137 137 -26 88 -155 -217 -64 72 -242 -224 -56 175 120 5 137
1174 137 -76 160 32 34 16 -151 210 44 -176 -42 -21 129 147 -300 211 17 55 306 96 357 -79 27
1196 27 -13 -41 319 -19 2 -62 -346 207 194 159 -89 165 111 -12 -29 -155 165 -33 -21 70 -227 159 -13 -107
1220 -107 38 131 -69 8 -156 -264 -7 -88 50 215 61 209 -68 206 159 65 -134 -38 -234 -2 163 201
1242 201 -99 -186 29 -289 -101 -189 -183 -6 49 -89 -108 -64 -11 -126 90 -95 12 -84 30 -193 101 223 196
1265 196 -222 295 -14 300 107 -39 -145 57 106 -20 -159 -86 73 120 171 0 -139 -324 -165 -38 -103 -101
1287 -101 -134 -179 102 -97 -174 58 -42 -142 102 -35 -45 -155 -22 -40 14 59 -182 185 -15 -175 22 100 92
1310 92 -131 174 186 177 183 198 66 -160 -19 -286 249 -184 -69 278 -53 -211 -138 -75 51 225 -192 -51 109
1333 109 -180 224 -104 18 -130 -251 119 46 131 147 -308 68 38 -75 115 -10 159 -4 -43 -128 46 -27
1355 -27 125 68 17 -96 21 -120 -8 162 -304 186 -12 82 9 175 -133 -31 89 -79 23 170 76 131
1377 131 90 231 92 281 120 -156 86 190 147 -202 -63 -69 30 201 85 -165 216 -141 77 17 -132 216
1399 216 23 -98 197 -190 -158 154 -91 -70 -95 -74 286 176 -36 108 -208 66 5 135 -84 106 66 22
1421 22 -328 -82 14 97 64 -234 -99 -30 -257 -126 -80 -102 130 106 -134 -208 178 219 57 -58 -166 -101 245 18
1445 18 -34 77 -14 25 -158 -56 25 92 103 107 442 -115 -199 303 -80 -135 34 -137 -329 -89 -356 169 -59 -281
1469 -281 -132 -63 58 117 157 -190 144 180 124 -106 -107 45 -189 -81 -81 -55 204 115 -159 -195 -16 -123 -66 21 153
1494 153 136 -64 -180 180 102 -13 25 -33 111 211 243 -80 -228 24 -154 102 105 191 322 93 158 -176 153
1517 153 -107 117 -358 -130 173 106 -160 -148 118 90 -103 10 50 28 287 -86 100 53 67 19 316 -16 -27
1540 -27 40 -218 -214 -201 106 -23 111 24 114 82 -47 62 -8 -27 -103 -33 -231 51 99 -49 -77 -109 178 10 167
1565 167 -54 86 169 -84 10 -363 322 153 69 -16 183 -39 -92 -121 -84 417 -34 -317 12 65 13 -21 -140
1588 -140 -129 -334 170 -254 -177 -97 40 111 -462 -28 -77 -19 27 -219 -423 310 134 -156 -57 7 190 37 -13
1611 -13 -66 125 342 -153 -179 48 -186 -175 140 -119 304 -32 -140 -95 -97 355 21 -413 -295 160 73 33 -444
1634 -444 -6 144 -165 -459 -223 82 389 -229 -99 313 183 87 -102 -197 -275 8 -228 12 21 64 134 -106
1656 -106 110 234 295 -140 33 -133 175 287 -405 87 -14 395 164 -190 282 53 106 -256 -53 56 137
1677 137 -70 -234 219 63 -19 -239 112 249 220 35 -87 24 -9 -13 -37 -76 209 -97 248 -159 -195 546 184
1700 184 -125 -106 38 189 103 -246 -228 255 192 58 -28 -65 56 72 -5 -310 -100 5 92 -163 -84 458 182
1723 182 -258 -289 -108 228 -172 -366 151 145 158 -124 -221 -34 139 54 26 -220 85 40 -102 -177 251 397 186
1746 186 134 -15 -124 15 35 -255 -61 490 -5 -454 -108 12 98 -34 -244 -65 101 36 -586 -226 152
1767 152 246 -105 -220 150 -4 18 -277 -113 76 131 -199 -126 108 375 514 184 -257 245 124 -62 -220
1788 -220 8 374 75 -54 -110 -73 111 -70 -277 42 184 197 -293 -164 -40 528 -38 -111 -80 -230 60 357
1810 357 -368 172 535 102 -284 -218 389 17 -26 -121 31 231 -130 -283 -287 326 266 -194 -296 -101 71 113
1832 113 -408 -306 214 141 -6 -418 -234 479 333 -233 -105 86 208 -13 -219 31 203 219 -251 -514 122
1853 122 235 20 -539 -253 276 394 11 -241 15 80 145 -230 -64 -41 56 -387 -341 0 2 130 -150 106
1875 106 262 312 -44 -573 -30 196 272 -89 -252 286 259 -230 -279 -25 250 187 -154 -310 187 338 12 -188
1897 -188 -188 209 19 -1 67 -83 221 105 -276 259 238 238 -179 -159 27 14 80 -263 -30 7 338 -231 -126 24
1921 24 -12 107 -184 -229 -143 171 -106 -221 -76 337 -81 -253 -202 -47 141 170 -171 -156 277 127 -380 -351 -13
1944 -13 7 -6 -249 -66 291 120 -40 -296 33 188 40 -352 -120 147 252 -176 -136 -126 19 -130 -255 -201
1966 -201 157 404 -170 -213 50 132 13 -291 -39 208 -20 -27 -225 -79 188 254 -359 -190 190 208 -498 -88
1988 -88 -173 222 316 105 -147 10 211 200 -137 -86 142 55 21 -273 -13 134 197 38 -3 -92 100 -383 -318 134
2012 134 358 -30 -97 -198 121 289 -72 -65 -3 115 -81 -230 -277 39 -91 -354 5 24 28 53 -234 -188 221
2035 221 154 19 40 -40 131 106 -35 -209 88 157 -28 -279 141 338 20 -104 -199 20 220 101 -283 224
2057 224 380 -246 122 -27 247 187 124 -194 -29 450 189 24 -209 54 98 -80 -121 -253 -130 61 -51
2078 -51 34 -57 152 70 -289 -16 171 52 -71 -290 -234 -77 177 -227 -445 -36 147 -242 -371 -175 237 222
2100 222 -166 -504 -225 217 263 -429 -43 36 -67 59 -164 163 207 184 -352 -69 97 279 -421 -66 171
2121 171 168 -3 -3 -262 271 158 -290 -275 -21 344 79 29 -44 -67 120 -64 -314 -22 129 45 -111 30 141
2144 141 161 27 -282 -52 54 407 -253 -82 -132 331 -149 -87 -47 140 132 148 -40 -163 195 0 -30 -241 -27
2167 -27 134 -198 -209 392 -35 104 -247 8 104 95 -308 -266 74 169 334 -189 -285 -52 173 -3 24 67 42 -59
2191 -59 -277 -10 129 125 59 118 -44 103 141 -198 -140 -139 165 17 -310 119 -126 36 -72 -155 207 -29 -117 -235
2215 -235 -238 241 104 -159 -3 -27 -20 -191 -17 -480 59 -55 62 -40 105 124 218 -71 112 28 99 -70 -217
2238 -217 -107 -48 -46 -135 -153 193 177 49 -40 -156 77 -82 -174 147 -31 161 57 -47 -251 444 424 -133 -124 -75
2262 -75 123 -141 -99 70 -80 138 39 -381 -200 145 -145 -7 38 85 -6 -15 -483 70 98 245 -74 -2 20 210
2286 210 45 54 -28 127 89 28 202 109 194 -47 -136 -48 110 -247 -184 -63 85 56 8 -379 337 -125 -6 197
2310 197 -218 -61 438 156 -63 -162 84 229 41 -90 -73 -76 -50 -225 -34 109 403 -24 76 -14 -294 128
2332 128 -108 6 9 -16 -258 58 59 -109 129 51 13 -142 119 -260 -197 -218 -130 -55 112 -132 204 -183 -121 -30
2356 -30 -130 -139 -9 55 -21 94 130 -30 -172 -106 2 130 -44 -106 -50 71 -17 -54 -78 -107 165 217 -82 -153 -77
2381 -77 159 -116 75 177 -125 185 -232 -16 94 188 -11 188 119 287 254 190 17 -84 -2 -234 -18 -70
2403 -70 162 76 -70 223 -36 178 -286 -106 233 -204 -103 -158 -43 249 115 38 250 -231 192 173 -84 28
2425 28 -1 117 30 -227 -143 -192 -199 -59 169 -18 68 -160 -133 135 52 117 -116 60 -110 91 -204 106 96 210
2449 210 52 88 65 -99 124 40 -109 -163 -116 56 2 -49 200 -18 -68 7 104 -241 -14 15 -248 57 284 -87
2473 -87 -80 128 -302 121 68 105 -127 81 -153 -306 -56 106 118 -62 173 -42 -99 428 -147 -253 -206 128 92
2496 92 255 184 79 -124 295 -132 191 -9 -139 -32 22 -90 213 -63 -335 -3 66 -29 -71 79 -57 -138
2518 -138 17 -128 -137 -310 212 -37 145 285 45 -145 -144 -71 -158 218 -62 -161 -169 39 -127 -134 -64 43 144 74
2542 74 29 266 50 174 65 -52 26 -120 169 236 -35 -2 -298 12 45 127 98 -62 31 -68 201 -15 -10 123
2566 123 -38 -2 -82 -52 -10 6 -59 -170 99 85 -129 -29 -11 -42 165 -289 -31 117 137 -47 -44 -81 -14 -156 -15
2591 -15 161 232 14 227 -182 -196 -68 -117 147 -89 -52 47 152 183 -256 -74 -45 58 215 18 156 57 140
2614 140 268 -80 -238 50 -124 -98 144 137 -89 -268 -396 -245 8 421 135 15 141 -218 61 -40 -67
2635 -67 36 45 273 96 -322 22 -60 161 164 -16 -85 -71 22 -76 71 171 45 21 49 48 -89 69 -53 -78 -195
2660 -195 42 281 -2 80 90 68 -132 95 -101 -112 -141 -154 72 114 -53 -111 -101 -35 134 -68 -13 -34 -75 14 5
2685 5 130 145 10 23 -33 -79 -275 55 -255 104 5 -110 -45 180 30 204 273 64 -71 38 141 -237 -140
2708 -140 -173 -95 -271 -332 82 200 -211 -151 -82 -220 -31 -33 -72 98 176 -63 127 82 17 196 173 -60 -45 -118 -178
2733 -178 -14 -12 251 -206 -181 -149 -37 -259 -36 -114 0 245 54 91 -71 -170 -25 299 41 -145 0 14 -9
2756 -9 67 43 -102 -275 -188 28 -182 -47 13 -98 156 175 -145 139 -98 -165 260 334 -73 -142 -90 -202 6 3
2780 3 -36 61 146 -74 -41 -172 -50 -196 -19 80 -43 138 6 63 -278 122 103 -212 71 -2 108 -54 -27 164
2804 164 19 -69 75 -80 149 -2 55 -186 62 -229 129 46 -48 0 -18 60 40 23 -193 -142 -73 105 223 56
2828 56 -227 42 155 101 -31 -76 89 -34 -70 37 -54 90 166 27 -33 244 111 130 160 -138 23 -12 -108 11
2852 11 -69 -159 -177 -128 -6 -31 156 -95 91 -187 -45 116 95 -63 -201 -145 127 70 156 -10 155 -174 -104 -73
2876 -73 -25 -28 -267 -27 -23 -10 243 -110 -30 201 -199 48 -257 267 23 -38 97 164 75 70 -68 -75 10 -160 -139 -116
2902 -116 -9 -36 53 67 137 -178 -5 -169 -66 35 -21 -95 208 72 -51 53 94 65 -62 -89 218 54 204
2925 204 48 -256 94 -36 358 -110 -28 -39 53 146 -164 63 -73 -70 -107 -224 271 -77 -84 98 113 72 172 -239
2949 -239 -21 -191 74 138 12 -134 -229 -151 42 -177 -300 92 -170 78 25 -243 27 -200 6 -219 143
2970 143 -99 -89 96 -51 -78 -243 -14 26 165 337 -141 -26 -246 -300 144 93 286 44 107 -50 -190 88
2992 88 101 41 -56 233 -69 241 -121 112 150 -4 115 -16 120 184 -46 19 25 -89 264 -51 -176 4 110
3015 110 111 -250 145 295 -14 65 46 91 -207 101 451 -151 -103 293 -183 -174 -76 -75 -401 124 -47 -133 162 -21
3039 -21 -57 -238 -155 86 -20 -49 70 -179 193 -272 36 -228 -81 25 -220 18 2 34 -42 187 -98 103
3061 103 -200 -120 166 -162 100 407 -141 -24 57 22 77 100 -115 -30 6 108 38 131 143 -56 133 -163 -97 -273
3085 -273 69 49 -19 -63 -297 127 -110 -357 103 -50 176 30 295 -281 198 -91 -41 98 -58 52 -100
3106 -100 -1 -161 -26 -94 154 -96 0 -145 -89 -243 79 -158 233 313 24 90 176 73 -275 -255 -20 -117 -146
3129 -146 22 78 -110 166 79 474 -125 -204 -60 -76 -156 55 -155 -284 -275 -17 397 -59 -73 198 61 204 -94
3152 -94 -174 1 48 204 -57 -188 59 -21 -120 -91 122 123 -84 35 143 -59 117 -147 -231 18 84 -58 -99 -43
3176 -43 157 84 -12 7 -48 -246 -44 85 28 -11 -290 12 191 44 44 -8 105 -8 95 129 -300 -25 -282 -148
3200 -148 -69 -26 -84 -122 -41 -392 -5 -25 -181 215 -4 -159 50 -115 -46 -186 38 -99 196 -9 -47 14 -11
3223 -11 -95 58 229 31 -54 159 87 146 -47 183 267 25 -6 99 -184 168 -90 -16 231 -86 41 -116 -189
3246 -189 14 24 -32 30 -275 300 -58 -97 366 -43 -144 290 -75 -63 12 56 100 201 162 130 -155 150 71 -81
3270 -81 51 47 33 39 -88 3 305 -340 -29 179 92 -279 23 -146 211 -180 97 20 -26 17 -42 -120 169 -146
3294 -146 -168 -65 -129 104 -115 123 154 -239 -93 77 10 218 347 -25 -33 -200 210 35 -157 -174 -79 -61 131
3317 131 -24 -13 19 -127 -211 150 -114 231 -62 27 -63 -14 142 84 -73 -70 206 70 42 -86 -113 199 103 5
3341 5 118 -182 254 -130 -16 81 -386 85 -117 -327 79 -42 -113 -69 -129 -69 8 -2 152 90 -19 -142 21
3364 21 -97 -38 173 296 54 -34 69 -260 -35 177 -154 -153 68 -169 -201 -4 -179 82 -54 -138 -76 -328 -87
3387 -87 -28 -7 188 48 -34 -113 -22 -24 98 171 -66 -80 136 -7 6 77 -122 92 -59 -203 -126 -190 175 -170 -25
3412 -25 -252 -259 -32 -103 -37 -182 131 134 166 -15 -22 -81 -311 -63 36 -43 -175 -41 121 -99 -163 -59 -159 118 45
3437 45 153 158 211 498 -37 -62 -142 -170 15 82 259 -276 -18 -5 97 -115 -177 -57 25 -91 -108 -127 265 258 -113
3462 -113 -72 154 139 157 -92 -218 209 -68 -258 -162 206 -6 139 -62 46 181 -74 -115 89 8 -169 246
3484 246 131 -143 -106 -173 25 -15 36 -103 32 92 -157 169 26 140 278 -113 -29 121 287 -171 245 -66
3506 -66 37 -65 259 181 -190 173 -49 106 88 16 -94 -44 21 153 -47 -146 -188 -11 -279 -4 -102 -3 127
3529 127 -110 201 177 184 190 -216 -230 -84 -33 26 -216 -116 68 -120 -69 58 6 -110 -157 -38 94 -283 -67 204
3553 204 128 230 92 115 85 93 -186 229 -99 112 -126 14 -48 373 -163 55 -72 149 349 -110 -158 -26
3575 -26 -26 -29 -21 -137 105 81 -229 197 -68 -23 38 -129 80 22 21 -248 220 14 265 291 66 -180 -93 201 -1
3600 -1 82 143 194 98 -65 -66 -61 160 99 341 168 1 -9 -2 -40 -195 139 104 -185 -88 -27 254 -181 106 145 -215
3626 -215 86 -202 132 129 -71 199 -203 30 197 83 69 78 -88 -112 29 33 135 -17 303 116 -82 209 -79
3649 -79 -244 -18 -57 -31 -36 -305 -239 -191 46 -98 -276 11 -35 179 193 170 -67 131 -50 28 174 70 29 -96
3673 -96 -160 91 -53 -202 -75 -167 -382 313 217 -39 195 34 19 106 17 -107 1 147 -268 -206 -197 -101 191 8
3697 8 -198 210 -79 -288 75 26 -63 -204 245 -379 -230 -103 -46 -79 -301 64 60 238 -18 39 301 -238 15
3720 15 13 85 -112 36 14 -121 -71 340 135 204 -208 -2 33 98 -97 40 12 198 67 -59 -15 -201 -332 -37
3744 -37 -230 -72 -62 -2 26 -249 -244 75 -55 -232 341 -53 194 -86 -16 52 78 340 107 -37 94 -192 155
3767 155 51 4 -54 -203 3 267 -63 -209 67 -23 -206 42 1 -241 -250 254 -55 76 113 219 -57 -114 -164
3790 -164 -38 -138 10 19 21 61 357 40 54 19 -200 313 197 4 90 141 206 -39 -165 -34 -112 -76 56 -43
3814 -43 -13 54 106 165 -187 -256 -99 -119 87 124 -10 -255 -36 38 103 -272 346 326 -16 -75 -78 -18 -80 -62 50 54
3840 54 61 -125 43 -57 -94 46 0 64 -32 326 156 147 257 102 108 36 16 -86 199 -14 38 307 -123 191 51
3865 51 -171 185 121 -136 -77 -29 -372 34 -152 79 36 -64 182 101 38 -97 146 25 185 26 61 158 -1
3888 -1 -21 281 36 47 21 182 -6 -142 121 -155 92 -176 -75 82 -150 207 211 107 -321 153 -120 178
3910 178 -71 52 142 -42 -158 142 310 151 -160 9 98 159 -196 -117 100 87 -118 289 -258 93 102 -18
3932 -18 44 155 68 -61 -33 -168 193 -257 -184 -19 -35 -14 -119 -44 -85 -326 -17 -166 23 94 80 126 -6 56
3956 56 -104 242 84 114 -3 -150 -322 100 -112 -111 158 -45 136 -105 -99 -59 -54 181 -221 228 -86 317 193
3979 193 78 -243 13 -12 119 130 -218 -37 -61 9 -109 19 -85 28 -65 20 -131 -57 -94 157 130 -33 109
4002 109 -50 -36 57 -69 -52 -163 185 46 -44 136 102 -238 -181 150 86 -243 38 -182 -18 41 -144 10 70
4025 70 145 52 -58 112 57 -102 198 -246 -300 125 107 69 74 -108 54 45 -62 -23 -357 167 -61 126 -89 -6
4049 -6 -120 -12 -109 110 262 171 -152 36 273 -40 3 49 238 -255 158 -92 175 -152 165 -45 -28 4 113
4072 113 -220 197 -93 105 72 15 -82 82 -50 -83 -346 -147 -144 -66 29 23 -61 69 137 -264 -25 -57 95 144 31
4097 31 -59 -222 94 -101 -61 -187 105 121 60 -124 -130 -246 40 -219 62 -181 26 -4 127 -145 299 -18 -8
4120 -8 129 -118 -94 -98 1 -10 18 -44 -23 206 17 -31 -177 -185 50 -250 -105 -85 138 -198 -118 147 19 -82 -72
4145 -72 -107 250 74 -229 215 -100 -134 27 -68 -150 -106 39 89 -23 84 -3 -134 342 -5 207 -148 198 74
4168 74 -207 -61 -82 92 190 -251 -16 66 -134 -80 -77 -265 42 19 -22 146 154 -98 -62 -26 -19 -177 -119 91 195
4193 195 39 -16 -108 -25 -81 34 -326 29 31 -79 15 -245 72 -119 113 173 58 -99 198 -143 58 98 294
4216 294 83 94 -46 -82 155 -79 8 -166 187 -56 171 32 -131 -211 192 -178 -188 117 10 56 -96 -316
4238 -316 239 -39 79 -396 -26 163 7 177 -48 -233 160 235 -122 -125 77 273 -3 -40 385 -36 -68 143
4260 143 -127 -34 -238 -9 178 -185 -18 22 -355 149 -178 -275 53 -306 48 226 46 -124 -172 0 -258
4281 -258 -267 -15 -137 53 -132 -238 -71 67 -262 -82 -146 238 -145 -61 8 182 -198 85 -19 167 47 3
4303 3 147 49 -116 127 -157 -74 147 -109 206 -78 103 -121 -79 -2 -150 0 203 -93 -292 59 90 142 -313
4326 -313 -35 -25 105 -175 -42 30 -126 -106 -255 23 89 296 -129 -239 95 47 102 -66 -68 -31 105 275 -94
4349 -94 -62 -28 39 106 33 -77 195 -194 11 -97 -20 138 -212 -127 145 -192 -163 304 58 3 -317 -56 39 41
4373 41 110 -50 24 -172 -41 102 339 172 157 91 44 -171 -72 20 140 -38 99 91 115 245 -72 7 -184 -380
4397 -380 -72 -374 30 160 -65 308 -7 232 -225 -142 4 17 65 -195 137 -133 7 94 -111 74 -284
4418 -284 170 -174 49 -137 -93 135 -160 149 93 -24 -56 71 235 96 -6 -36 -68 373 -104 47 -260 -85
4440 -85 72 3 -101 -103 -62 -111 -71 229 -196 -272 -18 -262 59 16 -264 13 311 36 119 158 -119 86 250 28
4464 28 186 -2 10 68 150 77 -213 29 -74 -45 4 -193 -13 -200 26 -58 210 98 -12 252 240 -183 -44
4487 -44 240 -150 -171 -88 -40 26 -92 74 -20 218 101 150 -172 164 40 -46 102 370 -30 17 -34 101 11 130
4511 130 31 -259 -228 18 -6 72 136 -4 -58 174 -77 43 -150 110 153 -180 45 -148 -67 127 -50 -12 -58
4534 -58 -136 262 114 283 22 12 -20 -204 111 -58 122 190 217 73 76 135 -157 248 -122 93 -210 -152 106
4557 106 -74 31 125 5 2 77 104 191 -31 -79 105 151 -72 32 49 224 118 47 -284 210 14 -157 111
4580 111 133 50 -116 289 151 280 2 11 32 39 4 -102 -155 41 129 311 -77 -177 -280 211 30 -20 -62 4
4604 4 17 -7 -33 5 -50 -79 -117 -92 218 182 124 -384 152 114 258 -144 11 58 -38 -3 -148 118 179 5 -122 125
4630 125 -37 304 -20 -32 -106 -21 182 -172 -221 66 -217 -73 122 -23 156 9 77 58 -123 67 121 -98
4652 -98 17 334 16 -7 264 -6 121 -143 -70 -320 -112 15 -107 83 -170 -6 118 117 57 88 41 85 -74
4675 -74 -148 1 103 -65 30 -57 31 -28 8 30 -68 342 34 -91 -24 190 29 -156 -49 210 21 110 0 113
4699 113 -167 -175 -128 149 -152 -36 -51 193 -8 -101 325 -26 109 -197 -131 51 -65 -158 58 99 131 -10 82
4722 82 -73 -34 -14 -21 -34 21 -129 -22 -47 79 -111 48 0 -53 231 43 202 20 25 197 -219 -317 -139 186
4746 186 -46 -66 106 -12 31 65 -66 31 229 -145 -1 139 -67 -41 30 102 203 -156 51 -19 124 2 160
4769 160 -88 230 154 -22 -191 -200 -58 -143 -184 95 117 -93 113 260 226 -9 85 -69 -174 -175 -249 126 197 -99
4793 -99 144 3 292 -119 111 12 -178 122 168 54 78 14 -8 -118 48 430 -209 -92 -69 -206 49 7 19
4816 19 -3 181 -127 58 -66 5 168 54 194 -105 132 -173 61 -89 -47 15 93 123 127 -3 -131 37 196
4839 196 241 -88 23 -218 -264 -33 150 -195 -139 -92 -125 -223 -91 84 -51 94 163 -67 -131 138 35 136 136
4862 136 -96 -140 145 -42 68 -49 -89 50 -46 -277 -68 139 16 55 -4 49 314 -97 54 79 180 23
4884 23 115 -75 59 118 -252 -95 218 80 -157 -44 122 4 -32 39 -135 310 -129 99 -72 246 183 -214
4906 -214 -143 -139 23 -42 -378 241 58 89 78 9 -94 -7 -37 74 163 -156 -57 -86 35 -227 50 -102 -98 -208 261
4931 261 7 6 -102 -9 -30 76 -52 -127 -45 196 214 196 54 -27 -27 392 -178 -67 -42 172 -138 -21 -220 91
4955 91 -306 110 -87 -3 146 -27 -68 -17 128 -45 77 -87 -77 23 -22 104 243 -20 -48 124 -39 -117 -37
4978 -37 -41 78 -126 -133 -128 14 -65 -52 -104 238 96 -83 -42 125 -52 -81 407 144 70 31 -128 -117 -14 285 -209
5003 -209 121 -112 -17 -86 126 76 -217 -289 92 209 40 147 137 220 -340 -226 -166 -337 -37 55 10 -286 343
5026 343 4 -100 282 -292 -71 59 -160 0 -27 269 -205 114 18 213 212 -109 -118 -15 -75 123 -71 -14 142
5049 142 -126 -40 83 -105 -116 -205 104 -136 -347 39 251 -6 13 72 301 247 -208 -89 6 -134 74 -212
5071 -212 -44 131 291 -156 -239 21 3 59 130 -59 -28 -31 -201 -57 -16 -79 128 70 37 -104 26 153 -1 -331
5095 -331 -32 -22 -332 -41 106 -19 -293 -275 -156 -119 -217 -101 124 -33 126 -81 32 -35 -19 6 -73 25 -221
5118 -221 -27 49 -35 -42 259 -145 -156 80 126 7 383 63 71 -9 320 42 7 -13 78 313 -66 -265 118 127 -25
5143 -25 -15 28 -146 -2 -22 135 -201 -71 100 -136 -57 -147 -131 -180 71 9 -25 252 -16 -19 44 -4 8 -29 -34 -5
5169 -5 117 42 -180 0 28 17 142 -41 263 -59 -287 23 95 -104 -115 48 68 -49 28 294 115 213 69
5192 69 -49 104 -15 111 41 -3 -26 -141 164 -58 -153 -156 1 -187 56 107 23 109 271 -86 -2 -353 -114 75
5216 75 -128 87 28 40 279 -60 83 172 -32 50 51 136 -194 408 154 -23 -112 54 168 43 115 -117 -46 -132
5240 -132 -160 -45 31 72 -211 27 171 308 85 206 -124 118 -263 89 -80 -89 -155 192 6 -180 233 -62
5262 -62 220 -122 -166 -112 -62 -41 203 -75 -59 63 -425 -116 -53 -24 26 -15 41 -3 93 22 97 123 -256 270 -263
5287 -263 -96 -61 -53 -43 -4 -211 59 -60 -134 -66 133 113 -213 80 -7 99 -37 145 12 207 -68 -122 118
5310 118 97 -60 50 -109 259 -151 74 218 -213 -113 93 156 79 126 -27 -16 -296 -117 -299 -96 -40 153
5332 153 48 229 -87 -3 198 82 157 -26 43 -42 -150 -38 -114 56 -170 -55 -2 89 246 -14 67 -7 -45
5355 -45 172 61 5 -92 -134 158 34 -88 79 -85 7 -39 121 28 -70 4 6 -106 -101 -71 86 -8 311 -77 -2
5380 -2 142 201 81 -187 277 -81 85 1 64 163 -216 -129 95 197 5 246 -50 -254 20 201 -25 -3 -13
5403 -13 -40 162 142 -97 -20 54 -96 227 73 374 39 -44 74 -114 93 34 28 -72 -104 -39 -87 15 36 208
5427 208 131 -28 -115 -234 76 33 19 -106 -128 31 57 80 -418 6 229 23 -97 -269 -211 -101 64 -130 58
5450 58 -32 103 -86 181 -258 -112 -307 333 -1 7 59 -13 -4 73 -214 52 81 242 25 131 69 -20 8 223
5474 223 79 -118 78 -117 -37 84 -202 71 -58 82 -228 -56 -18 -214 -153 204 39 74 133 -114 -23 -97
5496 -97 135 93 -95 -124 -225 -111 88 26 60 -149 -179 93 -18 166 220 -21 131 -78 96 -374 -273 -101
5518 -101 173 -281 -104 39 -62 62 160 -58 112 229 -4 99 -19 -151 117 -257 34 -45 96 380 -244
5539 -244 -65 -111 72 182 39 -96 -8 128 -199 65 114 -88 -176 -23 -25 -157 52 -204 41 78 -100 181
5561 181 -86 -79 51 188 -235 33 53 138 139 -40 53 10 -43 -22 17 56 -54 -194 113 -222 -21 80 -191 -33
5585 -33 130 190 114 40 -215 -58 -43 244 216 21 -286 -86 -319 -330 122 136 98 4 -179 -138 -99 66 -1 -35 77
5610 77 122 18 -94 -117 89 -226 166 322 16 36 99 17 -121 118 195 32 -75 -9 -32 141 -128 -88 -134 79
5634 79 137 -270 -172 -63 41 -89 -25 104 53 -86 -171 -9 -92 92 89 -89 -72 -106 111 163 -226 25 40 15 215
5659 215 124 42 22 -124 202 39 173 -138 109 -223 44 342 176 -43 -127 -9 125 34 -15 179 67 207
5681 207 45 -150 -63 151 -78 -100 -90 237 16 -63 149 26 362 -253 -151 119 42 139 -29 161 317 15
5703 15 136 105 -81 125 97 -31 147 205 26 219 42 39 95 56 -17 -118 -86 -169 -287 -115 11 73 56 273
5727 273 -67 163 93 -15 113 -24 113 130 -66 -16 -155 -91 -88 -89 -138 -41 -62 -187 13 -12 82 175 39 23 117
5752 117 -252 135 29 209 3 -16 262 125 -83 -184 222 146 -221 -109 126 -174 151 48 147 231 160 35
5774 35 61 -61 -232 -65 80 167 227 93 153 -40 -118 -95 102 -128 -51 266 81 -177 -143 123 -15 -182 0
5797 0 105 193 -136 -139 -19 237 -3 188 28 -44 -72 -215 128 -141 -49 13 -295 -111 224 301 -78 1 -88 -55
5821 -55 -133 106 116 -78 -460 -326 -198 -25 0 30 -53 157 -29 -210 -122 61 -95 -24 60 -231 110 103 41 129
5845 129 -144 27 -41 -130 -65 83 26 -22 241 -36 150 41 99 -80 24 -109 7 36 129 -129 12 71 114
5868 114 -314 52 -40 42 -49 -223 -177 10 91 -12 -164 253 151 221 51 -80 -119 2 25 16 168 -61 50
5891 50 -52 -110 106 -19 182 133 -76 -121 66 105 -250 -195 -122 -265 127 -120 -240 -62 -145 73 49 165 44
5914 44 -99 303 37 22 -76 42 60 -73 184 -132 -3 -95 -9 98 71 -268 -154 177 -51 67 132 69 -60
5937 -60 222 42 41 200 123 -169 130 -26 -80 10 -101 54 -124 155 -6 125 -66 91 18 49 99 296 -229
5960 -229 53 -71 128 34 82 -91 147 2 -198 147 -282 111 -243 168 -170 -110 -307 -242 155 87 -1 -137
5982 -137 133 -368 -32 231 81 13 46 4 147 72 -99 153 198 71 204 -95 164 -116 -96 158 223 248 -75
6005 -75 93 -94 -305 250 -48 35 233 -129 123 -167 -21 -64 28 -69 78 77 26 237 -220 1 202 60 -232
6028 -232 5 149 -43 -17 181 56 237 -96 -2 142 51 216 -4 -252 -46 -84 -173 -256 -374 31 -121 121
6050 121 -85 -135 -129 -17 -141 -62 1 16 132 44 -23 -184 121 -80 -121 26 5 -4 -269 -59 -84 11 37 -22 -165
6075 -165 338 5 -207 117 -29 235 13 -131 182 161 24 -38 -95 -136 -195 41 18 -208 -146 -107 -98 47 -10 -149
6099 -149 251 -61 -33 24 59 97 -352 -133 86 53 93 -141 69 316 27 -206 -4 -164 167 176 -167 -26 -133
6122 -133 -95 317 34 144 302 118 38 -103 -42 -136 -72 -308 123 -150 136 191 54 -174 57 14 -47 -69 -64 131
6146 131 -21 -76 -1 179 113 21 22 56 -43 -109 -208 36 47 194 236 -327 66 125 25 164 194 356 -232 76 -72
6171 -72 60 -110 -216 30 -259 4 144 17 -4 -396 3 149 -135 301 91 217 78 21 16 -225 -34 -116
6193 -116 8 86 -25 -7 10 77 168 17 44 83 41 43 37 39 11 -233 -249 -44 -140 13 100 -118 18 -69 -6 49 36
6220 36 12 -2 -106 20 307 178 -130 -237 71 3 123 -106 -172 49 -1 321 285 -60 -52 -78 -19 -43 -170 43
6244 43 -32 132 33 -256 140 -95 -223 115 -67 22 105 278 47 153 -122 170 -58 -90 224 145 175 184 -158
6267 -158 -123 60 11 65 -34 -108 -157 266 -26 -77 -129 -171 -39 60 172 332 -48 196 97 -156 68 225 338 12
6291 12 -53 139 -5 36 -1 145 -173 -272 71 227 -41 -52 76 -114 73 -199 -34 -87 -45 144 4 177 -22
6314 -22 188 109 -55 -140 -180 -81 68 1 -88 168 45 -28 -145 151 -316 195 102 -264 14 -40 60 -60 -41 69
6338 69 2 -51 -24 101 -85 -189 -159 109 -12 -218 -225 -181 175 213 -156 -194 -3 475 132 -65 -25 124 -49 -127
6362 -127 148 -12 154 195 -8 -45 205 -90 -30 191 -25 -139 12 275 -123 -17 233 -219 -245 -94 -34 3
6384 3 62 250 64 55 -135 -6 -90 19 218 -133 -81 115 70 80 103 -177 -104 -66 147 221 -146 -156 -239 -104 -30
6409 -30 -106 -11 259 -231 43 66 -115 44 266 298 261 -71 -88 -70 -176 -171 -10 -94 -153 -128 -40 -30 118 -259 -149
6434 -149 -57 28 -7 178 208 -91 152 126 154 -2 128 -154 250 53 228 22 260 209 461 111 -165 326
6456 326 -51 47 47 287 110 -275 -81 -119 -27 -311 -186 127 -134 84 18 140 102 -85 238 -182 165 260 -125
6479 -125 139 203 -147 -505 -187 4 -74 -13 210 283 54 -132 -132 89 93 43 108 -39 132 -56 -36 -87 -30 -37 -5
6504 -5 68 20 -21 -79 173 169 -108 124 57 113 129 -98 -37 -262 82 -63 322 103 -3 -141 -61 83 190 -4
6528 -4 45 60 -156 20 73 81 -158 52 -12 75 -85 213 -162 -51 -166 -127 139 -289 74 168 -115 19 449 -183
6552 -183 83 -29 -145 -323 -146 55 151 118 25 -165 -292 140 -217 -68 -128 233 -67 9 183 -185 41 191
6574 191 46 -29 -41 253 -176 97 -28 5 130 -163 138 182 -15 78 -206 -33 201 -300 -215 -51 1 -376
6596 -376 15 58 -102 -176 47 -42 -86 -145 -77 69 -135 249 -84 208 52 66 -41 216 25 40 11 -54 41 151
6620 151 -6 -50 27 -41 94 42 85 168 -36 13 43 167 239 -123 50 89 74 39 121 -212 205 160 -107 12 105
6645 105 3 -284 -236 -92 -156 -147 -45 38 10 -124 -9 -47 -208 -92 264 -71 -138 47 -122 -198 -107 -54 26 353
6669 353 184 46 114 70 112 -207 253 188 52 -239 -162 7 -52 -78 -66 -171 67 -63 -176 -54 111 -133 70
6692 70 -175 -51 -141 -248 -268 349 -49 -111 194 -242 51 87 -3 -88 -168 10 77 -188 189 -22 24 28 -249 2
6716 2 -115 -53 -91 52 -50 -127 -269 157 192 -89 109 -215 -111 131 65 -128 34 -337 177 0 -2 150 -61
6739 -61 -134 -104 160 91 -65 -8 -127 249 92 190 -198 319 56 -67 -237 107 -31 -180 95 -178 -13 223
6761 223 -1 -74 145 16 94 52 34 -249 65 -124 -221 -32 -350 167 52 135 -106 -105 181 169 -16 163 -183
6784 -183 -98 -59 -64 247 -36 -61 110 244 230 -30 253 117 6 87 -42 74 -87 -72 320 -54 -199 114 -174
6807 -174 -40 -10 -151 109 -32 -118 -124 -115 37 -159 -245 -4 -343 -159 59 -97 -60 153 -9 66 -72 374 8
6830 8 -240 240 97 32 -61 -176 -67 13 -63 -17 96 101 -18 12 -48 -299 117 1 243 8 12 87 -534 129 -130
6855 -130 54 -125 -130 153 -84 213 184 111 19 -155 -212 282 -92 120 75 44 136 -43 -61 -130 -251 117 68 407
6879 407 20 -37 -115 158 -53 41 -44 -88 39 38 -6 176 -4 111 17 30 -199 72 -260 -213 75 -63 103 -30
6903 -30 -44 15 16 92 -69 -16 -1 96 283 -55 -363 -83 -267 110 185 44 -102 -45 150 23 -122 -72 -109 -42 -56
6928 -56 -46 -36 31 149 18 57 -61 114 34 -133 66 2 -201 30 95 197 115 -248 123 124 185 9 289 122
6952 122 185 -21 -254 -177 -47 -63 -203 -81 -117 142 52 58 -119 -8 -183 67 -49 -176 178 114 -107 -144 -40
6975 -40 -302 -31 -161 273 -22 46 -163 12 37 94 237 135 -26 -75 86 -54 271 -6 -143 -161 57 99
6997 99 59 12 -208 -10 126 -85 -3 209 130 66 128 37 182 45 291 -10 101 158 -175 -100 -30 -175 38 -43
7021 -43 190 -111 63 -24 -105 162 41 -103 -101 35 74 174 -7 151 170 200 86 -74 -108 -213 -92 166 -159
7044 -159 -138 115 85 175 7 -166 -75 -202 -8 -80 -178 184 -101 -112 -123 -156 -52 -59 -5 -325 -126 319 -189 147
7068 147 -16 147 22 192 167 52 52 91 336 -173 57 -207 -277 -119 -89 85 332 -9 -106 24 10 90 47
7091 47 -128 -59 41 250 -77 -164 89 128 -93 181 -201 101 155 126 -35 23 -76 53 -163 -41 -13 54 -37 -319
7115 -319 -63 -72 -136 2 -115 -88 230 -83 -65 -295 -27 374 85 17 -24 -131 30 -81 -42 75 -91 10 -84
7138 -84 -108 -70 -75 163 -59 91 -87 -41 -92 -52 -9 97 182 -30 -169 -93 109 52 -23 -19 -78 -172 283 -63 -254 -197
7164 -197 2 -77 287 -181 43 -82 -116 -253 195 50 -26 38 -35 -37 -40 151 154 250 156 -79 -366 44 102 -106 -130
7189 -130 -128 139 -116 221 164 -141 -117 181 -69 -22 -137 31 -159 185 38 194 -169 33 -84 255 182 135
7211 135 161 138 103 -66 41 -28 -62 297 37 -101 248 -148 -83 -193 -181 222 -47 -43 -105 225 -212 -139 -29 -47
7235 -47 96 -161 -92 -8 141 -55 -173 -97 -123 -136 -78 -104 -43 -33 248 -213 148 202 187 -41 -197 117 133 -62
7259 -62 2 -4 -236 106 -259 -90 -72 -150 32 168 -376 179 -48 -40 15 -336 142 -119 -118 118 -34 25 -125 33
7283 33 95 -1 -50 -146 -242 148 -50 156 154 -135 162 -148 87 50 -301 -58 -1 -53 10 27 -330 -31 -54 -37 238
7308 238 37 -82 -369 129 198 -47 63 -45 -12 -138 35 57 61 -56 280 67 99 154 93 -171 124 140 157
7331 157 20 74 -12 98 -50 -38 -37 -103 -52 -44 177 62 297 59 53 -193 -249 -60 -16 319 -7 -64 36 -64 11
7356 11 -68 -78 -60 9 74 -140 -400 48 -41 37 2 43 43 90 28 119 -7 73 61 -266 -130 -182 147 97 -192 -57
7382 -57 41 -233 -205 -97 195 78 156 -105 90 -88 -106 100 196 5 130 156 -80 62 188 -13 126 82 87
7405 87 -89 -67 38 17 -147 63 15 12 -208 -222 -7 -41 14 72 131 0 -141 7 30 -273 82 -26 -260 -29
7429 -29 65 -196 256 -99 57 -106 157 140 -124 -101 -31 -120 -230 74 -52 -70 37 153 -74 -69 29 241 -118
7452 -118 -45 -166 -247 -182 -49 157 -98 -83 -93 11 65 -148 20 52 143 -335 -38 -44 192 -80 -124 -115 -194 -13 -196
7477 -196 -31 70 80 -167 163 -27 -113 133 45 -149 117 -203 70 -2 -78 -149 144 71 51 -57 177 3 -267
7500 -267 160 51 -9 -186 219 31 -207 138 94 63 -158 -145 57 10 137 -20 524 52 74 29 7 83 -167
7523 -167 -87 -16 96 77 -158 118 88 18 -142 -61 -7 32 174 -235 162 57 154 37 62 -182 25 120 -10 -112
7547 -112 -43 -29 -127 -35 -62 30 -173 121 72 93 48 -131 39 -96 116 96 -106 176 -95 36 -209 -86 146
7570 146 -15 -113 -109 74 36 96 19 -106 5 -49 66 5 204 141 230 -226 434 -157 13 29 109 -175 -82 26
7594 26 -36 131 28 264 -99 -237 168 45 125 64 -195 -6 152 2 72 -211 117 115 -11 -83 -37 197 114
7617 114 167 35 11 -68 -19 -33 159 -152 98 -203 -191 -114 -274 -77 -13 168 263 104 129 -134 -61 -45 -43 270 -103
7642 -103 4 4 119 -100 221 -59 -107 26 164 -163 165 -74 137 65 -231 167 -74 -190 71 124 142 -183
7664 -183 -89 44 -178 18 -12 -153 -123 283 221 173 110 199 32 -1 -97 -11 -149 -170 -98 36 44 3 -95 -68 3 112
7690 112 -137 -22 -52 -31 224 91 -124 -204 124 -23 50 -98 18 -120 -304 -42 101 93 -67 50 96 -113
7712 -113 -124 -134 41 167 145 -62 -20 -13 6 277 186 275 -132 44 34 93 -13 -126 178 181 -38 83 -45 189
7736 189 7 -104 -69 -98 -189 -110 -57 76 39 36 146 -62 -105 94 -203 19 208 -184 37 -105 118 155 201 360
7760 360 96 167 70 55 -22 76 48 207 -46 167 -42 41 -3 251 6 -31 -178 72 95 99 145 -283 -261 -126 14
7785 14 57 206 40 193 -46 297 -338 -43 230 -5 285 -60 -58 36 -25 105 251 251 -78 0 -103 48 113
7808 113 68 156 -150 42 45 -142 -209 165 129 -333 196 17 90 290 -29 -188 -111 -195 -205 343 144 -33 -155
7831 -155 -68 -13 -2 47 -134 49 -120 68 87 28 -88 -231 -215 161 -21 -278 -120 21 4 286 104 -105 83
7854 83 11 -149 2 -60 -36 -91 -160 238 -75 122 -113 -41 22 42 -42 166 93 297 23 147 141 -81 202 -4
7878 -4 61 -56 -58 153 340 44 -400 -204 -10 -108 -83 200 -94 11 -52 146 117 -33 -121 -55 288 -6 -334 101
7902 101 122 2 199 -66 -49 21 -109 -165 265 -99 -53 -114 -108 -72 47 225 210 -140 255 69 -48 -20 68 -293
7926 -293 -54 64 68 -79 37 5 130 -97 -51 150 172 138 104 64 -65 -83 -239 -33 -68 379 -187 127 54 253
7950 253 118 -124 150 -184 124 -69 27 286 -197 122 -102 228 256 17 -20 149 73 81 70 76 -169 -140 -68 51
7974 51 89 34 -266 -126 -47 -325 32 87 175 94 -67 195 -36 -319 208 86 -277 46 -87 -69 33 158 23
7997 23 331 -69 -67 -4 9 -197 -19 -64 69 187 14 198 33 -122 -179 -40 182 139 158 -161 117 166 12
8020 12 87 116 -59 -182 -159 94 66 149 -13 148 102 -47 -27 -42 -258 -177 232 -48 -144 -11 -246 8 237 10
8044 10 50 236 -188 -317 -44 -79 -51 -105 26 -26 6 79 -136 -162 273 366 -127 106 119 -132 -104 -146 7 76 -226
8069 -226 -92 84 191 69 75 -255 -5 -163 249 135 122 36 -10 195 -121 -79 -158 163 -132 -188 -340 5 -75
8092 -75 144 -76 -256 -121 186 176 -38 -109 78 71 -102 -132 -70 135 84 105 -120 227 37 4 -17 -140 -46 28
8116 28 230 176 16 105 -85 24 -179 45 218 22 19 -21 280 -115 58 -33 63 99 61 -24 -200 14 269 -19
8140 -19 96 292 -276 -253 0 -4 -60 -65 123 71 186 200 -31 -209 -240 -39 123 -41 -16 222 -249 -11 115 -33
8164 -33 -217 189 373 -18 104 11 -57 -201 3 21 152 14 0 8 -84 117 -2 210 29 125 -25 4 42 -31
8188 -31 -151 18 -31
8191c1
##END NTUPLES=NMR FID
##END=
