##TITLE=1H_Pr MC-1
 200.13MHz, DMSO-d6,
 8 sc
 
 20.10.2025
##JCAMPDX= 6.0         $$ Bruker NMR JCAMP-DX V2.0
##DATA TYPE= NMR FID
##DATA CLASS= NTUPLES
##ORIGIN= UXNMR, Bruker Analytische Messtechnik GmbH
##OWNER= pz
$$ XWIN-NMR		Version 3.5
$$ Tue Oct 21 14:35:02 2025 Russian Standard Time (UT+4h)  she@DPX200
##.OBSERVE FREQUENCY= 200.1313
##.OBSERVE NUCLEUS= ^1H
##.DELAY= (6, 6)
##.ACQUISITION MODE= SIMULTANEOUS
##.ACQUISITION SCHEME= undefined
##.AVERAGES= 8
##.DIGITISER RES= 18
##SPECTROMETER/DATA SYSTEM= spect
##.PULSE SEQUENCE= zg30
##.SOLVENT NAME= DMSO
##.SHIFT REFERENCE= (INTERNAL, DMSO, 0, 14.3821)
##AUDIT TRAIL= $$ (NUMBER, WHEN, WHO, WHERE, WHAT)
$$ ##TITLE= Audit trail, XWIN-NMR		Version 3.5
$$ ##JCAMPDX= 5.01
$$ ##ORIGIN= Bruker BioSpin GmbH
$$ ##OWNER= she
$$ F:/spectra/data/she/nmr/H-C/1/audita.txt
$$ ##AUDIT TRAIL=  $$ (NUMBER, WHEN, WHO, WHERE, WHAT)
(   1,<2025-10-21 14:33:38.76 +0400>,<she>,<DPX200>,
      <created by zg, POWCHK disabled, PULCHK disabled
       configuration hash MD5:
       00 E9 B6 7A A2 85 ED C7 34 08 36 98 17 FE 4E 26
       data hash MD5: 16K
       66 EC EE 6E 9A 12 A0 16 D2 67 8E 5C 02 7F 52 92>)
$$ ##END=
$$ 
$$ hash MD5
$$ 56 2A C4 43 BD 8D 67 F7 3D 4E E2 77 FB FD B0 D8
##$RELAX= 
##$RELAX= 
##$RELAX= 
##$RELAX= 
##$RELAX= 
##$RELAX= 
$$ Bruker specific parameters
$$ --------------------------
##$DU= <F:/spectra>
##$EXPNO= 1
##$NAME= <H-C>
##$PROCNO= 1
##$TYPE= <nmr>
##$USER= <she>
##$AMP= (0..31)
100 100 100 100 100 100 100 100 100 100 100 100 100 100 100 100 100 100 
100 100 100 100 100 100 100 100 100 100 100 100 100 100 
##$AQSEQ= 0
##$AQ_mod= 1
##$AUNM= <au_zg>
##$AUTOPOS= <>
##$BF1= 200.13
##$BF2= 200.13
##$BF3= 200.13
##$BF4= 200.13
##$BF5= 200.13
##$BF6= 200.13
##$BF7= 200.13
##$BF8= 200.13
##$BYTORDA= 1
##$CFDGTYP= 0
##$CFRGTYP= 5
##$CHEMSTR= <none>
##$CNST= (0..31)
1 1 145 1 1 1 1 1 1 1 1 1 1 1 1 1 1 1 1 1 1 1 1 1 1 1 1 1 1 1 1 1 
##$CPDPRG= <>
##$CPDPRG1= <>
##$CPDPRG2= <>
##$CPDPRG3= <>
##$CPDPRG4= <mlev>
##$CPDPRG5= <mlev>
##$CPDPRG6= <mlev>
##$CPDPRG7= <mlev>
##$CPDPRG8= <mlev>
##$CPDPRGB= <>
##$CPDPRGT= <>
##$D= (0..31)
0 0.7 0 0 0 0 0 0 0 0 0 0.03 0 0 0 0 0 0 0 0 0 0 0 0 0 0 0 0 0 0 0 0 
##$DATE= 1761042818
##$DBL= (0..7)
120 120 120 120 120 120 120 120 
##$DBP= (0..7)
150 150 150 150 150 150 150 150 
##$DBP07= 0
##$DBPNAM0= <>
##$DBPNAM1= <>
##$DBPNAM2= <>
##$DBPNAM3= <>
##$DBPNAM4= <>
##$DBPNAM5= <>
##$DBPNAM6= <>
##$DBPNAM7= <>
##$DBPOAL= (0..7)
0.5 0.5 0.5 0.5 0.5 0.5 0.5 0.5 
##$DBPOFFS= (0..7)
0 0 0 0 0 0 0 0 
##$DE= 6
##$DECBNUC= <off>
##$DECIM= 32
##$DECNUC= <off>
##$DECSTAT= 4
##$DIGMOD= 1
##$DIGTYP= 9
##$DL= (0..7)
0 120 120 120 120 120 120 120 
##$DP= (0..7)
150 150 150 150 150 150 150 150 
##$DP07= 0
##$DPNAME0= <>
##$DPNAME1= <>
##$DPNAME2= <>
##$DPNAME3= <>
##$DPNAME4= <>
##$DPNAME5= <>
##$DPNAME6= <>
##$DPNAME7= <>
##$DPOAL= (0..7)
0.5 0.5 0.5 0.5 0.5 0.5 0.5 0.5 
##$DPOFFS= (0..7)
0 0 0 0 0 0 0 0 
##$DQDMODE= 0
##$DR= 18
##$DS= 0
##$DSLIST= <SSSSSSSSSSSSSSS>
$$ [...]
##$SUBNAM0= <"">
##$SUBNAM1= <"">
##$SUBNAM2= <"">
##$SUBNAM3= <"">
##$SUBNAM4= <"">
##$SUBNAM5= <"">
##$SUBNAM6= <"">
##$SUBNAM7= <"">
##$SUBNAM8= <"">
##$SUBNAM9= <"">
##$SW= 18.0517328524113
##$SWIBOX= (0..15)
0 0 2 0 0 0 0 0 0 0 0 0 0 0 0 0 
##$SW_h= 3612.71676300578
##$TD= 16384
##$TD0= 1
##$TE= 0
##$TE2= 300
##$TE3= 300
##$TEG= 300
##$TL= (0..7)
0 120 120 120 120 120 120 120 
##$TP= (0..7)
150 150 150 150 150 150 150 150 
##$TP07= 0
##$TPNAME0= <>
##$TPNAME1= <>
##$TPNAME2= <>
##$TPNAME3= <>
##$TPNAME4= <>
##$TPNAME5= <>
##$TPNAME6= <>
##$TPNAME7= <>
##$TPOAL= (0..7)
0.5 0.5 0.5 0.5 0.5 0.5 0.5 0.5 
##$TPOFFS= (0..7)
0 0 0 0 0 0 0 0 
##$TUNHIN= 0
##$TUNHOUT= 0
##$TUNXOUT= 0
##$USERA1= <user>
##$USERA2= <user>
##$USERA3= <user>
##$USERA4= <user>
##$USERA5= <user>
##$V9= 5
##$VALIST= <valist>
##$VCLIST= <CCCCCCCCCCCCCCC>
##$VD= 0
##$VDLIST= <DDDDDDDDDDDDDDD>
##$VPLIST= <PPPPPPPPPPPPPPP>
##$VTLIST= <TTTTTTTTTTTTTTT>
##$WBST= 1024
##$WBSW= 4
##$XGAIN= (0..3)
0 0 0 0 
##$XL= 0
##$YL= 0
##$YMAX_a= 223289
##$YMIN_a= -296767
##$ZGOPTNS= <>
##$ZL1= 120
##$ZL2= 120
##$ZL3= 120
##$ZL4= 120
##$ABSF1= 10
##$ABSF2= 0
##$ABSG= 5
##$ABSL= 3
##$ALPHA= 0
##$AQORDER= 0
##$ASSFAC= 0
##$ASSFACI= 0
##$ASSFACX= 0
##$ASSWID= 0
##$AUNMP= <proc_1d>
##$AZFE= 0.1
##$AZFW= 0.1
##$BCFW= 1
##$BC_mod= 2
##$BYTORDP= 1
##$COROFFS= 0
##$CY= -3
##$DATMOD= 1
##$DC= 2
##$DFILT= <>
##$DTYPP= 0
##$F1P= 0
##$F2P= 0
##$FCOR= 0.5
##$FTSIZE= 0
##$FT_mod= 4
##$GAMMA= 1
##$GB= 0.15
##$INTBC= 1
##$INTSCL= 1
##$ISEN= 128
##$LB= 0.25
##$LEV0= 0
##$LPBIN= 0
##$MAXI= 10000
##$MC2= 0
##$MEAN= 0
##$ME_mod= 0
##$MI= 1.114404
##$NCOEF= 0
##$NC_proc= 0
##$NLEV= 6
##$NOISF1= 3.799351
##$NOISF2= 2.8
##$NSP= 1
##$NTH_PI= 0
##$NZP= 0
##$OFFSET= 14.38212
##$PC= 1
##$PHC0= -2293.015
##$PHC1= 37.39226
##$PH_mod= 1
##$PKNL= yes
##$PPARMOD= 0
##$PSCAL= 0
##$PSIGN= 0
##$REVERSE= no
##$SF= 200.129724274929
##$SI= 16384
##$SIGF1= 3
##$SIGF2= 2
##$SINO= 400
##$SIOLD= 16384
##$SREGLST= <1H.CDCl3>
##$SSB= 0
##$STSI= 0
##$STSR= 0
##$SW_p= 3205.1282051282
##$SYMM= 0
##$S_DEV= 0
##$TDeff= 0
##$TDoff= 0
##$TI= <>
##$TILT= no
##$TM1= 0
##$TM2= 0
##$TOPLEV= 0
##$USERP1= <user>
##$USERP2= <user>
##$USERP3= <user>
##$USERP4= <user>
##$USERP5= <user>
##$WDW= 1
##$XDIM= 8192
##$YMAX_p= 0
##$YMIN_p= 0
$$ End of Bruker specific parameters
$$ ---------------------------------
##NTUPLES= NMR FID
##VAR_NAME=  TIME,          FID/REAL,        FID/IMAG
##SYMBOL=    X,             R,               I
##VAR_TYPE=  INDEPENDENT,   DEPENDENT,       DEPENDENT
##VAR_FORM=  AFFN,          ASDF,            ASDF
##VAR_DIM=   8192,          8192,            8192
##UNITS=     SECONDS,       ARBITRARY UNITS, ARBITRARY UNITS
##FACTOR=    0.0002768,     1,               1
##FIRST=     0,             0,               0
##LAST=      2.2672688,     0,               0
##MIN=       0,             -296767,         0
##MAX=       2.2672688,     223289,          0
$$ Real data points
##PAGE= N=1
##DATA TABLE= (X++(R..R)), XYDATA
$$ plain form
0 0 0 0 0 0 0 0 0 0 0 0 0 0 0 0 0 0 8 -8 8 -8 8 -8 16 -16 19 -24 24 -32 33 -40 47 -51 58 -65 75 -83 93 -107
38 -107 116 -131 146 -163 180 -200 219 -244 269 -297 326 -361 395 -437 483 -533 587 -652 722
57 722 -807 901 -1018 1151 -1323 1534 -1814 2201 -2770 3694 -5465 10150 -54423 -134204 -147743
72 -147743 -194258 -208845 -213928 -207672 -220407 -230702 -233944 -222898 -224572 -236274 -248855 -249397 -248200
85 -248200 -246249 -246505 -238379 -220189 -195128 -170889 -144663 -119549 -92790 -65687 -40657 -25926 -15538
98 -15538 -963 17857 32981 44091 57192 81753 111826 134685 149739 170312 196058 214769
110 214769 217409 213173 214562 218487 210998 194040 183028 183322 183600 175580 165733 163659 166129 159841 142537
125 142537 123248 107875 89660 63376 33706 7668 -11006 -28522 -45273 -60249 -70726 -77129
$$ packed form
0@%%%%%%%%%%%%%%%%Qj6J6j6J6j6K4l2L5m3M8n6O5p3Q7r8J09j23J40j58J76k00
38a07K23k47K77l09L43l80M19m63N13n66O23o87P56q32R20j016J120j239J374
57G22j529J708j919K169k474K857l348M015m971O464r159J5615o4573p9781j3539
72a47743m6515j4587n083O256j2735j0295l242J1046j674j1702j2581n42J197
85b48200J951k56Q126J8190K5061K4239K6226K5114K6759K7103K5030J4731J0388
98a5538J4575J8820J5124J1110J3101K4561L0073K2859J5054K0573K5746J8711
110B14769K640m236J389L925p489j6958j1012K94K78q020r847k074K470o288j7304
125A42537j9289j5373j8215k6284k9670k6038j8674j7516j6751j4976j0477o403
$$ plain form
137 -77129 -82068 -89339 -101219 -114289 -124919 -135310 -149939 -167810 -181251 -185172 -184948 -186711 -187997
150 -187997 -179797 -163074 -148709 -141453 -135406 -122417 -107985 -102542 -103921 -99464 -86695 -74071 -65636
163 -65636 -55648 -36645 -11512 10690 27051 43611 64000 81252 90871 95129 98622 104140 109325
176 109325 111936 113748 118552 127619 137913 145627 150180 154120 158323 159119 152899 141456 129398 119691
190 119691 108990 94152 78286 69264 64613 58401 48467 39633 34596 28827 16230 -1363 -17675
203 -17675 -30943 -46593 -65813 -83625 -95205 -101403 -107996 -114749 -118147 -116732 -114654 -115972 -119571 -122216
217 -122216 -123780 -125744 -130166 -134205 -134100 -129796 -123733 -115920 -106616 -93296 -77498 -62112 -49742 -39143
231 -39143 -28383 -17445 -8774 -3506 2000 10807 22294 32827 42673 55325 71194 86406 97809
$$ packed form
137g7129m939p271j1880j3070j0630j0391j4629j7871j3441l921K24j763j286
150a87997Q200J6723J4365P256O047J2989J4432N443j379M457J2769J2624Q435
163f5636R988J9003K5133K2202J6361J6560K0389J7252R619M258L493N518N185
176A09325K611J812M804R067J0294P714M553L940M203P96o220j1443j2058r707
190A19691j0701j4838j5866r022m651o212r934q834n037n769j2597j7593j6312
203a7675j3268j5650j9220j7812j1580o198o593o753l398J415K078j318l599k645
217a22216j564j964m422m039J05M304O063P813R304J3320J5798J5386J2370J0599
231c9143J0760J0938Q671N268N506Q807J1487J0533R846J2652J5869J5212J1403
$$ plain form
244 97809 106300 114687 122076 125669 124218 121455 119511 118583 115452 111165 108793 109309 109855 107561 103096 97659
260 97659 92923 84945 72383 57878 44242 31107 16651 1526 -11234 -20340 -27381 -35463 -43338
273 -43338 -49999 -55658 -61599 -70661 -80754 -90626 -98221 -106620 -114588 -121148 -123226 -122473 -119897 -116598 -112162
288 -112162 -105011 -97139 -90796 -86047 -81492 -75777 -69623 -65165 -59897 -52855 -42663 -31100 -19769 -8127
302 -8127 5507 20077 33316 43186 51648 60327 67954 72510 74713 77738 82977 87565 90463 93156
316 93156 97889 103730 106990 106819 105975 104775 101848 95184 86324 77599 69901 61728 52488 43975 37175
331 37175 31442 25296 18400 11086 3610 -4032 -13153 -23678 -34533 -45302 -54400 -62791 -70202 -76787
345 -76787 -80746 -81721 -82522 -84486 -85463 -83971 -82486 -83410 -85108 -85443 -83341 -81322 -80552 -78566 -72218 -64042
$$ packed form
244I7809Q491Q387P389L593j451k763j944r28l131m287k372N16N46k294m465n437
260I7659m736p978j2562j4505j3636j3135j4456j5125j2760r106p041q082p875
273d3338o661n659n941r062j0093r872p595q399p968o560k078P53K576L299M436
288a12162P151P872O343M749M555N715O154M458N268P042J0192J1563J1331J1642
302h127J3634J4570J3239R870Q462Q679P627M556K203L025N239M588K898K693
316I3156M733N841L260j71q44j200k927o664q860q725p698q173r240q513o800
331C7175n733o146o896p314p476p642r121j0525j0855j0769r098q391p411o585
345g6787l959r75q01j964r77J492J485r24j698l35K102K019P70J986O348Q176
$$ plain form
361 -64042 -56714 -49632 -40979 -30357 -20588 -13547 -7794 -551 6705 11902 16245 21263 28187 35124 41534
376 41534 48078 54782 61983 68310 72898 75658 77520 78127 78220 76882 73912 71145 68988 67573 65043 61991
392 61991 59116 57726 55433 50829 44435 38455 33273 26221 16610 7405 998 -4726 -12406 -19785 -24942
407 -24942 -27598 -30945 -36211 -41451 -44270 -47407 -51956 -57294 -61755 -64224 -66292 -68859 -70169 -69675 -67563
422 -67563 -65013 -62654 -59178 -55626 -51802 -47846 -44304 -41696 -38694 -34374 -29663 -25079 -21049 -15495 -7745
437 -7745 -80 5657 11388 18057 25580 30693 33819 36816 41471 45382 47363 48173 50778 54769 57401
452 57401 58190 58966 61183 63197 62356 60098 57943 55975 52654 48000 43249 39231 35240 31030 26409 21616
468 21616 17608 13716 9297 4308 -1560 -7281 -12644 -18004 -24089 -30618 -35229 -38845 -42112 -46094 -49500
$$ packed form
361f4042P328P082Q653J0622R769P041N753P243P256N197M343N018O924O937O410
376D1534O544O704P201O327M588K760J862O07R3j338k970k767k157j415k530l052
392F1991k875j390k293m604o394n980n182p052r611r205o407n724p680p379n157
407b4942k656l347n266n240k819l137m549n338m461k469k068k567j310M94K112
422f7563K550K359L476L552L824L956L542K608L002M320M711M584M030N554P750
437g745P665N737N731O669P523N113L126K997M655L911J981Q10K605L991K632
452E7401P89P76K217K014q41k258k155j968l321m654m751m018l991m210m621m793
468B1616m008l892m419m989n868n721n363n360o085o529m611l616l267l982l406
$$ plain form
483 -49500 -50730 -51106 -52383 -54762 -55457 -55385 -54451 -55303 -55889 -54864 -51718 -49351 -48022 -44624 -39771 -34091 -29633
500 -29633 -25702 -20728 -14837 -9285 -5199 -1330 3650 8501 12971 17103 21654 26558 31571 36155 39967
515 39967 43470 46571 49536 51546 52433 52676 53028 53296 52395 51012 49179 48570 47407 44735 41328 38506
531 38506 36498 33512 28009 22705 18023 14088 9061 2651 -2713 -6805 -10744 -15089 -20319 -24203 -27000
546 -27000 -29906 -33745 -37674 -40172 -42345 -44444 -46999 -48880 -49403 -49574 -49119 -49084 -47850 -45765 -43159 -40837
562 -40837 -38862 -36165 -32896 -28891 -25799 -23025 -19242 -14788 -10126 -5952 -1945 2566 7942 12431 15941
577 15941 19451 23541 27483 30426 32395 34604 37047 39069 40650 41344 42087 43357 43854 43071 42054 41518
593 41518 40524 38546 36074 33252 30653 27559 24622 20579 17300 14128 10993 7263 3366 -497 -3414
$$ packed form
483d9500j230l76j277k379o95P2R34q52n86J025L146K367J329L398M853N680M458
500b9633L931M974N891N552M086L869M980M851M470M132M551M904N013M584L812
515C9967L503L101K965K010Q87K43L52K68r01j383j833o09j163k672l407k822
531C8506k008k986n503n304m682l935n027o410n364m092l939m345n230l884k797
546b7000k906l839l929k498k173k099k555j881n23j71M55L5J234K085K606K322
562d0837J975K697L269M005L092K774L783M454M662M174M007M511N376M489L510
577A5941L510M090L942K943J969K209K443K022J581O94P43J270M97p83j017n36
593D1518r94j978k472k822k599l094k937m043l279l172l135l730l897l863k917
$$ plain form
608 -3414 -6699 -11112 -14770 -18064 -20885 -23490 -26699 -29668 -31733 -33109 -34160 -35622 -36873 -36956 -36626 -36996
624 -36996 -36835 -36736 -35199 -33828 -32475 -31171 -29107 -26434 -23742 -21648 -18538 -15263 -11571 -8777 -5823 -3218
640 -3218 513 3928 6577 9572 12058 15229 17837 20372 22277 24392 26865 28502 29843 30638 31426 32439
656 32439 32530 32347 31807 31453 30858 30036 28610 27273 25769 23994 21812 19605 17126 14924 12236 9347 6465
673 6465 3438 664 -1498 -4469 -7820 -10207 -12112 -14374 -16972 -19082 -21135 -22551 -24250 -26037 -27089
688 -27089 -27598 -28065 -28824 -29712 -29062 -28636 -28268 -27719 -26955 -25335 -23596 -22374 -21161 -18939 -16721 -14414 -12300
705 -12300 -10264 -7422 -4442 -2068 589 3270 5571 8079 10865 12955 15160 16938 19222 21197 22271
720 22271 23743 24725 26062 26854 27307 27217 27532 27624 26821 26319 25212 24452 23487 21507 19439 18159 16340 13956
$$ packed form
608c414l285m413l658l294k821k605l209k969k065j376j051j462j251q3L30l70
624c6996J61R9J537J371J353J304K064K673K692K094L110L275L692K794K954K605
640c218L731L415K649K995K486L171K608K535J905K115K473J637J341P95P88J013
656C2439R1j83n40l54n95q22j426j337j504j775k182k207k479k202k688k889k882
673F465l027k774k162k971l351k387j905k262k598k110k053j416j699j787j052
688b7089n09m67p59q88O50M26L68N49P64J620J739J222J213K222K218K307K114
705a2300K036K842K980K374K657K681K301K508K786K090K205J778K284J975J074
720B2271J472R82J337P92M53r0L15R2q03n02j107p60r65j980k068j280j819k384
$$ plain form
738 13956 11579 9152 7267 4864 2207 -667 -2845 -5138 -7781 -10107 -12577 -14096 -16506 -18208 -20227
753 -20227 -21775 -22738 -24167 -24967 -25653 -26188 -26300 -26200 -26089 -25585 -24878 -24280 -22852 -21715 -20166 -18469 -16418
770 -16418 -14542 -12432 -10439 -7881 -5372 -3333 -1321 1046 3599 6450 8210 10240 12611 14479 16136
785 16136 17672 19385 20952 22480 22863 23239 23884 24348 24317 24342 23794 23508 22743 21945 20534 19086 17813 16300
803 16300 14599 12581 10445 8452 6605 4520 2322 -418 -2446 -4464 -6484 -8473 -11099 -12487 -13843
818 -13843 -15463 -16801 -18482 -19097 -19901 -20996 -21616 -21632 -21690 -21624 -21511 -21152 -20452 -19472 -18807 -17685 -16288 -14756
836 -14756 -13305 -11981 -10275 -8048 -6581 -4551 -2939 -832 723 3103 4682 6361 8316 9928 11509
851 11509 12950 14070 15161 16381 17082 17825 18201 18572 18752 18937 18780 18406 18212 17968 17131 16013 14895 14183
$$ packed form
738A3956k377k427j885k403k657k874k178k293k643k326k470j519k410j702k019
753b0227j548r63j429q00o86n35j12J00J11N04P07N98J428J137J549J697K051
770a6418J876K110J993K558K509K039K012K367K553K851J760K030K371J868J657
785A6136J536J713J567J528L83L76O45M64l1K5n48k86p65p98j411j448j273j513
803A6300j701k018k136j993j847k085k198k740k028k018k020j989k626j388j356
818a3843j620j338j681o15q04j095o20j6n8O6J13L59P00R80O65J122J397J532
836a4756J451J324J706K227J467K030J612K107J555K380J579J679J955J612J581
851A1509J441J120J091J220P01P43L76L71J80J85j57l74j94k44q37j118j118p12
$$ plain form
869 14183 12978 11391 9921 8718 7040 5710 3888 2508 931 -459 -2102 -3738 -5513 -6938 -7993
884 -7993 -9566 -10666 -12008 -12756 -13805 -14875 -15255 -15623 -16116 -16246 -16608 -16227 -16239 -15958 -15722 -15001 -14561 -13818 -12807
903 -12807 -12014 -10822 -9905 -8156 -6896 -5672 -4475 -3065 -1345 -48 1247 2517 4309 5924 6956
918 6956 7988 8926 10475 11170 12036 12769 13585 14439 14807 14625 14950 14968 15043 14833 14292 13878 13435 13166 12212 11298
938 11298 10326 9711 8561 6954 5843 4373 3547 1927 734 -1165 -2223 -3400 -4648 -6100 -7480 -8450
954 -8450 -9291 -10555 -11190 -12125 -12968 -13285 -13503 -14093 -14696 -14541 -14317 -14445 -14361 -13953 -13197 -12245 -11805 -11129 -10115 -9192
974 -9192 -7981 -6840 -5979 -4255 -3283 -1796 -922 293 1924 3418 4761 5898 6991 8016 9162 10172
990 10172 10794 11551 12288 12846 13312 13386 13989 13955 13964 13636 13435 12902 12384 11868 11157 10127 9128 8529 7293 5889
$$ packed form
869A4183j205j587j470j203j678j330j822j380j577j390j643j636j775j425j055
884g993j573j100j342p48j049j070l80l68m93j30l62L81j2K81K36P21M40P43J011
903a2807P93J192R17J749J260J224J197J410J720J297J295J270J792J615J032
918F956J032R38J549O95Q66P33Q16Q54L68j82L25J8P5k10n41m14m43k69r54r14
938A1298r72o15j150j607j111j470q26j620j193j899j058j177j248j452j380r70
954h450q41j264o35r35q43l17k18n90o03J55K24j28Q4M08P56R52M40O76J014R23
974i192J211J141Q61J724R72J487Q74J215J631J494J343J137J093J025J146J010
990A0172O22P57P37N58M66P4O03l4Rl28k01n33n18n16p11j030r99n99j236j404
$$ plain form
1010 5889 4619 3753 2735 1201 25 -1011 -2419 -3595 -4795 -6247 -6990 -7745 -9027 -10153 -11116 -11286
1026 -11286 -11542 -12161 -12768 -13103 -12646 -13066 -12651 -12877 -12090 -11493 -11211 -10848 -9961 -8909 -8114 -7077 -6279 -5081
1044 -5081 -3976 -2954 -1445 -317 701 2103 2932 3772 4970 5756 6839 7952 8565 9481 10059 10501 11092
1061 11092 11368 11346 11876 11987 11334 11228 11107 11123 10504 9707 9015 8393 7726 6882 6124 4989 4236 3220 2189
1080 2189 936 68 -956 -2020 -3051 -3916 -4577 -5640 -6201 -6959 -7692 -8551 -8695 -9374 -9708 -10005 -10269 -10363
1098 -10363 -10413 -10043 -9943 -9741 -9514 -8648 -8545 -7770 -6961 -6223 -5737 -5198 -4184 -3344 -2364 -1543 -1094 93 959
1117 959 1728 2492 3334 4391 5103 5617 6007 7002 7527 7800 8011 8403 8391 8560 8798 8862 9035 8651 8686 8505 7964
1138 7964 7489 7149 6656 5948 5248 4594 4093 3365 2486 1791 829 430 -301 -1308 -2024 -2829 -3594 -4125 -4748
$$ packed form
1010E889j270q66j018j534j176j036j408j176j200j452p43p55j282j126r63j70
1026a1286k56o19o07l35M57m20M15k26P87N97K82L63Q87J052P95J037P98J198
1044e081J105J022J509J128J018J402Q29Q40J198P86J083J113O13R16N78M42N91
1061A1092K76k2N30J11o53j06j21J6o19p97o92o22o67q44p58j135p53j016j031
1080B189j253q68j024j064j031q65o61j063n61p58p33q59j44o79l34k97k64r4
1098a0363n0L70J00K02K27Q66J03P75Q09P38M86N39J014Q40R80Q21M49J187Q66
1117I59P69P64Q42J057P12N14L90R95N25K73K11L92j2J69K38O4J73l84L5j81n41
1138G964m75l40m93p08p00o54n01p28q79o95r62l99p31j007p16q05p65n31o23
$$ plain form
1157 -4748 -5478 -5726 -6363 -6787 -7357 -7792 -7453 -7792 -8235 -8230 -8315 -7869 -7769 -7764 -7538 -6924 -6400 -6394 -5617 -5501 -4717 -4058
1179 -4058 -3486 -2822 -1955 -1293 -473 -10 635 1521 2264 3068 3709 4305 4712 5169 6009 6362 6514 7013 7433 7611
1199 7611 7491 7461 7790 7634 7342 7451 7011 7042 6481 6084 5567 4968 4793 3779 3305 2565 2183 1044 498 -238
1219 -238 -965 -1622 -2178 -2835 -3342 -3970 -4723 -5285 -5468 -6255 -6551 -6926 -7023 -7347 -7287 -7688 -7561 -7006 -7008 -7016 -6520 -6592
1241 -6592 -5948 -5597 -5189 -4356 -4148 -3549 -3088 -2595 -1477 -1031 -456 502 1070 1558 2100 2956 3388 4302 4778
1260 4778 5092 5351 5992 5939 6692 6588 6899 7020 6644 6629 6662 6687 6490 5772 5789 5275 4811 4568 3981 3674 2948
1281 2948 2650 1852 1322 495 -39 -522 -1233 -2057 -2399 -2752 -3496 -4062 -4784 -4830 -5050 -5462 -5567 -5980 -5961 -6209
1301 -6209 -6125 -6003 -6158 -6139 -5923 -5597 -5173 -5006 -4604 -4141 -3691 -3470 -2929 -2056 -1746 -1188 -779 26 134 1061
$$ packed form
1157d748p30k48o37m24n70m35L39l39m43Nq5M46J00NK26O14N24OP77J16P84O59
1179d058N72O64Q67O62Q20M63O45Q86P43Q04O41N96M07M57Q40L53J52M99M20J78
1199G611j20l0L29j56k92J09m40L1n61l97n17n99j75j014m74p40l82j139n46p36
1219b38p27o57n56o57n07o28p53n62j83p87k96l75r7l24O0m01J27N55kqM96p2
1241f592O44L51M08Q33K08N99M61M93J118M46N75R58N68M88N42Q56M32R14M76
1260D778L14K59O41n3P53j04L11J21l76j5L3K5j97p18J7n14m64k43n87l07p26
1281B948k98p98n30q27n34m83p11q24l42l53p44n66p22m6k20m12j05m13J9k48
1301f209Q4J22j55J9K16L26M24J67M02M63M50K21N41Q73L10N58M09Q05J08R27
$$ plain form
1321 1061 1000 2050 2475 3010 3430 3660 4183 4433 4811 5148 5175 5014 5450 5544 5573 5727 5198 5060 4691 4624 4353
1342 4353 4037 3833 3584 3422 2744 2573 2187 1307 1245 566 29 -415 -841 -1157 -1608 -2178 -2431 -2700 -3292 -3711
1362 -3711 -4064 -4070 -4539 -4470 -4369 -4614 -4683 -4911 -4657 -4500 -4548 -4351 -4388 -3831 -3683 -3242 -3220 -3088 -2486 -2233 -1710 -1226
1384 -1226 -1174 -671 -155 255 404 857 1621 1808 2280 2332 2877 3085 3739 3923 3495 3542 4126 4063 4408 4087 4048
1405 4048 3851 4345 3586 3749 3672 3813 3408 3032 2753 2571 2270 1821 1211 831 469 566 140 -403 -646 -1210
1425 -1210 -1419 -2022 -2213 -2423 -2559 -2906 -3333 -3545 -3705 -3500 -3713 -4064 -4134 -3714 -3911 -3595 -3710 -3893 -3776 -3113
1445 -3113 -3142 -2943 -2775 -2216 -1964 -1682 -1320 -1274 -718 -213 57 489 636 1298 1457 1810 2083 2570 2717 2473
1465 2473 2970 3163 3344 3575 3494 3870 3618 3786 3758 3268 3392 3353 3346 3274 2808 2549 2536 2144 1843 1234 1074 992
$$ packed form
1321A061o1J050M25N35M20K30N23K50L78L37K7j61M36R4K9J54n29j38l69o7k71
1342D353l16k04k49j62o78j71l86q80o2o79n37m44m26l16m51n70k53k69n92m19
1362c711l53om69O9J01k45o9k28K54J57m8J97l7N57J48M41K2J32O02K53N23M84
1384a226N2N03N16M10J49M53P64J87M72N2N45K08O54J84m28M7N84o3L45l21l9
1405D048j97M94p59J63p7J41m05l76k79j82l01m49o10l80l62R7m26n43k43n64
1425a210k09o03j91k10j36l47m27k12j60K05k13l51p0M20j97L16j15j83J17O63
1445c113k9J99J68N59K52K82L62M6N56N05K70M32J47O62J59L53K73M87J47k44
1465B473M97J93J81K31q1L76k52J68k8m90J24l9pp2m66k59j3l92l01o09j60q2
$$ plain form
1487 992 509 37 -771 -659 -615 -1142 -1520 -1961 -2275 -2206 -2799 -2602 -2913 -3309 -3112 -3494 -3175 -3578 -3543 -3593 -3459
1508 -3459 -3596 -3509 -3003 -2912 -2977 -2303 -2328 -2224 -1748 -1329 -1104 -808 -312 -289 72 303 480 811 1482 1705 1906
1529 1906 2287 2560 2806 2589 2772 3044 2957 2892 3004 3328 3510 3400 2952 3209 3092 2590 2793 2401 1966 1772
1549 1772 1537 1182 1070 784 280 540 223 -237 -355 -852 -1087 -1293 -1621 -2053 -1954 -1968 -2504 -2427 -2645 -2652 -3025
1570 -3025 -2742 -2870 -2716 -2667 -2583 -2740 -2606 -2113 -2231 -2188 -2010 -1590 -1537 -1434 -1078 -931 -628 -115 -20 133 739
1591 739 621 908 757 1253 1216 1217 1650 1761 1854 1754 1932 2284 2035 2325 2293 2348 2160 2109 1925 1755 1868 1737
1613 1737 1552 1589 1469 1024 1055 896 910 931 496 242 -34 -280 -604 -692 -944 -1093 -1148 -1207 -1419 -1498 -1167 -1487
1635 -1487 -1411 -1684 -2152 -2247 -1991 -2280 -2145 -2179 -2114 -1926 -1886 -1534 -1567 -1283 -894 -1002 -963 -699 -956 -860 -633 -526
$$ packed form
1487I92m83m72q08J12M4n27l78m41l14O9n93J97l11l96J97l82L19m03L5n0J34
1508c459j37Q7N06R1o5O74k5J04M76M19K25K96M96K3L61K31J77L31O71K23K01
1529A906L81K73K46k17J83K72q7o5J12L24J82j10m48K57j17n02K03l92m35j94
1549A772k35l55j12k86n04K60l17m60j18m97k35k06l28m32R9j4n36P7k18pl73
1570c025K83j28J54M9Q4j57J34M93j18M3J78M20N3J03L56J47L03N13R5J53O06
1591G39j18K87j51M96l7JM33J11R3j00J78L52k49K90l2N5j88n1j84j70J13j31
1613A737j85L7j20m45L1j59J4K1m35k54k76k46l24q8k52j49n5n9k12p9L31l20
1635a487P6k73m68r5K56k89J35l4O5J88M0L52l3K84L89j08L9K64k57R6K27J07
$$ plain form
1657 -526 -57 -168 37 227 654 1020 985 1317 1289 1407 1593 1326 1881 1606 1464 1771 1548 1774 2030 1769 1919
1678 1919 2060 1739 1741 1582 1384 1027 1258 1017 670 428 206 355 162 33 146 -192 -165 -443 -527 -864 -851
1699 -851 -1135 -1214 -1429 -1888 -1878 -1618 -1623 -1589 -1751 -1740 -1932 -1647 -1401 -1919 -1708 -1530 -1721 -1362 -1473 -1159 -742 -891
1721 -891 -587 -481 -132 320 295 403 616 559 661 370 696 887 962 1433 1421 1848 1676 1732 2153 1891 1918 1646
1743 1646 1560 1564 1283 1388 1300 1078 1168 1071 960 954 836 840 776 257 242 231 -183 -696 -829 -695 -938 -1326 -822 -1000
1767 -1000 -1040 -1440 -1189 -1277 -1210 -929 -1495 -1448 -1648 -1828 -1564 -1607 -1402 -1007 -1107 -890 -776 -956 -510 -464 -400 -207
1789 -207 -307 -273 -352 59 10 407 426 649 996 1251 1148 1210 1195 1155 1203 1241 962 753 1161 1271 641 1049 1079
1812 1079 983 1244 1183 1263 1061 796 871 594 -20 266 -310 -146 -290 -49 -272 -284 -310 -435 -296 -539 -686 -722
$$ packed form
1657e26M69j11K05J90M27L66l5L32k8J18J86k67N55k75j42L07k23K26K56k61J50
1678A919J41l21Kj59j98l57K31k41l47k42k22J49j93j29J13l38K7k78q4l37J3
1699h51k84p9k15m59J0K60nL4j62J1j92K85K46n18K11J78j91L59j11L14M17j49
1721h91L04J06L49M52k5J08K13n7J02k91L26J91P5M71j2M27j72N6M21k62K7k72
1743A646q6Mk81J05q8k22R0r7j11oj18Mo4n19j5j1m14n13j33J34k43l88N04j78
1767a000m0m00K51q8O7K81n66M7k00j80K64m3K05L95j00K17J14j80M46M6O4J93
1789b07j00L4p9M11m9L97J9K23L47K55j03O2j5m0M8L8k79k09M08J10o30M08L0
1812A079r6K61o1Q0k02k65P5k77o14K86n76J64j44K41k23j2k6j25J39k43j47l6
$$ plain form
1834 -722 -916 -1010 -882 -1179 -1124 -1411 -969 -1115 -998 -1007 -682 -731 -682 -726 -454 -757 -659 -672 -855 -519 -639 -511 -434
1857 -434 235 77 78 418 501 625 839 635 721 125 443 289 723 607 759 849 1167 1201 1184 1184 790 907 1018
1880 1018 1056 528 442 217 409 575 26 401 301 63 379 304 90 66 -270 -169 -648 -552 -793 -556 -691
1901 -691 -806 -633 -547 -429 -954 -545 -774 -756 -714 -863 -731 -1036 -968 -992 -836 -526 -708 -484 -499 -22 -321 -162
1923 -162 -138 52 -221 -385 80 -44 -102 310 90 157 521 809 586 707 888 858 847 605 850 458 374 648
1945 648 506 250 910 732 867 739 638 812 514 679 381 195 78 -139 -403 -425 -326 -529 -58 -209 -300
1966 -300 -196 -145 -413 -352 -763 -582 -1146 -1021 -759 -992 -1010 -726 -610 -597 -352 -398 -277 -745 -532 -519 -612 -460
1988 -460 -205 -305 -299 -294 -221 72 66 490 685 646 450 580 734 373 282 162 523 382 548 888 821 720 1094
$$ packed form
1834g22j94r4J28k97N5k87M42j46J17rL25m9M9m4K72l03R8j3j83L36j20J28P7
1857d34O69j58JL40Q3J24K14k04Q6n96L18j54M34j16J52R0L18L4j7%l94J17J11
1880A018L8n28q6k25J92J66n49L75j00k38L16p5k14k4l36J01m79R6k41K37j35
1901f91j15J73Q6J18n25M09k29J8M2j49J32l05O8k4J56L10j82K24j5M77k99J59
1923a62K4J90k73j64M65j24n8M12k20O7L64K88k23J21J81l0j1k42K45l92q4K74
1945F48j42k56O60j78J35j28j01J74k98J65k98j86j17k17k64k2R9k03M71j51r1
1966c00J04N1k68O1m11J81n64J25K62k33j8K84J16J3K45m6J21m68K13J3r3J52
1988d60K55j00ONP3K93oM24J95l9j96J30J54l61r1j20L61j41J66L40o7j01L74
$$ plain form
2011 1094 727 616 751 561 480 407 289 208 21 309 -19 126 -10 254 263 -45 127 -73 -62 -616 -600 -649
2033 -649 -900 -663 -768 -625 -363 -290 -436 -460 -260 -490 -554 -420 -491 -686 -895 -702 -536 -629 -300 -276 -420 27
2055 27 115 158 105 196 336 253 281 115 232 260 64 197 165 383 496 785 828 632 618 541 657 556 476 221
2079 221 130 229 320 115 123 265 233 76 -67 261 283 115 -187 -23 -472 -506 -280 -389 -354 -552 -204 -285 -314 -86
2103 -86 -491 -380 -343 -646 -382 -621 -570 -587 -566 -170 -459 -204 -251 -155 -321 -111 -7 -154 -288 -364 -373 -84 -103 -262
2127 -262 50 243 538 467 418 437 735 591 29 333 462 416 425 401 217 135 401 319 262 276 406 328 242 512
2151 512 160 13 91 -184 179 56 -297 -134 -95 -126 -124 59 85 -273 -151 -140 -326 -519 -308 -446 -475 -359 -332
2174 -332 -95 -172 -8 -53 -328 1 -137 -183 -647 -223 -257 -371 -416 -306 -28 95 277 52 46 181 127 346 102
$$ packed form
2011A094l67j11J35j90q1p3j18q1j87K88l28J45j36K64Rl08J72k00J1n54J6m9
2033f49k51K37j05J43K62P3j46k4K00k30o4J34p1j95k09J93J66r3L29K4j44M47
2055B7Q8M3n3R1J40q3K8j66J17K8j96J33l2K18J13K89M3j96j4p7J16j01q0k55
2079B21r1R9R1k05QJ42l2j57j43L28K2j68l02J64m49l4K26j09L5j98L48q1k9K28
2103h6m05J11L7l03K64k39N1j7K1L96k89K55m7R6j66K10J04j47j34p6rK89j9j59
2127b62L12J93K95p1m9J9K98j44n62L04J29m6Rk4j84q2K66q2n7J4J30p8q6K70
2151E12l52j47P8k75L63j23l53J63L9l1KJ83K6l58J22J1j86j93K11j38k9J16K7
2174c32K37p7J64m5k75L29j38m6m64M24l4j14m5J10K78J23J82k25oJ35n4K19k44
$$ plain form
2197 102 189 -41 95 -35 26 375 41 493 402 596 700 396 448 287 256 496 284 414 359 408 -58 97
2219 97 428 180 324 235 106 282 202 -5 -413 -345 -105 -150 -432 -351 -364 -363 -252 -326 -15 -268 -344 -388 -268 -526
2243 -526 -439 -418 -484 -499 -190 -120 -81 -176 -31 -277 -255 10 100 99 -9 96 235 278 293 171 141 478 274 350 491
2268 491 468 500 540 490 596 383 216 479 222 345 379 186 189 230 295 122 67 177 -185 36 -116 98 -321
2291 -321 -209 -559 -231 -300 -89 -353 -93 -347 -363 -36 -350 -384 -310 -492 -137 -241 -304 -167 -375 -155 -198 -212
2313 -212 34 28 -235 -209 -101 -40 -62 173 -48 82 -8 112 228 567 2 195 212 318 255 310 210 356 233
2336 233 48 186 355 195 338 635 606 303 320 435 318 -4 98 46 -22 -57 -91 203 -23 -190 -242 -287 -331
2359 -331 -93 -83 -214 -354 -170 -137 -409 -518 -284 -377 -369 -399 -280 -164 -300 -402 -241 -294 -141 -266 -134 -160 -312
$$ packed form
2197A02Q7k30J36j30O1L49l34M52r1J94J04l04N2j61l1K40k12J30n5M9m66J55
2219I7L31k48J44q9j29J76q0k07m08O8K40m5k82Q1j3JJ11p4L11k53p6m4J20k58
2243e26Q7K1o6j5L09P0L9r5J45k46K2K65R0jj08J05J39M3J5j22l0L37k04P6J41
2268D91k3L2M0n0J06k13j67K63k57J23L4j93LM1O5j73n5J10l62K21j52K14m19
2291c21J12l50L28o9K11k64K60k54j6L27l14l4P4j82L55j04o3J37k08K20m3j4
2313b12K46ok63K6J08O1k2K35k21J30r0J20J16L39n65J93J7J06o3N5j00J46j23
2336B33j85J38J69j60J43K97k9l03J7J15j17l22J02n2o8l5l4K94k26j67n2m5m4
2359c31K38J0j31j40J84L3k72j09K34r3Ql0J19J16j36j02J61n3J53j25J32k6j52
$$ plain form
2382 -312 116 -192 77 -12 138 154 -97 48 180 192 79 297 191 273 178 230 54 343 425 296 340 139 309
2405 309 225 250 266 276 252 198 113 120 108 128 130 453 129 261 79 93 -166 -19 -335 42 -107 -212 -234 -359 -160
2430 -160 -593 -377 -388 -335 -468 -191 -276 -27 -345 -461 -575 -411 -274 -453 -311 -297 -99 -484 24 -158 -43
2451 -43 -204 -155 -152 -8 -40 -142 -27 16 -120 -111 73 274 236 123 278 292 454 319 299 381 233 42 431 330
2475 330 346 216 183 415 226 201 234 61 -59 187 -31 -281 -79 176 -152 -205 -163 -212 -205 -435 -346 39 -393
2498 -393 -596 -446 -250 -354 -459 -435 -273 -176 -179 -574 -273 -237 -50 -49 -211 -103 -225 -97 -37 236 -59 -25 108
2521 108 -228 272 170 163 133 54 390 105 367 148 346 193 265 233 250 323 334 369 501 254 441 65 613
2544 613 421 221 231 138 232 -27 -185 156 154 -10 -287 -346 -106 -138 41 74 -121 -279 -116 -644 -145 -482 -277
$$ packed form
2382c12M28l08K69q9J50J6k51J45J32J2j13K18j06Q2r5N2j76K89Q2j29M4k01J70
2405C09q4K5J6J0k4n4q5Pj2K0KL23l24J32j82J4k59J47l16L77j49j05k2j25J99
2430a60m33K16j1N3j33K77q5K49l18j16j14J64J37j79J42J4J98l85N08j82J15
2451d3j61M9LJ44l2j02J15M3j36RJ84K01l8j13J55J4J62j35k0Q2j48j91L89j01
2475C30J6j30l3K32j89k5L3j73j20K46k18k50K02K55l28n3M2m9Pk30Q9L85m32
2498c93k03J50J96j04j05K4J62R7ll95L01L6J87Jj62J08j22J28O0K73k95L4J33
2521A08l36N00j02pl0p9L36k85K62k19J98j53P2l2J7P3J1L5J32k47J87l76N48
2544F13j92k00J0r3R4k59j58L41kj64k77n9K40l2J79L3j95j58J63n28M99l37K05
$$ plain form
2567 -277 -121 -117 -349 -299 -197 -592 -409 -292 -460 -204 -420 27 -416 -141 -146 -82 -152 -457 -56 323 -27 84
2589 84 -204 -57 217 248 139 476 163 239 565 74 147 177 498 45 220 215 202 210 229 163 286 238 243 283 84
2614 84 9 358 359 -113 36 155 -106 260 -113 168 -144 -88 -133 -163 -448 -98 -47 -306 -107 -109 -153 -166 -385 -224
2638 -224 -384 -98 -194 -91 30 -444 -214 -100 -260 -83 -178 -198 -226 -363 -137 -101 162 -95 -33 -106 -241 -2
2660 -2 -67 88 67 106 190 280 221 434 548 284 479 270 515 146 265 149 58 303 315 281 508 -24 283 129
2684 129 348 89 12 -128 21 30 -186 32 -145 -44 -121 171 -63 -233 -282 -303 55 -443 -75 -441 -374 -140
2706 -140 -481 -127 -194 -408 -218 -232 -466 -328 -264 -415 -197 -248 -79 -257 32 -112 139 77 188 -216 -92 125
2728 125 423 293 61 138 132 258 222 188 284 213 468 285 387 430 339 100 313 444 176 299 -67 232 151
$$ packed form
2567b77J56Mk32N0J02l95J83J17j68K56k16M47m43K75nO4p0l05M01L79l50J11
2589H4k88J47K74L1j09L37l13P6L26m91P3L0L21m53J75nj3QJ9o6J23m8NM0j99
2614H4p5L49Jm72J49J19k61L66l73K81l12N6m5l0k85L50N1k59J99km4j3k19J61
2638b24j60K86r6J03J21m74K30J14j60J77r5k0k8j37K26L6K63k57O2p3j35K39
2660bo5J55k1L9Q4R0n9K13J14k64J95k09K45l69J19j16r1K45J2l4K27n32L07j54
2684A29K19k59p7j40J49Rk16K18j77J01p7K92k34j70m9k1L58m98L68l66O7K34
2706a40l41L54o7k14J90j4k34J38O4j51K18n1J69j78K89j44K51o2J11m04J24K17
2728A25K98j30k32P7oJ26l6l4R6p1K55j83J02M3r1k39K13J31k68J23l66K99q1
$$ plain form
2751 151 23 -62 44 -76 -179 -151 -59 -1 -113 -72 -51 -384 -151 -187 -370 -346 -491 -773 -383 -289 -591 -279 -33
2774 -33 -201 -144 -326 -265 -274 -318 -237 -203 -180 62 -17 -59 114 -219 348 182 -361 -44 145 18 111 -89 324 290
2798 290 233 576 372 346 250 461 443 266 349 387 495 365 294 0 295 29 386 149 247 20 82 248 188
2821 188 51 -3 -218 163 -127 -186 -72 -102 -374 -197 -197 -294 -383 -189 -58 -229 -434 -434 -273 28 -338 -295 -1
2844 -1 -422 -165 -297 -173 -178 -70 -146 -108 -170 -405 203 -119 117 239 108 86 -18 93 319 -48 458 106 -17
2867 -17 406 217 334 177 521 443 -24 309 279 50 -31 323 186 40 268 123 -14 245 -139 30 81 -279
2889 -279 156 -153 17 -166 -154 -31 -74 -306 -178 -143 -221 -286 -300 -194 -164 -323 -130 -355 -118 -329 -171 -305
2911 -305 -457 -348 -215 -253 -373 -205 -230 -409 -227 -378 -34 46 56 -5 -10 214 2 168 217 318 36 185 79
$$ packed form
2751A51j28q5J06j20j03K8R2N8j12M1K1l33K33l6j83K4j45k82L90R4l02L12K46
2774c3j68N7j82O1rm4Q1L4K3K42p9m2J73l33N67j66n43L17J89j27R3k00M13l4
2798B90n7L43k04k6r6K11j8j77Q3L8J08j30p1k94K95k66L57k37R8k27O2J66o0
2821A88j37n4k15L81k90n9J14l0k72J77%r7q9J94J31j71k05%J61L01l66M3K94
2844am21K57j32J24nJ08p6L8o2k35O08l22K36J22j31k2j04J11K26l67N06l52j23
2867a7M23j89J17j57L44p8m67L33l0k29q1L54j37j46K28j45j37K59l84J69N1l60
2889b79M35l09J70j83J2J23m3k32J28L5p8o5j4J06L0j59J93k25K37k11J58j34
2911c05j52J09J33l8j20J68k5j79J82j51L44Q0J0o1nK24k12J66M9J01k82J49j06
$$ plain form
2934 79 315 -27 326 269 303 196 359 274 159 87 324 135 175 207 389 179 62 382 136 296 33 236
2956 236 -135 78 74 -229 95 54 -179 -32 -79 34 -194 -20 -347 -186 2 -385 -554 -279 -308 -426 -410 -77
2978 -77 -143 -533 -362 -129 -241 -365 12 -187 26 -137 -230 -141 0 -228 -120 22 56 222 214 201 266 94 64
3001 64 196 -17 452 337 229 454 140 34 361 447 501 432 444 101 157 224 127 129 46 96 260 -79 65 7
3025 7 155 5 174 78 -336 -170 -218 -250 -301 -146 -180 -189 -504 -263 -408 -476 -440 -550 -486 -244 -416 -626 -206 -31
3049 -31 -374 -274 36 177 -65 16 -13 227 228 -190 8 -132 17 17 266 136 382 44 231 161 217 79 216
3072 216 192 189 147 345 210 207 227 242 212 201 276 51 248 191 199 92 13 111 47 173 -106 -107 -401 77 -64 -205
3098 -205 -314 -92 -192 -118 -329 -181 -77 -124 -279 -188 -226 -535 -201 -91 -285 -136 -400 -82 -250 -545 -274
$$ packed form
2934G9K36l42L53n7L4j07J63q5j15p2K37j89M0L2J82k10j17L20k46J60k63K03
2956B36l71K13ml03L24m1k33J47m7J13k28J74l27J61J88l87j69K75k9j18J6L33
2978g7o6l90J71K33j12j24L77j99K13j63r3Q9J41k28J08J42L4J66qj3O5j72l0
3001F4J32k13M69j15j08K25l14j06L27Q6N4o9J2l43N6O7r7Kq3N0J64l39J44n8
3025GJ48j50J69r6m14J66m8l2n1J55l4rl15K41j45o8L6j10O4K42j72k10M20J75
3049c1l43J00L10J41k42Q1k9K40Jm18J98j40J49%K49j30K46l38J87p0N6j38J37
3072B16k4lm2J98j35lK0J5l0j1P5k25J97n7Qj07p9R8o4J26k79jk94M78j41j41
3098b05j09K22j00P4k11J48J04m7j55R1l8l09L34J10j94J49k64L18j68k95K71
$$ plain form
3119 -274 -188 -160 -71 75 115 68 2 31 92 -285 266 167 402 299 243 255 57 386 380 442 233 281 383 356 278 127
3145 127 173 341 100 -8 196 425 191 131 -155 323 -133 309 -16 58 -160 -2 -190 60 -191 -63 1
3166 1 -25 -180 -164 -268 -463 -134 -220 80 -235 -69 -29 -278 -287 -36 -102 -418 -132 -10 -414 90 -304 -77 -244
3189 -244 -55 -65 70 -180 -135 135 -64 -90 156 27 -201 241 393 247 228 291 539 61 270 275 703 170
3211 170 297 296 277 145 406 248 65 185 55 258 186 -70 49 261 -129 -254 -142 93 -22 -102 -89 -149
3233 -149 96 -269 -121 -16 -83 -248 -281 -228 -472 -233 -256 -377 -247 -109 -136 -297 -269 -219 -525 -154 -245 -202 20
3256 20 -102 -117 -81 -164 -32 160 28 -56 90 115 153 216 141 23 166 394 400 217 125 162 275 630 171 671
3280 671 185 191 269 383 14 275 324 210 115 52 117 145 283 435 -106 76 -15 -12 -280 80 16 -229 -127 -112
$$ packed form
3119b74Q6K8Q9J46M0m7o6K9O1l77N51r9K35j03n6J2j98L29oO2k09M8J02k7p8j51
3145A27M6J68k41j08K04K29k34o0k86M78m56M42l25P4k18J58j88K50k51J28O4
3166Ak6j55J6j04j95L29q6L00l15J66M0k49rK51o6l16K86J22m04N04l94K27j67
3189b44J89j0J35k50M5K70j99k6K46j29k28M42J52j46j9O3K48m78K09NM28n33
3211A70J27jj9j32K61j58j83J20j30K03p2k56J19K12l90j25J12K35j15q0J3o0
3233a49K45l65J48J05o7j65l3N3k44K39k3j21J30J38k7j61K8N0l06L71r1M3K22
3256B0j22j5L6q3J32J92j32q4J46K5L8O3p5j18J43K28Oj83r2L7J13L55m59N00
3280F71m86OP8J14l69K61M9j14r5o3O5K8J38J52n41J82r1Lk68L60o4k45J02J5
$$ plain form
3304 -112 -299 -242 -140 37 -282 -315 -343 -19 -268 -226 5 -223 -151 -302 17 -403 -342 -163 -173 -79 46 146 -181
3327 -181 -164 -233 12 295 104 215 79 177 -37 333 404 268 116 135 305 63 80 227 229 20 166 68 178
3350 178 499 281 378 321 132 188 11 -8 65 168 5 106 -50 117 -78 46 -218 66 -302 -207 -174 153
3372 153 -305 -134 -115 -297 -379 -118 -45 -153 -217 -212 -157 -97 -65 -96 -1 -101 -127 -96 -111 43 -446 114 96 -232 40
3397 40 287 -169 -13 128 313 243 120 16 260 199 32 230 240 1 283 141 180 163 158 90 55 -82 13 274
3421 274 158 199 239 175 160 62 -4 63 -36 6 -3 -146 -129 15 -26 -90 56 -126 -95 3 -202 -253 -413 -348 -84 19
3447 19 -57 -98 -144 -295 -159 -241 -429 -282 -81 -194 -145 -201 -158 54 164 -127 -85 219 -44 -182 -56 -40 93
3470 93 184 171 175 221 264 402 105 102 163 -66 147 -9 118 50 246 254 52 181 224 179 5 204 -120 -30 56 150
$$ packed form
3304a12j87N7J02J77l19l3k8L24k49M2K31k28P2j51L19m20O1J79j0R4J25J00l27
3327a81J7o9K45K83j91J11j36R8k14L70P1j36j52J9J70k42J7J47Kk09J46r8J10
3350A78L21k18R7n7j89N6j77j9P3J03j63J01j56J67j95J24k64K84l68R5L3L27
3372A53m58J71J9j82q2K61P3j08o4NN5O0L2l1R5j00k6L1j5J54m89N60j8l28K72
3397D0K47m56J56J41J85p0j23j04K44o1j67J98J0k39K82j42L9j7no8l5j37R5K61
3421B74j16M1M0o4j5r8o6O7r9M2rj43J7J44m1o4J46j82L1R8k05n1j60O5K64J03
3447A9p6m1m6j51J36q2j88J47K01j13M9n6M3K12J10k91M2L04k63j38J26J6J33
3470I3R1j3MM6M3J38k97lO1k29K13j56J27o8J96Qk02J29M3m5j74J99l24R0Q6R4
$$ plain form
3496 150 507 -20 51 9 -328 43 -181 263 -17 -303 37 -219 -74 -368 -275 -204 -282 -165 -194 -6 -352 -68
3518 -68 16 -259 -288 -246 -421 -179 -159 -255 13 -5 -29 24 195 118 -163 14 66 51 76 16 219 88 333 155 544
3543 544 274 221 332 246 301 -37 77 415 202 400 207 -10 41 144 17 120 -167 -28 -50 -133 -13 -15 -45
3566 -45 67 -172 269 -141 -410 -3 -166 119 -30 -162 -196 -205 -346 -303 -126 -499 -339 -89 -372 109 -65 -218
3588 -218 -74 -202 6 -110 229 -122 -260 90 106 395 -288 -225 -146 -69 169 -130 336 -24 -29 359 -133 -48
3610 -48 385 103 273 46 220 -108 41 227 393 358 213 -48 361 -24 143 -16 147 219 121 77 1 105
3632 105 -17 33 -13 222 -88 -38 -69 -163 -379 -263 -90 -120 -241 -165 -84 -84 -191 -111 -12 9 -17 -127 -199 -253 -189 -222
3658 -222 -69 42 -3 -240 -34 32 -57 -86 75 -140 -137 -13 239 -211 151 129 -99 134 175 70 254 282 106
$$ packed form
3496A50L57n27P1m2l37L71k24M44k80k86L40k56J45k94R3P1p8J17k9J88l46K84
3518f8Q4k75k9M2j75K42K0r6K68j8k4N3J71p7k81J77N2j5K5o0K03j31K45j78L89
3543E44k70n3J11q6N5l38J14L38k13J98j93k17N1J03j27J03k87J39k2q3J20kl0
3566d5J12k39M41m10k69M07j63K85j49j32l4rj41M3J77l73J60K50k83M81j74j53
3588b18J44j28K08j16L39l51j38L50J6K89o83O3P9P7K38k99M66l60nL88m92Q5
3610d8M33k82J70k27J74l28J49J86J66l5j45k61M09l85J67j59J63P2r8m4p6J04
3632A05j22N0m6K35l10N0l1r4k16J16J73l0j21P6Q1%j07Q0R9K1k6j10p2n4O4l3
3658b22J53J11m5k37K06O6q9k9J61k15LJ24K52m50L62k2k28K33M1j05J84K8j76
$$ plain form
3681 106 -84 547 450 115 32 -233 67 -28 104 -182 314 258 270 154 -151 1 -133 -115 -171 37 47 -83 -397
3704 -397 -197 -260 -186 157 178 -248 -30 -196 -40 -218 -233 -67 -284 -10 -347 -99 -164 -168 289 -101 9 -119
3726 -119 207 -172 -247 -99 -234 -197 -107 181 -76 -50 43 -13 255 -68 181 193 -113 -74 330 142 387 263 94
3749 94 90 353 140 240 250 170 233 130 187 23 100 -150 -128 261 -11 32 36 268 154 262 97 135 -8 -95 -87
3774 -87 -246 56 25 -24 174 24 51 -193 -516 -115 -128 -351 -115 -276 -394 -188 -148 -229 -121 22 -26 -47 -266
3797 -266 132 -167 -91 -7 -270 -10 -161 291 -29 -74 196 -1 -57 -79 107 109 219 -55 130 239 10 336
3819 336 -85 -36 44 245 217 43 144 150 75 121 17 83 19 208 160 -128 115 31 -36 93 192 12 -177 -205 -177
3844 -177 -116 -180 62 -467 -142 -383 -157 -87 9 64 87 -221 -216 -97 -321 -194 -166 17 -221 48 -37 0 -117 -231
$$ packed form
3681A06j90O31r7l35q3k65L00r5J32k86M96n6J2j16l05J52j34J8n6K08J0j30l14
3704c97K00o3P4L43K1m26K18j66J56j78j5J66k17K74l37K48o5mM57l90J10j28
3726a19L26l79p5J48j35L7R0K88k57K6R3n6K68l23K49J2l06L9M04j88K45j24j69
3749I4mK63k13J00J0q0O3j03N7j64P7k50K2L89k72M3MK32j14J08j65L8j43q7Q
3774h7j59L02l1m9J98j50K7k44l23M01j3k23K36j61j18K06M0q1J08J43m8k1k19
3797b66L98k99P6Q4k63K60j51M52l20m5K70j97n6k2J86KJ10k74J85J09k29L26
3819C36m21M9Q0K01k8j74J01Op5M6j04O6o4J89m8k88K43q4o7J29R9j80j89k8K8
3844a77O1o4K42n29L25k41K26P0R6N5K3l08NJ19k24J27K8J83k38K69q5L7j17j14
$$ plain form
3868 -231 0 240 166 -162 20 -151 -55 56 9 132 -57 -151 -13 154 -6 -11 52 244 92 -22 112 -13
3890 -13 66 92 -157 147 38 72 -54 105 -27 -286 19 -101 36 226 -185 24 44 -53 -305 -120 -86 -176 44
3913 44 -158 -310 -125 -208 -198 -253 -210 -319 -94 71 37 -228 -9 -77 -101 0 -246 47 -150 -46 129 225 151
3936 151 -92 -86 -32 -167 -196 235 85 -33 22 95 90 204 209 -3 135 110 161 123 254 -45 173 7 151 155 96
3961 96 -120 175 135 185 321 39 -23 141 -59 279 -55 98 344 -161 -39 -22 105 -28 -158 25 31 -58 2
3984 2 -145 -14 83 -69 -145 -276 78 -106 -266 -247 -334 -46 66 -26 7 -30 -342 -206 -323 54 -35 221 -45
4007 -45 173 76 -134 -55 80 2 133 -65 -9 141 237 216 339 230 66 136 69 8 100 -100 17 75 67 90 197
4032 197 98 163 226 -101 27 269 295 156 -180 -21 64 25 -133 83 -316 52 -41 73 -96 -324 -9 -72 -146
$$ packed form
3868b31K31K40p4l28J82j71R6J11m7J23j89r4J38J67j60nO3J92j52j14J34j25
3890a3P9K6k49L04j09L4j26J59j32k59L05j20J37J90m11K09K0r7k52J85L4r0K20
3913D4k02j52J85q3J0n5M3j09K25J65l4k65K19o8k4J01k46K93j97J04J75R6p4
3936A51k43ON4j35k9M31j50j18N5P3nJ14Nk12J38k5N1l8J31k99K18j66J44Mn9
3961I6k16K95m0N0J36k82o2J64k00L38l34J53K46n05J22J7J27j33j30J83Oq9O0
3984Bj47J31R7j52p6j31L54j84j60J9q7K88J12r2L3l7l12J36j17L77q9K56k66
4007d5K18r7k10P9J35p8J31j98N6J50R6k1J23j09j64P0o7o1R2k00J17N8qK3J07
4032A97r9O5O3l27J28K42K6j39l36J59Q5l9j58K16l99L68r3J14j69k28L15o3p4
$$ plain form
4055 -146 -6 -164 -199 -152 -47 -137 -182 -74 258 195 -229 -139 -30 -24 29 -16 40 -119 100 247 -224 -128 -258 -294
4079 -294 -116 35 236 -111 -126 -88 109 95 227 273 -72 289 15 -135 138 -107 -218 -122 -103 265 -43 25
4101 25 234 54 78 -163 146 -2 110 -88 109 170 212 140 -13 -248 -195 112 -89 -129 -148 -92 79 -106 -88
4124 -88 -146 -270 27 11 14 -16 -459 -58 -95 -202 -18 -52 -114 -161 -187 79 52 -61 124 -49 -114 70 -278 115
4148 115 43 -223 -7 10 48 -161 272 323 144 -88 503 91 49 187 239 177 -26 -143 28 93 24 -76 34
4171 34 261 -183 101 230 -157 -139 272 153 -163 -22 -32 -22 71 -200 -13 -187 -108 -78 -218 -85 59 -302
4193 -302 -263 -116 -148 -29 -75 -197 -157 -83 114 -89 -194 68 -321 236 37 -303 -99 93 -277 127 299 -231
4215 -231 143 17 99 328 391 -139 -76 47 9 235 56 -140 102 77 7 59 155 229 291 -1 186 -295 -48
$$ packed form
4055a46J40j58l5M7J05r0m5J08L32o3m24R0J09ON3m5N6j59K19J47m71R6j30l6
4079b94J78J51K01l47j5L8J97j4J32M6l45L61k74j50K73k45j11R6J9L68l08O8
4101B5K09j80K4k41L09j48J12j98J97O1M2p2j53k35N3L07k01m0j9N6J71j85J8
4124h8n8j24K97j6Ll0m43M01l7j07J84l4o2m7k6K66k7j13J85j73o5J84l48L93
4148A15p2k66K16J7L8k09M33N1j79k32N91m12m2J38N2o2k03j17J71O5o9j00J10
4171C4K27m44K84J29l87J8M11j19l16J41j0J0R3k71J87j74P9L0j40J33J44l61
4193c02L9J47l2J19m6j22M0P4J97k03j05K62l89N57j99l40K04J92l70M04J72n30
4215b31L74j26Q2K29O3n30O3J23l8K26j79j96K42k5p0N2R6P4O2k92J87m81K47
$$ plain form
4238 -48 -164 -68 -122 -44 -16 42 -251 -225 4 -132 50 -48 -194 -26 -181 -148 -290 55 -180 -145 -154 -12 -184 109
4262 109 -383 -64 3 -14 -60 98 -130 225 15 -138 -128 -104 -50 24 6 69 138 -68 265 43 -47 -102 209 210 -166
4287 -166 -28 44 4 175 -23 155 18 -208 123 201 -21 -11 -92 -13 -94 38 108 -55 81 -20 198 241 -243
4310 -243 -148 350 164 127 62 97 39 -268 73 24 -228 -6 -206 -181 93 29 -136 -162 -543 -194 -118 219 70
4333 70 -38 -9 13 34 183 59 68 152 -13 -201 170 109 405 85 99 79 -244 71 -22 -222 -236 -61 263 -92
4357 -92 136 -230 -318 4 129 -75 -95 -7 61 150 19 -61 -9 -75 -74 -289 84 38 74 -287 -12 44 -88 112 113
4382 113 -297 51 -39 -312 -14 -104 -10 -278 -81 -106 19 -227 276 -37 -83 -184 76 179 115 8 338 217
4404 217 -80 -87 70 -269 -186 -147 -11 9 -18 59 17 23 317 152 -199 90 -91 -54 209 300 -124 -51 106 408
$$ packed form
4238d8j16R6n4P8K8N8k93K6K29j36J82r8j46J68j55L3j42L45k35L5rJ42j72K93
4262A09m92L19O7j7m6J58k28L55k10j53J0K4N4P4j8O3O9k06L33k22r0n5L11Jl76
4287a66J38P2m0J71j98J78j37k26L31P8k22J0q1P9q1J32P0j63J36j01K18M3m84
4310b43R5M98j86l7o5L5n8l07L41m9k52K22k00K5K74o4j65k6l81L49P6L37j49
4333G0j08K9K2K1J49j24RQ4j65j88L71o1K96l20J4k0l23L15r3k00j4J75L24l55
4357i2K28l66q8L22J25k04k0Q8O8Q9j31q0N2o6Jk15L73m6L6l61K75N6j32K00J
4382A13m10L48r0k73K98r0R4k68J97k5J25k46N03l13m6j01K60J03o4j07L30j21
4404B17k97pJ57l39Q3L9J36K0k7P7m2OK94j65l51K89j81L7K63R1m24P3J57L02
$$ plain form
4428 408 43 58 -46 175 425 180 167 148 219 130 31 295 -65 -98 21 -323 79 81 5 47 -104 -438 100 66
4452 66 -49 -43 -57 59 -57 -250 -186 -51 -206 -253 252 -212 -15 -282 -25 -74 185 -44 -41 -275 -66 46 31
4475 31 -81 -270 -22 -133 245 -178 -9 69 123 -6 -49 4 -226 -42 85 135 176 121 324 60 -109 -134 7
4498 7 -193 -178 187 -114 117 -14 157 -68 -97 -105 -156 -236 -238 32 115 -25 60 189 -74 -212 -223 23 28 -231 -105
4523 -105 111 315 60 -78 -50 -112 1 -86 193 -156 212 -63 -125 -193 -180 -162 -23 -142 -293 36 -32 -126 -260
4546 -260 -188 6 -70 19 -48 18 162 127 -103 249 -140 -17 -36 153 80 -58 198 -114 231 -31 -151 188 -61
4569 -61 -134 -80 -179 -202 41 118 122 -129 -104 187 -79 -12 266 -9 -158 -5 12 -173 -53 -62 36 -15 -66 -88 26 -56
4595 -56 -55 -9 -41 -88 -49 136 -106 234 0 -12 22 -271 -155 -80 39 -1 6 -89 -37 -2 250 -15 186 188 271 -7
$$ packed form
4428D08l65J5j04K21K50k45j3j9P1q9r9K64l60l3J19l44M02Kp6M2j51l34N38l4
4452F6j15Oj4J16j16j93O4J35j55m7N05m64J97k67K57m9K59k29Lk34K09J12j5
4475C1j12j89K48j11L78m23J69P8N4j29m3N3k30J84J27N0M1n5K03k64j69k5J41
4498Gk00J5L65l01K31j31J71k25k9qn1q0kK70Q3j40Q5J29k63j38j1K46Nk59J26
4523a05K16K04k55j38K8o2J13q7K79l49L68k75o2o8J3J8J39j19j51L29o8r4j34
4546b60P2J94p6Q9o7O6J44l5k30L52l89J23j9J89p3j38K56l12L45k62j20L39k49
4569f1p3N4r9k3K43P7Mk51K5K91k66O7K78k75j49J53J7j85J20rR8n1n1k2J14q2
4595e6JM6l2m7L9J85k42L40k34j2L4k93J16P5J19m0Pr5N2L5K52k65K01KQ3k78
$$ plain form
4621 -7 -97 267 -223 83 225 -161 91 -80 -204 23 -151 74 148 234 -188 12 -101 488 62 10 55 -3 67
4644 67 343 -13 -125 28 118 57 -122 -68 -136 -139 7 125 -263 74 -79 -251 -404 -37 -163 -160 4 -158 -132
4667 -132 -156 -299 114 -26 181 220 95 -3 -107 90 -5 28 255 -318 -153 -154 36 299 -14 44 68 224 -254
4690 -254 66 -25 -151 160 277 150 274 37 40 3 -156 94 -90 -105 -174 239 295 101 26 -18 -66 184 320
4713 320 177 13 -192 -331 -55 298 34 259 -211 32 -6 -85 89 -88 385 -141 113 57 51 27 -287 -164
4735 -164 29 -29 105 -83 -128 70 38 -156 -13 -200 -39 -74 -45 40 -336 -62 -25 -169 -127 20 20 150 149 66
4759 66 55 79 349 125 33 -55 148 184 -304 -28 315 -78 174 191 4 272 -84 144 60 141 201 91 140 211
4783 211 44 -66 120 291 84 -45 -187 -82 -145 -183 -174 -229 72 79 -3 -217 -111 50 99 -96 33 6 -90 -5
$$ packed form
4621gr0L64m90L06J42l86K52j71j24K27j74K25P4Q6m22K00j13N89m26n2M5n8P0
4644F7K76l56j12J53R0o1j79N4o8lJ46J18l88L37j53j72j53L67j26LJ64j62K6
4667a32k4j43M13j40K07L9j25r8j04J97r5L3K27n73J65jJ90K63l13N8K4J56m78
4690b54L20r1j26L11J17j27J24k37Ll7j59K50j84j5o9M13N6j94p5m4m8K50J36
4713C20j43j64k05j39K76L53k64K25m70K43l8p9J74j77M73n26K54n6ok4l14J23
4735a64J93n8J34j88m5J98l2j94J43j87J61l5K9Q5l76K74L7j44M2J47%J30jq3
4759F6j1K4K70k24r2q8K03L6m88K76L43l93K52J7j87K68l56K28q4Q1O0j10M9P1
4783B11j67j10J86J71k07j29j42J05o3l8Rn5L01Pq2k14J06J61M9j95J29k7r6Q5
$$ plain form
4807 -5 38 103 22 8 45 -103 -192 -100 119 -98 -32 -44 -9 81 185 -127 224 159 -160 -132 238 53 -115 -103 0
4832 0 102 45 455 45 45 83 28 329 136 -61 145 -91 33 -384 98 -108 -11 95 -3 123 -104 56 151
4855 151 -69 -235 -61 -47 116 42 63 30 -170 -68 3 146 -208 -153 56 75 -22 -105 -148 74 49 75 8 -153
4879 -153 -130 -30 -149 -165 38 96 159 -28 -42 -225 -92 -30 -36 263 76 104 -47 -48 -4 37 184 68 -93 144
4903 144 -58 -20 466 35 347 -10 208 -151 -213 165 84 6 -169 -288 -149 -232 -80 -98 145 -355 -219 300
4925 300 39 -83 118 -53 75 268 -117 178 85 -47 -161 84 70 30 112 191 138 -181 -16 -94 -18 -162 -206
4948 -206 -299 -66 54 -59 175 -317 -43 125 349 243 -9 128 -2 -63 -236 115 -108 265 -204 188 331
4969 331 40 -186 -288 84 -134 341 124 -83 -176 148 -167 71 11 -236 144 315 -276 -39 -28 144 135 28
$$ packed form
4807eM3O5q1j4L7j48q9R2K19k17O6j2L5R0J04l12L51o5l19K8L70j85j68J2J03
4832@J02n7M10m10%L8n5L01j93j97K06k36J24m17M82k06R7J06r8J26k27J60R5
4855A51k20j66J74J4J63p4K1l3k00J02P1J43l54N5K09J9r7q3m3K22k5K6o7j61
4879a53K3J00j19j6K03N8O3j87j4j83J33O2oK99j87K8j51jM4M1J47j16j61K37
4903A44k02L8M86m31L12l57K18l59o2L78q1p8j75j19J39q3J52j8K43n00J36N19
4925C00k61j22K01j71J28J93l85K95r3j32j14K45j4m0Q2P9n3l19J65p8P6j44m4
4948b06r3K33J20j13K34m92K74J68K24j06k52J37j30o1j73L51k23L73m69L92J43
4969C31k91k26j02L72k18M75k17k07r3L24l15K38o0k47L80J71n91K37J1J72rj07
$$ plain form
4991 28 180 86 -229 -149 -8 71 73 -156 137 -60 -13 8 -131 143 -201 14 10 -52 -327 -5 -160 5 27 -150
5015 -150 -157 216 -55 25 6 -175 93 -74 39 24 158 -59 183 176 96 -337 -153 284 -217 83 -60 -159 -113
5038 -113 -95 69 -50 -27 -6 137 149 26 48 22 130 -39 -28 186 192 -13 -32 -69 -265 -176 5 -46 -200 -72
5062 -72 -68 55 -16 -54 20 76 -149 -76 -213 -110 -165 -194 8 -52 -4 100 111 -8 105 -6 -312 -48 -60 -1 224
5087 224 148 -217 266 83 -16 -151 -57 -40 -48 -121 59 42 31 103 5 153 -65 61 -106 -15 -172 71 87 73 -40
5112 -40 -146 120 -70 -172 -188 158 176 10 163 -101 -1 34 -14 -67 -131 130 124 -130 29 -13 -87 -110 24 144
5136 144 182 -49 -110 -295 193 -104 -223 49 219 -287 182 -142 73 23 181 16 -16 -12 -133 22 -18 -262
5158 -262 36 78 52 -65 -294 -179 97 318 -16 168 -32 135 -139 58 13 -6 -49 162 34 98 -192 -77
$$ packed form
4991B8J52r4l15Q0J41P9Kk29K93j97M7K1j39K74l44K15mo2k75L22j55J65K2j77
5015a50pL73k71Q0j9j81K68j67J13j5J34k17K42pq0m33J84M37n01L00j43r9M6
5038a13J8J64j19K3K1J43J2j23K2k6J08j69J1K14Ok05j9l7j96Q9J81n1j54J28
5062g2MJ23p1l8P4N6k25P3j37J03n5k9K02o0M8J04J1j19J13j11l06K64j2N9K25
5087B24p6l65M83j83r9j35R4J7qp3J80j7j1P2r8J48k18J26j67R1j57K43J6j4j13
5112d0j06K66j90j02j6L46J8j66J53k64J00L5m8n3o4K61ok54J59m2p4k3J34J20
5136A44L8k31o1j85M88k97j19K72J70n06M69l24K15n0J58j65l2Mj21J55m0k44
5158b62K98M2k6j17k29J15K76K21l34J84k00J67k74J97m5j9m3K11j28O4k90J15
$$ plain form
5180 -77 -40 63 -6 60 -79 22 -52 -192 -4 85 -92 107 -147 162 -70 156 92 130 103 36 72 -241 -206 -117
5204 -117 -114 309 -84 -82 -117 -101 -21 -208 19 8 -23 104 -32 7 92 42 48 -181 32 215 -126 218 12 -126 -266
5229 -266 -22 33 48 -62 -355 4 -70 53 358 71 -167 193 45 88 -124 83 -144 5 257 -143 256
5250 256 -152 204 88 37 -126 -170 10 134 95 91 69 18 -21 -15 -250 -54 132 79 77 -5 -331 5 -145 65 -65
5275 -65 -77 40 0 37 -159 -57 -68 341 140 278 98 166 -97 39 174 -253 -67 -199 -35 -150 -129 -197 -154
5298 -154 -45 122 241 -204 125 -34 -156 -254 -146 16 -122 68 136 27 359 -46 -145 -258 101 114 46 79
5320 79 -205 11 30 251 -157 -47 -168 -97 204 308 -92 -314 36 -165 -11 -201 -140 -59 197 103 -200 -123
5342 -123 94 -288 -141 -22 55 103 -17 67 19 -192 -61 56 -222 153 48 99 -135 193 46 8 40 51 -377
$$ packed form
5180g7L7J03o9O6j39J01p4j40J88Q9j77J99k54L09k32K26o4L8k7o7L6l13L5Q9
5204a17LM23l93Kl5J6Q0j87K27j1l1J27j36L9Q5n0Ok29K13J83l41L44k06j38j40
5229b66K44N5J5j10k93L59p4J23L05k87k38L60j48M3k12K07k27J49K52m00L99
5250B56m08L56j16n1j63m4J80J24l9mk2n1l9Ok35J96J86n3kq2l26L36j50K10j30
5275f5j2J17m0L7j96J02j1M09k01J38j80O8k63J36J35m27J86j32J64j15K1o8M3
5298a54J09J67J19m45L29j59j22r8J08J62j38J90O8j09L32m05r9j13L59J3o8L3
5320G9k84K16J9K21m08J10j21P1L01J04m00k22L50k01J54j90O1Q1K56r4l03P7
5342a23K17l82J47J19P7M8j20Q4m8k11J31J17k78L75j05N1k34L28j47l8L2J1m28
$$ plain form
5365 -377 89 17 324 172 54 -45 29 -55 -75 -27 -150 -214 -78 -72 106 15 221 208 82 -140 95 57 54 96 -258
5390 -258 238 -60 -65 158 34 -274 161 84 18 -300 124 69 -119 219 -13 -133 -62 -199 -129 -323 -92 -100 -21
5413 -21 142 -272 327 37 -103 -296 -62 -75 -108 23 -232 258 -156 179 43 -64 -89 -39 65 -205 26 -115
5435 -115 -102 -88 65 39 -35 -188 -22 45 105 323 31 305 67 -285 -40 39 216 100 -124 32 150 -4
5457 -4 -35 77 144 -378 44 178 102 166 0 45 227 216 413 116 85 22 -86 10 103 -150 92 135 -121 260
5481 260 255 -132 -126 -143 -28 201 78 -24 86 -308 361 -64 -14 -108 -23 38 105 77 -145 38 -135 73 122 -51
5505 -51 90 147 -116 6 171 60 82 -35 -187 5 89 -153 -35 -262 222 15 193 286 126 333 -39 -42
5527 -42 94 194 -96 -175 -138 65 -56 57 2 -62 -129 -230 31 57 59 124 300 -71 -220 -59 -59 1 -99 41
$$ packed form
5365c77M66p2L07j52j18r9P4q4k0M8j23o4J36OJ78r1K06j3j26k22K35l8lM2l54
5390b58M96k98nK23j24l08M35p7o6l18M24n5j88L38k32j20P1j37P0j94K31qP9
5413b1J63m14N99k90j40j93K34j3l3J31k55M90m14L35j36j07k5N0J04k70K31j41
5435a15J3J4J53k6p4j53J66O7O0K18k92K74k38l52K45P9J77j16k24J56J18j54
5457dl1J12O7n22M22J34p6O4j66M5J82j1J97k97l1o3j08R6R3k53K42M3k56L81
5481B60nl87Oj7J15K29j23j02J10l94O69m25N0r4Q5O1O7k8k22J83j73K08M9j73
5505e1J41N7k63J22J65j11K2j17j52J92Q4k42J18k27M84k07J78R3j60K07l72l
5527d2J36J00k90p9L7K03j21J13n5o4o7j01K61K6KO5J76l71j49J61%O0j00J40
$$ plain form
5551 41 122 -56 49 108 -37 -181 -77 -100 -70 -9 -82 -62 -182 96 66 104 42 361 11 -150 51 89 -100 -136
5575 -136 176 -47 -111 136 3 30 43 -166 30 -180 74 -66 16 6 4 262 201 95 -27 -59 -94 48 32 -248
5599 -248 4 -37 47 -69 -129 138 -63 -77 64 -4 -83 196 234 -238 196 115 -96 -63 -146 -55 127 196 69 64 251
5624 251 38 -82 -47 -151 -15 179 -97 -129 -195 18 -15 -94 -13 -208 -95 65 -267 70 177 222 17 2 -37
5647 -37 220 24 155 -57 -93 93 -66 137 47 -168 174 150 -148 71 2 35 -36 107 -220 -25 157 -67
5669 -67 181 187 18 -288 201 -23 -47 83 -110 17 38 -42 -142 -159 206 244 155 -108 46 -38 133 -12 51 -162
5693 -162 -190 -229 -185 180 41 -25 -133 8 -208 -84 286 -14 108 -67 6 13 -87 80 -192 -31 300 -41
5715 -41 -183 -49 54 264 71 -232 -122 253 29 54 57 147 48 163 -45 -211 86 -67 35 -41 -165 -20
$$ packed form
5551D1Q1j78J05N9j45j44J04k3L0O1p3K0j20K78l0L8o2L19l50j61K01L8j89l6
5575a36L12k23o4K47j33K7J3k09J96k10K54j40Q2j0kK58o1j06j22l2l5J42j6k80
5599b48K52m1Q4j16o0K67k01j4J41o8p9K79L8m72M34q1k11L3q3R1J82O9j27nJ87
5624B51k13j20L5j04J36J94k76l2o6K13l3p9Q1j95J13J60l32L37J07M5k05j5l9
5647c7K57j96J31k12l6J86j59K03r0k15L42k4k98K19o9L3p1J43l27J95J82k24
5669f7K48Oj69l06M89k24k4J30j93J27K1q0j00j7L65L8q9k63J54q4J71j45O3k13
5693a62k8l9M4L65j39o6j08J41k16J24L70l00J22j75P3Pj00J67k72J61L31l41
5715d1j42J34J03K10j93l03J10L75k24K5LR0r9J15k08j66K97j53J02p6j24J45
$$ plain form
5737 -20 72 178 234 -26 -177 -113 -50 173 135 -75 -15 -63 -63 -58 93 -71 -287 57 -56 -286 -148 144 201 -88
5761 -88 -185 2 81 32 -10 171 -6 71 71 250 -20 -46 -153 -45 -174 47 -113 -157 25 -45 190 -206 -174 257
5785 257 -275 250 -106 -95 75 17 85 64 -102 -93 13 -67 217 -89 -293 71 -89 16 91 161 -122 6 -79
5808 -79 282 63 -68 -86 -155 146 -39 -445 -64 -64 25 316 -16 -142 -286 -45 -62 136 -262 17 -135 84
5830 84 -72 91 177 -29 -34 16 228 -184 3 109 45 17 -190 -195 -102 3 -74 -121 111 67 -118 -24 126 330 -41
5855 -41 45 152 118 -7 -133 -334 54 61 22 40 -57 40 48 -35 13 -186 -3 267 -19 0 162 -15 -191 -255 -258 146
5881 146 396 -270 -82 -130 13 39 248 -193 109 102 -140 -124 -154 -75 -81 108 104 151 -57 -366 -37 -1 202 -98
5905 -98 130 245 -78 -158 38 -285 -133 -28 -56 48 29 62 -129 -34 147 175 -76 182 47 26 -115 6 123
$$ packed form
5737b0R2J06N6k60j51O4O3K23l8k10O0m8%NJ51j64k16L44j13k30J38K92N7k89
5761h8r7J87P9m9m2J81j77P7%J79k70k6j07J08j29K21j60m4J82p0K35l96L2M31
5785B57n32N25l56J1J70n8O8k1j66RJ06q0K84l06k04L64j60J05P5P0k83J28q5
5808g9L61k19j31j8o9L01j85m06L81%Q9K91l32j26j44K41j7J98l98K79j52K19
5830H4j56J63Q6k06nN0K12m12J87J06o4k8k07nR3J05p7m7K32m4j85R4J50K04l71
5855d1Q6J07l4j25j26k01L88Pl9J8r7R7Qq3M8j99J83K70k86J9J62j77j76o4lM04
5881A46K50o66J88m8J43K6K09m41L02pk42J6l0P9oJ89mM7k08l09L29L6K03l00
5905i8K28J15l23q0J96l23J52J05k8J04j9L3j91R5J81K8k51K58j35k1j41J21J17
$$ plain form
5928 123 -138 36 41 54 -85 -74 -102 -150 -402 308 68 -100 -208 129 -14 -55 58 -120 -76 -197 184 -79 122
5951 122 -76 -130 252 -274 30 330 -34 -135 -136 -38 4 -114 -118 -134 -170 -14 17 111 -201 -35 -244 -38 -138 -97
5975 -97 141 -38 198 47 -172 142 24 -137 179 -73 -275 47 -165 63 -46 154 237 -50 31 299 -78
5996 -78 103 -85 104 44 -8 90 174 266 125 -202 295 51 39 53 -61 -252 225 5 -454 278 96 17 143
6019 143 -159 87 135 101 273 -47 -65 73 -25 -6 -22 -187 -106 293 8 29 244 -139 -4 64 -148 -7 -89
6042 -89 -88 187 26 -130 -418 25 124 175 84 -247 60 -158 119 128 -311 105 -4 380 -275 75 -21 -70 157
6065 157 193 -124 -5 -176 -82 269 -214 -149 49 87 -16 -37 60 113 174 40 226 54 -201 -152 76 -85 210
6088 210 208 -193 -62 -68 7 -282 -144 1 -151 -99 -148 -44 -125 -243 94 67 -104 -272 42 55 -203 -86 73
$$ packed form
5928A23k61J74NJ3j39J1k8m8k52P10k40j68j08L37j43m1J13j78M4j21L81k63K01
5951A22j98n4L82n26L04L00l64j01jR8M2j18mj6l6J56L1R4l12J66k09K06j00M1
5975i7K38j79K36j51k19L14j18j61L16k52k02L22k12K28j09K00Q3k87Q1K68l77
5996g8J81j88J89o0n2R8Q4R2j41l27M97k44j2J4j14j91M77k20m59P32j82p9J26
6019A43l02K46M8l4J72l20j8J38r8J9j6j65Q1L99k85K1K15l83J35O8k12J41q2
6042h9JK75j61j56k88M43R9N1r1l31L07k18K77Rm39M16j09L84o55L50r6m9K27
6065A57L6l17J19j71R4L51m83O5J98L8j03k1R7N3O1j34J86j72k55M9K28j61K95
6088B10km01J31oP5k89J38J45j52N2m9J04q1j18L37k7j71j68L14J3k58J17J59
$$ plain form
6111 73 1 -28 -234 60 191 24 146 130 -17 299 352 -33 -215 146 -209 -269 201 213 -116 183 83 -77
6133 -77 -214 -236 -77 -145 -51 130 -83 48 -180 33 154 120 53 108 102 324 53 -311 -163 233 306 310 15 7 -12
6158 -12 -165 -123 -70 207 116 -31 122 17 -38 -170 -106 130 -115 -175 13 130 -206 -183 -50 -213 202 -139 -253
6181 -253 -55 198 164 -62 -241 12 184 -189 91 -64 135 172 31 -212 40 123 58 164 -130 72 124 -4
6203 -4 48 159 42 148 -267 94 -191 117 -44 -156 -170 95 75 25 -239 125 -102 -81 -173 69 67 -8 -63 -62 90
6228 90 6 193 157 65 263 26 -59 228 -166 17 -152 73 -254 -25 -135 -155 248 113 -23 122 45 -76
6250 -76 47 158 201 -271 -90 198 140 -317 58 104 -243 -180 -3 -225 -70 121 7 457 80 -48 131 108
6272 108 -44 58 -214 -47 -194 -113 83 -107 -87 -30 -135 128 49 -26 11 -99 -10 -192 43 53 -301 211 -57
$$ packed form
6111G3p2k9k06K94J31j67J22j6j47L16N3l85j82L61l55o0M70J2l29K99j00j60
6133g7j37k2J59o8R4J81k13J31k28K13J21l4o7N5oK22k71l64J48L96P3Mk95qj9
6158a2j53M2N3K77r1j47J53j05n5j32O4K36k45o0J88J17l36K3J33j63M15l41j14
6181b53J98K53l4k26j79K53J72l73K80j55J99L7j41k43K52Q3o5J06k94K02N2j28
6203dN2J11j17J06m15L61k85L08j61j12j4K65k0n0k64L64k27K1r2K42kp5n5JJ52
6228I0q4J87l6r2J98k37q5K87l94J83j69K25l27K29j10k0M03j35j36J45p7j21
6250g6J23J11M3m72J81K88n8m57L75M6l47O3J77k22J55J91j14M50l77j28J79k3
6272A08j52J02k72J67j47Q1J96j90K0N7j05K63p9p5L7j10Q9j82K35J0l54N12k68
$$ plain form
6295 -57 166 -31 -186 57 166 224 116 83 -166 -24 174 131 112 -181 -124 200 76 104 96 67 236 -120 -210 178
6319 178 242 36 -42 -41 -11 82 -41 164 -50 -58 -315 27 283 -306 -6 233 222 -43 -66 -333 -132 -1 44 -64
6343 -64 -302 184 -95 -162 210 -48 -42 40 -87 87 -172 -129 -65 -78 -83 26 59 -9 70 -88 -249 96 -127 42
6367 42 -93 -144 164 149 193 -9 -40 -47 7 107 109 56 -102 -1 125 -175 -23 71 38 -109 -97 -161 37 101 -204
6392 -204 -94 60 146 45 -36 -176 -250 -132 160 -94 -99 19 -193 -79 62 7 -210 -71 -175 127 -160 -124
6414 -124 -191 -154 74 94 142 220 -230 126 -42 -57 -78 -84 -19 -30 148 -166 34 -90 36 -197 80 -75 -32 326
6438 326 200 -135 23 40 -104 199 34 250 168 58 -3 122 110 -108 -25 33 -108 -8 -34 -105 -287 -92 133
6461 133 -150 60 -78 86 15 -535 -247 -1 -73 15 34 66 124 -58 256 -156 -103 263 -7 -13 12 68 66 -101
$$ packed form
6295e7K23j97j55K43J09N8j08l3k49J42J98m3j9k93N7L24j24K8qk9J69l56r0L88
6319A78O4k06p8JL0R3j23K05k14qk57L42K56n89L00K39j1k65k3k67K01J31M5j08
6343f4k38M86k79o7L72k58OQ2j27J74k59M3O4j3nJ09L3o8P9j58j61L45k23J69
6367D2j35n1L08j5M4k02l1pN4J00Kn3j58J01J26l00J52R4l3j47J2o4J98O4l05
6392b04J10J54Q6j01q1j40p4J18K92k54nJ18k12J14J41n5k17J39j04L02k87L6
6414a24o7L7K28K0M8P8m50L56j68j5k1oO5j1J78l14K00j24J26k33K77j55M3L58
6438C26j26l35J58J7j44L03j65K16q2j10o1J25j2k18Q3N8j41J00k6p1j82J95K25
6461A33k83K10j38J64p1n50K88K46p2Q8J9L2N8j82L14m12N3L66k70oK5N6kj67
$$ plain form
6485 -101 -51 86 5 -86 146 -34 77 -226 -250 -62 -128 -129 0 142 -197 38 310 3 -127 -30 -198 -35 333
6508 333 75 151 7 -4 -116 125 218 105 122 -304 99 65 -59 45 37 85 73 -71 -172 -220 -15 199 -434
6531 -434 21 54 79 35 140 22 -22 105 34 121 -352 -77 -101 -107 -69 -120 203 43 -15 -90 -27 -21 -104 72 -110 -122
6557 -122 -70 44 -28 126 -272 174 -223 151 -143 -149 56 151 72 -59 113 -348 143 -163 -129 155 357 -156
6579 -156 44 117 -150 -2 10 9 -49 55 145 -197 -123 -43 -29 44 -93 -18 27 40 26 -81 -265 -18 -166 32 106
6604 106 165 -65 15 21 274 -342 -224 -8 86 77 -95 234 -52 -122 -53 -20 120 -59 -61 -101 204 -52 76 -66
6628 -66 -170 16 172 -170 1 -60 301 141 19 380 -139 -122 -49 -124 -161 199 32 171 -75 9 19 -120 -328
6651 -328 62 -49 260 -83 148 215 -20 -223 47 175 86 -213 -33 173 -42 273 37 12 -89 -251 -290
$$ packed form
6485a01N0J37q1r1K32j80J11l03k4J88o6jJ29J42l39K35K72l07j30R7j68J63L68
6508C33k58P6j44j1j12K41R3j13J7m26M03l4j24J04qM8j2j44j01m8K05K14o33
6531d34M55L3K5m4J05j18m4J27p1Q7m73K75k4oL8n1L23j60n8p5O3Oq3J76j82j2
6557a22N2J14p2J54l98M46l97L74k94oK05R5p9j31J72m61M91l06L4K84K02n13
6579a56K00P3k67J48J2jn8J04R0l42P4Q0J4P3j37P5M5J3j4j07j84K47j48J98P4
6604A06N9k30Q0OK53o16J18K16R4rj72L29k86p0O9L3J40j79km0L05k56J28j42
6628f6j04J86J56l42J71o1L61j60j22L61n19J7P3p5l7L60j67J39k46Q4J0j39k08
6651c28L90j11L09l43K31O7k35k03K70J28q9k99J80K06k15L15k36k5j01j62l9
$$ plain form
6672 -290 -277 -43 -164 189 -124 26 -58 -122 237 18 -13 -125 -130 -120 -135 -133 14 186 213 48 -83 235 109 -11
6696 -11 -122 13 134 1 -54 70 1 196 225 5 221 88 20 128 10 -75 6 -59 -63 80 165 178 145 -328
6720 -328 59 -87 -45 -77 -141 -201 148 77 251 -97 -306 61 68 -117 235 -81 -53 -28 232 184 -47 70 -1 64
6744 64 4 -147 27 111 15 -49 -23 110 55 -68 -94 -175 214 -7 -323 -258 286 -141 -3 -91 83 -127 96 -138
6768 -138 -157 252 132 31 190 115 -225 164 -49 221 -186 221 69 76 -1 -36 -164 -22 -37 -10 20 -6 117
6791 117 -130 -68 -192 302 113 77 -81 -50 -229 214 214 29 -152 34 212 24 -162 -58 -20 137 60 -15 158
6814 158 1 378 121 64 -181 376 58 10 5 106 -66 73 -199 119 73 -272 -94 -56 -264 184 44 -80
6836 -80 147 96 86 261 92 -95 -30 9 18 141 10 -224 -268 -157 -162 -175 271 -152 -52 -53 -267 104 239 68
$$ packed form
6672b90J3K34j21L53l13J50q4o4L59k19l1j12nJ0j5KJ47J72K7j65j31L18j26j20
6696a1j11J35J21j33n5J24o9J95K9k20K16j33o8J08j18q5Q1o5mJ43Q5J3l3m73
6720c28L87j46M2l2o4o0L49p1J74l48k09L67Pj85L52l16K8K5K60m8k31J17p1O5
6744F4o0j51J74Q4r6o4K6J33n5j23k6q1L89k21l16O5N44m27J38q8J74k10K23k34
6768a38j9M09j20j01J59p5l40L89k13K70m07M07j52Pp7l5j28J42j5K7L0k6J23
6791A17k47O2j24M94j89l6j58L1j79M43%j85j81J86J78j88j86J04L8J57p7p5J73
6814A58j57L77k57n7k45N57l18m8nJ01j72J39k72L18m6l45J78L8k08M48j40j24
6836h0K27n1j0J75j69j87O5L9RJ23j31k34m4J11nj3M46m23J00jk14L71J35j71
$$ plain form
6860 68 17 -33 28 -206 -26 300 -201 160 -32 8 193 -339 -128 -72 -148 -246 3 -30 -247 59 -139 -50 57
6883 57 259 73 -40 -142 -52 -100 115 -56 206 84 43 266 187 -173 40 194 -23 -74 118 -87 -63 -119 147
6906 147 -19 24 28 161 180 16 178 33 -37 -154 -218 -48 222 -97 78 110 -162 -104 107 -102 -188 -101 127
6929 127 39 -32 346 -35 -197 -140 -4 219 35 -95 -184 24 285 -72 -71 -166 -66 -46 -68 -148 0 -66 155 42
6953 42 -37 -71 -119 116 -61 46 265 95 44 114 195 15 -200 -55 36 4 -109 -335 345 73 169 -210 -40
6976 -40 121 162 36 -106 -126 -135 -76 33 -324 167 296 -148 -86 -53 63 -36 -234 134 -165 347 105 188 74
6999 74 -149 -95 -224 -123 -80 -252 -191 -103 106 97 -228 45 -50 58 60 187 162 12 31 113 62 -57 51 26 168
7024 168 0 -8 -119 45 141 6 -217 259 -136 -149 6 -42 -194 111 -52 -119 -183 -41 211 231 160 88 -16
$$ packed form
6860F8n1n0O1k34J80L26n01L61j92M0J85n32K11N6p6r8K49l3k17L06j98Q9J07
6883E7K02j86j13j02R0m8K15j71K62j22m1K23p9l60K13J54k17n1J92k05K4n6K66
6906A47j66M3MJ33J9j64J62j45p0j17o4J70K70l19J75L2k72N8K11k09q6Q7K28
6929A27q8p1L78l81j62N7J36K23j84j30q9K08K61l57Jr5J00K0k2q0J48o6K21j13
6953D2p9l4m8K35j77J07K19j70n1P0Q1j80k15J45R1l2j13k26O80k72R6l79J70
6976d0J61M1j26j42k0rN9J09l57M91J29m44O2L3J16r9j98L68k99N12k42Q3j14
6999G4k23N4j29J01M3j72O1Q8K09rl25K73r5J08KJ27k5j50J9Q2n1j19J08k5J42
7024A68j68qj11J64R6j35k23M76l95j3J55m8j52L05j63o7o4J42K52K0p1p2j04
$$ plain form
7047 -16 77 -124 -29 95 -98 -17 51 81 65 -276 173 457 95 110 147 -90 -120 -194 138 -30 60 30 119 -39 -240
7072 -240 -199 237 221 12 -131 -36 202 -156 -152 132 135 -127 -161 84 -93 64 157 -44 -101 -231 8 138 -104
7095 -104 -72 34 26 143 -47 -116 120 259 438 107 30 138 -127 191 27 72 -229 -199 14 228 -210 127
7117 127 189 -55 -111 288 122 -198 -10 -149 79 109 33 -92 146 126 197 -61 -82 -10 -141 168 -89 -137 49
7140 49 -256 -112 62 148 -86 -54 25 -189 -144 -12 30 277 65 21 6 29 -200 -234 -195 22 -128 115 88 2
7164 2 178 -52 -95 -118 -12 -87 259 -11 81 -149 -59 55 -190 -191 224 -203 -4 -379 130 -56 46 64 -197
7187 -197 -106 23 329 -107 300 -116 4 -163 84 241 28 -65 48 20 -193 107 21 123 128 -30 133 63
7209 63 154 -169 18 82 101 -2 -102 61 166 -14 4 -77 45 145 15 216 -143 -187 -180 59 167 -95 -178
$$ packed form
7047a6R3k01R5J24j93Q1O8L0j6l41M49K84l62J5L7k37l0p4L32j68R0l0Q9j58k01
7072b40M1M36j6k09j43R5K38l58MK84Lk62l4K45j77J57R3k01n7j30K39J30k42
7095a04L2J06qJ17j90o9K36J39J79l31p7J08k65L18j64M5l01L0K13K14m38L37
7117A27O2k44n6L99j66l20J88j39K28L0p6j25K38k0P1k58k1P2j31L09k57m8J86
7140D9l05J44J74Q6k34L2P9k14M5J32M2K47k12m4j5K3k29l4L9K17j50K43k7q6
7164BJ76k30m3k3J06p5L46k70R2k30R0J14k45jM15m27J99l75N09j86J02J8k61
7187a97R1J29L06m36M07m16J20j67K47J57k13r3J13k8k13L00q6J02Nj58J63p0
7209F3R1l23J87O4J9j03j00J63J05j80J8q1J22J00j30K01l59m4PK39J08k62q3
$$ plain form
7232 -178 249 208 102 -124 368 214 -25 209 -247 195 20 -46 68 -113 -182 200 -133 93 56 -181 26
7253 26 -115 -178 -131 27 12 -75 6 -134 70 -62 220 389 114 122 175 21 63 102 -244 -119 -143 -100 -226 -18
7277 -18 -99 69 -32 -144 322 158 82 24 195 -109 270 292 27 140 185 -14 -223 122 92 215 -150 94
7299 94 111 84 40 -147 -78 38 -224 165 -53 -309 -35 -155 -212 -212 -100 -129 298 76 -93 -29 -193 228 22
7322 22 -309 -115 186 -38 84 180 106 15 119 -86 -30 185 -58 28 15 41 -76 187 93 -59 139 -44 -49 42
7346 42 -34 76 24 170 18 1 92 69 87 70 182 -57 -24 -130 -17 -176 243 107 -113 107 122 65 32 197
7370 197 -59 36 -253 203 263 49 -115 78 31 150 -138 -14 -266 131 -93 -134 72 -35 -159 -227 -98 84
7392 84 -132 -213 -126 -58 40 -174 -397 60 181 186 74 -156 111 -35 187 232 406 44 -5 -30 -98 -369 -46 -39
$$ packed form
7232a78M27m1j06k26M92j54k39K34m56M42j75o6J14j81o9L82l33K26l7k37K07
7253B6j41o3M7J58j5q7Q1j40K04j32K82J69k75QN3j54M2L9l46J25k4M3j26K08
7277a8q1J68j01j12M66j64p6n8J71l04L79K2k65J13M5j99k09L45l0J23l65K44
7299I4J7k7m4j87O9J16k62L89k18k56K74j20n7%J12k9M27k22j69O4j64M21k06
7322B2l31J94L01k24J22R6p4r1J04k05N6K15k43Q6j3K6j17K63r4j52J98j83nR1
7346D2p6J10n2J46j52j7R1k3J8j7J12k39L3j06J13j59M19j36k20K20J5n7l3J65
7370A97k56R5k89M56O0k14j64J93m7J19k88J24k52L97k24m1K06j07j24o8J29J82
7392H4k16q1Q7O8R8k14k23M57J21Nj12k30K67j46K22M5J74l62m9k5o8k71L23P
$$ plain form
7416 -39 -145 53 5 -337 156 -22 -102 -23 53 -27 -110 162 195 -29 -21 -15 -72 123 171 -190 85 198 -172 -120 151
7441 151 124 -155 172 223 59 -18 84 -3 -268 120 3 -131 -225 12 34 -55 83 29 2 -20 72 85 49 -57
7465 -57 296 -338 -82 27 -31 145 -174 57 -48 -224 -173 92 402 -3 120 -201 42 8 -8 24 71 276
7487 276 84 22 56 209 -329 84 -49 73 -171 -175 53 105 80 -36 -137 150 158 -20 -198 -36 32 -272 213
7510 213 153 253 -188 -215 235 -107 140 -209 -241 79 38 72 -221 -53 24 116 127 121 75 199 -12 -4 68 62 5 -225
7536 -225 -53 -47 75 37 231 62 -236 -12 -52 -141 -97 -118 -2 -106 -117 124 12 -131 193 111 70 -65 -128 -21
7560 -21 43 -131 -154 -119 104 -13 126 -115 22 -191 -61 -152 111 57 -480 -23 31 77 67 46 7 -6 6 111
7584 111 92 -6 -108 -306 110 -3 -113 354 12 -17 -116 125 179 -12 272 -31 -34 -162 201 -19 -276 -42
$$ packed form
7416c9j06J98m8l42M93j78q0P9P6q0q3K72L3k24QOn7J95M8l61K75J13l70N2K71
7441A51k7k79L27N1j64p7J02q7k65L88j17j34r4K37K2q9J38n4k7k2R2J3l6j06
7465e7L53o34K56J09n8J76l19K31j05j76N1K65L10m05J23l21K43l4j6L2M7K05
7487B76j92o2L4J53n38M13j33J22k44mK28N2k5j16j01K87Qj78j78J62O8l04M85
7510B13o0J00m41k7M50l42K47l49l2L20m1L4k93J68P7R2J1om6J24k11QP2on7k30
7536b25J72OJ22l8J94j69k98K24m0q9M4k1J16j04j1K41j12j43L24q2m1j35o3J07
7560b1O4j74k3L5K23j17J39k41J37k13J30r1K63n4n37M57N4M6j0k1l9j3J2J05
7584A11j9r8j02j98M16j13j10M67l42k9r9K41N4j91K84l03lj28L63k20k57K34
$$ plain form
7606 -42 -70 90 -57 7 -33 50 -14 242 78 -69 -189 -23 -37 -96 331 357 88 -256 -200 74 284 34 -1 -192
7630 -192 -16 -102 302 -131 0 103 43 -148 -329 -206 33 -12 -18 39 -23 268 172 68 251 -66 -196 -65 -67
7653 -67 -1 -17 -134 79 19 219 -68 2 85 -110 -32 20 81 13 -134 -385 164 24 -60 29 78 91 -152 181 -96
7678 -96 29 364 61 80 -170 -100 88 175 60 191 -43 -56 51 135 138 -142 19 79 229 239 57 179 -27
7701 -27 -64 333 -137 216 -294 -222 25 56 313 -66 -244 149 -168 150 -162 -2 146 224 70 -178 -19 -137
7723 -137 -90 33 78 -12 -147 82 33 10 178 -247 110 260 -24 -40 64 4 -34 -183 121 -35 -360 -135 93
7746 93 237 -5 -139 23 -201 65 361 230 -118 -81 -105 111 143 -2 -85 211 236 -18 -265 -5 -22 42 17
7769 17 -56 -124 -90 55 93 195 131 -60 -11 -89 -262 23 42 80 121 95 18 36 1 91 -290 417 19 98 -94 -137
$$ packed form
7606d2k8J60j47O4m0Q3o4K56j64j47j20J66j4n9M27K6k69l44N6K74K10k50l5j91
7630a92J76q6M04m33J31J03o0j91j81J23K39m5oN7o2K91r6j04J83l17j30J31k
7653f7O6j6j17K13o0K00k87P0Q3j95P8N2O1o8j47k51N49j40q4Q9M9J3k43L33k77
7678i6J25L35l03J9k50P0J88Q7j15J31k34j3J07Q4Lk80J61O0J50J0j82J22k06
7701b7l7L97m70L53n10P2K47L1K57l79j78L93l17L18l12J60J48P8j54k48J59j18
7723a37M7J23M5r0j35K29m9k3J68m25L57J50k84j6J04o0l8j49L04j56l25K25K28
7746I3J44k42j34J62k24K66K96j31l48L7k4K16L2j45q3K96K5k54k47K60j7O4k5
7769A7p3o8L4J45L8J02o4j91M9p8j73K85J9L8M1k6p7J8l5R0l81P07l98P9j92m3
$$ plain form
7795 -137 154 44 362 19 -146 -28 86 -137 -13 272 -194 -87 118 -236 -96 -149 1 115 -142 70
7815 70 -208 -235 7 152 -116 2 -98 21 60 122 -8 17 -101 358 159 -185 -153 51 108 143 35 -174 265
7838 265 52 61 1 -208 119 -1 -3 -15 102 73 -219 3 -136 -53 106 -148 108 69 96 40 -169 -12 -15 30 173
7863 173 135 114 -35 18 58 104 85 212 21 90 -13 -82 -74 -110 -257 103 -65 77 -45 81 133 -91 -91 45 122
7888 122 55 208 -81 -113 -185 109 -32 -90 41 13 -23 -14 -37 -92 45 130 -113 -141 11 236 225 -94 -75 -24 25
7913 25 51 -247 132 7 -22 -212 -17 -42 137 106 115 123 -215 208 299 1 -70 12 -145 325 80 -306 351 -178
7937 -178 36 38 -55 86 248 -68 -52 -137 49 -54 -108 101 116 40 -267 28 219 -28 176 82 -177 163 232
7960 232 -32 -56 -74 -85 -208 -3 126 -27 -16 17 -90 -116 172 136 10 -49 89 11 147 68 -115 -73 -61 24
$$ packed form
7795a37K91j10L18l43j65J18J14k23J24K85m66J07K05l54J40n3J50J14k57K12
7815G0k78k7K42J45k68J18j00J19L9O2j30K5j18M59j99l44L2K04N7L5j08k09M39
7838B65k13Ro0k09L27j20kj2J17k9k92K22j39Q3J59k54K56l9K7n6k09J57lM5J43
7863A73l8k1j49N3M0M6j9J27j91O9j03o9Ql6j47L60j68J42j22J26N2k24%J36P7
7888A22o7J53k89l2p2K94j41n8J31k8l6Rk3n5J37Q5k43k8J52K25j1l19J9N1M9
7913B5K6k98L79j25k9j90J95k5J79l1RQl38M23R1k98p1Q2j57M70k45l86O57n29
7937a78K14Kr3J41J62l16J6q5J86j03n4K09J5p6l07K95J91k47K04r4k59L40O9
7960B32k64k4j8j1j23K05J29j53J1L3j07k6K88l6j26n9J38p8J36p9j83M2J2Q5
$$ plain form
7984 24 147 94 147 226 66 -91 29 53 -285 159 -108 22 38 -19 375 32 129 102 -101 91 18 -244 190
8007 190 -218 -173 -85 -182 17 -31 -131 -178 174 -7 52 -158 167 -77 -201 65 -355 57 171 -202 -18 -201
8029 -201 -31 34 80 -77 -256 85 85 328 -34 -154 72 89 -49 83 51 -223 73 0 -99 192 48 51 90 -95
8053 -95 -11 -6 -185 -82 27 248 153 -34 -95 139 75 -174 -99 139 99 35 47 -53 -107 107 134 47 17 100 -188
8078 -188 25 121 -119 225 366 -28 -50 -154 1 -41 64 93 -54 64 -16 81 58 -60 -133 -267 350 161 235
8101 235 -133 61 -120 52 -184 -45 79 18 -10 13 -286 187 -54 -50 180 -85 -132 -38 -188 -85 99 108 61
8124 61 24 309 -52 -55 192 215 -265 -202 87 -145 -171 -199 -306 254 -129 -50 -45 -115 -155 28 -8 -238 -102 127 167
8149 167 69 -152 40 97 105 115 -36 -25 9 236 -103 159 277 -76 -197 175 45 244 -78 174 -133 137
$$ packed form
7984B4J23n3N3P9j60j57J20K4l38M44k67J30J6n7L94l43R7k7k03J92p3k62M34
8007A90m08M5Q8r7J99m8j00m7L52j81N9k10L25k44j24K66m20M12J14l73J84j83
8029b01J70O5M6j57j79L41%K43l62j20K26J7j38J32l2k74K96p3r9K91j44LL9j85
8053i5Q4Nj79J03J09K21r5j87o1K34o4k49P5K38m0o4J2j00n4K14K7q7l0Q3k88
8078a88K13R6k40L44J41l94k2j04J55m2J05K9j47J18q0R7k3j18p3j34O17j89P4
8101B35l68J94j81J72k36J39J24o1k8K3k99M73k41MK30k65m7R4j50J03J84Rm7
8124F1l7K85l61lK47K3m80O3K89k32k6k8j07N60l83P9Np0m0J83l6k30J36K29M0
8149A67r8k21J92N7QJ0j51J1L4K27l39K62J18l53j21L72j30J99l22K52l07K70
$$ plain form
8171 137 100 206 74 85 290 -100 190 3 145 -165 -101 138 28 -169 233 -116 -174 -277 -44 261
$$ packed form
8171A37l7J06j32J1K05l90K90j87J42l10O4K39j10j97M02l49n8j03K33L05
8191B61
$$ Imaginary data points
##PAGE= N=2
##DATA TABLE= (X++(I..I)), XYDATA
$$ plain form
0 0 0 0 0 0 0 0 0 0 0 0 0 0 8 -8 8 -8 16 -16 16 -24 24 -32 40 -45 49 -62 72 -80 92 -105 121 -137 158 -177
34 -177 201 -226 255 -287 319 -357 396 -440 487 -542 598 -662 728 -804 886 -976 1075 -1185
52 -1185 1307 -1442 1592 -1764 1959 -2183 2443 -2751 3121 -3576 4153 -4906 5946 -7468 9941
67 9941 -14644 26923 -136799 -296767 -214667 -212539 -181049 -174415 -129643 -105206 -80421 -80939 -61345
80 -61345 -42317 -17168 -8606 10548 33423 69364 97867 125966 148077 175818 196151 213920
92 213920 220962 223289 219520 220852 220209 215033 205930 204966 210426 215247 210357 202988 200581 200138 186199
107 186199 159635 133518 114747 93500 61735 27931 6931 -3587 -18003 -39391 -54822 -59085
119 -59085 -63856 -79290 -100986 -117919 -128737 -144922 -167576 -187851 -197377 -200376 -203041 -205276 -201285
$$ packed form
0@%%%%%%%%%%%%Qj6J6j6K4l2L2m0M8n6P2q5R4j11J34j52J72j97K26k58K95l35
34a77L78m27M81n42O06o76P53q36R27j029J140j260J390j532J690j862K051k260
52a185K492k749L034l356L723m142M626n194N872o697P729r059J0852j3414J7409
67I941k4585M1567j63722j59968Q2100K128L1490O634M4772K4437K4785n18J9594
80f1345J9028K5149Q562J9154K2875L5941K8503K8099K2111K7741K0333J7769
92B13920P042K327l769J332o43n176r103r64N460M821m890p369k407m43j3939
107A86199k6564k6117j8771k1247l1765l3804k1000j0518j4416k1388j5431m263
119e9085m771j5434k1696j6933j0818j6185k2654k0275r526k999k665k235L991
$$ plain form
132 -201285 -189957 -176751 -166124 -158086 -150680 -143158 -135373 -129494 -127441 -124274 -114676 -98975 -82631
145 -82631 -68700 -51167 -24847 3571 23605 37008 52571 72071 85910 88967 88853 96113 108534
158 108534 115667 117365 124733 139890 155462 163128 165755 170081 175768 174698 163903 150411 139488
171 139488 129264 117031 102307 89918 83448 79385 73058 65456 56918 48629 39700 25955 7083
184 7083 -13053 -30316 -45763 -62779 -80618 -93675 -99499 -102115 -106742 -112598 -114641 -112655 -114076 -121397
198 -121397 -130084 -134025 -136127 -141100 -147566 -148718 -141927 -132277 -124604 -115930 -101740 -84408 -69704 -60200
212 -60200 -52055 -40966 -31212 -24319 -19776 -12867 -2157 10763 23152 36244 50726 67990 84130
225 84130 96403 105152 112008 118086 121593 120862 118208 116306 117262 118147 117065 116524 118796 122016 122037 118075
$$ packed form
132b01285J1328J3206J0627Q038P406P522P785N879K053L167R598J5701J6344
145h2631J3931J7533K6320K8418K0034J3403J5563J9500J3839L057j14P260J2421
158A08534P133J698P368J5157J5572P666K627M326N687j070j0795j3492j0923
171A39488j0224j2233j4724j2389o470m063o327p602q538q289q929j3745j8872
184G083k0136j7263j5447j7016j7839j3057n824k616m627n856k043J986j421p321
198a21397q687l941k102m973o466j152O791R650P673Q674J4190J7332J4704R504
212f0200Q145J1089R754O893M543O909J0710J2920J2389J3092J4482J7264J6140
225H4130J2273Q749O856O078L507p31k654j902R56Q85j082n41K272L220K1l962
$$ plain form
241 118075 111999 106014 98161 84949 69067 54199 41618 28894 15096 2293 -6206 -11962 -19096
254 -19096 -28040 -36958 -44333 -52275 -63698 -76968 -89314 -98898 -107742 -116429 -123515 -126706 -124856 -122155
268 -122155 -119881 -116482 -110220 -104058 -99833 -97784 -95320 -91171 -86763 -82334 -77692 -69863 -58572 -45657
282 -45657 -32774 -19572 -5356 9484 22558 32885 41259 49254 56677 62469 66738 71145 77248
295 77248 84687 91899 97501 103475 110078 115324 117416 115840 113310 110426 105690 97107 87666 80214 73869
310 73869 66953 58892 51882 46954 42425 34726 25319 16542 7660 -2698 -15885 -29538 -40246 -49670
324 -49670 -59134 -68121 -74205 -77455 -79630 -82432 -84647 -86410 -87274 -89180 -91378 -94137 -95878 -95794 -94996 -93209
340 -93209 -89345 -84211 -76328 -67065 -58750 -50439 -41478 -31425 -23149 -17309 -12245 -4765 2431 8603 13729
$$ packed form
241A18075o076n985p853j3212j5882j4868j2581j2724j3798j2803q499n756p134
254a9096q944q918p375p942j1423j3270j2346r584q844q687p086l191J850K701
268a22155K274L399O262O162M225K049K464M149M408M429M642P829J1291J2915
282d5657J2883J3202J4216J4840J3074J0327Q374P995P423N792M269M407O103
295G7248P439P212N602N974O603N246K092j576k530k884m736q583r441p452o345
310G3869o916q061p010m928m529p699r407q777q882j0358j3187j3653j0708r424
324d9670r464q987o084l250k175k802k215j763q64j906k198k759j741Q4P98J787
340i3209L864N134P883R263Q315Q311Q961J0053Q276N840N064P480P196O172N126
$$ plain form
355 13729 20665 30448 40248 47665 54136 62986 71221 76661 78429 79814 81856 82787 80930 78225 76728
370 76728 76864 75744 74026 71598 70588 68990 65522 60464 54209 47937 40279 31886 23142 13997 5758
385 5758 -859 -7315 -13482 -19363 -24260 -27481 -31984 -38023 -43877 -48391 -52871 -58810 -65405 -69520 -70972
400 -70972 -72249 -74475 -74974 -72490 -68275 -65970 -64730 -61374 -56688 -53031 -51229 -49617 -46030 -40847 -36335
415 -36335 -32125 -27031 -19355 -11529 -4409 2077 9384 16206 22320 27511 31730 35182 38709 42120 45714
430 45714 48157 50897 54404 58603 61673 62558 63954 65924 66689 64329 60831 57956 55931 52798 47294
445 47294 42063 38962 36532 32716 27174 22830 19888 16087 9530 2612 -3059 -7894 -14751 -22053 -27773
460 -27773 -32230 -36089 -40633 -44218 -46566 -48181 -49889 -52059 -54000 -55342 -56551 -57568 -57916 -58868 -58423 -57023
$$ packed form
355A3729O936R783R800P417O471Q850Q235N440J768J385K042R31j857k705j497
370G6728J36j120j718k428j010j598l468n058o255o272p658q393q744r145q239
385E758o617o456o167n881m897l221m503o039n854m514m480n939o595m115j452
400g0972j277k226m99K484M215K305J240L356M686L657J802J612L587N183M512
415c6335M210N094P676P826P120O486P307O822O114N191M219L452L527L411L594
430D5714K443K740L507M199L070Q85J396J970P65k360l498k875k025l133n504
445D7294n231l101k430l816n542m344k942l801o557o918n671m835o857p302n720
460b7773m457l859m544l585k348j615j708k170j941j342j209j017l48r52M45J400
$$ plain form
476 -57023 -54249 -51546 -48622 -44719 -39480 -33932 -30219 -26308 -21077 -15286 -10700 -7582 -3605 1855 7822
491 7822 12426 15970 21674 28576 33978 37381 40672 44998 49078 50881 51537 52273 53739 54393 53791 52810
507 52810 52560 52521 51634 49764 47653 45118 42217 38727 34597 29484 24245 19387 14483 9306 3712 -978
523 -978 -5337 -9176 -14275 -19210 -22850 -26184 -30353 -34837 -38955 -41711 -44273 -47226 -50108 -51472 -51606 -51252
539 -51252 -51769 -51711 -49589 -46973 -45388 -43977 -41821 -38848 -35176 -32384 -29876 -26051 -20962 -16376 -11900 -7609
555 -7609 -2431 2837 7385 11740 15915 19954 23929 27966 30315 32932 35928 38897 41201 42334 43652
570 43652 45486 46681 46982 45943 45532 45146 43823 41185 38036 35728 33263 30284 26628 22614 19786 16600
586 16600 13036 8285 4392 801 -2873 -7508 -11762 -15789 -19009 -22352 -25898 -29121 -31150 -33101 -34907
$$ packed form
476e7023K774K703K924L903N239N548L713L911N231N791M586L118L977N460N967
491G822M604L544N704O902N402L403L291M326M080J803O56P36J466O54o02r81
507E2810k50l9q87j870k111k535k901l490m130n113n239m858m904n177n594m690
523i78m359l839n099m935l640l334m169m484m118k756k562k953k882j364j34L54
539e1252n17N8K122K616J585J411K156K973L672K792K508L825N089M586M476M291
555g609N178N268M548M355M175M039L975M037K349K617K996K969K304J133J318
570D3652J834J195L01j039m11l86j323k638l149k308k465k979l656m014k828l186
586A6600l564m751l893l591l674m635m254m027l220l343l546l223k029j951j806
$$ plain form
601 -34907 -36867 -38113 -38782 -39432 -39847 -40169 -40123 -39032 -38112 -36793 -35617 -33524 -30859 -28257 -25678 -22868 -19495
618 -19495 -16441 -12401 -9558 -6298 -2760 877 4369 6879 10111 13682 16995 19653 22285 24511 27143
633 27143 29404 30733 31975 33112 34153 34609 34404 34204 33955 33668 32809 31224 29598 28501 27211 24932
649 24932 22539 19858 17708 15170 11823 8774 6134 3200 209 -2903 -5875 -8344 -10679 -13418 -16113
664 -16113 -18518 -20628 -22607 -24337 -26136 -27850 -28904 -29507 -30142 -31044 -30948 -30382 -30010 -29504 -28851 -27860 -25801
681 -25801 -24081 -23075 -21458 -18865 -16510 -14201 -12143 -9919 -6637 -3935 -1684 587 3532 6565 9038
696 9038 11216 13380 15677 17986 20131 21481 23136 24889 25892 26799 27183 28237 28406 28357 28033 27554 26853
713 26853 26138 24829 23650 22094 20097 18698 16544 14517 11883 9378 7194 5143 2280 -487 -2932
$$ packed form
601c4907j960j246o69o50m15l22M6J091R20J319J176K093K665K602K579K810L373
618a9495L054M040K843L260L538L637L492K510L232L571L313K658K632K226K632
633B7143K261J329J242J137J041M56k05k00k49k87q59j585j626j097j290k279
649B4932k393k681k150k538l347l049k640k934k991l112k972k469k335k739k695
664a6113k405k110j979j730j799j714j054o03o35r02R6N66L72N06O53R91K059
681b5801J720J006J617K593K355K309K058K224L282K702K251K271K945L033K473
696I038K178K164K297K309K145J350J655J753J003R07L84J054J69m9l24m79p01
713B6853p15j309j179j556j997j399k154k027k634k505k184k051k863k767k445
$$ plain form
728 -2932 -5231 -7905 -10522 -12656 -14699 -16503 -18800 -20570 -21733 -22696 -24131 -25625 -26330 -26738 -26548 -27021
744 -27021 -27071 -26724 -25648 -25002 -23635 -22615 -21062 -19040 -17662 -15957 -13559 -11064 -9183 -6593 -4064 -1750
760 -1750 543 3526 5706 7916 10385 12411 14740 16303 18378 19374 21330 22551 23589 24254 24715 25714
776 25714 25759 25504 24764 24588 24037 22884 21492 20162 19611 17948 15270 13300 11549 9875 7333 4573 2645
793 2645 600 -1886 -4053 -6247 -8717 -10246 -12330 -14186 -15738 -17381 -18823 -20000 -21361 -22029 -22539 -22871
809 -22871 -23188 -23338 -22763 -22808 -22173 -21045 -20334 -19116 -17893 -15993 -14598 -13194 -11393 -9283 -6839 -5305 -3603
826 -3603 -1434 1103 2997 4529 6519 8733 10622 11666 13214 14862 16190 17290 17782 18721 19672 20479
842 20479 20462 20496 20559 20013 19655 19177 18205 17264 16399 15027 14025 12300 10803 9349 7785 5786 4123 2391
$$ packed form
728b932k299k674k617k134k043j804k297j770j163r63j435j494p05m08J90m73
744b7021n0L47J076O46J367J020J553K022J378J705K398K495J881K590K529K314
760a750K293K983K180K210K469K026K329J563K075R96J956J221J038O65M61R99
776B5714M5k55p40j76n51j153j392j330n51j663k678j970j751j674k542k760j928
793B645k045k486k167k194k470j529k084j856j552j643j442j177j361o68n10l32
809b2871l17j50N75m5O35J128P11J218J223J900J395J404J801K110K444J534J702
826c603K169K537J894J532J990K214J889J044J548J648J328J100M92R39R51Q07
842B0479j7L4O3n46l58m78r72r41q65j372j002j725j497j454j564j999j663j732
$$ plain form
860 2391 602 -848 -2610 -4488 -6444 -7677 -9046 -10776 -12274 -13040 -13997 -14777 -15763 -16405 -17003 -17013 -17590
877 -17590 -17514 -17323 -17288 -16870 -16575 -16127 -15269 -14197 -13274 -12299 -11314 -9422 -8437 -6951 -5528 -4185 -2600 -1229
895 -1229 31 1651 3407 4486 5941 7584 8446 10008 11235 11947 13033 13425 14297 14993 15143 15446 15608
912 15608 15804 15672 15388 14718 14343 13946 13397 12218 11533 10465 9954 8314 7013 5497 4367 3319 1557
929 1557 302 -1361 -2435 -3891 -5032 -6374 -7645 -8473 -9329 -10584 -11642 -12370 -12998 -13607 -14344 -14623 -14542
946 -14542 -14800 -14757 -14965 -14493 -13387 -13231 -13016 -12088 -11283 -10029 -9424 -8122 -7338 -5757 -4745 -3156 -2174 -345
964 -345 902 2207 3558 4572 5783 6852 8217 9077 9809 10907 11929 12257 12989 13412 13701 14537 14270
981 14270 14242 13954 13852 13555 12853 12070 11284 10864 9879 8655 7489 6767 5582 4335 2847 1618 625 -841
$$ packed form
860B391j789j450j762j878j956j233j369j730j498p66r57p80r86o42n98j0n77
877a7590P6J91L5M18K95M48Q58J072R23R75R85J892R85J486J423J343J585J371
895a229J260J620J756J079J455J643Q62J562J227P12J086L92Q72O96J50L03J62
912A5608J96j32k84o70l75l97n49j179o85j068n11j640j301j516j130j048j762
929A557j255j663j074j456j141j342j271q28q56j255j058p28o28o09p37k79Q1
946a4542k58M3k08M72J106J56K15R28Q05J254O05J302P84J581J012J589R82J829
964c45J247J305J351J014J211J069J365Q60P32J098J022L28P32M23K89Q36k67
981A4270k8k88j02k97p02p83p86m20r85j224j166p22j185j247j488j229r93j466
$$ plain form
999 -841 -2385 -3200 -4660 -5807 -7251 -8437 -9348 -10099 -10627 -11510 -12113 -12500 -12862 -13538 -13148 -13517 -13624 -13272 -12622
1018 -12622 -12360 -11988 -11511 -10473 -9444 -8587 -7949 -6544 -5425 -4030 -3085 -1984 -810 581 1716 2637
1034 2637 3417 4991 6006 6830 8092 8721 9761 10728 10939 11564 11903 12241 12170 12438 12003 11765 11688 11377 11187
1053 11187 10251 9772 9469 8530 7593 5932 5649 4627 3639 2178 958 269 -824 -1867 -2976 -4142 -4979
1070 -4979 -5609 -6534 -7499 -8170 -8354 -9223 -10058 -10546 -10680 -10839 -10740 -11459 -10963 -10414 -10379 -10130 -9327 -8939 -8431 -7723
1090 -7723 -7132 -6445 -5516 -4497 -3615 -2794 -2029 -1147 -72 987 1730 2950 3814 4803 5537 6015 6304 7270
1108 7270 7878 8294 8390 8726 9351 9655 9351 9161 9354 9533 9100 8827 8066 7912 7532 6844 5922 5242 4614 3876
1128 3876 3414 2556 1917 931 142 -539 -1452 -2389 -3237 -3675 -4811 -5279 -5903 -6493 -6736 -7081 -7406 -7842 -8041
$$ packed form
999h41j544q15j460j147j444j186r11p51n28q83o03l87l62o76L90l69j07L52O50
1018a2622K62L72M77J038J029Q57O38J405J119J395R45J101J174J391J135R21
1034B637P80J574J015Q24J262O29J040R67K11O25L39L38p1K68m35k38p7l11j90
1053A1187r36m79l03r39r37j661k83j022r88j461j220o89j093j043j109j166q37
1070d979o30r25r65o71j84q69q35m88j34j59R9p19M96N49L5K49Q03L88N08P08
1090g723N91O87R29J019Q82Q21P65Q82J075J059P43J220Q64R89P34M78K89R66
1108G270O08M16R6L36O25L04l04j90J93J79m33k73p61j54l80o88r22o80o28p38
1128C876m62q58o39r86p89o81r13r37q48m38j136m68o24n90k43l45l25m36j99
$$ plain form
1147 -8041 -7981 -8429 -9019 -8605 -8152 -8216 -7920 -7903 -7253 -6826 -6413 -6075 -5256 -4756 -4078 -3493 -2572 -1933 -1256 -674 149
1168 149 729 1841 2294 3095 3664 4340 5224 5661 5894 6431 6963 7077 7477 7479 8085 7673 7785 7674 7683 7544 6948
1189 6948 7004 6613 6107 5685 5195 4520 3981 3163 2866 2131 1131 578 -451 -895 -1551 -2178 -2888 -3711 -3811
1208 -3811 -4598 -5557 -5870 -6197 -6410 -6673 -7164 -7377 -7542 -7763 -7664 -7464 -7352 -7053 -6702 -6511 -6239 -5596 -5409 -4719
1228 -4719 -4416 -3745 -3026 -2308 -1772 -1333 -477 419 1241 1846 2022 2816 3415 4480 4674 5008 5318 5980 6176
1247 6176 6616 7027 7073 7072 6917 7051 7068 6842 6881 6373 5873 5544 5391 4897 4431 3850 3038 2948 2076 1357 543 128
1269 128 -640 -1105 -1860 -2566 -2957 -3588 -4046 -4896 -5206 -5475 -5725 -5677 -6421 -6618 -6332 -6480 -6553 -6531 -6132 -6068 -6226
1290 -6226 -6029 -5235 -5159 -4504 -3899 -3661 -2936 -2581 -2043 -1338 -1135 -499 431 773 1297 1983 2859 3327 3364 3876
$$ packed form
1147h041O0m48n90M14M53o4K96J7O50M27M13L38Q19N00O78N85R21O39O77N82Q23
1168A49N80J112M53Q01N69O76Q84M37K33N37N32J14M00KO06m12J12j11Rj39n96
1189F948N6l91n06m22m90o75n39q18k97p35j000n53j029m44o56o27p10q23j00
1208c811p87r59l13l27k13k63m91k13j65k21R9K00J12K99L51J91K72O43J87O90
1228d719L03O71P19P18N36M39Q56Q96Q22O05J76P94N99J065J94L34L10O62J96
1247F176M40M11M6jj55J34J7k26L9n08n00l29j53m94m66n81q12r0q72p19q14m15
1269A28p68m65p55p06l91o31m58q50l10k69k50M8p44j97K86j48p3K2L99O4j58
1290f226J97P94P6O55O05K38P25L55N38P05K03O36R30L42N24O86Q76M68L7N12
$$ plain form
1310 3876 4236 4676 4841 5213 5577 5611 5743 6016 5630 5964 5830 5587 5463 4906 4498 4442 4256 3825 3201 3062
1330 3062 2774 2115 1728 1139 658 -33 -380 -1085 -1642 -2042 -2081 -2598 -3344 -3637 -3621 -4196 -4678 -4706 -4674 -4913 -4842
1351 -4842 -5209 -5401 -4904 -4965 -5000 -4554 -4469 -4262 -3876 -3868 -3135 -2969 -2690 -2146 -1707 -1770 -864 -477 8 428 684 1236
1373 1236 1892 2114 2165 2722 2941 3400 3364 3698 3928 4475 4482 4405 4356 4438 4313 4602 4419 4237 3682 4028 3721 3289
1395 3289 3225 2535 2405 2071 1665 1395 784 601 231 -129 -313 -875 -1287 -1325 -2102 -2349 -2164 -2728 -3330 -3518
1415 -3518 -3472 -3421 -3872 -4069 -3877 -3961 -3942 -3829 -4040 -3887 -3781 -3803 -3694 -3237 -2924 -2767 -2554 -1929 -1479 -1289 -1305 -816
1437 -816 -517 156 450 1082 916 1293 1609 2116 2405 2827 3016 3114 3460 3635 3674 3488 4034 3901 3764 3788 3615
1458 3615 3651 3372 3441 2981 2622 2818 2480 2419 1975 1749 1357 1088 384 190 -262 -570 -538 -1091 -1754 -1447 -1760
$$ packed form
1310C876L60M40J65L72L64L4J32K73l86L34j34k43j24n57m08n6j86m31o24j39
1330C062k88o59l87n89m81o91l47p05n57m00l9n17p46k93J6n75m82k8L2k39P1
1351d842l67j92M97o1l5M46Q5K07L86QP33J66K79N44M39o3R06L87M85M20K56N52
1373A236O56K22N1N57K19M59l6L34K30N47Pp7m9Q2j25K89j83j82n55L46l07m32
1395C289o4o90j30l34m06k70o11j83l70l60j84n62m12l8p77k47J85n64o02j88
1415c518M6N1m51j97J92q4J9J13k11J53J06k2J09M57L13J57K13O25M50J90j6M89
1437h16K99O73K94O32j66L77L16N07K89M22J89R8L46J75L9j86N46j33j37K4j73
1458C615L6k79O9m60l59J96l38o1m44k26l92k69p04j94m52l08L2n53o63L07l13
$$ plain form
1479 -1760 -2184 -2778 -3027 -2886 -3391 -3216 -3669 -3744 -3626 -3738 -3600 -3614 -3462 -3507 -3200 -3405 -3050 -2443 -2317 -2142 -2230
1500 -2230 -2082 -1127 -1113 -980 -141 -284 181 730 1322 1270 1667 2110 2241 2516 2555 2770 2806 2975 3168 3071 3261
1521 3261 3334 3320 3451 3287 3217 3175 3282 2725 2148 2176 2161 1800 1363 1416 798 651 12 -69 -220 -471 -584 -883
1543 -883 -1451 -1756 -1809 -2091 -2258 -2558 -2681 -2843 -2991 -2783 -2938 -2994 -2921 -2890 -3124 -2841 -2667 -2570 -2517 -2464 -2130 -1876
1565 -1876 -1642 -1591 -1012 -915 -429 -280 -178 14 289 671 958 885 1208 1354 1593 1855 1980 1884 2352 2364 2505
1586 2505 2486 2807 2825 2610 2428 2387 2347 2190 2015 1877 1724 1939 1789 1517 1272 1390 674 754 415 -160 -33
1607 -33 14 -647 -950 -998 -1043 -1201 -1453 -1412 -1223 -1563 -1587 -1882 -1964 -2182 -2229 -2530 -2158 -2245 -2223 -1924 -2076 -1859 -1519
1630 -1519 -1441 -1467 -1071 -985 -1118 -925 -349 -633 -758 -307 -58 264 94 659 802 931 1183 1095 1544 1582 1518 1531
$$ packed form
1479a760m24n94k49J41n05J75m53p5J18j12J38j4J52m5L07k05L55O07J26J75q8
1500b230J48R55J4J33Q39j43M65N49N92n2L97M43J31K75L9K15L6J69J93r7J90
1521C261P3j4J31j64p0m2J07n57n77K8j5l61m37N3o18j47o39q1j51k51j13k99
1543h83n68l05n3k82j67l00j23j62j48K08j55n6P3L1k34K83J74R7N3N3L34K54
1565a876K34N1N79R7M86J49J02J92K75L82K87p3L23J46K39K62J25r6M68J2J41
1586B505j9L21J8k15j82m1m0j57j75j38j53K15j50k72k45J18p16Q0l39n75J27
1607c3M7o61l03m8m5j58k52M1J89l40k4k95q2k18m7l01L72q7K2K99j52K17L40
1630a519P8k6L96Q6j33J93N76k84j25M51K49L22j70N65J43J29K52q8M49L8o4J3
$$ plain form
1652 1531 1727 1414 1621 1827 1822 1991 2011 2184 2302 1909 1996 1765 2019 1391 1199 823 788 1023 621 553 421 614
1674 614 304 90 38 58 -224 -474 -1149 -1145 -1056 -1267 -1775 -1622 -1811 -1190 -1776 -1836 -1698 -1748 -1518 -1575 -1524 -1835 -1669
1697 -1669 -2115 -1522 -1739 -1345 -1152 -644 -772 -584 -122 -324 -55 59 280 130 300 418 308 625 1255 1088
1717 1088 1318 1460 1389 1879 1800 1857 1779 1695 1790 1706 1630 1508 1383 1426 1585 1293 1118 1293 1019 1082 639 375 476
1740 476 73 167 -452 -543 -372 -769 -796 -1014 -1129 -920 -1191 -1126 -1264 -1267 -1590 -1717 -1476 -1530 -1784 -1675 -1679 -1557 -1530
1763 -1530 -857 -1077 -933 -711 -762 -723 -587 -533 -287 -338 -634 -181 -313 36 175 600 759 1004 1204 1590 1500
1784 1500 1204 1215 1041 1227 1128 1198 1094 1232 1050 1470 1362 1390 1219 1605 1216 851 597 276 498 218 225 -23
1806 -23 43 -72 221 -322 -209 -361 -507 -645 -571 -877 -877 -1116 -1309 -1366 -1247 -1291 -1160 -1193 -1155 -837 -1030 -728 -731 -916
$$ packed form
1652A531J96l13K07K06nJ69K0J73J18l93Q7k31K54o28j92l76l5K35m02o8j32J93
1674F14l10k14n2K0k82k50o75MQ9k11n08J53j89O21n86o0J38n0K30n7N1l11J66
1697a669m46N93k17L94J93N08j28J88M62k02K69J14K21j50J70J18j10L17O30j67
1717A088K30J42p1M90p9N7p8q4R5q4p6j22j25M3J59k92j75J75k74O3m43k64J01
1740D76m03R4o19r1J71l97k7k18j15K09k71O5j38ll23j27K41n4k54J09mJ22K7
1763a530O73k20J44K22n1L9J36N4K46n1k96M53j32L49J39M25J59K45K00L86r0
1784A500k96J1j74J86r9P0j04J38j82M20j08K8j71L86l89l65k54l21K22k80Pk48
1806b3O6j15K93n43J13j52j46j38P4l06%k39j93n7J19m4J31l3L8L18j93L02lj85
$$ plain form
1830 -916 -1147 -752 -961 -964 -892 -992 -680 -317 -401 116 221 127 393 516 352 455 308 460 203 448 376 761
1852 761 814 901 1154 863 1094 870 1142 1030 1094 858 701 655 844 481 439 717 663 682 644 318 311 215 202 263
1876 263 -193 -430 -630 -841 -543 -328 -483 -108 -516 -605 -480 -559 -545 -521 -812 -844 -809 -1150 -775 -1002 -902 -808
1898 -808 -865 -677 -356 -460 -354 -132 -175 -298 -128 -184 -387 -262 -162 252 250 381 213 632 668 742 850 866 492
1921 492 683 629 575 838 449 669 648 630 1154 906 1028 831 623 889 661 362 544 147 122 149 -176 -90
1943 -90 -179 -106 29 19 -73 -209 -164 -450 -459 -879 -889 -1097 -1052 -1101 -872 -804 -699 -774 -422 -538 -824 -526 -766 -684 -672
1968 -672 -689 -833 -773 -447 -388 -78 -119 70 201 358 420 374 513 571 511 519 356 427 703 323 640 646 758 661 722
1993 722 1105 909 844 698 511 312 285 354 185 398 419 102 560 220 418 287 108 -4 -150 -278 -438
$$ packed form
1830i16k31L95k09lP2j00L12L63q4N17J05r4K66J23j64J03j47J52k57K45p2L85
1852G61N3Q7K53k91K31k24K72j12O4k36j57m6J89l63m2K78n4J9l8l26pr6j3O1
1876B63m56k37k00k11K98K15j55L75m08q9J25p9J4K4k91l2L5l41L75k27J00R4
1898h08n7J88L21j04J06K22m3j23J70n6k03J25J00M14kJ31j68M19L6P4J08J6l74
1921D92J91n4n4K63l89K20k1j8N24k48J22j97k08K66k28k99J82l97k5K7l25Q6
1943i0q9P3J35j0r2j36M5k86rm20j0k08M5m9K29O8J05p5L52j16k86K98k40Q2J2
1968f72j7j44O0L26N9L10m1J89J31J57O2m6J39N8o0Qj63P1K76l80L17OJ12r7O1
1993G22L83j96o5j46j87j99k7O9j69K13K1l17M58l40J98j31j79j12j46j28j60
$$ plain form
2014 -438 -806 -683 -745 -670 -865 -605 -475 -630 -506 -359 -536 -260 -353 -789 -627 -820 -996 -821 -618 -302 -198
2035 -198 -235 -419 165 -9 139 218 84 296 -147 -190 42 387 193 371 486 388 682 795 775 767 472 511 193
2058 193 653 441 412 327 478 224 439 577 208 354 307 315 42 100 -196 -229 -235 -280 -216 -455 -231 -272 -134 -146
2082 -146 -164 -287 -453 -256 -253 -196 -466 -671 -370 -797 -396 -180 -312 -482 -266 -89 -146 -284 -235 78 60 -293
2104 -293 -118 -272 -136 -305 -160 229 274 234 250 310 403 411 434 274 -123 122 91 175 334 608 564 113 326 443
2128 443 532 312 292 216 493 -14 132 -24 -62 83 52 -13 -34 162 50 -225 -29 152 56 -354 -253 -522 -594
2151 -594 -248 -332 -367 -501 -438 -364 -47 -305 -168 -23 -162 -334 -469 -227 -239 -15 -144 -379 -282 -140 -20 261
2173 261 142 182 371 345 -94 -424 -1 162 371 15 363 231 220 376 302 498 498 471 336 466 328 153
$$ packed form
2014d38l68J23o2P5j95K60J30j55J24J47j77K76r3m36J62j93j76J75K03L16J04
2035a98l7j84N84j74J48P9j34K12m43m3K32L45j94J78J15r8K94J13k0qk95L9l18
2058A93M60k12k9q5J51k54K15J38l69J46m7Qk73N8k96l3om5O4k39K24m1J38j2
2082a46j8j23j66J97LN7k70k05L01m27M01K16j32j70K16J77n7j38M9L13j8l53
2104b93J75j54J36j69J45L89M5m0J6O0R3QK3j60l97K45l1Q4J59K74m4m51K13J17
2128D43Q9k20k0p6K77n07J46j56l8J45l1o5k1J96j12k75J96J81r6m10J01k69p2
2151e94L46q4l5j34O3P4L17k58J37J45j39j72j35K42j2K24j29k35R7J42J20K81
2173B61j19M0J89k6m39l30M23J63K09l56L48j32j1J56p4J96%k7j35J30j38j75
$$ plain form
2195 153 290 96 254 200 236 359 14 265 417 167 -25 -51 119 -84 -124 -259 -264 -163 -349 -291 -337 -245 -220
2218 -220 -391 -104 -276 -184 -398 -573 -681 -259 -384 -553 -245 -637 -445 -127 -181 -212 30 -230 -27 49 70 33
2240 33 -3 -37 -169 47 219 279 328 408 352 518 74 530 270 617 239 315 306 212 223 598 95 479 289 463
2264 463 582 215 417 148 284 186 81 63 -109 -231 -82 56 -201 -253 -171 -275 -355 -78 -137 -139 -404 -544 -561
2287 -561 -328 -554 -530 -287 -269 -632 32 -160 -48 -287 -79 -351 -211 63 -172 48 83 -21 235 185 205 541
2309 541 389 305 276 161 104 459 344 229 198 374 365 268 289 483 311 333 282 239 212 152 15 139 263 136
2333 136 -55 -153 248 79 -83 -51 293 -76 -207 -314 -1 -156 -131 -424 -129 -338 -214 -450 -49 -84 -175 -409
2355 -409 -270 -84 -375 -294 -360 -250 -442 -334 -189 -278 -87 -282 -122 91 122 130 221 252 572 194 380 353 233
$$ packed form
2195A53J37j94J58n4L6J23l45K51J52k50j92k6J70k03m0j35nJ01j86N8m6R2K5
2218b20j71K87j72R2k14j75j08M22j25j69L08l92J92L18n4l1K42k60K03P6K1l7
2240C3l6l4j32K16J72O0M9Q0n6J66m44M56k60L47l78P6rr4J1L75n03L84j90J74
2264D63J19l67K02k69J36r8j05j8j72j22J49J38k57n2Q2j04q0K77n9kk65j40j7
2287e61K33k26K4K43J8l63O64j92J12k39K08k72J40K74k35K20L5j04K56n0K0L36
2309E41j52q4k9j15n7L55j15j15l1J76rr7K1J94j72K2n1m3k7o0j37J24J24j27
2333A36j91r8M01j69j62L2L44l69j31j07L13j55K5k93K95k09J24k36M01l5r1k34
2355d09J39J86k91Q1o6J10j92J08J45q9J91j95J60K13L1QR1L1L20l78J86k7j20
$$ plain form
2378 233 309 -87 383 262 442 384 192 668 377 333 169 82 255 139 84 12 166 324 211 359 152 -137
2400 -137 79 136 193 22 -79 105 14 -15 8 -228 -231 -367 60 -196 -297 19 -254 -179 -208 -240 -422 -254 -124
2423 -124 -256 -510 -61 -232 -252 41 -215 -51 -41 -141 14 91 -216 -191 2 -53 217 -81 169 81 30 285
2445 285 133 170 -131 295 -50 258 363 -12 281 380 363 305 467 254 293 -33 355 213 477 197 259 16
2467 16 39 147 -77 -11 -144 -70 31 -167 -234 -257 -86 -404 -362 -268 -229 161 -463 -346 -513 -609 -468 -300 -388 -328
2491 -328 -217 -363 -207 -366 -124 -222 -60 193 -234 -141 16 -40 -45 -15 -106 366 -4 269 246 33 266 197 137
2514 137 148 451 84 190 343 325 466 354 430 470 274 292 465 180 67 57 381 91 188 192 -12 112 -14
2537 -14 46 -231 -201 -518 -187 157 -160 -189 -29 -173 -369 -419 -332 -286 -241 -295 -277 -349 -341 -286 -319 -537 84 -296 -451
$$ packed form
2378B33P6l96M70j21J80n8j92M76k91m4j64q7J73j16n5p2J54J58j13J48k07k89
2400a37K16N7N7j71j01J84r1k9K3k36lj36M27k56j01L16k73P5k9l2j82J68J30
2423a24j32k54M49j71k0K93k56J64J0j00J55P7l07K5J93n5K70k98K50q8n1K55
2445B85j52L7l01M26l45L08J05l75K93R9j7n8J62k13L9l26L88j42K64k80O2k43
2467A6K3J08k24O6j33P4J01j98o7k3J71l18M2R4L9L90o24J17j67r6J41J68q8O0
2491c28J11j46J56j59K42r8J62K53m27R3J57n6nL0r1M72l70K73k3k13K33o9o0
2514A37J1L03l67J06J53j8J41j12P6M0j96J8J73k85j13j0L24k90R7Mk04J24j26
2537a4O0k77L0l17L31L44l17k9J60j44j96n0Q7M6M5n4J8p2QN5l3k18O21l80j55
$$ plain form
2562 -451 -42 -298 -77 -221 -60 -174 -28 22 176 -48 12 203 262 318 59 351 147 251 400 313 241 154
2584 154 268 527 332 251 43 435 452 349 157 248 145 464 4 -270 219 236 247 -68 -43 -225 137 -187
2606 -187 46 -83 -32 -215 -209 2 -106 -130 -249 -457 -470 -386 -260 -335 -268 -268 -84 -177 -510 -244 -482 -356 -350 -134
2630 -134 -111 -318 136 -209 -308 44 -20 60 160 11 82 410 58 86 262 -77 399 206 106 403 136 211
2652 211 503 335 209 214 332 -6 245 421 376 415 146 267 195 295 13 -105 15 65 86 -65 114 -133
2674 -133 -118 -239 -246 52 -353 -156 -74 -466 -92 -103 -176 -259 -283 -38 -96 -396 -437 -99 -445 -410 -275 -411 -134 -415
2698 -415 -293 -221 -27 -30 -201 28 9 -65 -391 162 -204 159 17 114 101 -56 40 269 363 95 336 221 382
2721 382 256 497 282 313 426 438 257 302 304 288 83 -124 -143 374 -8 -70 378 -22 -166 -25 -104 -214 -416
$$ packed form
2562d51M09k56K21j44J61j14J46N0J54k24O0J91N9N6k59K92k04J04J49q7p2q7
2584A54J14K59j95q1k08L92J7j03j92R1j03L19m60k74M89J7J1l15K5j82L62l24
2606a87K33j29N1j83OK11j08k4j19k08j3Q4J26p5O7%J84r3l33K66k38J26OK16
2630a34K3k07M54l45r9L52o4Q0J00j49P1L28l52K8J76l39M76j93j00K97k67P5
2652B11K92j68j26NJ18l38K51J76m5L9k69J21p2J00k82j18J20N0K1j51J79k47
2674a33J5j21pK98m05J97Q2l92L74j1p3q3k4K45n8l00m1L38l46L5J35j36K77k81
2698d15J22P2J94lj71K29j9p4l26N53l66L63j42R7j3j57R6K29R4k68K41j15J61
2721C82j26K41k15L1J13J2j81M5Kj6k05k07j9N17l82o2M48m00j44J41p9j10k02
$$ plain form
2744 -416 -367 -222 -179 -226 -527 37 -91 -554 -260 -209 -155 -379 -227 -164 -411 -158 -220 -168 -299 -254 -221 41 -137
2767 -137 -339 -164 74 -205 69 6 347 100 52 111 240 381 209 192 291 249 350 249 341 216 327 349 398
2790 398 496 399 41 380 398 191 261 192 367 34 149 253 9 -139 271 -22 -42 168 -187 -156 34 -184
2812 -184 -262 -661 -320 -295 -60 -248 -421 -430 -345 -289 -103 -498 -244 -205 -192 -104 -484 -248 -228 -68 -299 -249 -252 -275 -162
2837 -162 76 80 116 -84 106 -80 200 -44 -17 281 268 227 235 321 536 267 172 605 412 225 366 483 168
2860 168 145 52 245 312 145 35 113 128 -7 -179 16 110 11 89 -106 -26 -415 -28 -89 -112 -404 -321 88 -195
2884 -195 -157 -126 -458 -208 -298 -165 -66 -299 -340 -48 -114 -307 -247 -228 -96 -124 -213 -81 -215 15 -258 -37 296
2907 296 -47 54 217 159 231 116 114 233 371 395 191 153 185 403 464 300 411 436 232 104 597 44 53 -59
$$ packed form
2744d16M9J45M3m7l01N64j28m63K94N1N4k24J52O3k47K53o2N2j31M5L3K62j78
2767a37k02J75K38k79K74o3L41k47m8N9J29J41j72j7R9m2J01j01R2j25J11K2M9
2790C98R8r7l58L39J8k07P0o9J75l33J15J04k44j48M10k93k0K10l55L1J90k18
2812a84p8l99L41K5K35j88j73rQ5N6J86l95K54L9J3Q8l80K36K0J60k31N0lk3J13
2837a62K38ML6k00J90j86K80k44K7K98j3m1QQ6K15k69r5M33j93j87J41J17l15
2860A68k3r3J93O7j67j10P8J5j35j72J95R4r9P8j95Q0l89L87o1k3k92Q3M09k83
2884a95L8L1l32K50r0J33R9k33m1K92o6j93O0J9J32k8q9J32j34K30k73K21L33
2907B96l43J01J63n8P2j15kJ19J38K4k04l8L2K18O1j64J11K5k04j28M93n53Rj12
$$ plain form
2931 -59 272 274 118 49 64 112 114 40 69 -74 93 -124 24 -232 30 -262 -286 -211 -195 -294 -300 -89 -263 -303 -225 -389
2957 -389 -471 -200 -146 -306 -259 -407 38 78 -216 -270 -126 -56 -31 -120 -55 -131 -5 -106 9 -33 65 200 93 301
2981 301 325 182 381 609 250 412 455 420 214 111 494 345 229 538 248 -97 195 134 269 339 -224 30
3003 30 28 -113 264 394 115 -167 -11 -74 -84 47 -157 -219 -204 130 -242 -414 -373 -269 -215 -234 -361 -428 -326 -572
3027 -572 -349 -288 -520 -264 -172 -73 -5 -261 -238 129 179 -139 -16 -20 -25 131 152 174 -166 110 -43 458 148 57
3051 57 70 436 184 179 244 74 553 307 386 222 217 119 192 69 69 48 154 492 107 162 -332 -110 265 -69 185
3076 185 50 -51 -46 -231 -10 -419 -159 -100 -17 -125 -194 -319 -568 -169 -134 -268 -482 -79 -641 -230 -452 -87
$$ packed form
2931e9L31Kj56o9J5M8Kp4K9j43J67k17J48k56K62k92k4P5J6r9oK11j74m0P8j64
2957c89q2K71N4j60M7j48M45M0k94n4J44P0K5q9O5p6J26j01J15m2R8J35j07K08
2981C01K4j43J99K28l59J62M3l5k06j03L83j49j16L09k90l45K92o1J35P0n63K54
3003C0kj41L77J30k79k82J56o3j0J31k04o2J5L34l72j72M1J04N4j9j27o7J02k46
3027e72K23O1k32K56R2R9O8k56K3L67N0l18J23mnJ56K1K2l40K76j53N01l10r1
3051E7J3L66k52nO5j70M79k46P9j64nr8P3j23%k1J06L38l85N5m94K22L75l34K54
3076A85j35j01Nj85K21m09K60N9Q3j08o9j25k49L99L5j34k14M03n62M11k22L65
$$ [...]
8191a45
##END NTUPLES=NMR FID
##END=
