##TITLE=1H_Pr M4G-1607
 200.13MHz, CDCl3,
 8 sc
 
 11.3.2025
##JCAMPDX= 6.0         $$ Bruker NMR JCAMP-DX V2.0
##DATA TYPE= NMR FID
##DATA CLASS= NTUPLES
##ORIGIN= UXNMR, Bruker Analytische Messtechnik GmbH
##OWNER= pz
$$ XWIN-NMR		Version 3.5
$$ Tue Mar 11 14:22:29 2025 Russian Standard Time (UT+4h)  she@DPX200
##.OBSERVE FREQUENCY= 200.1313
##.OBSERVE NUCLEUS= ^1H
##.DELAY= (6, 6)
##.ACQUISITION MODE= SIMULTANEOUS
##.ACQUISITION SCHEME= undefined
##.AVERAGES= 8
##.DIGITISER RES= 18
##SPECTROMETER/DATA SYSTEM= spect
##.PULSE SEQUENCE= zg30
##.SOLVENT NAME= CDCl3
##.SHIFT REFERENCE= (INTERNAL, CDCl3, 0, 14.3821)
##AUDIT TRAIL= $$ (NUMBER, WHEN, WHO, WHERE, WHAT)
$$ ##TITLE= Audit trail, XWIN-NMR		Version 3.5
$$ ##JCAMPDX= 5.01
$$ ##ORIGIN= Bruker BioSpin GmbH
$$ ##OWNER= she
$$ F:/spectra/data/she/nmr/H-C/1/audita.txt
$$ ##AUDIT TRAIL=  $$ (NUMBER, WHEN, WHO, WHERE, WHAT)
(   1,<2025-03-11 14:21:01.35 +0400>,<she>,<DPX200>,
      <created by zg, POWCHK disabled, PULCHK disabled
       configuration hash MD5:
       00 E9 B6 7A A2 85 ED C7 34 08 36 98 17 FE 4E 26
       data hash MD5: 16K
       D3 5C 63 76 76 66 C2 65 C4 73 92 17 3B 92 DC 2D>)
$$ ##END=
$$ 
$$ hash MD5
$$ 49 A4 AD 9A D8 F5 BB 37 9A BE A7 41 16 36 DA D9
##$RELAX= 
##$RELAX= 
##$RELAX= 
##$RELAX= 
##$RELAX= 
##$RELAX= 
$$ Bruker specific parameters
$$ --------------------------
##$DU= <F:/spectra>
##$EXPNO= 1
##$NAME= <H-C>
##$PROCNO= 1
##$TYPE= <nmr>
##$USER= <she>
##$AMP= (0..31)
100 100 100 100 100 100 100 100 100 100 100 100 100 100 100 100 100 100 
100 100 100 100 100 100 100 100 100 100 100 100 100 100 
##$AQSEQ= 0
##$AQ_mod= 1
##$AUNM= <au_zg>
##$AUTOPOS= <>
##$BF1= 200.13
##$BF2= 200.13
##$BF3= 200.13
##$BF4= 200.13
##$BF5= 200.13
##$BF6= 200.13
##$BF7= 200.13
##$BF8= 200.13
##$BYTORDA= 1
##$CFDGTYP= 0
##$CFRGTYP= 5
##$CHEMSTR= <none>
##$CNST= (0..31)
1 1 145 1 1 1 1 1 1 1 1 1 1 1 1 1 1 1 1 1 1 1 1 1 1 1 1 1 1 1 1 1 
##$CPDPRG= <>
##$CPDPRG1= <>
##$CPDPRG2= <>
##$CPDPRG3= <>
##$CPDPRG4= <mlev>
##$CPDPRG5= <mlev>
##$CPDPRG6= <mlev>
##$CPDPRG7= <mlev>
##$CPDPRG8= <mlev>
##$CPDPRGB= <>
##$CPDPRGT= <>
##$D= (0..31)
0 0.7 0 0 0 0 0 0 0 0 0 0.03 0 0 0 0 0 0 0 0 0 0 0 0 0 0 0 0 0 0 0 0 
##$DATE= 1741688460
##$DBL= (0..7)
120 120 120 120 120 120 120 120 
##$DBP= (0..7)
150 150 150 150 150 150 150 150 
##$DBP07= 0
##$DBPNAM0= <>
##$DBPNAM1= <>
##$DBPNAM2= <>
##$DBPNAM3= <>
##$DBPNAM4= <>
##$DBPNAM5= <>
##$DBPNAM6= <>
##$DBPNAM7= <>
##$DBPOAL= (0..7)
0.5 0.5 0.5 0.5 0.5 0.5 0.5 0.5 
##$DBPOFFS= (0..7)
0 0 0 0 0 0 0 0 
##$DE= 6
##$DECBNUC= <off>
##$DECIM= 32
##$DECNUC= <off>
##$DECSTAT= 4
##$DIGMOD= 1
##$DIGTYP= 9
##$DL= (0..7)
0 120 120 120 120 120 120 120 
##$DP= (0..7)
150 150 150 150 150 150 150 150 
##$DP07= 0
##$DPNAME0= <>
##$DPNAME1= <>
##$DPNAME2= <>
##$DPNAME3= <>
##$DPNAME4= <>
##$DPNAME5= <>
##$DPNAME6= <>
##$DPNAME7= <>
##$DPOAL= (0..7)
0.5 0.5 0.5 0.5 0.5 0.5 0.5 0.5 
##$DPOFFS= (0..7)
0 0 0 0 0 0 0 0 
##$DQDMODE= 0
##$DR= 18
##$DS= 0
##$DSLIST= <SSSSSSSSSSSSSSS>
$$ [...]
##$SUBNAM0= <"">
##$SUBNAM1= <"">
##$SUBNAM2= <"">
##$SUBNAM3= <"">
##$SUBNAM4= <"">
##$SUBNAM5= <"">
##$SUBNAM6= <"">
##$SUBNAM7= <"">
##$SUBNAM8= <"">
##$SUBNAM9= <"">
##$SW= 18.0517328524113
##$SWIBOX= (0..15)
0 0 2 0 0 0 0 0 0 0 0 0 0 0 0 0 
##$SW_h= 3612.71676300578
##$TD= 16384
##$TD0= 1
##$TE= 0
##$TE2= 300
##$TE3= 300
##$TEG= 300
##$TL= (0..7)
0 120 120 120 120 120 120 120 
##$TP= (0..7)
150 150 150 150 150 150 150 150 
##$TP07= 0
##$TPNAME0= <>
##$TPNAME1= <>
##$TPNAME2= <>
##$TPNAME3= <>
##$TPNAME4= <>
##$TPNAME5= <>
##$TPNAME6= <>
##$TPNAME7= <>
##$TPOAL= (0..7)
0.5 0.5 0.5 0.5 0.5 0.5 0.5 0.5 
##$TPOFFS= (0..7)
0 0 0 0 0 0 0 0 
##$TUNHIN= 0
##$TUNHOUT= 0
##$TUNXOUT= 0
##$USERA1= <user>
##$USERA2= <user>
##$USERA3= <user>
##$USERA4= <user>
##$USERA5= <user>
##$V9= 5
##$VALIST= <valist>
##$VCLIST= <CCCCCCCCCCCCCCC>
##$VD= 0
##$VDLIST= <DDDDDDDDDDDDDDD>
##$VPLIST= <PPPPPPPPPPPPPPP>
##$VTLIST= <TTTTTTTTTTTTTTT>
##$WBST= 1024
##$WBSW= 4
##$XGAIN= (0..3)
0 0 0 0 
##$XL= 0
##$YL= 0
##$YMAX_a= 572334
##$YMIN_a= -665594
##$ZGOPTNS= <>
##$ZL1= 120
##$ZL2= 120
##$ZL3= 120
##$ZL4= 120
##$ABSF1= 10
##$ABSF2= 0
##$ABSG= 5
##$ABSL= 3
##$ALPHA= 0
##$AQORDER= 0
##$ASSFAC= 0
##$ASSFACI= 0
##$ASSFACX= 0
##$ASSWID= 0
##$AUNMP= <proc_1d>
##$AZFE= 0.1
##$AZFW= 0.1
##$BCFW= 1
##$BC_mod= 2
##$BYTORDP= 1
##$COROFFS= 0
##$CY= -3
##$DATMOD= 1
##$DC= 2
##$DFILT= <>
##$DTYPP= 0
##$F1P= 0
##$F2P= 0
##$FCOR= 0.5
##$FTSIZE= 0
##$FT_mod= 4
##$GAMMA= 1
##$GB= 0.15
##$INTBC= 1
##$INTSCL= 1
##$ISEN= 128
##$LB= 0.25
##$LEV0= 0
##$LPBIN= 0
##$MAXI= 10000
##$MC2= 0
##$MEAN= 0
##$ME_mod= 0
##$MI= 1.114404
##$NCOEF= 0
##$NC_proc= 0
##$NLEV= 6
##$NOISF1= 3.799351
##$NOISF2= 2.8
##$NSP= 1
##$NTH_PI= 0
##$NZP= 0
##$OFFSET= 14.38212
##$PC= 1
##$PHC0= -462.6711
##$PHC1= 4.192218
##$PH_mod= 1
##$PKNL= yes
##$PPARMOD= 0
##$PSCAL= 0
##$PSIGN= 0
##$REVERSE= no
##$SF= 200.129724274929
##$SI= 16384
##$SIGF1= 3
##$SIGF2= 2
##$SINO= 400
##$SIOLD= 16384
##$SREGLST= <1H.CDCl3>
##$SSB= 0
##$STSI= 0
##$STSR= 0
##$SW_p= 3205.1282051282
##$SYMM= 0
##$S_DEV= 0
##$TDeff= 0
##$TDoff= 0
##$TI= <>
##$TILT= no
##$TM1= 0
##$TM2= 0
##$TOPLEV= 0
##$USERP1= <user>
##$USERP2= <user>
##$USERP3= <user>
##$USERP4= <user>
##$USERP5= <user>
##$WDW= 1
##$XDIM= 8192
##$YMAX_p= 0
##$YMIN_p= 0
$$ End of Bruker specific parameters
$$ ---------------------------------
##NTUPLES= NMR FID
##VAR_NAME=  TIME,          FID/REAL,        FID/IMAG
##SYMBOL=    X,             R,               I
##VAR_TYPE=  INDEPENDENT,   DEPENDENT,       DEPENDENT
##VAR_FORM=  AFFN,          ASDF,            ASDF
##VAR_DIM=   8192,          8192,            8192
##UNITS=     SECONDS,       ARBITRARY UNITS, ARBITRARY UNITS
##FACTOR=    0.0002768,     1,               1
##FIRST=     0,             0,               0
##LAST=      2.2672688,     0,               0
##MIN=       0,             -665594,         0
##MAX=       2.2672688,     572334,          0
$$ Real data points
##PAGE= N=1
##DATA TABLE= (X++(R..R)), XYDATA
$$ [...]
1475e54N11N46k74l11k3q5K55J40k18l21J05L34J98j58j48l84J73o4j01K01Q23
$$ -554 -43 503 229 -82 -105 -190 65 205 -13 -334 -229 105 303 145 -3 -387 -214 -278 -379 -178 645
1496F45K90j015n99K26P15K34l70j34K01J97n85m82M15N39J48q11k04Q42J040
$$ 645 935 -80 -679 -453 262 496 126 -8 193 390 -195 -677 -262 277 425 -386 -590 252 1292
1515A292q57j183M06M13K86m74k12M39N92o52j039J57J355K07p91k10J21L17L35
$$ 1292 435 -748 -342 71 357 -117 -329 110 702 50 -989 -832 523 730 -61 -271 -150 167 502
1534E02m78p84K59R10j03l39J17J41k94J18j71k48M94P69j26p46p68M4Q83L44
$$ 502 24 -760 -501 409 306 -33 84 225 -69 49 -122 -370 124 893 767 21 -747 -703 180 524
1554E24m35n73O09K68l80j71Q3K87K89o20n62P03J072l55j124n78L59N79M38k26
$$ 524 89 -484 125 393 13 -158 -75 212 501 -119 -681 22 1094 739 -385 -963 -604 -25 413 187
1574A87l11M64j03r68j44J300J80m12l00J0j45M11j10l93L94L32p48l19R66N40
$$ 187 -124 340 237 -731 -875 425 605 193 -107 -97 -242 169 59 -334 60 392 -356 -675 291 831
1594H31o54n13n24N18Q14J61m47n07J38Jj37K65K02O9L25o00l47N58J78r9j48
$$ 831 177 -336 -860 -342 472 633 186 -321 -183 -182 -319 -54 148 217 542 -58 -405 153 331 232 84
1615H4n37OO38N53q35m12M52R1j04k0l2L43P25p83j058K8J494M36j045p41MO53
$$ 84 -453 -447 191 744 -91 -503 -51 40 -64 -84 -116 227 952 169 -889 -861 633 1069 24 -717 -713 -60
1637f0P67l28j033K88Q31k37p33J52M98N17m17r93J06Q81M48l68n03k89N39J85
$$ -60 707 379 -654 -366 465 228 -505 -353 145 662 245 -748 -642 239 687 319 -184 -473 66 251
1657B51k97n5J37K62j19n71K41K55K3R5l45m82O38M56l41k77p5j79K70L80Jk02
$$ 251 -46 -101 36 298 179 -392 -151 104 127 222 -123 -605 33 489 148 -129 -204 -383 -113 267 268 66
1679F6o9n8j67M71J43m60o8m1J14j90R8O6K72K20l15m82N2O53J07p6o41k97N34
$$ 66 -3 -61 -228 243 386 -74 -142 -183 -69 -259 -161 -95 177 397 82 -400 -348 305 412 336 -305 -602 -68
1702f8O31l63n23N5L84L1l9k93P4M52N4p84j00N99K29q0l55m67L15P92J04j005
$$ -68 563 200 -323 -268 116 147 108 -185 -111 341 395 -389 -489 110 339 259 -96 -563 -248 544 648 -357
1724c57k78J044ko72j38R1N37L08n51q34N27Q19J85n15l26q0K86J85r8l39L68
$$ -357 -635 409 407 -265 -403 -312 225 533 -18 -852 -325 494 679 164 -162 -242 44 229 131 -208 160
1745A60K63o80k00J41L26K56Q3m01k94K97n8K22P9L3k86K21j29j80L5M61j0m03
$$ 160 423 -257 -457 -316 10 266 349 -52 -346 -49 -107 115 194 227 -59 162 33 -147 -112 349 339 -64
1767f4j17r7J98M10j88l71N5J60k70L52n3j42K62J15j98j25nJ05J66K97M5q79
$$ -64 -181 -278 -80 330 142 -229 -174 -14 -284 68 15 -127 135 250 52 -73 -78 27 193 490 535 -344
1789c44n8M21j85K85J6k87n3L75m67l85O98L94J17m56l11k98L13N80k98k42J85
$$ -344 -402 19 -166 119 135 -152 -205 170 -297 -682 16 410 527 71 -240 -538 -225 355 57 -185 0
1810@K10l96Q7pK70M07l90n73J16L71J67k0k03l94k2M77j72l8J18M96l26k74k7
$$ 0 210 -186 -99 -106 164 571 181 -392 -276 95 262 242 39 -355 -377 100 -72 -110 8 504 178 -96 -123
1833a23k29L73N77m00m24p9J56k12K09L38K0q2q9l73l0N05K39m0j68l62j58K86
$$ -123 -352 21 598 198 -226 -305 -149 -361 -152 186 206 124 35 -338 -368 137 376 336 168 -194 -352 -66
1855f6K98m2k9j48q5j58J87K06L5Om4p28L28J9L89J05l51K8k34M54j98R8K33R
$$ -66 232 190 161 13 -72 -230 -43 163 198 204 160 -568 -240 -221 168 273 -78 -50 -284 170 -28 70 303 312
1879C12l64M3p6J75k8r2k30J05L73l7n15L60M2J12o2K8k64L1J14j3L8o0m19Q2
$$ 312 -52 -9 -85 90 62 -30 -260 -155 218 181 -334 26 68 180 118 146 -118 -87 27 14 52 -8 -427 -345
1903c45K66K53K4q9j05L9J22j87j23L81K08n02k39J67n7K33J24k40J52K11mo23
$$ -345 -79 174 198 109 4 43 165 -22 -145 236 444 -58 -297 -130 -187 46 170 -70 82 293 289 -334
1925c34K64N48l60j81QJ41j01l2k10N4K52J73n40J86M77l96j9J25O8l0m43j12
$$ -334 -70 478 118 -63 -55 86 -15 -47 -257 -203 49 222 -318 -132 345 -51 -70 55 123 93 -350 -462
1947d62M32M32k17p73K33L82J55m0j62q4K57k0m74J42M95o4m46j53N49j43M9N0
$$ -462 -30 402 185 -588 -355 27 182 142 -20 -104 153 133 -341 -199 296 232 -214 -367 182 39 88 138
1969A38m67K58L43l01N8K08m3l92O3L19j63k98L65o2k25J66q9M0O18nq48j11Q07
$$ 138 -329 -71 272 -29 29 237 194 -198 -135 184 21 -277 88 26 -199 -33 -122 -82 536 531 -317 -428 379
1992C79L6n11m77J81M61K46m49m22N88M89l55l63L89J98j69j75l37K66J82l62
$$ 379 415 -96 -573 -392 69 315 -134 -556 32 521 166 -197 192 390 221 46 -291 -25 157 -205
2012b05k83O23k7k52K49Kk35oM9K45NP3k63m32N28J16m91J7L22K87j02k60j90
$$ -205 -488 135 108 -144 105 107 -128 -134 -85 160 165 238 -25 -457 71 187 -304 -287 35 322 220 -40 -230
2035b30L73PRn27L21K44k48j61L7k2J21J05K8Q7J14q9j73K37r7l34P4L1K88j04
$$ -230 143 150 159 -368 -47 197 -51 -212 -175 -197 -76 29 57 144 258 169 -4 233 136 -198 -124 -93 195 91
2059I1l78r5L97R7l14j23M54J01K45n02j03J22K46j21l48K28K23k8k24p5k1J91
$$ 91 -287 -382 15 112 -202 -325 129 230 475 -27 -130 -8 238 117 -231 -3 220 192 -32 -107 -128 63
2081F3J19j33k41K86l5j45N8j13k46J20L56J1j32P4k51J37J82n3o5J61K30k03
$$ 63 182 49 -192 94 59 -86 -28 -141 -387 -267 89 100 -32 42 -209 -72 110 57 -8 153 383 180
2103A80l12j11J78M7k57Q1NM22Ml10M4j7L0J07J46o1j8l0m51rL37j85L27j56j1
$$ 180 -132 -243 -65 -18 -275 -194 -189 233 237 -73 -29 -46 -16 91 237 176 158 128 -323 -332 5 -180 147 -9 -20
2128b0M7j99L27j93j10J88j90O0J53L00o13N2J29k37J06L44J29J8P9m37m69J99
$$ -20 27 -172 155 -38 -148 40 -150 -90 63 363 -250 -198 -69 -306 -200 144 273 291 370 -67 -536 -337
2150c37M01J02J33k74k44L8J03q8K42J98j59j49K30k23L29p9j99m19J48k8M61
$$ -337 64 166 299 25 -219 -181 -78 -166 76 274 115 -34 196 -27 302 223 24 -395 -247 -275 186
2171A86J84n0o12j40L32J19P3J24K3k12P6j08k55J88K15M5m03J11P8K32Q0j38
$$ 186 370 320 -292 -432 -100 19 92 216 239 27 103 -5 -260 -72 143 188 -215 -104 -26 206 286 148
2193A48m97K24L25N1q2k31J9j69p3P8LM76q6j68j04J08J5j2R5j38o8J55j98J85
$$ 148 -349 -125 200 251 169 -62 -43 -212 -285 -207 -204 272 186 18 -86 22 37 25 120 -18 -86 69 -129 56
2217E6N0k96p1J80J60J96j72J4nl83M1L14J33J73k14n66J95Q3R0J51Kk70j20O4
$$ 56 106 -190 -261 -81 79 275 103 117 112 -271 -230 84 217 390 176 -390 -195 -112 -22 129 131 -139 -259 -195
2241a95j9L76K17k45m15k00N36J83j92K44k19j86r8O9K34K77K8n17j82L9L86J40
$$ -195 -214 162 379 134 -281 -481 55 238 46 290 71 -115 -213 -144 90 367 395 -122 -304 -265 121 261
2263B61j77k22l9Q0L5p7K64L3k16l1J29JL15l2n27K09l79K90J31L26n67p4J67
$$ 261 84 -138 -177 -97 -62 -139 125 158 -58 -89 40 41 356 324 -203 6 -373 -83 48 374 -193 -267 -100
2286a00J12J0J67p2l8r4j03J07LM67m25q0j05J82L8J28l46J7J79n9n7J07L67l57
$$ -100 12 22 189 117 79 -15 -118 -11 -8 459 34 -46 -151 31 69 197 -149 -132 47 -12 -69 38 405 48
2310D8k66n7k3L48J37k39r6Q3j21Q1K71p2j9p7j54p5J20J63m5p2k86L68m5O8J62
$$ 48 -218 -275 -298 50 187 -52 -148 -65 -186 -105 166 94 75 -2 -156 -231 -111 52 7 -65 -351 17 -28 40 202
2335B02l18N1J1J1J20j7j2P7j39k30J56L64l6j76k49l9L11K18k81k59l3M24o7
$$ 202 -116 -65 -54 -43 77 60 48 125 -14 -244 -88 276 240 64 -185 -224 87 305 24 -235 -268 156 89
2358H9j41K06K24l50k17k69K55N89K26n34l10j21K57p4K04J72M3k39lJ2k02M23
$$ 89 -52 154 378 28 -189 -458 -203 386 612 78 -232 -353 -96 -170 34 206 249 10 7 19 -183 240
2380B40j24k73m1J48J02J98J90k94k31j90j4J54J79J69j67m2j61l8J09L60q2n1
$$ 240 116 -157 -198 -50 52 250 440 146 -85 -275 -289 -135 44 213 46 4 -157 -195 -86 274 192 141
2402A41j16k31j20J59J61K9L13j94k16J80L21l28l89J42J21J25Q3k00R6L9q6j25
$$ 141 25 -206 -326 -167 -6 23 336 142 -74 106 427 99 -290 -148 -27 98 181 -19 77 116 30 -95
2424i5j42O01m0j88k35r3L86J68l47l98L78K90kk09j02m0k09L02J3J00N1R1j19
$$ -95 -237 364 324 136 -99 -192 194 362 15 -383 -5 285 283 74 -28 -68 -277 25 38 138 189 280 161
2447A61m28N0J04J52L04l1m36k22K52K67r9k70kJ53RJ35o9Q0o0q2j66l7M79O5
$$ 161 -267 -217 -113 39 343 312 -124 -346 -94 173 74 -196 -198 -45 -36 99 30 110 50 -32 -198 -235 244 309
2471C09n8k67K6j43k05J99P3K80l1k85k71K45N0J52j45J86k64m4R6K19N3j36j84
$$ 309 251 -16 10 -133 -338 -139 -66 214 183 -102 -373 -128 -78 74 -71 115 -149 -193 -97 122 175 39 -145
2494a45j98L16K02j38K00k42k61K62j15j33J44K96k28o1j90L20mL66l79k8j11
$$ -145 -343 -27 175 37 237 -5 -266 -4 -119 -252 -108 188 -40 -101 -291 29 25 391 12 -16 -127
2515a27K45j43j1J50k60k09L24K48k26K10n4l01R9K23k07J73j06k89M8L06J17
$$ -127 118 -25 -36 114 -146 -355 -31 217 -9 201 147 -154 -55 168 -39 134 28 -261 -213 93 210
2536B10k64n3r7K18J64l6j2k75J91M7l25R0M36k74k4j18o7P7L39k59N2K36l06
$$ 210 -54 -107 -204 14 178 142 130 -145 46 93 -232 -142 294 20 -4 -122 -189 -112 227 -32 20 256 -50
2559e0l16L49K17k48l4j1nK04pN2k37J49p8J1j71J39lL7km4k86M21p7j77L32J2
$$ -50 -366 -17 200 -48 -82 -93 -98 106 99 151 -86 63 -15 -4 -175 -36 -39 -2 -4 -48 -334 87 10 -167 165 177
2585A77m09M3K68J36j14j07j07M9J73N9j19J36k64j43J32j1J80N0m9k08O9J19
$$ 177 -232 -189 79 215 101 -6 -113 -64 109 168 49 185 -79 -222 -90 -101 79 129 80 -128 -59 60
2607F0J8j2j23L6L2j32k1J14K28l7l58J87j07J90lN2j04k8nL7j06K15j4j01o3
$$ 60 78 66 -57 -21 11 -121 -142 -28 200 163 -195 -8 -115 75 72 124 20 -8 -13 24 -82 133 119 18 -45
2632d5J95r7J12k64N5k1J01Kj02R3p5j03N5m4J65j21R7o1J01N4k13K48M3j88n9
$$ -45 150 53 165 -99 -44 -65 36 38 -64 29 -46 -149 -94 -138 27 -94 3 -58 43 97 -116 132 175 -13 -72
2657g2J03j00J06P9l3k23J93J43m36J66L39r4j57p1j57K31K01j14l04K02M4j45
$$ -72 31 -69 37 116 83 -140 53 196 -240 -74 265 171 14 -57 -214 17 218 104 -200 2 46 -99
2679i9j55L23K05k43L3k98L08N2r1k20N9L2MR0j59K61j56K09j13j54K21k7O8j11
$$ -99 -254 69 274 31 64 -234 74 126 35 -185 -126 -94 -90 0 -159 102 -54 155 42 -112 109 82 150 39
2703C9p4j09J96rp8k1J37j09P0j1j22K5K18n7j50R0M2Mq1p8l0K6L27k35j06J27
$$ 39 -35 -144 52 43 -35 -56 81 -28 42 31 -91 -66 152 95 -55 35 77 81 0 -78 -108 -82 245 10 -96 31
2729C1l5O4k1nj96P0K07j59M0P5j59R3k85J56MJ44j2K87j53j74k88L33J67k50
$$ 31 -4 60 39 34 -162 -92 115 -44 -4 71 -88 5 -280 -124 -120 24 12 299 146 -28 -316 17 184 -66
2753f6J66J00l01k8L02j90p2K09J58l02R2j62K26q8J18n8l80M30L3q0k13P2r7
$$ -66 100 200 -101 -129 173 -17 -89 120 278 -24 68 -94 132 44 162 104 -276 154 187 107 -106 -34 -131
2776a31J7J28J7j83L03j2R6n28K76J9K88l30q2R1Q6K1r2nmP6l0j12j32J10K19
$$ -131 -114 14 31 -152 151 139 235 -293 -17 2 290 -40 -122 -31 55 76 -16 -21 -25 51 21 -91 -223 -113 106
2801A06n5k45L11j27J32j16k16J74J83j29R5j73J9k14L01j75K5L7K39k33O6o8
$$ 106 51 -194 117 -10 122 6 -210 -36 147 18 113 -60 -41 -255 46 -129 -104 -67 172 -61 5 -63
2823f3m9J25J24k16o7J24p0Q0P5r0p0N9K38k89O0K49k90N8J04j10J32n1k4j91
$$ -63 -112 13 137 -79 -146 -22 -92 -12 63 -27 -97 -38 200 -89 -29 220 -70 -12 92 -18 114 63 39 -152
2847a52J69Rk79L48J01o7o9j10m5J8R4j25K20l4j1j76o8L24j81J18K9j47l5K35
$$ -152 17 26 -253 95 196 129 60 -50 -95 -77 17 -108 112 78 67 -109 -177 147 -34 84 113 -34 -69 166
2871A66j08k73N5J26K9K55k25nm0J14j1k69J43J86q9j82K6k51L36L89l45j40j3
$$ 166 58 -215 -160 -34 -5 250 25 20 -20 94 83 -186 -43 143 54 -128 -102 -353 -17 372 27 -113 -126
2894a26J76R6k09J77j76J8J85k83K68J90l62j93mP1L64mk3j32j33l0R2L5J71l5
$$ -126 50 146 -63 114 -62 -44 141 -142 126 316 -46 -239 -243 -172 192 188 165 33 -100 -130 -38 -3 168 133
2918A33k77K20j26l4K02j30L9o8mj66Q7K04j78Pk3l3QK30q2j72J47l2k56K73N
$$ 133 -144 76 -50 -84 118 -12 27 -41 -45 -211 -124 80 -98 -91 -114 -147 -139 91 9 -163 -16 -48 -304 -31 -26
2943b6LJ44j23Mp8r0J67k35K82j80p1K15j0Q2l21K93n2J49j66o1k82L42R7p8j21
$$ -26 -23 121 -2 2 -76 -166 1 -234 48 -132 -203 12 2 84 -237 56 4 153 -13 -74 -356 -14 83 5 -116
2968a16J24k1J9M9k13J58J35J0j89j65J96R9J36k52R8l6k19J29M7M9M5j1j77k89
$$ -116 8 -13 6 55 -158 0 135 145 -44 -209 -13 86 222 -30 68 32 -187 -58 -11 38 83 72 -105 -394
2992c94K84J10jJ07j46Oj60K08J17j03j09J70j54j23J66K91kL7l55lr4K40o4j51
$$ -394 -110 0 -1 106 -40 -34 -194 14 131 28 -81 89 -65 -188 -22 269 267 304 -51 -54 -148 92 28 -123
3016a23K59j93m4R3P6Q3k4p4r1J13%k57L18j48m4K8k2P4RJ74k81n1J17k5Q4o9
$$ -123 136 -57 -101 -8 68 151 127 53 -38 75 75 -182 136 -12 -56 -28 -50 24 33 207 -74 -125 -8 -33 51 -18
3042a8j5L6O3q8k26N8J80M3K0j84L05n1r1Q8l62J80J10K8k26op7R7J80J70j73
$$ -18 -33 3 66 -22 -248 -190 -10 33 53 -131 174 123 32 120 -242 -62 48 76 -150 -156 -233 -136 44 214 41
3067D1l06K10R1n9J70j40P9L6j76j04J32M34m56j9M3j16n3J83K5j84J97M7k16
$$ 41 -265 -55 36 -23 147 7 86 122 -54 -158 -26 408 -48 -67 -24 -140 -193 -10 15 -169 28 75 -141
3090a41R9J07j22R0r1j13K47l4k02o3L80j07k3O1k35L3J82o5j52J63O9p3j39Q1
$$ -141 -42 65 -57 33 -58 -171 76 42 -160 -223 157 50 27 88 -147 -114 68 3 -149 14 83 10 -129 -48
3114d8R0J1j59n2R9QK23j27k76K95M5k24J31O7j98J6J15j67J44J18j06Jr6Q8P2
$$ -48 42 53 -106 -158 -59 -51 172 45 -231 64 109 -115 16 83 -115 -99 16 -151 -7 111 5 6 -90 -2 70
3139G0l4j05k4J41j32K07K3j39o7J08p0mlL38l65j63J34k7J06P0o0qn9M2J7J17
$$ 70 36 -69 -93 48 -84 123 146 7 -60 48 -22 -26 -29 309 -56 -219 -85 -112 -6 64 4 -4 -63 -21 -4 113
3165A13j94J36K5n9j58P9J76L9k81J49or8O2J0L6m4J34n1r6M0J27j28N4o8%j33
$$ 113 -81 55 80 21 -137 -58 118 157 -124 25 19 -79 -17 -7 29 -15 119 68 -28 12 139 11 65 -3 -3 -136
3191a36P7R9j9L8k06O3P2J03l53M60k60L1M1J12o3j91J66k1lQ0r9k66L08p1kK48
$$ -136 -59 40 21 59 -147 -84 -12 91 -262 198 -62 -31 10 122 59 -132 34 13 10 90 -9 -275 33 -38 -40 208
3217B08j73O9Mj63L0n3R9O2j40j72J97j95J40L38j52j45N9j94J79m4J38k92Q6
$$ 208 35 104 108 -55 -25 -78 21 83 -57 -229 -32 -227 -87 251 99 -46 13 -181 -2 -46 92 -200 -114
3240a14J7Q0m8K00l30K72q9R6l2m8o0R8j18J10N9p7R9nj27L3k7j44Q8j8P9LR8
$$ -114 -97 -17 -65 135 -195 77 -12 84 52 4 -56 42 -76 34 93 16 115 110 -17 16 -11 -155 -67 -85 -6 -3 95
3267I5j75J85j54o1l9J85l4O2%o0n1J69L2o9M8k3k4j41J91r9N6j30J34k1J24l09
$$ 95 -80 105 -49 -110 -149 36 2 64 64 4 -47 122 154 85 133 110 86 -55 136 37 93 -37 97 76 200 -109
3293a09j01K04J38j96j2L75l75r0K91m5j43j01J08J32Q4j56Pn3o1M0oJ10O9r5
$$ -109 -210 -6 132 -64 -76 299 -76 -166 125 80 -63 -164 -56 76 160 4 11 -42 -103 -63 -69 41 110 15
3317A5P0m0J3P1j06p0j11K32j27P2K5n9j09L6J25j23K30j10j88J38K88l39j29
$$ 15 85 45 58 129 23 -47 -158 74 -53 19 44 -15 -124 -88 37 -86 144 34 -154 -16 272 -67 -196
3340a96K29J48k58K66j53j28M2p9K3P9K0N7j15J23J13q1l4o2M2n3J4j49m6J90
$$ -196 33 181 -77 189 36 -92 -50 -129 -106 -27 -7 50 -65 58 171 90 56 -6 36 -17 -3 -152 -198 -8
3364hNK3P6j54N9P1N3pj78O4K4j1j84P7rQ4p8L4%P2j3J94j63j62J19J2q3N7N0
$$ -8 -3 20 96 -58 1 72 125 118 -60 4 28 17 -167 -90 -99 -15 -93 -59 -59 13 0 194 31 -131 -12 0 -83 -26 24
3393B4J08P0l01M4j30K16n4r3N8K97o4l18J25r9K36j39o2J3K83j59j30O3M5j48
$$ 24 132 202 -99 -55 -185 31 -23 -116 -58 239 175 -143 -18 -117 119 -20 -82 -69 214 55 -75 -12 33 -115
3417a15J13J22j33jq1M2K24o3k4k4J23l14J75Q9j29R4o1q0K7l1j59J45J81m2n0
$$ -115 -2 120 -13 -14 -95 -53 171 108 84 60 183 -131 44 133 4 98 37 -43 -16 -47 -206 -61 120 78 28
3442B8j42R2N7k22K43J3p1l6L4n9N1K4k17K42J14j58M3p3P0k49K23k1L8k8Lj60
$$ 28 -114 -22 35 -187 56 69 -2 -38 -4 -63 -12 12 -205 37 151 -7 36 -37 33 -216 7 -14 24 -4 -1 -161
3468a61Q9R1J33k51J46m2J18j49J26j87rK96k63k7N9J03j99K01r2q8P9N3k04J05
$$ -161 -72 19 152 -99 47 5 123 -26 100 -87 -96 200 -63 -90 -31 72 -127 74 -18 -106 -27 26 -178 -73
3492g3L09j74kl5j25M8L5n7J10N2O6j48O0Jk96O6J57N8pm8q1J0J23%j32k9J49
$$ -73 236 62 60 25 -100 -52 -17 -74 36 88 154 6 66 67 -229 -163 -6 52 45 -3 -84 -74 49 49 -83 -112 37
3519C7n6J02p7lK3O7m9k57J78M8p8j76K44J27k35J91j69J28q3J36l26L36j5r9
$$ 37 -19 83 6 3 26 93 44 -213 -35 13 -65 -241 3 130 -105 86 -83 45 -38 98 -228 108 93 -6
3543fj3J4j7j84L76l56J57J03j04jJ08l27J70o1K89j73lK00p6j10P6kk48K63r2
$$ -6 -19 -5 -22 -206 170 -186 -29 74 -30 -31 77 -250 -80 -141 148 -25 -28 172 96 -14 62 60 -188 75 -17
3568a7L2n3J07l3L3R5k23o3J14J86l09Q8l2MJ60j56k8l8K34j02k3j96J37J88J
$$ -17 15 -38 69 36 69 164 -59 -122 -8 178 -131 -43 -75 -71 89 -67 -95 -133 101 -1 -24 -220 -83 105 106
3593A06q2M0o8J55k04m5J24M5p0J55j97m1J38j63P9L3J27k0J02kj76n5o1J35j66
$$ 106 24 64 -4 151 -53 -98 26 71 1 156 -41 -82 56 -107 -28 5 132 112 214 212 36 -19 -80 55 -111
3618a11N5J06J7k1q1j87J57J00j27K87l64N1K71r5J1N3k7j36R9k8l4L2l5K12j12
$$ -111 -56 50 67 46 -35 -222 -65 35 -92 195 -169 -118 153 58 69 122 95 -41 58 30 -4 28 -7 205 93
3643I3oQn0j2J81k58J42j88P0J1R1Lj1M9R1l99J52J15O7j26k4L0J21j4o0j10j02
$$ 93 87 95 45 33 214 -44 98 -90 -20 -9 82 85 74 123 214 -185 -33 82 149 23 -1 29 150 136 76 -34 -136
3670a36K59J9j40j3o7K13j04r4M6L8m5J9l4Q1o1J67p9j90J3q4J60K9q5mq1R4J67
$$ -136 123 142 2 -11 -78 135 31 -63 -17 21 -24 -5 -39 42 -19 148 69 -121 -108 -192 -32 -3 -88 -92 -173 -79 88
3697H8l6k3J01j30K0K0o9K8M2q5J22j10J97o7j90O0O0j2R5r1o6j26J75P2J8k16
$$ 88 52 29 130 0 20 40 -29 -1 41 -44 78 -32 165 98 -92 -32 28 16 111 20 -46 -172 3 75 93 -123
3723a23J73m9q3J53k80K64m4M3j38P2j13P9p2K91j67Q1m3N1k8j68k7J91l8M4k43
$$ -123 50 1 -82 71 -209 55 11 54 -84 -12 -125 -46 -118 173 6 87 44 95 67 -101 -128 63 25 69 -174
3748a74K06j93K47k3j8j13R6P6l8j7j17J27j12m3Q0P9j39J23k18M5J10LO8j53
$$ -174 32 -161 86 63 45 -68 28 104 66 49 -68 59 -53 -96 -16 63 -76 47 -171 -126 -16 -13 55 -98
3772i8k6J71l0n7O9P8k03P0J59l02p3K94R0r7j55ML5J89n1j25O1k11K76J58k28
$$ -98 -124 47 17 -40 29 107 -96 -26 133 -169 -242 52 142 45 -110 -106 -71 118 67 -58 3 -208 68 226 -2
3797bN1k81M2Q8N7Q2P4k18J4qR6Jr5J39j16n5J39o2J76q4l6l1oL4P9Q3k45K65
$$ -2 49 -232 -190 -102 -45 37 111 -107 -93 -101 -5 -4 -99 40 -76 -131 8 -54 122 38 2 -29 -35 -1 78 161 -84 181
3825A81j14j31P9J34k37lJ73r7n2J50k31L18k86NJ34l1lk10J56OO4p7nK8j2J05
$$ 181 67 -64 15 149 -88 -91 82 -15 -67 83 -148 170 -116 -111 23 -8 -11 -221 -65 -59 5 -72 -77 -49 -61 44
3851D4j30O7K9Q9k35K5J27O5kj05p8O1J26k2q3M7P1j41J60j05O4r9Q6J15q4j87
$$ 44 -86 -19 10 99 -136 -111 16 81 79 -26 -104 -43 83 61 -22 25 96 -45 115 10 74 -25 61 176 92 -95
3877i5J51n4O4j36L6J57o8j39nj4R4j01P4J7k2P0L6Q9j50p3R7J47L2j68q0p6J98
$$ -95 56 2 66 -70 -34 123 55 -84 -89 -103 -9 -110 -36 -19 -41 29 65 154 4 -69 28 175 207 39 -41 -117 81
3904H1j12J48j11o2J30j96J2M3P5o9m1L6M5p8J8O9J06m6Kn5j49K58K2jr7q1J23
$$ 81 -31 117 6 -56 74 -122 -110 -67 8 -61 -102 -66 -21 -99 -81 -12 94 48 50 -5 -154 104 126 125 28 -53 70
3931G0P8J4j15j73J54j15n9J40p5o5J51p8J5L7M6J42k58J24j31mJ98n2Q4j59n2
$$ 70 148 162 47 -126 28 -87 -146 -6 -81 -146 5 -73 -58 -21 25 167 -91 33 -98 -102 96 44 128 -31 -83
3956h3J3M5l0J17o6q2J12J1j9J63j96j12R6nj08J80j20J16N6j67k7j3K61k33J84
$$ -83 -70 -25 -55 62 -4 -86 26 37 18 181 -15 -127 -31 -36 -144 36 -84 32 88 -79 -106 -119 142 -91 93
3981I3P4l11nN5J83n5k08K49rk25J74J3Nj46Q0q4J95l1l3or1J11j12N7J69%k47
$$ 93 167 -144 -149 -94 89 34 -174 75 66 -159 15 28 33 -113 -33 -117 78 47 14 8 -83 28 -84 -27 142 142 -105
4008a05K05l7j7N4j33M8o3l7l0J03L5L29l81nP9j29K8J21k85J50J34r8J12Q3k72
$$ -105 100 63 46 100 -33 15 -48 -85 -115 -12 23 352 -29 -34 45 -84 -56 65 -220 -70 64 -34 78 161 -111
4033a11K84j23j54K25j37Q2k1n9j05L00j10j3N0k49J01J1n3n6Q8O2j7o8k9m4K29
$$ -111 173 50 -104 121 -16 66 45 -14 -119 181 71 58 108 -141 -40 -29 -82 -138 -50 12 -5 -73 -102 -146 83
4058H3j02o5J40Q6j32r9L9PJ08j25J23j31k7J72k37J67k02J01R5O7j88K53k34
$$ 83 -19 -84 56 142 10 -89 -50 -43 65 -60 63 -68 -95 77 -160 7 -195 -94 1 68 -120 133 -101
4081a01l5J52j76K43l5j80P7r6O0J01o6J50L1k48J27l1R2N8n4N7r1Kl8q1J34N6
$$ -101 -136 16 -160 83 48 -132 -55 -151 -91 10 -56 94 125 -123 4 -27 65 123 69 126 35 37 -1 -82 52 108
4107A08k71J21N2L6j24J39j51P3J18j41j6N2o7J20P0r4m9J18j58L4Q2J4r3K03
$$ 108 -163 -42 10 46 -78 61 -90 -17 101 -40 -56 -4 -71 49 119 25 -24 94 -64 -30 52 66 -27 176
4131A76n3k07j4J00p6L0p7l9K12O6k18J29P7j9l00J76k3J55j4J5j79Q9O2J48j06
$$ 176 123 -84 -98 2 -74 -44 -121 -160 52 118 -100 29 106 87 -213 -37 -60 95 81 96 -83 6 68 216 110
4156A10j01j30J57j53L6J65o5o3J55q0NP8j05j15r5J96j25J51M9k00j02L39j00
$$ 110 9 -121 36 -117 -81 84 19 -44 111 31 36 114 9 -106 -201 -5 -130 21 70 -130 -232 107 7
4179Gr8q8J02L5m5R7P3o5r6J92j50P3j17J7NK5lJ14k6j78P7J12m6J22k39J52J7
$$ 7 -91 -179 -77 -42 -87 10 83 18 -78 114 -36 37 -80 -63 -58 -33 -36 78 52 -126 -49 63 17 139 -100 52 69
4206F9M0n0j37O1r4J76k86K84j49p9J42p4J76j06J01p2OO2j60P2j31R9K37ql59
$$ 69 109 59 -78 -17 -111 65 -221 63 -86 -165 -23 -97 79 -27 74 2 8 70 -90 -18 -149 -50 187 179 -180
4231a80J66M4oJ00j1r2Q8J3j56rO1J01j51K0L7q0O6O5j94K38j12j22M7n9K34j06
$$ -180 -14 30 24 124 113 21 109 122 -34 -43 18 119 -32 -12 25 -55 11 76 -118 120 8 -114 -67 -126 108 2
4257Bpj71K12P2l4j67R3P8j01K2j6k9P0j87K5J48J06j46K4J78j79Kp4J00k05K92
$$ 2 -5 -176 36 108 74 -93 0 78 -23 -1 -17 -46 24 -163 -138 10 116 -30 -6 172 -7 -5 -79 21 -184 108
4283A08n9k94J95K73l07J13K1n1K7L6q4K14j91P0m3p0j4J68m3j21M3j48J55o5
$$ 108 49 -245 -50 223 -84 29 50 -1 26 62 -22 192 1 71 28 -42 -56 112 69 -52 -9 -157 -2 -67
4307f7J05%J48j61j35Q9M5R5j69L9m0K30k15j4K04j15p3K27k58n7J27n9j5J58
$$ -67 38 38 186 25 -110 -21 24 119 -50 -11 -51 179 -36 -50 154 39 -34 193 -65 -122 5 -54 -69 89
4331H9m0j32J53j08O3J02j82J72p3R4kj03n1k50L56k20L43k26kr7K14Q9j61j46
$$ 89 49 -83 70 -38 25 127 -55 117 44 138 136 33 -18 -268 88 -132 211 -15 -17 -114 100 189 28 -118
4355a18J58O5q6p0l3J78k52N2J26j27J8J8J57n2L4j35RPR4J15j49m4R6rnK1Jj33
$$ -118 40 105 19 -51 -84 94 -158 -106 20 -107 -89 -71 86 34 68 -67 -58 -51 43 158 9 -35 61 52 47 68 69 -64
4383f4N8R7K12l30J5j48K47m7j4j10p4N7n5K03J90j16k8n5N7j97J33lL0ok48K94
$$ -64 -6 91 303 -27 -12 -160 87 40 26 -84 -158 -101 -156 47 237 121 93 38 95 -102 31 28 58 52 -196 98
4409I8j27J7J40j15N4J11r0k0m3j39qJ06J25j04j21n1p1M89k48j38R6J26r0j88
$$ 98 -29 -12 128 13 67 178 88 68 25 -114 -122 -16 109 5 -116 -167 -238 251 3 -135 -39 87 -3 -191
4433a91K00K9J9l7j06j27J87K56k67j28J47k1J36O4l32L4J79J10j58r9J39k09
$$ -191 9 38 57 20 -86 -213 -26 230 -37 -165 -18 -39 97 161 -171 -137 42 152 -6 -105 34 -175
4455a75j0J56j4n6J36m5p3k1j0P5P7L3k39P7P7j65J53r4L56k40J16j63m1J62j37
$$ -175 -185 -29 -43 -99 37 -8 -81 -102 -112 -37 40 73 -166 -89 -12 -177 -24 -118 238 -2 114 -49 -90 72 -65
4480f5Nk0Q4j2J41j11k6j8O6j66K50m00L56M8j52J65j09r9M2K1J22k61L11j80
$$ -65 -60 -80 4 -8 133 22 -4 -22 44 -122 128 -272 84 132 -20 145 36 -63 -21 0 122 -139 172 -8
4504hr1K00j2j68J53o4pP6p6q2K90j11j45K7K03j80N8mJ26k54J88j54J06j97R8
$$ -8 -99 101 89 -79 74 10 3 79 3 -79 211 100 -45 -18 185 5 63 59 185 -69 119 -35 71 -126 -28
4529b8J23m7j94J82k1k8M3p9j13K32j7o2M4k1J97k45J39j64k5J45J03j73Q6m1
$$ -28 95 48 -146 36 15 -13 30 -49 -162 70 53 -9 35 14 211 -34 105 -59 -84 61 164 -9 77 36
4553C6j88J09l3Q2j28M3J28P5Jm26L03k2NN0mLj06K5m4J98J14l39L01l67L59k58
$$ 36 -152 -43 -76 6 -122 -79 49 124 125 -301 2 -20 -15 35 31 34 -72 -47 -91 107 221 -118 183 -184 175 -83
4579h3Q3K0j61K78n1j85J8J44m4kM4q5j5j07K96n5jj91o9L32q4L8j42K0j46L27
$$ -83 0 20 -141 137 86 -99 -81 63 19 17 61 -24 -39 -146 150 95 94 -97 -166 166 82 120 -22 -2 -148 179
4605A79j13k8O3o5J51k11mL5J0k09J8Q5J17l8L1P6j28J51j50j8m8K02n2p5L6n2
$$ 179 66 38 101 36 187 -24 -28 7 17 -192 -174 -89 28 -10 21 97 -31 120 -30 -48 -96 106 54 -21 15 -37
4631c7P5m1N9k9J40j56j1m1j4J17m0R3j36p7K15j24O1K31k59J00k65J65j1K1N6
$$ -37 38 -3 56 27 167 11 0 -41 -55 62 22 115 -21 -98 117 -7 54 285 26 126 -139 26 15 36 92
4656I2N4j82J1q3K59k53J17j56K2O0Q2PJ07j78nM1j18J22j36K00k17K97l30J70
$$ 92 146 -36 -25 -108 151 -102 15 -141 -119 -59 23 30 137 -41 -46 -5 -123 -1 -137 63 -154 143 -187 -17
4680a7m4p5K86j26J4KN5j56r1P6p7L06N3k99J55j42N8J89k12K7o2R6q1K8N7j56
$$ -17 -61 -136 150 24 38 40 95 -61 -152 -76 -153 153 206 -93 62 -80 -22 167 -45 -18 -80 16 -65 -37 20 -136
4706a36J35J05j89J34o8OO5K9j26n1J5m7R3J27j33K11j79m7l4N3M6j01M4N4kj59
$$ -136 -1 104 -85 49 -19 -13 52 81 -45 -96 -81 -128 -35 92 -41 170 -9 -56 -90 -37 9 -92 -48 6 4 -155
4732a55J42p1Q4P6j6o5r5K01J9k60oK47n7j49P0k4pJ76J07k10N0p5O0l2j02R5
$$ -155 -13 -84 0 76 60 -5 -100 101 120 -140 -146 101 44 -105 -35 -59 -66 110 217 7 57 -18 42 10 -92 3
4758Cm3j07K34j81J34J66k50j6J28m1J51j48r4L11k59O2k22L34k29J30m6J4r6
$$ 3 -40 -147 87 -94 40 206 -44 -60 68 27 178 30 -64 247 -12 50 -172 162 -67 63 17 31 -65
4781f5J06j5j89J55p0L7J32j11L3m1K6Rpk2P2j09O9kk22L21j50L1J04k6j09M5
$$ -65 41 26 -163 -8 -78 -41 91 -20 13 -28 -2 7 0 -22 50 -59 10 8 -214 107 -43 -12 92 66 -43 2
4807Bj2l4J90j51R2j09j7L4k1j01M6R3j67J87j0l2P3k36J87L8j24N3JL8M5j30
$$ 2 -10 -44 146 -5 87 -22 -39 -5 -26 -127 -81 12 -155 32 22 -10 63 -173 14 52 -72 -19 -18 20 65 -65
4833f5J4n9K0l6P4n1K15j56N1J27k03K07j24L7o9j2P0J0j13J24L2j62J81k6j29
$$ -65 -51 -110 -90 -126 -52 -103 112 -44 7 134 -69 138 14 51 -18 -30 40 50 -63 61 93 -69 112 86 -43
4858d3L7o7j1N0j63J28K05n8n8L6o3P1r3j6m9K0Q9j01q1J24L0Q8j30J77j76N1
$$ -43 -6 -73 -84 -34 -197 -69 136 78 20 56 -7 64 -29 -45 -94 -74 15 -86 -167 -43 -13 75 -55 122 -54 -3
4884cl3j21K35l1L9nj28J79m6n6j08J36n6k5O9p4J21k57K00p5J68k62J07j4L9
$$ -3 -36 -157 78 47 86 81 -47 132 86 30 -78 58 2 -23 46 -28 93 -164 36 -39 129 -133 -26 -40 -1
4909aj07P9j6j0J03K0rj06r2K21pk6j31O1q1M0jJ01k60L01j09J22p8L3j18m0J57
$$ -1 -108 -29 -45 -55 48 68 59 -47 -139 82 75 49 -82 -21 -102 -62 -63 38 -222 79 -30 92 14 47 -71 -111 46
4936D6J6r1R6J28l00K24k20J36j47Q0O8j5r7l9J95j39M2o5J00l9J76k46J43nn6
$$ 46 62 -29 67 195 -105 119 -101 35 -112 -32 36 21 -76 -115 80 -59 -17 -82 18 -21 155 -91 52 47 -9
4961iM1p8P3j92J76j4N7o7J05j21j90K37j32J22n5K57j55M3o3r1O9l8K5M3J9n5
$$ -9 32 -46 27 -165 11 -3 54 -13 92 -29 -219 18 -114 8 -47 210 55 98 35 -56 13 -25 0 43 62 7
4987Go4J37p8M4P6j90m3O0J42p3j8n2N5l6J41q7j4k8o2R3j57J66K7J27j47J07
$$ 7 -57 80 2 46 122 -68 -111 -51 91 18 0 -52 3 -33 108 21 7 -21 -83 10 -147 19 46 173 26 133
5013A33q9J9k3j38j1j8O2J24k6M2k61jK02m2J09j05L3k08J49j0K7J48k37Q1R9
$$ 133 44 63 40 -98 -109 -127 -65 59 33 75 -186 -187 15 -27 82 -23 10 -198 -49 -59 -32 116 -121 -40 59
5038E9o2Q5j05J08j53M2j6j2Q6j01n0O6Q1p1J33k1k8k19J59M9n6J26K6p5m8r0
$$ 59 -3 82 -23 85 -68 -26 -42 -54 32 -69 -119 -53 28 -43 90 69 41 -178 -19 30 -26 100 126 51 3 -87
5064h7R7j20J49l9j84J70j6Oq9j00J27J84r1J1j51J98j29J39j78K52m5j85J1J29
$$ -87 10 -110 39 0 -184 -14 -30 -24 -113 -213 -86 98 7 18 -133 65 -64 75 -103 149 104 -81 -70 59
5088E9j19j23K90j58J90k65J55m0o9M5n2Q1M4l0j23J9P9J19j64J54o3p9Q0qO0
$$ 59 -60 -183 107 -51 139 -126 29 -11 -80 -35 -87 -6 38 8 -115 -96 -17 102 -62 92 29 -50 30 22 82
5113H2L9j18N0M0O0j64M1n9K2M1O7J20j75r6J93l21K45J7p9k0k7K1P9j9o3R6j56
$$ 82 121 3 53 93 153 -11 30 -29 -7 34 101 221 46 -50 143 -178 67 84 5 -15 -42 -21 58 39 -24 72 -84
5140h4J26n6k9J38p9j8o4M4o6J64r2M5n5J07r3j23R2l6J05k0l5K6L1Q7k1Q2k34
$$ -84 42 -14 -43 95 16 -2 -66 -22 -88 76 -16 29 -26 81 -12 -135 -43 -79 26 6 -29 -3 28 115 94 176 -58
5167e8j6P3P2j70J32L9j07Q2m4J62k80O5Q5J16l29K83l1m1P5j56J05J1P3j63O1
$$ -58 -74 -1 71 -99 33 72 -35 47 3 165 -115 -50 35 151 -178 105 74 33 108 -48 57 68 141 -22 39
5192C9L5k3q2J87j00j00J06k28J89k01P9J48n9P5qm0r1J26Pj47J32k96L92k42
$$ 39 74 51 -31 156 56 -44 62 -166 23 -178 -99 49 -10 65 57 17 -74 52 59 -88 44 -252 140 -102
5216a02J37r7o9P0j02P6J70rj78J55k74K72o9J25j85J6N5J41q9j81nJ90m5J19
$$ -102 35 -62 -131 -61 -163 -87 83 74 -104 51 -223 49 -20 105 -80 -64 -9 132 43 -138 -143 47 2 121
5240A21j73j7L8r6J88k54j8K79j61J43J33j90J52j27o1l6J08p4M6O4N8m7J04n5
$$ 121 -52 -69 -31 -127 61 -193 -211 68 -93 50 183 -7 145 18 -43 -79 29 -45 1 65 123 76 180 125
5264A25k31K53k1j32P1O2j81p6J4J59J74k14k24K85j01K07j70R5N3q7M4l02O7
$$ 125 -106 147 126 -6 65 127 -54 -130 -116 43 217 3 -221 64 -37 170 0 95 148 61 105 -197 -130
5287a30O2N8j00J76q2K26q1n8q3j54J82N2J31k39R4M9o1j16K42L4k72J23j00M
$$ -130 -68 -10 -110 66 -16 210 129 71 -12 -166 16 68 199 -40 54 103 42 -74 168 202 -70 53 -47 -43
5311d3Q4J4j07RP5k13J03K4J10k8k5R7l7l9k08J56l7J04j97J21J3R4P3q7p5r6
$$ -43 41 55 -52 -43 32 -181 -78 -54 56 28 3 100 63 24 -184 -28 -65 39 -158 -37 -24 70 143 56 -19 -115
5337a15o4J83pj31k8R3P6Q0m8q4m4J83K3j95N4J05k18K24k55J55K5j42J98O7N6
$$ -115 -179 4 -3 -134 -162 -69 7 87 39 -45 -89 94 117 -78 -24 81 -137 87 -168 -13 12 -130 68 135 191
5362A91j06J9j20J8J4J13j42p0k9J25N9n4j8j20P9j06O2J95j4j19m3J81m3J48
$$ 191 85 104 -16 2 16 129 -13 -83 -112 13 72 18 0 -120 -41 -147 -85 110 96 -23 -66 115 72 220
5386B20j97o6r9J98l0m8k1J74k26J29J88k80j7J42j41q5J39p9J60k34J64P0k3
$$ 220 23 -43 -142 56 26 -22 -43 131 -95 34 222 -58 -75 67 -74 -159 -20 -99 61 -173 -9 61 38
5409C8J7o3K4m6K08o3j44Q0j41J82j55m3j40K38n1P0P4j16o2o0QJ2J03j71K46
$$ 38 55 -8 16 -30 178 115 -29 51 -90 92 -63 -106 -246 -8 -59 11 85 -31 -93 -153 -145 -133 -30 -201 45
5434D5j65O5J04q2J32k6j06J35n2j42Q2p5J53j91O1Jj2J22l1O8j57L74k23j88
$$ 45 -120 -55 49 -33 99 73 -33 102 50 -92 -10 -85 68 -123 -62 -61 -73 49 18 86 -71 303 80 -108
5458a08R4J58j75j4R3l0l2Q8l87L68j75J48j97Q8J32j91J94n7k1OJ04j09K1KJ08
$$ -108 -14 144 -31 -45 48 18 -14 74 -313 55 -120 28 -169 -81 51 -140 54 -3 -24 -18 86 -23 -2 0 108
5483A08j88J01R5n5l3p0K28j52q0k4Q9o1Q6j49P6l0P2j3L0j07p3K05j66K60o1
$$ 108 -80 21 116 61 28 -42 186 34 -46 -70 19 -42 44 -105 -29 -59 13 0 30 -77 -150 55 -111 149 88
5508H8j6j49J57j1j89R6n6rK31k00K74l81O9Q4Pj26J21J63k69O9R6p8K34k92%
$$ 88 72 -77 80 69 -120 -24 -80 -89 142 -58 216 -165 -96 -12 -5 -131 -10 153 -116 -47 49 -29 205 -87 -87
5533h7R6Rp0l9J02n2o2J91p6r2m2k7K66k57K36k3j92j0J99r9K39j69j17P9l7m2
$$ -87 9 18 -52 -91 11 -41 -103 88 12 -80 -122 -149 117 -140 96 73 -119 -129 70 -29 210 41 -76 3 -34 -76
5559g6q3J66j50J08K16l10K16j59J16k45N9K67k17L7o0J2L21l29K47o6L5j6j59
$$ -76 -159 7 -143 -35 181 -129 87 -72 44 -201 -142 125 -92 -55 -115 -103 218 -111 136 70 105 89 -70
5582g0J13K1j22M9p2J42j16j1P4k17K62o5P4J20j98N0O7n6m7J26j93R4j75J19
$$ -70 43 64 -58 -9 -81 61 -55 -66 8 -209 53 -12 62 182 -16 34 101 45 -2 124 -69 25 -150 -31
5606c1J23j81L21j60L7j00l5J7n8L5oN5j20J9J09L3k19J63j03J26j12J83Rm1p2
$$ -31 92 -89 232 72 109 9 -26 -9 -67 -32 -38 17 -103 -84 25 58 -161 2 -101 25 -87 96 105 64 -8
5631hl2J74j10j50J75J18j95M7j24J43JO3m3P8j68K53k29N6L8k43L71j70J10m3
$$ -8 -40 134 24 -126 49 167 -28 19 -105 38 39 102 59 137 -31 222 -7 49 87 -156 215 45 155 112
5655A12k8l8R2j31n9qN2j61J66J5J05k17N7M4o0J29k2P2L0j94K2O0J26k9j92J18
$$ 112 84 46 138 7 -52 -60 -8 -169 -3 12 117 -100 -43 1 -59 70 48 120 150 -44 -22 38 164 135 -57 61
5681F1j31m3K05pn0n5k17J90L6o3K1J47j43P1j64K75j61j29K23J92j90q1j5J27
$$ 61 -70 -113 92 85 35 -20 -237 -47 -11 -74 -53 94 -49 22 -142 133 -28 -157 66 258 68 -13 -28 99
5705I9l9j4p4j87J03O5J82j17m2l4j69K43mn1J05j57J40j25k2J54j70R2J44k57
$$ 99 60 46 -28 -215 -112 -47 135 18 -24 -58 -227 16 12 -39 66 -91 49 -76 -98 56 -114 -22 122 -135
5729a35L84k77J15l6J1k95J70j0J36p5n7J90k78J90r9j4o1qOJ67q8n4K07l8j56
$$ -135 249 -28 87 51 62 -233 -63 -73 63 -12 -69 121 -157 33 -66 -80 -141 -149 -143 24 -64 -118 89 51 -105
5754a05K80j68N5j36J06qj04J74q8R4k18J60j14J32q8j5J51j15j19Q0O8M3%j14
$$ -105 175 7 62 -74 32 24 -80 94 6 100 -118 42 -72 60 -28 -43 108 -7 -126 -46 22 65 65 -49
5778d9OR1p9O3K3j01J5Q5R4l51M6K02K3m0KJ4j37K24k02J72j6o3o5r7N0L8N9j06
$$ -49 -43 48 -31 32 55 -46 -31 54 148 -203 -157 45 68 28 30 44 -93 131 -71 101 85 22 -43 -140 -90 -52 7 -99
5806i9J28J12r9m8M1n4J83k49J9NJ5Pn6J26J6j1m8j0J38j40p9J59j62J56j44J35
$$ -99 29 141 42 -6 35 -19 164 -85 -66 -61 -46 -39 -95 31 47 36 -12 -22 116 -24 -103 56 -106 50 -94 41
5832D1nmj49J17kJ22j07n0k26L40p9Q4l3j17J20j18J13l7o2J38n4O4r0OR7j04
$$ 41 36 32 -117 0 -2 120 13 -37 -263 77 -2 82 49 -68 52 -66 47 10 -52 86 32 96 6 12 109 5
5858EN8k5L1j66R0M0l5j3J43j6j8j30J61k35N9J20Q7l02K37k6K8j04J19r8o9R5
$$ 5 63 38 69 -97 -7 33 -2 -15 128 112 94 -36 125 -110 -51 69 156 -146 91 65 93 -11 108 10 -59 36
5884C6m0J2J37j65o9J22PJ34l7j77L4jJ22m3lj96K01K3j85J38NP1j83J06J62l57
$$ 36 -4 8 145 -20 -89 33 40 174 137 -40 -6 -7 115 72 69 -127 74 97 -88 50 55 126 -57 49 211 -146
5910a46J86P2j26J02j68Q3%j67K35j14O3J26l72L39j64J27j21rl9K4K24j77N9
$$ -146 40 112 -14 88 -80 3 3 -164 71 -43 20 146 -226 113 -51 76 -45 -54 -93 -69 155 -22 37
5933C7j68J02J55m0m6k70L16k10J61Q6j61M6N9p6J34k37Q8p9J33l3O5l4P8j5j90
$$ 37 -131 -29 126 86 40 -230 86 -124 37 123 -38 8 67 -9 125 -112 -24 -103 30 -3 62 28 106 91 -99
5958i9J41p5K00k61J52k66J29J96j40J53j53l5M3k6l5N4K32j71J16l46K25n0P2
$$ -99 42 -33 167 -94 58 -208 -79 117 -23 130 -23 -58 -15 -41 -76 -22 210 39 155 -191 34 -16 56
5981E6j30Q3L6L0q4l4J7m8K1M0M4k5Qj43L16l7j8k32L2J54M4r4%j7r0R9j95l7
$$ 56 -74 9 45 75 -9 -43 -26 -74 -53 -13 31 6 14 -129 187 150 132 -100 -68 86 130 36 36 19 -71 28 -167 -204
6009b04K57K9j22K1J65k05R8J10j32q4L9R7k1j4m4J9j7q3N6K9k3k6M6J5l7M7J27
$$ -204 53 82 -40 -19 146 -59 39 149 17 -67 -28 69 48 34 -10 9 -8 -91 -35 -6 -29 -55 -9 6 -31 16 143
6036A43j11M8j49K9J44J43k45J53l1j13JJ19n3q5l4Q1K3J15l69P9KJ19pQ5k26
$$ 143 32 80 -69 -40 104 247 2 155 124 11 12 131 78 -7 -41 40 63 178 -191 -112 -110 9 2 87 -139
6061a39J22j47JJ34J4P6Qk12K13j12p1kJ68j47J86j38N3J36o9K0k32K99l34J69
$$ -139 -17 -164 -163 -29 -15 61 69 -143 70 -42 -113 -115 53 -94 92 -46 7 143 74 94 -138 161 -173 -4
6085dm2n2R9Q4j89Q9j29J12P8N8K5rk35RK26n3Q1k8k62K09j7j99K87j51r4J9K08
$$ -4 -46 -98 1 85 -104 -15 -144 -32 46 104 129 120 -115 -106 120 67 148 120 -142 67 50 -149 138 -13 -107 -88 120
6112A20q8j39J31M9p0Qn5J91j32r5j4kJ05l5j47K29q2r3J84J05j54P7k16J35L
$$ 120 32 -107 24 73 3 11 -44 147 15 -80 -94 -96 9 -26 -173 56 -26 -119 65 170 16 93 -123 12 15
6137A5k9j72J93K7R3j71r5L30k24J30j12l9j0j46L05j75R7Mj30M6k1J8l3J95q3
$$ 15 -14 -186 7 34 127 -44 -139 191 -33 97 -15 -54 -64 -210 95 -80 17 21 -109 -63 -84 -66 -99 96 13
6162A3k87J91J58k4j72J26Q5r4Q2N7o0M2k34J06O2j23NK28l58K88J1j78J85k46
$$ 13 -274 -83 75 51 -121 5 90 -4 78 135 75 117 -117 -11 51 -72 -67 161 -197 91 102 -76 109 -137
6186a37K88j57N0Oj42l1R6J82k62O7P4m7N3j3m7J64j76rL6P4l94L74L0l7m9J80
$$ -137 151 -6 44 50 -92 -123 -27 155 -107 -40 34 -13 40 27 -20 144 -32 -41 -5 69 -325 49 79 42 -7 173
6212A73j45qj5m3K72k63J05k32N5m1R3L8m3k11L15j40O8K4J75j20o9qJ95r6j54
$$ 173 28 20 5 -38 234 -29 76 -156 -101 -142 -49 -11 -54 -265 50 -90 -22 2 177 57 -12 -20 175 79 -75
6237g5PN6l2rJ9k8J03n6k6jJ44j64j4o7J65j54R4L0J21l4K8k11J25j02L7k4N6
$$ -75 -68 -12 -44 -53 -34 -62 41 -15 -41 -42 102 -62 -76 -143 22 -132 -38 -8 113 79 107 -104 21 -81 -44 -68 -12
6264a2Q0j54K10m1J6J94k26j04N1m0L5j0J77j45l3N6n9JJ21q7M0k61J87j3P5K4
$$ -12 68 -86 124 83 99 293 67 -37 14 -26 9 -1 176 31 -2 54 -5 -4 117 30 70 -191 -4 -17 58 82
6290H2j48J29l9k9k4J27j08M0k4R0k28P9K5J50j54q3P7j7K23k48J00n4J67k02
$$ 82 -66 63 24 -5 -29 98 -10 30 6 96 -132 -53 -28 122 -32 -115 -38 -55 168 -80 20 -34 133 -69
6314f9pK30j50L2j27jJ42j35K16n8l2j77K11lM1j91L6K03n4j73N3m2l1J8J30j94
$$ -69 -76 154 4 36 -91 -92 50 -85 131 73 41 -136 75 72 113 -78 -42 161 107 -66 -13 -55 -86 -68 62 -132
6340a32j14K50l8K3J08l6j01r5J55N0j40M8L1j47J99n8L3k73L2J99j49J4O9J94
$$ -132 -246 4 -34 -11 97 61 -40 -135 20 70 -70 -22 9 -138 61 3 36 -237 -205 -6 -155 -141 -72 122
6364A22j85J78o4k0l9J10k20J63p8J0o2j39J97M7m3n0J28j58J29n3k4J92p8j56
$$ 122 -63 115 51 31 -8 102 -118 45 -33 -23 -85 -224 -27 20 -23 -73 55 -103 26 -27 -51 141 63 -93
6388i3J39Rk12J17m6N8N9nJ01j82K7Nj09J01J07n3Q8Rr3J55j91O8o3m9pJ59o1
$$ -93 46 55 -157 -40 -86 -28 31 26 127 -55 -28 -23 -132 -31 76 23 111 120 27 182 -9 59 -4 -53 -60 99 38
6415C8j43J17o4K2J47k3L8K6j90q5M4K85j87M6q8j10J09Q9K8j11p3K03k00K63
$$ 38 -105 12 -52 -30 117 94 132 158 -32 -117 -73 212 25 71 -17 -127 -18 71 99 -12 -85 118 -82 181
6439A81j81oq3J32j44J43p3k1M4k3q8J59o5M7q2p6J15N7m6j26J38KL7o3M3j34
$$ 181 0 -6 -89 43 -101 42 -31 -52 -8 -31 -119 40 -25 22 -60 -136 -21 36 -10 -136 2 4 41 -22 21 -113
6465a13j4J12l7LJ15m4p0R0M4j16R4J09j19k73K93J1k5j24j40J99j17K54l19K14
$$ -113 -127 -15 -52 -49 66 22 -48 42 86 -30 64 173 54 -219 74 85 60 -64 -204 -5 -122 132 -187 27
6489B7m2J08o6o5Q4J30j09j09P9M1Rj01R1n0l8j49J97j40kJ72J45k55j40Q0r1
$$ 27 -15 93 27 -38 46 176 67 -42 37 78 87 -14 77 27 -11 -160 37 -103 -105 67 212 -43 -183 -103 -194
6514a94J05M3K00j08j6j38q1J55Nr9l3J05L8L8r5J94j73K22k90P9J54p9k5p2J45
$$ -194 -89 -46 154 46 30 -108 -189 -34 -29 -128 -161 -56 -18 20 -75 119 -54 168 -122 -43 111 32 7 -65 80
6539H0jK12l37K3R5K2l5k60J35J0P0L0Q6j78J07n6p7N0j97J64P0M7k31J30L1O
$$ 80 79 291 -46 -23 72 94 59 -201 -66 -56 14 44 130 -48 59 3 -74 -24 -221 -57 13 60 -171 -41 -10 -4
6565dO0k27J16L0J41n6kj60J17k38J99L00k99m2J49%k46J81mJ76j15j77J01j52
$$ -4 56 -171 -55 -25 116 60 58 -102 15 -223 -24 276 -23 -65 84 84 -162 19 15 191 76 -101 0 -152
6589a52Q4R2nj2L0M8j35J80j41OJ8R9j53m9R7m4K10k34N1k2M0P5K3k08J87j20
$$ -152 -68 24 19 7 37 85 -50 130 -11 -5 13 112 -41 -90 7 -37 173 -61 -10 -32 8 83 106 -102 85 -35
6615c5n5J73j0J02j73M8q4Q2l3MQ2l8J51l02J33j03M9j07k1O0K5J5N6J10k40L8
$$ -35 -90 83 73 175 2 50 -34 48 15 19 101 63 214 -88 45 -58 -9 -116 -137 -77 -52 -37 19 129 -111 -73
6641g3N0J34k11J77q9p6J01J9K4o2l6Q2mJ13k38N4n3Q1J28j95O0J19r6l4j9J06
$$ -73 -23 111 -100 77 -12 -88 13 32 56 -6 -42 40 36 149 -89 -35 -88 -7 121 -74 -14 105 9 -25 -44 62
6667F2j68k5J30L6K3K5j69J51q6R1rl1oJ2q8J26j76qJ28pl3j04j6J13O6R0j52
$$ 62 -106 -131 -1 35 58 83 -86 65 -21 70 61 30 24 36 -52 74 -102 -110 18 11 -22 -126 -142 -29 37 127 -25
6694b5o4K14n5j27O3l1J42p2J02j96L6R9j40J78k2j85J19j76J52Lq2R7jQ1j23
$$ -25 -89 125 70 -57 6 -25 117 45 147 -49 -13 86 -54 124 102 -83 36 -140 12 15 -67 30 29 110 -13
6719a3p1O5q4m6J50M6K9l3j47Q4j63K14j45p9K59m4N5J4j14J2P2K5j47M7O5r5
$$ -13 -84 -19 -103 -149 1 47 76 43 -104 -20 -183 31 -114 -193 66 22 77 91 -23 -11 61 86 -61 -14 51 -44
6745d4J17k4j62l9K25qJ19l11K45j07J16j25o1K9ln7J50j87J06J88k8k29K3J38
$$ -44 73 49 -113 -152 73 65 184 -127 118 11 127 2 -59 -30 -33 -90 60 -127 -21 167 139 -90 -67 71
6769G1k0no3R1q0O1k4p2Ro5R7o9j0J1j9m4K91k64L9J04o5n6N9N5j19L5O4j03P
$$ 71 51 46 -17 74 -6 55 31 -41 -32 -97 0 -69 -79 -68 -87 -131 160 -104 -65 39 -26 -82 -23 32 -87 -52 12 -91 -84
6798h4Q9k0Q7k10p6J03K2J07p3J31n4p9J23o1O1p0j63K54j54p3J78p7p0J90J08
$$ -84 5 -15 72 -138 -214 -111 -89 18 -55 76 22 -57 66 5 66 -4 -167 87 -67 -140 38 -39 -109 81 189
6823A89j71N5l8R2l55K75P6j38l7L1j6o4k2K06p6L1O8L4j47J39j11p2O9lK6k1
$$ 189 18 73 35 127 -228 47 123 -15 -52 -21 -37 -101 -123 83 7 38 106 140 -7 132 21 -51 18 15 41 20
6849B0K2Nk6J4J8m7J3L0L4j57q0R2RJ48l1JJ68l53J00J6P5n9N8o8q8K12j14k11
$$ 20 42 47 21 35 53 6 19 49 83 -74 -154 -62 -53 95 64 65 233 -120 -20 -4 71 12 70 2 -86 126 12 -199
6877a99J14J76k05J18PK7P4j79J61o5J1r1R5j50J36p6q2Q7J14N4j10r4J63P0m6
$$ -199 -85 91 -114 4 11 38 112 -67 94 29 40 -51 44 -106 30 -46 -128 -41 73 127 17 -77 86 156 110
6902A10k28J86j83J47J26j36J02j86P3p7N0O3j47J29k36R6JR8k05O1J28K05k07
$$ 110 -118 68 -115 32 158 22 124 -62 11 -66 -16 47 -100 29 -207 -111 -110 -12 -217 -156 -28 177 -30
6925c0J36N9j55p4N0J55j60J21j05j56J89o7l0j00J29J11l4j29M0J49l52J52O6
$$ -30 106 165 10 -64 -14 141 -19 102 -3 -159 30 -37 -67 -167 -38 73 39 -90 -50 99 -253 -101 -35
6948c5j04N1K08l5o8J13j93J54l7R5r6Q1j46j1L9q8K4r6K14j9j25J31M6q5j01
$$ -35 -139 -88 120 85 17 130 -63 91 54 149 53 134 -12 -23 16 -72 -48 -144 70 51 -74 57 103 18 -83
6973h3P7J7j34K39j11J44q2j83K28k10j1K57q5k69k5L88k65J16O9j79Q8R1k18
$$ -83 -6 11 -123 116 5 149 67 -116 112 -98 -109 148 63 -206 -231 157 -108 8 77 -102 -14 77 -141
6996a41K09j31J25lj37J82j27rj4J33J9k09K08J17j77q3p9Q7oQ5q5k4K5kpO1j31
$$ -141 68 -63 62 59 -78 104 -23 -32 -46 87 106 -103 105 222 45 -38 -117 -30 -36 49 -36 -60 -35 -37 -44 17 -114
7023a14J78j30M7J83k1j64j12Q2M6R5r3R2n6k24K13k05J66J12j94n5L51l94L54
$$ -114 64 -66 -19 164 143 -21 -133 -51 -5 90 -3 89 33 -191 22 -183 -17 95 -99 -154 197 -197 157
7046A57J2j80K37k14k1N5oml8R4J9n0j58M9pL2J12Nk15K56j47J5p4J8P8R2k57
$$ 157 169 -11 226 12 -9 46 40 36 -2 92 111 61 -97 -48 -55 -23 89 94 -121 135 -12 3 -71 -53 25 117 -140
7073a40J29j61M1N1O7J13r0K4q6K1j8ql6j8J44j41O9j1L8%np8K8J68m9j9K6N3
$$ -140 -11 -172 -131 -80 -13 100 10 34 -52 -31 -49 -57 -93 -111 33 -108 -39 -50 -12 -12 -17 -95 -67 101 52 33 59 112
7101A12j84MQ6l1j7n4Q9J32q6l0r2RL6m5L3k3m8J34j54N3j47K22n6K8J4J16K3
$$ 112 -72 -68 18 -13 -30 -84 5 137 51 21 -71 -62 -26 -71 -38 -61 -109 25 -129 -76 -223 -1 -57 -29 -15 101 124
7128A24j73J00N2j23r2Q2N9j24l3J14m4R1Oj75J47O7j12O6%j96R8N4K0j09J21
$$ 124 -49 51 103 -20 -112 -30 29 -95 -128 -14 -58 33 39 -136 11 78 -34 32 32 -164 -66 -12 8 -101 20
7153B0r6J34Jp8n0J42j11M3kP3q9q6J94k25P3r5K61l4l6k1J10l4j52J39j50P0
$$ 20 -76 58 59 -19 -69 73 -38 5 3 76 -13 -99 95 -130 -57 -152 109 75 39 18 128 94 -58 81 -69 1
7179AK29k54o0L8K67j24n9J2K7J4j05O8m0j43J55j19K13l9P9j43N5j44K9j2J41
$$ 1 230 -24 -84 -46 221 97 38 50 77 91 -14 54 14 -129 26 -93 120 81 160 17 72 -72 -43 -55 86
7204H6o2j57R3O3j89J70J02j12O6j45N3j19L29p4L5k03m5J96r1q5N8K01k75l1
$$ 86 24 -133 -40 23 -166 4 106 -6 60 -85 -32 -151 178 104 139 -64 -109 87 -4 -89 -31 170 -105 -136
7228a36J05J22j66J51k5k15K96m5n3J56m4k63M8J53q4%N8N1p4j2M4n0J21k45K5
$$ -136 -31 91 -75 76 51 -164 132 87 34 190 146 -117 -69 84 0 0 58 109 35 23 67 17 138 -107 -82
7253h2P4k5Rm5J04M7j22r7Q2J64j03O9M7j66J70j00M4j11j75K84j84K82j02r8
$$ -82 -8 -33 -24 -69 35 82 -40 -137 -55 109 6 75 122 -44 126 26 70 -41 -216 68 -116 166 64 -34
7277c4RR2l3j53K70j35L6Mj06qQj47K99n4JJ56l20K11J9p0j90J52mm5J25k31J86
$$ -34 -25 67 34 -119 151 16 52 56 -50 -58 -50 -197 102 48 49 205 -115 96 115 45 -145 7 3 -42 83 -148 38
7304C8k49J30K57k04p4K91k13K93k73j01J84j30kjj43K23k0J39k01n6K65j03r
$$ 38 -211 -81 176 -28 -102 189 -24 269 -4 -105 79 -51 -53 -54 -197 26 6 145 -56 -112 153 50 41
7327D1j88K33j88k2J32j08j0K46k91J56M3j31J79j02O1J42p3k49m2L80j11nJ15
$$ 41 -147 86 -102 -124 8 -100 -110 136 -155 1 44 -87 92 -10 51 193 120 -129 -171 209 98 93 208
7350B08l39K47j29m6N0J03l3J23j52q3Q1K9l50L30O5j98L4Q2l1o1q5K15j18J18
$$ 208 -131 116 -13 -59 -9 94 61 184 32 -51 30 59 -291 39 104 -94 -60 22 -9 -70 -155 60 -58 60
7374F0n9p8J25N0Rk36J21L4K6n3p8K41k18j48J58N3M4r2j26K5J88K0p4J60k09
$$ 60 1 -77 48 98 107 -129 -8 26 52 -1 -79 162 -56 -204 -46 7 51 -41 -167 -142 46 66 -8 152 -57
7399e7pR0o7j00J26j65J94j65J09RJ44j17N4q7K4n8J51p9j43L41o2l5n6q2J23
$$ -57 -64 26 -41 -141 -15 -180 14 -151 -42 -33 111 -6 48 -39 -15 -73 78 -1 -144 197 135 100 44 -38 85
7424H5j94N6o3J13J39j90N6P8o0J09j40J56k50M4q9K26k23Q4J00j34m2J81j35
$$ 85 -109 -53 -116 -3 136 -54 2 80 20 129 -11 145 -105 -61 -150 76 -147 -63 37 -97 -139 42 -93
7447i3N2K21j04j6n8J86k00K7j41J46L4m3J16k04Q8rj82K33n4J10m2M5N8j76l9
$$ -93 -41 180 76 60 2 188 -12 15 -126 20 54 11 127 -77 11 2 -180 53 -1 109 67 112 170 -6 -45
7472d5m2O3p6J08j35J82J91k51jj52K40j45J83j99L0J82k72P7M5ROoQ5n9n2j1
$$ -45 -87 -24 -100 8 -127 55 246 -5 -6 -158 82 -63 120 -79 -49 133 -139 -62 -17 -8 -2 -8 77 18 -34 -45
7498d5qrJ2o0K96k13J16p2q5j06O2J83l24K88j06rJ51n3P2k6j40J19j36pK6K68
$$ -45 -53 -62 -50 -110 186 -27 89 17 -68 -174 -112 71 -253 35 -71 -80 71 18 90 64 -76 43 -93 -100 -74 194
7524A94p1p6l5rk8M7j06J6J7r1M01k19l27L38j51J17O5l3q4k03J60J96j94J10
$$ 194 123 47 12 3 -25 22 -84 -68 -51 -142 259 40 -287 51 -100 17 82 49 -35 -238 -78 118 -76 34
7548C4k0jj35J71N9m7O5o7o4P0n9m3j3M7p5J13J68l81M05k15mj01J76p3o1K2j26
$$ 34 14 13 -122 49 108 61 126 59 -5 65 6 -37 -50 -3 -78 35 203 -178 227 12 8 -93 83 10 -51 -29 -155
7575a55K54%k6j79pKJ21M0l1M3kj05N8k5r2J65j06J22q9M4N6j19J0j66L57j47
$$ -155 99 99 73 -106 -113 -111 10 50 19 62 60 -45 13 -12 -104 61 -45 77 -12 32 88 -31 -21 -187 170 23
7601B3q2Q3J87k71J03o4L4r0J08R5j72N6j5J1O3k89K45j76J92K6j80P4K1p8R6
$$ 23 -59 24 211 -60 43 -21 13 -77 31 126 -46 10 -5 6 69 -220 25 -151 41 67 -113 -39 -18 -96 0
7626@j33L6J8O5j03J57K3j80K5K02N9l48R5L54j76K5j88R2l2p2M6N1p3J04l9Q3
$$ 0 -133 -97 -79 -14 -117 40 63 -117 -92 110 169 -179 -84 270 94 119 -69 23 -9 -81 -35 16 -57 47 8 91
7652I1j58M6J3L1j18J4K41j56J6pJ0j93K04K2r2P6q7k5J41k09J45k44J77J14J67
$$ 91 -67 -21 -8 23 -95 -81 160 4 20 13 23 -170 34 56 -36 40 -47 -72 69 -140 5 -239 -62 52 219
7677B19k24P2j23OQ6j01L4rJ05j81L2J12k64K11K6l8L3n7N2J6o1PL5q0K3m9o1
$$ 219 -5 67 -56 -50 36 -65 -31 -40 65 -116 -84 28 -236 -25 1 -37 -4 -61 -9 7 -54 -47 -12 -92 -69 -118 -179
7704a79J57R3j12K7J10o2j24J26j3J2O9p0k3M5j20J63k42J13L7N2K8q5k1J38q4
$$ -179 -22 71 -41 -14 96 34 -90 36 23 35 104 34 11 56 -64 99 -143 -30 7 59 87 2 -19 119 35
7729C5j62J9OK59m6j57O9m9J86j01k66L20k00J22lQ3p8R1n5q2o3m3L2K4R0J07
$$ 35 -127 -108 -102 157 111 -46 23 -26 160 59 -207 113 -87 35 32 115 37 128 73 -9 -72 -115 -83 -59 31 138
7755A38p5j05J0%J16L7k5j80O3L4P5l5L3Oq7q2N1J19j26K9Q3l4j0r9q0R8J04k0
$$ 138 63 -42 -32 -32 84 121 96 -84 -21 13 88 53 86 92 5 -77 -26 93 -33 -4 79 45 35 -64 -144 -46 58 38
7783C8K8o4q1R8mlj25J45q1J73j05J08l7j18k4J07JJ0j55J17oJ3JJ23q3q2n6j5
$$ 38 66 2 -79 19 15 12 -113 32 -49 124 19 127 90 -28 -52 55 56 66 -89 28 22 35 36 159 76 -6 -62 -77
7811g7J5j81K41n8N6j1R4j46O7L1j2L6J20k97K29ml7j1j4j79J46P3q2J10r0l8
$$ -77 -62 -243 -2 -60 -4 -15 79 -67 0 31 19 55 175 -122 107 103 66 55 41 -138 8 81 -1 109 19 -19
7837a9J33j27J4J95j80j3J14k54J43pj06L1J43n6o1J68k71R5p0K68l32J46N4l
$$ -19 114 -13 1 196 16 3 117 -137 6 -1 -107 -76 67 11 -50 118 -153 -58 -128 140 -192 -46 8 5
7861Em7r7J48N6K0r2O6j71K0J74qj88J38J08q1j27J88j43K09l26K20j12R7mr5
$$ 5 -42 -139 9 65 85 -7 59 -112 -92 82 74 -114 24 132 51 -76 112 -31 178 -148 72 -40 57 53 -42
7886d2J51l1j13oJ47j13p1J07j34QJ90j55N7p1%Q3K1M0N1q3P0j31O3p5J71j81
$$ -42 109 78 -35 -41 106 -7 -78 29 -105 -97 93 -62 -5 -76 -76 7 28 68 119 36 106 -25 38 -37 134 -47
7912d7J01j08J36M0k14J60k27K17j20K14j19n8o9R4o7j6Q0n0J54j5k2P6k9j0p5
$$ -47 54 -54 82 122 -92 68 -159 58 -62 152 33 -25 -94 0 -67 -83 -3 -53 101 86 64 140 111 101 26
7937B6k2l4o0J05J13k06K23j99n9K55j46J55k93L1n5K70oR5k00o9J39K8Lo6R9
$$ 26 4 -30 -90 15 128 -78 145 -54 -113 142 -4 151 -142 -111 -166 104 98 193 -7 -76 63 91 94 28 127
7962A27q1k12J32K1J87k24Q6L9m4J66j65lo3M1M7l4p7p1J54J8R4L2k02P3R0m7
$$ 127 46 -166 -34 -13 174 -50 36 75 31 197 32 29 -34 7 54 20 -57 -128 26 44 138 170 -32 41 131 84
7988H4R4k59m9L3L1J75k43J34k3j4J40j96K04j06j7O4J44j46j19K2P9m9r7K48
$$ 84 178 -81 -130 -97 -66 109 -134 0 -23 -37 103 -93 111 5 -12 52 196 50 -69 -47 32 -17 -114 134
8012A34k64J19J33n9j03K5M6J5r9J21K8k20K03k6r1M1R4k4j84K68j34n0J6P4q2
$$ 134 -130 -11 122 63 -40 -15 31 46 -53 68 96 -124 79 53 -38 3 97 73 -111 157 23 -27 -11 63 -19
8037a9j38J37k8o4RM7J33M5l02J74N0j4J54k41P9J08m6j14J11k41K57m0m3Np7
$$ -19 -157 -20 -48 -112 -103 -56 77 122 -180 -6 44 30 184 -57 22 130 84 -30 81 -160 97 57 14 19 -58
8062e8L8R2q7k9NJ4L2ql9R1NK5Ol01J69lr6K19m2l3j70P7J63Oj4Q3j40RJ17Rq5
$$ -58 -20 72 -15 -44 -39 -25 7 -1 -40 51 56 81 87 -214 -45 -48 -144 75 33 0 -170 -93 70 76 62 145 5 14 131 140 55
8093E5P0k19Q9P2l6k07J09M5J58r4j25J08j40J8J2N9k2O5m3m3J28Pj1j93J24J68
$$ 55 125 -94 -5 67 31 -176 -67 -22 136 42 -83 25 -115 -97 -85 -26 -48 17 -26 -69 59 66 55 -138 -14 154
8119A54j16j50n0J79qj01J57q8J7rm6N6j90L1J83p3R8k3%j05L0J63j62o5K3Q9
$$ 154 38 -112 -162 17 9 -92 65 -23 -6 -15 -61 -5 -195 -164 19 -54 44 21 21 -84 -54 109 -53 -118 -95 -6
8145f%K39l53P2K40l02J43r0J74j20K7J5L9L5j34m4PJ10k9P3o7J10m7r4Q2j40
$$ -6 -6 233 -120 -48 192 -110 33 -57 117 -3 24 39 78 113 -21 -65 -58 52 23 96 29 139 92 -2 80 -60
8171f0J58k2j00J13j63J2J36j5m5n6J88k27K32j45K6k54J21Q3j41J86
$$ -60 98 76 -24 89 -74 -62 74 59 14 -42 146 -81 151 6 32 -222 -101 -18 -159 27
8191B7
$$ Imaginary data points
##PAGE= N=2
##DATA TABLE= (X++(I..I)), XYDATA
0@%%%%%%%qJ6j6J6k4L2l3M1n6P2q8J04j28J60j92K24k64L12l61M18m87N64o47
$$ 0 0 0 0 0 0 0 0 -8 8 -8 8 -16 16 -17 24 -32 40 -48 56 -72 88 -104 120 -144 168 -193 225 -262 302 -345
30c45P43q51R65j093J236j395J572j761J969k202K453k727L028l353L711m105
$$ -345 398 -453 512 -581 655 -740 832 -929 1040 -1162 1291 -1436 1592 -1761 1950 -2155
46b155M531m996N507o068O688p368Q115q948R883j0933J2119j3473J5041j6875
$$ -2155 2376 -2620 2887 -3181 3507 -3861 4254 -4694 5189 -5744 6375 -7098 7943 -8932
60h932J9052k1697K4986k9201L4825m2749N4827p5667J21309l94060K77401O12240
$$ -8932 10120 -11577 13409 -15792 19033 -23716 31111 -44556 76753 -317307 -39906 572334
72E72334p86936l8660N61072j95699m29063M56151J27081m39945R3534L69406
$$ 572334 -214602 -253262 307810 112111 -316952 139199 266280 -173665 -80131 289275
82B89275l62016k33911L93965O8198l80885J45620K91313k60158j62787M01855
$$ 289275 -72741 -306652 87313 155511 -225374 -79754 211559 -48599 -211386 190469
92A90469O3869m04562M5168L44003k34039k87831L29462J71779l78169l128L25866
$$ 190469 254338 -150224 -105056 238947 4908 -282923 46539 218318 -159851 -162979 162887
103A62887j93951k13013L85047R7150m05671J07300L45113k91923j92412L57822
$$ 162887 -31064 -244077 140970 238120 -167551 -60251 284862 -7061 -199473 158349
113A58349r2670l88697L38656L08772n03241j46613N54685m3102m72393K50858
$$ 158349 65679 -323018 15638 324410 -178831 -325444 229241 186139 -286254 -35396
123c5396L61631l45092j85037L59440M072l28389Q7450J93031j65536n8773J88061
$$ -35396 326235 -18857 -203894 155546 159618 -168771 -81321 111710 -53826 -112599 75462
134G5462o7902j63232K03766J57536k64535j07894K84293K7804k58138P9316J97595
$$ 75462 7560 -155672 48094 205630 -58905 -166799 117494 145298 -112840 -33524 164071
145A64071j97967j48093K19788K0329k03278J43906J84651k36268r8915K72125
$$ 164071 -33896 -181989 37799 58128 -145150 -1244 183407 -52861 -151776 120349
155A20349n639k21628J17327J13788j97391K749J86994j46949j46270K37723O6241
$$ 120349 114710 -106918 10409 124197 -73194 -70445 116549 -30400 -176670 61053 127294
166A27294k61588L5219K38069r5061j29486J65342K2708k16924L5877K09533p2039
$$ 127294 -134294 -99075 138994 43933 -85553 79789 102497 -114427 -78550 130983 58944
177E8944j73083P2557R4071q3245k3609Q8743k2793n6643Q4067L0093j17163J8722
$$ 58944 -114139 -41582 52489 -30756 -54365 34378 11585 -45058 39009 69102 -48061 -29339
189b9339J34851p7728j42812J06027R6943j30406l2324J28755l7777r4702R6145
$$ -29339 105512 27784 -115028 -9001 87942 -42464 -74788 53967 16190 -78512 17633
200A7633M4926j07302L7257J07991r6073q6336J04257K3432r3173L6904N3801
$$ 17633 62559 -44743 -7486 100505 4432 -81904 22353 45785 -47388 -10484 43317
211D3317q8108j8495J00686r958o3043N5867L0322q2038l92R0211j7920q1315
$$ 43317 -44791 -63286 37400 27442 -35601 20266 50588 -31450 -31842 58369 40449 -40866
223d0866J8447M5495l5038k5480M0506J0013l3901J3302L3850k8213k3023M9191
$$ -40866 -22419 23076 -11962 -37442 3064 13077 -20824 -7522 26328 -1885 -24908 24283
235B4283K1684m7414j1091J9535k5988l342N0170j5322n9930L1177N1818m0110
$$ 24283 45967 -1447 -12538 6997 -18991 -22333 27837 12515 -47415 -16238 35580 -4530
247d530k4861M9825N796l6019J4798J2859k7964R152K1935l8563k2309M3602J7710
$$ -4530 -29391 20434 26230 -9789 5009 17868 -10096 -944 20991 -17572 -39881 3721 21431
260B1431k8212k020J2825o122O682J3277j8456j0847K5009O506k7000j2036J1417
$$ 21431 -6781 -8801 4024 -2098 4584 17861 -595 -11442 13567 20073 -6927 -18963 -7546
273g546P463k694o811l142J0620J4426K533p998p663l374K617O172K763j650k606
$$ -7546 -83 -2777 -9588 -12730 -2110 12316 14849 6851 -812 -4186 -1569 4603 7366 5716 3110
288C110n504r685m452N949J3673P167o173m033M884k346m825N753J114p275K811
$$ 3110 -2394 -12079 -16531 -10582 3091 10258 4085 52 4936 2590 -2235 3518 4632 -2643 168
303A68J312j0424M110J6164j0386j8884J3064J3248j0862O042J9060j5539k0028
$$ 168 1480 -8944 -4834 11330 944 -17940 -4876 8372 -2490 3552 22612 7073 -12955
316a2955J1310q12j4895J7695K0679k1475j5674J8736Q25j6753J2464J4120j5539
$$ -12955 -1645 -2457 -17352 343 21022 -453 -16127 2609 3434 -13319 -855 13265 -2274
329b274J999K0602j5081k4521J6486J3987k1010n243K3569K54j5858Q189N243
$$ -2274 -275 20327 5246 -19275 -2789 11198 -9812 -15055 8514 8768 -7090 1099 6342
342F342j9054L707K5618q103k1095J6676J5473k3558j0356J9989m255j8007J8309
$$ 6342 -12712 -9005 16613 8510 -12585 4091 19564 -3994 -14350 5639 1384 -16623 1686
355A686J5304k3197k111K5928j4259k8223K1521K0367k1224q41K3736j6497k4484
$$ 1686 16990 -6207 -8318 17610 3351 -24872 -3351 17016 -4208 -5049 18687 2190 -22294
368b2294K2380J1398k6722O529L1854j5080k3727J9028P553k3345N951K1374j5642
$$ -22294 86 11484 -15238 -8709 23145 8065 -15662 3366 10919 -12426 -6475 14899 -743
381g43j2935K4745K288l0291N194K5913j4611j7877K3670J1444k1810j39J7489
$$ -743 -13678 11067 13355 -16936 -11742 14171 -440 -18317 5353 16797 -5013 -5152 12337
394A2337j4607j3826K2959N767k4833Q745K3985k2088k0260K7164P588k8726O934
$$ 12337 -2270 -16096 6863 12630 -12203 -3458 20527 -1561 -21821 5343 12931 -15795 -8861
407h861K8173j4674j7476K0347N94k5002J1623K1402j8423p980K4775n091k8414
$$ -8861 19312 4638 -12838 7509 8103 -16899 -5276 16126 -2297 -10277 14498 9407 -19007
420a9007J1680K2411j6570j1810K2019L563k1266K939J3708j0530n908J6040k277
$$ -19007 -7327 15084 -1486 -13296 8723 12286 -8980 -6041 7667 -2863 -8771 7269 4992
433D992j7424J1557J6809j8809j2595K3753M582k5775M862K2863j0920j3022J5470
$$ 4992 -12432 -875 15934 -2875 -15470 8283 12865 -12910 -8048 14815 3895 -9127 6343
446F343j708j8840J2353J4785k0256k667K7752r111l0189J5515K2779j8598q939
$$ 6343 4635 -14205 -1852 12933 -7323 -9990 17762 8651 -21538 -6023 16756 -1842 -10781
459a0781K0603j672j7791P305P975j0886L317J2756j1358j2298J6278Q914j8444
$$ -10781 9822 8150 -9641 -2336 5639 -5247 -1930 10826 -532 -12830 3448 12362 -6082
472f082m736J8335R85j8463J901J6339l223j1019N285M121p052L749O792j0446
$$ -6082 -10818 7517 8502 -9961 -8060 8279 5056 -5963 -678 3443 -3609 140 6932 -3514
486c514k123J6434m901k0395J0139J8094j4481j1627J6502L165j3263N292N143
$$ -3514 -5637 10797 5896 -14499 -4360 13734 -747 -12374 4128 7293 -5970 -678 4465
499D465j0884N139J3607j3526j1663J8467O606k0630k477J8479r14j2709K670
$$ 4465 -6419 -1280 12327 -1199 -12862 5605 12211 -8419 -10896 7583 6669 -6040 -3370
512c370O768k979r24K278l298m47O730q86j1094O56J3485j744j4670N354J4807
$$ -3370 3398 419 -505 1773 -1525 -1972 4758 3872 -7222 -6566 6919 5175 -9495 -4141 10666
527A0666q467j2854J0580R664r805m002O957k010l050M970m276n491J0635L526
$$ 10666 2199 -10655 -75 9589 -216 -4218 2739 729 -2321 2649 -1627 -7118 3517 7043
541G043j4598q17J5464N2j1472J586O818j703k393q98k073L345O158n482j0133
$$ 7043 -7555 -8372 7092 7144 -4328 -2742 4076 2373 -20 -918 -2991 354 6512 1030 -9103
556i103M489J1022k407j0288K843J0781k619j0726K330P622k155k074J075l450
$$ -9103 -4614 6408 4001 -6287 -3444 7337 4718 -6008 -3678 3944 1789 -285 790 -2660
570b660m9O858l562q573Q881R389j2030o912J3804K171j2844J800R421l783n960
$$ -2660 -2709 4149 587 -7986 895 10284 -1746 -8658 5146 7317 -5527 -3727 5694 1911 -4049
585d049Q64R25K046L975k449n262L368M096l531k607M546M700l274p977j903O919
$$ -4049 -3185 -2260 -214 3761 1312 -3950 -582 3514 -17 -2624 1922 6622 3348 -4629 -6532 387
601C87L106l660l56M65k457J032J856k289M089O259q013r173Q518P081q881j877
$$ 387 3493 -167 -523 -58 -2515 -1483 373 -1916 2173 8432 419 -8754 -236 6845 -2036 -3913
617c913P904k974o034L734R36r86P261o92j1835K514J1605m816r314O140O550
$$ -3913 3991 1017 -5017 -1283 -347 -1333 5928 5236 -6599 -4085 7520 2704 -6610 -470 6080
632F080o004n641J865L062K547N73k254q06J347k55k99O56N48J496k226n257Q38
$$ 6080 76 -5565 -3700 -638 1909 2482 228 -578 769 514 215 871 1419 2915 689 -4568 -3730
649c730M733k289p53N272j275o689L015N552k649N0K912n128l110P103j352q290
$$ -3730 1003 -1286 -2039 3233 1958 -4731 -1716 3836 1187 1237 4149 -979 -4089 3014 1662 -6628
665f628M767P199n691m172M647O69j179L337q31m041L369K393o813k486O526K391
$$ -6628 -1861 5338 -353 -4525 122 791 -388 2949 2118 -1923 1446 3839 -2974 -5460 1066 3457
681C457m071j888J196J09k27K308L735j7m583k580J245J079J379J900k878m329
$$ 3457 -614 -2502 -1306 -1197 -1424 884 4619 4602 19 -2561 -1316 -237 1142 3042 164 -4165
697d165J466R65j913M303O214m348n836K641J599q24M040L41p378j692M496r51
$$ -4165 -2699 -1734 -3647 656 6870 2522 -3314 -673 926 102 4142 4483 -2895 -4587 -91 -1042
713a042j929L986J430l925j60J967p95J394L396j146m029r26J49M90J287k05j084
$$ -1042 -2971 1015 2445 -1480 -1640 327 -468 926 4322 3176 -853 -1779 -1630 -1140 147 -58 -1142
730a142QJ033N23m85j027J896L524j858l983J02J908r02l39N32k053J67L182o15
$$ -1142 -1134 -101 422 -63 -1090 806 4330 2472 -1511 -1409 499 -403 -742 -210 -2263 -2096 1086 471
748D71k212K234K414j259l86k56k277O03L447k014m273J110K169p43l11Q46j05
$$ 471 -1741 493 2907 1648 1262 1006 -1271 -668 2779 765 -3508 -2398 -229 -972 -1283 -437 -542
765e42J964J950k492k427J255J759K31k91k011k182J138J708j056r0J584P13m70
$$ -542 1422 3372 880 -1547 -292 1467 1698 1407 -604 -2786 -1648 60 -996 -1086 498 1211 741
782G41l34j060O03K570K46l225k402L62K368J707j206k270J4K149J149k60l09
$$ 741 407 -653 -50 2520 2766 -459 -2861 -2499 -131 1576 370 -1900 -1886 263 1412 1152 843
799H43n0J010o3l369j302L724J433l302j001J00k30K677K724k336k521K114J293
$$ 843 793 1803 1740 -1629 -2931 793 2226 -1076 -2077 -1977 -2207 470 3194 858 -1663 451 1744
816A744j237N09O31k526k45J783k134j763L527K258k947j701J135J188J661J265
$$ 1744 507 1016 1647 -879 -1124 659 -1475 -3238 289 2547 -400 -2101 -966 222 1883 3148
832C148j905l160L3K758j82j302J62R42j175p31Q05N96J23K108R24m269k096M117
$$ 3148 1243 -1917 -1884 874 692 -610 -448 494 -681 -1412 -607 -11 112 2220 3144 -1125 -3221 896
850H96J872k643j060j53j776J467L729j651l100L029K563l993j422L689R63j493
$$ 896 2768 125 -935 -1088 -2864 -1397 2332 681 -2419 610 3173 -820 -2242 1447 2410 917
866I17O09k159l435K820L932k902k665K624J635j936O35J153j860j9L100p46l649
$$ 917 1526 -633 -4068 -1248 2684 -218 -2883 -259 1376 -560 75 1228 -632 -651 2449 1703 -1946
883a946L08L153n82k339k81Q72Q49J498O33l572r09M270R96m835p06M018k70j995
$$ -1946 -1638 1515 933 -1406 -1687 -815 34 1532 2165 -1407 -2316 1954 2950 -1885 -2591 1427 1157 -838
901h38O88K33j797J392J810k488p13M330L68l951O99J316k686m96M156k04l923
$$ -838 -150 83 -1714 -322 1488 -1000 -1713 2617 2985 -966 -267 1049 -1637 -2133 2023 1819 -2104
918b104N45K095r90n92J845p31p52K620K12m181O87M058p05m826J34L463K23p03
$$ -2104 -1559 536 -454 -1046 799 68 -684 1936 2148 -2033 -1346 2712 2007 -2819 -2685 778 1001 298
936B98M78j355j644K529J302k532M01L176j466l391J921J487l041O31L457j580
$$ 298 776 -579 -2223 306 1608 -924 -523 2653 1187 -2204 -283 1204 -1837 -1206 2251 671
952F71k972K324K181j574r23j70j104J629L407j967m730J622L635k190k975J783
$$ 671 -2301 23 2204 630 -293 -463 -1567 62 3469 1502 -3228 -1606 2029 -161 -3136 -1353
968a353L521J02k298j209J50J466J966j418l169J242L431j812k945K087J879k670
$$ -1353 2168 2270 -28 -1237 -1087 379 2345 927 -2242 -1000 2431 619 -2326 -239 1640 -1030
984a030j073K751J35j111J730J28k821J53J658j710R21L525k267m304K266L074
$$ -1030 -2103 648 783 -328 1402 1530 -1291 -1138 520 -1190 -269 3256 989 -3315 -1049 2025
1000B025k663j294K730Q27j383j28r30o91K420R63l413q08L350R01k422o54J445
$$ 2025 -638 -1932 798 1625 242 114 -816 -1507 913 1876 -1537 -2345 1005 1906 -516 -1170 275
1017B75L07q82m72J272O84p89o86K99O5j00o95p30J186K152o55l189J042K992
$$ 275 582 -300 -772 500 1184 395 -291 8 73 -27 -722 -1452 -266 1886 1231 -1958 -916 2076
1035B076j595k557J761J976o08q24q75r77J844J609k581j106L159L62l052k02
$$ 2076 481 -2076 -315 1661 1053 229 -646 -1623 221 1830 -751 -1857 1302 1664 -1388 -1590
1051a590K078J29m95Lr96J73J558k10j443Q45M25j078m51J621M46q82p09O11O21
$$ -1590 488 617 122 125 -871 -698 860 650 -793 52 477 -601 -1052 569 1015 133 -576 35 656
1070F56q46j277R83J749j41j558j177M57J735M09j255l56J503J32j794m40K125
$$ 656 -190 -1467 -484 1265 1124 -434 -1611 -1154 581 990 -265 -621 882 1014 -780 -1220 905
1087I05M14j573n81K47Q29N76j091q61J207J001j047r47J046K58j64m30r9K98
$$ 905 1319 -254 -835 -588 241 817 -274 -1135 72 1073 26 -921 125 383 219 -211 -310 -12
1105a2N20m16o77R62R2r13k27R78M69k76r59m52J303N55r28r31M90N68q6r9O9
$$ -12 508 92 -585 377 469 -444 -671 307 776 500 -459 -911 392 947 19 -912 -422 146 60 -39 30
1126C0P3J11k66l34Q31N99q54o48Q96l31p45J25L25M76M87o73j050L21J126n25
$$ 30 103 214 -52 -386 445 1044 190 -458 438 107 -638 -513 -188 288 775 102 -948 -627 499 -26
1146b6k02Q18q1r91L89L55m51M53q1q77K90J333n78j094O24O97p53o7K86k91M87
$$ -26 -228 590 509 -482 -93 262 -189 264 183 -694 -404 929 351 -743 -119 578 -175 -242 44 -247 240
1167B40K60l51n12r7J54o9P29M05k32k22p79L5O23j91l39P73L01j040j42M96m51
$$ 240 500 149 -363 -460 -306 -375 354 759 527 305 -474 -439 184 -7 -346 427 728 -312 -454 42 -409
1188d09JR87k23o42P37r0r24O67O44j146o37J191L70n35M86q6j324N27P88n21
$$ -409 -408 579 356 -286 451 361 -563 104 748 -398 -1035 156 526 -9 477 391 -933 -406 382 -139
1208a39l01J005J76m30l46m90l09L93Q76K67k04m43l23j04j01L89N51jn83j40
$$ -139 -440 565 741 311 -35 -525 -834 -441 435 702 498 55 -268 -372 -473 -84 467 466 -117 -257
1228b57K35l11M75K53q73n24J115J18n11O19M21p25q43P01j12J26J232J6j573
$$ -257 -22 -333 142 395 -478 -1002 113 231 -280 339 760 35 -808 -107 -219 -93 1139 1155 -418
1247d18j88K83p1J97P22p2o19N43p1o32l66Q51J60k50R5n3j91j85J23o5P5r4J61
$$ -418 -606 -323 -394 -197 525 453 -166 377 306 -326 -692 159 319 69 164 111 -80 -265 -142 -207 -132 -226 -65
1270f5J29r0O38K42j033o66N87L14k06M01M54p58l77K68l83r7J400K31j026Q9
$$ -65 64 -26 612 854 -179 -845 -258 56 -150 251 705 -53 -430 -162 -545 -642 758 989 -37 52
1290E2K50m58k74L53R7j69P06k63q45J49O19k42k79K26K77J36j11J0m41K63M4
$$ 52 302 -156 -430 -77 20 -149 557 294 -551 -402 217 -25 -304 -78 199 335 224 234 -207 56 100
1311A00r1k36k79M70M70m2m00k36K4j91N22M88j17k14n6p64m67P73P72l91P0N1
$$ 100 9 -227 -506 -36 434 392 -8 -244 -220 -411 111 599 482 268 212 -552 -1019 -246 526 135 205 256
1333B56l36%L23l58k04P38l2q02j35P17ok43r5k33J22L32K15k11k4M14n20j71
$$ 256 -80 -80 243 -115 -319 419 387 -415 -550 167 161 -82 -177 -410 -288 44 259 48 24 438 -82 -253
1355b53J61R9L41j17l06j76R1o5K66J08l56K96N41k85o56J67M20j19j82l6q8k1
$$ -253 -92 7 348 231 -75 -251 -160 -225 41 149 -207 89 630 345 -311 -144 276 157 -25 -61 -149 -170
1377a70M77m95o96Q24O49n39k36K67J2n2J7k63qN62R1j089RO27M73l78j92l04
$$ -170 307 -188 -884 -60 589 50 -186 81 93 41 58 -205 -213 349 440 -649 -640 -13 460 82 -110 -414
1399d14K43N19j27l07L71j9m06m00L01K54L82j48p75N0M11L36M9pj51m59K07R2
$$ -414 -171 348 221 -86 285 266 -140 -540 -239 15 397 249 -526 -476 -65 271 320 313 162 -297 -90 2
1421Bl98N00L89n57l78P8L1N14L64l19q15M21O97m6p93K21J69l38P6l13L49P19
$$ 2 -396 104 493 -64 -442 -364 -333 181 545 226 -589 -168 529 483 -310 -89 80 -258 -182 -495 -146 573
1443E73n5j261j41R53P84l00n52l67M45K06m73m65O49N04m05n90J3J074Jn27n54
$$ 573 518 -743 -884 69 853 553 1 -366 79 285 -188 -653 -4 500 95 -495 -482 592 593 66 -488
1464d88%P66K55k97l76K37M4m03j21k8Q03J36l77j99q4J29J35K19k82n15L13M17
$$ -488 -488 278 533 236 -140 97 141 -262 -383 -411 392 528 151 -48 -132 -3 132 351 69 -446 -133 284
1486B84O1j95k27m68K88K02j27K57M49j9p25l05L14M70J05l01k81J86L56n62k87
$$ 284 345 150 -77 -545 -257 -55 -182 75 524 505 -220 -525 -211 259 364 63 -218 -32 324 -238 -525
1507e25N50M21l1o90k34J075K69q55r92M41Q18P4l27k36L05K65k61r09K85J381
$$ -525 25 446 415 -275 -509 566 835 -20 -1012 -571 247 321 -6 -242 63 328 67 -842 -557 824
1527H24J29j023m12M01K75m2m10l84J88J072m02n12J87K21k04j3O9j68O45M21
$$ 824 953 -70 -482 -81 194 152 -258 -642 -454 618 216 -296 -109 112 -92 -105 -36 -204 441 862
1547H62m64r32m31O42P43J90n73n41L96M65k99m15L37M81j67n97l12Q48Q36o65
$$ 862 398 -534 -965 -323 420 610 37 -504 -108 357 58 -357 -20 461 294 -303 -615 233 1069 404
1567D04j452K09P34O67J36l40m74K49N6r43L4J362J88j131p4K53jK05J78o00K59
$$ 404 -1048 -839 -105 562 698 358 -116 133 189 -754 -720 642 830 -301 -375 -122 -123 82 260 -340 -81
1588h1M61m73k84R55L75j011p15K21N83N50r2q77k78N71K59m16K71K59O9j98l82
$$ -81 380 -93 -377 578 953 -58 -773 -552 31 581 489 -388 -666 -95 164 -252 19 278 347 149 -233
1609b33k44M82N26l22m28k10J17P91R6o05l82M17M27m92r4L06R2L35o19r50K03
$$ -233 -477 5 531 209 -219 -429 -312 479 575 -30 -412 5 432 -60 -154 152 244 579 -40 -990 -787
1630g87J658K19j143p36L63P11N30n94p93K42R83k57r74J99P71k8n70k88R6N77
$$ -787 871 1090 -53 -789 -426 285 815 221 -572 -330 653 396 -578 -379 392 364 -206 -494 -398 179
1650A79M56o79m41J95L82L03j58l16M8L45k62l10K44K96j26l8k12l44O01L72l23
$$ 179 635 -44 -485 -290 92 395 237 -79 -31 314 52 -258 -14 282 156 118 -94 -438 163 535 212
1671B12n36R2Q9L5N65l19l51l8J57j7L61J59l79n24M53K18k49K3QJ3K49k20n21
$$ 212 -324 -232 -143 -108 457 138 -213 -251 -94 -111 250 409 30 -494 -41 177 -72 -49 -41 -28 221 1 -520
1694e20K80O58J52n96m20K3N98N67n59n43L06L57j98j80j23K03L16M9q88j36Q69
$$ -520 -240 418 570 -26 -446 -423 175 742 183 -360 -54 303 105 -75 -198 5 321 370 -518 -654 215
1715B15N19m52p95k1M48O70j15r76J10Q88Mq85j70N16K62L55p58o21O35Q43j84
$$ 215 734 282 -513 -534 -86 584 469 -507 -397 491 495 -390 -560 -44 218 573 -185 -806 -171 672 488
1736D88p68j93M4M94K50j57m36L46J51n56J82J94K47l4Q9m57l00N46K9j99K32
$$ 488 -280 -473 -429 65 315 158 -278 68 219 -337 -155 39 286 252 341 -116 -416 130 159 -40 192
1757A92k01l01L34j94j60M26J20J20n04J33o2N0N38l76m60J25K73k41J04K28j26
$$ 192 -9 -310 24 -170 -330 96 216 336 -168 -35 -97 -47 491 115 -345 -220 53 -188 -84 144 18
1778A8mJ81l21q6K32j79J28L38j46o73j23O36J27r8k5j68J73J84l28j79N23L05
$$ 18 14 195 -126 -212 20 -159 -31 307 161 -512 -635 1 128 30 5 -163 10 194 -134 -313 210 515
1800E15k56o67J00LM20K74j86l94J97k02l6J83K94J05r7l94m47M30K77K23k41
$$ 515 259 -408 -308 -305 115 389 203 -191 6 -196 -232 -49 245 350 253 -141 -588 -158 119 342 101
1821A01l3l87j7L95r2j05K88M6k90j67L2K66K77K26l70o70J07N71j29j65L40N7
$$ 101 68 -319 -336 59 -33 -138 150 196 -94 -261 -229 37 314 540 170 -500 -393 178 49 -116 224 281
1843B81k20j14m24J17O78J34o70p1M5k2L84J78j90J38l50j11K74L17j32q7j23
$$ 281 61 -53 -477 -360 318 452 -218 -289 -244 -266 118 296 106 244 -106 -217 57 374 242 155 32
1864C2k67j72K37K79l0k2k50k25L72K93j37j24K63j06l60l2J08R1J8K31l48NL45
$$ 32 -235 -407 -170 109 79 57 -193 -418 -46 247 110 -14 249 143 -217 -249 -141 -50 -32 199 -149 -144 201
1887B01k03l38J92K90p4K9q5l53K83j1j31K35k2l22L20K6RJ89l4l90p9J96m4m0
$$ 201 -2 -340 -148 142 68 97 12 -341 -58 -69 -200 35 13 -309 11 37 46 235 201 -189 -268 -72 -116 -156
1911a56K26J53l95m47M87J35J83o9j2j36M64j83n18K86L93m89l31L11o1P8k9q0
$$ -156 70 223 -172 -619 -132 3 186 117 105 -31 433 250 -268 18 411 -78 -409 -98 -159 -81 -110 -190
1933a90k1K83J52l33K9M73j29l55J02O1l09Q1J49Q8K91j73o51K73N55m8l02j61
$$ -190 -211 72 224 -109 -80 393 264 -91 11 72 -237 -156 -7 81 372 199 -452 -179 376 328 26 -135
1955a35J75J43j10l84J3N22k1n44J3O07M5k71J00j46lL46j84k97Q2Pm05K53K73
$$ -135 40 183 73 -311 -298 224 203 -341 -328 279 324 53 153 7 4 350 166 -131 -49 -42 -447 -194 79
1978G9j02m20N20J22k45J50k26J89K53P5r37L08N95n4n50j32K55M31p6m06j10
$$ 79 -23 -443 77 199 -46 104 -122 67 320 395 -542 -234 361 307 -243 -375 -120 311 235 -171 -281
1999b81N04K50m66k80M55Q2q3l60k13L88N9R6l44K10L18l74j04K41J4j16J15j11
$$ -281 223 473 7 -273 182 264 181 -179 -392 -4 55 151 -193 17 335 -39 -143 98 112 -4 111 0
2021@j59P6j79k68M69J94k90k33O29L46l24l52j50M24P0j82l01K36L47l74j74
$$ 0 -159 -83 -262 -530 -61 133 -157 -390 239 585 261 -91 -241 183 253 71 -230 6 353 -21 -195
2042a95K61o4J12p1O6l1K59l65k07J83P0k3p1J31K10m17R8q1J96K81m00q6L08
$$ -195 66 2 114 43 109 78 337 -28 -235 -52 18 -5 -76 55 265 -152 -54 -135 61 342 -58 -144 164
2065A64M14m85l71j98L92J52L7n49L18M55l50j01K2Q6M99r4l28p5R6J79l12j78
$$ 164 578 93 -278 -476 -84 68 105 -444 -126 329 -21 -122 -100 -14 485 391 63 -12 84 263 -49 -227
2087b27P0q5RL58M8j84j33J00q1M22J0k44K32j33m49j09J38M01n4o4p9r4M38L1
$$ -227 -157 -242 -233 125 173 -11 -144 -44 -125 297 307 63 295 162 -287 -396 -258 143 89 25 -54 -148 290 321
2111C21p19J61J13l8K91J06k63Q4o2l22%M05Q0J0LJ2k88Q2J65k77R0L7j99qL26
$$ 321 -398 -237 -124 -162 129 235 -28 56 -6 -328 -328 77 157 167 170 182 -106 -24 141 -136 -46 -9 -208 -216 110
2136A10N9p09K04L09J40m9K35j02j35K1n13j2M33L28pl24l2l71L24J32Mj22L06
$$ 110 169 -540 -336 -27 113 64 299 197 62 83 -430 -442 -9 319 312 -12 -44 -415 -91 41 45 -77 229
2159B29j47k02J63J01o5Q1k96l00L17K43r7K13O3p57O2L39K82r2J51Po03jj3J11
$$ 229 82 -120 43 144 79 160 -136 -436 -119 124 27 240 303 -454 -392 -53 229 137 288 295 -308 -309 -322 -211
2183b11R9M09k29k21R4J88L1j11j07j68%O88k49k98k20o5Q3J42n2L10J34j01m09
$$ -211 -112 297 68 -153 -59 129 160 49 -58 -226 -226 462 213 -85 -305 -370 -287 -145 -197 113 247 146 -263
2206b63J21K14r9R8jj33j83K62l2J78k11k30q1N48K66k89j83k0o4k10J47J79K02
$$ -263 -142 72 -27 71 70 -63 -246 16 -16 162 -49 -279 -360 188 454 165 -18 -38 -102 -312 -165 14 216
2229B16J33l93l39J86M57o4r2J92j70k75J67m0K89L4k32m18q3O50Ln8m03J70k26
$$ 216 349 -44 -383 -197 260 196 104 296 126 -149 18 -22 267 301 69 -349 -432 218 221 163 -240 -70 -296
2252b96L79j64L75J47m60k68o0L93J28j09l4k75n9L36NK8J13j46k14j9R9J83P6
$$ -296 83 -81 294 441 -19 -287 -347 46 174 65 31 -244 -303 33 38 66 179 33 -181 -200 -101 82 158
2275A58j34j32l4J06n4N40k43k16j05P6J77j04M8k49J06k0j74L02P0P3k87j09
$$ 158 24 -108 -142 -36 -90 450 207 -9 -114 -38 139 35 83 -166 -60 -80 -254 48 118 191 -96 -205
2297b05J3K95n5K09m32P4P1J03j95J73J09k36l13L40m1K61J37m22j89K37j10k6
$$ -205 -192 103 48 257 -175 -101 -30 73 -122 51 160 -76 -389 -49 -90 171 308 -114 -303 -66 -176 -202
2319b02L05N7j01j40J07k44J68K85j6n37K79N8J3N9k10p4k45N46j16r5N3R8K3
$$ -202 103 160 59 -81 26 -218 -50 235 219 -318 -39 19 32 91 -119 -193 -438 108 -8 -103 -50 48 71
2342G1k51l0L04J97Ll31k85K73J50J45l07j92N1L15O9k20J98k21j88j02K48K28
$$ 71 -180 -210 94 291 294 -37 -322 -49 101 246 -61 -253 -202 113 182 -38 160 -61 -249 -351 -103 125
2364A25M34j75n02k18K00R3l5J43L62j38m35K9P5J04J32O7m68o4K40J52P3n2j37
$$ 125 559 384 -118 -336 -136 -43 -78 65 427 289 -146 -117 -42 62 194 261 -207 -271 -31 121 194 142 5
2387Ek95J55N6K45O5K6k81j57n8K36j05L60m8j31j40k1j28J58J69M1K3j81j00
$$ 5 -290 -135 -79 166 231 257 -24 -181 -239 -3 -108 252 204 73 -67 -88 -216 -58 111 152 175 -6 -106
2410a06K25k6j22n8KJ52J56o1k60j8j4J50k03J65J99j7k01j13M3J01J8j96K02
$$ -106 119 93 -29 -87 -85 67 223 162 -98 -116 -130 20 -183 -18 181 164 -37 -150 -107 -6 12 -184 18
2433A8j63N10K11o10j57NJ66P9n3J3J28j21j77j89l2K32L59N6l07L2l54M75P6
$$ 18 -145 365 576 -34 -191 -186 -20 59 6 19 147 26 -151 -340 -372 -140 219 275 -32 0 -354 121 197
2456A97j47l7l3K63n6p5q1l5P9k62j62J46L77l0j17j67Q4j30K6K56O9J59k67j28
$$ 197 50 13 -20 243 187 112 31 -4 75 -187 -349 -203 174 144 27 -140 -56 -186 -160 96 165 324 57 -71
2480g1l32K96N18k91r4j67r8J49m2K69k1j63l35J40L04J98j16k73j69J51J62R6
$$ -71 -403 -107 411 120 26 -141 -239 -90 -132 137 116 -47 -382 -242 62 260 144 -129 -298 -147 15 111
2502A11K7J9J87k99l97M69L2o1Q5k16j28J13K75k42j21j3J16l9L35J20m49j39
$$ 111 138 157 344 45 -352 117 149 88 173 -43 -171 -58 217 -25 -146 -159 -43 -82 253 373 -76 -215
2524b15K10j71J29K35j44j55P0q3n6M57j12k00n32P18K3k5k94r2R1K45m8q8L9
$$ -215 -5 -176 -47 188 44 -111 -41 -124 -180 277 165 -35 -567 151 174 149 -145 -237 -146 99 51 -37 2
2547Bp7J34j53j2M6J29K70k79p8k40J65o4K65n1j90J44j78n4J90k4J23k35K62
$$ 2 -75 59 -94 -106 -60 69 339 60 -18 -258 -93 -157 108 57 -133 11 -167 -221 -31 -55 68 -167 95
2570I5J7j87J45N3j53J19j13j50J38P8L9k6k7N9k26j69N42l7j57l5j61J75M6K29
$$ 95 112 -75 70 123 -30 89 -24 -174 -36 42 81 55 28 87 -139 -308 234 197 40 5 -156 19 65 294
2594B94j79n6j01j2P8k6J51j43o6n1R8K72k63j0R3r2j12Rj8J55J14r7o1L8O7p
$$ 294 115 59 -42 -54 24 -2 149 6 -60 -111 -13 259 -4 -14 79 -13 -125 -116 -134 21 135 38 -23 15 82 75
2620G5nL8k30m6R6J03K4p1p7%J60J1J5Rl3j04O3R5l2J72k57j35K03k15R9M5P8
$$ 75 70 108 -122 -168 -72 31 55 -16 -93 -93 67 78 93 102 69 -35 28 123 91 263 6 -129 74 -141 -42 3 81
2647H1o8q7K1p9p0K35J4j24l3J28m0Q3J04k84L6J69P7j42P8n0k12j24K41m2J69
$$ 81 13 -74 -53 -132 -202 33 47 -77 -110 18 -22 61 165 -119 -83 86 163 21 99 49 -163 -287 -46 -88 81
2672H1K05k45J03m0j79N5j42K82j04O8j17j30N4J89r9j85MM5J14R4m6j01o0K71
$$ 81 286 41 144 104 -75 -20 -162 120 16 84 -33 -163 -109 80 -19 -204 -200 -155 -41 53 7 -94 -154 117
2696A17l11MK62r0J04M9k74j80M68j74P2j6J6j8j25J72q3k04K85o5O8p4rL7j07
$$ 117 -194 -190 72 -18 86 135 -139 -319 149 -25 47 31 47 29 -96 76 -7 -211 74 9 77 3 -6 31 -76
2721g6J23l3j5J82l1k64O4J1P2PP9k46J31l0L9j3J0R7j74R1k3J13O1L3l67J89
$$ -76 47 14 -1 181 150 -114 -50 -39 33 40 119 -127 4 -26 13 0 10 107 -67 24 1 114 175 208 -159 30
2747C0p6k14J11M35l39j7mJ6O6Pm8J05R5o0j84l5J29N8j05K32j69j96J14J88j83
$$ 30 -46 -260 -149 286 -53 -70 -74 -58 8 15 -33 72 167 107 -77 -112 17 75 -30 202 33 -163 -49 139 -44
2772d4J8J7j22J46l9k8J91O0j68j88l2J7L77l0k37K4k3J14J84k76J5J19J3J13
$$ -44 -26 -9 -131 15 -24 -52 139 199 31 -157 -189 -172 205 175 -62 -38 -61 53 237 -39 -24 95 108 221
2796B21m95J08J81M1p5k23J40J44mN4j43P5k7K35k32j8JJ00Q0j57n5j05J57Jp0
$$ 221 -274 -166 15 56 -19 -242 -102 42 38 92 -51 24 -3 232 0 -18 -17 83 163 6 -49 -154 3 4 -66
2821f6N5j71K06O1j50k19L11M1j84j8O4J41j74K00j18j7K79l31l2j8O2P2M4q3
$$ -66 -11 -182 24 85 -65 -284 27 68 -116 -134 -70 71 -103 97 -21 -38 241 -90 -122 -140 -78 -6 38 -45
2845d5l3K6j38J64J14J90k39j37J0J31j31J79k76J65P3k3l06Q8L14k9j84J58k66
$$ -45 -78 -52 -190 -26 88 278 39 -98 -88 43 -88 91 -185 -20 53 30 -276 -188 126 97 -87 71 -195
2868a95J15K09Lj94J6K12o6J03l12Q8q2K29l6k25K78o8j42J46n7j58L50j7j74
$$ -195 -80 129 132 -62 -46 166 100 203 -109 -21 -103 126 90 -135 143 75 -67 79 22 -136 214 197 23
2891B3k91M7L05L6j85j7l6K00j73n0M3L17j42j49n1n2L49j00r9j98Q2K99k15Q2
$$ 23 -268 -221 84 120 -65 -82 -118 82 -91 -141 -98 219 77 -72 -123 -175 174 74 -25 -223 -141 158 -57 25
2915B5O0L2k02q5K12o1P6l6L1j56J68o0K4J92q1j58J95l11K1J18M6j74L8J8j66
$$ 25 85 117 -85 -170 42 -19 57 21 52 -104 64 4 28 220 139 -19 176 -135 -114 4 50 -124 -86 -68 -234
2940b34J30L29j64j25J31n7m9P5J69k65J04l7j48J03O5k32rK60l9J46j81L1j13
$$ -234 -104 225 61 -64 67 10 -39 36 205 -60 44 7 -141 -38 27 -205 -214 46 7 153 -28 3 -110
2963a10J72J13j57Q9k18J66p3j08J89PJ66j56k83N8K76m9j61L5N0pK7L1n2O3m0
$$ -110 62 175 18 107 -111 55 -18 -126 63 70 236 80 -203 -145 131 82 -79 -44 6 -1 26 57 5 68 28
2988B8P2k97J27J13L6q8J61k10K7N3J33N9k41n9Pl6J07l9J01L8k53M5j70L79R3
$$ 28 100 -197 -70 43 79 -9 152 -58 -31 22 155 214 -27 -86 -79 -115 -8 -47 54 92 -161 -116 -286 93 186
3013A86q3j24J40p2k82K32j22J85L1k36m4J96J2p7J11q9n1Rj07K05k9J18j20k79
$$ 186 103 -21 119 47 -235 -3 -125 60 91 -145 -189 7 19 -58 53 -36 -87 -78 -185 20 -9 109 -11 -290
3037b90L40J05j76Q6L2n5j20Q3mk03K50pM5j04j0M4j03l5N1J00J75P1k54n8r0
$$ -290 50 155 -21 65 97 42 -78 5 1 -202 48 41 86 -18 -28 16 -87 -122 -71 29 204 275 21 -37 -127
3062a27J56m9n5P4j67L64k85O8J10j90r0L00j75L1N3Q4k7j7j27M1J62q1k8q5J92
$$ -127 29 -20 -75 -1 -168 196 -89 -21 89 -101 -191 109 -66 -35 18 102 75 58 -69 -28 134 53 25 -60 132
3087A32j37k09O9K02N0k61J71o8Q1j15O9o9L06l3k63R4QL7J60k21k93J95k3K15
$$ 132 -5 -214 -145 57 107 -154 17 -51 30 -85 -16 -85 221 188 -75 19 27 64 224 3 -290 -95 -118 97
3111I7j05J8J56k67J51Qj51N7J09j29l8J69n5J56j27J4m5l2N1J9j72J52q5N4j01
$$ 97 -8 10 166 -101 50 58 -93 -36 73 -56 -94 75 20 176 49 63 18 -14 37 56 -116 36 -49 5 -96
3136i6J37o1N5K4n5L3J13j75J97l13J4P9J3J1RkQ9j12o6J93k50L62k34o0O0J09
$$ -96 41 -20 35 59 4 37 150 -25 172 -141 -127 -48 -35 -24 -15 -17 72 -40 -106 87 -163 199 -35 -95 -35 74
3162G4M9n5j39J25m0J74j82R9R2l45L11q9J22j55%K08k71J11J37l85K21k51K67
$$ 74 123 68 -71 54 14 188 6 105 197 -148 163 74 196 41 41 249 -22 89 226 -159 62 -189 78
3185G8j74N8j08J25M2rko2P9q4J87j61j8m1l0P9J56q7j02j16M0R0rN8J51K9j99
$$ 78 -96 -38 -146 -21 21 12 10 -52 27 -57 130 -31 -49 -90 -120 -41 115 28 -74 -190 -150 -60 -69 -11 140 169 -30
3212c0J24R0l24J65l9k7J8J9j21p7L22j66n2M5N4J0J33j32n7J48j68o3J71rJ13
$$ -30 94 184 -140 25 -14 -41 -23 -4 -125 -202 120 -46 -98 -53 1 11 144 12 -45 103 -65 -128 43 34 147
3237A47k5j69O9m2j7ppJ31n8l5NJ29j49q7J37Ko6O6l8n5Oll8J33O4j7L1j13Lj08
$$ 147 122 -47 22 -20 -37 -44 -51 80 22 -13 -8 121 -28 -115 22 24 -42 24 -14 -69 -63 -66 -104 29 93 76 107 -6 -3 -111
3267a11K68j40L0m2L7r4MN3j29J5Q1m7J42N6l3j20p1O9L9nP0n1J46k81R5k7P0
$$ -111 157 17 47 5 42 -52 -48 5 -124 -109 -28 -75 67 123 90 -30 -101 -32 7 2 72 21 167 -114 -19 -46 24
3294B4N6k17L2J40K0p3R8p0J09q4O2r8P3l7n5j14J45Q0j26Q2l23J02K54Oj30L22
$$ 24 80 -137 -105 35 55 -18 80 10 119 35 97 -1 72 35 -20 -134 11 91 -35 47 -276 -174 80 86 -44 278
3320B78k83p7K03q4Rj52J65m9j86K47j62nJ24o7l7Q8M5K9q7lo1o9L40l09k3j2
$$ 278 -5 -82 121 37 46 -106 59 10 -176 71 -91 -96 28 -39 -76 12 57 86 -1 -4 -65 -134 206 -103 -126 -138
3346a38K79O1k54M6J4j37K27j66p8J39o0k4J33N6J44k31QR1M9k11J7N9k16K81
$$ -138 141 202 -52 -6 8 -129 98 -68 -146 -7 -67 -91 42 98 242 11 19 110 159 -52 -35 24 -192 89
3370H9j06m8K93k86J12j7j86J33l0M7r0R5l3m9J07p7j66J14K52Oj11qj38J25L3
$$ 89 -17 -65 228 -58 54 37 -149 -16 -46 1 -89 6 -27 -76 31 -46 -212 -98 154 160 49 41 -97 28 61
3395F1j55l5K15q0J16k77Q5Q2j08K29j84l3J21J02j07O0j59O2P8q0K6p5M3L4j11
$$ 61 -94 -129 86 6 122 -155 -70 12 -96 133 -51 -84 37 139 32 92 -67 -5 73 -7 19 -56 -13 21 -90
3420i0J54m9j89K52L5n2n2j65J36J38k9p4j6%k8r3R9R5j08J23r9J6l2N8j74Q1
$$ -90 64 15 -174 78 113 61 9 -156 -20 118 89 15 -1 -1 -29 -122 -23 72 -36 87 -12 4 -28 30 -144 -63
3446f3J33j92M8K0Kj22R2K07l24K62j33Mn1N9j8mL09l47N6K7K3q7K43j36j63J02
$$ -63 70 -122 -74 -54 -52 -174 -82 125 -199 63 -70 -66 -117 -58 -76 -80 229 -118 -62 -35 -12 -99 144 8 -155 -53
3472e3J63j03M4q4J36l6pj3k40J78L9o9r5J38n2j84K44m0r1J63k41Q8J24J0jM0
$$ -53 110 7 51 -33 103 67 60 47 -193 -15 24 -45 -140 -2 -54 -238 6 -34 -125 38 -203 -115 9 19 18 58
3498E8p3l5L26l22L0j17J52o6j41J67J2k4L8J8l4r9J39J2k36K21J03j69L9J30
$$ 58 -15 -50 276 -46 -16 -133 19 -47 -188 -21 -9 -33 5 23 -11 -110 29 41 -195 26 129 -40 -1 129
3522A29j49l2j6q5K75j25p8j53L44K9Oj36N6j06l0J29k06l3K68j10J01j44J2P9
$$ 129 -20 -52 -68 -153 122 -3 -81 -234 110 139 145 9 65 -41 -71 58 -148 -181 87 -23 78 -66 -54 25
3546B5q8K92k74K11k48PL5J05N5q7p7j03%J12P6R6j27n3j27K66j8j46M0P4j79
$$ 25 -63 229 -45 166 -82 -75 -40 65 120 33 -44 -147 -147 -35 41 137 10 -43 -170 96 78 -68 -28 46 -133
3571a33J5J63Q5k59K14j68P5k23K71j72R7R8n4k07J11Q9p9J9K13j32R7j95K0J05
$$ -133 -118 45 130 -129 85 -83 -8 -231 40 -132 -35 63 9 -198 -87 2 -77 -58 155 23 120 -75 -55 50
3595E0j3K8l5j5K7J0K0j92O4L5r5J30m5j44J26J14k4j43n0L89l92J68O1l7j41
$$ 50 37 65 30 15 42 52 72 -120 -56 -21 -116 14 -31 -175 -49 65 41 -102 -152 237 -155 13 74 37 -104
3620a04J61q3q0J79J69j97m4j16N2O3J10K6j13k39K35N9q1Q3j29j07K96k20M5
$$ -104 57 -26 -106 73 242 45 1 -115 -63 0 110 136 23 -216 19 78 -3 80 -49 -156 140 -80 -35
3643c5l6J00J53j70R5n0r0R3Mj23k4M3Jm9K10k93J10J71j46N8P5j18J4l9l6J42
$$ -35 -71 29 182 12 107 57 -33 60 64 -59 -83 -40 -39 -88 122 -171 -61 110 -36 22 97 -21 -7 -46 -82 60
3669F0m2J58j06j39Q0J2J4Q9j96J25J67r1j48j15R2j15L54J0m27J73JO1k11K87
$$ 60 18 176 70 -69 11 23 37 126 -70 55 222 131 -17 -132 -40 -155 199 209 -218 -45 -44 17 -194 93
3693I3M8k38K10k56R5P3K4l2O7R4n2j19J11k60R7mL0K37j35j4l6n9J37m2k33J89
$$ 93 141 -97 113 -143 -48 25 49 17 84 178 126 7 118 -142 -45 -49 -19 218 83 69 33 -26 111 69 -164 25
3719B5j96J6J99k6NQ1j72N7q5m2K63j63o3q8J58J0mq0L23j26n5M3n6o7K75l44
$$ 25 -171 -155 44 18 23 104 -68 -11 -96 -138 125 -38 -101 -189 -31 -21 -25 -105 218 92 37 80 24 -43 232 -112
3745a12O2J58o9j0j45J45m7j4p1J76n2j8P4p0k5j05J51K03j57l0j25J09J1L3k9
$$ -112 -50 108 39 29 -116 29 -18 -32 -103 73 21 3 77 7 -18 -123 28 231 74 44 -81 28 39 72 43
3770D3j18j3o4K45m2q1O9j25m5J21j25J35m1J1K1m8m0K64r7q7j22L6L3j3R5p1
$$ 43 -75 -88 -152 93 51 -30 39 -86 -131 -10 -135 0 -41 -30 -9 -57 -97 167 70 -17 -139 -103 -70 -83 12 -59
3796e9n0J24M4j39K09q7j79J89r5K7KJ4J17k25K29j87K88l46l3P3J20o2Q1m5l7
$$ -59 -109 15 59 -80 129 42 -137 52 -43 -16 -14 0 117 -108 121 -66 222 -124 -157 -84 36 -26 55 10 -27
3821b7l4P5Mp5L5j75L79k75J1Q3O9q4l5J22j69R7n8j17K89j54K40j64j6n9k0K1
$$ -27 -61 14 18 -57 -22 -197 182 -93 -82 1 70 -14 -49 73 -96 1 -57 -174 115 -39 201 37 21 -38 -58 -37
3847c7J79k67J39j31J51Nj54J65kj80K71j28P2j02l0p4P0J21j01p9P4%k08K19
$$ -37 142 -125 14 -117 34 39 -115 50 48 -132 139 11 83 -19 -49 -123 -53 68 -33 -112 -38 -38 -246 -27
3871b7L1K6n7K01j59pr3J93j59R9j09J75q1k01Q2rR3n2j34J00j6K16J4q5j47R3
$$ -27 4 30 -27 174 15 8 -85 108 -51 48 -61 114 33 -168 -86 -95 -2 -54 -188 -88 -104 112 126 41 -106 -13
3897a3M5j20J10RJ4k0LL8N9K4j6j79J17l1L1k5r1Lrj34J40Q0l7O0J5j72L10j74
$$ -13 32 -88 22 31 45 25 28 66 125 149 133 -46 71 40 71 46 -45 -42 -51 -185 -45 35 -2 58 73 -99 211 37
3925C7O4jQ1p7j17Mn6K56r7l6r9L8k7L2l6K0n8j00J95R2j12rm8r3J79n4r7K14
$$ 37 101 100 181 104 -13 -9 -65 191 94 58 -41 -3 -30 2 -34 -14 -72 -172 23 115 3 -6 -54 -147 32 -22 -119 95
3953I5l9k32J13R8N2k5j50J99Lp1J47k57Pn9J08j7J47j67J6l6l4Q8n2Q4n9J76
$$ 95 56 -176 -63 35 87 62 -88 111 114 43 190 -67 -60 -119 -11 -28 119 -48 -32 -68 -102 -14 -66 18 -41 135
3979A35j62J28r3o8Q5J10k29p0J42n9K05j56J01r6qN0pJ25p8j04M2j1K50j08r3
$$ 135 -27 101 8 -60 25 135 -94 -164 -22 -81 124 -32 69 -27 -35 15 8 133 55 -49 -7 -18 232 124 31
4004C1m0k5j73K28L7j1O2n8r1P8L6j37J24j64K20j94k3M0K0K4L8p8L2j47K86J09
$$ 31 -9 -34 -207 21 58 47 109 51 -40 38 74 -63 61 -103 117 -77 -100 -60 -40 -16 22 -56 -24 -171 115 224
4030B24j41k6j99K33m1k5q7K05o1O1l3L7k6j12r6nJ50j04J7j4K91l87J86nL5M
$$ 224 83 57 -142 91 50 25 -62 143 82 143 110 147 121 9 -87 -92 58 -46 -29 -43 248 -139 47 42 77 81
4056H1L1j46J5k39K58J21l06K01q8l0O0j3R0p8l5n8J26k5R2q1o0R1o2j23K46p4
$$ 81 112 -34 -19 -258 0 121 -185 16 -72 -102 -42 -55 35 -43 -78 -136 -10 -35 57 -24 -84 7 -55 -178 68 -6
4082fO6j9p4n5K03k17J37%k55K81p0Pq4J92Qj61J92j13k9N1O0k25J38J65k23m8
$$ -6 60 41 -33 -88 115 -102 35 35 -220 61 -9 -2 -86 106 114 -47 145 32 3 54 114 -111 27 192 -31 -79
4108g9R3N0j56j28K44n4P8M4Mj80r5K97k17J19K1l3R4q4l0L1J01j00j21J91j62
$$ -79 14 64 -92 -220 24 -30 48 92 96 -84 -179 118 -99 20 41 8 102 18 -12 19 120 20 -101 90 -72
4133g2J29J00o4j70J4p5Q6K55j78p5mL9l4J22m2j61J67K4j82J50j54J92l1r1J9
$$ -72 57 157 93 -77 -63 -138 -52 203 25 -50 -54 -15 -49 73 31 -130 37 61 -121 29 -125 67 36 -55 -36
4158c6m1J76j43J63j83J5NJ5J93j46l9k6LRl0J17j09q8J38J55k53J99j30M1Q5
$$ -36 -77 99 -44 119 -64 -49 -44 -29 164 18 -21 -47 -44 -35 -65 52 -57 -145 -7 148 -105 94 -36 5 90
4183I0o2J94n8j04j28P1n1N9k18R4J24n4qJ52j20J14R7k20j16l3J02J55j2l5n5
$$ 90 28 222 164 60 -68 3 -48 11 -207 -113 11 -43 -51 101 -19 95 192 -28 -144 -177 -75 80 68 33 -22
4208b2n6P5L0o2nJ44l2l1m1O2k19K49l8Lj39J26n1j25J76j51L7P9M0k09J80K1
$$ -22 -78 -3 27 -35 -40 104 72 41 0 62 -157 92 54 57 -82 44 -7 -132 44 -107 -70 9 49 -160 20 41
4234D1j04QJ67p5J9N2r1q7K10p1p4Nl8o8J06j10J98o1q1m9N0J74p9p4N0J52j13
$$ 41 -63 -55 112 37 56 108 17 -70 140 69 -5 0 -38 -106 0 -110 88 27 -54 -103 -53 121 42 -32 18 170 57
4261E7j2j30P4J18K16k56j86n8J63J95k01J55j76J1R6J6o9k23J48P3p7q4nJ86
$$ 57 45 -85 -11 107 323 67 -119 -177 -14 181 -20 135 -41 -30 66 82 13 -210 -62 11 -66 -150 -155 31
4285C1M9j18k23K80P1j09j58J52J05j38J20j48N0m8jR3j03R5m9j65J17K09k48
$$ 31 80 -38 -261 19 90 -19 -177 -25 80 -58 62 -86 -36 -84 -85 8 -95 0 -49 -214 -97 112 -136
4308a36Q9l2J47mq8N6R9p3j44J73l6j81J82j7R5k26K03m6k5p3Q8l6N4J6q5L7k8
$$ -136 -47 -79 68 64 -24 32 131 58 -86 87 51 -130 52 35 130 -96 107 61 36 -37 51 15 69 85 0 37 9
4335IKlj00Q5o7J64K2j86J14n3P8n6J5K9n6K01k88L2K24k08N5J3O7m1r7K1n0r3
$$ 9 11 8 -92 -7 -74 90 112 -74 40 -13 65 9 24 53 -3 198 -90 -58 166 -42 13 26 93 52 -45 -24 -74 -167
4363a67J71j95J66j46J29j19K42Mj68J1M8J62o4j33Q9j67J47R9j93K31k05rJ64
$$ -167 4 -191 -25 -171 -42 -161 81 85 -83 -72 -24 138 74 -59 30 -137 10 109 -84 147 -58 -67 97
4386I7k97N2K59n3n3O0j63L03j52j27O0Q9o9L7Q1n8k05J62R6l3j01l8L3p4o3J80
$$ 97 -200 -148 111 58 5 65 -98 205 53 -74 -14 75 6 43 124 66 -139 23 119 86 -15 -53 -20 -94 -157 23
4412B3m4j85J78Rq8m5K24k3p0j19JJ09J62j45j04N0J51KL4j26j82M08k09K9q7
$$ 23 -21 -206 -28 -19 -107 -152 72 49 -21 -140 -139 -30 132 -13 -117 -67 84 86 120 -6 -188 220 11 40 -47
4437d7pK35q7j92Q9K32j84J18k02m4N1%O5n9q8P1J67j62J25j00j28K26L5j67J
$$ -47 -54 181 94 -98 -9 223 39 157 -45 -89 -38 -38 27 -32 -120 -49 118 -44 81 -19 -147 79 114 -53 -52
4462e2J23r8J7m9oN7l4m9J97p0M3j2m1m0k7J70p0o3p9P3N5J42j89j65R5R3Nl3
$$ -52 71 -27 -10 -59 -65 -8 -42 -91 106 36 79 67 26 -14 -41 129 59 -4 -83 -10 45 187 -2 -167 -72 21 26 -7
4490gj17l9J39o5L08j54n8p6O4O2r8lRp1O5Q7%J38k39J86j77j08P5J65j36J46
$$ -7 -124 -163 -24 -89 219 65 7 -69 -5 57 -41 -44 -35 -106 -41 46 46 184 -55 131 -46 -154 -79 86 -50 96
4516I6l7j7k40R1J34J9n1K22q6j75M2P1L8k30K87j11j05J15j58J04m1J58M5j92
$$ 96 59 42 -198 -107 27 46 -5 217 131 -44 -2 69 107 -123 164 53 -52 63 -95 9 -32 126 171 -21
4540b1j21O9J75K6M6j43L3j2j00j39K27L1l0L2O6j38k36L60q2j09K00k20N8k1
$$ -21 -142 -73 102 128 174 31 64 52 -48 -187 40 71 41 73 139 1 -235 125 43 -66 134 -86 -28 -49
4564d9r0K91Q9k45l3J09j42m6K87j34M2n1j57k9K12j26j20J00L5MJ00q7J87o5
$$ -49 -139 152 241 -4 -37 72 -70 -116 171 37 79 28 -129 -158 54 -72 -192 -92 -57 -53 47 -40 147 82
4588H2j26J11j53K13k52J06j13K16j84J85p0l4M4J9J35j42J49n2rp4J2n7l1K3
$$ 82 -44 67 -86 127 -125 -19 -132 84 -100 85 15 -19 25 44 179 37 186 134 125 51 63 6 -25 -2
4612bj47J66J43j34J6j47JM9l1O3R0nLJ3j36J06k8P8j86J51j01J21m2j15J68j38
$$ -2 -149 17 160 26 42 -105 -104 -55 -86 -23 67 62 65 78 -58 48 20 98 -88 63 -38 83 41 -74 94 -44
4638d4r2RO4J57j99N6K0%P1j50N8K6K7n0J68k49o5N7K42r5N1r0p6j29K04J69q6
$$ -44 -136 -127 -63 94 -105 -49 -29 -29 42 -108 -50 -24 3 -47 121 -128 -193 -136 106 11 62 -28 -104 -233 -29 140 54
4665E4p2l1j1K31j30l4j10P4m2P3L3N7j43N5j26J35k2p8R3J2j4M3j61K1J17L3
$$ 54 -18 -49 -60 171 41 7 -103 -29 -71 2 35 92 -51 4 -122 13 -9 -87 6 18 4 47 -114 -93 24 57
4691E7L7j53J09k0k3j6j1M5k8JK6J7j53J72J20l11J13J17j25Q3j6k1l1Nq3j6K15
$$ 57 94 -59 50 30 7 -9 -20 25 -3 -2 24 41 -112 60 180 -131 -18 99 -26 57 41 20 -11 -6 -89 -105 110
4718A10j97K78k6j01j47JK09j73J61k27M9J08j18J08M9k07O5r6K21o0j93K27j69
$$ 110 -87 191 165 64 -83 -82 127 -46 115 -112 -63 45 -73 35 84 -123 -58 -154 67 7 -186 41 -128
4741a28L65j21J07%j81q7N8O3j79L61k30p8J26m3n4j5j13R3J5N0Ln0K31k16J17
$$ -128 237 116 223 223 42 -45 13 76 -103 258 28 -50 76 33 -21 -36 -149 -56 -41 9 12 -38 193 -23 94
4766I4q2L7j24P6J10qj42R4Q2k10o0jP1Q4N2ko4OJ21m2j33N4R3j61%M5j79R2J91
$$ 94 12 49 -75 1 111 103 -39 55 137 -73 -133 -134 -63 21 73 71 7 13 134 92 -41 13 106 -55 -55 -10 -189 -97 94
4795I4j94O6j33J42L0j26K01j93Q3k6j24J47R6m0J46k53L09k59J19J5n7J47j20
$$ 94 -100 -34 -167 -25 5 -121 80 -113 -30 -56 -180 -33 63 23 169 -84 225 -34 85 100 43 190 70
4818G0j32J69k30O2J52k54J56n1L6n4j2k3O7OJ81k38J36L0j88K34nk66J42j49
$$ 70 -62 107 -123 -61 91 -163 -7 -58 -22 -76 -88 -111 -44 -38 143 -95 41 71 -117 117 112 -154 -12 -161
4842a61K73j89K19j80P8J49j86L4P4k26K09l7O4N1k38P0j27Q1O9j64J59O3j47
$$ -161 112 -77 142 -38 40 189 3 37 111 -115 94 57 121 172 -66 4 -123 -42 27 -137 22 85 -62
4865f2J87k06J3J19m7j22J19Kj12nJ66j05J38Q9o3l3k38K44j88K34k77K10q4Q3
$$ -62 125 -81 -68 51 4 -118 1 3 -109 -114 52 -53 85 174 111 78 -160 84 -104 130 -147 63 -21 62
4889F2j17m4K45k63j5O5M5j4Q6P5o4p8N6j3Qk8O3p2O0L9j59O9k9q7J42l8K5j9
$$ 62 -55 -99 146 -117 -132 -67 -22 -36 50 125 61 -17 39 26 34 6 69 -3 57 96 -63 6 -23 -110 32 -6 19 0
4917@j15R1l2Q8r4N7o9K9K5J81j29j0J6p8J37j46po3J05J11j08O3P9Q3j37j8k40
$$ 0 -115 -24 -56 32 -62 -5 -74 -45 -20 161 32 22 38 -40 97 -49 -56 -119 -14 97 -11 52 131 214 77 59 -181
4944a81J67N9N7k65K89o3j10j9q2J83J5l3L7k1o0J2LP0p5MP1l6J10k24J84j94
$$ -181 -14 45 102 -163 126 63 -47 -66 -148 35 50 17 54 33 -27 -15 -12 58 -17 -13 58 22 132 -92 92 -102
4970a02J23J51j67JNj0j08O2qM0k05Q3K49M7k67J95r7KN3q7J11M0r6O7r7j76K27
$$ -102 21 172 5 6 11 1 -107 -45 -53 -13 -218 -135 114 161 -106 89 -8 -6 47 -40 71 111 15 82 -15 -191 36
4997C6r2J46j35j9J75rR4j96k4l6m5j6%K21j15J54q9l5n3j4R7o4M0K1j19J54K31
$$ 36 -56 90 -45 -64 111 102 196 0 -24 -60 -105 -121 -121 100 -15 139 50 15 -38 -52 45 -19 21 42 -77 77 308
5024C08j11j36m2j98R0J19j08J47P8k10j6R3l7r6N1n0R3K21j12j15M3M8j51k3
$$ 308 197 61 19 -179 -89 30 -78 69 147 -63 -79 14 -23 -119 -68 -118 -25 196 84 -31 12 60 -91 -114
5048a14q9J39oQ1j73J67p1J21rP6j08p5mm2K9O7m9L2J32j49o2K90j28j66N1q2
$$ -114 -203 -64 -70 11 -162 5 -66 55 46 122 14 -61 -65 -107 -78 -11 -60 -28 104 -45 -107 183 55 -111 -60 -142
5074a42K17l71L13k18K0J80J50j19l7m6O4P2k35J58j36L44k63J43j10jnJ7qN4
$$ -142 75 -296 17 -201 -181 -1 149 30 -7 -53 11 83 -152 6 -130 214 -49 94 -16 -17 -22 -5 -13 41
5098D1K7p2J85j35K7o8oj02L2K2J23q3J08j48k0J82o6N8k19J53J58j10J8k56Q1
$$ 41 68 -4 181 46 73 5 -1 -103 -71 -49 74 -9 99 -49 -69 113 47 105 -114 39 197 87 105 -151 -70
5123g0J93J22k62o2Q9j32O8K2Nj67L59n2j10n4R2q4J63j46K7Qn5N1K6m9q6J84
$$ -70 123 245 -17 -79 10 -122 -54 -32 -27 -194 165 113 3 -51 41 -43 120 -26 1 9 -46 5 31 -18 -104 80
5149H0j05K45k27R2j65J43q9l5J18q6n5J3Q8o0M1L7J0p0O4o7J52j96K9M3j23K01
$$ 80 -25 220 -7 85 -80 63 -26 -61 57 -29 -84 -71 17 -43 -2 35 45 -25 39 -28 124 -72 -43 0 -123 78
5175G8o1J1L8j25N3JJ00l29L61j46k44K41M6N3n5q2J30l4K9J8K2j21J62j17r1
$$ 78 17 28 66 -59 -6 -5 95 -234 127 -19 -263 -22 24 77 22 -60 70 36 65 83 105 -16 146 29 -62
5200f2n1N9K78l39O7K6Q0p4L2k6nJ56j04l5oq8O5J21k00l8Q7R4L1r3J49j81P6
$$ -62 -113 -54 224 -115 -48 -22 58 -16 16 -10 -15 141 37 2 -4 -92 -27 94 -106 -144 -57 37 68 -25 124 -57 19
5227A9J8m7Q5r6k1K18k0o5k49K28%qn7M7j98K75j75M6o7n6J01O1k0j07K5J31j79
$$ 19 37 -10 75 -21 -42 176 156 91 -158 70 70 62 5 52 -146 129 -46 0 -67 -123 -22 39 19 -88 -63 68 -111
5254a11O5j03K91j63P9j01K9Q5j15J01l1j76q9L87j34j20K22M8Q0j02k75Q5J07
$$ -111 -46 -149 142 -21 58 -43 -14 71 -44 57 26 -150 -239 148 14 -106 116 164 244 142 -133 -48 59
5277E9Q1j44p3J12N4q2o5j2P8l6L2j16R4K17k47n6J9J05Pn5K9L6j3j54L7O6P5
$$ 59 140 -4 -77 35 89 7 -58 -70 8 -28 4 -112 -18 199 -48 -104 -85 20 27 -28 1 37 24 -130 -93 -27 48
5304D8qj03J35j6k83J30J79j19NJ27k25Q4J1J22j37j49K98o0M0j0j58qL16j14
$$ 48 40 -63 72 56 -227 -97 82 -37 -32 95 -130 -46 -35 87 -50 -199 99 39 79 69 -89 -97 219 105
5328A05k56J49p0K20q0j18l1l4K9J59K6k40j7K61j81K5l9J7R4J23j89K2j87J90
$$ 105 -151 -2 -72 148 68 -50 -81 -115 -86 73 99 -141 -158 103 -78 -53 -92 -75 19 142 -47 -25 -212 -22
5352b2L3o1J31j94J66k76J18K12j1j74K00q6m1J29o8R3j60l7J3m1K37j81O9j14
$$ -22 11 -50 81 -113 53 -223 -105 107 96 -78 122 36 -5 124 56 149 -11 -48 -35 -76 161 -20 49 -65
5376f5J20j09o6O3n3Q0pK3q4K16l5k34L21j68J02q2j43OO0M4J3N9r1j45J99M9
$$ -65 55 -54 -120 -57 -110 -30 -37 -14 -98 118 83 -151 170 2 104 22 -121 -115 -55 -11 2 61 -30 -175 24 73
5402G3K8j32k6m3K35j53J03j28J0O8j58O3L7J39j15Kk17K67o3M9P6j89N7m4J23
$$ 73 101 -31 -57 -100 135 -18 85 -43 -33 35 -123 -60 -23 116 1 3 -214 53 -10 39 115 -74 -17 -61 62
5427F2j9qJ56k57k3O0m1l2J44r0J52k89J83O6n0l5R7j3j0j60J08r3N8Q4M3j14
$$ 62 43 35 191 -66 -89 -29 -70 -102 42 -48 104 -185 -2 64 14 -21 76 63 53 -107 1 -92 -34 50 93 -21
5453b1M6j06J83r2j23M4N1O9j09P2j37J06O6o7j5o7J76q7J20j16Rm8J35j34J23
$$ -21 25 -81 102 10 -113 -69 -18 51 -58 14 -123 -17 49 -18 -33 -100 76 -11 109 -7 2 -46 89 -45 78
5478G8k19R9M5J1p8J10j89J78J0o1J13r1%K11l35J23j03J29j8K4j4j77R6O0m3
$$ 78 -141 -42 3 14 -64 46 -143 35 45 -16 97 6 6 217 -118 5 -98 31 13 37 23 -154 -58 2 -41
5503d1J26l2j19N0k8k3J15L9q4o7J7J00J2mJ28p1j64Qj01O6j0J42k84J39R9l3
$$ -41 85 53 -66 -16 -44 -67 48 87 3 -64 -47 53 65 61 189 118 -46 -38 -139 -73 -83 59 -225 -86 13 -20
5529b0Mn1J48j58L1J19k4Ro1r6J12q2R6R4O0q9k63J14L0j06J86l6J1NK2J5k36
$$ -20 -16 -67 81 -77 -46 73 49 58 -3 -99 13 -69 27 121 181 92 -171 -57 -27 -133 53 17 28 33 55 70 -166
5556a66J42o6K36k08J26j18j2J14k7l4J20p8Pp0J23k45J39K4l8r1Q8N1q1N7j85
$$ -166 -24 -90 146 -62 64 -54 -66 48 21 -13 107 29 36 -34 89 -156 -17 7 -31 -122 -34 17 -64 -7 -192
5581a92K49k49J80K27k44j45L18r0j61J65J8n8J4j04J31r8L33m45J47K7n9k7m0
$$ -192 57 -192 -12 215 -29 -174 144 54 -107 58 76 18 32 -72 59 -39 294 -151 -4 23 -36 -63 -103
5604a03J50j7K2J8k5j54J58j33J37J16k67J31O2p6Q8l7j23J31o5j40J10p2J20
$$ -103 47 30 52 70 45 -109 49 -84 53 169 -98 33 95 19 107 70 -53 78 13 -127 -17 -89 31
5627C1J8K3j07J31j17O8j99PJ71nL1O3q7k2r4Q2j1J30j2k32J21m9J50nr3J23q9
$$ 31 49 72 -35 96 -21 47 -152 -145 26 21 52 115 28 6 -88 -6 -17 113 101 -131 -10 -59 91 86 -7 116 27
5654B7p1J41k20R1O6O2j21JM4rj6n4J84O6j92j30L5K16j09M0o4N9N4r8P2j24o5
$$ 27 -44 97 -123 -32 34 96 -25 -24 20 11 -5 -59 125 191 -1 -131 -96 120 11 51 -13 46 100 2 74 -50 -115
5681a15o6J66J27r5M8l55J33J73N5r4j06J20J21k6q8L7J03r0mp4O4N5j86J81j11
$$ -115 -181 -15 112 17 65 -290 -157 16 71 -23 -129 -9 112 86 -2 35 138 48 44 -30 34 89 -97 84 -27
5706b7M2N9o2k6Q1k07O5L4m7J37K8k3j12N6K2L5n1N9oj7l8J09j42J43j58K7J31
$$ -27 15 74 12 -14 67 -140 -75 -41 -88 49 77 54 -58 -2 20 55 4 63 57 40 2 111 -31 112 -46 -19 112
5733A12r7J83j17r7q6k7J27m3J8J47j4r2r1J2Q5ll9J81l08L32j31m8NM8k0r6M8
$$ 112 15 198 81 -16 -102 -129 -2 -45 -27 120 106 14 -77 -65 20 17 -22 159 -149 183 52 4 9 57 37 -59 -11
5760a1N5j24M7J73o3j17J36j13J44j41q1K16j38Q9r1j4LJ27O5j60J2l4J77j91
$$ -11 44 -80 -33 140 77 -40 96 -17 127 -14 -95 121 -17 72 -19 -33 -30 97 162 2 14 -20 157 -34
5784c4K06j56N0N4j77J04o7Q0q4K3k0j85K00j8j1rR3j23o4R4L1o1P0q5K4J22K0
$$ -34 172 16 66 120 -57 47 -20 60 -24 -1 -21 -206 -6 -24 -35 -44 49 -74 -138 -44 -13 -74 -4 -89 -65 57 77
5811G7j90k8K75k80K83M1q7r5J9k6O4j14L4O0M8j45M3J29k29K33j19p3K15j61
$$ 77 -113 -141 134 -146 137 178 91 -4 15 -11 53 -61 -27 33 81 -64 -21 108 -121 112 -7 -80 135 -26
5835b6O8m4o2J0M6O5j19j7OK43k33R6J48j73N9j09J5L9r3L34l39J6p5K84K3l2
$$ -26 42 -2 -64 -54 -8 57 -62 -79 -73 170 -63 33 181 8 67 -42 -27 12 -81 253 -86 -70 -145 139 162 130
5861A30n4j43J26k3p1N6J25p8j6o7J47j96j4j4P5R5j89J41k27j17J67M6K7o5J4
$$ 130 76 -67 59 36 -35 21 146 68 52 -15 132 -64 -78 -92 -17 78 -111 30 -197 -314 -147 -101 -74 -139 -125
5886a25P9O7j28J22P6k20J1J33M7q5K17l01O9m7J61p2Nj03K7Q0J4j8K0R1L3j41
$$ -125 -46 21 -107 15 91 -129 -118 15 62 -23 194 -107 -38 -85 76 4 9 -94 -67 13 27 9 29 120 153 12
5912A2m7K4L0j86J70Q7m0L7j08k19P5K65j63J33r5nrkj25P0J39p4o4J39n8K2J00
$$ 12 -35 -11 19 -167 3 90 50 87 -21 -240 -165 100 -63 70 -25 -30 -39 -41 -166 -96 43 -31 -95 44 -14 8 108
5939A08p7%p6P9j73K1J87o5N9N5K38k98O9q2k02J62M6j00J75n6j27J5k5K15j67
$$ 108 31 31 -45 34 -139 -118 69 4 63 118 356 58 127 45 -157 5 51 -49 126 70 -57 -42 -67 148 -19
5964a9q7P7j63J99o3P5r3p2K6K03Q0k38J08o6o6J62o0J22Pk33M9J14k0R3k9j4
$$ -19 -106 -29 -192 7 -56 19 -74 -146 -120 83 163 -75 33 -33 -99 63 3 125 132 -101 -52 62 42 135 106 92
5990I2j36L9q0j84L27o5K9N6j44m2K89j78k2Q4j35N9J50k40O6j06J76l5o5N5l2
$$ 92 -44 -5 -85 -269 58 -7 22 78 -66 -108 181 3 -19 65 -70 -11 139 -101 -35 -141 35 0 -65 -10 -42
6015d2J44J45m72L25o1n4R9j78J05l1qJ2Q8L7l7k17K02p2K8rOj6L9Q0p6p9K12
$$ -42 102 247 -225 100 39 -15 84 -94 11 -20 -28 -16 72 109 72 -145 57 -15 13 4 10 -6 33 113 37 -42 170
6042A70j92J31j74l6L44j82M8j44j33J31K0J9o2Q3J13l6j06J1k57K32j1n9O5R2
$$ 170 -22 109 -65 -101 243 61 109 -35 -168 -37 -17 2 -60 23 136 100 -6 5 -252 -20 -31 -90 -25 67
6066F7J1j23M1O9j53L1J22L4j76O0L2J1K4j64K6J02L4k49L49j29l8j23Q5lJ46
$$ 67 78 -45 -4 65 -88 -57 65 99 -77 -17 15 26 50 -114 -88 14 48 -201 148 19 -19 -142 -57 -60 86
6091H6Pk9j50J83p5p7J66j77J62j27P0k9mJ11l7m0o0k2J82j06j50J56N6p7M3k2
$$ 86 93 64 -86 97 22 -55 111 -66 96 -31 39 10 6 117 80 40 -20 -42 140 34 -116 40 96 19 62 40
6117D0l0P0q6M6j81J58pmr6J57j41K4J03K1l5M7j79L15j05k20J9R0nj00J4K52
$$ 40 10 80 -6 40 -141 17 10 6 -90 67 -74 -50 53 74 39 86 -93 222 117 -103 -84 6 1 -99 -85 167
6143A67k52K8J09j30P1j82K50Jk04R2J29q1j49J53j05K05j24L8m9n6q8J92K47
$$ 167 -85 -57 52 -78 -7 -189 61 62 -142 -50 79 -2 -151 2 -103 102 -22 16 -33 -89 -177 15 262
6166B62j56j91m1J89j48jn2J95j03M0N1j7p6r8P3O2J50o3o1L1j78K17j13K1j76
$$ 262 106 -85 -126 63 -85 -86 -138 57 -46 -6 45 28 -48 -146 -73 -11 139 76 15 46 -132 85 -28 -7 -183
$$ [...]
8191g7
##END NTUPLES=NMR FID
##END=
