##TITLE=1H_Pr M-4 
 CDCl3
 8 sc, 
 13.1.2025
##JCAMPDX= 6.0         $$ Bruker NMR JCAMP-DX V2.0
##DATA TYPE= NMR FID
##DATA CLASS= NTUPLES
##ORIGIN= UXNMR, Bruker Analytische Messtechnik GmbH
##OWNER= root
$$ XWIN-NMR		Version 3.5
$$ Mon Jan 13 16:33:34 2025 Russian Standard Time (UT+4h)  she@DPX200
##.OBSERVE FREQUENCY= 200.1315
##.OBSERVE NUCLEUS= ^1H
##.DELAY= (6, 6)
##.ACQUISITION MODE= SIMULTANEOUS
##.ACQUISITION SCHEME= undefined
##.AVERAGES= 8
##.DIGITISER RES= 18
##SPECTROMETER/DATA SYSTEM= spect
##.PULSE SEQUENCE= zg30
##.SOLVENT NAME= CDCl3
##.SHIFT REFERENCE= (INTERNAL, CDCl3, 0, 15.7039)
##AUDIT TRAIL= $$ (NUMBER, WHEN, WHO, WHERE, WHAT)
$$ ##TITLE= Audit trail, XWIN-NMR		Version 3.5
$$ ##JCAMPDX= 5.01
$$ ##ORIGIN= Bruker BioSpin GmbH
$$ ##OWNER= she
$$ F:/spectra/data/she/nmr/H-F/1/audita.txt
$$ ##AUDIT TRAIL=  $$ (NUMBER, WHEN, WHO, WHERE, WHAT)
(   1,<2025-01-13 16:32:29.60 +0400>,<she>,<DPX200>,
      <created by zg, POWCHK disabled, PULCHK disabled
       configuration hash MD5:
       00 E9 B6 7A A2 85 ED C7 34 08 36 98 17 FE 4E 26
       data hash MD5: 16K
       C7 67 B7 63 A8 B6 02 6A 02 BD 9B D0 87 E2 43 4B>)
$$ ##END=
$$ 
$$ hash MD5
$$ 37 4B 46 20 27 D2 81 9A 70 C6 31 53 C3 D9 58 8B
##$RELAX= 
##$RELAX= 
##$RELAX= 
##$RELAX= 
##$RELAX= 
##$RELAX= 
$$ Bruker specific parameters
$$ --------------------------
##$DU= <F:/spectra>
##$EXPNO= 1
##$NAME= <H-F>
##$PROCNO= 1
##$TYPE= <nmr>
##$USER= <she>
##$AMP= (0..31)
100 100 100 100 100 100 100 100 100 100 100 100 100 100 100 100 100 100 
100 100 100 100 100 100 100 100 100 100 100 100 100 100 
##$AQSEQ= 0
##$AQ_mod= 1
##$AUNM= <au_zg>
##$AUTOPOS= <>
##$BF1= 200.13
##$BF2= 200.13
##$BF3= 200.13
##$BF4= 200.13
##$BF5= 200.13
##$BF6= 200.13
##$BF7= 200.13
##$BF8= 200.13
##$BYTORDA= 1
##$CFDGTYP= 0
##$CFRGTYP= 5
##$CHEMSTR= <none>
##$CNST= (0..31)
1 1 145 1 1 1 1 1 1 1 1 1 1 1 1 1 1 1 1 1 1 1 1 1 1 1 1 1 1 1 1 1 
##$CPDPRG= <>
##$CPDPRG1= <>
##$CPDPRG2= <>
##$CPDPRG3= <>
##$CPDPRG4= <mlev>
##$CPDPRG5= <mlev>
##$CPDPRG6= <mlev>
##$CPDPRG7= <mlev>
##$CPDPRG8= <mlev>
##$CPDPRGB= <>
##$CPDPRGT= <>
##$D= (0..31)
0 1.2 0 0 0 0 0 0 0 0.06 0 0.03 0 0 0 0 0.0002 0 0 0 0 0 0 0 0 0 0 0 0 
0 0 0 
##$DATE= 1736771548
##$DBL= (0..7)
120 120 120 120 120 120 120 120 
##$DBP= (0..7)
150 150 150 150 150 150 150 150 
##$DBP07= 0
##$DBPNAM0= <>
##$DBPNAM1= <>
##$DBPNAM2= <>
##$DBPNAM3= <>
##$DBPNAM4= <>
##$DBPNAM5= <>
##$DBPNAM6= <>
##$DBPNAM7= <>
##$DBPOAL= (0..7)
0.5 0.5 0.5 0.5 0.5 0.5 0.5 0.5 
##$DBPOFFS= (0..7)
0 0 0 0 0 0 0 0 
##$DE= 6
##$DECBNUC= <off>
##$DECIM= 24
##$DECNUC= <off>
##$DECSTAT= 4
##$DIGMOD= 1
##$DIGTYP= 9
##$DL= (0..7)
0 120 120 120 120 120 120 120 
##$DP= (0..7)
150 150 150 150 150 150 150 150 
##$DP07= 0
##$DPNAME0= <>
##$DPNAME1= <>
##$DPNAME2= <>
##$DPNAME3= <>
##$DPNAME4= <>
##$DPNAME5= <>
##$DPNAME6= <>
##$DPNAME7= <>
##$DPOAL= (0..7)
0.5 0.5 0.5 0.5 0.5 0.5 0.5 0.5 
##$DPOFFS= (0..7)
0 0 0 0 0 0 0 0 
##$DQDMODE= 0
##$DR= 18
##$DS= 0
##$DSLIST= <SSSSSSSSSSSSSSS>
$$ [...]
##$SUBNAM2= <"">
##$SUBNAM3= <"">
##$SUBNAM4= <"">
##$SUBNAM5= <"">
##$SUBNAM6= <"">
##$SUBNAM7= <"">
##$SUBNAM8= <"">
##$SUBNAM9= <"">
##$SW= 24.0689530833862
##$SWIBOX= (0..15)
0 0 2 0 0 0 0 0 0 0 0 0 0 0 0 0 
##$SW_h= 4816.95568400771
##$TD= 16384
##$TD0= 1
##$TE= 0
##$TE2= 300
##$TE3= 300
##$TEG= 300
##$TL= (0..7)
0 120 120 120 120 120 120 120 
##$TP= (0..7)
150 150 150 150 150 150 150 150 
##$TP07= 0
##$TPNAME0= <>
##$TPNAME1= <>
##$TPNAME2= <>
##$TPNAME3= <>
##$TPNAME4= <>
##$TPNAME5= <>
##$TPNAME6= <>
##$TPNAME7= <>
##$TPOAL= (0..7)
0.5 0.5 0.5 0.5 0.5 0.5 0.5 0.5 
##$TPOFFS= (0..7)
0 0 0 0 0 0 0 0 
##$TUNHIN= 0
##$TUNHOUT= 0
##$TUNXOUT= 0
##$USERA1= <user>
##$USERA2= <user>
##$USERA3= <user>
##$USERA4= <user>
##$USERA5= <user>
##$V9= 5
##$VALIST= <valist>
##$VCLIST= <CCCCCCCCCCCCCCC>
##$VD= 0
##$VDLIST= <DDDDDDDDDDDDDDD>
##$VPLIST= <PPPPPPPPPPPPPPP>
##$VTLIST= <TTTTTTTTTTTTTTT>
##$WBST= 1024
##$WBSW= 4
##$XGAIN= (0..3)
0 0 0 0 
##$XL= 0
##$YL= 0
##$YMAX_a= 20005
##$YMIN_a= -38749
##$ZGOPTNS= <>
##$ZL1= 120
##$ZL2= 120
##$ZL3= 120
##$ZL4= 120
##$ABSF1= 10
##$ABSF2= 0
##$ABSG= 5
##$ABSL= 3
##$ALPHA= 0
##$AQORDER= 0
##$ASSFAC= 0
##$ASSFACI= 0
##$ASSFACX= 0
##$ASSWID= 0
##$AUNMP= <proc_1d>
##$AZFE= 0.1
##$AZFW= 0.1
##$BCFW= 1
##$BC_mod= 2
##$BYTORDP= 1
##$COROFFS= 0
##$CY= 11.3945322036743
##$DATMOD= 1
##$DC= 2
##$DFILT= <>
##$DTYPP= 0
##$F1P= 15.6554695791079
##$F2P= 12.8336369535428
##$FCOR= 0.5
##$FTSIZE= 0
##$FT_mod= 4
##$GAMMA= 1
##$GB= 0.15
##$INTBC= 1
##$INTSCL= 1
##$ISEN= 128
##$LB= 0.24
##$LEV0= 0
##$LPBIN= 0
##$MAXI= 10000
##$MC2= 0
##$MEAN= 0
##$ME_mod= 0
##$MI= 1.114404
##$NCOEF= 0
##$NC_proc= 0
##$NLEV= 6
##$NOISF1= 3.799351
##$NOISF2= 2.8
##$NSP= 1
##$NTH_PI= 0
##$NZP= 0
##$OFFSET= 15.70392
##$PC= 1
##$PHC0= -26575.86
##$PHC1= 19.38744
##$PH_mod= 1
##$PKNL= yes
##$PPARMOD= 0
##$PSCAL= 0
##$PSIGN= 0
##$REVERSE= no
##$SF= 200.130013532006
##$SI= 16384
##$SIGF1= 3
##$SIGF2= 2
##$SINO= 400
##$SIOLD= 16384
##$SREGLST= <1H.CDCl3>
##$SSB= 0
##$STSI= 0
##$STSR= 0
##$SW_p= 3612.71676300578
##$SYMM= 0
##$S_DEV= 0
##$TDeff= 0
##$TDoff= 0
##$TI= <>
##$TILT= no
##$TM1= 0
##$TM2= 0
##$TOPLEV= 0
##$USERP1= <user>
##$USERP2= <user>
##$USERP3= <user>
##$USERP4= <user>
##$USERP5= <user>
##$WDW= 1
##$XDIM= 8192
##$YMAX_p= 0
##$YMIN_p= 0
$$ End of Bruker specific parameters
$$ ---------------------------------
##NTUPLES= NMR FID
##VAR_NAME=  TIME,          FID/REAL,        FID/IMAG
##SYMBOL=    X,             R,               I
##VAR_TYPE=  INDEPENDENT,   DEPENDENT,       DEPENDENT
##VAR_FORM=  AFFN,          ASDF,            ASDF
##VAR_DIM=   8192,          8192,            8192
##UNITS=     SECONDS,       ARBITRARY UNITS, ARBITRARY UNITS
##FACTOR=    0.0002076,     1,               1
##FIRST=     0,             0,               0
##LAST=      1.7004516,     0,               0
##MIN=       0,             -38749,          0
##MAX=       1.7004516,     20005,           0
$$ Real data points
##PAGE= N=1
##DATA TABLE= (X++(R..R)), XYDATA
$$ [...]
2086E80p53q11J148N88j345N53P32j203J09R20p61k02R22r83l80J612m33j132
2104h39J104M12j393O33P27q28l91J561r58o54J199p17p33J270K85j353P26P74
2122H25r29R7Q81j089j2P86l4r82J048o0j058N98Q19j594P75J158j345M4Q60n67
2142B21m76P91m60n29L62Q32j371P27R46j376q4J277j023l20J227o05o47J248
2160G40l95r42N50N44j325M20J231p62q7O00o08n49Q54P5j340J276J88j284J95
2179f19J190q96p3R30p52k55M93k74l75Q58L28j691R94N91j180p6J243r09j72
2198f45J264r00n58J064k08q64J006Mq50L69J057j249j52R64n72l14J000o8j260
2217i12P86L57p90N45N26j067l6J399o60q03J271m66j004J089K38p98L10Q40j185
$$ y = [580, -173, -984, 164, 752, -593, -40, 692, -511, -402, 518, -243, -445, 477, -506, -886, 726, 293, -839, 265, 677, -716, -83, 644, -184, -575, 986, 28, -626, 573, -144, -877, 393, 678, -675, 51, 825, -104, -7, 874, -215, -227, 559, 525, -457, 591, 531, -527, 71, 890, -704, 71, 1229, -116, -72, 788, 221, -255, 536, 76, -453, -91, 741, -630, 97, 1043, -333, -417, 860, -163, -483, 744, 139, -508, 740, 345, -597, -47, 497, -828, -408, 823, 61, -26, 574, -34, -583, 271, 346, -994, 282, 470, -814, -619, 571, -325, -398, 532, -220, -475, 18, -256, -631, 227, 555, -1136, -142, 449, -731, -807, 436, -473, -645, 619, -281, -839, 225, 17, -847, 159, 163, -687, -318, 739, -510, -662, 302, -270, -584, 416, 348, -912, -126, 231, -559, -14, 512, -555, -591, 808, 148, -655, 616, 150, -854, 235, 473, -325, -15, 825, -360]
2236c60k3J277j328l59J388m69k85Q19J56j147P48Np41M05Q30r86nJ039q59l21
2256b16P40m54o35J066O2j103P88Q71j588P37Q45j538j30J182n07l07P27j8j200
2275f78J064j5r92P09N77p49j45J258q93p39J102m36n70O88M99j345Q14L30r08
2294d29O3J126p51n07J119p04o11O97L79q59N42K73r22l0J116j009J03P02n46
2313b48o84J301k11j088R04Q9o32O89K54j060J43Q80j034q3J479o46j004Q32K13
2332I4p47R17J71r81K39Q27r57l68J207j07r62O11M12r22R77j98j006Q71K62q61
2352e21K24Q97o63o20J195l17p18O54L83q60L83O79j415J038J42p50N5Q16m41
2371A61m73Q37j43j071J137L07j109J96R46j041k17J275q97k72J223m16r88Q74
$$ y = [-360, -383, 894, -434, -793, 595, 126, -159, 660, 816, -331, 417, 422, -319, 86, 916, -70, -75, 964, 105, -216, 524, 70, -565, 501, 563, -540, 248, 1119, -469, 268, 1113, -425, -555, 627, 120, -187, 540, 522, -678, 386, 371, -621, 88, 665, -84, -229, 1029, 136, -603, 499, 63, -507, 181, 680, -665, 149, 479, -429, -366, 760, 9, -498, 621, -83, -694, 3, 382, -477, 65, 338, -584, -614, 502, -507, -404, 298, -248, -932, 369, 158, -930, -26, 63, -569, 120, 374, -686, -543, 337, -697, -780, 699, 53, -951, -119, 94, -653, 264, 435, -546, -307, 520, -437, -805, 402, 295, -667, -56, 356, -566, 411, 213, -793, 78, 340, -521, -297, 600, -63, -683, 512, 195, -523, 131, 514, -346, 37, 716, -699, 339, 481, -269, -214, 602, 161, -312, 525, 382, -689, 448, 755, -354, -158, 788, -253, -470, 805, -92, -364, 859, 443, -545, 329]
2389C29J09r07O69M97q76q9J138j127r3J300p75q18Q84M59j306O57N48q16K71
2408E4O49r56J8R81j090k16Q24J61r19N39K74r66L82P83j345N93Q49o71j18N17
2428C43l40q49J082j18r48R27K82j228O83M47r25J38R28o80n76R84J31p23L46
2447i6M01j098M62P59r43J12Q40o06m24J510j154o13J157K95j419P93L86p88K52
2466a74L90p01RQ69m16l70O36j35o22M30O69j125L33O61l75k27P24n39l12R21
2486F46p00o93J051J26q47O10L78j128L0J180r29L15R36q86p40Q69O5o0M2O21
2506H86j318L51Q65r90j27J110o49o18J126k90p44O24P66j621M38O66r42K31Q71
2525F35p11m34J390j087m21J080r0r30P54J79p92K04O04r12L35P64p16k87R01
$$ y = [329, 438, -469, 200, 697, -179, -268, 870, -257, -350, 950, 175, -643, 241, 700, -606, 51, 599, -217, 54, 703, -253, -235, 746, -344, -560, 264, 425, -494, 45, 319, -647, -265, 518, -827, -234, 615, -56, -174, 343, 3, -846, 236, 118, -830, 97, 379, -849, -166, 281, -644, -506, 422, -258, -834, 150, 281, -442, -96, 305, -793, -331, 428, -515, -403, 437, -169, -593, 917, -237, -850, 307, 602, -817, -24, 362, -426, -174, 216, -485, -476, 393, -23, -393, 243, 108, -514, -84, 585, -540, -207, 454, 79, -148, 576, 37, -275, 646, -54, -747, 304, 430, -417, 193, 571, -557, -527, 653, -276, 39, 975, 89, -651, 218, 283, 223, 265, 886, -432, -81, 784, -206, -333, 777, 128, -490, 636, 346, -398, 226, 992, -629, -191, 475, -467, -236, 635, -76, -510, 880, -207, -628, 452, 362, -568, 186, 365, -427, -223, 381, -531, -196, 568, -148, -435, 466]
2544D66n34l46O48K26j108M60O43o26k59P60n66j50O42l0n03O49N9r51J88P09
2564C77o54J33M11o84p0R15m39l69O25j7j004R93L25j422Q74K60m65k4M01m12
2584b46j89N32j92n70Q83K15j164M96O15p15L0Q10j75p42P27l30p63J222j33m87
2604a76O1N15q63L39O98p89J26N97k49p47Q82j32q04O67K33r03N86P64j045n2
2624b92P95n27k78Q52l98p57R63l0p56O43L25r02J91R75r57N3M71l99m80J097
2644E89l36p52Q99k11m51L57L80j036L93O81o94j9R41o79n93R15mr98J019O4r00
2665d35N68L56q12R0N15k81r2J59k57j93N50M83j114K74R43j163OQ83n53o60J237
2686E04p67l81N39J50q35O54N71p48j83P60l03m22R37n77n51P37J30n11O68j44
$$ y = [466, -68, -414, 234, 460, -648, -188, 455, -171, -430, 330, -236, -386, 256, 226, -277, 372, 431, -520, -332, 377, -277, -144, 267, -417, -487, 428, -11, -380, 245, 228, -776, 217, 542, -880, -6, 254, -211, -235, 166, -246, -435, 97, -95, -665, 218, 433, -731, -235, 380, -335, -305, 505, 330, -412, 315, -15, -778, 444, 311, -176, -115, 400, -463, -124, 574, -215, -89, 508, 259, -488, 394, 262, -542, 125, 358, -545, 41, 805, -240, -292, 503, -24, -302, 550, 152, -605, 358, 328, -428, 215, 540, -362, -171, 804, -153, -100, 371, -28, -508, 589, 253, -499, 400, 189, -262, 95, 475, -561, -168, 513, -181, -200, 741, 62, -531, 384, 380, -618, 401, 465, -435, 133, 489, -323, -233, 282, 1, -91, 68, -189, -382, 168, 651, -463, -189, 754, -409, -403, 480, -73, -733, 504, -263, -644, -105, 45, -790, -136, 435, -313, -496, 264, -39, -461, 476, -101, -652, 85, 215, -296, 372, 228]
2706B28q02M04N96p01j59Q90l33q31J004k07o88R09L39j106K36P01j001J07Q93
2725D79l40m19R54l00n82N53j98p47P09L60r88M38P00r88J8R64l47n81M84K00
2745C69q71R17kq02M31N65q12k5R48o49m57J024k13q62R79j7r95P25L06q77N58
2766B40K45k96k67Q00n76n94Q48k9o34P28K4r54L82N12o79J20Q04r18k31J044
2786E69k41o67O92l12l84M18L93q01K96L63l91n73J021j52o55M20J42o17M46N95
2806E62j138N19O08p34J08L21m37m61R97j68p36O36R6n54K79O76r37J05P25p59
2826b92l96Q11j04l88O05O8r31N50L95r25N72M97n54k18Q53o49l01O84r4o59O87
2847B11j83n27N59M02q14K57L13m31j84Q67j39q27M07M82j069P02L87q39O41K46
$$ y = [228, -574, -170, 426, -275, -434, 456, 123, -708, 296, 89, -599, 310, 649, -457, -221, 480, -521, -414, 479, 139, -280, 674, 374, -208, 345, 147, -600, 109, 469, -519, -81, 619, -369, -351, 613, 266, -315, 169, 369, -502, 415, 413, -389, 42, 607, -205, -230, 718, 69, -388, 636, 423, -439, 540, 523, -472, 253, 559, -318, 240, 485, 189, -78, 722, 146, -448, 400, 371, -263, 465, 489, -465, -83, 429, -250, -130, 674, -244, -475, 569, 328, -339, 353, 41, -343, 75, 468, -333, -37, 326, -65, -638, 383, 231, -424, -4, 138, -479, -33, 562, -576, -57, 551, -183, -75, 246, -191, -652, 345, 177, -559, 77, 173, -381, -102, 574, -363, -258, 467, -292, -688, 123, 19, -369, 236, 304, -627, -77, 318, -607, -35, 462, -92, -310, 543, -106, -407, 277, 183, -476, 211, 28, -499, 60, 462, -352, -95, 218, -213, -397, 470, 331, -496, -89, 393, -676, 26, 413, -426, 215, 461]
2867D61k41n09R30q27l71R09J08p30P17m9q98N09M44n24j08R36q96k67P96j68
2887B22o09P24jn39K76M56o84J42P12p88l76Q57j53n56O31m64j85J92L93n36L20
2908C4N15q87j57R39k84n36M44J29p53Q37q8p82K97K96Jm59P76n29k80P14o81
2929d54k74P39k3j82J07O15q77K04M97o68J27L31k60m02M82K7o13N90K01m86K11
2950a08N55q53J60O14m67k64L84j01k66N56n4p63L38O45o81Q2O51n82k54P13m48
2971a43j64M74Q7o00N73N2n85J88O12p94PQ62m89m50Q46k71p17Q51M34r44K39
2992F8O05r12N3M43j35m02Q95m71o44O80M5p38O24L90o81O8Q53p09n73J126k59
3013C26n35O81k67m27N34N8q35L53N52q66J35O13j60o33P31l69l55R49j55l58
$$ y = [461, 220, -289, 641, -186, -557, 352, 460, -270, 447, 398, -500, 9, 453, -71, -179, 757, -139, -406, 390, 222, -387, 337, 336, -203, 73, 529, -155, -13, 699, -89, -465, 392, 239, -317, 314, -150, -335, -143, 250, -286, 34, 549, -338, -495, 444, 160, -376, 68, 197, -556, 281, 193, -589, -292, 4, 5, -454, 322, -207, -487, 227, -454, -728, 11, -12, -194, -87, 528, -349, -145, 352, -316, -189, 142, -118, -520, -38, -11, -624, -34, 167, -319, -108, 447, -406, -246, 368, -99, -363, 21, -80, -346, 210, 156, -607, -269, 376, -305, -223, 428, -154, -408, 305, -143, -307, 167, 254, -346, 227, 279, -306, -118, 494, -300, -293, 569, 80, -370, 476, 205, -512, 339, 773, -171, 68, 673, -239, -186, 257, 122, -280, 615, 144, -500, 180, 225, -513, 111, 501, -180, -112, 741, 32, -541, 585, 326, -209, 472, 205, -222, 312, 370, -465, -112, 440, -426, -291, 322, 162, -471, 260, -109, -464, 485, 330, -28]
3033b8L87m9q93O30O3j90k47Q74n07o33Q96p6o82N78L33p82K64M68l47l70Q89
3054E78q00k06M79k5m32N61M98j079N37M21q45N5N57n77J86K79m01n9M61k8p70
3075f10N45N2j97j2O68q49p1Q43m67l42J040l37q23P65k72k88M41K34o54j44O93
3096B15m10j12M70Q5n53M76j70l05N7O39k93n2P29r51QO44j11m19O07m37m60N29
3118A86K94p04M54K71n57l21Q37l76k67M20l16k84L63M52o70M58K48q13L36O62
3138F73o90k48O89k76m13M44k14l14M80L67n78Q8P6k66K53K22j44l95N71j51o41
3159d67Q8O01o12J21R16r76m1P89q24Q2Q24o98l70R63j59o09N03J18q42K12L61
3180b0m08J44N46m42j44L65J72p62J43P11m74j17O49n72l25Q52p90O2N01km89
$$ y = [-28, 359, 310, -583, 47, 110, -80, -327, 547, 40, -593, 303, 227, -455, 123, 456, -326, -62, 406, 59, -311, 578, -222, -428, 51, 26, -406, 155, 653, -426, 111, 532, -313, -258, 299, -278, -92, 187, -214, -273, 188, 160, -610, -65, -13, -210, -222, 446, -403, -474, 369, -98, -440, 600, 263, -560, 205, -67, -355, 86, 320, -334, -478, 215, -195, -307, 163, 248, -305, 171, 1, -304, -247, 392, 99, 47, 776, -175, -167, 477, 366, -53, 554, 117, -343, 186, 480, -224, 230, 501, -56, -377, 460, 84, -183, 237, -79, -363, 0, 452, -218, 240, 488, -325, 11, 673, -17, -265, 424, 148, -265, 179, -35, -349, 131, 498, -80, 8, 84, -182, 71, 293, 149, -246, 325, 174, -467, -379, 222, -390, -269, 647, -329, -370, 419, -405, -323, 501, -197, -567, 396, 237, -372, 131, 249, -593, -381, -20, -428, -284, 262, -180, -324, 41, 213, -549, -406, 305, -169, -286, 363, -209, -534, 318, -472, -410, 91, 89, -400]
3201d00L52ok93P59j98o15M2O54l18l15M35l21k80M45N94p65K35M92q12J5Q96
3222E96q24P2P54r23L91K07k17l18L87K56o67N10J76n80j53P08n30J81L00k67
3242E9m03O08J22o58N27j95o1L6M11l81l57N57q4k11O67k74r11P24J4k27M2K29
3264B34l89O2L25m67J10N14m08l49M55j7j30L37j10l92M2Q47r06k41Q55m24j78
3285b30K75J83o07J03M06k56M18j14n91L93m9l8j21M37l18l85K59M71o56J21K61
3306c8l37j31Q76n60k60P67l85k29K94m2k23M82K1m44J94M49o72j07O23m83j23
3327c28N14O5m99M00k45j21M41j62k94o3O93m89l76N39l46j4P61o91n1J15L23
3348A72n43J55M62m64M01M7l48j1M39m44J42Q2K61n59Q4M85k76k77M86o26J66
$$ y = [-400, -48, -54, -347, 412, 214, -401, -359, 295, -23, -338, 97, -224, -504, -59, 535, -230, 5, 497, -315, -300, 596, -228, -156, 598, -325, 66, 273, 56, -262, 125, 381, -286, 224, 400, -180, -333, 375, -155, 26, 326, 59, -344, 264, 386, -272, 255, 60, -1, 35, 446, 65, -292, 265, 181, -30, 637, 363, -548, 176, 190, -37, 5, 234, -155, -93, 232, -235, -125, 389, -19, -368, 87, 70, -60, 277, 167, -225, -183, 664, -242, -483, 372, -52, -230, 45, 228, -379, -276, 130, -126, 292, 178, -413, -20, -69, -107, -228, 209, -109, -494, -235, 236, -420, -299, -38, -375, -506, 370, -190, -450, 317, -68, -297, -3, -45, -268, 214, 235, -209, -15, 434, -238, -345, 278, -205, -328, 186, 251, -248, 152, -93, -214, 227, 65, -229, -292, 401, -88, -464, 75, -271, -285, 476, -215, -266, -151, 172, -371, -216, 246, -218, 183, 230, -118, -129, 310, -134, 8, 90, 351, -208, -124, 361, 85, -192, 294, -332, -166]
3369a66P16l46m94N11j28l20K53M02n34K70K75l85k71N44j02n99Q21m29j59L91
3389B50m8n97M43K37n91K9L16j70j16L64j24n46O70m0p1Q4Q0o09J57N83m89n4
3411b42N92j84n27L67J66p50N49J01n82M40J40j59j36P77n30o7J59r2l78L85k8
3432Ak25K32K63l00j19M40o87P8M49j26j78P82m68n53N98R8l96K07J53m21j3N52
3454C67k80l25M39j01j47j04M90m56J08K62k69R4K87l30n9K44l2m29M70rn63J93
3476a50N72p96N41R6k50j24N96k73m62Q41j71r09P06K5n93L37K09j77Q5%j7k13
3498a27L18J38o11M72J04k97J26K74k54Q1j1n36r3Q19k48k82N95r3n13j03O00
3519C59l08J65j60m37M87O9l00Q5P6j59l25N32O5l74L26N9n12K79K98m6m22N23
$$ y = [-166, 550, 204, -290, 221, 93, -227, 26, 428, -106, 164, 439, 54, -217, 327, 225, -374, 447, 18, -141, 250, 202, -395, 48, 285, -306, -277, 39, -131, -247, 117, -7, -553, 117, 77, 6, 90, 170, -439, -282, 301, -188, -242, 350, 166, -361, 6, 172, -578, -29, 72, -510, -70, 70, -89, -225, 552, 22, -45, 114, 22, -356, 29, 1, -224, 8, 271, -29, -148, 292, -395, -317, 132, 6, -172, 610, 142, -411, 187, 285, -111, 96, 249, -172, -185, 367, 87, -238, 201, 100, -47, -151, 339, -117, -9, 253, -16, 78, 365, 35, -24, 220, 188, -241, 229, 220, -343, -150, 422, -374, 167, 263, 13, -111, 485, 212, -250, 591, 420, -489, 217, 242, -351, -14, 195, 18, 103, 103, 86, -127, 191, 329, -282, 190, 294, -3, 123, 397, 143, 224, 213, -323, -416, 403, 155, -127, 468, 375, -138, -241, 359, 51, 216, 56, -381, 106, 175, -125, -40, 36, -123, -448, 84, 149, -225, 101, 160, -352, -73, 225, 179, -243, 280]
3541B80l93k85L63j02j28O02n42l2J74L33l43j10K60j73l54P39k32l78K09J09
3561cj44K06J61p48M59L35n85K3M34j52j48M67l05m66P30p6p18K26L93k8k10M79
3583C30l38j54N11k04m98N13r3j61P5J43k01j56N17m41RL77k28k25L96K70m32
3604A0L2O12q74j58N13k49k05P93p29j90O45P2m79K54M04o35J41K08l89K81m2
3625A5J45o26M78J39j62M12o6m33qL31J9j61K13l56l09M38P2k31j6J49l08q0O01
3648B56k49j4M87p58L37M5jl80O13j24k80K45j56m01N29p4l2l58L26j12M4K25
3670A68n35L24M55m23l53Q1K18l32Q3J92j6J27J96N9l74j00K11l18J6K15n65P03
3692C2j32k3j62L04j40K55L0k31l19M15K46m60J85R3M8l35M5j24J98L06N7k38
$$ y = [280, -113, -398, -35, -137, -265, 337, -205, -237, -63, 270, -73, -183, 77, -96, -450, 289, 57, -321, -112, -3, -147, 59, 220, -528, -69, 266, -319, -296, 138, -14, -162, 305, 0, -466, 264, 188, -530, -304, 89, 61, -149, 330, -8, -162, 349, 145, -353, 160, 67, -94, -19, 124, -77, -233, 284, -157, -148, 229, 1, -224, 172, 442, 10, 42, 654, -220, -378, 135, -114, -319, 474, -255, -445, 200, 272, -207, 47, 451, -184, -43, 165, -224, 57, 15, 160, -466, 12, 151, -11, 401, 335, -98, -106, 225, 244, 83, 296, -60, -369, 69, 141, -90, -106, 43, -265, -345, 256, 7, -7, 480, -278, 59, 104, 103, -277, 336, 212, -68, 177, 21, -380, 149, 75, 43, -315, 11, -101, -57, 168, -367, -43, 412, -11, -364, -283, -65, -397, -314, -122, -138, -11, 185, 244, -130, -230, -19, -337, -321, -106, -671, 32, -100, -123, -285, 19, -121, 134, 164, -67, -386, 29, 275, -185, 0, 93, 141, -194, -149, -273, -75, 231, 288, 50]
3714E0j06L14n64J73J09j10K48K64k86M9P8l72P5M10r8l75L28K48m94O2J59m09
3736b47M09L82n45L7M21m20J1O3j59j02L88j74m85M47J84l26K48K23n95l7M07
3757A30Q6k74K17J74n71P4J53l51N55N8l70j85O82n89j20L27p9K6J88n7j13l0
3779f9J68j19j08P4n02K73L64j13k67L12K2k42M89m78J5j5K78j97Jj19K7m59Q72
3802B07j93n66M10O1o4lL79l79j31L14K3k35K62k11k42M70J94m15kJ33O3l98O84
3825C61o90R3L52J94k51N1J53n70J04J60l92L30K14r4k03N60j37o88M12L54m26
3846a13L97j57l37n2O88m77M0L91n04L8M07j97m61M30j09k84J68J62k2J92N7n97
3868c40M57j9l6k45M08p1m48J73M50j58m95P31p00L84K73l21j47K45J27l51P9
$$ y = [50, -56, 258, -306, -133, -24, -134, 114, 378, 92, 141, 219, -153, -78, 332, 234, -141, 187, 435, -59, 3, 162, -247, 162, 544, -1, 36, 457, 37, 48, 111, -48, -150, 238, 64, -421, 26, 210, -116, 132, 355, -240, -277, 130, 216, -58, 159, 333, -238, -164, -11, -362, 193, 251, -119, -304, 378, -211, -331, -4, -83, -57, 131, 74, -39, -69, 99, -20, -128, -54, -556, -283, 81, -32, -299, 13, 35, -207, 282, -196, -181, -196, 82, -115, -114, -233, -206, -665, 207, 14, -552, -142, -81, -145, -148, 231, -148, -279, 35, 58, -177, 85, -126, -368, 102, 296, -119, -121, 12, 75, -323, 361, -329, -236, 116, 310, 59, 110, 263, -307, -203, -43, -435, -105, 109, 15, -188, 372, 235, -453, -41, 313, -113, 284, 127, -210, -262, 426, -51, -11, 380, -124, -86, 321, 124, -337, 93, -16, -300, -132, 30, 8, 200, 257, -340, 117, 98, 62, -183, 225, 154, -294, -121, 329, 171, -324, 407, -293, 91, 364, 43, -104, 141, 268, -83, -4]
3889dj78K6J73Q7r0k25M14m81J18K36n0l82L98J15p60N01Nk93R3O17p69K40L60
3912A51l02j99M17Q9m69N32l25J07j07J16k30JM9J11j29J76N8j82K33L8n32L84
3934a3L11p19j2O40j92k41J56K8k39K67l8l29J81K07M4j38L84l51j44K74j46j46
3956b16K76nl03M53l1m61M76k35m13O0Q72n43j20K70N2o8p4L33k78J25J39o22
3978c13M53J41n71L25J28k1l27K10R4q4j50M79l45K14J04j36k4k06QR3K8l18l18
4001e36R63k62l79K64L8j52j67O32l43r7K19m9m65R75n25l30K04q2j53L4N32m91
4023a70R0L28n43K0L65j3m79K58j11Ok5M68k37p7K24m01J13N26m44m57O10J30
4045A81l75L7M05l82r6J86k93J62M52p20K79J3PK69J49k82l86M53P2k62k30M86
$$ y = [-4, -182, -156, 17, 104, 14, -211, 203, -278, -160, 76, 26, -356, 42, 157, -603, -102, -97, -390, -297, 320, -449, -209, 151, -151, -350, 67, 156, -313, 219, -106, 1, -106, 10, -220, -219, -170, -59, -188, -12, 46, -136, 97, 135, -397, -13, 298, -421, -433, 207, 15, -226, -70, -42, -281, -14, -52, -381, -200, 7, 51, -87, 297, -54, -198, 76, -70, -216, 60, 55, -248, 205, 174, -287, 189, -46, -459, -399, 473, -70, -190, 80, 132, 64, -10, 323, 45, 170, 309, -313, 140, 281, -290, 35, 163, 142, -185, 25, 119, 35, -115, 364, 19, 233, 337, 201, 177, -29, -21, 72, 100, -218, -536, 427, 165, -214, 50, 88, -64, -231, 401, 58, -39, 180, 131, -334, 641, 116, -214, -10, -92, -245, -211, 321, -170, -80, 248, -295, -275, 90, 77, -402, -144, -255, -249, -274, 194, -43, -120, 104, -297, -184, 342, -102, -559, 51, 181, -194, -157, 248, -134, -230, -44, -337, -175, 277, -443, -164, -151, -144, 125, 274, -8, -394, 59, 131, -131, -361, 125]
4067A25k13k73K17K05PJ42k56lL29j00k29P3M21m22k20N78r5m08K92k90j71L40
4089D9K70l19Q5Kk94N4L64j36n66P32j63j26K88Q4l29q9K12l97J13L12J99n17
4111a72P7K75l71L54N3m47M38j9n85N22L45p16M03K46n63j13O10j71l49N3L06
4132A76l84j9R9J40R5q0k40L23m7k50q8L35J58m82J83J61j85K76m9L1J4J26K9
4155C22n06N43o70j16M74j5l35N5K63k12K18K57k93j0k6k7l83P72l36r2l2J04
4177d5j78J82J86j89k05K73j72R7J53j45m3N8K27n43O93l37m41L02M73j78r7j12
4199d1M1j56j4J07k21Q7L92o56L84N07m87q1M25k76k72L37L56k58k18J27k81J39
4221e9R8j0j41Q26q98K77O9l54k57N36J07n13M75j74o5j33K65M59o72O34m30P8
$$ y = [125, -88, -361, -144, 61, 68, 210, -46, -49, 280, 180, -49, 24, 445, 23, -197, 381, 286, -122, 170, -120, -291, 49, 319, 0, 85, 87, -207, -153, 211, 75, -491, 241, 78, -48, 240, 324, -5, -94, 118, -279, -166, 146, 345, -172, -95, 180, -191, 163, 216, -231, 207, 188, -397, 125, 470, -246, 157, 403, -160, -273, 337, 166, -183, -130, 176, -208, -227, -128, 12, 107, 27, -213, 110, 63, -187, -275, 60, 218, -264, -81, 80, -105, 171, 122, 153, 167, 293, 322, -184, 359, -311, -427, 47, 32, -303, -248, 15, -197, 21, 278, -15, -25, -51, -78, -461, 311, -25, -117, -149, -45, -223, -41, 145, -44, -249, 24, -148, -51, 102, -43, -86, -28, 199, -344, 349, 12, -429, -127, 346, 168, 71, -41, 0, -156, -170, -63, -284, -197, 195, -461, -77, 430, -57, -138, 287, 11, -261, 76, 432, 174, -44, 83, -198, -59, 39, 29, -112, 714, -184, 93, 162, -192, -449, 87, 194, -319, 156, -18, -83, -216, 49, 508, -164, 470, 40, 118]
4243A18o1L9k74N37l28k25J28M87n89J89L45l72k83K85k14O6R3O33p10RO30p35
4265b32J40J21J5n18O34j91q1J20J47l0M3l8n0j25N5N6j91J93K58l71O6R6m14
4288b97K99J52J55l56R0pJ02kn5l54M88j82l58M95j37j20J10j8Q2k31q9j03J75
4311a61L0K50k17k20L34o61P93o7l03K08P9j67j08K72L1l22K37L49m85L85n39
4332b82o7L33kj28K0L35k82Q0j15Q9k20K81O1j52Q2K98m12N32l34k73q2L68n3
4355G7k86N51j53k55J20K64m42K64q1j18o5M45j26l44L71k62l78K81O2j31K23
4376A7P4k21L54J8m24o1N78r1n03L40j14%mJ63o4L7j78Jl6K26k24P6J31q3j14
4401a02k3J76l35M49J55p62M44J84l02J39l5P9k42J91j0l78K97J78m03K9L01l5
$$ y = [118, 57, 96, -178, 359, 31, -194, -66, 421, -168, 21, 366, -6, -289, -4, -218, -152, -59, 574, -136, -127, 503, -232, -92, 29, 44, -474, 160, -31, -112, 8, 155, 125, 168, 130, 80, -45, 10, 66, -125, 68, 326, -45, 21, 117, -297, 2, 154, 309, -47, 43, 36, 138, 136, 81, -273, 215, 33, -325, 170, 33, -87, 23, 5, 87, -144, -233, -336, -161, -131, 119, -98, -318, 16, -645, 148, 81, -222, -14, 65, -102, -210, 62, 93, -229, 8, 357, -128, 257, -282, -349, -16, -18, -146, -126, 209, -73, 7, -108, -19, -239, 42, 103, -49, 33, 331, -81, 451, 117, -156, -238, 130, 77, -209, 342, 189, -66, 54, 318, -124, 140, 59, -59, -124, 321, 195, -149, 222, -40, -418, -137, -75, -206, 17, 91, -130, 224, 242, -182, -243, 335, 244, -259, 81, -33, -33, -37, 126, 62, 99, -79, -78, -114, 112, -112, -36, 95, 12, -102, -125, 51, -284, 165, 320, -442, 2, 186, -116, 23, -12, 67, -175, 16, 6, -372, -75, 103, -300, -271, 30, -5]
4423em14P69m67j37L95K6l81J52K33l83K09j03j63r6L08Q6O4K83l86k45M3o3Q0
4446a95j22L50k84L49K05j63qp1L62o30L09j71J30l6k44N25l6J34k85k94K41j79
4468a13J20K82k81N0N1R0l14K22K87n93J57N1k42J45J46L5j7n8j0n8N1k29O0L32
4492A64o6j06j43L63l17L7L90J11p62O1K16m6J30J58J20k37Q9j27q1L89l65rL09
4515B78l04j06J69j0l00L22L2J8j19j34K54l27J56K69l51K10m2l22Q5K42m47K84
4537a43J25l81L93j12P6l27N23J2n32Q40k86j88r4j46pK0m5J02J26L04l29k24
4559b93M22K02k24m8j08L15k61K53k55j50O9K39k39J8J92l29k27L79o8J4K03m23
4581c19L58J12k13j47M14j21l74M1M06j17j44k2r3L91k1K14k64J64n6n32P08m09
$$ y = [-5, -419, 350, -117, -254, 141, 167, -214, -62, 171, -212, -3, -106, -269, -365, -57, 29, 93, 376, -10, -255, -212, -275, -195, -317, 33, -251, 98, 303, 140, 132, 61, 423, -207, 102, -69, 61, 25, -219, 306, 270, 404, 119, -175, 66, -113, 7, 289, 8, 58, 109, 199, -115, 107, 394, -199, -42, 9, -233, -88, 58, 93, 76, 18, 8, -50, 1, -228, -168, 164, 98, -8, -151, 212, -105, -68, 322, 433, -329, -268, -52, -98, 32, 190, 310, 73, 162, 35, -46, 343, -22, -31, 278, -26, -132, 37, 27, -273, 49, 81, 99, -20, -154, 100, -227, -71, 198, -153, 57, 15, -307, -222, 20, -427, -143, -18, -399, -6, -118, -42, -369, 154, 166, -366, 474, 188, 0, -94, -240, -247, -227, -272, -170, -44, 260, -69, -293, 129, 331, 107, 59, -49, 266, 5, 258, 3, -147, -78, 161, -78, -60, 132, -197, -424, -45, -113, -99, 104, -319, 39, 151, -62, -209, 205, 84, -290, -249, 157, 40, -104, -126, -219, 172, 151, 365, 101, 265, 209, -323, 385, -24]
4603b4o9J58Jj79o7K77k65K55K56k09l71M07oj72k0J24k01K29p7j99K58J75k32
4626D9j86K01J57n32M14j3J77m04J73j71K00K92n76J62K44j00l41L24j24q2J1
4647a25K91j05o8k3L6J7K49Qn04K33j53j21K17M0k25L07k86K34k36M40j03l20
4669a97K15j07O8J19m8j0J01j33j71J24L0j63J59J69m4k52j17N09n05L32Q2k59
4691i8j08L06m25K57L2k1m5J88o8O3L05j56k66K41p0k37J77J4J57l50J53J64o11
4714c98K85L00k39J9J84k39k4M77m25j74J55K61k42L85k94j69QN12l10n7j37R1
4736c1Q8qq9r5M81k38j78L40j88k12K26R1l31K88k9o8J34J4j23r4J06j68m12N72
4760G6q9m8K37k37K09l31M7L49j94J27j95j62K66j03k54K64J77j99K93k05L98
$$ y = [-24, -93, 65, 66, -113, -180, 97, -168, 87, 343, 134, -237, 170, 164, -8, -28, 96, -105, 124, 47, -152, 106, 281, 49, -137, 64, 221, -311, 103, 90, 267, -137, 36, -135, 65, 357, -219, -57, 187, 87, -254, 70, -54, -136, -125, 166, 61, -7, -30, 6, 23, 272, 280, -224, 9, -144, -265, -48, -8, -233, 74, -212, 22, -214, 226, 123, -197, 18, -89, -21, 98, 50, 40, 141, 8, -163, -39, -9, -172, -13, 156, 112, -140, -257, 252, -253, 79, 161, -98, -206, 100, -325, -68, -36, -57, -102, 86, 18, 81, 386, 230, -36, 205, 135, -102, 75, 89, 246, -104, 49, 213, -398, -113, 187, -52, -33, 151, -88, -112, 365, -60, -234, -79, 182, -60, 325, 31, -138, -130, 382, 72, 15, -122, -31, 57, 49, -40, -135, 346, 108, -70, 270, 82, -130, 96, 187, -144, 144, 115, 47, 181, 195, 72, -22, 84, -84, -496, 76, -13, -61, 176, -61, 148, -183, -136, 213, 19, 146, -49, -211, 55, -48, -302, -38, 139, -60, 233, 28, 426]
4781D26o46L40j81L24j21l43j04L47J87j50J41j31j45p3K43n21L98J5J07j27p
4802b1K49k11L73n75M9J90k6j01J59k60L04m37M09m26L14J76j41KQk8J5j15K61
4825A68l80J80j93K07j23M26N4p93N88j74j11J84K00J68n18N7N6j89M41k38k28
4846b18N9J88k25j1M27j91m1k7j30j59M94K49n02P9J12k02K48K44k97JJ63k77
4868a6k59L45k29K51Q9k39k85L71J1K73j00j78qq4Q7k55l2L60j02m7J18J89l49
4891h9L24j89J5j19Q2J09j88K86l22K09k8J30P1k04J5k40P3k5K33j54K25j51k55
4914a92L63k57j37M1L79m03K65m3l4j51J92M2l15K00k27O0J9L32l84K24K39l79
4936a66K12j21J86k08L62N4m30K40j43k8J72k15L8Q4J16j20K5jj4K25m21M53n83
$$ y = [426, -220, 120, -61, 263, 142, -201, -305, 42, 229, 79, 220, 89, -56, -129, 114, -407, -9, 6, 113, -14, -21, 228, 17, 390, -185, -136, 54, 28, -73, 86, -174, 130, -307, 102, -324, -10, 166, 25, 27, 35, 7, 22, -93, 168, -212, -32, -225, -18, -141, 285, 339, -454, 134, -40, -151, 33, 233, 401, -117, -60, -4, -193, 248, 10, -218, -159, 29, -196, -207, 220, 29, -12, -39, -169, -328, 166, 415, -87, -8, 104, -98, 150, 394, 97, 98, 261, -16, -275, 70, -159, 92, 181, -58, -343, 28, 39, 312, 212, 34, 26, -58, 29, -226, -258, 102, 0, -47, 71, 260, -89, 235, 46, 61, -58, 24, 133, -55, 231, -91, 118, 90, 220, 291, 87, 102, -138, -65, -90, 143, -11, 214, 63, -192, 171, -86, -223, -182, 197, -206, 59, 16, -18, -169, 23, 65, -250, -50, -277, -217, -198, 134, -250, -26, 213, -166, 46, -75, 111, -97, 265, 319, -111, 129, -14, -42, 130, -85, -47, 37, 153, 33, 58, 57, 43, 268, -153, 300, -283]
4959b83L46K4o8m3L03m41K53Q4k4p2J05j44j99K98qm54M29N2j53qL5k40JL31k81
4984a57J69r7j13K46J41j55j47L57l3k68J65K89k32j38Q7k19L8M2n0J17Q4J60
5006B86l68M19l32k61J91J35j92k19K65N2l76L83K78l29r5J22J40K0l44k7L07
5027E5Nj19l28K18J42J37L9M7k84J32M45r02K56R8Q1m45N31q6l6M4j34j03j93
5050d00O30n63L55K68m36O5k46K08J24K9Q1m12L44J40m18K09N3l51K97J40l6J45
5072B26o0k01L8L6k00R6J23R7j33k1Q2j28NK00l14K0j03K54J15k50J64k81J29
5095a06J21L6r8m3L4J32P8rk19Q3ll2M7K92m04l9L21j90j93M53o30K72jL75J9
5120B96k89O6J55j12Jm41J83L1j22K51J43k92l51L26M98n84L65J36k95o7N1O5
$$ y = [-283, 63, 87, 19, -24, 279, -162, 91, 175, 151, 79, 184, 40, -159, 139, 131, -323, 106, 158, 5, -3, 32, -208, -207, 124, -157, 12, -85, -198, 48, 189, 34, -113, 244, 211, -57, 108, 397, 165, 27, 114, -105, -67, -25, -75, 42, 126, 286, -82, 337, 5, -256, -65, 70, -122, -341, -76, -24, -400, -17, 261, -68, -163, -41, 99, 119, -225, -252, 55, 60, -59, -387, -169, -27, 110, 149, 196, -88, 44, 489, -413, -157, -59, 22, -423, 108, 22, -14, 30, -104, -207, -400, 230, -333, 22, 290, -146, -81, -327, -119, 5, 34, 115, -297, 47, 187, -231, -22, 31, -320, -23, 117, 81, 226, 166, -35, 3, 39, -161, -65, 58, 155, 22, 1, 83, -45, -40, 160, -154, -134, -237, 17, 132, -118, 46, -235, -106, 15, 51, -47, -90, -56, 76, 154, 145, -74, 9, 6, -26, 21, 313, -91, -130, 191, 1, -192, 261, -369, -97, -98, 277, 296, 7, 73, 228, 116, 117, -324, -141, -110, -232, 19, 162, -130, -481, -155, 343, -241, 124, 260, -35, -102, -51, 14]
5142A4j04J48k37K95p6k94K73j16L94n36L28J10Pp6q2j19j3P0r4Q4K01P6m28j56
5166c31M58r1j49J90k16k46L62K18k73K56l58M12k82J00j63l2J53N6r7J91N2m67
5188b57N31k46j53L7J04k31K12o6M6J04j72L7K68J03n49K91k64O6m3J43J15k22
5210a46j39N28k73Q4p3R8n2l49K86j9J54Mn2J36l17j2J26K6K57k86o7l1N1j68
5234b34L32n8j47K92j05m06M32j09K76L58o43k57L47J97k7j52K93o73K7L67k00
5255i0l1J93j76k10L34R5j89M09k28k46j53K34M56m98J82jk07P1n4J70J30j98
5277gj3%j1j16O3K57j88j15N11m93K13p1Qj51K82j8k37m1M65l61qQ5j87L02k08
5302c9j06J39O6J8j23K37k79j6j23M11m47P7L46k3l98K96N7j69J31K01m52K45
$$ y = [14, -90, 58, -179, 116, 40, -254, 19, -97, 297, -239, 89, 199, 206, 130, 48, -71, -84, -14, -108, -24, 177, 253, -175, -331, 127, 36, -113, 77, -139, -385, -23, 195, -78, 178, -180, 232, -50, 50, -113, -145, 8, 64, -33, 158, 210, -257, 274, 28, -125, -88, 16, -215, -3, -69, -23, 81, -91, -54, 214, 317, -232, 59, -205, -139, -182, -39, 76, -146, -285, 243, -30, 54, -19, 79, 27, -322, -36, -55, 99, 103, 51, 187, -130, -142, -16, 10, 267, -19, -86, -117, -66, -234, 98, 40, -107, 185, 80, -326, 106, -3, 273, 631, -12, -269, 78, 275, 248, 96, 389, -284, -257, 110, -90, -121, 72, -104, -314, 20, 115, -74, 335, 107, -139, -292, -58, 398, -100, 82, 81, -126, -55, -109, 61, 191, -7, -20, -20, -31, -147, -84, 173, -15, -130, 381, -112, 101, 30, 38, -113, 169, 151, -86, -127, 338, -23, -31, 54, -133, 169, -39, -145, -6, 60, 78, -45, 192, -87, -103, -226, 185, -262, -185, 161, 138, -260, 36, 93, -76, 55, 256, -196, 49]
5324D9K34k53k84M91k59j35M39m24L85k4k21O9k08J83j5K02L5k47j22qJ88O8k07
5347f4j15NJ42J74n17K90L70p4O4k00o2l74N42j67k46J61K40j70L29k32J21r0
5369A27J63j81k78J40M6o86P04M4n81K97N28l92k66L44J75l85Q1j73k85O16n4
5390a6l09J22K86k14K12N8k37J24j83L8Q7r5M08k33Q1k86K41q9J4J32l74J09K10
5413H6q4n7Q3j68K0J18K82l71qj33L73q0j23r5q6L66k27rL03l19o3J77l02M94
5437A77j53l57N58P1k29l8j95q8J81O01l73j67Q1m4j52q4K2K21O8Q9n27J66M78
5460C06n57Q8K22m54M32k5Jq6o0M34m1j06jJ73m97L14J7k15J91j64j79K10K6j12
5484h3O7K69k14J29l61L78lJ25l21j43N6J8K53m92K39k45K63j2o0j47K59N4l93
$$ y = [49, 283, 30, -254, 237, -22, -157, 282, -142, 243, 219, -2, 67, -141, 42, 27, 229, 264, 17, -105, -113, 75, 143, -64, -179, -174, -32, 142, -375, -85, 285, 211, 275, 75, 13, -361, 181, 14, -232, -71, 169, -1, 328, 96, 217, 127, 290, 109, -169, -29, 17, -669, 35, 79, -502, -205, 323, -69, -335, 9, 184, -201, -120, -293, -578, 38, -16, -325, -203, 83, -131, 81, 139, -98, 26, -157, -119, -32, -127, 281, 48, 129, -157, 84, -5, 9, 141, -233, -124, 86, 2, -55, 28, -140, -120, -2, 280, -91, -99, -232, 141, 61, -62, -157, -243, 123, -104, -113, 190, -129, -192, -15, -317, 177, 24, -333, 225, 296, 67, 29, -166, -254, -73, 528, 155, -12, 69, 25, -127, -211, -189, 32, 100, 189, -338, -172, 306, -251, -163, 59, -395, 37, 12, 13, -73, -133, 301, 260, 154, 153, 326, -171, 143, 160, -55, 136, -28, -207, 3, 29, -83, -16, 253, 39, 168, -193, 185, 182, 307, -14, -157, -101, -83, 170, -322, -83, -328, -65, -77, -137, -284, -25, 29, -364]
5507c64L53j03J09k25O65l10l85M95l09MM4j03Pj35L69r4k08M04k50k10P8J75
5529Gl62K91p3J82J82l9l38K70L1mj69k35M79j47k36m0L30p9J7k41K90K23j38
5552B01k46L6K23k82L01k05m7L11l47n4J40p6l41L03kk20N8M80l26L4j51R0k41
5575c61L26K37l3k52M02k55j58J06P8j00J3J64j59K53n78O33k53n1kj67J2O6k5
5598a04L91o9l21mK65l50M2J60J54k74J82l00K80k13M03k58J68L9l85M08j97J66
5620A83n28N34k50O1J80l90J54K94m78L92l49M53m05P0J34K9k61j59N0J90J0L1
5642e5l69K49k8j02M46m95L82l12K14J02K09m2j14j30J13l19L07l28L80nj39P5
5664C9k14J6L30l47p4K86j64J75j64Q7n5j53N4P2K65j24J3l08M71j80J9L33o61
$$ y = [-364, -11, -114, -5, -230, 435, 125, -260, 235, -74, -70, -26, -129, -122, -257, 112, 18, -190, 214, -36, -246, -168, 7, -355, -64, -137, 45, 227, 188, -150, 120, 151, 147, -22, -257, 222, 75, -161, -201, 129, 50, 67, -174, 116, 339, 201, -45, -9, 214, -68, 233, 28, -19, 292, -55, -109, 31, -45, -386, -83, -85, -305, -247, 233, -93, -59, -210, -120, -361, -35, 202, 169, -83, 319, 64, -94, 12, 90, -10, 3, 167, 8, 261, -317, 316, 63, 12, 10, -157, -145, -79, -104, 287, 218, -103, -107, 158, -192, -150, 10, 164, -110, 72, -228, 52, -161, 242, -16, 152, 191, -194, 214, 17, 183, -345, 189, -61, 0, 180, -210, -56, 238, -240, 152, -197, 256, -149, -79, 55, 84, -177, -336, -286, -96, -86, -55, -424, -175, -203, -305, 141, -354, 28, -284, -70, 32, 241, 199, 85, -45, 68, -251, 56, -272, 108, 103, -36, 39, -175, -159, 171, -176, -250, 36, -128, 47, -117, -30, -85, -238, -184, -112, 153, 29, 42, -266, 205, 25, 44, 377, -284]
5687b84K71r8K01k12k27M71n9j70K87k96L9M8J14J10N6k24M0J4k9Q5m3K41j06
5710B29l01qK19l82L14o5j18J06J37l25J53K73k43J71Q8j99Q1n8k1l02K81K02
5732B32k86J57R0j65k41L72m6q1k14O7J9K11J66O4l60l5l81M25J8L02l23j20J18
5755a1l9O6k5j93J15J91l7p2J60N8k36j62K11l12L68j18k25l12O75j48J13j5n
5778D7J07j25l2K16k17J31j30Q3j53K23k74j28L61m66L85k33J55K66l9j94J55
5799A38k98J69m7n3Q8K80m92K31j17L8J62k96M99n55R6O2o4J66m0j06J36J20j25
5822hR6m38L32K86n34L74j31K95j11j41l48K96K74j75k02K54J05p0L8J69n90N01
5844B72k05QJj13o6J47L03n09k7K99k65rL40n31L64L6k4M0j34j04k41M89O3M2
$$ y = [-284, -13, -111, 90, -122, -349, 122, 63, -107, 180, -116, -77, -29, 85, 195, 251, 27, 67, 81, 52, 137, 94, 335, 229, -72, -80, 139, -243, 71, 6, -112, -6, 131, -194, -41, 232, -11, 160, 248, 49, 130, 72, 51, -251, 30, 232, -54, 103, 193, 28, -213, 159, 113, 32, -182, -115, -96, 115, 281, 345, -15, -50, -431, -6, 12, 314, -9, -129, -11, -50, 16, -9, -202, -87, 104, 67, -5, 155, 213, -23, -185, 26, -286, 82, -36, -261, -573, 102, -46, 67, 52, 47, 154, 29, -3, 213, -4, 127, -3, 80, -73, 150, -124, -252, 109, -357, 28, -205, -50, 216, 177, -17, 138, -160, 9, -38, -91, -3, 277, -215, 16, -101, -63, 99, -197, 302, -253, -157, -95, -159, 7, -33, -139, -3, 117, -8, 88, -350, -18, 268, -266, 108, -23, 272, 161, 20, -328, -32, 242, 67, -135, 119, 224, 154, 192, 361, -229, 272, 67, 75, 76, -37, -103, 44, 347, -162, -189, 110, -155, -164, 176, -355, 9, 45, 21, 61, -73, -177, -418, 71, 134, 176]
5868A76l41J18k17J70M4J90k84K97M4Q0n3Q3k78q8K37j8k38O2J51P6m05K24M89
5891E19j50n07k38O38k32j76K42k4k61K34n0J00K14k36p5j60J93Q9q5M3J4J23
5913B15r1j00O5l2j33O9M1J34J56l41l34K07R5j9M48m70L3J86j94j6J06Rj15K03
5937A22j68k71J64K28k90M31m47L22l30J99M3O2k04L76l56P6J46p9K6M9m0j36
5959g7m9J44K79l16l63L11K24J48n05K63pK58o03M30k81N03k35k40j38K64N2j70
5981a08J11r9J30q4j93r0O1K42J26n17P99o89K63m6J63l3j64L41k6k36K64o4k73
6004a22J62k7J39n8j45K66k58p1K69k21L84j82p6J54m2k38k03J37j22j10L65k15
6026b14K35Q2k88n7O15p23K25m4K40l9k90J82k33N47j30l79K61L11o13L82K9m5
$$ y = [176, -165, -47, -264, -94, -50, 140, -144, 153, 197, 277, 224, 307, 29, -59, 178, 160, -78, -16, 135, 211, -194, 30, 519, 369, -138, -376, 262, 30, -146, 96, 72, -189, 45, -5, 95, 309, 73, -2, -162, 31, 120, 35, 78, 92, 215, 124, 24, 89, 57, -76, -7, 34, 168, 324, -17, -351, -144, -49, -68, 380, -90, -57, 129, -65, -81, 25, 34, -81, 122, -46, -317, -153, 75, -215, 216, -231, 91, -239, -40, 3, 65, -139, 237, -119, -43, 103, 24, 50, 99, 59, -77, -126, 18, 297, -19, -382, -71, 153, 301, -204, 59, 52, 310, -293, 137, -144, 359, 124, -116, -254, 10, 62, -108, 3, -96, 34, -50, -243, -333, -272, -30, 96, -421, 378, -311, -48, -94, 69, 36, -128, 213, 187, -49, 215, 151, -122, 40, 13, 152, 94, -51, 215, -43, -114, 155, -66, 318, 136, 60, 214, 172, -66, -269, -132, -254, -364, 1, -214, 21, 103, -185, -242, 373, -350, -125, -169, 71, 32, -258, -76, -309, 238, 108, -271, -10, 301, -312, 70, 99, 54]
6048E4j74k07L90o0J95k2m9j24k7J84l39Q6Q8m07O63j68l16J00o4R4P1J01l17
6071b48K54J9OJ1L4J40n47M31j81K66m69O58m83O9M60o02K7J42k7K33l43K1K98
6094A69l66J8J30K30lm67K16l19L83J95k12j27J61K54n2l24J85k05J55l56M07
6115G2j4n5k9r4K75J87k14O2q4k21r0M96n4j26j61Qo7J43J30n4k80K61k93M93
6139B91l46j13K41l45J73K80oj26j71L09k90Q1l97N32J26l04K69l74L99k33R2
6160H8o5k04L11j15j50m0L28j11j68Q1k24L24R3k23M1K01P6N0o48M03k55M10l03
6183a00j83J61j34L34k65K09k5K15j32J87M2n68N20l07j1J50k53%L30m06K24j07
6205a19K9q1j33K22L43n03K32O7k21P2J36l29J86J38q2K97j57r5j43K46k10K20
$$ y = [54, -120, -327, 63, 3, 198, 176, 127, 3, -24, 160, -179, -93, -5, -412, 251, 83, -233, -133, -197, -103, -32, 69, -248, 6, 25, 31, 42, 76, 216, -331, 100, -81, 185, -284, 374, -109, -40, 420, -182, -155, -13, -40, 193, -150, -129, 169, -197, -179, -49, 181, 178, -289, -73, -392, -9, 186, -26, -153, 8, 262, 210, -114, 71, -134, 21, -335, 72, 58, 3, -26, -120, 155, 342, 128, 190, 106, -115, -205, 291, 237, 111, -50, -42, -109, 34, 164, 110, -170, 91, -202, 291, -55, -168, 73, -272, -99, 181, 175, 49, -122, 187, -103, -22, -419, 113, 239, -65, 204, -170, 229, -4, 88, 23, -181, 130, 15, -135, -175, 153, 42, -126, -45, -269, 55, 148, -75, -34, 167, 243, 293, -355, 48, -207, 203, -100, -283, -122, -256, 78, -187, 22, -3, 212, 80, 267, 309, -259, 261, -46, -57, 93, -160, -160, 170, -236, -12, -119, -90, -171, -304, -82, 261, -242, -10, 57, -164, -92, 44, -285, -99, 39, -43, 254, 97, 2, -141, 105, -105, 115]
6227A15R3l88M3j41K09J87O8k58p1O2K00l10L33k62J36J02k51o7K70Rq7J1R2j85
6251i0K36J32R3m44J60K22k12J4j06L9j62q5J46J32J17K46o40J10j03J03k4K17
6273A01j51J59J84j66j65L8j40K07p0M0j44J38j50l7J52K37j19k59K27j29j5J24
6295F2j00m9M08l69j66L74r0k2m42K35M77n90K13K93r3k12l4N6l0K93l14j66J72
6318i4J25j43O8N9j33J65o9KJ26k05L33j22L4o0K3k0K3j26j23L64k74J36J27k05
6342A1k12R1j7K62K32k10l91M03r9j85R5K27n3l15L99l22L50j02j79q6N6M73l22
6365A06P9o94N85k74M77k38L7J19k24k29M49R6n63K36K05m08L75j62j1J57K0n9
6387G9K4P2k05O9K95l14j61P7K33j45m6J35j57K9L9o1j6R7j94j91K42n9J47j74
$$ y = [115, 208, -180, -137, -278, -69, 118, 186, -72, -143, -81, 119, -191, 142, -120, 16, 118, -133, -200, 70, 79, -8, 3, 95, -90, 146, 278, 371, -73, 87, 309, 97, 111, 5, 44, -118, -203, -57, 75, 192, 438, -202, -92, -195, -92, -116, 101, -50, 109, 293, 127, -38, 0, -140, 67, -3, 37, -107, 31, -119, -156, -4, 233, 114, -145, 82, -47, -62, 62, -38, -87, 321, -48, -214, 160, 70, 48, -394, -159, 318, -272, -59, 234, 141, -71, -105, -49, -79, 214, -100, -266, -94, 31, -112, -44, 15, -118, 47, -22, -20, 106, -99, 234, 112, 146, 86, 109, 89, 112, -14, -137, 227, -47, 89, 216, 11, -201, -110, -127, 135, 367, 157, -234, 169, 70, -115, -20, 207, 154, -161, 238, -84, 266, 164, -15, -101, -45, 428, 106, 185, -509, 76, -198, 279, 41, 78, 197, -27, -256, 193, 289, -274, -38, 167, -241, 134, -28, -39, 118, 138, 79, 103, 175, -30, 39, 334, 20, -141, -64, 169, 24, -22, 113, -44, -15, 24, -37, -53, 44, -150, -341, -99, -158, -11, -185]
6411a85N14l04j8K30j27p8k02M55k06n1k36M95m23J50k17K97q9JJ81Q3m08R5J30
6434H7k03J03K59j73K1j12O1K09j14M7k13j75J51M57j05m10P2L6j79L25k60K6
6456i0M64j60k32K42l75m36O25n2K85l26J15m4k56L89j28r7M35k23k31K40Qk91
6478a38K64L89m99k74K29K4k18M01l54j7L8K34j83M17p06M56N1j21O9j62J86k12
6500a26j6M34j52l14N53j63M0k21r6Q7k66N98l85j00K97m47k1L82k96J45q5Q1
6522g1j25J6o9K9J82J01k99M01l73ML71l06Q3J3J15j38k82R4K79m6j76K72o7J63
6546A71o4on17N73j20k31K63O5k59J13Mj79J82K31j29k52l6N27m30J12j00J19
6568C7l1K34j71j98L30k16k26K13K06l36P4Q0K96l18O0r4Q9J5O3l06L13kj56K90
$$ y = [-185, 329, 25, 7, 237, 110, 32, -170, 285, 79, 28, -208, 287, -136, 14, -203, 94, 5, 6, 187, 270, -138, -43, 87, -116, -13, 246, 73, 94, -18, 43, 252, 138, 185, -28, -203, -52, 405, 300, -110, -38, -2, -181, 144, -116, -90, 374, 214, -18, 224, -151, -587, 38, -14, 271, -55, 60, 16, -240, 149, 21, -76, 359, 136, -95, 145, 153, -138, 126, 515, 16, -258, -29, -5, -223, 178, -176, -193, -155, 79, -104, 313, -393, 63, 114, -7, 62, -100, 86, -126, -142, 292, 140, -174, 379, 216, 256, 35, -61, 26, -240, 358, -27, -127, 170, -277, -298, 84, -212, -67, -152, -71, -196, -180, -249, -220, -38, 63, -236, 165, -208, -204, 167, -139, -56, -43, 72, -66, -348, -254, 25, -21, -197, 75, 8, 171, 107, 101, -416, 157, 37, -194, 69, 134, -125, -12, -8, -187, -5, 226, 97, -155, -191, 336, -94, 18, -82, 37, 6, 240, 69, -129, 201, -15, -241, -28, 178, -158, -84, -4, 292, -26, 34, -60, 29, 44, 107, -199, 114, 112, -44, 246]
6592B46ok84rJ41o15N43K96k35q7L63m59O5j09N17n31K36O6j81k03L39O2l4k39
6615a18J45k39j09K61Q2J87j9J80j83Qj15p3j24K87l01J31Q5j49J67qj24LJ54
6638A28p9j39J13K11k92q6K42l51J07j8K68n54M41m33L22Om2M10j01j86L46k0
6660B93o93N93j06r3o8l9L03l71k8P6J64j71L67J15k31L44l29P3n5k8j03q6m3
6683a16K17j60l0O8j91J41r8lM43j40l39L22l2k72j43L03m5Q7j77M24j49O1ln3
6707A15j92J44l50J90j88L26N4k01j80J48K39j07L9K4k79j36J36k1L41j32K99
6728B69k07j49K62k7k13J01jJ34J8l78k9J02L42n59M23L8m1K82j99k87L2L9J47
6751I9j30J35k46K5J64j23j31K81R4J35k57J17j28k56J40L2j9K70n18L08j97K50
$$ y = [246, 240, -44, -53, 88, -527, 16, 312, 77, -10, 353, -106, -41, -150, 367, -164, 72, 138, -43, -246, 93, 155, 121, -118, 27, -212, -321, -60, 22, 209, 190, 370, 187, 195, 80, 7, -117, 170, -131, 0, 85, -64, 103, 95, -29, -26, 128, 49, -90, 23, 234, -58, -144, 98, -253, -146, -164, 104, -450, -9, -442, -120, -114, -156, 254, 153, -33, 313, 293, -400, 193, 87, -6, -74, -113, 190, -181, -209, -133, 31, -140, 227, 342, 111, 455, 126, 199, 144, 116, 13, -73, -116, 101, -59, -89, -21, -212, -71, -169, -172, 271, 131, -208, 114, 82, -190, -333, -30, -75, 12, -165, 259, 110, 171, 168, 115, -77, 67, -283, -93, -281, 45, 99, -102, -282, -134, 105, -2, 37, 61, -218, -354, -218, -239, 102, -30, 269, 62, -87, 175, 148, -65, 36, 35, 169, 187, -191, -220, -118, 224, -335, 88, 126, 85, 367, 168, -119, -87, -48, 99, -31, 104, -142, -117, 47, -76, -207, 74, 168, 303, 46, 163, 35, -221, -81, -49, -68, 202, -316, -8, -205, 45]
6773D5j30jJ93mJ43k59J21l92M20J84r0l14L1K52o0m90N32j42L3r1j26j02K03
6796d4k90K81J41m1j77L53j0K33n43J04j02K0Q8Q4j73K02M9j47P3J00j76K13n82
6819c44j86N08l30L26J08o4k14J47M04k56j43N87n67K84j89j60M24k94L55k33
6839A63k36o8j1L50J86n61M08K2l2k29J47P1k44j81L11m24L63O2j37P0o0M0j60
6862a50O2J5R1m71L97j41O0J93mj34K95l55R2L4J13K6j22o5J00m4Q8k60L8J4L13
6887A85M6N1j60p5J46k04J85l3J24k80M58l34j90K51m10L88k17K97J23p22K96
6908g5J16r4j67J1L23O6k76J21l89L45Q1j76K28J04k44O5j33j17J05K22N2M22
6930E90m68j30j04J93Q5q4j7q3k35K54K0O7J03k13l56K68K65r6n9K77K43n60j45
$$ y = [45, -85, -86, 107, 103, 246, -13, 108, -284, 136, 320, 230, -84, -53, 199, 139, -351, 181, 39, 72, -19, -145, -247, -44, -334, -53, 88, 47, -130, 223, 213, 446, -97, 7, -95, -75, 13, 97, -76, 126, 175, 28, 101, 201, 25, 238, -344, -530, -22, -352, -26, 82, 18, -196, -49, 355, 99, -44, 543, -24, 260, 71, -89, 335, 41, 396, 163, -73, -141, -152, 198, 384, -177, 231, 253, 221, -8, 139, 210, -34, -215, 96, -328, 35, 97, -40, 30, -30, 10, -150, -88, -73, 18, -453, -56, -197, -137, 56, 52, -82, 213, -142, -50, -16, 97, 123, 1, -64, 36, -8, 80, -180, -142, -128, 185, 231, 282, 122, 47, 193, -11, 174, 141, 265, -15, 443, 109, -81, 170, -240, 148, -69, 228, 351, -371, -75, 41, -53, -220, -209, 114, 180, -96, 25, -364, -19, 62, -114, 114, 218, -26, 39, -94, -211, -106, 116, 168, 590, 122, -8, -112, 81, 166, 82, 65, -18, -253, 1, 21, 88, 191, -22, -378, -110, 155, 59, 0, 277, 520, -40, -185]
6953a85L86k35L1K16k09%J53j50n7N8k3M21r6L8n82K46r0o7L68k98K8J08j44L62
6977B79m40J32m57M16J01J50j8K51m80l2Lp1l3j14K20J22J32j47k37K40j22M05
6999C00k53k16K51m72L71M1N9k66jL70j26k16J70k41mNK52j17J42l4K32j22m55
7022c30N31n28N49k68k90K39j20K71k80N86l46k32K62l31N4J3K63J49j87L3k91
7043b53L32N0k45%k0QJ60K24l15j8O06l87J13k84N1K6n0k60J72N0N7k23l4O75
7067D35k88Q7k12J50k33K50J16k57J85l69K18R9j75l29M34l67l4K91o4o6J29j27
7089a27j24o0K63J6N09m30J2l11J08K02J08j73L6Ok76K1N00m36r8J81n23L85N36
7112C25o50J57J79j46L65k44J4K6j03J10k40J36n7J13l80O57l47Q6M67m09j15
$$ y = [-185, 201, -34, -3, 213, 4, 4, 157, 7, -50, 8, -15, 406, 310, 348, -234, 12, -78, -145, 223, -75, -47, 61, -83, 279, -161, -29, -486, -70, 31, 181, 163, 414, -66, -98, -95, -166, -199, -313, -93, 29, 161, 14, -223, 17, -105, 300, 47, -169, 82, -390, -19, 22, 81, -185, -186, 184, 58, -158, 12, -229, -233, -228, 24, -93, 49, 15, 247, 125, -330, 201, -327, 222, -46, -336, -97, -217, 54, -226, 360, 14, -218, 44, -287, -233, -220, 43, 192, 5, 38, -253, 79, 129, -116, -116, -136, -128, 32, 256, -59, -77, 529, 142, 255, -29, 22, 48, -2, -262, -90, -40, 17, -206, -240, 435, 147, 234, 22, 172, -61, 189, 305, 48, 233, -136, 82, 181, 6, -323, 111, -256, -290, 1, -63, -129, 0, -127, -251, -311, -48, -32, 477, 47, 59, -252, -144, 58, 166, -7, 29, 35, -241, -220, 280, -156, -254, -73, -596, -211, 325, -325, -168, 11, -135, 230, -14, 0, 26, -77, 33, -207, -71, -128, -15, -395, 262, -85, 1, 468, 59, -56]
7133e6Q5k54K18p1J7j1l7Q4j82M00j92K45m23j64M16k35J12k8J87l08O91l58j13
7156B3L0j44J13j46J75J03k89M49l57K14O3k26J03j15j28j4K87k07q3L11L8j97
7178CK4j02K04k62J9O3J39j55RJ03k68K42j99K64k29K11j41J92l0k71J83j39k15
7201c55M08k72K55N5j04K2Oj06R8j97M46m52J23M0j35M77j9k02l34M41m21M44
7223B18j33j26K24j79%r9q6J90J04j24P7L08m46O6L0k86J61J43n3o3J70j06k2
7246c2M4o4L5j93J16K64j24J27j73M3LN7p7j72J32n1l9P2p7J67J46k76K55j02
7270H1k88J59n4J97k11K20m00L22J67k6k09J27J31l08L40k07r1q0J98P7j99k0
7292g4j40K12K38o11J84L50k53R5K23k48K20l41k26N27j71p1J08j50K9K75m0j04
$$ y = [-56, 29, -225, -7, -78, -61, -72, -109, -25, -207, 193, 1, 246, -177, -341, 75, -160, -48, -76, 111, -197, 494, 136, 23, 53, -91, 22, -124, 51, 154, -135, 314, -43, 171, 234, 8, 111, -4, -132, -146, 141, -66, -149, 162, 200, 3, 27, -75, 129, -133, -114, -51, 88, -67, -58, 45, -223, 19, -180, 84, -145, 66, -75, 117, 87, -184, -1, -140, -355, 53, -219, 36, 91, -13, 9, 15, -91, 7, -190, 256, -196, -73, -33, -168, 309, 290, 88, -246, 195, -226, 218, 85, -41, 183, 4, 4, -95, -181, 9, 113, -11, 66, 374, -72, -6, 24, -262, -101, 42, -11, -74, 96, -10, -32, 12, -52, -17, -210, -94, 170, 46, 173, 0, 43, 46, 103, 26, -146, -14, -65, -104, -32, -109, 58, 204, -72, 183, 81, -207, -48, -102, 95, -116, 104, -296, 26, 193, 167, -42, 85, 216, -92, 248, 41, -50, -130, 68, 145, -54, -74, -214, -2, 236, -375, -191, 159, -94, 1, 224, -24, 196, -145, -371, 156, -15, -86, 22, -128, -99, 176, 136, 32]
7314C2L15n28L06r0k80J05L01j36J95J77m55q1J39j6o4j11p1J88J67j84K42j51
7336@j52J3J47l14J13L29m72N85k98NK2J45l06K79J20O3k85l7J84j72o7J18l7
7359a7j15M24ll49J59l03M27l5j96k71M54j21m1J74l22K64l06K73J46l36K60m71
7381c05K32l4K10k88L83k92J46j99k52O16j53K82o03J01j6J22K6K64j72N5K52
7402C75n37K32J6J07m05M23P1j86j69J37r4J19L10m13J49n7q6k10J05L57j46j97
7424i9J75l83k7K72K18k16L36m53J27j79O0L77m39j98N86L6k13J51K0k42K15r3
7446C1%m1J04k48L6J55L4N6n3p5j04K6N2j9K85j01q3O6k63L66M9m39K8L24j2k87
7472a13j04M43Ol22J90j0j67M5K09j80k23M05k43K51Q1n42N67j43k81q1J06K75
$$ y = [32, 347, -181, 125, 35, -245, -140, 161, 25, 220, 397, -58, -139, 0, -16, -80, -191, -262, -74, 93, -91, 151, 0, -152, -139, 8, -306, -193, 136, -336, 249, -49, -44, -22, 123, -183, 96, 216, 279, -6, -43, 141, -31, -98, 20, -17, -132, 292, 289, -60, 99, -204, 223, 188, -8, -279, 175, 54, 13, 187, -135, 129, -177, 96, 242, -94, 166, -305, -73, -107, 103, -185, 198, -94, 52, -147, -399, 217, 64, 346, -257, -156, -172, -50, -24, 240, 68, 123, 375, -162, 70, 86, 193, -212, 211, 282, 96, -73, 64, -30, 89, 399, -14, 135, 78, -8, -218, -113, 244, 98, -99, 76, -307, -334, -62, 156, -60, 276, -177, -50, -229, -169, 208, -231, -429, 157, 193, -20, 131, 151, -91, 124, 31, 31, -10, 94, -154, -118, 37, 71, 127, 74, -1, -105, -79, -27, -46, 239, 138, 55, 121, -142, 224, 273, -166, -138, 186, 174, -113, -217, 226, 232, -90, 100, 90, -77, -32, 177, -3, -226, 179, -64, 187, 268, -274, 293, 150, -131, -212, -106, 169]
7494A69J77m55j20M61k90j38K97k97L53k63N7R9p9m7L69j51j79j18L11O2Ok4j16
7517H4j45R9K04j17o2m0j3J30j44m9K06k03K84n16J51p7J70K62L0j90R7l46K01
7540A6k41J23K09j01K42j99l3ml82N79o8k25n8L12k2p8n1k7j61J47J96J16k93
7563cj56qM36j53o6n0j53K25l04J34j21K30nk07L96l04j83N07q7j88K93k91k62
7586c20o6J58K92PJ97k59q8jk43K38j11L13j51M5o1Q2j03k3K41k11o2q3J08m5
7610a46k61N57j98k8K51k00j45K08k08K23m6J29j92J08j84K6j71L15j07l24L46
7631d7j32J26J00m34J69L64k18M1k83M75m1j84j16k3j85M10j62K42K00o29J92
7652a35J18rK26j51P1l12J22K28q9J13l68J03L0L36k77j77K10j80P9L3j3j56M15
$$ y = [169, 346, -109, -229, 232, -58, -196, 101, -196, 157, -106, -49, 50, -29, -76, 293, 142, -37, -155, 156, 218, 224, 200, 84, -61, 38, 242, 125, 63, 23, 10, 140, -4, -53, 153, -50, 234, -282, -131, -208, -38, 224, 254, 64, 161, -185, 16, -225, -102, 107, 6, 248, 49, 16, 12, -370, 209, 141, -84, -142, 170, 148, 70, 19, -8, -169, -22, 174, 290, -3, -159, -167, 269, 116, 50, 0, -153, 72, -232, -98, -219, 11, 6, -201, 195, -109, -292, 215, 128, -60, 233, -58, -320, -386, -228, 64, 71, 268, 9, -79, -80, -323, -85, -196, 117, -34, 11, -50, 32, -71, -94, 147, -64, -126, -209, -101, -146, -407, 150, -48, -76, 175, -25, -170, 38, -170, 53, 7, 136, -56, 52, -132, -106, -277, 38, -69, -393, -47, -179, -53, 47, -387, -218, 146, -72, -31, -314, 161, 120, -64, -180, -203, -388, 22, -140, 102, 302, -327, -135, -17, -26, 200, 49, 120, -192, -70, 158, 69, 182, -186, -83, -53, 283, 6, -171, 39, -141, -62, -29, -42, -198, 217]
7675B17l01O9Q0j66J0N6j83J49J02j42K25j45K4J13j01M2k24JK06k18K87J09m0
7698A70q2J87l57k2J61p4k0K54k30k5L70m02J09K33j58m9J07K17n08L41R8l16
7720Dl35J56K95m6n0K48k79q7K49j1k21K08n5j59J01j24J67J07r9MJ14n0o7k86
7744b16J51J22m23L27K35j8k15k45L64k25K10j85N3P5m5J29j91J47j16j33j09
7765c08M23J68o27K87o5J61pJ22K4j86l2K09k65P3J58m47K66J51J9L5K9j02k05
7788a19j94P80o48O7J12J7k19N11k14k39J8L28n25M68k12Nj4r4J20n6L38r9k0
7811A11K5m24K88J69k71J17M6j68R1J45Q2l10J90l19J7mL46j09l75K20K7J33l
7834B4J09k45R2J24j55p7l5m0K78J92r5l99K84k14J7L06L5q2j16o9N2L2L25n52
$$ y = [217, -84, -15, 65, -101, -91, -35, -218, -69, 33, -109, 116, -29, -5, 108, 7, 49, -175, -174, 32, -186, 101, 210, 170, 88, 275, -82, -104, 57, -17, -37, 217, -13, -38, 332, -70, 39, 272, 114, 65, 172, 389, -119, 222, 320, 4, -331, -175, 120, 74, 24, 272, -7, -94, 155, 144, -77, 131, 76, -83, 18, -106, 61, 168, 69, 73, 187, 137, 70, -216, -65, 57, -366, -39, 196, 178, -37, -282, 82, -143, 67, -118, -65, 10, -35, 94, -97, 50, -66, -199, -308, 115, 283, -344, -57, -122, 39, 32, 154, 178, -8, -40, 169, -96, -23, 135, -312, -46, 105, 124, 159, 188, 86, -119, -313, 467, -181, -114, -2, 15, -204, 307, 93, -146, -128, 200, -325, 143, -69, -64, -78, -172, -52, -108, 230, 131, 111, 136, -288, 0, 169, -102, 15, 61, -107, -16, 129, 211, -99, 91, -228, -211, -215, 131, 22, -353, -133, -106, 27, 24, 133, -112, -20, 104, -51, -128, -163, -203, 75, 267, 172, -227, 57, -157, -140, 166, 201, 119, 3, -66, -14, 18, 343, -209]
7858b09K37k66L26q7N6lK29k81L05m54n0J64J18LJ0j25K39l39PK91J67k76o9J46
7882A39J82k37k41K53j50L4K18l72K01o0l7L01j22M4k30Rk1J08j7J58l88L02L1
7905A05o7l09L48Kl75L85j5Q1J11k43l5jj49J48J97j50n3J6k81K02j23k36L43
7928i9J41K4LL5k69k2O0K21j5k27k79M89L5l18K65l2j05K67j28k33L43k46j3K22
7952A19Q6j09p4J37j69M5L6q9J58l06J03r6L64k11L82n77J37n1J20J69j28l66
7974c20N31P3m7n12K91K07l01nj20J60K09j61m4j33J84j81l8K97k5m12L69Q1k62
7997a59L1k24M91k78L4R1J24qqq3j84L7K72L6q5k40L2J65ln1J90j43j68L38k73
8022f6r6K20l17J63r2o8J31k5K36l88M01k05o8R1n5L28k09P4j01r4J77J25m7k78
$$ y = [-209, 28, -238, 88, 1, 57, 54, 283, 2, 307, -147, -197, -33, 85, 88, 98, -27, 212, -127, -120, 171, 338, 62, -7, 139, 321, 84, -157, 96, -54, -20, 198, -174, 27, -33, -70, 231, 109, 153, -77, -68, -89, 19, 2, 160, -228, 74, 105, 38, -271, 77, 79, -296, 89, 74, 155, 266, 23, -12, -13, -162, -14, 183, 33, -20, -4, -285, -83, -206, -442, -99, 42, 66, 69, 104, -165, -187, -127, 94, 79, -148, -427, 62, 97, -221, 44, 12, -93, 174, 46, -187, 156, -90, -103, 119, 205, 96, 22, 159, -10, 35, 71, -18, 140, -166, -63, -159, 205, -6, 376, -201, -64, -115, 5, 174, 46, -320, 211, 284, 237, -275, 16, 223, -78, -83, -203, -43, 166, 5, -39, -172, 12, -169, -207, 90, 65, -347, 22, 103, -159, -128, -352, 139, -139, -105, -14, 110, 102, 94, 11, -173, -136, 136, 172, 87, -153, -121, 44, 41, -10, 180, 37, -131, 207, -66, -162, 58, -259, -96, -188, -256, -125, -150, 86, -302, 99, -106, -174, -83, -138, 190, -19, 55, -46, -140, 37, 162, 115, -163]
8046a63J97k06J18n6K14R2k38P9q6k9J7K8J52j76p0O8k6J43m9k27R0O12m82j51
8070a49J1j26pL17O6k20n9J94m08M74j26%J47j2k47N66l80l07L49m7L5k43L60
8093A88q4k49K00J82J15m82M7Q7mJ63l51M27m5k20J82k22M0J55N1l59M7K91J54
8116C13m56K78j43k62Q5n2K30j53R5K19j07kj08N3K15l4k55L57m78N89l00k42
8138a58L50k24lj58O07m11L19m56j5L97k73K01j57j43J50K38l97nJ37k26N42M4
8160C59j66k08Q1J76n22K26M7L7j4J26n8K06p8j13p3l38K41J92k74J53P7J07j55
8183B9j23j50M57L3l30K41K0k58
$$ y = [-163, 34, -172, -54, -110, 104, 196, -42, 37, -49, -78, -61, -33, 119, -57, -127, -59, -85, 58, 9, -218, -128, 484, 2, -149, -138, -264, -271, 46, 112, -108, -167, 27, -381, 93, -33, -33, 114, 102, -145, 421, 41, -266, 83, 36, 71, -172, 188, 104, -145, 55, 237, 352, -130, -83, 4, 0, 163, -188, 239, 194, -26, 156, -66, -26, 129, 180, -179, -132, 159, 313, -143, 135, -8, -270, -185, -237, -7, -160, -65, 154, 47, 45, -63, -10, 205, 171, -84, 273, -205, 384, 84, -158, 192, -32, -35, -193, 414, 3, 322, -134, -149, 248, -25, 176, 19, -124, 26, 264, -133, -138, -1, -227, 315, 359, 193, -15, 66, 242, -280, -54, -7, 30, 16, 142, 84, 290, 212, 99, 26, -312, -71, 121, -153, 0, 77, 184, 29, -94, -244, 213, 246, -84, 157, 177, -81]
8191h1
$$ Imaginary data points
##PAGE= N=2
##DATA TABLE= (X++(I..I)), XYDATA
0@%%%%%%%%%%jRj6J6j6J6k3L1l2L8m6N4o2P1q4R5j07J22j40J60j79K01k26K54
34A35k85L16l51L92m34M79n33N93o56P26q04Q91r89J100j227J373j544J747j994
53a065K301k693L217l959N096p083J1608m6171J3159L5674l1518J1482Q144k0069
67b1877l397K4052j0527K160J6193j7656j5828K9771Q82k5026J2004J1409k4028
80b1868O636K1818j1981o846J0926j6512m601K8853k51j8864J4549J425k4928
93b1644J0452K2920j2233k450J0190j4695m127K0945o895j3299J7843p19k0758
106a4470J5039J6186j9198m348J1077r809J414J8740r000j0124J2273q548j5411
119a6179K2598J3586k0877L61J0915j3850j620J7541n300o401J0254q751r166
$$ y = [0, 0, 0, 0, 0, 0, 0, 0, 0, 0, 0, -1, 8, -8, 8, -8, 8, -15, 16, -16, 22, -24, 30, -32, 39, -45, 50, -57, 65, -75, 85, -94, 107, -119, 135, -150, 166, -185, 207, -227, 252, -281, 312, -344, 382, -422, 469, -520, 580, -647, 726, -818, 929, -1065, 1236, -1457, 1760, -2199, 2897, -4186, 7422, -38749, -25590, 10084, -21434, -9952, -1808, -21877, -25274, -1222, -11749, -9589, 6604, -11052, -26880, 2891, 3773, -21253, -9249, 2160, -21868, -15232, 6586, -5395, -12241, -1315, -17827, -22428, 6425, 6174, -12690, 1859, 3284, -21644, -11192, 11728, -505, -2955, 7235, -7460, -11587, 9358, 2463, -10836, 7007, 6288, -14470, 569, 16755, -2443, -6791, 4286, -5523, -4109, 14631, 5631, -4493, 7780, -768, -16179, 6419, 20005, -872, -511, 10404, -3446, -5066, 12475, 7175, 774, 11028, 2277, -6889]
132f889J8736J314k0926Q010J1309j5379K655J7265j1360r810Q724n149l096J9285
146A4689k142j7141Q718M065j6655Q682J7148j1741p933R995p122m425J4207m282
160F063j2326J2026J196j4085J0128J0804j7119m384J2832m295j665J2516o528
173E163j1033R040j918q182J5164P174j8334j311J1575q740k416J3410m993q260
187c661P774k407o582J2372K85j6185O271J1690j0736r1J3067r849r728R863R50
202C033l919J1744k578j4913O766O229j0423N422J2551j1255q537J0495j452n277
216b114R510k524r898Q531L979j0396O132Q182j4561l388J4229k180n151Q267
230H618m270r963Q114K583o771R342L852j6058MJ2690o426m153J0479l534r235
$$ y = [-6889, 11847, 13161, -7765, 245, 11554, -3825, -1170, 16095, 4735, -5075, 3649, -1500, -4596, 14689, 12547, -4594, 4124, 8189, -8466, 216, 17364, 5623, -2310, 7685, 563, -3862, 10345, 6063, -6263, 5763, 6959, -7126, 3002, 13806, -3313, -7697, 5135, 840, -825, 11691, 5163, -5870, 3170, 1252, -6930, 8234, 15408, -2926, -4237, 7338, -1402, -3818, 9592, 4599, -3661, 4113, 1706, -4876, 7496, 7781, -8404, -2133, 9557, -1179, -1270, 11797, 1948, -7780, 2083, 3033, -886, 10858, 8280, -6633, 133, 6362, -4061, 1361, 13912, 2657, -5880, 4615, 3163, -2114, 7396, 4872, -5026, 3505, 7484, -2912, 3220, 11402, -3159, -6547, 7682, 5502, 351, 8618, 4348, -5615, 2499, 5082, -1689, 7653, 11505, -4553, -4549, 8141, 1715, -2438, 8041, 4507, -4728]
245d728P572J507o520O969P64j2836N679J1596r663k191R513p608q438J0668K787
260E071n564N257j990j0915O239P577r137K233R049j0157o548J1358k13p004N789
275A045n66p909P081M583r097L052N989j1574j531J3773k909p552O072k175q038
290i756P381M893p340L921L050j1940J336J2484o077n578Q777k635q283Q090K669
305I92p180L566J725q356N057R608r037m018Q959n094o868J0757L289q217K503
320b314J184q026N518P367q001m37Q019p759m585J1332K15q468M218K153o468
335f052N238M902q148J071N585p890o98J2009l057q993N742Q75o437O351M501
350D999o937R02L390p209J307J0476n933o306P936k91p284O798L646q287J703
$$ y = [-4728, 2844, 4351, -2169, 4800, 5564, -7272, -1593, 10003, 340, -1851, 7662, 54, -8384, 2284, 5071, -493, 4764, 2774, -8141, -1902, 5675, -3462, -1229, 7820, -2337, -8885, 2473, 2260, -4744, 1045, 479, -7430, -349, 4234, -4863, -1811, 4178, -7396, -8927, 4846, 1937, -5615, 457, -1718, -9756, -2375, 2518, -4822, -901, 2149, -9791, -8455, 4029, -2048, -7626, 1151, -1484, -9767, -1677, 992, -6188, -2622, -897, -9253, -4196, 5412, -3625, -7643, 1316, -3778, -10646, 111, 3400, -4817, -2314, -1130, -9156, -3638, 3729, -4272, -4709, 3310, -4449, -9034, 2298, 2513, -5955, -1737, 416, -6052, -814, 4088, -4060, -2989, 2596, -5294, -5992, 6017, 2960, -6033, -291, 584, -5853, 498, 4999, -1938, -1036, 2354, -4855, -3548, 6928, 995, -5311, 2625, 2334, -4950, 1848, 5494, -2793, -1090]
365a090L752n907L341P799q301m299Q364k474o026Q841K726r591J553L581n479
380c210M185N831q327j046P361n282m149J0178m57r715L867M414n603K479M575
395E101p186j15N791n128j113R705m232r011O256L147o151L747M740p443o41M862
411B329m781N74Q146n935o474P765J341p130N346L328p870N34N340m154J305N610
427E274o921m198Q654j197n780O873K048r235J189O513m263J330M119o633j579
442c806P428k842m461Q013o73r007M235N810n659J236L998n857j175O305l088
457D57j858O983l442p953P251M293p190K776M182p037p38O570k909j199N350m626
473I10n455Q113J767p047L661L602p296N6P016m102o57M370m689l642P945m36
$$ y = [-1090, 2662, -3245, 96, 7895, -406, -4705, 3659, 1185, -4841, 4000, 6726, -2865, -1312, 2269, -3210, 975, 6806, -1521, -2567, 4794, -488, -4637, 5541, 5084, -4631, -764, 3650, -1953, 526, 5101, -2085, -2200, 3591, -1537, -2650, 7055, 2823, -6188, 68, 3215, -2936, 811, 5551, -1892, -2533, 2329, -2452, -1878, 6268, 333, -6141, 1624, 2965, -4165, 1181, 4509, -3361, -2827, 2513, -1641, -336, 5274, -1647, -5845, 2809, 1612, -4168, 2705, 4753, -4482, -3293, 3220, -1043, 287, 4406, -2227, -3806, 3622, 780, -3681, 4332, 3659, -5348, -1113, 4697, -962, 274, 4272, -1585, -2760, 3545, 457, -1401, 5582, 2140, -5813, 1438, 5731, -1459, 1317, 5499, -1538, -2276, 4294, 1385, 186, 5536, 910, -4545, 3568, 5335, -1712, 1949, 5551, -1745, -1689, 5327, 1225, 568, 4938, 249, -3393, 4552, 4116]
489D116o245N457J533q007K471O590m211j542L603m278k170P309j811m581N563
504C797r9q688M834O428o431q90M310m532j409O150k160l540N330k241o101N898
520F56M495p375j75N443n295j160O778k532l688M395k868m074P248J500p273K494
536a431L861o573j00P055l101l055M080l211k420O210J9o590M125K801o977K071
552c236P077n194l102M112k327j384N649j014n538M330J024o761M275O136o322
567b275k251N405l001k180N926j407m226M553j076m684N384L041o926q4N731l528
583a598j822O300k138m352L590o01l405N798J785p118J699M609n431j34O801k676
599A307m414M341q16k928M793J74o120L527L334n204R09O222n061l925N090k46
$$ y = [4116, -2129, 3328, 4861, -3146, -675, 5915, 1704, 162, 3765, -513, -2683, 4626, 2815, -1766, 3797, 3698, -4990, -156, 6272, -159, -1049, 3261, -1271, -2680, 3470, 1310, -2230, 3100, 859, -5242, 656, 5151, -2224, -2399, 3044, -2251, -3411, 3367, 835, -2853, 1542, -1326, -5400, 1848, 3348, -3925, -1431, 2430, -4143, -4243, 2812, -289, -3344, 736, -2475, -4895, 1315, 1334, -5256, -1131, 1670, -5307, -3236, 3841, -1353, -4455, -343, -2670, -4054, 1595, 581, -4957, -627, 397, -6364, -2089, 4047, -2275, -4526, 879, -2122, -4302, 1624, 217, -4009, 544, -532, -5216, 168, 3209, -3717, -3801, 1930, -1598, -3420, 2880, 742, -3610, -20, -621, -4026, 1772, 3557, -3561, -1862, 2747, -2684, -2818, 3983, 1307, -3107, 1234, 418, -2510, 2283, 2457, -3663, -136, 3198, -2006, -1097, 5125, 64, -3861, 1229, 983]
615I83k608M839p97n767L760J687m998L326N068o240k165N471j386l052M414o89
631A846m629L962R12m505L555K882o836m7O318l012k115N034k062m763L419J238
647A197k981M126P47o416Q92N538m480j005N933k898m386M211J030l542L072M57
663A495n231K933L825m651m7N000m532l523N885R98l720L068p8n250K816K801
679A789l833J834M101n579k494O553j328m059M196L23m271L032K089m273J886
694c4K836n492Q0O852k690l870M839j519m442L856K471l284J923J212n356J419
710a199N106l740j768N663k375m369M605J706m610K164J408l757J800L816m232
725B18j316M885l511l182O180J007n099K639O06m342K528L087l116l6L802m652
$$ y = [983, -1625, 3214, 2417, -3350, 410, 2097, -2901, 425, 5493, -747, -2912, 2559, 1173, -1879, 2535, 1846, -2783, 1179, 2091, -2414, 1141, 4023, -2813, -2860, 3458, 446, -1669, 3365, 1303, -3460, -41, 1197, -1784, 2342, 3089, -3327, -2435, 3103, -1377, -2382, 3551, 653, -3733, 478, 1508, -2034, 1038, 1495, -3736, -803, 3022, -1629, -1676, 3324, -1208, -4731, 1154, 2152, -1568, 1500, 1422, -3828, -1012, 1789, -2044, -210, 3891, -1688, -4182, 2371, 1043, -3016, 1180, 1503, -2768, 264, 2353, -1920, -34, 2802, -2690, -2610, 4242, 1552, -2318, 2521, 1002, -3440, 416, 2887, -397, 1526, 2738, -2618, -1199, 3907, 167, -1601, 4062, 1687, -2682, 1923, 3629, -981, 1183, 2591, -1166, 634, 4450, 218, -1098, 3787, 276, -2906, 3274, 4281, -818, 1821, 2427, -1915, 613, 3700, 584, 548, 4350, -302]
741c02k021O240j269m311L361J372m524K489K507l816K45K468l605J19N634k488
757B099m449L882N0m367L454L052m206M15K123m098N22M778k863k751M752j024
773A369m515L853J911n119J275K563l343J269L874m519j774M508k415k749N420
788A608J095o093J691K151l363J176L849l530r67L749l628j705N381q28m755L376
804g93K275m645J757L005m182l21L571k732j87M800k812m632M348P89m014L148
820f25K971m097o38L059k868K37M057k658k710M452n46m257L671K271n091O88
836b084M008k577j72L207l643j946M814j437k643M573N20n974J728L908l265K96
852f87L302k725j645L554j770k037M409p68m482L201K824m297L57L295l672p61
$$ y = [-302, -2323, 3917, 2648, -1663, 1698, 3070, -1454, 1035, 3542, -274, -29, 2439, -1166, -1047, 4587, 2099, -2350, 1532, 1582, -2785, 669, 3721, -485, -70, 2053, -2045, -1523, 3255, 392, -2359, 2393, 1369, -3146, 707, 2618, -2501, -1226, 1337, -2006, -737, 3137, -1382, -3156, 1352, -1063, -3812, 1608, 2703, -3390, -1699, 452, -2911, -1735, 2114, -1416, -2383, 1366, -2262, -3967, 1414, 586, -4169, -793, 1482, -3163, -1406, 1599, -2583, -2904, 667, -2065, -2252, 2548, -264, -4896, -548, 241, -3773, -625, 2346, -1751, -2389, 670, -2198, -1961, 2096, -562, -3272, 1180, 634, -3623, 48, 2319, -2772, -2084, 1924, -653, -825, 2382, -1261, -3207, 1607, 170, -2473, 2100, 2620, -3354, -1626, 2282, -983, -687, 2615, -110, -1755, 1799, 29, -2008, 2401, 1633, -2849, 352, 3176, -1121, -764, 2531, -1141, -1902]
868a902L880j645j319L619k131m192M128J897m077K027K949m754n53L842k212
883d43n99L691k324l203M587l8m236K662K183m552L83M418k315j357K723k444
899h64k123M554p12l101L711M05n213J118M437l219l95L102k237j986L548r47
915G8k710L869l91m203L267K948m419m41L294k784r17M361j590j977K686j349
931b78l311L825K311m325J081K983l967r95M072q37k207L221j188k713L842J42
947A656m233K264K752m040K7M757k382k572K933j300j552M197m14l207K471R37
963B294m546J677M293l225j723M041j540k553L288l91k558K884K31l703K722K695
979C886m212q22M348k516j577L705k62l379K200k72k681L350J763l924M81K845
$$ y = [-1902, 1978, 333, -986, 2633, 502, -3690, 438, 2335, -1742, 285, 3234, -1520, -2073, 1769, -443, -1042, 2649, 325, -2878, 1709, 1671, -2565, 97, 2280, -2272, -1889, 2529, 214, -1143, 1580, -864, -2987, 1567, 855, -2246, 1465, 1870, -3343, -2225, 2212, -1007, -1402, 1700, -537, -2523, 1025, 78, -2632, 1237, 846, -3357, -90, 2858, -1561, -2002, 1292, -1492, -2409, 1952, 362, -1615, 1071, -278, -3589, 236, 2547, -1778, -697, 2286, -1681, -2676, 1396, 559, -1648, 1573, 385, -2328, 1514, 1656, -2577, -313, 2439, -1601, -1574, 3183, 801, -1771, 1162, -138, -1690, 2507, 2093, -1114, 1357, 2294, -2252, -575, 3718, 493, -1230, 2811, 1271, -1282, 2006, 1615, -943, 1941, 2172, -1531, 1191, 3886, -326, -1148, 3200, 684, -893, 2812, 2550, -829, 1371, 1099, -1582, 1768, 3531, -393, 88, 2933]
995B933l280r28L855p65k904L018l36k709L217L67m146J495L016l203l19M140
1011C451k831k844L174k65j684L001J25l941K031J468l713J043M253l595j989
1026b316L636q58k747K991K81l233K026J175l287K115K551m491p30M341j793j936
1042b275L447m50l600J971R55k430K147J852m074K13L516k709j235M489j472l177
1058b832K957O14k981J746J632m125J560L133k837j005L983k229l071L401P54
1073G00k829K429M73l235J600K294l128J072L059l158j969L929n20k793K532O64
1089A120l083J412K109k719J017K332l581r03M725j516l005L466m93k727J501
1104c45K217k488Q79J746l460J27L652k202k076L930q02k963K444J068k851J217
$$ y = [2933, -347, -1275, 2580, 1815, -1089, 1929, 1593, -1116, 2101, 2468, -1678, -183, 2833, -370, -689, 3451, 620, -2224, 950, 685, -999, 2002, 2127, -1814, 217, 1685, -2028, -985, 3268, -327, -2316, 1320, 462, -2285, 706, 987, -2246, -220, 955, -2332, -217, 2334, -2157, -2887, 1454, -339, -2275, 1172, 722, -2878, -907, 48, -2382, -235, 1617, -2457, -2244, 1272, -1437, -2672, 1817, 345, -2832, 125, 739, -2242, -496, 1136, -2989, -1429, 1704, -1133, -2138, 1845, -384, -3455, -54, 700, -2129, 300, 773, -2462, -862, 1432, -1696, -624, 2435, -723, -2692, 1237, 717, -2076, 456, 1120, -1963, -551, 1558, -1161, -144, 2188, -1393, -2296, 2429, 913, -2092, 1374, 881, -1846, -345, 1872, -616, 263, 2009, -1451, -1324, 2328, 126, -1950, 1980, 1178, -1785, 659, 1727, -1124, 93]
1120I3J604l280O77L341k589j131L406j861k611L315Q18k960J234J366k658N78
1136f58K964l183j59L376l113j783L676L02l687K216J370l327J391K265k758R5
1152a013K206k582r59M435j374k902K583N94l443J474K564k594j03K349k661m37
1168a863L677j944k298L323k44l169K211J955l224N36J809k567Q31K817k356j613
1184b119L518j400k562L072J225l204P44J766k350M17K671k329m57K824j598k392
1200b174L865Nl710K162J768l098J010K190k477m63K860j907j036L284q37l431
1216a989K794J082l116J594K047k394m13K275j732o91L274j842k490L287J91l241
1232a364K066K149l229J43K322k153K87K250j828k082L260n20k828L320P32l520
$$ y = [93, 1697, -1583, -906, 2435, -154, -1285, 2121, 260, -2351, 964, 1782, -1178, 56, 1422, -1236, -658, 2306, -877, -1036, 2340, -773, -2556, 1120, 1422, -2265, -49, 1321, -2006, -615, 1650, -1108, -1013, 1193, -1389, -2348, 2087, 713, -2189, 394, 988, -2455, -981, 1583, -1011, -1114, 1235, -1426, -1863, 1814, -130, -2428, 895, 651, -2518, -307, 1648, -1576, -1040, 769, -1798, -967, 1850, -506, -2119, 1399, -1, -2563, 509, 1734, -1470, -726, 1040, -1310, -893, 1778, -551, -1008, 1816, 218, -2174, 1691, 1696, -2014, 148, 1916, -1182, -172, 2018, -459, -922, 1938, 31, -1005, 2279, 1442, -1989, 805, 1887, -1229, 365, 2412, 18, -395, 1880, 148, -543, 2731, 889, -1601, 1686, 1877, -1364, 702, 2851, -378, -235, 2087, -66, 221, 2471, 643, -1439, 1821, 1301, -1527, 1793, 2525, -995]
1248i95P24K160k011p9K340k106j029K650j000j730K741o0l455J684K326k952
1264g92j16L058k772o04K292p80j382K708m89l244K777R65l073O87K753k549r82
1281a543K659j042j416K634j088k314K365Q07l244J837K245l513m0K716j776r99
1297a712K488j318j572K714q1l036K463J438l745Q01K718k154o62K611j267j906
1313b220L040o71k013K282N74l325J682K327k485m65K278j322j568K560m10j655
1329a391K058j89k812K453J624k876M02K539k555r16L103j264j325K473p99k355
1345a830K217J137k918J468J733k834l56L171j712r57K020j82k444K607J54k416
1361a142J515J238k991N13K932j919j282K114n22j954K751k81k333J870P88l114
$$ y = [-995, -271, 1889, -122, -201, 2139, 33, -996, 1654, 654, -1076, 1665, 1605, -1850, -166, 2160, -792, -908, 2150, -622, -1226, 1066, 286, -1096, 1612, 1123, -2121, 656, 1621, -1452, -765, 1988, -561, -1543, 1116, 74, -1342, 1292, 204, -2110, 255, 1062, -2182, -345, 1900, -1613, -1653, 1063, -713, -1712, 776, -542, -2114, 600, 519, -2517, -54, 1384, -2361, -1560, 1158, -996, -1658, 953, -314, -2220, 820, 149, -1864, 418, 992, -2333, -651, 1676, -809, -1274, 1004, -318, -1886, 674, 264, -1391, 667, 478, -2334, 119, 1743, -1133, -731, 1808, -747, -1663, 1440, 176, -1149, 1324, 525, -1830, 387, 1524, -1394, 74, 1807, -1027, -1383, 1788, 76, -881, 1139, 957, -1487, 1120, 1274, -1142, 373, 1611, -1380, -867, 2065, 146, -1136, 978, 456, -1498, 1253, 972, -1361, 509, 1297, -1817]
1377a817J551K255k409o65K517j223k009K715j03k180J929K09k056J349J573k333
1393f97j85K022k000j201L272o01k264K022J0j853J469J298k860Q41J947k462
1409a242n36L265j345k167K362j86j838J792O85k613J411J359k383M06K849k146
1425c27j622K687n84k011K615j43k252J731Q41k843J002K697k230j433L176j115
1441A89j851K151O81k474J019J564k460J170J683k578n46L519j866j287K722q78
1457G58k109J615R56j918J167J395k695M88K139j962q33L105j156k348K641N12
1473A755k312R65J098k024R65J642k266QK125j510j591K638j38k085J745Q87k624
1490g22J144J357k273O23K083k249p82K568n91k504K477L70k183J204R59j593
$$ y = [-1817, -266, 1989, -420, -1085, 1432, 209, -1800, 915, 812, -1368, 561, 770, -1286, 63, 1636, -697, -882, 1140, -860, -2061, 1211, 610, -1654, 368, 378, -1475, -6, 1292, -1568, -727, 1220, -1242, -1778, 1487, 142, -2025, 337, 151, -1687, 105, 790, -1823, -412, 947, -1436, -1030, 1819, -327, -1949, 738, 154, -1857, 758, 615, -1637, 94, 935, -1908, -906, 1791, -439, -1872, 1304, 189, -1662, 489, 1170, -1304, -285, 1279, -1181, -11, 1672, -906, -1452, 2067, 201, -1086, 1636, 758, -1351, 264, 1220, -698, 469, 1864, -831, -343, 1796, -166, -999, 2106, 950, -1398, 1243, 1755, -557, 408, 1506, -518, 447, 2089, -177, -169, 1956, 446, -1145, 1493, 1355, -730, 1015, 1902, -722, 422, 1779, -494, 129, 2212, -37, -819, 1749, 1158, -1346, 1131, 1501, -682, 522, 1481, -112]
1506a12K35J970k790j31K601j157j735K090K39k646J519J120j873O07J503k405
1522i65J38K174j810n96K268o36k230J733R77k391J135J109k174M09K007j930
1538g82p77K674j441j871K831N1k562J632R45k143K07J873j479l59K417j991j006
1555a781K860o34k330J918Q43k159O94J457j879J32J570j826n38L054r85j550
1571a154J812Q0k475J591J320j977O77J442j813m49J961j107j220K311m63j969
1587a433J872N47k050P92J745j969j20K001j553m37J857j221j453K383L51k342
1603a030J070J483k489O34J718j566j58J491r72j170J848K14k444J654R07j970
1619g80K69K103k022n61J945j031q53K261q71j696J872K33k194J096J614j890
$$ y = [-112, 123, 2093, -697, -828, 1773, 616, -1119, 971, 1210, -1436, 83, 1203, -670, -63, 1440, -965, -827, 1347, -463, -1059, 1209, 573, -1657, 76, 1053, -1338, -203, 906, -1268, -859, 1148, -782, -1559, 1115, -326, -2197, 634, 685, -1877, -245, 700, -1443, -1236, 637, -842, -1201, 1216, -775, -1781, 1079, 445, -1885, 33, 876, -1283, -589, 868, -1011, -879, 691, -1135, -1673, 1381, 396, -1154, 658, 738, -1737, -146, 1174, -803, -126, 1316, -497, -946, 1015, -92, -1312, 999, 536, -1433, 439, 986, -1064, -272, 1473, -496, -616, 1385, -168, -605, 1252, 31, -1422, 961, 1312, -1030, 40, 1523, -966, -332, 1386, -180, -338, 1153, 181, -989, 859, 1073, -1371, 283, 1190, -780, -511, 1592, -430, -991, 954, -77, -930, 1331, 460, -1236, 636, 869, -1325, -229, 1385, -505]
1635e05r2J337j252n13K146j346j653K465K86k461J451J180k551K54J856j069
1651d67l57J916j512j127J916m23j609K080P31k567Q60J411j575p75K217j152
1667d33q30J765r45r34J867j09k166J054J836k162J76J542j670m85J830m05j063
1684a132K009o01j876J556J117k417R14J786j996k71J721j035q50J779m14j329
1700a039J861j01j718P83J387k182L50J929r05j151J617l82j493K051l15j266
1716e74J406Q36k271L60J945j891k92J812o99j360J882n69j212J669k4j922J330
1733D26J124j989K43J583j146p62J648n37q96J348k40j919J561R00j912N92J569
1750A593j526r10K004m03j337J527k21j852J894K38j576P17J140j881M59J650
$$ y = [-505, -597, 740, -512, -1025, 1121, -225, -1878, 587, 873, -1588, -137, 1043, -1508, -1254, 602, -467, -824, 1092, -420, -1547, 369, -54, -1663, 417, 1148, -1419, -559, 852, -723, -1498, 719, -433, -1263, 502, -443, -1377, 490, 381, -1785, -731, 1105, -1057, -881, 661, -1009, -1494, 336, -69, -1132, 877, 276, -1600, -44, 1073, -1344, -430, 1356, -640, -911, 810, -225, -1075, 704, 290, -1039, 822, 721, -997, -214, 1173, -1009, -659, 1270, 365, -786, 831, 449, -1044, 1007, 692, -574, 832, 1668, -603, -243, 1702, -189, -481, 1331, 632, -728, 1154, 585, -627, 1042, 1018, -904, 426, 1550, -439, -196, 1387, 241, -521, 1127, 590, -306, 1042, 802, -1117, 444, 1344, -568, 24, 1593, 67, -843, 1161, 758, -579, 948, 727, -1125, 769, 1007, -569, 148, 1288, -593, -134, 1516]
1766A516j231j349J822l10j844J688L85j668J210Q90k065J24K157j463o87J616
1782G91o66j167J735n36j256J195M57j871R59J657j816n89J783j037r21J757j37
1799C38j283J017Qj211J062P57j650L71J688j624q76K163l85j516J467m2r79O14
1817h1R62j872P14J378j728k75J967j503o12J497k86j031J335N78j928P45J181
1834A041j622NK039j767n56K070o21j380J219L16j436R65P42j482M78J086j436
1851c39m97J874q00r67J562k28j212O93Q43j744Q46Q91j100m23J550r37r35J785
1869H62l54j673J550M15j464O00J095j564l6J286j085k66J704o29j460J299M38
1886G18j809J208L15j021L78R53r99o23J682j145j081K083k4j878J384L90j340
$$ y = [1516, 285, -1064, 758, 448, -1396, 292, 677, -991, 219, 1109, -956, -832, 1325, -138, -825, 791, 125, -1042, 693, 157, -1099, 96, 553, -1318, -359, 1298, -518, -1107, 676, -361, -1282, 475, 338, -945, 72, 80, -1131, -69, 688, -962, -591, 1097, -527, -1403, 760, 375, -1141, 326, 284, -695, -81, 881, -991, -277, 1101, -627, -902, 1065, -438, -1050, 447, 161, -870, 465, 1043, -885, -140, 1041, -581, -576, 1463, -304, -860, 1210, 589, -791, 428, 744, -692, 273, 1015, -467, 11, 1097, -339, -836, 1038, 238, -729, 833, 605, -607, 86, 929, -815, 31, 922, -178, -601, 949, 12, -923, 862, 508, -1165, 385, 800, -664, -64, 1031, -533, -569, 717, -368, -634, 1070, 441, -1019, 280, 718, -1091, 117, 432, -589, -211, 742, -257, -880, 802, -343, -1424, 659, 635, -1243, 141, 531, -809]
1903h09M92R45j430L02J149j561j89J538m99j164J635j4j413P67M64j238N08J089
1921E72j193l05J631q82j043J561k55j594J268P48j630O49R19j475L54J303p93
1938a65o75J409m37j530J729K91j364O24R54j634N90J245j349j62J323o05j242
1955i98J517J19j138Q81N71j588N95J290j456l5J205q07q20J616j79j705J304
1972C72O85j681P06R92j132k08J320j205n06J799o35j003J215L2j294Q94O29j309
1990c29Q8J504j246j96J201n88p88J258k53j188O59R26j550N27P43j102MJ459
2008A129j028n99J299m40r77R68N09j483M41P57j201K88J225j438K9J605j146
2025f2j001J671p74r32J442N0j123k70J896j406o34J805r51l94R65k16j169J204
$$ y = [-809, -317, 628, -802, -500, 649, -912, -1101, 437, -62, -1226, 409, 395, -1018, -251, 213, -1025, -517, 572, -621, -926, 705, -177, -1220, 341, 86, -1508, -240, 508, -1122, -473, 446, -1029, -675, 628, -165, -840, 569, 132, -1398, 331, 622, -742, -118, 836, -798, -208, 1037, -312, -474, 849, 244, -998, 519, 638, -500, 381, 952, -636, -41, 1249, -207, -242, 963, 156, -664, 952, 773, -932, 372, 1057, -624, 82, 1074, -58, -266, 1054, -151, -657, 1142, 507, -496, 719, 751, -543, 351, 980, -329, -241, 1263, 17, -179, 1022, 434, -354, 904, 651, -537, 122, 1048, -502, 25, 768, -334, -330, 1129, 101, -498, 801, 361, -616, 352, 861, -622, -181, 576, -625, -337, 888, -550, -521, 1084, -62, -1063, 608, -166, -1098, 344, 394, -729, -999, 897, -509, -1143, 662, -289, -683, 282, 66, -1103, 101]
2043A01N33j605R89P92j479J02R65q75k31J144o09q16J209m88q25J161L72r79
2061e39L61J097j423j35J192n28j068J501k11j218J535j30j336R03J132j746J86
2078d27J245r60k74J166l45j147J391k67j198J008R13j695L99R88j213J1R94m01
2096A88r19J603l52j166Q29M53j196K95J060j141K56J207j205n88J259l99q56
2113f72J122O0j137J104M35j695P34J036j218l44J379r13n23J065k94p23J109
2130E25k85o88J15J250j415p7J320o20j023J184j03n84N59J15j345J012Q22j380
2148f18K35R18r36l33J254p83j39O97j1j406J447j90p12R3J076j082j31J330j092
2167c83o35J209M6j228J157L39j225M26R33r33j59R77q01n12J169l66o05J024
$$ y = [101, 634, -971, 18, 810, -669, -567, 398, -477, -708, 436, -173, -989, 220, -268, -1093, 68, 440, -539, -178, 919, -504, -639, 553, 25, -1043, 458, 247, -971, 564, 434, -902, 1, 1133, -613, -427, 818, -142, -416, 750, 405, -742, 649, 382, -816, 192, 1105, -590, -191, 797, -416, -405, 589, 188, -731, 872, 520, -646, 183, 636, -560, -265, 795, -346, -90, 1117, -88, -676, 583, 184, -672, 450, 510, -627, 477, 912, -783, -49, 987, -231, -575, 804, -109, -632, 433, 139, -584, 525, 240, -448, -333, 917, -498, -575, 745, 125, -898, 286, 183, -401, 158, 273, -1072, -60, 762, -618, -383, 535, -401, -734, 520, -263, -402, 295, 284, -1122, 325, 135, -577, -484, 592, -490, -621, 709, -383, -1018, 191, 237, -991, 166, 505, -720, -294, 639, -294, -453, 524, -277, -789, 380, 14, -591, 433]
2185D33j8r41O55L81j356L94J290j017k99J238p99p61J074j50r08P98O01r89J02
2204b72J066j169j33J100o04o47J157Kq20P58j4r92N36Q03j073L72O98j055j32
2223d19J051m07n53P13j65q48J061L08j426O41J102r68k12J139p51p15R29k23
2241B57m35O47R7j029L31P29j235O9J560j014n10J272m60r23J162K46j280N48
2259C2O46j358P27P88j343J19J082q29o18J008k46n00M06M91r60O18P55j189j14
2278d85J501j383l18J176p48m10O65N13j295N71O70j060L48O96j240q3J475p66
2296a73m96O07J75q09P84L48j252N83P31j041M52M48q03j25R79l10j020J353j38
2315B93j073M88O06n96L1J064j062l63J227n80n19Q94N9j139M52J211j490L27
$$ y = [433, 415, -526, 129, 510, -846, -452, 838, -179, -478, 760, -39, -800, 274, 124, -784, 14, 615, -374, -272, 794, -375, -508, 592, -12, -659, 498, 500, -320, 438, 424, -568, -32, 771, -302, 70, 768, -287, -419, 632, 225, -328, 385, 220, -628, 433, 741, -685, -44, 1058, 90, -122, 1017, 266, -449, 480, 257, -178, 469, 566, -463, -132, 597, -638, -569, 991, -23, -533, 739, 279, -644, 518, 764, -516, 32, 678, -680, 47, 835, -508, -389, 693, -136, -754, 254, 8, -492, -86, 405, -555, 63, 818, -371, -485, 1016, -367, -685, 491, -257, -667, -2, 511, -784, -213, 457, -603, -255, 441, -799, -882, 593, -173, -669, -62, 113, -696, 88, 436, -816, -233, 498, -543, -91, 357, -446, -571, 408, 98, -922, 431, 293, -780, -292, 314, -282, -251, 813, -249, -612, 615, 35, -484, 410, 469, -670, -218, 993, -497, -170]
2333a70M05l69r0R32p29o82J193j76q76R45M75j009K68O11j082K75Q86r13o6J148
2353I76j012n28J022r1r70R98L69r96k8O14p93K29J002q11m44R29j15r89J239
2372F01j09r83N92K95o79l1M41m89o30J357n02l84Q51k85q47P59K61m76J79O89
2392F10j192r1J055m79m77O40l2p40P64R1r67M84O91p04L4P83m74k71P42p06q45
2413a084Q99O61j475O69P40p05P1O51p95l48J353k69j135J253k37r85P16L69j116
2432g67N34Q05j317K86J001r32r7R48m23m85O75M64j231M76N74q22o8J001o06
2451A6k57P23n00k85O57J29j162J104L84j343O58M44p45p1O16k75k05M44K70o39
2471c7P86l2j255P45O08j206J70R34o30m63Q68m90o52J273p7r70M62P15j197M31
$$ y = [-170, 235, -134, -224, 708, -21, -703, 490, 314, -562, 383, 858, -151, 117, 728, -354, -79, 807, -106, -172, 976, -36, -564, 458, 367, -603, 395, 764, -232, -260, 354, -439, -210, 792, -19, -463, 466, 351, -638, 601, 492, -491, 101, 396, -283, -314, 127, -362, -992, 365, -137, -521, 330, 45, -802, -43, 218, -258, -79, 610, -582, -673, 382, -97, -574, 66, 34, -706, 58, 149, -818, -334, 357, -347, -313, 470, -4, -275, 467, -239, -1084, -185, 476, -999, -330, 410, -295, -224, 427, -368, -716, 637, 368, -767, 486, 249, -736, -20, 349, -767, -233, 572, -745, -459, 542, -390, -487, 461, 38, -447, 228, 692, -539, -63, 511, -311, -379, 622, 16, -241, 482, -18, -303, 354, 483, -679, 425, 809, -534, 124, 568, -177, -248, 368, 93, -112, 332, 602, -37, 749, 717, -538, 207, 815, -391, -221, 713, 83, -380, 488, -2, -654, 619, 542, -428, 34, 749, -448, -17]
2491a7M97l45q34J276k89n71Q18l38l83L64J21o55M40N76q26j17J034q28n18O67
2511G2j95j76K72M79r86L93Q54j118j20Q29l36l85P27j07n77Q83o49o84J158k95
2531C9n95Q0J030p31l29R38m03m83J045m72l53L06n3j093J210J58q87J07J095
2550F09j007j93J001k22o61Q78m04o49Q34J98j156N56O00o91j8P69n74n99J226
2569D97j60r90J155mj050P27K96o09l45J122o13l01M36m2q63J118K4o13O53K33
2589F71r49m6R25p37q7N56j13p14P90Q5n62N56J83o86K67L43j084M73P93n90o89
2610f15J162q7r81R35j53n97K44N17r35L37P44o15l08O83m9p00K32K40o95O85
2630D4K52o54K01N77o57k85P93k84k50N62J9r17R11r3p88O55J88o22r6R76q03
$$ y = [-17, 480, 135, -699, 577, 288, -283, 535, 197, -186, 178, 299, -356, 84, 660, -166, -283, 751, -77, -595, 72, -123, -299, -27, 452, -534, -141, 713, -405, -525, 304, -32, -417, 310, 203, -374, 509, -140, -824, 334, 39, -556, -476, 554, -177, -506, 432, 29, -454, 591, 119, -234, 72, 19, -1074, 136, 294, -593, -486, 609, -398, -591, 410, 188, -473, 405, 1, -648, 186, 384, -772, -216, 384, -307, -325, 444, -130, -729, 497, 337, -653, 502, 498, -552, 175, 471, -138, -483, 639, 26, -275, 161, 119, -744, 374, 398, -215, 438, 671, -278, -324, 601, -136, -223, 333, 220, -494, 296, 381, -181, 375, 558, -128, 139, 482, -602, -129, 664, 74, -615, 547, 460, -521, 414, 261, -336, -92, 425, -510, -173, 571, -44, -352, 331, 282, -418, -186, 54, -641, 44, 296, -358, -157, 420, -237, -522, 271, -13, -263, 299, 318, -599, 312, 219, -569, 86, 274, -348, -444, 532, -271]
2651b71m05P79l53k59N79K69r46O97L19r62L33O77r17OQ19m72n39R85m4j237J052
2672A10L2o64M75K42q96K49P94o51k31Q65j75p59P70K76r94N98N88j047M53L46
2692C81o51rJ110n16p45O24K32r94M14O67j221O65Q40j016m4R89o71l73P44P7
2712E03q92R47J02j194Q14L37n67k74Q63r40l62J191k58q99J139Pj063Q92J28
2731D74q58M78Q59r23l27J051p74m36Q91r1q22N78J01p51N60K86m49K47K58m31
2751g9k17R90l97q97Q96k5o89L5O33m11j74N80o66r2Q63m38o19J163j03q20L13
2772a54N18j151O44O19r49L53K00j2o07P88j00p37Q59j05o98M53K31o29L09K64
2792I6k45j1P15p72m05Q65N3r21L54P04q55n4Q78p14j49Q11m26o38R86J34p98
$$ y = [-271, -676, 103, -250, -509, 70, 339, -607, 90, 409, -553, -220, 457, -460, -454, 365, -107, -646, 339, 295, -942, 110, 142, -522, -47, 195, -701, -452, 342, -309, -540, 325, 150, -609, 161, 437, -557, 41, 629, -418, 35, 381, -270, -279, 831, 315, -430, 194, 426, -568, -154, 513, -708, -43, 797, -219, -263, 726, 55, -318, 426, 503, -389, 558, 660, -534, 280, 617, 50, -224, 639, -301, -663, 528, 270, -629, 510, 517, -546, 346, 474, -384, 94, 953, 30, -297, 754, -20, -456, 435, 344, -478, 100, 201, -550, 10, 296, -153, 94, 352, -79, -296, 694, 297, -600, 296, 271, -418, -383, 250, -161, -335, 245, -421, -513, 350, -88, -707, 456, 353, -467, -154, 364, -787, -143, 476, -473, -120, 80, 68, -539, 249, 149, -588, 271, 166, -532, -79, 152, -477, -168, 96, -149, -160, 555, -217, -622, 243, 296, -625, -271, 433, -422, -476, 402, -312, -461, 350, -76, -714, 272, 406, -392]
2813c92M53L69r94M52L20k13j59N87l86l50O93k07p71R32L4o47M90K02o77J23
2833a41P17m89k28O46p05l2N26j66n34O35L60r64R51l1p88P4N89j49m42M53j72
2854A10n04Q58k70o96N32L34o08L74N38q90J23O31m93o14R61l54m17O73M10j163
2874d65N41M12o66j78J053o02n02L74N3o80O81K09p85K35N81q59L02P41o69k15
2894d39O26j64m43N23P6n63M64J99q11K28N54o20OO60k79n39Q92k60o72N82J63
2915A83p17M26N34j015L42Q15j087K08M75j80l66O06r8q96J054Q1p26J62Q16j035
2935d18j07R47m14k85N92k31l90O34p5p65K91P10m39j90M32j67l36N75r9o87Q02
2956C80k28n03O33K05p63K74M90o66N9M19k64k25N53Q7p43O75J10q16M68M81o59
$$ y = [-392, 61, 430, -564, -112, 208, -5, -164, 423, 37, -313, 380, 173, -598, 334, 368, -279, 211, 413, -264, -141, 576, 87, -141, 505, -200, -232, 294, 128, -406, 229, 589, -375, 576, 545, -243, -169, 420, 271, -171, 282, 110, -394, 464, 194, -502, 30, 364, -244, 130, 668, -222, -99, 532, 39, -575, 386, 32, -385, 288, 698, -465, 76, 488, -178, -356, 697, 95, -407, -33, 20, -660, 21, 230, -555, -320, 261, -598, -296, 445, -224, -439, 187, 23, -420, 103, 179, -384, 80, 279, -532, -304, 250, -370, -364, 296, 17, -522, 370, 110, -562, 20, 183, -534, -108, 426, -589, -247, 568, -519, -311, 164, -16, -382, 224, 126, -770, 284, 365, -361, -199, 617, -418, -525, 422, 8, -277, 315, 84, -306, 328, 253, -512, -221, 489, 50, -140, 292, 125, -211, 364, 265, -422, 380, 152, -351, 282, 487, -276, -2, 488, -178, -119, 300, 36, -189, 364, 451, -292, 383, 493, -323, 145, 626, -33]
2977c3k91O47k67k29M49j67j77M22P0p10O02L18r85J31Q22n52k73L68No61Q12
2998C01j65n43N71L31q09J36L51p87L31P57m90m64O81m40k12M28o6m49M40K95
3018A97k02l34M79l57m18Q86n6p01M12L64o81K68K98p43J49O39l59l16P54l22
3038d3p40P99Ml19N13J13o53M24M3p76J25P14k58n14Q82k90n28R69n73j08K16
3059@k9l67K84N96p62l20J037o35k22O41k60k83N91J48q45J72J215r55l42Q37
3079E01m67JO34j06r91J076n59p37N82L69n52M52M98o28o3O09j11p51J43K31o34
3100e03P42J48o81L50P36r83r0R25l45p33P85l00l40N90P6p67M61M13m73l12N62
3121B61l62j90O15l40n34Q66l47m89M83K65m80Q6K34o93O33M09l48l86P50n59
$$ y = [-33, -324, 323, 56, -173, 276, 109, -68, 354, 424, -286, 316, 634, -351, -220, 602, 50, -223, 145, 150, -511, 301, 136, -407, 164, 495, -314, -178, 173, -614, -283, 474, -16, -480, 201, -239, -451, -23, -89, -538, -98, 197, -5, -339, 140, -217, -635, 251, 195, -506, -94, 270, -411, -143, 155, -588, -439, 200, -159, -475, 279, -43, -783, 16, 20, -299, 214, 327, -326, 98, 141, -635, -510, 204, -54, -568, 314, 24, -504, 465, -108, -216, 0, -29, -396, -112, 484, -278, -598, 439, -196, -418, 223, -37, -320, 271, 419, -426, -254, 961, 6, -336, 501, 34, 35, 669, 563, -428, 648, 89, -648, -66, 303, -249, 203, 701, 73, 10, 619, 508, -243, -100, 131, -503, 239, 387, -294, 56, 792, -191, -281, 644, 299, -434, 351, 51, -289, 301, 377, -390, 71, 484, 11, -301, 261, -101, -291, 324, -16, -550, 316, -31, -520, -37, 228, -252, -166, 68, -625, 8, 417, 69, -317, 433, -126]
3141a26k85N14K61p05O7N97o23J99M52o36K53K11k09n38R05J92r10K36N7L0j71
3162b29J31j41k92P23j82k18O25l82l89J00Q06r95K42J49j74K7K78l88k8O22O4
3183C49o82L32M06o89L10K26l68J10L67n46J4K97P1m45Q04j46q48Q29l0k97j40
3204g6N82l28k63K89r6j9J58L4l62J39M64p52J63M78o78N8O35n93m3O92k00l59
3226g7J61M44p67M14M54q16J46L16l98rN77p12J33M99l50n01N57K12q00N07K22
3247B12o2o1J45k58m32Q85k77k71K61K36o66M09L98q34K34M29n93J39J69k5k97
3268b59K80K14n41K68m9m8m5j8Q8j78N34m84l16N88o1m49Q65k92j62J71K04q06
3290d96L58M42o66K46M39m78j61O05r0n41M89K87o89L15K32n12q2M80j24m56O74
$$ y = [-126, -411, 103, 364, -341, -274, 323, -300, -101, 351, -285, -32, 179, -30, -568, 337, 529, -381, -145, -88, -58, -229, -98, -239, -531, 192, 10, -208, 417, 35, -354, -254, 552, -443, -201, -52, -226, -199, 79, -309, -337, 285, 349, -333, -1, 405, -284, 26, 252, -116, -6, 361, -185, -171, 126, 197, -248, 556, 410, -438, 391, 361, 64, -76, 506, 178, -85, 204, 108, 89, 247, 281, -81, 58, 522, -230, -67, 411, -267, -209, 426, -167, -210, 482, 282, -77, 84, 528, -239, 175, 629, -187, -41, 275, -123, -132, 445, -267, -134, 365, 15, -486, 71, 283, -517, -10, 212, 150, 89, 234, -24, -456, 429, 152, -119, 142, 378, -288, 121, 519, -315, -81, 348, -245, -106, 63, 38, -259, 21, 235, -306, -38, -87, -135, -180, -198, -110, -288, 246, -238, -554, 34, -27, -476, 389, 97, -65, 106, 310, -496, -138, 304, -362, -116, 323, -155, -316, 289, 199, -342, 147, 434, -255, 60, 292, -220, -302, 178, 54, -402, 272]
3311B72j06j69K11Q0n22L07J78n77k52J029p04J6O39l37o6L28j8o9n17O84o31
3332b24L51n7l29L40R2j61j58N23j68m36L98j2m00K43N2k57K32rK8m15N60j37
3354E6l68N23O9o96N62J96k12l46P66o18J1K87o0p00P02l3l58m1O82p71K57L76
3376B84m31K30K20j92l53L48L7l98K45L25p73M94P4p14M12N00m87l47Q58m04k38
3397c10M17j91r9L80no34N06K19p78K21O45l94k39L67J02KJ68l17m63L89K36o03
3419c81N23k3k84m29P53p5n49M23J06l32L29J12n56K22O20n92m07P23j32l73N61
3440B39m9q20R51Ro79M43M49n41R8K26k18k02L23k64j85M78r4m75M13L49n60J61
3462E2Mr3K6L51l80k33O29j74m00N63N0k37q9M53r70J93M42j54k73P14j91k64
$$ y = [272, 166, -3, 208, 288, -234, 73, 251, -326, -578, 451, -253, -237, 402, 65, -1, 327, 309, 240, -277, 407, -224, 127, 70, -259, 81, 173, 12, -146, 377, 209, -227, 171, 159, -241, 2, 54, -203, 29, 20, 48, -367, 193, 56, -312, 211, 280, -416, 146, 342, 130, -216, 550, -68, -57, 230, 170, -530, 172, 139, -219, -260, 422, -349, -92, 284, -147, 83, 303, 111, -242, 106, 143, -255, -10, 315, -458, 36, 110, -604, -192, 308, -179, -526, 332, -72, -310, 107, -84, -183, 197, 192, -442, 64, 283, -495, -274, 371, -23, -262, 105, 207, 209, 377, 60, -403, -14, 222, -381, 142, 119, -165, -594, 159, 84, -465, -42, 64, -268, 61, 173, -383, -161, 459, -133, -540, 183, 51, -322, 239, 190, -630, 321, 330, -349, 94, 543, 2, 100, 326, 108, -94, 229, -35, -220, 258, 164, -311, 102, 451, -109, 52, 56, -37, -11, 340, -40, -273, 356, 182, -218, 345, 395, 158, 69, 522, -448, -255, 187, 33, -240, 474, 283, 19]
3484A9M01J46j057M38N05o38k64O70j89j25J65O0k87K33q9l54M46Q2k90O1K10
3505A43l94L24L65k66j98L43m91K05K0L8n52M15K08n36K06L38K6m39O13n63q4
3526b79P06n50j67O85m28n46O80K5l8l26P05o69q1L98k7k70L58J51n48L92p8k46
3548a53Q0M32k22k71L24j25l04O90j6p81M00O03r83M74K80l04j6L88m88p0M68
3569D06k16n02L99J71l69N7N97o85k39O01m27J68P5p7k73K78M00l78L00r1m26
3590b31L04j21L56n53N21l99L09k6k2q4R7L0k16j42M74q6j88M55n75J93j31K70
3612B35k56J70K16n01K26K28n46L86Q8k57o05Q22k18m84N89j00j24j99N77k45
3632BP0J4k38j18M87l13n92J206m32k81Q1K86l41J30L30p98K75m0J35N1K89j68
$$ y = [19, 420, 566, -491, -53, 452, -186, -450, 220, 31, -94, 71, 131, -156, 77, -12, -366, 80, 162, -128, -67, 143, -251, 73, 438, 172, -26, 317, -174, 31, 51, 89, -463, -48, 160, -376, -170, 168, 194, -245, 368, -195, -279, 427, -123, -290, 395, -33, -579, 101, 126, 88, -238, 467, -202, -283, 115, 88, -182, 176, 327, -221, 171, 93, -153, -73, 359, 137, -134, 190, 65, -239, 451, 435, -346, 54, 657, -326, 148, 428, 124, 108, 496, 8, -62, 406, 190, -312, 87, 258, -111, -54, 543, -142, -381, 220, -207, -39, 36, -41, -314, -36, 364, -14, 286, 195, -231, 73, -48, 308, -245, 276, -123, 186, 160, 138, 54, 151, 181, -35, -177, 297, 211, 23, 478, -97, 96, -35, 235, -21, 149, 365, -136, 90, 318, -228, 158, 246, -11, -616, 206, -12, -496, 93, -7, -131, -330, 247, 2, 72, 86, -152, -270, 217, -96, -688, 518, 86, -195, -114, 172, -169, -39, 291, -507, -232, -272, -137, -86, 203, 35]
3654C5n34M99J77n35N7M99n66J36L74j56n1L97l22k31K07L4k98N2L9J08j77L23
3676F7l22m8L80M3l20J35L33k56J88J65m18J96K29m69K28K40m76m74P19j74J16
3697H2j8j3j95j1O33m67j62N09l64k84O28j83o43O18p7k05M04j37l24L76K23m18
3719b8K51l2m92L12K22J3o59M80Jl39N1M32k66k9K42l07n8M48m81R9J64J72k94
3742i8K89J59m43j4K5O8j50N61n68j55O02N0o30L17J39k03p9J80r4N8j12J42k92
3765b48L31j04j06N8J61o49P83R4l40N5N62p63k18P63m83LK30J30r52N88Q8l08
3787c25J34O34n26j85O06m78p4O50m59k28K35J05k27K62k50K15m7j21R0k32K13
3808hP3o8L5j23N8L31l7m27J17L08l95O9M99l45m3J14J31m52K28j01N6j60J72
$$ y = [35, -499, 0, 177, -358, -301, 198, -368, -232, 142, -14, -65, 332, 10, -221, -14, 20, -278, -226, -187, -79, -256, 67, -255, -303, 77, 120, -200, -65, 268, 12, 200, 365, -53, 143, 372, -97, 131, 371, -105, -579, 140, -34, 82, 64, 51, -144, -155, 478, 11, -151, 358, -6, -290, 338, 155, -488, 130, 53, -152, 252, 115, -209, 167, 390, -28, 223, 191, -301, 11, 233, 246, -413, 67, 68, -271, -220, 212, -54, -83, 159, -148, -206, 242, -239, -140, 24, 196, -98, 191, 350, -93, -107, -82, -14, -164, 397, -171, -326, 276, 326, -304, 13, 152, -51, -130, 50, -44, 14, -98, 44, -248, 83, -21, -127, -69, 92, -557, 226, 320, -20, 35, 597, -166, -384, 379, -104, -101, 129, 259, -693, -105, -17, -325, -191, 443, -83, -268, 338, -140, -214, 436, -23, -251, -16, 89, -138, 124, -126, 89, 42, -79, 11, -221, -8, 65, -3, 32, -91, -33, 298, 261, -166, -49, 259, -136, -67, 432, 87, 44, 158, 289, -163, 65, -36, 20, -140, 32]
3831C2J38O1L2r9j92J71j60l9N13m35k83O00q2n30m4M64k77L27q0k78J5J32K68
3854B54o82M66j99kM69j3l35J49L3r9m51L50K40k76J68r7m16N80O4k61l32M15
3876B5j32q7O35k51n63L54K61p07R14m16l70K59L43m59M4L13j95k17M09j23m94
3897d57K61M39k36j74M40o73L71J50l21o5M71K1m27K51K43n65K78K6j72J22j12
3918a29l51O44l7j44j23L14j90m74O21k3l04L92j23j84Q1L80n27o2N18l25r9L64
3940B19j45k74J54M72m13J52P4l3p0K2k93r7P79n62l80J87Q33q68M4K52j97J97
3962E3L19n09q7O0L13j57N61o54j48M24k6k05M8K74n57M87j78r1J32K12q4m55
3984b68M95J6j64l66M24J62k07k13Qj20K59N6o20R96k53j13J08k77M3j15M12m84
$$ y = [32, 170, 231, 263, 164, -28, 143, -17, -56, 457, 22, -261, 339, 257, -273, -317, 147, -130, 197, 117, -161, -146, -14, 254, -428, 38, -161, -163, 306, 293, -42, 107, 140, 41, -410, -60, 180, -96, 72, -25, -441, 139, 203, -58, -390, 25, -107, -194, 441, 190, -373, -19, 242, -465, 449, 33, -337, -78, 265, -194, -150, 163, -32, -249, 160, 37, -457, -196, 243, 7, -167, 273, -400, -29, 121, -200, -265, 206, 227, -200, 51, 294, -271, 7, 33, -139, -17, -129, -480, 164, 127, -17, -140, 174, -16, -490, 131, 108, -196, 196, 73, -111, -30, 350, -177, -239, 279, -46, -145, 219, 74, -200, -46, 426, 13, 165, 239, 206, 136, 158, -135, -232, 547, -15, -395, -208, 625, -243, -199, 53, -144, 53, 372, -137, -224, -164, 149, -8, 553, -101, -249, 175, 149, -56, -8, 266, -291, 196, 18, -73, 59, 271, 187, -268, 227, 243, 79, -287, 137, 299, 92, -121, -113, -233, 26, 82, -538, 458, 205, 92, 200, -77, -34, -149, 263, -221]
4006b21l03O77k34j94N78j70l11K20Qp8j42J58M1K3j21m46K39N73l90l82N75L9
4028A39n02L60K31j57k26Q9k34K79K77n19J22M38l12k02K97O7l03N5J60n56M67
4049c0J92m82K49J29k45J67n2K83m26K22j89kj73Q49o34L08K25j69m69M27k03
4070b3m49P33j92l81K59J31k63L20L51n24k77O26r5l00j4K57o15N22P2k92k08
4091c62N68m08k5L06K61o39N73l3l79K83J92o38M97k27kk17N10l88L0K59j62l39
4113c40L87N7m21K59K51n67K04P66q17o5K10j33K96q2k41n8K46J64j53J20n4j51
4135a22j19L39q4k99L6K12N8n7J80l56P6L29m01J81J58l03p9L23m1k35K69Q5k58
4158a08K65K18n71k75P62k60j54P5j30j22L78R7m22J83J46n49K45M36m14Q6K55
$$ y = [-221, -524, 153, -81, -275, 303, 133, -178, 42, 50, -28, -170, -12, 29, 52, -69, -515, -276, 297, -93, -475, 100, 139, -363, -3, 228, 71, -155, -66, -300, -21, 256, -263, -141, 297, -15, -217, 80, 147, -156, -101, 59, -497, -30, 162, -320, -71, 58, -187, -20, -72, 211, -215, 7, -182, -184, -357, 492, -142, 166, 391, 222, -247, 180, -23, -472, 261, 69, -312, -53, 78, -185, 135, 486, -38, -315, 311, 216, -84, -98, 159, -456, 66, 138, -154, -362, 206, -202, -227, 79, 340, -299, 274, 241, -138, 145, 337, -301, 196, -31, -33, -250, 260, -128, -98, 161, -1, -340, 47, 104, -317, -58, 193, -374, -170, 596, -221, -286, -76, -209, 87, 5, -236, -294, -48, 116, -37, 83, 29, -122, -241, 98, 14, -285, -249, -37, 21, -36, 144, -212, -136, 193, -208, -27, 131, -172, -251, 72, 31, -204, 65, 150, -108, 157, 375, -196, -471, 291, 31, -123, -48, -178, -300, 78, 175, -247, -64, 82, -467, -222, 214, -200, -114, 141]
4179A41l44J60L85L1j87j03O2j68M31j97m17J16%n3J10l6N10l67K24j66l27M82
4201B87j41l60K90L6l39J35K83j70J2K94K03p04L62L5l07J51J54J95n96L53l29
4222a56K25J26m5n5J22k0k65J48K19m85O7J57k20j9R5R0j87K97P7j60j23K0%k23
4246c15P87o47o3J44K26n86O66J29o80M75K09p11O51l05N8k5Ol08J72l5j8K0O8
4269h2K23n68L41J21k54O4L7M2j23L46j87q8K31j88j94K62M68p12L75O5m76L10
4291A3K62n42K29O5M0l41L81l4j72K15r1m12K76L12k07P8L5j11q9K96k56r1J25
4314a9P3p9j2K59j6l64J59J66o61O41r8l51L88ll56L20J63J32l73M09k21j28J30
4337A59J5l60K72r8R1N7j59l07K02K54l04N5J33K59P3l42K98m81J57K6r6L24k74
$$ y = [141, -203, -43, 342, 373, 186, 83, 145, -23, 408, 211, -206, -90, -90, -143, -33, -69, 441, 74, 298, 132, -195, 287, 146, -214, 76, 112, -227, -92, 191, 21, 33, 327, 530, -174, 188, 223, -84, 67, 221, 416, -180, 173, -156, 69, 195, 150, 95, 217, 197, -68, 80, 299, -186, -119, 38, -182, -201, -106, -16, -203, 94, 171, 11, -112, -92, -92, -315, 472, -175, -238, -94, 132, -454, 212, 341, -339, 136, 345, -366, 285, -20, 38, 13, 19, -289, -117, -152, -170, -150, -82, 141, -427, -86, 35, -219, -155, -118, -76, -199, 147, -40, -128, 103, -85, -279, -17, 451, -261, 114, 179, -297, 13, 275, -267, -38, 27, 67, -274, 107, 73, -99, 116, 25, -387, -111, 201, -6, 72, 107, -4, -93, 203, -53, -144, -19, 54, -25, -37, 222, 206, -158, 1, 167, -494, 147, 49, -302, 86, 83, -273, 47, 210, 342, -31, 378, 157, 29, 159, 174, -186, 86, -12, 79, 136, -23, -330, -128, 126, -178, -123, 10, 269, 342, 0, 298, -183, -26, 0, -96, 228, -46]
4360d6n9O9J61m08J60K31m7j14M15k28k93j37L02M7l14O16n74J78K59l00JM10
4382C29l60m08N04O3k82m40N04N3O6J01l67p8M04k84J34K06n3k35K6L8K20l23
4404a82K02j81M2K21N8l47M94k40l25L51J45k63k39L40k53K29o0k52J88K50r0
4425H8l64R3Q6J82k80K48j88J13J55k09m6M37l55o6J60k67J08Q6R0l89N46J02
4447C30o24K08P0k44j38M41r4N1K71p6k25l8L86m95L1L01j63J34J68l47J11l9
4469A9J47l40l0K63l39M05J24l94K73j14j82j58O20l25k29N49k14j67J03J90l54
4490a53L22K1k11j64L84l16K3L39j98p1R5J99k12j99K04J4j59J48k22J14j06N3
4512i5J8K1P7Ql10K74l40k0M76j33l73N06K9n06L89p0L4J83j34k46J93K32k67
$$ y = [-46, -105, -36, 125, -283, -123, 108, 61, -53, 362, 134, -159, -296, 6, 53, -261, 355, -219, -41, 218, -82, -81, 329, -31, -439, 65, 128, -154, -594, -90, -37, 29, 130, -237, -315, 89, -195, -61, 145, 92, -143, -117, -79, 141, -182, 20, -161, -119, 102, 160, -187, 307, 67, -258, 93, 238, -25, -264, 76, -177, 52, -8, -260, -72, 178, 88, -276, -183, -97, 85, -195, 53, -135, -22, 133, -76, -122, 315, -40, -106, 54, -213, -105, -19, 71, -318, 228, 330, -294, -86, -16, -260, -398, 43, -51, 0, 271, 195, -30, -68, 318, -177, -146, 155, -8, 126, 294, -53, 58, 19, 166, -174, -204, 59, -280, 125, 249, -145, 128, 14, -168, -326, 294, -31, -260, 289, 75, -92, 11, 201, -153, 169, 190, -21, -185, 199, -117, -94, 245, 47, -24, 71, 270, 58, -141, 63, 77, -82, 66, -156, -42, -148, -95, -77, -56, 21, 29, -281, -7, -347, -367, 109, -24, -397, 109, 138, -368, 21, -49, -15, 168, 34, -212, -19, 213, -54]
4535e4j66L82m50J44L27l92L9L95m61o8m6P26m88j47M69j18k85L46n2l87O29O2
4557D05m48j87K23j62K19n3K69n37M82J21n70K76L02p19L76L18k66K36j49p3R8
4578A61k13k53K72K57j34l55L06P1l50M94j60k49O0K06k47J4M72j13p59K26L16
4599B2k0m4O8p6KK45o06L37K80l55K5L92k96j57M42k93m68K32K27j12L22k83M43
4622C27m80J80K26l99L58j54k52Q1M44l41J5o9K37k15K72j88l00N23k36j57N0
4643g8k14L18N1p8J75Q3j13j08k48M47l22k62M48j26r7L5O2j05K13J68r8m10K73
4666A4mj19L82j97m48L07M53k33n9j48m6QL06k11k48J97L32m2j80k80mL90K22
4689C92l18r7nJ76m57M16m19J62K74j31J43j30J8j21Q0K80m63Q1%J12K39j00n9
$$ y = [-54, -220, 162, -288, -144, 183, -209, -170, 225, -236, -304, -350, 376, -112, -259, 210, 92, -193, 153, 101, -286, 343, 405, -43, -230, -7, -169, 50, -3, 266, -271, 211, 332, -238, 38, 340, -379, -3, 315, 49, 285, 136, 63, 161, -52, -305, -33, 224, 90, -265, 41, 112, -238, 256, 96, -153, -93, 113, -134, -120, 352, 239, -520, -294, 22, 2, -42, 26, -50, -48, 197, -409, -72, 208, -147, -122, 270, -26, -183, 259, -34, -502, -270, -43, -155, 167, -116, 327, -153, 27, 253, -146, 212, 58, -194, -113, 331, -10, 5, -64, 173, -42, 230, 42, -258, 265, 29, -128, -78, -292, 26, 77, -1, 174, 257, 144, 36, -212, 235, -87, -349, 99, -27, -124, -89, -27, -132, 81, 249, 151, -259, 14, 10, -109, 273, 76, -372, -65, 388, 155, 96, -52, -98, -90, 216, 5, -243, -46, 286, 244, 64, -216, -220, 170, 392, 74, -23, -28, 148, -309, 107, -312, -150, 124, -7, 136, 6, 24, -97, -17, 263, -200, -119, -119, -7, 232, 132, 73]
4712G3k81J19J74k94j0J69J0j97L24j36j27N59k12L1l91L24l71K24K2J5j84M77
4734C18m71J17K78j70n55N70k53O8lK28O1Lk65K3K3M56n78J76j01K90n35P1N31
4757B82m31P6j34N59k22J00j45j71l2J16l89L04J07rl7n2k49M03j86K05m12K06
4779a11j86K58L51j03j88N6Jq1k02M57m36m2M02j67k39N90k25j77L85m90K64l80
4801b63L8M10m39M49p4k51M65m49O2K67j48l13K58J72m57J35M45l57j58M54n32
4822b86K60R4j89r2K73K56n70J63M03m23J22M8j23q8J35j35k07L67J0j15%JM9
4845d7j06J30l25R7M95k93rJ54j02j16N02p0k47K6k78M46m42K47J3l11K01k99
4867c34K19L7m4n7L06J27k76q6Jj27R4N77m56j54L27Kj84O2K21n31KL94m30J94
$$ y = [73, -208, -89, 85, -209, -219, -50, -40, -237, 87, -49, -176, 383, 171, 202, -189, 135, -236, -12, 10, 25, -159, 318, -153, -36, 242, 72, -483, 87, -166, -98, -101, 127, 188, 191, -74, -51, -28, 428, -150, 26, -75, 215, -320, -249, 282, -149, -73, -207, 352, 130, 230, 85, -86, -118, -2, -391, -87, 20, 11, -26, -78, -327, 76, -110, 95, -317, -111, -297, -39, 312, 209, 21, 77, 78, -3, -205, 252, -184, -226, 176, 9, -230, 360, 135, -42, 343, -147, 117, -263, -225, 185, -254, 195, 121, -130, 335, -114, -52, 215, 67, -246, 12, 184, -273, -138, 307, -50, -208, 246, -286, -26, 68, -121, -213, 60, 316, -254, -91, 312, -111, 11, 59, -64, -152, -17, -152, -359, 8, 18, -97, -97, -96, -47, -153, -23, -348, -251, 244, -49, -58, 96, -6, -122, 380, 310, 63, 89, -189, 257, -185, 62, 75, -236, -35, -334, -115, -78, -122, -179, 127, 254, -22, -108, -107, -234, -140, 437, -19, -173, 154, 156, -28, 34, 255, -276, -274, 120, -310, -116]
4891a16J70j72J87K6R1K74m01L35m84P3K76l71L7K60k05R5kj15J14k8q9J98j85
4914c2N5m9R3L09j25j72K03l20QN2k18L29J35k62j81R0J47l05K52l2rj40k3M06
4938B11l36M17l78L37Pj1j74p7L13l29J18Jl97K11L64m20J13J2NJ10m7J00n15
4961c65L34l4J28l00L59j93l8K88l05j6K05k12R6o7L23o3Oq0l68J97L38k39m09
4984d15O05j8k96R3K86j84j58K51k4k70K74l57L70j20N6j22O9M8m63J90r9M14
5006A30N6j60j35L19k91O3L4kJ7j89q9N01m58J42O2j86L22J3k86J9L99J60n77
5029a36J09q2K52J37j39j90m2L3j1R9l74K55J05j11p4j15N8R4J28k52L87k05N
5052f9R7J62j30K45j33k53K91j31L3k60K61K06l68p7K81m89L82M4p3k88K40J70
$$ y = [-116, 54, -118, 69, 95, 186, 460, 59, 394, -90, -17, 259, -112, -75, 185, -20, 75, 73, -42, 72, 44, -45, 153, -32, 23, -26, 67, 376, 251, 79, 282, -38, -30, 22, -196, 133, 268, 6, -175, -85, 62, -243, 9, -23, -32, -172, -195, 211, -125, 292, -86, 251, 258, 247, 73, -4, 309, -20, 98, 99, -298, -87, 277, -143, -30, -18, -13, 97, 50, 150, -365, -31, -65, 63, -237, 122, -71, -109, 179, -126, -142, 63, -149, -53, -120, 203, 140, 146, 66, -302, -105, 233, -6, -415, 190, 172, -124, -31, 255, 71, -87, 164, 140, -130, 144, -213, 157, 37, 93, -29, 40, 88, -375, -185, -284, 130, 186, 26, -109, 210, -81, -18, 16, 14, 31, -158, -247, 254, -204, -62, 0, -186, 136, 149, -137, -118, 281, 441, -136, -27, -109, 143, 280, 141, -49, -91, -58, -69, 30, -344, -89, 16, -95, -169, -284, -226, -132, -4, -256, 131, -74, -69, 28, 190, 60, 305, 172, -81, 210, 79, 112, -148, 113, 319, -49, -126, 155, -334, 48, 92, 19, -269, -29, 141]
5074A41J84l23j6L8K17n65L60J05J33o67N71M9j50k39K64j70l29O05j15m0J8J24
5096A95m17L75k12k11L14P7K9K93n91L66k52J74n50N82j1m00K49n8J07n5J52k1
5118A35o95L62K28j49k9L24n0k47ML14j75R6k33J18n16M93l48J51L73l99L96J5
5140A68M7m59L59j03j1M0M34l12l64J94l3j27J23L7m83M04K06j32L56k49k41N17
5162C71j56k25O3N6J97l43J10N0k15kL69l67Q7J42m9j5Ok06n8J3M75m12OK11N2
5187A60J09j92k22J45J16j83J53j17k0R4k06K99k76J5J79k90L69O1n15K79Q0k74
5209b36p4N05k34J32j95j02J19P5q6J39m6P1Q7k61j8K96j20k5K8q2M9r4k05Q0
5233a97J59O1K76k03J50n09K04J5l20K08J17J19k79L36l03J24J06k10J0P6J63
$$ y = [141, 325, 2, -14, 24, 241, -324, 36, 141, 274, -393, 178, 227, 77, -162, 102, -68, -397, 208, 93, 53, 71, 195, -222, 153, -59, -270, 44, 121, 150, 443, -148, 218, -34, 140, -410, 172, 161, -239, 10, -48, 59, 4, 156, 135, -560, -198, 30, -119, -148, 176, 126, -121, -117, 197, 22, 118, -115, 3, -513, -20, -368, -217, 156, -243, 153, 168, 215, -244, 115, 12, 1, 41, 475, 163, -201, -7, -40, -167, -44, -7, -490, -86, 120, -12, 344, 95, -146, 371, 215, -10, 53, 109, 306, -37, 73, 123, -92, -94, 275, -92, -5, 137, 88, 73, 79, -127, -185, -172, 303, -109, -103, 108, 160, 269, 77, -145, 0, 116, -67, 86, -31, -51, 43, -163, 136, -140, -125, 54, -236, 133, 194, -321, -42, 38, -236, -310, 195, -39, 93, -102, -204, -85, -10, -96, 43, -3, 68, 155, -106, -124, 172, 52, 27, 55, -27, 22, -72, -277, -197, -38, 23, 299, 96, 246, -263, -59, -44, -364, -156, -39, 80, -199, 137, -166, -42, 64, -146, -136, -60, 103]
5254A03k29K76J61m05k55M41l92M58j24qlo2j38K84K77m60J24n7P0j9M2j05J38
5277A17j55M6O5j76K51pj42m5j6K2J68j08j00K71j41J49m19M60j0l6M2Q9n45J00
5301a20PK11k91m0K51NP8j62RJ27m5q9l7K23l26J53j7JK16K2J35r7j91j89N0%
5327a16J14P0j28K94m65j2K47j18j29M54m67P2M8J11q1J51J74l86K93j03Q9l31
5349b19J84k86N13k97j09j25M89k56k44K61L51l55JJ87r9J11q9j13M15m19j89
5370b88J94J69M6m19O31l22M7r5L10r6n30P08l40M89l18k83P3j14J82N3p8j65
5392a46K18j6k17L5K35k19J94r9k39L31N2J01l5k14J25J44l71N8j9R8L35n60M85
5415B76l93M52j17n39O7J84RL28K2m39J21J00j70J38r6M41m79J43N5j40jK03k89
$$ y = [103, -126, 150, 311, -94, -349, 92, -300, 158, 34, 26, 23, -39, -177, 107, 384, -76, 48, -9, 61, 42, 84, -21, 117, -38, 8, 73, -103, 148, 141, -1, -46, -62, -40, 128, 20, -80, 191, 50, 199, -220, 240, 230, 194, 236, 325, -220, -120, -113, 98, -193, -233, 18, 23, 101, -61, -52, 75, 30, -59, -96, 127, -199, -46, -63, -62, 154, 176, 311, 214, 23, -166, -116, -116, -2, 68, -60, 234, -231, -243, 4, -114, -243, 211, -256, -184, -136, -25, -106, 45, 219, -167, 126, 23, 112, -219, -35, -321, 192, -105, -214, -339, 150, -106, -350, -89, 262, -93, -92, 95, -4, 107, 18, -95, 320, -99, -288, -94, 75, 121, -298, 333, 11, 58, -37, 273, 177, -353, 355, 15, 504, 186, -97, -24, -138, 44, 97, 19, -146, 72, 56, -161, -126, 109, -110, 84, -15, -254, 77, 129, 230, 195, -19, 106, 250, -121, -63, -82, 16, 351, -209, 276, -117, 335, 218, -321, -254, -70, -61, 267, 289, -150, -29, 71, -99, 39, -57, 384, -95, 48, 103, -37, -38, 165, -124]
5438a24N24k91j01l23K95K07l13P8L87m16K8L64k28J57l60K16k1J99k28j40k6
5459a16m2L31j84n8M1M94m33J49K7j46J48m53K07J61P9m73L34k2M1k31J02k39
5481b83J02k4J69j5j31K40o7J65k13L10n14R4M3L37m42O5j49L82o7J6n5n2L83
$$ y = [-124, 400, 109, 8, -315, -20, 187, -126, -48, 339, -77, -49, 315, 87, 244, -116, 100, 79, 278, 50, -90, -116, -158, 173, -11, -69, -28, 466, 33, 182, 209, 63, 211, -242, -35, 126, 205, -268, 66, 44, 85, -146, -44, -283, -181, -205, -36, -51, -182, 58, -9, 156, -57, 253, -261, -167, -124, 213, -229, -164, -313, 69, 2, 18, -37, -89, 294]
$$ [...]
8191B08
##END NTUPLES=NMR FID
##END=
