##TITLE=1H_Pr M-3
 200.13MHz, CDCl3,
 8 sc
 
 10.6.2025
##JCAMPDX= 6.0         $$ Bruker NMR JCAMP-DX V2.0
##DATA TYPE= NMR FID
##DATA CLASS= NTUPLES
##ORIGIN= UXNMR, Bruker Analytische Messtechnik GmbH
##OWNER= pz
$$ XWIN-NMR		Version 3.5
$$ Tue Jun 10 14:55:27 2025 Russian Standard Time (UT+4h)  she@DPX200
##.OBSERVE FREQUENCY= 200.1313
##.OBSERVE NUCLEUS= ^1H
##.DELAY= (6, 6)
##.ACQUISITION MODE= SIMULTANEOUS
##.ACQUISITION SCHEME= undefined
##.AVERAGES= 8
##.DIGITISER RES= 18
##SPECTROMETER/DATA SYSTEM= spect
##.PULSE SEQUENCE= zg30
##.SOLVENT NAME= CDCl3
##.SHIFT REFERENCE= (INTERNAL, CDCl3, 0, 14.3821)
##AUDIT TRAIL= $$ (NUMBER, WHEN, WHO, WHERE, WHAT)
$$ ##TITLE= Audit trail, XWIN-NMR		Version 3.5
$$ ##JCAMPDX= 5.01
$$ ##ORIGIN= Bruker BioSpin GmbH
$$ ##OWNER= she
$$ F:/spectra/data/she/nmr/H-C/1/audita.txt
$$ ##AUDIT TRAIL=  $$ (NUMBER, WHEN, WHO, WHERE, WHAT)
(   1,<2025-06-10 14:54:03.09 +0400>,<she>,<DPX200>,
      <created by zg, POWCHK disabled, PULCHK disabled
       configuration hash MD5:
       00 E9 B6 7A A2 85 ED C7 34 08 36 98 17 FE 4E 26
       data hash MD5: 16K
       FD 3E 1E B5 CB 84 99 0D E0 B4 1E EC 4C FC 9F 59>)
$$ ##END=
$$ 
$$ hash MD5
$$ 01 D7 77 C2 41 C1 F9 02 6C 43 98 76 77 F5 A4 9F
##$RELAX= 
##$RELAX= 
##$RELAX= 
##$RELAX= 
##$RELAX= 
##$RELAX= 
$$ Bruker specific parameters
$$ --------------------------
##$DU= <F:/spectra>
##$EXPNO= 1
##$NAME= <H-C>
##$PROCNO= 1
##$TYPE= <nmr>
##$USER= <she>
##$AMP= (0..31)
100 100 100 100 100 100 100 100 100 100 100 100 100 100 100 100 100 100 
100 100 100 100 100 100 100 100 100 100 100 100 100 100 
##$AQSEQ= 0
##$AQ_mod= 1
##$AUNM= <au_zg>
##$AUTOPOS= <>
##$BF1= 200.13
##$BF2= 200.13
##$BF3= 200.13
##$BF4= 200.13
##$BF5= 200.13
##$BF6= 200.13
##$BF7= 200.13
##$BF8= 200.13
##$BYTORDA= 1
##$CFDGTYP= 0
##$CFRGTYP= 5
##$CHEMSTR= <none>
##$CNST= (0..31)
1 1 145 1 1 1 1 1 1 1 1 1 1 1 1 1 1 1 1 1 1 1 1 1 1 1 1 1 1 1 1 1 
##$CPDPRG= <>
##$CPDPRG1= <>
##$CPDPRG2= <>
##$CPDPRG3= <>
##$CPDPRG4= <mlev>
##$CPDPRG5= <mlev>
##$CPDPRG6= <mlev>
##$CPDPRG7= <mlev>
##$CPDPRG8= <mlev>
##$CPDPRGB= <>
##$CPDPRGT= <>
##$D= (0..31)
0 0.7 0 0 0 0 0 0 0 0 0 0.03 0 0 0 0 0 0 0 0 0 0 0 0 0 0 0 0 0 0 0 0 
##$DATE= 1749552842
##$DBL= (0..7)
120 120 120 120 120 120 120 120 
##$DBP= (0..7)
150 150 150 150 150 150 150 150 
##$DBP07= 0
##$DBPNAM0= <>
##$DBPNAM1= <>
##$DBPNAM2= <>
##$DBPNAM3= <>
##$DBPNAM4= <>
##$DBPNAM5= <>
##$DBPNAM6= <>
##$DBPNAM7= <>
##$DBPOAL= (0..7)
0.5 0.5 0.5 0.5 0.5 0.5 0.5 0.5 
##$DBPOFFS= (0..7)
0 0 0 0 0 0 0 0 
##$DE= 6
##$DECBNUC= <off>
##$DECIM= 32
##$DECNUC= <off>
##$DECSTAT= 4
##$DIGMOD= 1
##$DIGTYP= 9
##$DL= (0..7)
0 120 120 120 120 120 120 120 
##$DP= (0..7)
150 150 150 150 150 150 150 150 
##$DP07= 0
##$DPNAME0= <>
##$DPNAME1= <>
##$DPNAME2= <>
##$DPNAME3= <>
##$DPNAME4= <>
##$DPNAME5= <>
##$DPNAME6= <>
##$DPNAME7= <>
##$DPOAL= (0..7)
0.5 0.5 0.5 0.5 0.5 0.5 0.5 0.5 
##$DPOFFS= (0..7)
0 0 0 0 0 0 0 0 
##$DQDMODE= 0
##$DR= 18
##$DS= 0
##$DSLIST= <SSSSSSSSSSSSSSS>
$$ [...]
##$SUBNAM0= <"">
##$SUBNAM1= <"">
##$SUBNAM2= <"">
##$SUBNAM3= <"">
##$SUBNAM4= <"">
##$SUBNAM5= <"">
##$SUBNAM6= <"">
##$SUBNAM7= <"">
##$SUBNAM8= <"">
##$SUBNAM9= <"">
##$SW= 18.0517328524113
##$SWIBOX= (0..15)
0 0 2 0 0 0 0 0 0 0 0 0 0 0 0 0 
##$SW_h= 3612.71676300578
##$TD= 16384
##$TD0= 1
##$TE= 0
##$TE2= 300
##$TE3= 300
##$TEG= 300
##$TL= (0..7)
0 120 120 120 120 120 120 120 
##$TP= (0..7)
150 150 150 150 150 150 150 150 
##$TP07= 0
##$TPNAME0= <>
##$TPNAME1= <>
##$TPNAME2= <>
##$TPNAME3= <>
##$TPNAME4= <>
##$TPNAME5= <>
##$TPNAME6= <>
##$TPNAME7= <>
##$TPOAL= (0..7)
0.5 0.5 0.5 0.5 0.5 0.5 0.5 0.5 
##$TPOFFS= (0..7)
0 0 0 0 0 0 0 0 
##$TUNHIN= 0
##$TUNHOUT= 0
##$TUNXOUT= 0
##$USERA1= <user>
##$USERA2= <user>
##$USERA3= <user>
##$USERA4= <user>
##$USERA5= <user>
##$V9= 5
##$VALIST= <valist>
##$VCLIST= <CCCCCCCCCCCCCCC>
##$VD= 0
##$VDLIST= <DDDDDDDDDDDDDDD>
##$VPLIST= <PPPPPPPPPPPPPPP>
##$VTLIST= <TTTTTTTTTTTTTTT>
##$WBST= 1024
##$WBSW= 4
##$XGAIN= (0..3)
0 0 0 0 
##$XL= 0
##$YL= 0
##$YMAX_a= 140250
##$YMIN_a= -199417
##$ZGOPTNS= <>
##$ZL1= 120
##$ZL2= 120
##$ZL3= 120
##$ZL4= 120
##$ABSF1= 10
##$ABSF2= 0
##$ABSG= 5
##$ABSL= 3
##$ALPHA= 0
##$AQORDER= 0
##$ASSFAC= 0
##$ASSFACI= 0
##$ASSFACX= 0
##$ASSWID= 0
##$AUNMP= <proc_1d>
##$AZFE= 0.1
##$AZFW= 0.1
##$BCFW= 1
##$BC_mod= 2
##$BYTORDP= 1
##$COROFFS= 0
##$CY= -3
##$DATMOD= 1
##$DC= 2
##$DFILT= <>
##$DTYPP= 0
##$F1P= 0
##$F2P= 0
##$FCOR= 0.5
##$FTSIZE= 0
##$FT_mod= 4
##$GAMMA= 1
##$GB= 0.15
##$INTBC= 1
##$INTSCL= 1
##$ISEN= 128
##$LB= 0.25
##$LEV0= 0
##$LPBIN= 0
##$MAXI= 10000
##$MC2= 0
##$MEAN= 0
##$ME_mod= 0
##$MI= 1.114404
##$NCOEF= 0
##$NC_proc= 0
##$NLEV= 6
##$NOISF1= 3.799351
##$NOISF2= 2.8
##$NSP= 1
##$NTH_PI= 0
##$NZP= 0
##$OFFSET= 14.38212
##$PC= 1
##$PHC0= -1452.555
##$PHC1= -9.607799
##$PH_mod= 1
##$PKNL= yes
##$PPARMOD= 0
##$PSCAL= 0
##$PSIGN= 0
##$REVERSE= no
##$SF= 200.129724274929
##$SI= 16384
##$SIGF1= 3
##$SIGF2= 2
##$SINO= 400
##$SIOLD= 16384
##$SREGLST= <1H.CDCl3>
##$SSB= 0
##$STSI= 0
##$STSR= 0
##$SW_p= 3205.1282051282
##$SYMM= 0
##$S_DEV= 0
##$TDeff= 0
##$TDoff= 0
##$TI= <>
##$TILT= no
##$TM1= 0
##$TM2= 0
##$TOPLEV= 0
##$USERP1= <user>
##$USERP2= <user>
##$USERP3= <user>
##$USERP4= <user>
##$USERP5= <user>
##$WDW= 1
##$XDIM= 8192
##$YMAX_p= 0
##$YMIN_p= 0
$$ End of Bruker specific parameters
$$ ---------------------------------
##NTUPLES= NMR FID
##VAR_NAME=  TIME,          FID/REAL,        FID/IMAG
##SYMBOL=    X,             R,               I
##VAR_TYPE=  INDEPENDENT,   DEPENDENT,       DEPENDENT
##VAR_FORM=  AFFN,          ASDF,            ASDF
##VAR_DIM=   8192,          8192,            8192
##UNITS=     SECONDS,       ARBITRARY UNITS, ARBITRARY UNITS
##FACTOR=    0.0002768,     1,               1
##FIRST=     0,             0,               0
##LAST=      2.2672688,     0,               0
##MIN=       0,             -199417,         0
##MAX=       2.2672688,     140250,          0
$$ Real data points
##PAGE= N=1
##DATA TABLE= (X++(R..R)), XYDATA
$$ [...]
105A2694m7369J3525L4300o988j6031J4903n951j9999K9441K3168l8653k1347
$$ 12694 -34675 -21150 13150 6162 -9869 5034 -917 -20916 8525 31693 -6960 -28307
117b8307L6105K5211k8664l1499K0467K5609k1699j7709K0433J0613j9836n752
$$ -28307 7798 33009 4345 -27154 -6687 18922 -2777 -20486 -53 10560 -9276 -15028
129a5028L0372P740l9617l742M3520j981l8671J937K8495K14k4318k593J9939
$$ -15028 15344 23084 -16533 -20275 23245 21264 -17407 -15470 13025 13239 -11079 -13672 6267
142F267k703j2330J3402P376j7423n742J6476Q003j6423r164J7586M209j7785
$$ 6267 3564 -8766 4636 12012 -5411 -11153 5323 13326 -3097 -12261 5325 9534 -8251
155h251L7J1345j009m209J021O032J58r895K196J0179n117n787N035Q85n553j910
$$ -8251 -8214 3131 2122 -2087 -1066 4966 5124 -4771 -2575 7604 2487 -3300 1735 2620 -2933 -4843
171d843N319q59r684P229J4189r498r861J0030O309o043o303L096P290m967o349
$$ -4843 476 -383 -10067 -2838 11351 1853 -8008 2022 8331 2288 -4015 -919 6371 1404 -4945
186d945O190j20p636K100P020J221o770k425J0718J834j1083J02N675q76p22l21
$$ -4945 1245 1125 -6511 -4411 2609 3830 -2940 -5365 5353 7187 -3896 -3794 1881 1005 283 -38
202c8J26r61k877M917K971p576Q09P469j175m140k124J520K750k773M31K566n585
$$ -38 88 -873 -3750 1167 4138 -3438 -2629 4840 3665 -475 -2599 -1079 1671 -1102 -671 1895 -3690
219c690p49O382Ol341j810L641P416m752q239M962M740k026l021l103J967K333
$$ -3690 -4439 1943 1949 -1392 -3202 439 7855 3103 -5136 -174 4566 2540 -481 -3584 -1617 716
235G16j586P00k456k017P170J324n706P02K883J936j422n367K208L728l278k54
$$ 716 -870 -170 -2626 -4643 2527 3851 -1855 -1153 1730 3666 2244 -3123 -915 2813 -465 -719
251g19O05j170J559j131K38L014l107k62L863k886j786J470k34R68j336n50L032
$$ -719 -114 -1284 275 -856 -618 2396 -711 -973 2890 4 -1782 -312 -546 422 -914 -1464 1568
268A568k429n46M539k221j988K554l41K22q65k113K198r41k124K587q32j186J757
$$ 1568 -861 -1407 3132 911 -1077 1477 1136 1358 493 -1620 578 -363 -2487 100 -732 -1918 -161
285a61r36J326R27k888K709K262l129J78M60m27P42k236J24J751k368J225J102
$$ -161 -1097 229 1156 -1732 977 3239 110 288 748 321 1063 -1173 -1049 702 -1666 -441 661
302F61l345K166K649k135k50j50P65J757k820o91K085j183J067N16k529J952P33
$$ 661 -2684 -518 2131 -4 -254 -404 361 2118 -702 -1393 692 -491 576 1092 -1437 515 1248
319A248j794J467n49j022J600j272o51P27j009J421q1j976K476K26j872K112k53
$$ 1248 -546 921 372 -650 950 -322 -973 -246 -1255 166 85 -1891 585 811 -1061 1051 798
336G98j249J727k97m18l9j291J478p3k240J322j03j124J854p27q30J836o13L2
$$ 798 -451 1276 979 561 522 -769 709 636 -1604 -282 -385 -1509 345 -382 -1212 624 11 43
354D3R31q97P10r3j269J313p54r55J975j255j020K149n75p13O27q90M98J73m38
$$ 43 974 77 787 694 -575 738 -16 -971 1004 -251 -1271 878 303 -410 217 -673 -175 -2 -440
373d40Q80j343l85K451j200j007J761o05L64J124j789l1J038m96R6r82k62J628
$$ -440 440 -903 -1288 1163 -37 -1044 717 112 476 1600 -189 -220 818 322 418 -564 -826 802
391H02j120p82P88q62J025R25j926R53J460q87K29n57n6J568j345o85J365j301
$$ 802 -318 -1100 -312 -1174 -149 776 -1150 -197 1263 376 605 48 -8 1560 215 -470 895 -406
409d06l86Q86j003N28P13p11L05m42M24J199j937j59J967r71M91L57k193J359
$$ -406 -792 94 -909 -381 332 -379 -74 -516 -92 1107 -830 -989 978 7 498 855 -1338 21
427B1J506j983P4Q78J14K93j365k70N29q61J071K40j215J556o79j626K629j45
$$ 21 1527 -456 -382 496 610 903 -462 -732 -203 -1064 7 247 -968 588 -91 -1717 912 767
445G67k044J558Q30J54l27k332R96K169j303j298o27J171K121k312j611J815J45
$$ 767 -1277 281 1111 1265 938 -1394 -398 1771 468 -830 -1457 -286 1835 -477 -2088 -273 -128
462a28O13K3j867J831J044k157Q73L88j257J398P5q01M59r72p7P52k91N45r46
$$ -128 485 508 -1359 472 1516 -641 232 620 -637 761 836 35 494 -478 -555 197 -94 451 -495
481d95m04K023j459j297J916j083M17K715k083j546J576J85K43m85j136J335R68
$$ -495 -899 1124 -335 -1632 284 -799 -382 2333 250 -1296 280 465 708 223 -913 422 1390
498A390l34j613k240K302K274k465j66R34o63J465p37k366K000J689l07j02j554
$$ 1390 1056 -557 -2797 -495 1779 -686 -852 82 -581 884 147 -2219 -219 1470 1163 1061 -493
515d93j08J131q00K47L61l77Q79n54r67O0j296J225K462j521m98M51j285J483
$$ -493 -601 530 -270 -23 338 -39 840 286 -681 -621 -1917 -692 1770 249 -249 202 -1083 400
533D00P45k793O34K695L45j422j930M80J842m23q25q87M94K740j551l080K145
$$ 400 1145 -1648 -1014 1681 2026 604 -1326 -846 996 573 -252 -1139 -645 2095 544 -2536 -391
550c91J042j556O35K87K87J045r89q43L90J72M93n22J46J431j456j684J132J70
$$ -391 651 -905 -270 17 304 1349 360 -483 -93 79 572 50 196 1627 171 -1513 -381 -211
568b11j17K54l27J350r0k296N87P34o98J370R28o34l91j096Q0Q73q31l7J304R31
$$ -211 -328 -74 -401 949 859 -1437 -850 -116 -814 556 1484 850 459 -637 -557 316 -515 -552 752 1683
588A683l23k645p98K340m30j021J688K25k79J97j755l88J535L80MQ5O21L22k020
$$ 1683 1360 -1285 -2083 257 -173 -1194 494 719 440 637 -1118 -1506 29 409 413 498 1119 1441 -579
607e79o46J419o18j81J404o7l52r77j178J255O34o43O95K10K58M20j747m24J482
$$ -579 -1225 194 -424 -605 799 732 380 -597 -1775 -520 114 -529 166 376 634 1054 -693 -1117 365
626C65n3J99K16o30N07l94j171K01JQ04R71j188J0P28j399j0P81l39J035M87p13
$$ 365 312 511 727 97 604 210 -961 -760 -759 45 1016 -172 -162 566 -833 -843 -62 -401 634 1121 408
647D08k0q09l2Q31o01N70Q06j298n3K65q23L25p3K13J111r39m98R21n67J96M63
$$ 408 388 -421 -453 378 -223 347 1153 -145 -198 67 -756 -431 -504 -291 820 -119 -617 304 -263 -67 396
668C96o87Q81K64j139N51q1n86O96l85j24M90o49L55p7j104J128M78q25P96k70
$$ 396 -291 590 854 -285 266 185 -401 295 -90 -214 276 -373 -18 -95 -1199 -71 407 -418 378 108
688A08l05Q88r73k59J038l61K88J60q73M94j93o98O88k91Q9Q54r90k02M37p28
$$ 108 -197 691 -282 -541 497 136 424 584 -289 205 12 -686 2 -289 -200 654 -336 -538 -101 -829
708h29P50M86p27Q75O0p18M76n68p0R37m46P5R9j033M60K17p16N63N5k1O12j056
$$ -829 -79 407 -320 555 615 -103 373 -195 -265 672 226 301 400 -633 -173 44 -672 -109 -54 -75 537 -519
730e19j35J089n46K32M74o82O00kr24M92P2j37L84o50O3M40q21L98K39o82P52
$$ -519 -654 435 -111 121 595 -87 513 511 -413 79 151 14 398 -252 -189 251 -570 -172 67 -615 137
751A37l4p18Q43p0m74N59j42J83J86p02N07K33p38M37k10m47O86m05l81O15k88
$$ 137 103 -615 228 158 -316 243 101 284 470 -232 275 508 -230 207 -3 -450 236 -169 -550 65 -223
772b23M7K18n28N58J81n21O28j60m12O93l11l14N77l31j89J97l59K87j88l97P31
$$ -223 -176 42 -486 72 253 -268 360 200 -212 481 170 -144 433 102 -87 110 -249 38 -150 -547 184
793A84k26m94O55k42j52O34m27P1M14m14J00O3j66M70l18l43N57m99j77N31n20
$$ 184 -42 -536 119 -123 -275 359 -68 3 417 3 103 166 0 470 152 -191 366 -133 -310 221 -299
814b99QM30m51J36J94k98L98j24m5O76n24k28O16m54pK80n07K81J42m86J63k01
$$ -299 -291 139 -312 -176 18 -280 118 -6 -51 625 101 -127 489 35 28 308 -199 82 224 -262 -99 -300
836c00k7N22n60j1P15n48KM42m46M33K38n96L93l7j82K42m31J26M00p76K16M01
$$ -300 -327 195 -365 -376 339 -209 -207 235 -211 222 460 -136 257 220 38 280 -151 -25 375 -401 -185 216
858B16o51M70lo39O18J54l68K54k50K88M77p91K53L98m97M10j58m94N22k30k45
$$ 216 -435 35 32 -607 11 165 -203 51 -199 89 566 -225 28 426 -71 339 181 -313 209 -21 -266
879b66M42n75J45M26o50L46L30n65N24j0l46O70k74l81N82j49m5j66m26Q20j43
$$ -266 176 -399 -254 172 -478 -132 198 -367 157 147 -199 471 197 -184 398 249 204 38 -388 432 289
900B89r60P09J9m46M96l88j46P49l36l3J79l68M64O4l53L55k91L4N52q41q8P16
$$ 289 -671 38 57 -389 107 -281 -427 322 -14 -47 132 -236 228 292 -61 294 3 37 589 -252 -340 376
922C76o17K2L39m75L71j82l54P88k25l74N40j12R8J38o74M28L95m06J52l55m1
$$ 376 -241 -219 120 -355 16 -166 -520 268 43 -331 209 97 195 333 -341 87 482 76 228 -127 -168
943a68P68q01n59Q27p0M4P3o57M25L66n95K32J93N8K09l38K38J26q47M19O57o88
$$ -168 600 -201 -760 67 -3 41 114 -543 -118 248 -347 -115 78 136 345 7 245 371 -476 -57 600 -88
965h8J1J11j65L00l67l23N74j97r8M95j89j17j00j8P35l62o54Q11K95m40k85m29
$$ -88 -77 34 -131 169 -198 -521 53 -144 -242 253 64 -53 -153 -171 564 202 -452 359 654 214 -71 -500
987e00M86N87p56j78L76j36J80l36l51O73J33k30K71j05K7j04l98O27K99p67J43
$$ -500 -14 573 -183 -361 15 -121 59 -277 -628 45 178 -52 219 114 141 37 -361 266 565 -202 -59
1008e9M99k04l35o33L32Q91m69l32M42k61q1J25j18L31nK8M40n68n67O65J60j30
$$ -59 440 236 -99 -732 -400 491 22 -310 132 -129 -210 -85 -203 128 123 151 591 23 -544 121 281 151
1030A51J6k56K59j54n86M68K32l89K31M2l2K8o04L29P58m19m1K76k52K37j64m46
$$ 151 167 -89 170 16 -570 -102 130 -259 -28 14 -18 10 -594 -265 493 74 33 309 57 294 130 -316
1052c16K46J58J49J46o20J39K17o50J51L28k05M83J22l68R5l31LO02j49o9K73
$$ -316 -70 88 237 383 -237 -98 119 -531 -380 -52 -257 226 348 -20 75 -256 -253 349 200 131 404
1073D04j48M9n36m11P63j0l99N13n9k90j53l56O52L24p46N29O08o50k75j32J92
$$ 404 256 305 -231 -642 121 111 -288 225 166 -124 -277 -633 19 343 -403 126 734 84 -191 -323 -131
1094a31N24k71j5L82l30j47l64l60P64J37l51N45l77l55L99m35j27P60O6rl4j40
$$ -131 393 122 107 489 159 12 -352 -712 52 189 -162 383 6 -349 50 -385 -512 248 314 305 271 131
1116A31J83n85k00Q10q0k65K60l06L9q7o87N46M13l34L80Ml85J76j85QL50m3L74
$$ 131 314 -271 -471 339 259 -6 254 -52 -13 -100 -787 -241 172 -162 218 222 -163 13 -172 -164 186 143 517
1139E17N0o87rj8j79L84j06J93L84q62k21N77l56k1O51J15n7l12k44K69k73J9
$$ 517 567 -120 -129 -147 -326 58 -48 145 529 -333 -554 23 -333 -354 297 412 355 43 -201 68 -205 -186
1161a86N74j34K8k4o20K30k9l63O07K77n03J49l4k14M3m3L40K22k91K20j5l98
$$ -186 388 254 282 258 -362 -132 -161 -524 83 360 -143 6 -28 -242 -199 -242 98 320 29 249 234 -164
1183a64K24Jq4K70k20M1J85n46J3L68l42M6L12k9M1k26p6L14j96p2M17JNj58k96
$$ -164 60 61 -23 247 27 68 253 -293 -280 88 -254 -208 104 75 116 -110 -186 128 -68 -140 277 278 283 125 -171
1208a71K25q2k77N17j6l38J78j29l02J43R9K26O5j52K42m2l85J64J26K1J77k12
$$ -171 54 -28 -305 212 196 -142 36 -93 -395 -252 -153 73 138 -14 228 186 -199 -35 91 112 289 77
1230G7L2J48n03j02L86p3K7K0j21J32k36q7L78n4j8K49k35j6J33j69J28l1j19
$$ 77 109 257 -246 -348 38 -35 -8 12 -109 23 -213 -300 78 24 6 255 20 4 137 -32 96 65 -54
1253e4L22j88l29K57m7j20J12j77K10J31l85J85K23k26R0O3O8J75l76R9L10m15
$$ -54 268 80 -249 8 -39 -159 -47 -224 -14 117 -268 -83 140 -86 4 67 135 310 -66 33 343 -72
1275g2J3K61k99M9M0j44J20j64k8L47k70k6L14j31K8O5j85L17p0k65L04q5k56
$$ -72 -59 202 -97 -48 -8 -152 -32 -196 -224 123 -147 -173 141 10 38 103 -82 235 165 -100 204 119 -137
1298a37J94j20N0P4l16K37J07m09K82J02j66J86p1j3J70k36J50J60l24K12P4l06
$$ -137 57 -63 -13 61 -255 -18 89 -320 -38 64 -102 84 13 0 170 -66 84 244 -80 132 206 -100
1320a00K07q6k38L20j76r7K33k31Q1R2k17K34N7j76L05j54j20L10k39p9K71j52
$$ -100 107 21 -217 103 -73 -170 63 -168 -87 5 -212 22 79 -97 208 54 -66 244 5 -74 197 45
1342D5N5o6k55K53k0k54K58p8r5K68k08O8J55k18J27J64j84J28l0j47K41k25r2
$$ 45 100 34 -221 32 12 -242 16 -62 -157 111 -97 -29 126 -92 35 199 15 143 113 -34 207 -18 -110
1365a10K64k27j8J60k65M3R6r8J59r7l6K74j89l3K45j63Q0J49k49P8K9j38J06
$$ -110 154 -73 -91 69 -196 -153 -57 -155 4 -93 -129 145 -44 -77 168 5 85 234 -15 63 92 -46 60
1388F0m4r9J19j55mJ64j91Q5O4j32K28Mj61J66Ro5O0p3L9R0j86L0O4k04Q5j0j33
$$ 60 16 -83 36 -119 -123 41 -150 -65 -1 -133 95 99 -62 104 113 48 108 35 74 164 -22 8 72 -132 -47 -57 -190
1415a90K10o1j04J31l2L4L3j26J39J83j97N8K4m2R7j80j16K43o1q2L3j01J01%
$$ -190 20 -41 -145 -14 -46 -12 21 -105 34 217 20 78 102 60 157 -23 -139 104 43 -39 -6 -107 -6 -6
1439fk48K26J55j64N7M0o0P8q6jJ95q8mk7j49J01n4j31K31j09j16J59o4j16J35
$$ -6 -254 -28 127 -37 20 60 0 78 -8 -9 186 98 94 67 -82 19 -35 -166 65 -44 -160 -1 -65 -181 -46
1464d6%N1J15j26R7K4r5P2q8N1J43k27K2J34j95o4K7o4K79n4k96K55J31k04j5
$$ -46 -46 5 120 -6 91 115 20 92 4 55 198 -29 -7 127 -68 -132 -105 -169 110 56 -240 15 146 -58 -73
1489g3K6J84M6k04Q3M4j37R5j10q5K78j62j38K16j64q0J40j26J49J75j83L6l2
$$ -73 -47 137 183 -21 62 106 -31 64 -46 -131 147 -15 -153 63 -101 -181 -41 -167 -18 157 -26 10 -22
1512b2l0J03k0N1J60k01N2m8k92J98J70k07J61n2j21J57k17j40K99Q4n9M4J7R8
$$ -22 -52 51 31 82 242 41 93 45 -247 -49 121 -86 75 23 -98 59 -158 -298 1 85 26 70 87 185
1536A85k49r8L17j14q3L07k10j81J89k21j5J49n4R6Oj24N6m5K7J69j26J43J04
$$ 185 -64 -162 155 41 -42 265 55 -126 63 -158 -173 -24 -78 18 24 -100 -44 -89 -62 107 -19 124 228
1559B28j95OKj12K18r7j45K73j24k04J3l8J31J11j77Q7J64j07j13j10K12K41k75
$$ 228 33 39 41 -71 147 50 -95 178 54 -150 -137 -175 -44 67 -110 -23 141 34 -79 -189 23 264 -11
1582a1K1K94l08q2N1j64J73J88j88pL8j00r7k4K48J52j75O9L2j71M4QJ9K20l8
$$ -11 10 304 -4 -86 -35 -199 -26 162 -26 -33 5 -95 -192 -216 32 184 9 78 110 -61 -17 -9 10 230 192
1607A92j27L1j72r9J25l4Q7R8j04%q0j02P2M0Q7J52m3J9n8j87P1N7j20J98J35
$$ 192 65 96 -76 -175 -50 -84 3 101 -3 -3 -83 -185 -113 -73 14 166 123 142 84 -103 -32 25 -95 103 238
1632B38j99j1nk00j01J21J97Qm4J15m3k60P9R2nJ80R2j19j9j12j24M2mR0J56q9
$$ 238 39 28 23 -177 -278 -157 40 48 4 119 76 -184 -105 -13 -18 162 254 135 116 4 -120 -78 -82 8 164 75
1658G5q5j29j22J24J4O3K30j9j31Lj32N6J01m6K07K1k28Lj09r7J59L5PP7p6k9
$$ 75 -10 -139 -261 -137 -123 -60 170 151 20 23 -109 -53 48 2 209 230 2 5 -104 -201 -42 -7 0 77 1 -28
1684b8q6q6J79P6k8J66p1j32O5j16L1J09k5k9O0r3k4p3n4J44n7%J84j59rM3r7
$$ -28 -114 -200 -21 55 27 193 122 -10 55 -61 -30 79 54 25 85 -8 -32 -105 -159 -15 -72 -72 112 -47 -56 -13 -110
1711a10J00Q5m4J37n3j21P1j18m7J55k4K3O2k02jrj16J73J06m5J14j64RR8j79
$$ -110 -10 75 31 168 115 -6 65 -53 -100 55 31 54 116 -86 -87 -96 -212 -39 67 22 136 -28 -19 79 -100
1736a00O9J81o7J9Lj56N0r5k1J59p3K5O5j88K8R3j35J66J3m5J42p3r4J10r0M9
$$ -100 -31 150 83 102 105 -51 -1 -96 -117 42 -31 -6 59 -129 -101 -8 -143 23 36 -9 133 60 -34 76 -14 35
1762C5N3p3N3j8j11P9o1p4J21k6k1O6o9mO8p5J11O5j21Q2m1n2P7j04%J15r6m1
$$ 35 88 15 68 50 -61 18 -43 -117 4 -22 -43 23 -46 -50 18 -57 54 119 -2 80 39 -13 64 -40 -40 75 -21 -62
1790f2L5r5Q3k8l4R1k6j5J01m3m8Q1j9N4Qo4M9mj20O5Om5O6q1pN0p2RJ02l7M5
$$ -62 -27 -122 -39 -67 -101 -10 -36 -51 50 7 -41 40 21 75 83 19 68 64 -56 9 15 -30 36 -45 -52 -2 -74 -65 37 0 45
1821D5l5n8R3J9l1L7l8l6Q3j38pP2m7J2Qo7O6rk1L9J0k0M7j3K6J3m6L5Mm7Q9l9
$$ 45 10 -48 45 64 33 70 32 -4 79 -59 -66 6 -41 -29 -21 -88 -22 -31 -52 -13 -3 -23 24 11 37 50 4 39 43 -4 85 46
1853D6p4M9m0KJ0o5K9M9n6J5J8j0N0K0j6K2j9KK7q9M3L1q7O4K0q8K0j5o3Q7lO
$$ 46 -28 21 -19 -17 -7 -72 -43 6 -50 -35 -17 -27 23 43 27 49 30 32 59 -30 13 44 -43 21 41 -47 -27 -42 -105 -18 -21 -15
1885a5J2nL5j4m2P5K1n6J11p8n3R2m8q2O4n7kP8j32M3L0m9M4JL1O6j09K1J06r8
$$ -15 -3 -8 27 13 -29 46 67 11 122 44 -9 83 35 -47 17 -40 -42 36 -96 -53 -23 -72 -28 -27 4 70 -39 -18 88 -10
1915a0R1l3p0J09m4j50J04ll0N3r3kJ08o0QJ1k3R8m9OP3p5j7J13r6j1M8p6J4M4
$$ -10 81 48 -22 87 43 -107 -3 -6 -36 17 -76 -78 30 -30 -22 -11 -34 64 15 21 94 19 2 115 19 8 56 -20 -6 38
1945C8q6O2o3l5N9pNK4o5Q4M8j30Q0L2n0J19j05m0R1l7o0M9l0L3j2r1P4j1k2N6
$$ 38 -48 14 -49 -84 -25 -32 -27 -3 -68 16 64 -66 14 46 -4 115 10 -30 61 24 -36 13 -17 16 4 -87 -13 -24 -46 10
1975A0l7O4N4j06JQ6p1L6ll9O0ln2rj1k6M5m5K0J5m7Q0o7l7J22km7R2l8%j2m5
$$ 10 -27 37 91 -15 -14 72 1 37 34 -5 55 52 0 -9 -20 -46 -1 -46 -26 -11 -58 22 -45 -82 40 38 -9 83 45 45 33 -12
2007a2k3Q0l3k1Jj1Mm9QL7j9O0j0m6N5L6p6L2L3pK6ro8J3oj7J7l4N0j7m1k3lM1
$$ -12 -35 45 12 -9 -8 -19 -15 -64 -56 -19 -38 22 12 -34 21 57 -19 13 46 39 65 56 -12 1 -5 -22 -5 -39 11 -6 -47 -70 -73 -32
2041c2L3j9K0R9o2p7J9J6L5K4n2K7M0o9n5J4K9K4qLJ1n6J2Ok5O7N4n9kM2o0%l
$$ -32 1 -18 2 101 39 -38 -19 -3 32 56 4 31 71 2 -53 -39 -10 14 6 9 20 -36 -24 -18 -43 24 78 19 17 59 -1 -1 -4
2074dj5N0Ok4l2q5L9J0m3R3L1k7Rn2l9Q9rO5J0n3N2o3r3O1M6pN7m2J2l1j14L0
$$ -4 -19 31 37 13 -19 -104 -65 -55 -98 -5 26 -1 8 -44 -83 6 -3 62 72 19 71 8 -85 -24 22 15 72 30 42 11 -103 -73
2106g3N9J2N3J7o9M9m7o3R4K2j1K6k8l7n7lP0m8k8R2l4p9M8l4L8K0J3J9L6k1N
$$ -73 -14 -2 51 68 -1 48 1 -62 32 54 43 69 41 4 -53 -56 14 -34 -62 30 -4 -83 -35 -69 -31 -11 2 21 57 36 41
2137D1n5pR2l6k9N8p5Nj1p1Q1K5k8L4l6kPn9K4R1k3K5K8o2j3m8k4Q1j0J4N5m5
$$ 41 -14 -21 71 35 6 64 -11 -6 -17 -88 -7 18 -10 24 -12 -14 -7 -66 -42 49 26 51 79 17 4 -44 -68 13 3 17 72 27
2169B7q7Ml4L1N9K7J9j9m7J1j0K9P0k3k7M3j11K7j7l0R0J0k9j5j6jm4J3P4N0q5
$$ 27 -60 -56 -90 -59 0 27 46 27 -20 -9 -19 10 80 57 30 73 -38 -11 -28 -58 32 42 13 -2 -18 -19 -63 -50 24 74 -11
2200a1O1No3ll1K7N4k1ML1q7k9J1KJ8kJ8L3m8pK1J1J6M7j0L6p1l2N3k3j7M1l9
$$ -11 50 55 -8 -11 -42 -15 39 18 22 53 -34 -63 -52 -50 -32 -34 -16 17 -31 -38 -17 -6 10 57 47 83 12 -20 33 10 -7 34 -5
2233eM1l1l6Nm0K3M4L2l6J2nk0mmL4N1l3j5%k0l8L0k5M0Ll1QQk8L9J2k5N1J9j5
$$ -5 36 5 -31 -26 -66 -43 1 33 -3 9 4 -16 -20 -24 10 61 28 13 13 -7 -45 -15 -40 0 3 -28 -20 -12 -40 -1 11 -14 37 56 41
2268D1j1n7P7rm5N9lmn8rj5L5m1M6J5o2K2K1m1K5K3KJ5j9L0j5j4jmJ1Rjl4Kk5
$$ 41 30 -27 50 41 -4 55 52 48 -10 -19 -34 1 -40 6 21 -41 -19 2 -39 -14 9 11 26 7 37 22 8 7 3 14 23 22 -12 -10 -35
2303c5k1J3L0K3%j3K1ml6N7pKJ6Mn2J2JnJ1m4JJ4j6J3J4Jqj3K0J3n1O7k7jkJ3
$$ -35 -56 -43 -13 10 10 -3 18 14 -22 35 28 30 46 50 -2 10 11 6 17 -27 -26 -12 -28 -15 -1 0 -8 -21 -1 12 -39 28 1 0 -2 11
2339A1j8J9j1OJ4n1L5j0OpJpO2j1m9L1L5q7P8j3k8J3Nl5K5k6J2J1j7J0k4J2j0
$$ 11 -7 12 1 7 21 -30 5 -5 1 -6 -5 -12 50 39 -10 21 56 -31 47 34 6 19 24 -11 14 -12 0 11 -6 4 -20 -8 -18
2372a8l2K5N1p3N4K1l0j1M0k7L1p0O5j4k3kK0l9M1n7M4J6k5j4M0j6j5Q1m0pK9
$$ -18 -50 -25 26 -47 7 28 -2 -13 27 0 31 -39 26 12 -11 -13 7 -32 9 -48 -4 12 -13 -27 13 -3 -18 63 23 16 45
2403D5n6NL7l2j6J1OQj2%mm2L7K9l5J6Mk7K4JmM6k2k3J9L7k1Km0K7j6l3L6J6k9
$$ 45 -11 -6 31 -1 -17 -6 0 8 -4 -4 -8 -50 -13 16 -19 -3 1 -26 -2 -1 -5 41 19 -4 15 52 31 33 -7 20 4 -29 7 23 -6
2438fJ0k0jM2mk4J7qJ3Ml6K1L3j7rl4J3mj5K0j7Mrk1M3J7Jj2j2rJ7%QQlRJ9k5
$$ -6 4 -16 -17 25 21 -3 14 6 19 23 -13 8 41 24 15 -19 -6 -10 -25 -5 -22 -18 -27 -48 -5 12 13 1 -11 -20 -3 -3 5 13 10 19 38 13
2476A3m1M7J0l7kj5L2ol7L7L0j6k2J6J5J8n4%N5n7J2l5L4MOk3Pj0J5Rj8m7N1q
$$ 13 -28 19 29 -8 -10 -25 7 1 -36 1 31 15 -7 9 24 42 -12 -12 43 -14 -2 -37 -3 1 7 -16 -9 -19 -4 5 -13 -60 -9 -17
2510a7J0J0oJ8lOl6J5OL5k9l3M1m0j5K4nM5j5m1L7j9jpJO7k9j3j7L8l4j1kJ7K2
$$ -17 -7 3 -3 15 12 18 -18 -3 3 38 9 -24 17 -23 -38 -14 -19 26 11 -30 7 -12 -13 -20 -19 48 19 6 -11 27 -7 -18 -20 -3 19
2545A9J0o5LRj8J9j5N3j7ML9p3K3L5kk4L1qm9L3l0RKK0qJrK1k1Kjj6LL0rKoj7
$$ 19 29 -36 -33 -24 -42 -23 -38 15 -2 2 41 -32 -9 26 24 0 31 23 -26 7 -23 -14 -12 8 0 1 -8 13 -8 -6 -7 -23 -20 10 1 3 -3 -20
2583b0L9k4NK8o4LL0jj2JJ2K1m3J0J2j5%J6pP5m5l3J1j0L3k1lJ8Nn5J0J0rJ2J
$$ -20 19 -5 0 28 -36 -33 -3 -4 -16 -15 -3 18 -25 -15 -3 -18 -18 -2 -9 66 21 -12 -1 -11 22 1 -2 16 21 -34 -24 -14 -23 -11 -10
2618a0Pj3Rm5K6J5K0%k3K0K8m3k0J5RJ6J5l5K0k1k7J3k3L9K0J0qNj2mJ5j4JK1
$$ -10 -3 -16 -7 -52 -26 -11 9 9 -14 6 34 -9 -29 -14 -5 11 26 -9 11 -10 -37 -24 -47 -8 12 22 14 19 7 3 18 4 5 26
2652B6j8oJ3k5mL9l5j8PK9l2j2J2lK9J4nj4PkKk8RJ9pK5k1k6OL1l7J8J8L6m9L3
$$ 26 8 2 15 -10 -14 25 -10 -28 -21 8 -24 -36 -24 -27 2 16 11 -3 4 2 4 -24 -15 4 -3 22 1 -25 -19 12 -25 -7 11 47 -2 31
2688C1m3j0L9KnRrllj6L2k7Om2K6K0j8J0qMqOj3JpL7k7J7J2j2j9M2l9j7K9JK3
$$ 31 -12 -22 17 19 14 23 14 11 8 -8 24 -3 3 -39 -13 7 -11 -1 -9 -5 -13 -7 -20 -19 -26 11 -16 1 13 1 -18 24 -15 -32 -3 -2 21
2725B1l1K9j7j9J2k9J8K1J9%l6J5pMJ0pPJ7Qo0J1RJ5l1j3MJ0J3j6pK3MJ0j9M4
$$ 21 -10 19 2 -17 -5 -34 -16 5 24 24 -12 3 -4 0 10 3 10 27 35 -25 -14 -5 10 -21 -34 -30 -20 -7 -23 -30 -7 -3 7 -12 32
2760C2j9ok2J4mPj6M1Lm4j9K9j0M0k0j7M0k8J7j3KLrK3j3oj8j5jjL9l2j0J1MJ4
$$ 32 13 7 -15 -1 -5 2 -14 27 30 -14 -33 -4 -14 26 6 -11 29 1 18 5 7 10 1 24 11 5 -13 -28 -29 -30 9 -23 -33 -22 -18 -4
2796dj1k%J4JkK2j2Mmk0L9mRk3k4KlK5jj2OKnJ1k7LRK6k2K1Nk7J3k0JLk2qK4%
$$ -4 -15 -17 -17 -3 -2 -4 18 6 10 6 -14 25 21 30 7 -17 -15 -18 7 6 -6 0 2 -3 8 -19 -16 -7 19 -3 18 23 -4 9 -11 -10 -7 -29 -37 -13 -13
2837a3j5OJ1pj1KJ1L9k5moJ9J3k3K4rKk3L1l5J4LqQPj9K5l8J4L4l3K5k6k1L8K
$$ -13 -28 -22 -11 -18 -29 -27 -16 23 -2 -6 -12 7 20 -3 21 12 14 -9 22 -13 1 4 -4 4 11 -8 17 -21 -7 27 -6 19 -7 -28 10 12
2873A2j3mkJ1j2j9J8J4l2J8nnL6j1J6k1lJ3J9j5pLj0J6J9m5pL8Kqk0Mj2M5n2K2
$$ 12 -1 -5 -7 4 -8 -27 -9 5 -27 -9 -14 -19 17 6 22 1 -2 11 30 15 8 11 1 17 36 -9 -16 22 24 16 -4 0 -12 33 -19 3
2909Ck0K2rk1J4M%qK1k5%K9k5J8qNQlj9RK3j0j5K0k2LJ0j6K6nkJ2lllLJ1qlk5
$$ 3 -17 5 -4 -25 -11 -7 -7 -15 6 -19 -19 10 -15 3 -5 0 8 5 -14 -5 18 8 -7 13 -9 -6 4 -12 14 9 7 19 16 13 10 13 24 16 13 -12
2949a2kJ1J0ppj2mK2j8J2PLJk1J8k5MOJ6kj7L1pJ4j7J6l4K0J0J6l5pK6l0kJ9M5
$$ -12 -14 -3 7 0 -7 -19 -23 -1 -19 -7 0 3 4 -17 1 -24 -20 -14 2 0 -17 14 7 21 4 20 -14 6 16 32 -3 -10 16 -14 -16 3 48
2986D8n7RK0rO%m8K8J9Ol5lk8M7j0j6J1K7j7kk2M8k9MPMj0J3p%nL3m9M0qlJ8m8
$$ 48 -9 0 20 11 17 17 -31 -3 16 22 -13 -16 -44 3 -7 -23 -12 15 -2 -4 -26 22 -7 -3 4 8 -2 11 4 4 -1 32 -17 23 15 12 30 -18
3024a8L0K8m0J3j8J1K4k7k8%N2qj8k9L0J1j8qK9j6Lj2K5j6%olKj0M3j0k0K3l2
$$ -18 12 40 0 13 -5 6 30 3 -25 -25 27 19 1 -28 2 13 -5 -13 16 0 3 -9 16 0 0 -6 -9 -7 -17 26 16 -4 19 -13
3058a3PJ2J2k4LJ8mJ0j8%K3j2QOj1j7PJ4j3J2k8J3j4k1oNL3k6K5k7J7Qnj4J2K2
$$ -13 -6 6 18 -6 -3 15 11 21 3 3 26 14 22 28 17 0 7 21 8 20 -8 5 -9 -30 -36 -31 2 -24 1 -26 -9 -1 -6 -20 -8 14
3094A4ql5M7qkLj4LK3j0k9J6K1m2K5L4k5PpJ9j2J7l0rPJ5k7j0K8k5j0J4j1pL1
$$ 14 6 -29 18 10 8 11 -3 0 23 13 -16 0 21 -21 4 38 13 20 13 32 20 37 7 -2 5 20 -7 -17 11 -14 -24 -10 -21 -28 3
3129Cl3L5l7jmM9mOpQOl1L1Nrj0Rj3LK3l3rL6j2J9m3J7J3l1K1L3n2Qj7M4k2J1
$$ 3 -30 5 -32 -33 -37 12 8 14 7 15 21 -10 21 26 17 7 16 3 6 29 -4 -13 23 11 30 -13 4 17 -14 7 40 -12 -4 -21 23 1 12
3166A2koj2L5j9Ol2J3j1PNk3L8j5MK5j9rJ4J1j1J1j7j8L1j4LJ2Jj2j6j3J2J3k4
$$ 12 10 4 -8 27 8 14 -18 -5 -16 -9 -4 -27 11 -4 0 25 6 -3 11 22 11 22 5 -13 18 4 7 19 20 8 -8 -21 -9 4 -20
3201b0Pj5MkK2nK2j1k0J4LrJ1%mpJ0poJ2l6K9NJ9j8L3j8j8jNj1J8L6k7j0JK7n1
$$ -20 -13 -28 -24 -26 -4 -9 13 2 -18 -4 -1 -10 1 1 -3 -10 0 -7 -13 -1 -37 -8 -3 16 -2 31 13 -5 -6 -1 -12 6 42 15 5 6 33 -18
3239a8jM1k9PRj6nJ6l2RLpL8m0N9m3oK4mOok7J7qPOpJ5Q%k9M3m0J3K8m7L3qJ7
$$ -18 -19 22 -7 0 9 -7 -12 4 -28 -19 -16 -23 15 -25 34 -9 -15 9 5 11 5 -22 -5 -13 -6 0 -7 8 16 16 -13 30 -10 3 31 -16 17 9 26
3278B6oJ2j7Lj7K5k0jj1mJ0k2J9j3kRj9KrL8J3l7nL1kj2J8ql5J9L4mJmKj6L0l8
$$ 26 20 32 15 18 1 26 6 5 -6 -10 0 -22 -3 -16 -18 -9 -28 -26 -35 3 16 -21 -26 5 3 -9 9 1 -34 -15 19 15 16 12 14 -2 28 -10
3316a0K6J8j8J7k4K3k9OJ7k1j3J9pk9L1k6j1Pj0MPK1j7rJ8J1m1K9J0nNJ5Oj1J
$$ -10 16 34 16 33 9 32 3 9 26 5 -8 11 4 -25 6 -20 -31 -24 -34 -30 -23 -2 -19 -28 -10 1 -40 -11 -1 -6 -1 14 20 9 10
3351A0k2KK1m0L3Lq%J1J9l0K0%J5pm1J1kJ9j8J1j8J8J6o3jN2ql5%K5lrK8rk1K0
$$ 10 -12 -10 11 -29 4 7 -1 -1 10 29 -1 19 19 34 27 -14 -3 -5 14 -4 7 -11 7 23 -40 -41 11 3 -32 -32 -7 -10 -19 9 0 -21 -1
3388aqJ1J4k0J4l2J9K4koJ6k0k2J5J2%J8m2J2j2K1j2J3Lk5J4Nmj5J1j1J6j2j2
$$ -1 -9 2 16 -4 10 -22 -3 21 19 13 29 9 -13 2 14 14 32 -10 2 -10 11 -1 12 15 -10 4 9 5 -10 1 -10 6 -6 -18
3422a8oJ7KJ7k1%K4Rk9K1jj7J4pJ1o%MK2m6K5lLkNk1qL0k7J1K9k4j5K7k1j7J4
$$ -18 -24 -7 -5 12 -9 -9 15 24 -5 16 15 -2 12 5 16 10 10 14 36 -10 15 12 15 13 18 -3 -11 19 -8 3 32 8 -7 20 -1 -18 -4
3459dK3Jj3j6k1KNK7j3j8K9OQj1j3J9lL1l9J8MRj1rQMj0m5K3K2mj9L6k9J0l2j4
$$ -4 19 20 7 -9 -30 -28 -23 4 -9 -27 2 8 16 5 -8 11 8 39 0 18 22 31 20 11 19 23 13 -32 -9 13 9 -10 26 -3 7 -25 -39
3496c9L3JOj0J2qNnkk6L5rk9K5poJ4J2j9O%LK5lK6j8JRj3J5k7LJ6l4mJ6J5nl6
$$ -39 -6 -5 1 -9 3 -5 0 -5 -7 -33 2 -7 -36 -11 -18 -24 -10 2 -17 -11 -11 -8 17 14 40 22 23 32 19 34 7 10 26 -8 -12 4 19 14 -22
3535b2L1j1k6K7nk0K5j1rJ1Lj0J3lOj9K0qj1J1J4l9J0K3J1J2j4lPj3KJ5kJ1om1
$$ -22 9 -2 -28 -1 -6 -26 -1 -12 -21 -10 -7 -17 -4 -7 -1 -20 0 -8 -19 -8 6 -33 -23 0 11 23 9 6 13 0 2 17 15 26 20 -21
3571b1K4Pl7M2k8k1L1nP%nj0noK9j3K5qj3J3Pk1K0KMj0qkRj5J6J5k4KQk2M0pk7
$$ -21 3 10 -27 15 -13 -34 -3 -8 -1 -1 -6 -16 -21 -27 2 -11 14 6 -7 6 13 -8 12 14 18 8 0 -2 7 -8 8 23 -1 1 9 -13 27 20 -7
3610gL9pj5Kk3K9j7M5m3K7l0Rj1l2J5j2J8LKrLMJ6m6K9K7j1j5L4Po5L0J7l5M1
$$ -7 32 25 10 12 -11 18 1 46 3 30 0 9 -2 -34 -19 -31 -13 -10 -8 -17 -14 -10 6 -40 -11 16 5 -10 24 31 -34 -4 13 -22 19
3645A9j4k2J0J1KJK4j0k0NJ9mnj1qL1kj2k2Ml9K9J6jrk1J3mNj5L7j7qJ7J7Pl2
$$ 19 5 -17 -7 4 6 7 31 21 1 6 25 21 16 5 -3 28 26 14 -8 -4 -43 -14 2 1 -8 -29 -16 -20 -15 -30 7 -10 -18 -1 16 23 -9
3682iL5l0Klj0L2l1K2l3J0L1jk8M0k6K4m6M7mk4K5j8j0Kj6L4n6L9lj7l2L1J3k3
$$ -9 26 -4 -2 -5 -15 17 -14 8 -25 -15 16 15 -13 27 1 25 -21 26 22 -2 23 5 -5 -3 -19 15 -41 -2 -5 -22 -54 -23 -10 -33
3716c3M2lj3J2j8knM6J7k8J3rl0J8j3J9k5K0pK2j6k5J3lK8pj5j4K1Kl8K4j2J8
$$ -33 9 6 -7 5 -13 -15 -20 26 43 15 28 19 -11 7 -6 13 -12 8 1 23 7 -18 -5 -8 20 13 -2 -16 5 7 -31 -7 -19 -1
3750aJ5J7nm2k0J2QoJ7J1j0j6J4j0K8j4J1K7j1Lm1J5j8L3k5L4k2j8J5J2k1K2m3
$$ -1 14 31 26 -16 -36 -24 -16 -22 -5 6 -4 -20 -6 -16 12 -2 9 36 25 28 -13 2 -16 17 -8 26 4 -14 1 13 -8 14 -29
3783b9K4K5nj5Jnj1K6jK4k0l0KLrM7m8JKKJ6k1rL2jj8O8pk1Lk3J8J8l5%mr%op
$$ -29 -5 20 15 0 1 -4 -15 11 10 34 14 -16 -14 -11 -20 27 -21 -20 -18 -16 0 -21 -30 2 1 -17 51 44 23 26 3 21 39 4 4 0 -9 -9 -15 -22
3823b2L4Jj8L1l1K4lj6LM4l4k4L1j4lMj8J1j9K1k7Kj4M1k3M1l2OoM6ol1j0K3K7
$$ -22 12 13 -5 26 -5 19 16 0 3 47 13 -11 20 6 3 7 -11 0 -19 2 -25 -23 -37 4 -19 22 -10 -4 -10 36 30 -1 -11 12 39
3858C9rj7j9J5j2mOLj3J6nj1NJ4j9j1J6pj3NK3J9l3M7o0J1mL3j2j1J4rK3j8%J4
$$ 39 30 13 -6 9 -3 -7 -1 2 -11 5 0 -11 -6 8 -11 -22 -6 -13 -26 -21 2 21 -12 35 -25 -14 -18 15 3 -8 6 -3 20 2 2 16
3894A6j1k9J0M0j7K8l2QJ7J2m4PK1lm2J8Qj3j9K4Mj0jj4pL2Qn5L6QJ9oj0Mj1K0
$$ 16 5 -24 -14 26 9 37 5 13 30 42 -2 5 26 23 -19 -1 7 -6 -25 -1 3 -7 -8 -22 -29 3 11 -44 -8 0 19 13 3 7 -4 16
3930A6Qm2J0PoL9o2LN1Knlk8N8k1k7K7j7MqK0l3J8k9J2onM5l5JNQk1J2j1ML6q
$$ 16 24 -18 -8 -1 -7 32 -30 -27 24 26 21 18 -10 48 27 0 27 10 14 6 26 -7 11 -18 -6 -12 -17 28 -7 -6 -1 7 -14 -2 -13 -9 27 19
3968A9j9Qj6J9jlPl3JRL0j2j8J1K0l6L1plK9k1K4k8NoM0o6J1J2rj5%j6K3J3l0
$$ 19 0 8 -8 11 10 7 14 -19 -18 -9 21 9 -9 2 22 -14 17 10 7 36 15 39 11 16 10 50 -16 -5 7 -2 -17 -17 -33 -10 3 -27
4004b7L1%k5rPJ5M5k8pK0Qlj7l3L6j5qL4l3J5k5RJ6M1l8KL5l9J9j2%jLLmj6k0
$$ -27 4 4 -21 -30 -23 -8 37 9 2 22 30 27 10 -23 13 -2 -10 24 -9 6 -19 -10 6 47 9 11 46 7 26 14 14 13 16 19 15 -1 -21
4041b1J6mqJ7l8L0J9m0J9kmJ6K5j3J1rJ0L4pn6K8J9k9Lj0l3K0nKJ0jj1k2K8MJ1
$$ -21 -5 -9 -17 0 -38 -8 11 -29 -10 -12 -16 0 25 12 23 14 24 58 51 -5 23 42 13 16 6 -27 -7 -12 -10 0 -1 -12 -34 -6 -2 9
4077Ij2J5mJ0k8jlqJ1kpOj2K2pj6J4noj5M3J1QQj0J0KK2m2l0L0pl6N5l0K8j7q
$$ 9 -3 12 8 18 -10 -11 -14 -22 -11 -13 -20 -14 -26 -4 -11 -27 -13 -18 -24 -39 4 15 23 31 21 31 33 55 13 -17 13 6 -30 25 -5 23 6 -2
4115bk4J1L2l5K5JjJkk1L5%m5J6k0L9oj4m0M8m8M3K7J5l4l7L0K1k2J8NjJ5k1j
$$ -2 -26 -15 17 -18 7 8 7 8 6 -15 20 20 -25 -9 -29 10 4 -10 -50 -2 -50 -7 20 35 1 -36 -6 15 -7 11 16 15 30 9 8
4150HMj9K8k3NLj7prJ5lJ9j4k0K4K1j0Ql1J7J4pl0Rl2N3j5Jj2nkJ8j1j8N4K3j2
$$ 8 12 -7 21 -2 3 6 -11 -18 -27 -12 -15 4 -10 -30 -6 15 5 13 -18 -1 13 6 -24 -15 -47 6 -9 -8 -20 -25 -27 -9 -20 -38 16 39 27
4187B7l5LK3Nj4K5n3L9Kj7K2k5lK8n4RkK8k8J3l1M0Kj6J2K9l9rK3J8j0Kj2J3l0
$$ 27 -8 -5 18 23 9 34 -19 20 22 5 27 2 -1 27 -27 -18 -20 8 -20 -7 -38 2 4 -12 0 29 -10 -19 4 22 12 14 2 15 -15
4222a5Qn%K1%J6jk4j4J8JJ3%J0J6l2K7k0j5J4m2K9%j4rj%l3K9J3k6L9PJ8j1j6
$$ -15 -7 -12 -12 9 9 25 24 0 -14 4 5 18 18 28 44 12 39 19 4 18 -24 5 5 -9 -18 -19 -19 -52 -23 -10 -36 3 10 28 17 1
4258Akj1K6j8oj1L6l5PJ2J3j8K7j1Kj4K0Pk5J6J4K7o3J5nrL0j8MRn4K9k6K4k1
$$ 1 -1 -12 14 -4 -10 -21 15 -20 -13 -1 12 -6 21 10 12 -2 18 25 0 16 30 57 -6 9 4 -5 25 7 11 20 -34 -5 -31 -7 -28
4293b8L3J0j0K1mk3K4l5K2mj0M5k9k5moK9J0m0jJ2K3l0QK7Oj7J7k7J2L4k1j9J8
$$ -28 5 15 5 26 22 -1 23 -12 10 6 -4 41 12 -13 -17 -23 6 16 -24 -25 -13 10 -20 -12 15 21 4 21 -6 6 40 19 0 18
4327A8j0rK5k2Lj0k1M7n6L5k4L7l4J3j4J1L8j2k4J5jj3J6j1J4j9J7J3l4lnK7j2
$$ 18 8 -1 24 2 5 -5 -26 21 -35 0 -24 13 -21 -8 -22 -11 27 15 -9 6 5 -8 8 -3 11 -8 9 22 -12 -15 -20 7 -5
4360eRk%J6lrL1%Kkm7K1%j0k3PK1j9K0%Nk2j9J5qM5l7j6K6QM8l1j5K9k2k3J8k
$$ -5 4 2 2 18 15 6 37 37 39 37 -10 11 11 1 -22 -15 6 -13 7 7 12 -10 -29 -14 -22 23 -14 -30 -4 4 52 21 6 35 13 -10 8 6
4398FJkJ1Qj9k3J8j5OK9Ql8L7qNk1mJ3kk4K0Ml0OKJkJ5j1J2oJj2J2jRPk7L3J4
$$ 6 7 5 16 24 5 -18 0 -15 -9 20 28 -10 27 19 24 3 -1 12 10 -14 6 10 -20 -14 -12 -11 -13 2 -9 3 -3 -2 -14 -2 -3 6 13 -14 19 33
4438C3m4K0k7OM6j3l6ML0%kj0j4M7o9J8L2qj2OpL0j8j7omK7k4j0RRj0kK1pkJ0
$$ 33 -11 9 -18 -12 34 21 -15 -11 19 19 17 7 -7 40 -29 -11 21 13 1 7 0 30 12 -5 -11 -15 12 -12 -22 -13 -4 -14 -16 5 -2 -4 6
4475FJ0j7J5l8M6j2J9J7k6k3K8k5M%j1K5l0K9nl0K3Om2L3J2J7j7j5rL2j5K2o1
$$ 6 16 -1 14 -24 22 10 29 46 20 -3 25 0 4 4 -7 18 -12 17 12 -18 5 11 -31 2 14 31 14 -1 -10 22 7 29 -32
4508c2rM4rlK0m0MM2k3LJ6mKj2Pkkj1L4qNj2j3MqJOPOm0M4Kjk6jL7j3k6rK5j8
$$ -32 -41 3 -6 -9 11 -29 -25 17 -6 -3 13 9 11 -1 6 4 2 -9 25 17 22 10 -3 1 -7 -6 0 7 13 -27 17 19 18 -8 -9 28 15 -11 -20 5 -13
4549a3O2p3K3l3K4j0NJJ6KJ3k0K2J2j7omK7m0J5J8j2RNk3MMl2J8orJ2J2k4J7j3
$$ -13 49 -24 -1 -34 -10 -20 -15 -14 2 4 17 -3 19 31 14 8 4 31 -9 6 24 12 21 26 3 7 11 -21 -3 -9 -18 -6 6 -18 -1 -14
4585a4j4K5J1k2K4%Jnll3jL8Pk2kJ5J8l8K2j3%K5j7L3j6Nj8J9Pqj6K5k7j0K0n0
$$ -14 -28 -3 8 -14 10 10 11 6 3 -30 -31 7 14 -8 -10 5 23 -15 7 -6 -6 19 2 35 19 24 6 25 32 24 8 33 6 -4 16 -34
4621c4N5k6j2J6q%Rj9NjL4j2J4qNpj9nK9j0J0%j7omJ0J0J0l5M2l2RQJ7jopj3Q
$$ -34 21 -5 -17 -1 -9 -9 0 -19 -14 -15 19 7 21 13 18 11 -8 -13 16 6 16 16 -1 -7 -11 -1 9 19 -16 26 -6 3 11 28 27 21 14 1 9
4660ILpmJ1j9oPk2J9J5k5K8j6p%QK1l9M0j4K0%k9j0mJ0M2l6K0j2j0K9j8k6J2L3
$$ 9 12 5 1 12 -7 -13 -6 -28 -9 6 -19 9 -7 -14 -14 -6 15 -24 16 2 22 22 -7 -17 -21 -11 31 -5 15 3 -7 22 4 -22 -10 23
4696B3qp%K1l3lL6j9poj5K7l2L5l1J3QKlj4pOLk2L7K8j0j9oKK3j6jL2j8Jk3J3
$$ 23 15 8 8 29 -4 -7 29 10 3 -3 -18 9 -23 12 -19 -6 2 4 1 -13 -20 -14 -11 -33 4 32 22 3 -3 -1 22 6 5 37 19 20 -3 10
4734A0pj4K5nmNLmJ7mmk6k0L9Pk4pMPloK4oj5QMmj2J9j8LK3mk8L4J8pj5Njk0L3
$$ 10 3 -11 14 9 5 10 13 9 26 22 18 -8 -28 11 18 -6 -13 -9 -2 -5 -11 13 7 -8 0 4 0 -12 7 -11 -8 15 11 -17 17 35 28 13 18 17 -3 30
4776C0k7mlJ7qk8K3J3pk6K0QJ2l8M8j1l5N4k4j3K6q8N3J3l5J4J7k6LoL6ml4N8
$$ 30 3 -1 -4 13 5 -23 0 13 6 -20 0 8 20 -18 30 19 -16 38 14 1 27 -61 -8 5 -30 -16 1 -25 -22 -28 8 4 -30 28
4810B8k1qMK9j0l5K9l3rOL9k8OLJ4k8PJ6OJ8k5Lj0Ll7K6K1k8RRk5K7k9j5K0K4
$$ 28 7 -1 3 32 22 -13 16 -17 -26 -20 19 -9 -3 0 14 -14 -7 9 15 33 8 11 1 4 -33 -7 14 -14 -5 4 -21 6 -23 -38 -18 6
4846FJ2k9Ok0L2j0PJ9k2j6O1l9kJ5nNoMK9l0qlQk8J0NKQk6M0l8J5QK9m8QJ2k5
$$ 6 18 -11 -5 -25 7 -3 4 23 1 -15 46 7 5 20 15 20 14 18 47 17 9 6 14 -14 -4 1 3 11 -15 25 -13 2 10 39 -9 -1 11 -14
4884a4J4mqOk4oNM1%Ml5K5Kj2J3%K0j7OML2j7k0k9L5r%KMm5K0Qj7NlRk4J9J5m
$$ -14 0 -4 -12 -6 -30 -36 -31 10 10 14 -21 4 6 -6 7 7 27 10 16 20 52 35 15 -14 21 12 12 14 18 -27 -7 1 -16 -11 -14 -5 -29 -10 5 1
4924Aj7M5ol5j2K5k0L1j4l5K7J3j3PJ3Rj6k1L2j9K2QlL3n6K8k1j1J5j2J3j5Jl7
$$ 1 -16 29 23 -12 -24 1 -19 12 -2 -37 -10 3 -10 -3 10 19 3 -18 14 -5 17 25 22 55 -1 27 6 -5 10 -2 11 -4 -3 -40
4958d0N0j7k3KoK6K9m3j0M3mJJ1k6MmlK5k0J1pnQLNk3K2qj3J4N3l8J5qjMj1j9
$$ -40 10 -7 -30 -28 -34 -8 21 -22 -32 11 7 8 19 -7 -3 -7 -10 15 -5 6 -1 -6 2 5 10 -13 9 1 -12 2 55 17 32 24 23 27 16 -3
4996cPJ6j7j5Oj1J2kk6M9l5njk5N2pQpK7j0LK5k8j0J0mk1LM3m9pK7j8J8mJ8Ll0
$$ -3 4 20 3 -12 -6 -17 -5 -7 -33 16 -19 -24 -25 -50 2 -5 3 -4 23 13 16 41 13 3 13 9 -12 -9 34 -15 -22 5 -13 5 1 19 22 -8
5034hJ0lJ9lnj7MKnK1o1M8j5Jm5O2qj9J1j4L1QJ0pj7j9mK3QPl7K1j1j1L6jj1J2
$$ -8 2 -1 18 15 10 -7 -3 -1 -6 15 -46 2 -13 -12 -57 5 -3 -22 -11 -25 6 14 24 17 0 -19 -23 0 8 15 -22 -1 -12 -23 13 12 1 13
5072A3oJ8k9KoMjpM7m7qkJ8opJ1nkj8J3j2J2K4klrNPmJ4Ml1J3JJ6oJ1l3J2rRK5
$$ 13 7 25 -4 -2 -8 -4 -5 -12 35 -12 -20 -22 -4 -10 -17 -6 -11 -13 -31 -18 -30 -18 6 4 1 -8 -3 4 0 14 18 -13 0 1 17 11 22 -11 1 -8 1 26
5114B6j1j5J1lj7PlJ5k3L1Mj1k9PK2%m3RJ5k1MJ0KkrrJ4L8j4k9K0j9J9K7K6l0
$$ 26 15 0 11 8 -9 -2 -5 10 -13 18 22 11 -18 -11 11 11 -32 -23 -8 -29 -25 -15 -13 -15 -24 -33 -19 19 5 -24 -4 -23 -4 23 49 19
5150A9Nl1J0j0K7K2m7jK0n4M8j1OJ4l1K1J3l6JJ5rK6j9j9J8MqK5k9kj1oRpM4j9
$$ 19 24 -7 3 -7 20 42 -5 -6 14 -40 8 -3 3 17 -14 7 20 -16 -15 0 -9 17 -2 -21 -3 1 -7 18 -11 -13 -24 -30 -21 -28 16 -3
5186cJ3k7K3J1jK0j8KJ4l8K4k3OJ8k4J3ol3L1oK4mm0N1m8nJ3OL0l2Onnj6OJ3K1
$$ -3 10 -17 6 17 16 36 18 20 34 -4 20 -3 3 21 -3 10 4 -29 2 -4 20 16 -24 27 -21 -26 -13 -7 23 -9 -3 -8 -13 -29 -23 -10 11
5223A1l8JK0J0j5J4NJ0k2mM1j4nJ9j4MK5j2k8m7M7l2J1OK1k7j7Oj3K8l5O2qk5
$$ 11 -27 -26 -6 4 -11 3 8 18 -4 -8 33 19 14 33 19 23 48 36 8 -39 8 -24 -13 -7 14 -13 -30 -24 -37 -9 -44 18 10 -15
5257a5Qj4J3mpM1k5MmnK0k0J1J1lrl8OL2ljJ7pJ2j7JK7l8%K2oLk7qK4j0j5J8m
$$ -15 -7 -21 -8 -12 -19 22 -3 1 -3 -8 12 -8 3 14 11 2 -36 -30 2 -1 -2 15 8 20 3 4 31 -7 -7 15 9 12 -15 -23 1 -9 -24 -6 -10
5296a0KRj5l0L2j2j7PL8l6K5mK6oKojnoK%J7k2J0nPL8k3K5j6Jk0qK2k7j6RK4K
$$ -10 -8 1 -14 -44 -12 -24 -41 -34 4 -32 -7 -11 15 9 11 5 4 -1 -7 -5 -5 12 -10 0 -5 2 40 17 42 26 27 7 -1 21 -6 -22 -13 11 13
5335A3j8j6K5k6L3j4Qj8LKLoK5Kj5j9J1j9J4K2j3Rk2J0LrJ1J7jQj2QmkJ5L%j2
$$ 13 -5 -21 4 -22 11 -3 5 -13 -10 -8 -5 -11 14 16 1 -18 -7 -26 -12 10 -3 6 -16 -6 -3 -12 -1 16 15 23 11 19 15 13 28 31 31 19
5373A9l2qJ4%Oj7PJj0%o%OOK1l9J5kQJ2LK4Rj8rj0%m%QOKl8K6kJ5j8K9j5J5j5
$$ 19 -13 -21 -7 -7 -1 -18 -11 -10 -20 -20 -26 -26 -20 -14 7 -32 -17 -19 -11 1 4 28 37 19 10 0 0 -4 -4 4 10 12 -26 0 -2 13 -5 24 9 24 9
5414IKj7J7k4K7l1K6l3J2J1pK3j2l7QPKK6j9J5k0LM2jk8Jr%MJ0j7J1l3M5J6k0
$$ 9 11 -6 11 -13 14 -17 9 -24 -12 -1 -8 15 3 -34 -26 -19 -17 9 -10 5 -15 -12 30 29 1 2 -7 -7 -3 7 -10 1 -32 13 29 9
5450Il5MJ3L0J4j6Jj4K8k4j5OqL2n0K9k0Jj8L5Nl5J6L5k6j0LL2l0M3j4rJ0pJ3
$$ 9 -26 -22 -9 21 35 19 20 6 34 10 -5 1 -7 25 -25 4 -16 -15 -33 2 7 -28 -12 23 -3 -13 -10 22 -8 35 21 12 22 15 28
5485B8rJ1l8J8j8J9k2K0Nj5j6K6K1j3j1NOoPmj4j6L3k8MNk6j8M1n5N8j5kjL4K
$$ 28 19 30 -8 10 -8 11 -11 9 14 -1 -17 9 30 17 6 11 17 11 18 14 0 -16 17 -11 -7 -2 -28 -46 -5 -60 -2 -17 -19 -20 14 16
5521A6k2RK9k5QK2l0J0Jj9J8Nk2K4lj2k1L0Rj5mJ8n4K6K3k6J6pk2L9j6J7lKk8
$$ 16 -6 3 32 7 15 37 7 17 18 -1 17 22 0 24 21 9 -12 18 27 12 8 26 -28 -2 21 -5 11 4 -18 21 5 22 19 21 -7
5556gqK3qkkLNpjKkmM5k2Kj%J6k3j6K4l2L0j1k3J6kJ3l5j0J9J7j6K6kj8K4moJ2
$$ -7 -15 8 0 -2 -4 -1 4 -3 -4 -2 -4 -8 37 15 17 16 16 32 9 -7 17 -15 15 4 -19 -3 -5 8 -27 -37 -18 -1 -17 9 7 -11 13 9 3 15
5596A5ok0J4J6k7J5oRJj4J0j4K1J1j3m1N4k5J5OLj9rK6lnj4J7kOk8k2N0k8JJ3
$$ 15 9 -11 3 19 -8 7 1 10 11 -3 7 -7 14 25 12 -29 25 0 15 21 24 5 -4 22 19 14 0 17 15 21 -7 -29 21 -7 -6 7
5632Gk1Qj4J0J1k0RJ5pQ%Mj9j1j3J9j9M0J2l5J6K3pqQLK5j0Oj1k8Pj8jLMnl2K2
$$ 7 -14 -6 -20 -10 1 -19 -10 5 -2 6 6 10 -9 -20 -33 -14 -33 7 19 -16 0 23 16 8 16 19 44 34 40 29 1 8 -10 -11 -8 -4 -9 -41 -19
5671a9PjJLjJ1m1M6j1j0QJ2NNk5KJ0kMnqL1rOj6KLPk7K1K2J2n1K3K1Rk6j6j4P
$$ -19 -12 -13 -12 -9 -10 1 -40 6 -5 -15 -7 5 10 15 -10 -8 2 0 4 -1 -9 22 13 19 3 5 8 15 -12 9 31 43 -8 15 36 45 19 3 -11 -4
5711dnjlQnNNj3Mmj6M8j9oL2j9j9J0j7K5Pl5N9l1j8M0l7J0NnLKMJ0pk1J6j2K7
$$ -4 -9 -10 -13 -5 -10 -5 0 -13 -9 -13 -29 19 0 -6 26 7 -12 -2 -19 6 13 -22 37 6 -12 28 -9 1 6 1 4 6 10 20 13 -8 8 -4 23
5750B3rl8M2k7QLqJnJ4k2LlJ7jKLK1k1J3l2K9Mj2j1KK6j4k5L9j2j7PK5qj1J3j3
$$ 23 14 -24 18 -9 -1 2 -6 -5 -10 4 -18 -15 -18 -1 -2 0 3 24 3 16 -16 13 17 5 -6 -4 22 8 -17 22 10 -7 0 25 17 6 19 6
5788FMJ3k1L2m1j5J6J0mkLJ0j7J5k5J3l3K7J0MRl5RMLL6l6lMM4j9j3Ll5L8l0L1
$$ 6 10 23 2 34 -7 -22 -6 4 0 -2 1 11 -6 9 -16 -3 -36 -9 1 5 14 -21 -12 -8 -5 31 -5 -8 -4 40 21 8 11 -24 14 -16 15
5825A5nMnoL8m9QK2l0K5J5l5LK1j5J0k4nJ5J5k6lk4J9L5k5j1j2K0L6m8K4J3j6
$$ 15 10 14 9 3 41 -8 0 22 -8 17 32 -3 0 21 6 16 -8 -13 2 17 -9 -12 -36 -17 18 -7 -18 -30 -10 26 -22 2 15 -1
5859aj0K6mJ4J1n4L0onLj0Mj0K6j3K2j7Pm0J2L6m6NJ2KnK5k4OJ3KoJ1j1j8k3J3
$$ -1 -11 15 11 25 36 -18 12 6 1 4 -6 -2 -12 14 1 23 6 13 -27 -15 21 -25 -20 -8 -6 -11 14 -10 -4 9 11 5 16 5 -13 -36 -23
5896b3M5j4J2JJ2k0oK0j2k7M7l9J1JRj3NLm1J0J9pJj1K4Pj8k2ORpJ1K5nJ3k6N
$$ -23 22 8 20 21 33 13 7 27 15 -12 35 -4 7 8 17 4 9 12 -29 -19 0 -7 -6 -17 7 14 -4 -26 -20 -11 -18 -7 18 13 26 0 5
5933EoqJ7k4Qj2K5j6K6LoJ9rjOj4J2lj1k6K5J8k8J5l0QJ8j7RMj8PrJ8k7K4lJ2
$$ 5 -1 -9 8 -16 -8 -20 5 -11 15 18 12 31 22 21 27 13 25 22 11 -15 10 28 0 15 -15 -7 11 -6 3 7 -11 -4 -13 5 -22 2 -1 11
5971A1KoJ8l8L4oj8OK0l9L8l4k2M0J4lrK1j4J4k3j2K8n1M1PMm4K1JLJl7L6k0k
$$ 11 13 7 25 -13 21 15 -3 3 23 -16 22 -12 -34 6 20 17 8 29 15 29 6 -6 22 -29 12 19 23 -21 0 1 4 5 -32 4 -16 -18
6007a8K6k1kJ9kk7L2pJ1Lm2J4lJ7j0K0j7P%J3%q%qPJ8k4ML2l4M3j7k0Qrj0j7K
$$ -18 8 -13 -15 4 2 -25 7 0 11 14 -28 -14 -17 0 -10 10 -7 0 0 13 13 5 5 -3 4 22 -2 2 34 0 43 26 6 14 5 -5 -22 -20
6045b0K0j8Rj3J8%j1L0j7K6j8k3J5PJ4Ql4J0RqQJ3k6Lj0L5l6L3k3LlJ7Nj1K8m0
$$ -20 0 -18 -9 -22 -4 -4 -15 15 -2 24 6 -17 -2 5 19 27 -7 3 12 4 12 25 -1 2 -8 27 -9 24 1 4 1 18 23 12 40 0
6081@oJ8nJlk0rJPj3L0j7j7J7k9L4j3MJ7J9k5J2MKRk7K0rMpKLLk6L0LNpj3oK3
$$ 0 -6 12 7 8 5 -15 -24 -23 -16 -29 1 -16 -33 -16 -45 -11 -24 -20 -3 16 -9 3 7 9 18 -9 11 2 6 -1 1 4 7 -19 11 14 19 12 -1 -7 16
6122A6j0jj6k1K5nMl1J5LKL7o4J7J2J2ol6K2L2k0J9j7LJ6K0j1j4KPok1J7L3j5
$$ 16 6 5 -11 -32 -7 -12 -8 -39 -24 -21 -19 18 -46 -29 -17 -5 -11 -47 -25 7 -13 6 -11 -8 8 28 17 3 5 12 6 -15 2 35 20
6157B0j8MJ0k9L5k2lk5L9J7k8Nk2k2OJ1K9QJk0k6PlJ5nNrL1l3J8nK2k9L5l2nL8
$$ 20 2 6 16 -13 22 0 -3 -28 11 28 0 5 -17 -39 -33 -22 7 15 16 -4 -30 -23 -26 -11 -16 -11 -20 11 -22 -4 -9 13 -16 19 -13 -18 20
6194B0j8J0JJ3j4j4%L3k1Ok4JJ1j1J4j7J7k4lK0lMj2K1j1l4K7j5PM4l9pPlj3J2
$$ 20 2 12 13 26 12 -2 -2 31 10 16 -8 -7 4 -7 7 -10 7 -17 -20 0 -3 1 -11 10 -1 -35 -8 -23 -16 28 -11 -18 -11 -14 -27 -15
6230a5RJ0K5qJ2m1J2rJ7j7qJ3RJ0l7oN0lkk7k8QlK2j4K2j8MQoJ6j2J5j1J1%j6
$$ -15 -6 4 29 21 33 -8 4 -5 12 -5 -13 0 9 19 -18 -24 26 23 21 -6 -34 -26 -29 -7 -21 1 -17 -13 -5 -11 5 -7 8 -3 8 8 -8
6267hL5Oj8j2j2K5m6M6mJ8m1RJ6k5J9L8o3L3j7k1K6kj6N2l9j4Opj3L1l3K3J3k0
$$ -8 27 33 15 3 -9 16 -30 16 12 30 -11 -2 14 -11 8 46 -17 16 -1 -22 4 2 -14 38 -1 -15 -9 -16 -29 2 -31 -8 5 -15
6301a5j6lJ8J0K0k2J8Mkk2%m5L0L7mpK4k6K5j6kOqJQNj3Rk4J3Jkj3J9k4K0jm0
$$ -15 -31 -34 -16 -6 14 -8 10 14 12 -10 -10 -55 -25 12 8 1 25 -1 24 8 6 12 4 5 13 18 5 14 -10 3 4 2 -11 8 -16 4 3 -37
6339c7L1Nk3L0l4NM1m0jL7k9PKkKJ4k5J2j5kL5qqJ6%Jm0N6Rl1lJ7l3K0MJqOpo
$$ -37 -6 -1 -24 6 -28 -23 18 -22 -23 14 -15 -8 -6 -8 -6 8 -17 -5 -20 -22 13 5 -3 13 13 14 -26 30 39 8 5 22 -11 9 13 14 6 12 5 -1
6379alJ5k8J0j5K8j8Ojj5J7k9M3pk3J6K3npMj3QrJ2j3J1Nlj6QK4j5k1RK5npkn
$$ -1 -4 11 -17 -7 -22 6 -12 -6 -7 -22 -5 -34 9 2 -21 -5 18 13 6 10 -3 5 -4 8 -5 6 11 8 -8 0 24 9 -12 -3 22 17 10 8 3
6418Cj9K6j7J6j0rQj6JQpNJ3lm3N7pKj9K0j3K7k1j4j9L8K3m5L6k6oJ1L5l9KkP
$$ 3 -16 10 -7 9 -1 -10 -2 -18 -17 -9 -16 -11 2 -1 -44 13 6 8 -11 9 -4 23 2 -12 -31 7 30 -15 21 -5 -11 0 35 -4 -2 -4 3
6455ClJ7K3j5Olm6K3k5k0K6lJ6l0J3Rj1J1J1RPj4nK9Nm3M0k7mrQLnPjnOJ8Nk1
$$ 3 0 17 40 25 31 28 -18 5 -20 -40 -14 -17 -1 -31 -18 -9 -20 -9 2 11 18 4 -1 28 33 -10 30 3 -1 -10 -2 1 -4 3 2 -3 3 21 26 5
6495EJ5l2J8Lk5J9K2j8k8K4nJ0nkoL7j7n3M3j2jOpK2qNj2J7lj6J3j1K2MpJ2ll
$$ 5 20 -12 6 9 -16 3 25 7 -21 3 -2 8 3 1 -5 32 15 -38 5 -7 -8 -2 -9 13 5 10 -2 15 12 -4 9 -2 20 24 17 29 26 23
6533B3j8%k3J0M2j7rJ0j0j0J6ol5N5l4mJ2k5K6mk0J8j5L6ko0K9jJ6j6J7l7L9K0
$$ 23 5 5 -18 -8 34 17 8 18 8 -2 14 8 -27 28 -6 -10 2 -23 3 -1 -21 -3 -18 18 16 -44 -15 -16 0 -16 1 -36 3 23
6567B3m7M5k2KLK3j4j6OK3k7j1L3o1N5jrjOk2j7L6pJ7jk8j2nL9l9M8j4j3MqLK2
$$ 23 -24 21 -1 1 4 27 13 -3 3 26 -1 -12 21 -40 15 14 5 4 10 -12 -29 7 0 17 16 -12 -24 -29 10 -29 19 5 -8 -4 -12 -9 13
6604A3opM8n1J8j7K0pK2k5J9orml5K3LK1m8N4n3M5j3j8J2Nj3pJ2J0j5J2J9j8L
$$ 13 7 0 48 -3 15 -2 18 11 33 8 27 21 12 8 -27 -4 -1 20 -28 26 -27 18 5 -13 -1 4 -9 -16 -4 6 -9 3 22 4 7
6639GprrM5m8K3Kk5J7QPk0MJ8j7J3K0j6NJ0j7qK2lj8Qjj1ok3J2J9m8L7j0K1j7
$$ 7 0 -9 -18 27 -21 2 4 -21 -4 4 11 -9 -5 13 -4 9 29 13 18 28 11 3 25 22 4 12 11 0 -6 -29 -17 2 -46 -9 -19 2 -15
6676a5nL8k5j2pL5K1k3Ok2K3qnjMl8O3m4RJ6KloqK2mj4K1j3J7rj0oK0j7%qj8L5
$$ -15 -20 18 -7 -19 -26 9 30 7 13 -9 14 6 1 0 4 -34 29 -15 -6 10 12 9 3 -5 17 13 -1 20 7 24 15 5 -1 19 2 2 -6 -24 11
6715A1k7QOJ1j3j3J4K3rj5k1K0Mk5K6NJomK3j5j5kML6rlJMj1qj1lM8k7Qj5j0K
$$ 11 -16 -8 -2 9 -4 -17 -3 20 11 -4 -25 -5 -1 -26 0 5 6 0 -4 19 4 -11 -13 -9 27 18 15 16 20 9 1 -10 -13 35 8 16 1 -9 -7
6754gj3J9k7J6Pj1l2L8LNPr%J0k8M2k9M5k6l5K2Rj3J4JMrPj6%K0rMj0K4k3j6K1
$$ -7 -20 -1 -28 -12 -5 -16 -48 -10 -7 -2 5 -4 -4 6 -22 20 -9 36 10 -25 -3 6 -7 7 8 12 3 10 -6 -6 14 5 9 -1 23 0 -16 5
6792ERj9L3l6J5n1M9Oj3j3QL1l1k3M6Jm0K1lJ3k7K0kj1K2j3J2pL2m8K8oK4j9P
$$ 5 14 -5 28 -8 7 -44 5 11 -2 -15 -7 24 -7 -30 16 17 -23 -2 -5 8 -19 1 -1 -12 10 -3 9 2 34 -14 14 8 32 13 20
6827B0m3M2k1K5j3m2M1oJ6kpK1l7mJ9nk2J9ok0J8l0kM4Nj1mJ1J3l7K0K5k6K3J6
$$ 20 -23 19 -2 23 10 -32 9 3 19 17 10 31 -6 -10 9 4 -18 1 -5 -25 -7 -37 -39 5 10 -1 -5 6 19 -18 2 27 1 24 40
6862D0k2lj8K6k7RJkNL0o1K6j0jK8Mkl1M%J9l7K9Pk3Jj3K7j3J6qk8J2K8Jl1L7
$$ 40 18 15 -3 23 -4 5 6 4 9 39 -22 4 -6 -7 21 25 23 -8 -4 -4 15 -22 7 14 -9 -8 -21 6 -7 9 1 -27 -15 13 14 -17 20
6899B0OJ4m0J8Rk3J1K4k3j9J3pj5ML3%j0l0K3l3M4k5j0J0J3Kl0K5J5j5k4J5j6
$$ 20 26 40 0 18 27 4 15 39 16 -3 10 3 -12 -8 25 25 15 -15 8 -25 19 -6 -16 -6 7 9 -21 4 19 4 -20 -5 -21
6932b1K6j5j0K4m3K9j1J0J5k8M1mj0L1N%Ok4rmMJ0Nl7K2k7K0L1k4j7J0k3kOL0
$$ -21 5 -10 -20 4 -39 -10 -21 -11 4 -24 17 13 3 34 39 39 45 21 12 8 12 22 27 -10 12 -15 5 36 12 -5 5 -18 -20 -14 16
6967A6m5K4J1K4j5l2K0k6K5J5m5M4l1K8J8k2J0lk1K9oMK7k5Jj9K3l1J1K5m0qL1
$$ 16 -29 -5 6 30 15 -17 3 -23 2 17 -28 16 -15 13 31 9 19 16 -5 24 18 22 49 24 25 6 29 -2 9 34 -6 -14 17
7000A7qj4K1k1mnJ0J2o4O4k8J1J5Mk8RjJ7j1qJ0J0k1j5N3j2lJMoJ9l6K3kj1M2
$$ 17 9 -5 16 -5 -9 -14 -4 8 -56 8 -20 -9 6 10 -18 -9 -10 7 -4 -12 -2 8 -13 -28 25 13 10 11 15 9 28 -8 15 13 2 44
7036D4k5k2K8k6K2j0lj9J6OoK1j8Jl9L5LL0o2L2OJ7o4O3l2kKj3K7k1L1l7J4QM5
$$ 44 19 -3 25 -1 21 11 8 -11 5 11 5 26 8 9 -30 5 8 38 -24 8 14 31 -33 30 -2 -4 -2 -15 12 -9 22 -15 -1 7 52
7071E2o0L7j0nMjNPl3J6Nj4j2J3MoorJ1J2mKj4Qj7J1j4J8J3kj3j7J2L5j0k1Jj7
$$ 52 -8 29 19 14 18 17 22 29 -4 12 17 3 -9 4 8 2 -4 -13 -2 10 6 8 -6 2 -15 -4 -18 0 13 11 -2 -19 -7 28 18 -3 -2 -19
7109a9L3rL0l9PjMnj2K4J9m0L1m1J9L9j1k4rK9k4PJ0J5m2J4mJpk1N1j7kQlmk5
$$ -19 14 5 35 -4 3 2 6 1 -11 13 32 -8 23 -18 1 40 29 5 -4 25 1 8 18 33 -9 5 1 2 -5 -26 25 8 6 14 11 7 -18
7146a8M9rJ2l0J7mj3j0JRK5m6K5qNj1J4K4J5k4j%n3O4m3pJ4J0k6Lj0K5l9QJ4K7
$$ -18 31 22 34 4 21 17 4 -6 -5 4 29 -17 8 0 5 -6 8 32 47 23 22 22 -31 33 -10 -17 -3 7 -19 -16 -26 -1 -40 -32 -18 9
7182Ij0j1K0l8L3NljKNJ9J8m8J1J3k2j0L3m7J3L9k2K8k1kK6l4Rj0Rkj0PLok3M1
$$ 9 -1 -12 8 -30 3 8 5 4 6 11 30 48 0 11 24 2 -8 25 -22 -9 30 8 36 15 13 39 5 14 4 13 11 1 8 11 5 -18 23
7219B3nj0J0l2j0RJ1qMRJ1lQk6mk0L8NnM0l3J3k7J3K2pl7K2Jj5NMm4K5joK0oJ7
$$ 23 18 8 18 -14 -24 -15 -4 -12 -8 1 12 9 17 -9 -13 -33 5 10 5 45 12 25 -2 11 33 26 -11 11 12 -3 2 6 -38 -13 -14 -20 0 -6 11
7258A1jNl4K5NrPnj8mK4j5k3J6J2J0lqJ8%K1l9J9Pj0K0j4k1RlJ8k8RjJk6L4pj1
$$ 11 10 15 -19 6 11 2 9 4 -14 -18 6 -9 -32 -16 -4 6 3 -5 13 13 34 -5 14 21 11 31 17 -4 5 2 20 -8 1 0 1 -25 9 2 -9
7297iQooJ7Ppj9N0n2K6j2k5K6k8QK4J7m0L7k9rK4J3j7L1j2mMJ4k4lJ7qK1n4K5
$$ -9 -1 -7 -13 4 11 4 -15 35 -17 9 -3 -28 -2 -30 -22 2 19 -21 16 -13 -22 2 15 -2 29 17 13 17 31 7 4 21 13 34 -20 5
7333EJ2l8J6j2J7k%l5K5K1l1j5N9k4OpP%l6OQJ6plJ5Lj6J2k9K7K4j5pOMpmj2J6
$$ 5 17 -21 -5 -17 0 -2 -2 -37 -12 9 -22 -37 22 -2 4 -3 4 4 -32 -26 -18 -2 -9 -12 3 6 -10 2 -27 0 24 9 2 8 12 5 1 -11 5
7372E%ro%J6j9NQj7mJ9J2k0Rl2L8k9J0Qk1L8l1j7M4j5L%oJ2J0k4PK8j4LnkJ5%
$$ 5 5 -4 -10 -10 6 -13 -8 0 -17 -21 -2 10 -10 -1 -33 5 -24 -14 -6 -27 11 -20 -37 7 -8 -5 -5 -11 1 11 -13 -6 22 8 11 6 4 19 19
7411A9j5Pj4K5J0rk8J4oJ3k0jrOj0kJ3K0m2K9j3j2K5j3J2L0k2j5j0K7j5J6l2O
$$ 19 4 11 -3 22 32 23 -5 9 3 16 -4 -5 -14 -8 -18 -20 -7 13 -29 0 -13 -25 0 -13 -1 29 7 -8 -18 9 -6 10 -22 -16
7445a6OJ6nJ9j2j7L7k7M1m0JJK1k1Qj8kJ1j3K6m3j6Q4n0J4%qj4kJ6l2K9J5oKK0
$$ -16 -10 6 1 20 8 -9 28 1 42 2 3 4 25 4 12 -6 -8 3 -10 16 -27 -43 41 -9 5 5 -3 -17 -19 -3 -35 -6 9 3 5 25
7481B5j0kK1lk2%J6j6l2M2k7K7l7M9j6j3j1kK1j1%QlPj9j3K6J0k5jL3k3k1nK4
$$ 25 15 13 34 31 9 9 25 9 -23 19 -8 19 -18 31 15 2 -9 -11 10 -1 -1 7 4 11 -8 -21 5 15 -10 -11 22 -1 -22 -27 -3
7516cmJJ6j1JK8l4J0MRplOkj3K2qnnK2Ll5oO3l0JnpqqNk2O5n0J0J1j2j7J6jpK
$$ -3 -7 -6 10 -1 0 28 -6 4 8 17 10 7 13 11 -2 20 12 7 2 24 27 -8 -14 49 19 20 15 8 0 -8 -3 -25 40 -10 0 11 -1 -18 -2 -3 -10 -8
7558hk4J3J4j9L0J2rj2J8jK0j6rJ7j0j3K6L5k0m8J0J8k3K4l0K2l0MK2j0J8m8J2
$$ -8 -32 -19 -5 -24 6 18 9 -3 15 14 34 18 9 26 16 3 29 64 44 -4 6 24 1 25 -5 17 -13 -9 13 3 21 -27 -15
7591a5J1j0QnK4%lk3Rj5J1K2k7J3%%OK2op%k8M1j1kkJ8j3Qk0rQJ5j3J6Ok1Kk1
$$ -15 -4 -14 -6 -11 13 13 10 -13 -4 -19 -8 14 -13 0 0 0 6 28 22 15 15 -13 28 17 15 13 31 18 26 6 -3 5 20 7 23 29 8 10 -11
7630a1jRK2m2L1k1J4Rj5M0k7l3J2K9j9Qj0nj5M5k3J3rJ0KMMlJ9j2j8j5j4K5qr
$$ -11 -12 -3 19 -23 8 -13 1 10 -5 35 8 -25 -13 16 -3 5 -5 -10 -25 20 -3 10 1 11 13 17 21 18 37 25 7 -8 -22 3 -5 -14
7666a4J7Lk0J8j9K9lPj6pqj4L3l1KqK5j9J4K6k7pK3Oj2j9J5J6K0k4NJ7%l8K7l3
$$ -14 3 6 -14 4 -15 14 11 18 2 -5 -13 -27 6 -25 -23 -31 -6 -25 -11 15 -12 -19 4 10 -2 -21 -6 10 30 6 11 28 28 -10 17 -16
7702a6L2qJ9j1l4M2l9MNK8rnl9L3qj2Kj9L5K2l7rK5j3L4k3j3K1k9L3Mk2Rj5L8
$$ -16 16 8 27 16 -18 24 -15 -11 -6 22 13 8 -31 2 -6 -18 -16 -35 0 22 -15 -24 1 -12 22 -1 -14 7 -22 11 15 -7 2 -13 25
7737B5m2J3kkL6J0l1Ok6K1jj2J5j1J1Jj5Rml6qL0J1J3l0NNj0K7k3J5k6K1L4l5
$$ 25 -17 -4 -6 -8 28 38 7 13 -13 8 7 -5 10 -1 10 11 -4 5 1 -35 -43 -13 -2 11 -19 -14 -9 -19 8 -15 0 -26 -5 29 -6
7772fK3k1j8J0PL6j7J6k4J1Qk6Pj3K3j0K7j6J3J0k9j2J1j5J0Lk6KK1j3k4K8rj1
$$ -6 17 -4 -22 -12 -5 31 14 30 6 17 25 -1 6 -7 16 6 33 17 30 40 11 -1 10 -5 5 8 -18 -16 5 -8 -32 -4 -13 -24
7806b4J6%LJ4k9K1J2kMoQJrl4K3K3Jqj4k2L1j2JK0J8jm8J6J6pJ1l2rM0Ll3qqK5
$$ -24 -8 -8 -5 9 -20 1 13 11 15 9 17 18 9 -25 -2 21 22 14 0 -22 9 -3 -2 18 36 35 -13 3 19 12 23 -9 -18 22 25 -8 -16 -24 1
7845AmnJjLj0PJK8m8K3K2j6lKOK8m5L8Nj5k0K9l2MK7m0J5K2qj2JJ4j1j0L2j7l4
$$ 1 -3 -8 -7 -8 -5 -15 -8 -7 21 -27 -4 18 2 -1 1 7 35 -10 28 33 18 -2 27 -5 -1 26 -14 1 23 15 3 4 18 7 -3 29 12 -22
7883b2L4l0L6j6l2K2%mJRjnj4lJ9j4J6qL4j8nK0j7%J2Pj4k7K0jrN6l4p%J0KJ2
$$ -22 12 -18 18 2 -30 -8 -8 -12 -11 -2 -3 -8 -22 -25 -6 -20 -4 -12 22 4 -1 19 2 2 14 21 7 -20 0 -1 -10 46 12 5 5 15 17 29
7921B9l8j1LJ0L0l3RqPL3m5pK0l0L9lj0lrnL7j2KmK6Kk3J2k0M9m2kj5M8m4QnK7
$$ 29 -9 -20 -17 -7 23 -10 -1 -9 -2 31 -14 -21 -1 -31 8 5 -5 -8 -17 -22 15 3 5 1 27 29 6 18 -2 47 5 3 -12 36 -8 0 -5 22
7959B2koJ0m2J2l3P7j2jn6NM7l6J9kj9J1j5J7pJ7%j4J7%Lpj8KL2jnQn1J8OK8j2
$$ 22 20 14 24 -18 -6 -39 38 26 25 -31 -26 21 -15 4 2 -17 -6 -21 -4 -11 6 6 -8 9 9 12 5 -13 -11 21 20 15 23 -28 -10 -4 24 12
7997A2Oj4lj5J7j7rM9m7M5k5j0mJ6k3jK9qqK0j4lj1J0mNJ4l5N2l2MMrL4j8K0l4
$$ 12 18 4 1 -14 3 -14 -23 26 -21 24 -1 -11 -15 1 -22 -23 6 -2 -10 10 -4 -7 -18 -8 -12 -7 7 -28 24 -8 -4 0 -9 25 7 27 -7
8034gJ5Mj0J1Mj9M6k6kj5rk2M3Klk2J2mnKoJ4pJ2j5OKj0J4k3L3j2j0J0j6J5J3
$$ -7 8 12 2 13 17 -2 44 18 16 1 -8 -30 13 15 12 -10 2 -2 -7 -5 -11 3 -4 8 -7 -1 1 -9 5 -18 15 3 -7 3 -13 2 15
8071A5j9j4K5MJ5l5K0K0j0kLk5K5J1k2%Pl0oK3j3k0PjJ7J9rk4KK0j5KK0OOk0m
$$ 15 -4 -18 7 11 26 -9 11 31 21 19 22 -3 22 33 11 11 18 -12 -18 5 -8 -28 -21 -22 -5 14 5 -19 -17 3 -12 -10 10 16 22 2 -2
8108bJ6Kk3J5LrjK0k9J3J6J0k2OJ7j5MQj3j0K2k4j0J3j0nLOk6MJ7j6J9roJ0J2
$$ -2 14 16 -7 8 11 2 1 21 -8 5 21 31 9 15 32 17 21 29 16 6 28 4 -6 7 -3 -8 -5 1 -25 -21 -4 -20 -1 -10 -16 -6 6
8145FojJRJ8k1j3kK1kjPk3M2k8K0j1j1J2Lj3k5J0J9k9J1KJ3J7qLol8K3Qqk8PJ6
$$ 6 0 -1 0 9 27 6 -7 -9 12 10 9 16 -7 35 7 27 16 5 17 20 7 -18 -8 11 -18 -7 -5 8 25 17 20 14 -24 -1 7 -1 -29 -22 -6
8184fl0L2p%mJ8M
$$ -6 -36 -4 -11 -11 -15 3 7
8191G
$$ Imaginary data points
##PAGE= N=2
##DATA TABLE= (X++(I..I)), XYDATA
0@%%%%%%%%%%%%%%%%%qJ6j6J6j6J6k4L2l2M0m8N0n8O8p6Q8j00J09j21J36j54J74
$$ 0 0 0 0 0 0 0 0 0 0 0 0 0 0 0 0 0 0 -8 8 -8 8 -8 8 -16 16 -16 24 -24 26 -32 36 -40 48 -52 57 -64 72 -82 92
39I2j94K16k39K65k95L27l60L94m34M78n26N81o41P07p81Q63r56J063j186J330
$$ 92 -102 114 -125 140 -155 172 -188 206 -228 250 -276 305 -336 371 -410 453 -503 560 -626 704
59G04j501J710j970K299k738L351m261N758q630J5986o8414j41711J94655J45012
$$ 704 -797 913 -1057 1242 -1496 1855 -2406 3352 -5278 10708 -57706 -199417 -4762 140250
73A40250j10524j15745O5561P8088l1572m4886J3360r064q170N3202L0205p3185
$$ 140250 29726 -86019 -20458 57630 26058 -18828 -5468 -14532 -22702 30500 60705 -12480
85a2480o4539O0908R0387m8873r6143L0967P8213p933l7829m945Q168M600J1798
$$ -12480 -77019 -16111 74276 25403 -70740 -39773 38440 30507 -7322 -12267 -4099 501 12299
98A2299Q816k6324k7335L7767L8893l9574m7174K2753M1345q310k5471J1162O259
$$ 12299 21115 -5209 -32544 5223 44116 4542 -42632 -19879 21466 13156 -12315 -1153 5106
111E106j7871J8087K2158l5592k1369L8847K2144l3310k9322K4048L0115k0651
$$ 5106 -12765 5322 27480 -8112 -29481 9366 31510 -1800 -31122 -7074 23041 2390
123B390k2154K1028J3919j8889p094K3989O147l5907o646M2771N60m2548K304
$$ 2390 -19764 1264 15183 -3706 -10800 13189 19336 -16571 -23217 19554 20114 -22434 -20130
136b0130L3522m51k4973j431K2703J172j5948Q683R582j6811o760J6343O049j6530
$$ -20130 13392 12941 -12032 -13463 9240 10412 -5536 3147 12729 -4082 -10842 5501 11550 -4980
150d980r607J6440O941j8164j191J5872m59o939J336M621L64p767O52J0426m259
$$ -4980 -14587 1853 8794 -9370 -10561 5311 4852 -2087 -751 3870 4234 -3533 -2881 7545 3286
165C286q441N304K762n548j512M785J150o980M016J2493q859j2621J0482P841
$$ 3286 -5155 149 2911 -2637 -4149 636 1786 -5194 -1178 11315 2456 -10165 317 8158
179H158q345o033L973O988l354p204N859L313p006K081P593o49o634k559Q241
$$ 8158 -187 -6220 -2247 4741 1387 -5817 42 3355 -3651 -1570 6023 5374 -1260 -3819 4422
194D422K006j2083j241Q601j004k693O04K20N56j145L039L819o253r62Q026j818
$$ 4422 6428 -5655 -6896 1705 701 -1992 -1388 -1168 -612 -1757 1282 5101 -1152 -2114 5912 4094
210D094o295o33K174K697k195j950K732l247j720O786J65m837k90L296N036l900
$$ 4094 -2201 -2834 -660 2037 -158 -2108 624 -2623 -4343 2443 2608 -2229 -2519 777 5813 1913
226A913q456N147O649m008l545p85K297L293k046p39M5j834N008J658p284l8M268
$$ 1913 -6543 -1396 5253 1245 -2300 -3085 -788 2505 459 -280 -235 -2069 2939 4597 -2687 -2725 1543
243A543l7k022m070J713N497k612j675K519p40J103N22j133K292k133k366L849
$$ 1543 1506 -516 -4586 -2873 2624 12 -1663 856 116 1219 1741 608 2900 767 -1599 2250
259B250j789l315K273m1j56J8j001K639p00k121M266n69l366K849L81j338J95
$$ 2250 461 -2854 -581 -622 -778 -760 -1761 878 178 -1943 2323 1754 -1612 1237 1618 280 475
276D75j552J522L98k968K112Q45k073J746l08o15J500k326R79K790l627r87K285
$$ 475 -1077 445 843 -2125 -13 832 -1241 505 197 -418 1082 -1244 -265 2525 -1102 -2089 196
293A96m32N97j011o51K657j016j50K072k991K52L290k613j441P54k76J172j725
$$ 196 -236 361 -650 -1301 1356 340 190 2262 -729 -477 2813 200 -1241 -487 -763 409 -1316
310a316j301K985n74n95J590j666J201K037k469N09Q11j457J333n54j841J144
$$ -1316 -2617 368 -206 -801 789 -877 324 2361 -108 401 1212 -245 1088 534 -1307 -163
326a63l41L44O66k314J291J510k185J467Q27k206J285N38r50N69p61O73Q71j981
$$ -163 -504 -160 506 -1808 -517 993 -1192 275 1102 -1104 181 719 -231 338 -423 250 1121 -860
344h60R66J185j844J011K19j521J549k77j474Q58m93J26P93j374P98N65j129J903
$$ -860 106 1291 -553 458 677 -844 705 428 -1046 -188 -681 -555 238 -1136 -338 227 -902 1001
362A001pj781J973K27j410P96n79m72M77q28M76l83j181K019l44j740K113K58
$$ 1001 994 -787 1186 1413 3 799 220 -252 225 -603 -127 -510 -1691 328 -16 -1756 357 615
380F15q34J209j120l78J716o53n49k11l43J647m82j619R20k46P4J269j763j91
$$ 615 -219 990 -130 -508 1208 555 6 -205 -548 1099 617 -1002 -82 -328 -254 1015 -748 -939
398i39J810j159m14M29l75J238m89j084J810l02j094J280m96p2J115r80k51j2
$$ -939 871 -288 -702 -273 -648 590 101 -983 827 525 -569 711 215 143 1258 278 27 15
416A5l51R39j309r80K170n62p76J090j461N99K256j807l28J767j88k65r71o08
$$ 15 -336 603 -706 -1686 484 -78 -854 236 -1225 -626 1630 -177 -505 1262 1074 809 -162 -770
434g70J134m70J83O78j577O47M40j953J773Q22k545J283J624q83l61j353O69K617
$$ -770 364 -106 77 755 -822 -175 265 -1688 85 907 -1638 -355 1269 386 25 -1328 -659 1958
452A958j228j641M83J013J444j877k234K207O99p84J97j566Q70J750k387n7J572
$$ 1958 730 -911 -428 585 2029 152 -2082 125 824 40 237 -1329 -459 1291 -1096 -1153 419
469D19j187Q88R06j276L96q7k73J101k14j89k81q95J513o35k134J897J70q84K297
$$ 419 -768 120 1026 -250 146 59 -214 887 673 484 203 -692 821 186 -1948 -51 119 -765 1532
488A532j430k382K156P71n40R0p69J117J075j140j126j004J851K530k644j335
$$ 1532 102 -2280 -124 647 107 197 -572 545 1620 480 -646 -1650 201 2731 87 -1248
504a248J852o47J02jk268J694K348j373p82q30j12J786k04l19Q34n18L62l1j264
$$ -1248 604 -43 59 58 -2210 -516 1832 459 -323 -1153 -1265 521 317 -2 832 314 676 645 -619
523f19L76k46M05K172j527j831R44p75N08J373k162J47K999l19j945j079R39K096
$$ -619 -243 -489 -84 2088 561 -1270 -326 -1101 -593 780 -1382 -1235 1764 1445 -500 -1579 -640 1456
541A456n43j288N0N57J784j190l458J864K232k032j5Q54m38N58o52j092R15M14
$$ 1456 913 -375 -325 232 2016 826 -2632 -768 1464 -568 -583 271 -167 391 -261 -1353 -438 -24
559b4K76P0j71J053r56j874J529J078n43J88l98K70Q3k124K91J595p75N67J015
$$ -24 252 322 151 1204 248 -1626 -97 981 438 626 228 498 581 -1543 -1252 343 -432 135 1150
578A150j172o80l47J22J387j18j84J290J32j061j884m68K757K78j841J150N36
$$ 1150 -22 -702 -1049 -927 460 342 158 1448 1580 519 -1365 -1833 924 1202 -639 511 1047
595A047j285j35j064m14K025O78m73l1l6R1j275n49K115J05q73J211j10j121n14
$$ 1047 -238 -373 -1437 -1851 174 852 379 348 312 403 -872 -1421 694 799 -74 1137 1027 -94 -608
614f08p83J082J176r28K15L18o80O7j024m60K067K80n43L29n24K13J32j093L77
$$ -608 -1391 -309 867 -61 154 472 -208 -141 -1165 -1625 442 722 179 508 -16 197 329 -764 -387
633c87Q24K79O54j286r17R40r49k66J374k66K16M79j069j96j8q4J153j21j0R39
$$ -387 437 716 1370 84 -833 107 -842 -1108 266 0 216 695 -374 -570 -588 -672 481 360 350 1289
653A289j165o44Q13n32J67N17l69N78o95j068J113j06m36P58n13K98P12j247J96
$$ 1289 124 -520 293 -239 -72 445 76 654 -41 -1109 4 -102 -538 220 -293 5 717 -530 -334
672c34O56o45P14K18n98N79m62j96M13j018N89Q59j180K09K41p93P03l13n42J373
$$ -334 322 -323 391 609 11 590 128 -68 345 -673 -84 775 -405 -196 45 -748 -45 -358 -900 473
692D73k1l83M15p88K19N33p50N97K41m85P01q05p99Q04m35J66Q41q87K37M37j012
$$ 473 452 69 484 -304 -85 448 -302 295 536 51 752 -53 -852 -48 -483 -317 524 -363 -126 311 -701
713g01L93K27k48J044k13m87M02p55J48P99p91K92M00n17K86p23n46J258k72m21
$$ -701 -308 -81 -329 715 502 15 417 -338 -190 609 -182 110 510 -7 279 -444 -990 268 -4 -425
733d25P03o03J16M88q91M35P35l79L32k88l09O34o13j08N90p24L30L24r56M47
$$ -425 278 -325 -209 279 -612 -177 558 179 511 223 -86 548 -65 -173 417 -307 23 347 -609 -162
753a62L21q18N45J64k19L79m68J90O55o79J80L41n91N00R5o79M79q7l71K94m01
$$ -162 159 -659 -114 50 -169 210 -258 -68 587 -92 88 429 -162 338 433 -246 233 146 -225 69 -332
774c32J44M06o75K44K85n87N52J24n08O68k5l78L32j93P2K30m50M14Pq71M71J29
$$ -332 -188 218 -457 -213 72 -515 37 161 -347 321 296 -82 250 57 129 359 -91 323 330 -541 -70 59
796E9n29N31k05l20N43k56j27L84k34M31P7m93N12j10n03O09k20l20N14m22k40
$$ 59 -470 61 -144 -464 79 -177 -304 80 -154 277 354 -139 373 263 -240 369 149 -171 343 -79 -319
817c19L70l58J75P6l34N56j84m79P01j18l63N85k04K0M06n32J7K01k63M20l74
$$ -319 51 -307 -132 -56 -390 166 -18 -497 204 86 -277 308 104 124 530 -2 15 216 -47 373 -1
838am15O84l22m19N82l95j6M85m78J90L38l56K86r4p8N75n60j36O61n43J2L05
$$ -1 -416 268 -54 -473 109 -286 -302 183 -295 -105 233 -123 163 69 -9 566 6 -130 531 -12 0 305
860C05q09L28M50o39J85k2p5M98n16n4P32m35O1L40n45M45J30n40M27k08k47N81
$$ 305 -504 -176 274 -365 -180 -202 -277 221 -295 -349 383 -52 9 349 -196 249 379 -161 266 58 -189 392
882C92n72j64N52n98J65L79o07M30J00n62N90J20l51J90j80N39K54j099M54M79
$$ 392 -180 -344 208 -390 -225 154 -453 -23 77 -485 105 225 -126 64 -116 423 677 -422 32 511
902E11p82L86n6m65O87k41m70L66k81J50L85m70L10R5k86O24m63l67R91l72l82
$$ 511 -271 115 59 -406 281 40 -430 -64 -345 -195 190 -280 30 125 -161 463 0 -367 624 252 -130
923a30M90l76rJ37n20M98N6o83N09R8l22K03l56K13O87m87k1O4j96P13m44p09
$$ -130 360 -16 -25 112 -408 90 146 -537 -28 70 -252 -49 -405 -192 495 8 -13 51 -145 568 124 -585
945e85Q94K22m86J14n38R0N60n82k2M30j44P2k19n5M30n66K17R24o44k52M78k65
$$ -585 309 531 45 159 -379 -289 271 -311 -333 97 -47 25 -194 -249 181 -385 -168 756 112 -140 338 73
967G3J13j14m30N52O2m72L43j71l55J53j1M72q0p31O84N20o94k13O0L74O45o51
$$ 73 186 72 -358 194 256 -216 127 -44 -399 -246 -257 215 135 -596 88 608 -86 -299 -239 135 780 129
989A29m38N48j45j03p6l56N30K38n21O2k6j31J32j84M32M81p61l1O83k19l87j63
$$ 129 -309 239 94 -9 -85 -441 89 327 -194 -132 -158 -289 -157 -341 91 572 -189 -220 463 244 -143 -306
1011c06L16Q39m50p57M17j38k64K37n8J39P6k33K82k43n61P61M29l29l8p7P9J16
$$ -306 10 849 399 -358 59 -79 -343 -106 -164 -25 51 -182 100 -143 -704 57 486 157 119 42 121 237
1033B37n17L53M30m86m1J30k89k1k71J48P58l86l81M19j39oJ13l37L06L97o7M4
$$ 237 -280 73 503 17 -24 106 -183 -204 -475 -327 431 45 -336 83 -56 -62 51 -286 20 417 350 394
1055C94n36q8M65m68j2N70k88P5J30o22K9Mo6O85m1l42L68j72j49q2k31P24K93
$$ 394 -142 -230 235 -233 -245 325 37 112 242 -380 -351 -347 -413 272 231 -111 257 85 -64 -146 -377 347 640
1078F40o68K47R9n34n6r4L80M69p59M4O77p24l97L60K53M81j56l18M42k75k72
$$ 640 -28 219 318 -216 -272 -366 14 483 -276 -232 445 -279 -676 -316 -63 418 262 -56 386 111 -161
1099a61M0j86O54L35p23K09j53o41M21Ok30P32L0l90K2j78J53j55j84Q99R9o02
$$ -161 -121 -307 347 682 -41 168 15 -626 -205 -199 -429 303 333 -57 -35 -213 -60 -215 -399 500 599 -3
1121cK48j40k35J65l73K85O55n62q1J21n40J70J20p6M22k1MJ03o22QM38r1L23
$$ -3 245 105 -130 35 -338 -53 602 40 -41 80 -460 -290 -170 -246 176 155 159 262 -360 -352 86 -5 318
1144C18R3k26K27o46m31P94r2l18O23n5l96k29k03L87P1m4N83r1l33N4l63J74
$$ 318 411 185 412 -234 -665 129 37 -281 342 287 -109 -338 -541 -154 -83 -127 456 365 32 86 -277 -103
1166a03L58k99L74K62o92n6J23k58J03P3J50J80l67k7J69k84J85K84j40K18m6
$$ -103 255 -44 330 592 -100 -156 -33 -291 -188 -115 35 215 -152 -179 -10 -294 -109 175 35 253 207
1187B07j57K26l69o6M41k75j49L85j66j96j25j11L24m0j54M09j3j79k9j52J96
$$ 207 50 276 -93 -159 282 7 -142 243 77 -119 -244 -355 -31 -71 -225 184 171 -8 -37 -189 7
1208GJ94k24L49J24n45Q9L2l01K14J64j6L1k73J6R3l69J89L74q4J41j58j22L01
$$ 7 201 -23 326 450 -95 -6 26 -275 -61 103 87 118 -155 -139 -46 -415 -226 148 64 205 47 -75 226
1231B26l28j42N62lk28J3j32L0j00j61L28K2k66J94j38j28K39k2N5J41j35J89
$$ 226 -102 -244 318 315 87 100 -32 -2 -102 -263 65 87 -179 15 -123 -251 -12 -34 21 162 27 216
1253B16J6l77K62J19k85J50p8n6J61l95N7L47k73n7J83p5J58j74q8M73k72j70
$$ 216 232 -145 117 236 -49 101 23 -33 128 -267 -210 137 -136 -193 -10 -85 73 -101 -189 284 12 -158
1275a58M19j89q4J96k03N4K4j75K52j19k50K89p3j44J39j14J42J03l14K63J47
$$ -158 261 72 -12 184 -19 35 59 -116 136 17 -233 56 -17 -161 -22 -136 6 109 -205 58 205
1296B05l07K33L8j08J48k68L3K40l80P1K89l51O7O5j92K08j27l1L33k30OK50k80
$$ 205 -102 131 169 61 209 -59 -26 214 -166 -95 194 -157 -90 -25 -217 -9 -136 -167 166 -64 -58 192 -88
1319h8J31J69k59K38k5k55K57j55j66K17k22P8J58k41J39K5k74L50nj93K67l5
$$ -88 43 212 -47 191 166 -89 168 13 -153 64 -158 -80 78 -163 -24 1 -273 77 72 -121 146 111
1341A11p7J14j89J24J15k91J49O1k19J46j18j50K70j96KK46k27N8J24j30K21m6
$$ 111 34 148 -41 83 198 -93 56 117 -102 44 -74 -224 46 -150 -148 98 -129 -71 53 -77 144 98
1363I8j68K96r1j74K16j97m9K16j76M1Qj90J72q9j61K66l5o4J95j49jJ45j22J18
$$ 98 -70 226 135 -39 177 -20 -69 147 -29 12 20 -170 2 -87 -248 18 -17 -81 114 -35 -36 109 -13 105
1387A05P7j69J08o3j20J58j59l8J51j71L6J13k27J24J02j68J32L0k7J48r2o2J65
$$ 105 182 13 121 58 -62 96 -63 -101 50 -121 -85 28 -199 -75 27 -141 -9 21 -6 142 50 -12 153
1410A53j39RJ45j82P6M1k45Q9N2r7Q5j39N0K12j78n3J52n5J20n2j20K31N8j74
$$ 153 14 23 168 -14 62 103 -142 -53 -1 -98 -13 -152 -102 110 -68 -121 31 -24 96 44 -76 155 213 39
1434C9N3p3rN5k07Q6J93k75j5J14q9Q4qm3J74m7n0R5q7P1R3j42J00K7k51J70j8
$$ 39 92 19 10 65 -142 -56 137 -138 -153 -39 -128 -44 -52 -95 79 32 -18 77 -10 61 154 12 112 139 -112 58 40
1461D0k07J28K0n5J04j46K7R9j24Q3M5MJ53j17j27K48j45j28J79p8J10L2l39J16
$$ 40 -167 -39 -19 -74 30 -116 -89 10 -114 -31 14 18 171 54 -73 175 30 -98 81 3 113 145 -194 -78
1485g8K28k87k9J04L4Q5j60L8J36j10O6P5j66K89k2k64J67j6j90J58o1l8J26k01
$$ -78 150 -137 -166 -62 -28 57 -103 -65 71 -39 27 102 -64 225 203 -61 106 90 -100 58 -3 -41 85 -116
1509a16p1Q6l3J32j3LJ32r9q6J55k22J49K90k46mP4k27N9m2j79L00M1j67L5l6
$$ -116 -187 -101 -134 -2 -15 -12 120 21 -65 90 -132 17 307 61 57 131 -96 -37 -79 -258 42 83 -84 -49 -85
1534h5Q0j18j24L87J9k13L03j40k43K60q9j14J89l2l6K7k04K1N6p9J39o4QJ72
$$ -85 -5 -123 -247 140 159 -54 249 109 -134 126 37 -77 112 80 44 71 -133 -112 -56 -135 4 -60 -52 120
1558A20k24n3J79q2J65P0k16J79N0l44Q9J04OQ9j70k9J39k01j00K4J81K31k39
$$ 120 -104 -157 22 -60 105 175 -41 138 188 -156 -67 37 43 132 -38 -67 72 -129 -229 -205 -24 207 -32
1581c2r1L22j83k06K37j9J08J56k00j38J10r9p2k2J69J37k59l4Q6j72O4J49pJ42
$$ -32 -123 199 16 -190 47 28 136 292 92 -46 64 -35 -107 -129 40 177 -82 -116 -30 -202 -138 11 4 146
1605A46Rj96L9l7o6K05L7l1O3j31j23k5p5J29R1k1M2o6o4J9j51J20J82m4J16J22
$$ 146 155 -41 -2 -39 -105 100 137 106 169 38 -85 -110 -185 -56 35 14 56 -10 -74 -55 -206 -86 96 52 168 290
1631B90k49p4O6j26j5J63J23o5j56Rk3k38J08J90m2J56M0k05pk0o3J66P9P9L7
$$ 290 41 -33 33 -93 -108 55 178 113 -43 -34 -57 -295 -187 3 -39 117 157 -48 -55 -75 -138 28 107 186 223
1656B23j02j80m6n0J21O6k9J06n3k25rL0J07J15k5J06J4k27k0J20j13J42J12p1
$$ 223 121 -59 -105 -155 -34 32 3 109 56 -169 -178 -148 -41 74 49 155 169 -58 -78 42 -71 71 183 112
1680A12nj04j12j8rJ20O7q3P8l7j87J02J3nJ97l2k5O4j00o0%j3J35jj49J12k9
$$ 112 107 3 -109 -127 -136 -16 51 -32 46 9 -178 -76 -63 -68 129 97 72 136 36 -24 -24 -37 98 97 -52 60 31
1707C1k18J25k8QJ47r5O9K2j44N6J8o0K06N0j09L7j53j2O3j09J26Q6j37K1q7j11
$$ 31 -187 -62 -90 -82 65 -30 39 61 -83 -27 -9 -69 137 187 78 115 -38 -50 13 -96 30 116 -21 0 -87 -198
1733a98J53n8MK50r3l0M5j25N6L9m9J61m6n9K3j23p6R5o8O3J14j71R2Mj31R0M2
$$ -198 -45 -103 -99 151 58 28 73 -52 4 43 -6 155 109 50 73 -50 -126 -31 -99 -36 78 -93 -1 3 -128 -38 4
1760Dk0J54j19j3J09j49L0O6j15J32J2j44N6p6j9Q0j02P2Q9j06K9Q4p2O3j7l4
$$ 4 -16 138 19 6 115 -34 -4 62 -53 79 91 -53 3 -73 -92 -12 -114 -42 47 -59 -30 54 -18 45 28 -6
1786fJ19m2n5P7r9K4L6p1K2Nq5R3q9n2J07l6M3L4l3JP3j02M8N8l6L8k8o6P3j11
$$ -6 113 71 16 93 -6 18 54 -17 5 10 -75 18 -71 -123 -16 -52 -9 25 -8 -7 66 -36 12 70 34 72 44 -22 51 -60
1816f0K5M9j9n1Kk1N8K4m2L8j7J0R9j03K6Q4m2JJ3n5j7%l4O4n1l4L0n5K8M3k9
$$ -60 -35 14 -5 -56 -54 -75 -17 7 -35 3 -14 -4 95 -8 18 102 60 61 74 19 2 2 -32 32 -19 -53 -23 -78 -50 -7 -36
1847c6K8K9k7N5j3n3P2J1o7M1m9RN5n9o2M9k9%M5p3O9J0m1J9K6lO1m4J5N7o6k6
$$ -36 -8 21 -6 49 36 -17 55 66 -1 40 -9 0 55 -4 -66 -17 -46 -46 -1 -74 -5 5 -36 -17 9 6 67 23 38 95 29 3
1879Col8N6K8p3rJ6j5lm9L9P2k3K3l7l0J02Qj11Q7K5j3Lo8k9P2m6l3M8l8K6l2
$$ 3 -3 -41 15 43 -30 -39 -23 -38 -41 -90 -51 21 -2 21 -16 -46 56 64 -47 40 65 52 55 -13 -42 30 -16 -49 -1 -39 -13 -45
1911d5p8J32np3Q2l8Q6K5j41R2N6p2L8l2p4Q3o1j1L5q6P2j9n9J03m8o7J82q3m2
$$ -45 -123 9 4 -69 13 -25 61 86 -55 37 93 21 59 27 -47 36 -25 -36 -1 -87 -15 -34 -93 10 -38 -105 77 -6 -48
1940d8J18o4mP0o1J1%p0L7jKL2r1J6Q2j27L7R7o2N1lo8J02%o3O1J9m5j1o7K8N1
$$ -48 70 6 2 72 11 22 22 -48 -11 -12 -10 22 -69 -53 29 -98 -61 36 -26 25 22 -46 56 56 -7 54 73 28 17 -50 -22 29
1972B9o0L6n6pQ0j01k3J28p5pJ27p6O7J9j20J5N3jPJ1l1Mp4J0nm9J16K0q9Q2k3
$$ 29 -31 5 -51 -58 22 -79 -102 26 -49 -56 71 -5 62 81 -39 -24 29 28 35 46 15 19 -55 -45 -50 -99 17 37 -52 30 7
2003Gm2N4m2K5O6Qj5j7l1J3l2j9P2n6mJ0j01M9O2n9pQ8m3J4Kl5O9J9j9oJ7J9j8
$$ 7 -35 19 -23 2 68 76 61 44 13 26 -6 -25 47 -9 -13 -3 -104 -55 7 -52 -59 29 -14 0 2 -33 36 55 36 30 47 66 48
2036D8p4l0O9j3J0j8l4O3p5m8N4M7L4N3n1k6M2o8QK6L4j2jm1L0j00MN9l6J6O1
$$ 48 -26 -56 13 0 10 -8 -42 21 -54 -102 -48 -1 33 86 35 9 51 -17 -9 17 51 39 38 -3 27 -73 -69 -10 -46 -30 31
2067C1l9n2N0j9pK9N1JMMm9m1K0P2o5J7M0p0j2l9%Q3KkL7p6L1np6P2J23m8m5N
$$ 31 -8 -60 -10 -29 -36 -7 44 45 49 53 4 -37 -17 55 -10 7 47 -23 -35 -74 -74 9 11 9 46 -30 1 -4 -80 -8 115 67 22 27
2101B7m6no7P0P5p5K5lq8L0Kn2J00N3k9K8j6m1K5j6O1%o3O2j1j30K8M4k2M3m2
$$ 27 -19 -24 -91 -21 54 -21 4 1 -87 -57 -55 -107 -7 46 17 45 29 -12 13 -3 58 58 -5 57 46 -84 -56 -12 -34 9 -33
2132c3K6J0n6NN6k3N9L3r0N2l5n0O5r1J13J6n6J2j6j00O2m5K8J25l3n1L0n0k7
$$ -33 -7 3 -53 -48 8 -15 44 77 -13 39 4 -46 19 -72 41 57 1 13 -3 -103 -41 -86 -58 67 34 -17 13 -37 -64
2161f4J3M7R7nn1M1r1q0O9JL6M6l7k6l2n5N0L6j7N5j0lK7p0kM3n0J17k4q0N6n6
$$ -64 -51 -4 93 88 37 78 -13 -93 -24 -23 13 59 22 -4 -36 -91 -41 -5 -22 33 23 20 47 -23 -25 18 -32 85 61 -19 37 -19
2193a9l3L6qM0L2q2lLk7JL8L4L8m%J8q4m0R7opL5m9Lm0n1K6N6k5L1j8K7k6m3K1
$$ -19 -52 -16 -24 16 48 -34 -37 -34 -61 -60 -22 12 50 46 46 64 -20 -60 37 31 24 59 10 13 -27 -78 -52 4 -21 10 -8 19 -7 -50 -29
2228b9M2L3j2K2j8om0j0J5JK1K6o2l9K5m8M2N7MK9n7k8K6J7%K7K7j8j1k6j8nM1
$$ -29 13 46 34 56 38 32 -8 -18 -3 -2 19 45 -17 -56 -31 -79 -37 20 24 53 -4 -32 -6 11 11 38 65 47 36 10 -8 -13 28
2261B8l2J2j5Qnk7Ok1K6M5k3K5j1l3M9j8l0N5j9k5K7k9j1ok6L2K1kj0J2j7K0k7
$$ 28 -4 8 -7 1 -4 -31 -25 -46 -20 25 2 27 16 -17 32 14 -16 39 20 -5 22 -7 -18 -24 -50 -18 3 1 -9 3 -14 6 -21
2294b1k9N9M1l9KJ4j4J2m9M0K2m4J0m4K7ml2M2J0k8PK1j1kJ1oL0j2J5JKo9N0r
$$ -21 -50 9 50 11 13 27 13 25 -24 16 38 -6 4 -40 -13 -17 -49 -7 3 -25 -18 3 -8 -10 1 -5 25 13 28 29 31 -38 12 3
2328CL3o2J7Rk0K4Ok1J8L8m2k0L3JK0l3MJ2Ll0J1j2K4Jl6kJ8j1lRNM1l9k6M4j9
$$ 3 36 -26 -9 0 -20 4 10 -11 7 45 3 -17 16 17 37 4 8 20 23 -7 4 -8 16 17 -19 -21 -3 -14 -17 -8 -3 38 -1 -27 17 -2
2364bK0L1j3Jl0j4J0k3PL3l5j0K1J6m9L4J6rjML4l9QKJ3rJ3j7j5jk1K7j8JOJ2
$$ -2 18 49 36 37 7 -7 3 -20 -13 20 -15 -25 -4 12 -37 -3 13 4 3 7 41 2 10 12 25 16 29 12 -3 -4 -25 2 -16 -15 -9 3
2400Ck1K8l0L6l5NK6k3KL2kOk7j0L0Rk2Lj6k5PJ7qJ3ol2L9K5j6l0MK4RjLK0m7
$$ 3 -18 10 -20 16 -19 -14 12 -11 -9 23 21 27 0 -10 20 29 7 10 -6 -31 -24 -7 -15 -2 -8 -40 -1 24 8 -22 -18 6 15 14 17 37 -10
2437a0nr%K0qJ2%k0mJ8QnK3j7J5j9J7K5k5Ll3J6nL2m6LJ5k6KJ0oK1ppPMNj5J5
$$ -10 -15 -24 -24 -4 -12 0 0 -20 -24 -6 2 -3 20 3 18 -1 16 41 16 19 -14 2 -3 29 -17 -14 1 -25 -23 -13 -19 2 -5 -12 -5 -1 4 -11 4
2476DK0Kk2L%Oj2Qk3J1n7K3K2L2l6PrRK2%j7J0J9jqk8M2m1MQk2K6Nj1Rpl9J9J0
$$ 4 24 26 4 7 7 13 1 9 -14 -3 -60 -37 -15 17 -19 -12 -21 -12 10 10 -7 3 22 21 13 -15 27 -14 -10 -2 -24 2 7 -4 5 -2 -41 -22 -12
2515a2MK2j3nMNj4J0pL7mj5ql0jLl1L5qM1jk8%JpQJ3NK7on4M0J7o0M2qnKj3Nj2
$$ -12 -8 14 1 -4 0 5 -9 1 -6 31 27 12 4 -26 -27 -24 -55 -20 -28 13 12 -16 -16 -15 -22 -14 -1 4 31 25 -29 11 28 -32 10 2 -3 -1 -14 -9 -21
2556b1j4K2J1l1O3k7j7j6K8j2O2m2Rk7j6mJ0J3K0k9pJ9k1kJ9jL0%k4L8m1MO8l7
$$ -21 -35 -13 -2 -33 30 3 -14 -30 -2 -14 48 6 15 -12 -28 -32 -22 -9 11 -18 -25 -6 -27 -29 -10 -11 19 19 -5 33 -8 -4 64 27
2590B7l9RJ5Nj4j7Mnj2K5j8k6N4n2K0K2J0j1kNK2j2j9MJ5K2j8m8L6%Ol0QJ5J0
$$ 27 -12 -3 12 17 3 -14 -10 -15 -27 -2 -20 -46 8 -44 -24 -2 8 -3 -5 0 22 10 -9 -5 10 32 14 -34 2 2 8 -22 -14 1 11
2625A1J1j0Mj1orN2Qk9j8J7mj6J5jl7M4m6K0k9Pj0K8mJ8L1j9m5J2NRrM5J0l3r
$$ 11 22 12 16 5 -1 -10 42 50 21 3 20 16 0 15 14 -23 21 -25 -5 -34 -27 -37 -9 -13 5 36 17 -28 -16 -11 -2 -11 34 44 11 2
2661BpMok3L6Rj4j5j2QMJ7L1l3J6Qk1j5J1J4j3MJ8k7j6K8n0L4LKMK0j9kJ0j6J1
$$ 2 -5 -1 -7 -30 6 15 1 -14 -26 -18 -14 3 34 1 17 25 4 -11 0 14 1 5 23 -4 -20 8 -42 -8 -5 -3 1 21 2 0 10 -6 5
2698Ejk3M5k2qoNJ1Jj7j0K1k7K2Rj0J6kj0j2K8j8Ok0J5K4k3Qmk4J7k1MM7l9K8
$$ 5 4 -19 26 4 -4 -10 -5 6 7 -10 -20 1 -26 -4 5 -5 11 9 -1 -13 15 -3 3 -17 -2 22 -1 7 3 -21 -4 -25 -21 26 -13 15
2734A5k8rJ3J8l3K5K0J4k0j2j5L0k1J1J7k3j1Kj9L2Qj7K0l0mJ2LJ8j2j5N7m1j5
$$ 15 -13 -22 -9 9 -24 1 21 35 15 3 -12 18 -3 8 25 2 -9 -7 -26 6 14 -3 17 -13 -17 -5 -2 16 4 -11 46 5 -10
2767a0%J8qpJ7l3M9k4k8J4pOj4J6J2j3J0J1Qj1Pj5M5m4k6N4j4j3nJJ0k7K8J3k0
$$ -10 -10 8 0 -7 10 -23 26 2 -26 -12 -19 -13 -27 -11 1 -12 -2 9 17 6 13 -2 43 -1 -27 27 13 0 -5 -4 6 -21 7 20 0
2802@pK0k2K6ol4K1L7m8QrNK4j6m1M6k6K2mpJJ3J3k6KQkj6J6RJK6k9k2OL8j6K
$$ 0 -7 13 -9 17 11 -23 -2 35 -13 -5 -14 -9 15 -1 -42 4 -22 0 -4 -11 -10 3 16 -10 -8 0 -2 -18 -2 7 8 34 5 -17 -11 27 11 13
2840A3J1Lk1%Rj1oj4J6K1k1J3lJ3Kk9J2l5J2J6k8J8J6J0k5K7l8j4L2l2K4J6J1
$$ 13 24 27 6 6 15 4 -2 -16 0 21 0 13 10 23 25 -4 8 -27 -15 1 -27 -9 7 17 -8 19 -19 -33 -1 -33 -9 7 18
2873A8mMJj8lJ8Pk3J3rmJ4k1JK9j3k2j0k%RKJ2J1J2ok3NK0j4kJ1k7J0k8%N7k3
$$ 18 14 18 19 1 -2 16 23 0 13 4 0 14 -7 -6 23 10 -12 -22 -24 -24 -15 -13 -1 10 22 16 -7 -2 18 4 2 13 -14 -4 -32 -32 25 2
2911Bkmj0NK6JoNnPj1L0l5jQk2RnJj0K3l3J8OK3k0Kk7J5k2L8l0L3MRj2k7J9j5
$$ 2 0 -4 -14 -9 17 18 12 17 12 19 8 38 3 2 10 -12 -3 -8 -7 -17 6 -27 -9 -3 20 0 2 -25 -10 -32 6 -24 9 13 22 10 -17 2 -13
2950a3mL1nk5lrJ7M3o0K9pPK4n0jJ2K5k1K2NRj4J9m2lJ3LJ8n1K0J6j4K4nRpNk3
$$ -13 -17 14 9 -16 -19 -28 -11 32 -28 1 -6 1 25 -25 -26 -14 11 -10 12 17 26 12 31 -11 -14 -1 2 20 -31 -11 5 -9 15 10 19 12 17 -6
2988fnJ7QK0j6lkk5OL5l6j7J5J3Rj9lJ9l5M6J3ll0K1k4nk3L4QpJ5j5j0rj5kK2
$$ -6 -11 6 14 34 18 15 13 -12 -6 29 -7 -24 -9 4 13 -6 -9 10 -25 21 34 31 1 22 -2 -7 -30 4 12 5 20 5 -5 -14 -29 -31 -9
3025irPj1K2nJ2lj0RJ3j2Ol5N1l7J5j6M0j3n0K7K5rl2L2mJ1pQm6M8nmol3M9l8
$$ -9 -18 -11 -22 0 -5 7 4 -6 3 16 4 10 -25 26 -11 4 -12 28 15 -35 -8 17 8 -24 8 4 15 8 16 -30 18 13 9 3 -30 19 -19
3062a9J3k4K6kj1KJ1j1nk4J3K3jK2j2pNJ1j6J9k0K5oLOl1Pl8kL2L2Jl1K3oj3J
$$ -19 -6 -30 -4 -6 -17 -15 -4 -15 -20 -44 -31 -8 -9 13 1 -6 -1 10 -6 13 -7 18 12 15 21 -10 -3 -41 -43 -11 21 22 -9 14 8 -5 -4
3099dOrlL0jk9%RQlRj8ROk4J0j2J5J8Qk0k4J6J8k7J6j4K3Ol7L3k3J1K3l4J0k3
$$ -4 2 -7 -10 20 19 -10 -10 -1 7 4 13 -5 4 10 -14 -4 -16 -1 17 25 5 -19 -3 15 -12 4 -10 13 19 -18 15 -8 3 26 -8 2 -21
3136b1K2j8J2Kj0OJ2mK7k4J4lj0Lm6J7K0Nk3RMj2JJ7K2l2J4%J0jk5J7J0k8L8%
$$ -21 1 -17 -5 -3 -13 -7 5 1 28 4 18 15 5 8 -38 -21 -1 4 -19 -10 -6 -18 -17 0 22 -10 4 4 14 13 -12 5 15 -13 25 25
3172B5qk3K9k0mPkqlJ2%Oqjk8O0n5L4k5L3j9JNqJPk2K4Nl1JK6k7J7J6n7K0L9l1
$$ 25 17 -6 23 3 -1 6 4 -4 -7 5 5 11 3 2 -26 34 -21 13 -12 21 2 3 8 0 1 8 -14 10 15 -16 -15 11 -16 1 17 -40 -20 19 -12
3211a2K8Jk1J4J3NKj6m7K8lQj0K0j6j3K2l8K7J0LJ7qNJj0j4J2K7n9L8mmJ5j9J1
$$ -12 16 17 -4 10 23 28 30 14 -33 -5 -8 0 -10 10 -6 -19 3 -35 -8 2 5 22 14 19 20 10 -4 8 35 -24 14 10 6 21 2 13
3247A3m0L0JNkj7QkJ1j6L4k8J8j6MmRJ4j2Nnj9k1NJ8K8l2rL5Pl0oJ0J7j7PLOJ0
$$ 13 -27 3 4 9 7 -10 -2 -4 7 -9 25 -3 15 -1 3 -1 8 22 10 15 10 -9 -30 -25 -7 21 -11 -20 15 22 -8 -14 -4 13 -4 3 6 12 22
3286B2pjj1J7kk0L6n2K0K7j7j6J4Jj2L2l5lK3k5J3pJ8lj5j8kL4j0J4j8MnnL7l0
$$ 22 15 14 3 20 18 -2 34 -18 2 29 12 -4 10 11 -1 31 -4 -7 16 -9 4 -3 15 12 -3 -21 -23 11 1 15 -3 1 -4 -9 28 -2
3322bnj1K4J9k9J2rnNj6K1k5K1J3ok7J0J2j2K1j9J9j3J8j2J4l3K4j7J5qmJ8j5
$$ -2 -7 -18 6 25 -4 8 -1 -6 -1 -17 4 -21 0 13 7 -20 -10 2 -10 11 -8 11 -2 16 4 18 -15 9 -8 7 -1 -5 13 -2
3356bjL1m1jNOpL1j2l4OK8K8n1K0j5J7J2j6K4j7k0oJ5K9m9J5KNj7L1rNj7J8l8
$$ -2 -3 28 -13 -14 -9 -3 -10 21 9 -25 -19 9 37 -14 6 -9 8 20 4 28 11 -9 -15 0 29 -20 -5 -3 2 -15 16 7 12 -5 13 -25
3392b5L6kJ1j4%l5J7mJ1kj0K0K1k1Jk6K4%j0K6Ml3J8lKJ0lJ0rnj9J4qJ4k7K4k2
$$ -25 11 9 20 6 6 -29 -12 -16 -5 -7 -17 3 24 3 4 -22 2 2 -8 18 22 -11 7 4 6 16 13 23 14 9 -10 4 -4 10 -17 7 -15
3429a5K4okLL3k3j7lj9K5J3l6L7j7Ll1K3J7qJ0l0J6J3k6mk9N3J7qj2nK9l4L6k3
$$ -15 9 3 1 4 37 14 -3 -6 -25 0 13 -23 14 -3 0 -31 -8 9 1 11 -19 -3 10 -16 -20 -49 4 21 13 1 -4 25 -9 27 4
3464DJ7%J7l4k8L5j4LLJ8mk2J3rQJ9j4kjj6L8o4M0K4l0%LLP%lj7j6L3k0rL8l7
$$ 4 21 21 38 4 -24 11 -3 0 3 21 17 -5 8 -1 7 26 12 10 9 -7 31 -33 7 31 1 1 4 7 14 14 11 -6 -22 11 -9 -18 20 -17
3502a7L4K1nj1oRL0l7m%PJ8l2pj9J3Lj2KJ8Jk2kM5n3L5k0L6n9K1J3K5l1J5j4L6
$$ -17 17 38 33 22 16 25 55 18 14 14 21 39 7 0 -19 -6 -3 -15 -13 5 6 -16 -18 27 -26 9 -11 25 -34 -13 0 25 -6 9 -5 31
3538C1m3LJ6kj8L0j4NL4k7qJ0j7J5k1J2OLl1J5lj7N4n7M7k2oJ4m5J8Mj3K8KKr
$$ 31 -12 -9 7 5 -13 17 3 8 42 15 7 17 0 15 -6 6 12 15 -16 -1 -4 -21 33 -24 23 1 -5 9 -36 -18 -14 -27 1 3 5 -4
3574dpJ4J2j5j4PN%okKJ6l0K3j2LM0j0KK7m4QJ7j0j5J5nml4K8Jj8K5k1pj0L6m2
$$ -4 -11 3 15 0 -14 -7 -2 -2 -8 -10 -8 8 -22 1 -11 -8 32 22 24 51 7 15 32 22 7 22 17 13 -21 7 8 -10 15 -6 -13 -23 13 -29
3612b9N8k9k9K5L0j6Ll8N2j8j9MJ5j3Rj4j2JK1j5ORJ4k1j1N5k1K0k9J6mk0K1m1
$$ -29 29 0 -29 -4 26 10 13 -25 27 9 -10 -6 9 -4 5 -9 -21 -20 1 -14 -8 1 15 -6 -17 38 17 37 8 24 20 0 21 -20
3646b0L9Lnk3K2J6k5l5M2qj4K8j4OMk1Qj7J6NJ9k1LJ2l3J8j2J3k2L4J2kl0j6M2
$$ -20 19 22 17 -6 16 32 7 -28 14 6 -8 20 6 12 16 -5 3 -14 2 7 26 5 8 20 -13 5 -7 6 -16 18 30 28 -2 -18 24
3681B4%rK3mk0J0qpk6J6J3Jj5j1j%Ql5M5J8qk6K3qjL0rj5J2Krmj0K2j2nrK7l0
$$ 24 24 15 38 34 14 24 16 9 -17 -1 12 13 -2 -13 -14 -14 -6 -41 4 22 14 -12 11 3 2 32 23 8 20 22 13 9 -1 21 9 4 -5 22 -8
3720hK1j3RnJ8j8NPl3L6OloOpj7pOrK4Ml3N0m7kNK0K7n7M4j6L6l0mROj2Mk1j6
$$ -8 13 0 9 4 22 4 9 16 -17 19 25 22 16 22 15 -2 -9 -3 -12 12 16 -17 33 -14 -16 -11 9 36 -21 23 7 43 13 9 18 24 12 16 -5 -21
3760b1jK4k1M1k5mK1J1qj1lKL8k1J5jo3N7l9j3M6l0J2J1k0k1K6k0rL5J3J0kk0
$$ -21 -22 2 -19 22 -3 -7 14 25 17 6 3 5 43 22 37 36 -27 30 -9 -22 24 -6 6 17 -3 -24 2 -18 -27 8 21 31 29 9
3794IK3jj5J3Mk5L3k5j2pkjJ8n0M7l4L0NOj7K0k5mM1k5k1K4%jJ1j9j7j8K3k6K1
$$ 9 32 31 16 29 33 8 41 16 4 -3 -5 -6 12 -38 9 -25 5 10 16 -1 19 -6 -10 31 6 -15 9 9 8 19 0 -17 -35 -12 -38 -17
3830a7K0J7l8L0j8J0M1n3K6k1j1M6Pk8K1j8k1Kk5L3j8j4K1oQj7J6llJ4j7L1KN
$$ -17 3 20 -18 12 -6 4 45 -8 18 -3 -14 32 39 11 32 14 -7 -5 -30 3 -15 -29 -8 -14 -6 -23 -7 -10 -13 1 -16 15 17 22
3864B2l8N2nl9%pkJ2K8j9k5J2j2K4Pj4J4nk4N6m3K0rjJ0nl5K8qJ9k9rJ2lL0j6
$$ 22 -16 36 31 -8 -8 -15 -17 -5 23 4 -21 -9 -21 3 10 -4 10 5 -19 37 -6 14 5 4 14 9 -26 2 -6 13 -16 -25 -13 -16 14 -2
3900bk1J7j3J1kJ5%Qkj5ML3l7l8K9JJ6J1j9Nj2J0J4k4J5j1J6pRJ2k0K6j8j6L2
$$ -2 -23 -6 -19 -8 -10 5 5 13 11 -4 0 33 -4 -42 -13 -12 4 15 -4 1 -11 -1 13 -11 4 -7 9 2 11 23 3 29 11 -5 27
3935B7l7J7no%NL8k4j6Jj6K9k8K2oj6L6k0K6j3J8l8J2J7jnm4J5jJ6J7j9j8N6n0
$$ 27 -10 7 2 -4 -4 1 39 15 -1 0 -16 13 -15 7 1 -15 21 1 27 14 32 -6 6 23 22 17 -27 -12 -13 3 20 1 -17 39 -11
3970a1lJ5lK4ploLkj4kK0j3Pm0J5Kj6J6K4l5L1j5L3qoj5nK5pPj4J6k1J0LJk5l
$$ -11 -14 1 -2 22 15 12 6 9 7 -7 -9 11 -2 5 -35 -20 -18 -34 -18 6 -29 2 -13 20 12 6 -9 -14 11 4 11 -3 13 -8 2 5 6 -19 -22
4009b2K2%j5M4J5l5k0J5J3nj8L1j9j3j5k4J6OK0Jl3J9J2j4J4j3J7%K8j0nJ3l6
$$ -22 0 0 -15 29 44 9 -11 4 17 12 -6 25 6 -7 -22 -46 -30 -24 -4 -3 -36 -17 -5 -19 -5 -18 -1 -1 27 17 12 25 -11
4042a1J8L6o0PL3l2j2Pj0LOJ8Pj5jL8o3L6J2PRm6L9k4K5m5pM4k3j2lpJ2k1L6O
$$ -11 7 43 -17 -10 23 -9 -21 -14 -24 -21 -15 3 10 -5 -6 32 -31 5 17 24 33 -13 26 2 27 -18 -25 19 -4 -16 -19 -26 -14 -35 1 7
4078Gj5K0j9nJ6K5j1J0l2L1pK0n4J2rMK8k6J1j1K0J0m9K9j7L4j0K7l5QRnL0m4
$$ 7 -8 12 -7 -12 4 29 18 28 -4 27 20 40 -14 -2 -11 -7 21 -5 6 -5 15 25 -24 5 -12 22 12 39 4 12 21 16 46 2
4112Bk2J7Jj9K5K2k2j2j3nLOJ8J2j1J6K6k1Noj2j1K1Qj3j2l0K5Rrj7K6K3m9L3
$$ 2 -20 -3 -2 -21 4 26 4 -8 -21 -26 -23 -17 1 13 2 18 44 23 28 22 10 -1 20 28 15 3 -27 -2 7 -2 -19 7 30 -19 14
4147A4j5k0K9RrJqk2K0J2l6L6l2KM2m3J1%pMM0k7K4jj1K0k0Lj0J7l0k8L6k2J1
$$ 14 -1 -21 8 17 8 9 1 -21 -1 11 -25 11 -21 -19 23 -20 -9 -9 -16 -12 28 1 25 24 13 33 13 16 6 23 -7 -35 1 -21 -10
4182a0LJ9J0l2k0J9J6QJ4j8J6Nj8oL8n2loJ0oqkJ7Lk9K0k4K2M0l6KM8m7OjK5p
$$ -10 -7 12 22 -10 -30 -11 5 13 27 9 25 30 12 6 44 -8 -11 -17 -7 -13 -21 -23 -6 -3 -32 -12 -36 -14 26 -10 -8 40 -7 -1 -2 23 16
4219A6K5n4K3Pk2J3J3j5mmk0j1K5J0PqrRJPj5K2%l0L9pl1J1k1rK9J0rj7J3J6k2
$$ 16 41 -13 10 17 -5 8 21 6 2 -2 -22 -33 -8 2 9 1 -8 1 2 9 -6 16 16 -14 25 18 -13 -2 -23 -32 -3 7 -2 -19 -6 10 -12
4256a2j0M5J6l5K7j3Jj7roL3k4qNJ1k7J9KOoj6K6l4ML1j3rM5j8J4j2Kk3oK0Lj2
$$ -12 -22 23 39 4 31 18 19 2 -7 -13 20 -4 -12 -7 4 -23 -4 -2 4 -2 -18 8 -26 -22 9 -4 -13 32 14 28 16 18 -5 -11 9 12 0
4293@MJ9l6j5Jj0N6lk2K1oomL5rrjLLj1Rj5j6Oj2mKKk2J2L9oK5k1OpK1j1j8M3
$$ 0 4 23 -13 -28 -27 -37 19 16 -6 15 9 3 -1 34 25 16 15 18 21 10 19 4 -12 -6 -18 -22 -20 -18 -40 -28 11 5 30 9 15 8 29 18 0 43
4333D3j0j2m1K8j7j8L7k3j5M7k3j3J4J5k1M1n0M7mk9L3jk1j3K0j9J3j4j6K2k1
$$ 43 33 21 -20 8 -9 -27 10 -13 -28 19 -4 -17 -3 12 -9 32 -18 29 25 -4 29 28 7 -6 14 -5 8 -6 -22 0 -21
4364b1J3j2K2j0Lj6J8J7%J6j6K3l9OK5j8lj4Qj1Qj8LJ7JJ4j4kN4j4p6M7ll2J9
$$ -21 -8 -20 2 -8 -5 -21 -3 14 14 30 14 37 -2 4 29 11 8 -6 2 -9 -1 -19 -16 1 2 16 2 0 54 40 -36 11 8 -24 -5
4399ej4K8L0n5j2K2Oj5NJ8j3nkQJ2K0k6oJL4lk3k3K4%K5j6m9J8J0j3kK7lNLnn
$$ -5 -19 9 39 -16 -28 -6 0 -15 -10 8 -5 -10 -12 -4 8 28 2 -4 -3 31 28 5 -18 6 6 31 15 -34 -16 -6 -19 -21 6 3 8 11 6 1
4437AOQjQJ4l2qnrJ5j6J9k7J7K9l5K7k8J0K3k0K8mk8K5K8l0J9k9J0Q%k4Ql3J6
$$ 1 7 15 14 22 36 4 -4 -9 -18 -3 -19 0 -27 -10 19 -16 11 -17 -7 16 -4 24 20 -8 17 45 15 34 5 15 23 23 -1 7 -26 -10
4473a0K0mkj7K4k0L1m2K6j2QNNj7J1KoJ7k7K0k2OKkj5K0pnNK0J0k4J3J8j7J0K1
$$ -10 10 6 4 -13 11 -9 22 -20 6 -6 2 7 12 -5 6 8 2 19 -8 12 -10 -4 -2 -4 -19 1 -6 -11 -6 14 24 0 13 31 14 24 45
4510D5l8P%j7j0L1ok5KPJ0lj0j6L8j3rkJ7Kj7ORk2J7j5L7kk5LqkK0pk3J1K4Jq
$$ 45 7 14 14 -3 -13 18 12 -13 -11 -4 6 3 -7 -23 15 2 -7 -9 8 10 -7 -1 8 -14 3 -12 25 23 -2 1 -7 -9 11 4 -19 -8 16 17 9
4549IK3k6K1k7K1j4K4l2j2LjOk0L3kj8PM0m0j6K5qQnNK6m4K8rk0J7K0l2pM0j5
$$ 9 32 6 27 0 21 7 31 -1 -13 -10 -11 -5 -25 8 6 -12 -5 35 -5 -21 4 -4 4 -1 4 30 -14 14 5 -15 2 22 -10 -17 23 8
4585Hk0k3N0k0j4M7Rl8oJ8J5J3l7K4j9qKoJ1J8m0L9m8K0mNk1J4omL3rJ2kK2m6
$$ 8 -12 -35 15 -5 -19 28 37 -1 -7 11 26 39 2 26 7 -1 1 -5 6 24 -16 23 -25 -5 -9 -4 -25 -11 -17 -21 12 3 15 13 35 -11
4621a1M6m3oK6l0J8k3J8j1J7ORl0K9k8L1J7rk1L8m7oK7j3L3k0k0plmj6K2OQj3
$$ -11 35 -8 -14 12 -18 0 -23 -5 -16 1 7 16 -14 15 -13 18 35 26 5 43 -4 -10 17 4 37 17 -3 -10 -13 -17 -33 -11 -5 3 -10
4656a0pQLK8j5kLJ%pkj1j6J6MK7n0pL8J1%j1K0k6K1l3J2NK1j5K3l2J8l6K9%k5
$$ -10 -17 -9 -6 22 7 5 8 9 9 2 0 -11 -27 -11 -7 20 -30 -37 1 12 12 1 21 -5 16 -17 -5 0 21 6 29 -3 15 -21 8 8 -17
4693a7K9J1j5rj0j0J6qJ0J1l%j3OnL4k0pL1l2Kj8QK3k3J6J0qj1oJ3qJ1j0J9j9
$$ -17 12 23 8 -1 -11 -21 -5 -13 -3 8 5 5 -8 -2 -7 27 7 0 31 -1 1 -17 -9 14 -9 7 17 9 -2 -8 5 -3 8 -2 17 -2
4729bK0j5j6K8j2J8l0K9k2j0Jj3J8K3jk3JK2k6pK4nJ6rJ0jk0K9j4ml7M0m3M3n
$$ -2 18 3 -13 15 3 21 -9 20 -2 -12 -11 -24 -6 17 16 -7 -6 16 -10 -17 7 2 18 9 19 18 -2 27 13 9 -28 12 -31 12 7
4764GnJ0j5ORl0NK8l0nJ0K2k5J4Rk3K1k0MK1k2j2J9mj1J5J5K%j0OjRj2PrlK9j8
$$ 7 2 12 -3 3 12 -18 -13 15 -15 -20 -10 12 -13 1 10 -13 8 -12 -8 13 -9 -21 -2 -6 -17 -2 13 15 15 5 11 10 19 7 14 5 2 31 13
4803A3j0k7J4J7l6M9rRk1k1J3K1j7j4L1K0lm1K2J4k0ok7N5k4k0K9m6J0QOJ4pJ6
$$ 13 3 -24 -10 7 -29 20 11 20 -1 -22 -9 12 -5 -19 12 32 29 -12 10 24 4 -2 -29 26 2 -18 11 -35 -25 -17 -11 3 -4 12
4837A2k3J2J6j7J8J2nK2k4m6M1j3RJ3j5l4K0j2j4M6k1klMOKmM6n5MJ5pj6j4J4
$$ 12 -11 1 17 0 18 30 25 47 23 -23 18 5 14 27 12 -22 -2 -14 -28 18 -3 -5 -8 -4 2 4 0 46 -9 -5 10 3 -13 -27 -13
4872a3K5Lk8j2J3%kK0K3ml6L1pqM0l4j8J7k1J7j1Qk2M3m2PK1k1J9k5QK8k1%J3
$$ -13 12 15 -13 -25 -12 -12 -14 6 29 25 -11 20 13 5 45 11 -7 10 -11 6 -5 3 -19 24 -18 -11 10 -11 8 -17 -9 19 -2 -2 11
4907A1j1J1k4Mj1J6Mlrj1J5J4j2L2k0j4jK9Ol1J9O%k4Pj3M1mj6Km6M2Jmk9j3K0
$$ 11 0 11 -13 -9 -20 -4 0 -3 -12 -23 -8 6 -6 26 6 -8 -9 20 26 -5 14 20 20 -4 3 -10 31 27 11 13 -33 9 10 6 -23 -36 -16
4944a6K1lk6J5J0%mJ2Nj3k1K4Kk7M2k5%j0qJ2K0k9K1RJ9mj9%K0k2KkJK2l5K1k
$$ -16 5 2 -24 -9 1 1 -3 9 14 1 -20 4 6 -21 21 -4 -4 -14 -22 -10 10 -19 2 11 30 26 7 7 27 5 7 5 6 28 -7 14 12
4981A2k3QLJ5m5L0j9NkJ5j9J8L1n8M1J1k4J3l5ML2mPok3Rj9nK9K3l1lL8%ooj3
$$ 12 -11 -3 0 15 -30 0 -19 -14 -16 -1 -20 -2 29 -29 12 23 -1 12 -23 -19 13 9 16 10 -13 -4 -23 -28 1 24 -7 -10 28 28 22 16 3
5018CK6j7rJ5m1M9l3k1M0k3Lkm0N8lNk1K2nmj7j8M7m2O3k5j9mK3k9M8l7J0J7K
$$ 3 29 12 3 18 -23 26 -7 -28 12 -11 -8 -10 -50 8 5 10 -11 11 6 2 -15 -33 14 -28 35 10 -9 -13 10 -19 29 -8 2 19 21
5053B1lj0k8M3k8Qk2K7k8J8K1rNRk4Nk3K9ol1J6l8K1PK0j2K1ojrLj6K3J9l3M6
$$ 21 18 8 -20 23 -5 3 -19 8 -20 -2 19 10 15 24 0 5 -18 11 5 -26 -10 -48 -27 -20 0 -12 9 3 2 -7 -4 -20 3 22 -11 35
5089C5m1K4l4J3K6l1K2l1J1N6n1k8K1qL8ol1L9Mn7M5j1Rjk4LnL1l6Ok0K9K1m8
$$ 35 -6 18 -16 -3 23 -8 14 -17 -6 50 -1 -29 -8 -16 22 16 -15 24 28 -29 16 5 14 13 -11 -8 -13 18 -18 -12 -32 -3 18 -30
5123c0L9l2Rj8OL5RJMOk3J4kl2K4J3l8K2qNk0Lj1M3l7K0NJ1j2lK0mOk6J4l0j1
$$ -30 9 -23 -14 -32 -26 9 18 19 23 29 6 20 18 -14 10 23 -15 7 -1 4 -16 -13 -24 19 -18 2 7 18 6 3 23 19 25 -1 13 -17 -28
5160b8QJ6l3M1l6K8l0K9RkJ3k1J2Pk2QQJ6j2J2j6J0k4oM0k6%KK4ll8MK0%k5J4
$$ -28 -20 -4 -37 4 -32 -4 -34 -5 4 2 15 -6 6 13 -9 -1 7 23 11 23 7 17 -7 -13 27 1 1 3 27 24 -14 -10 10 10 -15 -1
5196akK4m7K3j1j3K0m6L2J9J0mj6J9nlk9K4L4j9Ll5J9M0j8J1k6kK1k3OlJ3k0q
$$ -1 -3 21 -26 -3 -14 -27 -7 -53 -21 -2 8 4 -12 7 2 -1 -30 -6 28 9 12 -23 -4 36 18 29 3 1 22 -1 5 2 15 -5 -13
5231a3k7O1k0L3m6lK8k8J9qJ5nQm%lj2ol1L0PJ4j6J7ljoKj0oL3j8QOnrjj6M1K
$$ -13 -40 21 1 34 -12 -15 13 -15 4 -4 11 6 14 10 10 7 -5 -11 -42 -12 -5 9 -7 10 7 6 0 2 -8 -14 19 1 9 15 10 1 0 -16 25 27
5271B7l2k9L1Jkk0K0K9m0j3OK9Ql0qK0oKRj8K9k6J2J2k0K6rQk9J4Pj6KK4jk0j4
$$ 27 -5 -34 -3 -2 -4 -24 -4 25 -15 -28 -22 7 15 -15 -23 -3 -9 -7 2 -16 13 -13 -1 11 -9 17 8 16 -13 1 8 -8 -6 18 17 -3 -17
5308a7L7J1j2qj8K5%n1K8j5K4j7kLmj7K1j4JJ9J0k4K5k9mM1k0j8J1mJ1j8J3K6
$$ -17 20 31 19 11 -7 18 18 -33 -5 -20 4 -13 -15 -12 -16 -33 -12 -26 -25 -6 4 -20 5 -24 -28 13 -7 -25 -14 -18 -7 -25 -12 14
5342A4lj7j6K9j5kK5j7K0j4K3J0l6J0J6k6Nj9pK1J4k9j6k5M3mOPjJ7k0kK4J2k0
$$ 14 11 -6 -22 7 -8 -10 15 -2 18 4 27 37 1 11 27 1 6 -13 -20 1 15 -14 -30 -55 -12 -16 -10 -3 -4 13 -7 -9 15 27 7
5377Gkj2J9Rk3qLK2k1Rj3K0Pk6OpJ5KpJ0%k7M7Om2J8j8j0J3J5J0l2j6OK3qpjK1
$$ 7 5 -7 12 21 -2 -10 -7 15 -6 3 -10 10 17 -9 -3 -10 5 7 0 10 10 -17 30 36 -6 12 -6 -16 -3 12 22 -10 -26 -20 3 -5 -12 -13 8
5416HJj9J5k0L2pQLj4K0j3lj2J7jqKlj5N0n5K4mnPj6J7joj2QJ1j9kJ1Pl4K7k6
$$ 8 9 -10 5 -15 17 10 18 21 7 27 14 11 -1 16 15 7 9 6 -9 41 -14 10 6 1 8 -8 9 8 2 -10 -2 9 -10 -12 -1 6 -28 -1 -27
5455b7K4j2K2moJ6J7l5oK8j1nK0m3M2nj7Kj6J3Ol8M7j4j5J3qK8lpKk4j5M9k2J4
$$ -27 -3 -15 7 3 -3 13 30 -5 -11 17 6 1 21 -22 20 15 -2 0 -16 -3 3 -35 12 -2 -17 -4 -12 16 13 6 8 -16 -31 18 -4 10
5491A0lk9J9j9K1Ql6PK3j3J6k0J1K2k2J1J8k2M3k5Lj4qL7l6j9MK2k9L4l3J5L1
$$ 10 7 -22 -3 -22 -1 7 -29 -22 1 -12 4 -16 -5 17 -5 6 24 2 45 20 23 9 1 38 2 -17 -13 9 -20 14 -19 -4 27
5524B7l1NNoj6oM5j0Pj9OMj9K4klPk1J2koJ3k4K2nJ4J0nn5M8J9m7J2J6kj2lNJ5
$$ 27 -4 1 6 0 -16 -22 23 13 20 1 7 11 -8 16 14 11 18 -3 9 7 1 14 -10 12 7 21 31 26 -29 19 38 -9 3 19 17 5 2 7 22
5563B2m9J9jQj4K0k6J3%RjL5pqqkNj6oL3l9J4mj8M7j5j5lJ6k5L3j5lnooJ9J1J4
$$ 22 -27 -8 -9 -1 -15 5 -21 -8 -8 1 0 35 28 20 12 10 15 -1 -7 26 -13 1 -3 -21 26 11 -4 -7 9 -16 17 2 -1 -6 -12 -18 1 12 26
5602B6l7PJ4j2llj0m2L7%k7M2Jl1M7Qk6J7OJ8l5J3lpj9K3j0J9k0L0rj7kMK2rl
$$ 26 -11 -4 10 -2 -5 -8 -18 -60 -23 -23 -50 -8 -7 -38 9 17 -9 8 14 32 -3 10 7 0 -19 4 -6 13 -7 23 14 -3 -5 -1 21 12 9
5639ImqJ4k0K2Lj8K3olj2rj1J2mM6l9m3M8k5K2k6L9k5MoL0k1%Rj9J3Qm3L4L9m4
$$ 9 5 -3 11 -9 13 16 -2 21 15 12 0 -9 -20 -8 -12 34 -5 -48 0 -25 -3 -29 10 -15 -11 -17 13 -8 -8 1 -18 -5 3 -40 -6 33 -11
5676a1K4k2OJ6j4kqJ0j1J5nOJ0l0K9j9%k4L4n9P0j4Mj8J1nj1K7rJ4l2J2J5kJ0
$$ -11 13 -9 -3 13 -1 -3 -11 -1 -12 3 -2 4 14 -16 13 -6 -6 -30 4 -55 15 1 5 -13 -2 -7 -18 9 0 14 -18 -6 9 7 17
5711A7l5OoRK1j2j5J4Pj0J1nqjR%J6mPj5mK5j7j8KJ3j8J5Lj5k9K9j4J3j1J9j7
$$ 17 -18 -12 -18 -9 12 0 -15 -1 6 -4 7 2 -6 -7 2 2 18 14 21 6 2 27 10 -8 -6 7 -11 4 7 -8 -37 -8 -22 -9 -20 -1 -18
5748a8L1k9J2J5j7J6oMmKk5J1KnK2l3N4k1Nnk1J2j6L7J1l7LK5n8K5J8%Ol7QL1
$$ -18 13 -16 -4 11 -6 10 4 8 4 6 -19 -8 -6 -11 11 -22 32 11 16 11 -10 2 -14 23 34 -3 0 25 -33 -8 10 10 16 -21 -13 18
5784A8o0K9ONj1j6K4onK6j1j5L8k5J0j8PJ1J5K8l0j9j3K2%j9J7j6M4j9k1l4K7
$$ 18 -42 -13 -7 -2 -13 -29 -5 -11 -16 10 -1 -16 22 -3 7 -11 -4 7 22 50 20 1 -12 10 10 -9 8 -8 36 17 -4 -38 -11
5817a1J4k1J6nKj4mKL6k4lJ4j9J5k2moK8J3Mk4M1rj8MoNORk3%mK5oj4Oj5J1qm
$$ -11 3 -18 -2 -7 -5 -19 -23 -21 15 -9 -12 2 -17 -2 -24 -28 -34 -6 7 11 -13 28 19 1 5 -1 4 10 19 -4 -4 -8 17 11 -3 3 -12 -1 -9 -13
5857a3J8j4lL2j4jJ1j8%j8J4j0J4Ql1Ll2N1Pj5K2m0M1k0lRL5k5j9K3lmLK%Nl3
$$ -13 5 -9 -12 20 6 5 16 -2 -2 -20 -6 -16 -2 6 -25 -22 -54 -3 4 -11 11 -29 12 -8 -11 -2 33 8 -11 12 9 5 8 10 10 15 -18
5894a8J9J4j1J2j8J3j0Mk7M0pk4N5l9oJ8nJ0r%j0Rk2J0j7NM1l7k8L2J0lMPoQK3
$$ -18 1 15 4 16 -2 11 1 5 -22 18 11 -13 42 3 -3 15 10 20 11 11 1 10 -12 -2 -19 -14 27 -10 -38 -6 4 1 5 12 6 14 37
5931C7k4j7K1kl2J6jokK8l8j0K7m1O0l5K5j6M0j2Kj2lk0J4pQ%qj0J0j9K6j2K3
$$ 37 13 -4 17 15 -17 -1 -2 -8 -10 18 -20 -30 -3 -44 16 -19 6 -10 30 18 20 8 5 -15 -1 -8 0 0 -8 -18 -8 -27 -1 -13 10
5966A0k8L1j1l6L4PLPj6j3Jj8K7Kk3K7k2L6Mm9K0j2K1qj6kL6k5jJ5qk2RNK7j7
$$ 10 -18 13 2 -34 0 7 10 17 1 -12 -11 -29 -2 0 -23 4 -18 18 22 -27 -7 -19 2 -6 -22 -24 12 -13 -14 1 -7 -29 -20 -15 12 -5
6002emM3kn3L1k9K9K1k0J0j9J2j8j1K5j6M3j2jk0J6k0J5Jqj6j3J2k3L0j2OPoL
$$ -5 -9 34 32 -21 10 -19 10 31 11 21 2 14 -4 -15 10 -6 37 25 24 4 20 0 15 16 8 -8 -21 -9 -32 -2 -14 -8 -1 -7 -4
6037dj3M5l1j1MQKnKJk4L2Rk3RKrqO1n0k1K8%J6ol1L0J0j3mj7L1j0Nl2J2Ok9K7
$$ -4 -17 28 -3 -14 -10 -2 0 -5 -3 -2 -26 6 15 -8 1 3 -6 -14 47 -3 -24 4 4 20 14 -17 13 23 10 6 -11 20 10 15 -17 -5 1 -28 -1
6076aJ8pj7J0k7K9lkoj1lN9nm1KJ4j7M2l0j7Qj1J5%OJ7n3J0J4K0J2k1lrPkJ3k6
$$ -1 17 10 -7 3 -24 5 2 0 -6 -17 -20 39 34 -7 -5 9 -8 34 4 -13 -5 -16 -1 -1 5 22 -31 -21 -7 13 25 4 1 -8 -1 -3 10 -16
6114a6J8l2pM0Jk8L9k5MQk1J2mkqlK3j8J2J3oLL3m1J7jj9K5Rl1k1M7k4JqJ0J5
$$ -16 2 -30 -37 3 4 -24 15 -10 -6 2 -19 -7 -11 -13 -21 -24 -1 -19 -7 6 0 3 36 -5 12 11 -8 17 26 -5 -26 21 -3 -2 -10 0 15
6151A5k1K1RQl1qK2k1pLPj4J3%K5l7J6j6K0nNJ6k1L0n3L4J5Jpj2Nj3Mk1N1k3j1
$$ 15 -6 15 24 32 1 -7 15 -6 -13 -10 -3 -17 -4 -4 21 -16 0 -16 4 -1 4 20 -1 29 -24 10 25 26 19 7 12 -1 3 -18 33 10 -1
6188aj7LK6qJ0L4p4j4M3k6M0%j2m0L0j9L2j2k4jPj5L6Kj0J5Rj4LM3k1lj5j5J6
$$ -1 -18 -15 11 3 13 47 -27 -41 2 -24 16 16 4 -36 -6 -25 7 -5 -29 -30 -23 -38 -2 0 -10 5 14 0 3 46 25 22 7 -8 8
6223HK0k2PmMn1L5K8l9J5RlroJ0mL9m0J0J7k6L2k5Kj8J7J2jrj1Qj4Rk3M4j5l1
$$ 8 28 6 13 9 13 -38 -3 25 -14 1 10 7 -2 -8 2 -2 37 -3 7 24 -2 30 5 7 -11 6 18 17 8 -3 5 -9 0 -23 21 6 -25
6260b5M6l8L9QqMLj5l4J9K2j8J0k3pJ8KqKj5M6n1kK4J6j7j3jQmJm4M5OJk0MK2
$$ -25 21 -17 22 30 22 26 29 14 -20 -1 21 3 13 -10 -17 1 3 -5 -3 -18 28 -23 -25 -1 15 -2 -15 -16 -8 -12 -11 -55 -10 -4 -3 -23 -19 3
6298Ck0kPNJ6N%j6NnPpj0J8l5M3Rl1NL8k5k4qK3KkrPQk6J8J3k6K5kj4j0K3j7J6
$$ 3 -17 -19 -12 -7 9 14 14 -2 3 -2 5 -2 -12 6 -29 14 23 -8 -3 35 10 -14 -22 1 3 1 -8 -1 7 -19 -1 12 -14 11 9 -5 -15 8 -9 7
6338GpRj9K0JOJ9k2mNj7jPJ8J1k5J4j7Pj1lmNljJ0noJJ2Ok6K7j7L1m0%M1k1pj0
$$ 7 0 9 -10 10 11 17 36 14 10 15 -2 -3 4 22 33 8 22 5 12 1 -2 -6 -1 -4 -5 5 0 -6 -5 7 13 -13 14 -3 28 -12 -12 29 8 1 -9
6379iONMnj3JkJ3j4L8Pn6K3jNNJ4j6K5l2RmoQ%jjj1k8M4mj3J4M0n8KKJ9lj9%J9
$$ -9 -3 2 6 1 -12 -11 -13 0 -14 24 31 -25 -2 -3 2 7 21 5 30 -2 7 3 -3 5 5 4 3 -8 -36 8 4 -9 5 45 -13 -11 -9 10 7 -12 -12 7
6421Gk6L6j4K2k2j4J6J4j2qk0Pj4L6pJ1j5J8j2K7m8L2j8K2j7J2Lk2K7j6k0qJ5
$$ 7 -19 17 3 25 3 -11 5 19 7 -1 -21 -14 -28 8 1 12 -3 15 3 30 -18 14 -4 18 1 13 16 -6 21 5 -15 -23 -8
6454hK4m3PJ8j3K5j4Rj4KojJ3L6l6%J3%j3k0K5J3l4J8k4K9J1Njl8L8k2K6Oj6J5
$$ -8 16 -27 -20 -2 -15 10 -4 5 -9 -7 -13 -14 -1 35 -1 -1 12 12 -1 -21 4 17 -17 1 -23 6 17 22 21 -17 21 -1 25 31 15 30
6490C0k7J4k7JK1l5oK3j0j2J2L6l5K0k2J3J0j6K4n%Pj4oJ1pkK4k7PJ1j1KLj3K2
$$ 30 3 17 -10 -9 12 -23 -29 -6 -16 -28 -16 20 -15 5 -17 -4 6 -10 14 9 9 16 2 -4 7 0 -2 22 -5 2 13 2 4 7 -6 16
6526A6j1j3Pj4K4ppKmJ4j8j1K1l8K9Jj3K5j8NJ2KOj6j3K7L3m1NL5l3Qk9K8j3j
$$ 16 5 -8 -1 -15 9 2 -5 -3 -7 7 -11 -22 -1 -39 -10 -9 -22 3 -15 -10 2 4 10 -6 -19 8 41 0 5 40 7 15 -14 14 1 0
6562@Mj7J5Rk7J9l0j9N9%k0nnJ4ljlmONj2M1j9j3K6m0K7ojrJ5k4J8Lk8L2%qJ6
$$ 0 4 -13 2 11 -16 3 -27 -46 13 13 -7 -12 -17 -3 -6 -7 -10 -14 -8 -3 -15 26 7 -6 20 -20 7 1 0 -9 6 -18 0 3 -25 7 7 -1 15
6601A5l6K2KoL0j1k2J0MJ0k1K3j5j1pRK8l5L9k2k9J1J4kj5K1KOkk5J2Lj4LJ9j6
$$ 15 -21 1 3 -3 27 16 -6 4 8 18 -3 20 5 -6 -13 -4 24 -11 28 6 -23 -12 2 0 -15 6 8 14 12 -13 -1 2 -12 -9 10 -6
6637fJ9kNoK7Jm5K5m3L3j4rJ0jkMK0mj9l0L5l4L4k2J2qNnJ0L1k8mK2k1rK8Kk5
$$ -6 13 11 16 10 37 38 -7 18 -25 8 -6 -15 -5 -6 -8 -4 16 12 -7 -37 -2 -36 -2 -24 -12 -20 -15 -20 -10 21 -7 -11 11 -10 -19 9 11 -14
6675a4%KPJ9j5K2J2l0Qj9J5K0rJJ0j8kj0j5J6J9m9MK2lj9K3MmPl0L4J9nl6PK0
$$ -14 -14 -12 -5 14 -1 21 33 3 11 -8 7 27 18 19 29 11 9 -1 -16 0 19 -30 -26 -4 -7 -26 -3 1 -3 4 -26 8 27 22 -14 -7 13
6712A3j1J8j0j9jOOK2j9Pl7L8j6J1J2%j6l4N3nk6lK4j0nj3RPk1Pk0L5%j2pJ1J8
$$ 13 2 20 10 -9 -10 -4 2 24 5 12 -25 13 -3 8 20 20 4 -30 23 18 -8 -11 13 3 -2 -15 -6 1 -20 -13 -33 2 2 -10 -17 -6 12
6749A2pj5J2K7j8j2JOJ2Jm8KO0m6K0K7l6j3K4k5L4k7K4k6JJ7L0k0%k1K1k9j2J8
$$ 12 5 -10 2 29 11 -1 0 6 18 19 -29 -27 33 -13 7 34 -2 -15 9 -16 18 -9 15 -11 -10 7 37 17 17 -4 17 -12 -24 -6
6783fK4j1j4j5J8k4K7nJ6m1M2nj7M3m3MJ2Oj1Q%%K8k8J1k0Rl9N6Ln2N2qRl0%j1
$$ -6 18 7 -7 -22 -4 -28 -1 -6 10 -31 11 6 -11 32 -11 -7 5 11 0 8 8 8 36 8 19 -1 8 -31 25 28 -24 28 20 29 -1 -1 -12
6820a2K7qj2LjJ5j0jK2m6RlK1oJj4L7l0J4K3Ml2L0j6j9jOK2k1Nj5J6jN%j2RMJ8
$$ -12 15 7 -5 -2 -3 12 2 1 23 -23 -14 -17 4 -2 -1 -15 22 -8 6 29 33 1 31 15 -4 -5 1 23 2 7 -8 8 7 12 12 0 9 13 31
6859C1j6j5RoPNk2J7oj3qJ5J2k2J8j9J3L4l7PmLL4l5K5j0Qk0J5j0J6k0NOk0J2
$$ 31 15 0 9 3 10 15 -7 10 4 -9 -17 -2 10 -12 6 -13 0 34 -3 4 0 3 37 2 27 17 25 5 20 10 26 6 11 17 -3 9
6895Ij6Orj2LL0omKkj1J8k6K8j9Kj6J6K6j7nlnj1NoL6j1j1PK3j5LKOJJ5l2J0j7
$$ 9 -7 -1 -10 -22 -19 11 5 1 3 1 -10 8 -18 10 -9 -7 -23 -7 19 2 -3 -6 -11 -22 -17 -23 13 2 -9 -2 21 6 9 11 17 18 33 1 11 -6
6935foJ7J1k2QK0k2L2k1k6K4J1Kj7j5nJ9J0kj3lMok0J9mL0l5%K0Qk3QK8k1J5m2
$$ -6 -12 5 16 -6 2 22 0 32 11 -15 9 20 22 5 -10 -15 4 14 12 -1 -4 0 -6 -26 -7 -11 19 -16 -16 4 12 -11 -3 25 4 19 -23
6972b3J7J1KJ6Kl2Ok2K2k9K8j2J4nj%Klj1KJ1k6M0llj9K3qk8K4J1Rl5JrJ6J8k0
$$ -23 -6 5 7 23 25 -7 -1 -23 -1 -30 -2 -14 0 -5 -6 -6 -4 -7 -18 -16 -5 -31 9 6 3 -16 7 -1 -29 -5 6 15 -20 -19 -28 -12 6 -14
7010a4K7j5K9n3K8K4k1RJK7n0J2POk5L1k7pkK5m1J8jQK4l4K1l7L3J2k8l7N0K2
$$ -14 13 -2 27 -26 2 26 5 14 15 42 -8 4 11 17 -8 23 -4 -11 -13 12 -29 -11 -12 -4 20 -14 7 -30 3 15 -13 -50 0 22
7044B2l6mjL6k1j5J0k0J2OOj1J7lpK2j1k0L6j1K5Ornk7JnJ8l1J7l7J6J8kk6M7
$$ 22 -14 -18 -19 17 -4 -19 -9 -29 -17 -11 -5 -16 1 -2 -9 13 2 -18 18 7 32 38 29 24 -3 -2 -7 11 -20 -3 -40 -24 -6 -8 -34 13
7080A3j4k4J9L0olOj3J4%Nj5%k0K9mj3Lk8M9l7JJ1K6l6J6qJ5J1K9l0k9OK4l6k4
$$ 13 -1 -25 -6 24 18 15 21 8 22 22 27 12 12 -8 21 17 4 7 -21 28 -9 -8 3 29 -7 9 1 16 27 56 26 -3 3 27 -9 -33
7116c3L1J5jk9MMKj4J8kj9K8J4j1m1L9jMK3j7k9L9j9PMLpj7K2KQk4QNpk1K1%l
$$ -33 -2 13 12 -17 -13 -9 -7 -21 -3 -5 -24 4 18 7 -34 5 4 8 31 14 -15 24 5 12 16 19 12 -5 17 19 27 3 11 16 9 -12 9 9 6
7155FJ7k9jNj3J1Rj6M4n6nK8kK2jj4K8k2k2J7j5J7MJ2l7K8j2NJ6pj3j3%PlPK6
$$ 6 23 -6 -7 -2 -15 -4 5 -11 33 -23 -28 0 -2 20 19 5 33 11 -11 6 -9 8 12 24 -13 15 3 8 24 17 4 -9 -9 -2 -5 2 28
7192B8k6J0oKk6OJ0K0l5K9l6jL4K4m1ROk4L3k9L1l7RJ0NK9jj5j9NPj8J4J5l2K4
$$ 28 2 12 6 8 -18 -12 -2 18 -17 12 -24 -25 9 33 -8 1 7 -17 16 -13 18 -19 -10 0 5 34 33 18 -1 4 11 -7 7 22 -10 14
7228A4Mmm1N6l4K1l1J3j9J2K8j1kJNRl0L6j5J0k0Jj4lJ1j5J5%Oj9RK4k0Nmj3L7
$$ 14 18 14 -27 29 -5 16 -15 -2 -21 -9 19 8 6 7 12 21 -9 27 12 22 2 3 -11 -14 -3 -18 -3 -3 3 -16 -7 17 -3 2 -2 -15 22
7265B2Jj9MJoK5k5%j9L7j9MOLj0j5j1J7OqK1l8J1J7k5jK1qQOqRKj0l3M6j4nNK9
$$ 22 23 4 8 9 3 28 3 3 -16 21 2 6 12 15 5 -10 -21 -4 2 -6 15 -23 -12 5 -20 -21 0 -8 0 6 -2 7 9 -1 -34 12 -2 -7 -2 27
7305B7%J3l3jK3j1kKj8qJj6K1Kl7L7Ll1K4L9n3J1Nj6J1lJ8j5JJ1mj9L7j9k0KJ1
$$ 27 27 40 7 6 29 18 16 18 0 -8 -7 -23 -2 0 -37 0 3 -28 -4 35 -18 -7 -2 -18 -7 -10 8 -7 -6 5 1 -18 19 0 -20 -18 -7
7342gPKk5K6nqoJ8j3J1J6LkrpJ8k9K7j2j6K1k4J2k8M2rj5J8k8lL2k9L5j8J0k1
$$ -7 0 2 -23 3 -2 -10 -16 2 -11 0 16 19 17 8 1 19 -10 17 5 -11 10 -14 -2 -30 12 3 -12 6 -22 -25 7 -22 13 -5 5 -16
7378a6K3k0KL1m0J2k3M5j0j8J4J7m1J8K7k6J1K3Jj1j1Mj1JLrKl2K4J4k5KN2l3
$$ -16 7 -13 -11 20 -20 -8 -31 14 4 -14 0 17 -24 -6 21 -5 6 29 30 19 8 12 1 2 5 -4 -2 -34 -10 4 -21 -19 33 0
7412@k4M1m8L2qk3K0j6J6L0rl9L1knK5j5qK1j4J3l3nM7j5rj0NJ8lmk6RK2j1j8
$$ 0 -24 17 -31 1 -7 -30 -10 -26 -10 20 11 -28 3 1 -4 21 6 -2 19 5 18 -15 -20 27 12 3 -7 -2 16 13 9 -17 -8 14 3 -15
7448a5J6Om6L1QK1k1kNj2NlJ6m6N7Mk2OLJ3Ql8mRJj2RJ5j3J6m8J5L3kk4LL1j0
$$ -15 1 7 -39 -8 0 21 0 -2 3 -9 -4 -7 9 -37 20 24 2 8 11 24 32 -6 -10 -1 0 -12 -3 12 -1 15 -33 -18 15 13 -11 -8 23 13
7486A3j8Pj2RKmk7J7K3j1j3Rj5PJ3lmqL7l6K5Jk9PJ8rQJJ3J8j4o8N7lRrj7k5N5
$$ 13 -5 2 -10 -1 1 -3 -30 -13 10 -1 -14 -5 -20 -13 0 -3 -7 -15 22 -14 11 12 -17 -10 8 -1 7 8 21 39 25 -43 14 11 20 11 -6 -31 24
7525B4pj0qK2j8noKQJ3l6M8l8kK2l3OJNQj1LK2nooM8l7Kk7L7J4l9J7j0K1rlpj8
$$ 24 17 7 -1 21 3 -2 -8 -6 2 15 -21 27 -11 -13 9 -24 -18 -17 -12 -4 -15 -12 10 5 -1 -7 41 4 6 -21 16 30 -9 8 -2 19 10 7 0 -18
7565a8L2j4OJ8j5qKRj0PJ3k2J3k9K1j3jk6L1kK4k1j4K5j7j1M9J3l9L1rj3K3l4
$$ -18 14 0 6 24 9 1 3 12 2 9 22 0 13 -16 5 -8 -9 -35 -4 -6 18 -3 -17 8 -9 -20 29 42 3 34 25 12 35 1
7599AQJ0j3OJ3j9K4j1J0l3j2oK3J3rJ3nOk9Mj7M0l3J8Ok7oJ2%J2Kj1MJ0Lmk3J1
$$ 1 9 19 6 12 25 6 30 19 29 -4 -16 -22 1 14 5 18 13 19 -10 -6 -23 17 -16 2 8 -19 -25 -13 -13 -1 1 -10 -6 4 7 3 -20 -9
7637iJ6j3K0PJ4l7ORj1J7j8J3jKj6rJ9nQmj1jJ2jJJlmK0l2j8L6m2L7nJ0j3j0K4
$$ -9 7 -6 14 21 35 -2 4 13 2 19 1 14 13 15 -1 -10 9 4 12 8 -3 -4 8 7 8 9 6 2 22 -10 -28 8 -34 3 -2 8 -5 -15 9
7676InpJ2KLjRPk3nJ2J3qmJ8k4mJ3pJ0l0kJ0mNK9l6Lk2L8nMK0l2ojK7nk6LJ2L
$$ 9 4 -3 9 11 14 13 22 29 6 1 13 26 18 14 32 8 4 17 10 20 -10 -12 -2 -6 -1 28 -8 -5 -27 11 6 10 30 -2 -8 -9 18 13 -13 -10 2 5
7718Ej2J0J0J6l7L7kk4J3%Qj2l8K3L5l1J9j5M2k6j9Oj1KPMj8J1J8qj7J1Pmj9K1
$$ 5 -7 3 13 29 -8 29 27 3 16 16 24 12 -26 -3 32 1 20 5 47 21 2 8 -3 -1 6 10 -8 3 21 13 -4 7 14 10 -9 12
7754A2j9j8L4J4l2NJ3M4l9k3J3J3j7K0j5jK8j4j6NkJRk6J2%%qKQPLk4J6rOj6J3
$$ 12 -7 -25 9 23 -9 -4 9 53 14 -9 4 17 0 20 5 4 32 18 2 7 5 6 15 -11 1 1 1 -7 -5 3 10 13 -11 5 -4 2 -14 -1
7792amk5L4m6M7k7J7K2mLMj0J6j1j1K4m1LJ2mJPJ6nk6LJ8K7m8J0pL0m6L0k5MJ0
$$ -1 -5 -30 4 -42 5 -22 -5 17 13 16 20 10 26 15 4 28 -13 -10 2 -2 -1 6 22 17 -9 -6 12 39 -9 1 -6 24 -22 8 -17 -13 -3
7829cJ8k6LJ4j2J0j6NoL1j7k3j1L0j5K9j9l%Q%%J9Mk7K0k1oJ9J5Qk0rK2j1j5J
$$ -3 15 -11 -8 6 -6 4 -12 -7 -13 18 1 -22 -33 -3 -18 11 -8 -11 -11 -3 -3 -3 16 20 -7 13 -8 -14 5 20 28 8 -1 21 10 -5 -4
7866dJ4k4L3J4m8M4m4K1L2j4l2%j1MlmL5k5L1l5K3J7l6L5qPj9K5k4J3Pj3k6J3
$$ -4 10 -14 19 33 -15 29 -15 6 38 24 -8 -8 -19 -15 -18 -22 13 -12 19 -16 7 24 -12 23 15 22 3 28 4 17 24 11 -15 -2
7900bMqJ6l1JJ1JJ3Pm9O7k2jj6qK8j8Pj3KK1m1K2kJ7Lj6j2QK4k3QK6j3j4J1Qj7
$$ -2 2 -6 10 -21 -20 -9 -8 5 12 -37 30 8 7 -9 -17 11 -7 0 -13 -11 10 -31 -9 -11 6 9 -7 -19 -11 13 -10 -2 24 11 -3 8 16 -1
7938aj2lM4Om3K1lKj6N1k3j6j2k2M4j8rM6n1KL1j9k9LL3k5L0k4J7J2j8L2k3Oj4
$$ -1 -13 -16 28 34 -9 12 9 11 -5 46 23 7 -5 -27 17 -1 -10 36 -15 -13 18 -1 -30 -27 6 -19 11 -13 4 16 -2 30 7 13 -1
7973aj1jJ5L7m6RK0j1Jj1pK0Ol9RJ8Oj9j1rK9qk0N8m8K3Jl4L9j7lL4m6L3Jl0J4
$$ -1 -12 -13 2 39 -7 2 22 11 12 1 -6 14 20 -19 -10 8 14 -5 -16 -25 4 -4 -24 34 -14 9 10 -24 15 -2 -5 29 -17 16 17 -13 1
8010AJ3rkJk8L7j4J6J0k2K0L6p6M7j4K%l1NPk1K1MJ4k7Oj3JK3j9K7l4L8k0j7J9
$$ 1 14 5 3 4 -24 13 -1 15 25 3 23 59 -17 30 16 18 18 -13 -8 -1 -22 -1 3 17 -10 -4 -17 -16 7 -12 15 -19 19 -1 -18 1
8046AJ4kk4Nj3OL4k2J2mRMj3JJ3k3MlL8m4L3pMrk5J9kJ2J1n1J6J9k5J9pK1nj9
$$ 1 15 13 -11 -6 -19 -13 21 -1 11 7 16 20 7 8 21 -2 2 -1 37 -7 26 19 23 14 -11 8 6 18 29 -22 -6 13 -12 7 0 21 16 -3
8084cj2J4Kk1KJ2L1l2LPk6K4pK9lKJ6m7L2oJ9k9LK1j6npOJ7k6mJ4k3J7j7J3Lj6
$$ -3 -15 -1 1 -20 -18 -6 25 -7 -4 3 -23 1 -6 23 20 22 38 -9 23 17 36 7 10 31 15 10 3 9 26 0 -4 10 -13 4 -13 0 3 -13
8122a3NK1j9J6oklJ0NJ9l4J5Qk9K1k0mJ1orJ2J1L0l3J2LMk4K4PJk3j1k7M3k7j3
$$ -13 -8 13 -6 10 4 2 -1 9 14 33 -1 14 22 -7 14 -6 -10 1 -5 -14 -2 9 39 6 18 21 25 1 25 32 33 10 -1 -28 15 -12 -25
8159b5L6l0M9n6L6k0jK7l0k1M8K1j3lm6L1j3k0K0J4j4j4N9l0nJ8j3J3k5PK1k5
$$ -25 11 -19 30 -26 10 -10 -11 16 -14 -35 13 34 21 18 -28 3 -10 -30 -10 4 -10 -24 35 5 0 18 5 18 -7 0 21 -4
8191d
##END NTUPLES=NMR FID
##END=
