##TITLE=1H_Pr M-2 
 CDCl3
 8 sc, 
 13.1.2025
##JCAMPDX= 6.0         $$ Bruker NMR JCAMP-DX V2.0
##DATA TYPE= NMR FID
##DATA CLASS= NTUPLES
##ORIGIN= UXNMR, Bruker Analytische Messtechnik GmbH
##OWNER= root
$$ XWIN-NMR		Version 3.5
$$ Mon Jan 13 16:29:15 2025 Russian Standard Time (UT+4h)  she@DPX200
##.OBSERVE FREQUENCY= 200.1315
##.OBSERVE NUCLEUS= ^1H
##.DELAY= (6, 6)
##.ACQUISITION MODE= SIMULTANEOUS
##.ACQUISITION SCHEME= undefined
##.AVERAGES= 8
##.DIGITISER RES= 18
##SPECTROMETER/DATA SYSTEM= spect
##.PULSE SEQUENCE= zg30
##.SOLVENT NAME= CDCl3
##.SHIFT REFERENCE= (INTERNAL, CDCl3, 0, 15.7039)
##AUDIT TRAIL= $$ (NUMBER, WHEN, WHO, WHERE, WHAT)
$$ ##TITLE= Audit trail, XWIN-NMR		Version 3.5
$$ ##JCAMPDX= 5.01
$$ ##ORIGIN= Bruker BioSpin GmbH
$$ ##OWNER= she
$$ F:/spectra/data/she/nmr/H-F/1/audita.txt
$$ ##AUDIT TRAIL=  $$ (NUMBER, WHEN, WHO, WHERE, WHAT)
(   1,<2025-01-13 16:28:18.17 +0400>,<she>,<DPX200>,
      <created by zg, POWCHK disabled, PULCHK disabled
       configuration hash MD5:
       00 E9 B6 7A A2 85 ED C7 34 08 36 98 17 FE 4E 26
       data hash MD5: 16K
       1D 82 F0 16 73 1B 9D 58 20 6D 0B 6D DA 53 EE 0C>)
$$ ##END=
$$ 
$$ hash MD5
$$ 7E 20 5C D7 2E 2C E8 BF 3A 66 E7 D7 67 3D 49 8D
##$RELAX= 
##$RELAX= 
##$RELAX= 
##$RELAX= 
##$RELAX= 
##$RELAX= 
$$ Bruker specific parameters
$$ --------------------------
##$DU= <F:/spectra>
##$EXPNO= 1
##$NAME= <H-F>
##$PROCNO= 1
##$TYPE= <nmr>
##$USER= <she>
##$AMP= (0..31)
100 100 100 100 100 100 100 100 100 100 100 100 100 100 100 100 100 100 
100 100 100 100 100 100 100 100 100 100 100 100 100 100 
##$AQSEQ= 0
##$AQ_mod= 1
##$AUNM= <au_zg>
##$AUTOPOS= <>
##$BF1= 200.13
##$BF2= 200.13
##$BF3= 200.13
##$BF4= 200.13
##$BF5= 200.13
##$BF6= 200.13
##$BF7= 200.13
##$BF8= 200.13
##$BYTORDA= 1
##$CFDGTYP= 0
##$CFRGTYP= 5
##$CHEMSTR= <none>
##$CNST= (0..31)
1 1 145 1 1 1 1 1 1 1 1 1 1 1 1 1 1 1 1 1 1 1 1 1 1 1 1 1 1 1 1 1 
##$CPDPRG= <>
##$CPDPRG1= <>
##$CPDPRG2= <>
##$CPDPRG3= <>
##$CPDPRG4= <mlev>
##$CPDPRG5= <mlev>
##$CPDPRG6= <mlev>
##$CPDPRG7= <mlev>
##$CPDPRG8= <mlev>
##$CPDPRGB= <>
##$CPDPRGT= <>
##$D= (0..31)
0 1.2 0 0 0 0 0 0 0 0.06 0 0.03 0 0 0 0 0.0002 0 0 0 0 0 0 0 0 0 0 0 0 
0 0 0 
##$DATE= 1736771297
##$DBL= (0..7)
120 120 120 120 120 120 120 120 
##$DBP= (0..7)
150 150 150 150 150 150 150 150 
##$DBP07= 0
##$DBPNAM0= <>
##$DBPNAM1= <>
##$DBPNAM2= <>
##$DBPNAM3= <>
##$DBPNAM4= <>
##$DBPNAM5= <>
##$DBPNAM6= <>
##$DBPNAM7= <>
##$DBPOAL= (0..7)
0.5 0.5 0.5 0.5 0.5 0.5 0.5 0.5 
##$DBPOFFS= (0..7)
0 0 0 0 0 0 0 0 
##$DE= 6
##$DECBNUC= <off>
##$DECIM= 24
##$DECNUC= <off>
##$DECSTAT= 4
##$DIGMOD= 1
##$DIGTYP= 9
##$DL= (0..7)
0 120 120 120 120 120 120 120 
##$DP= (0..7)
150 150 150 150 150 150 150 150 
##$DP07= 0
##$DPNAME0= <>
##$DPNAME1= <>
##$DPNAME2= <>
##$DPNAME3= <>
##$DPNAME4= <>
##$DPNAME5= <>
##$DPNAME6= <>
##$DPNAME7= <>
##$DPOAL= (0..7)
0.5 0.5 0.5 0.5 0.5 0.5 0.5 0.5 
##$DPOFFS= (0..7)
0 0 0 0 0 0 0 0 
##$DQDMODE= 0
##$DR= 18
##$DS= 0
##$DSLIST= <SSSSSSSSSSSSSSS>
$$ [...]
##$SUBNAM2= <"">
##$SUBNAM3= <"">
##$SUBNAM4= <"">
##$SUBNAM5= <"">
##$SUBNAM6= <"">
##$SUBNAM7= <"">
##$SUBNAM8= <"">
##$SUBNAM9= <"">
##$SW= 24.0689530833862
##$SWIBOX= (0..15)
0 0 2 0 0 0 0 0 0 0 0 0 0 0 0 0 
##$SW_h= 4816.95568400771
##$TD= 16384
##$TD0= 1
##$TE= 0
##$TE2= 300
##$TE3= 300
##$TEG= 300
##$TL= (0..7)
0 120 120 120 120 120 120 120 
##$TP= (0..7)
150 150 150 150 150 150 150 150 
##$TP07= 0
##$TPNAME0= <>
##$TPNAME1= <>
##$TPNAME2= <>
##$TPNAME3= <>
##$TPNAME4= <>
##$TPNAME5= <>
##$TPNAME6= <>
##$TPNAME7= <>
##$TPOAL= (0..7)
0.5 0.5 0.5 0.5 0.5 0.5 0.5 0.5 
##$TPOFFS= (0..7)
0 0 0 0 0 0 0 0 
##$TUNHIN= 0
##$TUNHOUT= 0
##$TUNXOUT= 0
##$USERA1= <user>
##$USERA2= <user>
##$USERA3= <user>
##$USERA4= <user>
##$USERA5= <user>
##$V9= 5
##$VALIST= <valist>
##$VCLIST= <CCCCCCCCCCCCCCC>
##$VD= 0
##$VDLIST= <DDDDDDDDDDDDDDD>
##$VPLIST= <PPPPPPPPPPPPPPP>
##$VTLIST= <TTTTTTTTTTTTTTT>
##$WBST= 1024
##$WBSW= 4
##$XGAIN= (0..3)
0 0 0 0 
##$XL= 0
##$YL= 0
##$YMAX_a= 110529
##$YMIN_a= -200678
##$ZGOPTNS= <>
##$ZL1= 120
##$ZL2= 120
##$ZL3= 120
##$ZL4= 120
##$ABSF1= 10
##$ABSF2= 0
##$ABSG= 5
##$ABSL= 3
##$ALPHA= 0
##$AQORDER= 0
##$ASSFAC= 0
##$ASSFACI= 0
##$ASSFACX= 0
##$ASSWID= 0
##$AUNMP= <proc_1d>
##$AZFE= 0.1
##$AZFW= 0.1
##$BCFW= 1
##$BC_mod= 2
##$BYTORDP= 1
##$COROFFS= 0
##$CY= 11.3945322036743
##$DATMOD= 1
##$DC= 2
##$DFILT= <>
##$DTYPP= 0
##$F1P= 15.6554695791079
##$F2P= 12.8336369535428
##$FCOR= 0.5
##$FTSIZE= 0
##$FT_mod= 4
##$GAMMA= 1
##$GB= 0.15
##$INTBC= 1
##$INTSCL= 1
##$ISEN= 128
##$LB= 0.24
##$LEV0= 0
##$LPBIN= 0
##$MAXI= 10000
##$MC2= 0
##$MEAN= 0
##$ME_mod= 0
##$MI= 1.114404
##$NCOEF= 0
##$NC_proc= 0
##$NLEV= 6
##$NOISF1= 3.799351
##$NOISF2= 2.8
##$NSP= 1
##$NTH_PI= 0
##$NZP= 0
##$OFFSET= 15.70392
##$PC= 1
##$PHC0= -26571.12
##$PHC1= 14.18744
##$PH_mod= 1
##$PKNL= yes
##$PPARMOD= 0
##$PSCAL= 0
##$PSIGN= 0
##$REVERSE= no
##$SF= 200.130013532006
##$SI= 16384
##$SIGF1= 3
##$SIGF2= 2
##$SINO= 400
##$SIOLD= 16384
##$SREGLST= <1H.CDCl3>
##$SSB= 0
##$STSI= 0
##$STSR= 0
##$SW_p= 3612.71676300578
##$SYMM= 0
##$S_DEV= 0
##$TDeff= 0
##$TDoff= 0
##$TI= <>
##$TILT= no
##$TM1= 0
##$TM2= 0
##$TOPLEV= 0
##$USERP1= <user>
##$USERP2= <user>
##$USERP3= <user>
##$USERP4= <user>
##$USERP5= <user>
##$WDW= 1
##$XDIM= 8192
##$YMAX_p= 0
##$YMIN_p= 0
$$ End of Bruker specific parameters
$$ ---------------------------------
##NTUPLES= NMR FID
##VAR_NAME=  TIME,          FID/REAL,        FID/IMAG
##SYMBOL=    X,             R,               I
##VAR_TYPE=  INDEPENDENT,   DEPENDENT,       DEPENDENT
##VAR_FORM=  AFFN,          ASDF,            ASDF
##VAR_DIM=   8192,          8192,            8192
##UNITS=     SECONDS,       ARBITRARY UNITS, ARBITRARY UNITS
##FACTOR=    0.0002076,     1,               1
##FIRST=     0,             0,               0
##LAST=      1.7004516,     0,               0
##MIN=       0,             -200678,         0
##MAX=       1.7004516,     110529,          0
$$ Real data points
##PAGE= N=1
##DATA TABLE= (X++(R..R)), XYDATA
0@%%%%%%%%%%%Qj6J6j6J6k0K5k9L2l9M7n2O0o9Q1r1J00j14J30j48J67j86K07k29
$$ 0 0 0 0 0 0 0 0 0 0 0 0 8 -8 8 -8 8 -12 13 -16 16 -23 24 -28 32 -37 44 -47 53 -61 69 -79 88 -98 109 -120
35a20K55k86L19l52L90m35M81n31N88o52P24q05Q97j004J129j278J460j685J973
$$ -120 135 -151 168 -184 206 -229 252 -279 309 -343 381 -424 473 -531 598 -680 780 -905 1068
54A068k354K886l684M997p531J4118o2286j47539J33745R8594r2032j6706J42002
$$ 1068 -1286 1600 -2084 2913 -4618 9500 -52786 -200325 -66580 32014 -60018 -76724 65278
67F5278K6252j37907p0222P9080L7847q9883k7795J30183M5792j30898k9726J26245
$$ 65278 91530 -46377 -116599 -37519 328 -89555 -117350 12833 58625 -72273 -101999 24246
79B4246k1106j44561L4209J35009l6902r9216M7025P3615o2104q3573N4084J07326
$$ 24246 3140 -141421 -107212 27797 -9105 -108321 -61296 12319 -49785 -133358 -79274 28052
91B8052k8108j02618K3989P4328p8000q2288J19164J07977r5519p4095P9508J6800
$$ 28052 -56 -102674 -78685 -4357 -82357 -164645 -45481 62496 -33023 -107118 -27610 -10810
103a0810j02441j4359R9493K9794p1457j6503Q5929K7738j00597m4822Q7025R460
$$ -10810 -113251 -127610 -28117 1677 -69780 -86283 -354 27384 -73213 -118035 -31010 -21550
115b1550r7727L8750J38121k9316j22287K3645P6355m6056n6085O0788O4176n1053
$$ -21550 -119277 -80527 57594 28278 -94009 -70364 5991 -40065 -96150 -35362 28814 -22239
127b2239p0997M8247R0029l4821q2463M4494N9169q5762n1213J16672O0426r7626
$$ -22239 -93236 -44989 45040 10219 -72244 -27750 31419 -54343 -105556 11116 71542 -26084
139b6084l4550Q3119J0973p5143k566O8422K416p2898m690R6331K7844q9952j9185
$$ -26084 -60634 22485 33458 -41685 -44251 24171 26587 -46311 -51001 45330 73174 -16778 -35963
152c5963Q0698k0821r0537N0296J03379m8613q4751M6004O3046l8848m0408M4683
$$ -35963 44735 23914 -66623 -16327 87052 38439 -46312 -308 62738 23890 -16518 28165
164B8165L7798n5487o2406N3662P9366m1836n6861O6754M0675r3257l7667Q8905
$$ 28165 65963 10476 -51930 1732 81098 39262 -17599 49155 89830 -3427 -41094 47811
176D7811J6301q2807M820Q6554J0176o1516j0328M1811j3965p1800P747R8759
$$ 47811 64112 -18695 -13875 72679 82855 21339 11011 52822 38857 -32943 -25196 73563
188G3563J5881q0402P003O9953m8345q3456N3882P5000m8472m9123N2608M0136
$$ 73563 89444 9042 16045 85998 37653 -45803 8079 83079 34607 -14516 38092 78228
200G8228m9593m3255M1169M3543m4836m8538N5861M8726p2043m5025Q1844L2443
$$ 78228 28635 -14620 26549 70092 25256 -23282 32579 81305 9262 -35763 46081 78524
212G8524p8710p428P6880j3066q3003K771O4628K808m3942J2762N9405j2205q3082
$$ 78524 -186 -7614 69266 56200 -26803 -24032 40596 43404 -538 12224 71629 59424 -23658
225b3658n802P1056j5459o5321M9363P9714n0604o8683M3539L4284n8389l0919
$$ -23658 -29460 41596 26137 -39184 10179 89893 39289 -29394 14145 48429 -9960 -40879
237d0879N5969L9265l8522l3858L9754L3242n6882m3764O1970L5853p0095j8803
$$ -40879 15090 54355 15833 -18025 21729 54971 -1911 -45675 16295 52148 -17947 -36750
249c6750P8126L454p7020Q690O8092j3069n8609P971M3788j3374m9918J5742O8243
$$ -36750 41376 44830 -32190 -23500 44592 31523 -27086 -19115 24673 11299 -38619 -22877 45366
262D5366p140o7883J3444N7960m4137o4658N3943N9395m9255l4172N5525K4354
$$ 45366 38226 -29657 -16213 41747 -2390 -67048 -13105 46290 -2965 -37137 18388 42742
274D2742n7120l2012L9283K5066l8933k2807N6194L4125o2491l3063O3666J2781
$$ 42742 -14378 -46390 -7107 17959 -20974 -43781 12413 46538 -15953 -49016 14650 27431
286B7431p3905J208P3354j2254o4035K0536N6593j6953m7324J1914M1450j8094
$$ 27431 -46474 -45266 28088 15834 -48201 -27665 28928 11975 -35349 -23435 18015 -79
298g9n3606J6906O3012j8015n7398L8176N5222n4122n3439N0490L1483n3138j5479
$$ -79 -53685 -36779 26233 8218 -49180 -11004 44218 -9904 -63343 -12853 18630 -34508 -49987
311d9987N8151K2607m4408k3592L3876J5580m7757k2506N9791K6734n9794j0060
$$ -49987 8164 30771 -13637 -37229 -3353 12227 -35530 -58036 1755 28489 -31305 -41365
323d1365O7071n644p0268J2604N8212k2875m7980K6251M4642j7490l9043J6715
$$ -41365 25706 20062 -50206 -37602 20610 -2265 -50245 -23994 20648 3158 -35885 -19170
335a9170M2874j9903n3206K1966N1800l5076m6419N3507M6630n3247l1361N0398
$$ -19170 23704 3801 -49405 -27439 24361 -10715 -57134 -3627 43003 -10244 -41605 8793
347H793J1542n5064j1401M8600J8671l5329j1886M3600J4122n6552k0389N7755
$$ 8793 20335 -34729 -46130 2470 21141 -14188 -26074 17526 31648 -24904 -45293 12462
359A2462Q097o0043J1503O8637j6361n8359K3443M3393l0189l9712K6047L8200
$$ 12462 20559 -39484 -27981 40656 24295 -34064 -10621 32772 2583 -37129 -11082 27118
371B7118j8323l5331K2861M4433k5829m8318L4097M2082m9434l6190N7189K8789
$$ 27118 8795 -26536 -3675 40758 14929 -33389 708 42790 -6644 -42834 14355 43144
383D3144n1236r655N1856L825m8532j0015L7022R447l6796o474N2205J2724n4587
$$ 43144 -8092 -17747 34109 37934 -10598 -20613 16409 25856 -10940 -17414 34791 47515 -7072
396g072n874N4734j3486o1071K2326N5797k3527l8713L3647L3674l1715l4940
$$ -7072 -12946 41788 28302 -32769 -10443 45354 21827 -16886 16761 50435 18720 -16220
408a6220K0990L0572k1529l3466L0117M2417l3715l8279M4498K9411n6570k3560
$$ -16220 4770 35342 13813 -19653 10464 52881 19166 -19113 25385 54796 -1774 -25334
420b5334N3239J0738m7194K056M7152P95m1561n986L5561L349m3642m273N1954
$$ -25334 27905 38643 -8551 -6495 40657 41452 -109 -6095 29466 32815 -10827 -15100 36854
433C6854J139n3059J3209N5986k4792n4210K7266L7891l4500k8669L5570L0205
$$ 36854 37993 -15066 -1857 54129 29337 -24873 2393 40284 5784 -22885 12685 42890
445D2890k6843k8284K3249K8281l0894l6731L3903L3011m2971k2892N6807J8833
$$ 42890 16047 -12237 11012 39293 8399 -28332 5571 38582 -4389 -27281 29526 48359
457D8359n6393j2107M4187o277m3945Q172M2752J550l5417k422L6182k008m8693
$$ 48359 -8034 -20141 24046 17769 -26176 -18004 24748 26298 -9119 -11541 24641 22633 -26060
470b6060R94M9384j2509m8825K8291M9490l2000m0976L0139K3319l4818k1126
$$ -26060 -25066 24318 11809 -37016 -8725 40765 8765 -32211 -2072 21247 -13571 -34697
482c4697L2603K4314k6814k6769K7444K8949l3470k9437M0234J9280n2721j3347
$$ -34697 -2094 22220 -4594 -31363 -3919 25030 -8440 -37877 2357 21637 -31084 -44431
494d4431N5759Q087m7560M551M0240j2161l9844N853L4903l944l6390M382M5351
$$ -44431 11328 19415 -28145 -23594 16646 4485 -35359 -29506 5397 1453 -34937 -30555 14796
507A4796l599m5826J2380M1854l1657m6473L5849M2030l1444k3722L4706J6136
$$ 14796 11197 -34629 -22249 19605 -12052 -58525 -22676 19354 -12090 -35812 -1106 15030
519A5030l6358k0875K8455K0800k8985k3034L7043K7996l8502j9308M4542M674
$$ 15030 -21328 -42203 -13748 7052 -21933 -44967 -7924 20072 -18430 -37738 6804 11478
531A1478n6458j599N3297j041l8355J2507L3542j4193l4549P521L4269n603l8500
$$ 11478 -44980 -46579 6718 5677 -32678 -20171 13371 -822 -35371 -27850 6419 816 -37684
544c7684Q595M3756j2521m1518K6139L8859l7062l5383L8010K6101l4166j5723
$$ -37684 -29089 14667 2146 -39372 -13233 25626 -11436 -46819 -8809 17292 -16874 -32597
556c2597L1368J3728k7957j2237L1356J9506l6042k6442L5369J7740l9041j004
$$ -32597 -1229 12499 -15458 -27695 3661 23167 -12875 -39317 -3948 13792 -25249 -26253
568b6253N4348j585n2030K883L7631j4184l2087J7129L4346o982k7754J0125L1828
$$ -26253 28095 26510 -25520 -22637 14994 810 -31277 -14148 20198 13216 -14538 -4413 27415
581B7415j5707m4945J3068M2411j7651k8182L9180K9518m5367k9568L4471J6723
$$ 27415 11708 -33237 -20169 22242 4591 -23591 15589 45107 -260 -29828 4643 21366
593B1366k8831n262L2185J0319l2191j5738L3230J8336l6770j4212M2143N485
$$ 21366 -7465 -12727 19458 29777 -2414 -18152 15078 33414 -3356 -17568 24575 30060
605C0060m6421M483M7085j1457m0718J7547L6074j4625k9477R896K1376j4461
$$ 30060 -16361 -11878 35207 23750 -16968 579 36653 22028 -7449 2447 23823 9362
617I362k6892K0380M2811j3835m0257J6380K5235l6053k4302M5204K5912l5717
$$ 9362 -17530 2850 45661 31826 -8431 7949 33184 -2869 -27171 18033 43945 8228
629H228j2715L1682M391l2218j0461K6088J0047k7356p285L9638J2830m3803j0978
$$ 8228 -4487 27195 31586 -632 -11093 14995 25042 -2314 -9599 30039 42869 -934 -11912
642a1912L8228o495m0380J8616M1568j8960l5070J6149K6597j4550k2921J3716
$$ -11912 26316 19821 -20559 -1943 39625 20665 -14405 1744 28341 13791 -9130 4586
654D586K2760j8560l1654K0313L7066k2578l1020L0686K1718m0676j7193L9230
$$ 4586 27346 8786 -22868 -2555 34511 11933 -19087 11599 33317 -7359 -24552 14678
666A4678Q686l6254m915L2858O910k6493p364K4904K894l6665o666M2677N642
$$ 14678 23364 -12890 -17805 15053 21963 -4530 -11894 13010 15904 -20761 -27427 15250 20892
679B0892m0385N751L9874j7809l8642K0328K9753k3552k6142J9808K4374j2668
$$ 20892 -19493 -13742 26132 8323 -30319 -9991 19762 -3790 -29932 -10124 14250 1582
691A582k0855J5564K2155k4640l2459K4330L1284k8311j9393L8769J3627m1414
$$ 1582 -19273 -3709 18446 -6194 -38653 -14323 16961 -11350 -30743 8026 21653 -19761
703a9761r707L3420K41l1286J47L0058O101k5059n297K7929N08l9013m87M1945
$$ -19761 -29468 3952 4193 -27093 -26946 3112 9213 -15846 -21143 6786 7294 -31719 -32206 9739
717I739l772l7302J5351L3366k3891k9381K5463K4602k1259k0666J6271J7734
$$ 9739 5967 -31335 -15984 17382 -6509 -35890 -10427 14175 -7084 -27750 -11479 6255
729F255j7253k0272K2852K8352k4791k6849K9170J7292l8880j2382M0569Q198
$$ 6255 -10998 -31270 -8418 19934 -4857 -31706 -2536 14756 -24124 -36506 4063 12261
741A2261l2156L517L1838n278l2537l849K4385L754k2421N157L6889l874m2425
$$ 12261 -19895 -16378 15460 10182 -22355 -26204 -1819 1935 -20486 -15329 21560 17686 -24739
754b4739L624L5082j6257k9945K6793K9949k5110k2185K2836J6369k1620j6827
$$ -24739 -21115 13967 -2290 -32235 -5442 24507 -603 -22788 48 16417 -5203 -22030
766b2030J8990J9326j8900k0492K4944K1591l1399j7308L7208J1825l7248m601
$$ -22030 -3040 16286 -2614 -23106 1838 23429 -7970 -25278 11930 23755 -13493 -18094
778a8094L2631m870l0135Q526L0901p97k4320j965K1181l943l1141O900L8069
$$ -18094 14537 9667 -20468 -11942 18959 18162 -6158 -8123 13058 9115 -22026 -15126 22943
791B2943o326l3327J6991K9434k6162k8080K4853J9585k2818j1551K4786J4453
$$ 22943 16617 -16710 281 29715 3553 -24527 326 19911 -2907 -14458 10328 24781
803B4781k0983j7847J7309J7256k2619j7103L1015J5112l5079q859L7480K177
$$ 24781 3798 -14049 3260 20516 -2103 -19206 11809 26921 -8158 -17017 20463 22640
815B2640l3822M576K8514r728k7353P397K5309j891k2046M827K6696q341l4242
$$ 22640 -11182 -6606 21908 12180 -15173 -7776 17533 15642 -6404 -1577 25119 16778 -17464
828a7464R032L1907j6746k5965K7366K6200k7105k0404K2514J0004k3931r318
$$ -17464 -8432 23475 6729 -19236 8130 34330 7225 -13179 9335 19339 -4592 -13910
840a3910K3550J4637j9071j5055K1724J4016k9478j3277L3318P859l4771N51L4409
$$ -13910 9640 24277 5206 -9849 11875 25891 -3587 -16864 16454 24313 -10458 -9907 24502
853B4502o296k9940J0215K5044r167k2651N417K0098o179k3421R656L1190j0050
$$ 24502 18206 -11734 -1519 23525 14358 -8293 -2876 17222 11043 -12378 -2722 28468 18418
866A8418l0578J4779K3456k5912k2137K9165J8834k4282q988K3130N878k3568
$$ 18418 -12160 2619 26075 163 -21974 7191 26025 1743 -7245 15885 21763 -1805
878a805j1585J8578J2195j9930r888K9030J0489l3418p886L2249k758l2323R595
$$ -1805 -13390 5188 17383 -2547 -12435 16595 27084 -6334 -14220 18029 15271 -17052 -7457
891g457K9510j1987k4380J1499K1123r005k0185O629K0562j0439k6160J2818K8704
$$ -7457 22053 10066 -14314 -2815 18308 9303 -10882 -4253 16309 5870 -20290 -7472 21232
904B1232j6526k4550K4428J9082k9664j6590K6025P594k3791l339K3956P893k1105
$$ 21232 4706 -19844 4584 23666 -5998 -22588 3437 11031 -12760 -16099 7857 15750 -5355
917e355j0706J8142P530k6660o947L2059N387l1435K541L0307j1756k8445J2392
$$ -5355 -16061 2081 9611 -17049 -23996 8063 13450 -17985 -15444 14863 3107 -25338 -12946
930a2946K2533j2880j8828J2175J7375q829j9211R416K2099j3496k5860J6893
$$ -12946 9587 -3293 -22121 -9946 7429 -1400 -20611 -11195 10904 -2592 -28452 -11559
942a1559K2565k3842j6735K9410J3449k7160p733K2640P82k2989l303K1387Q149
$$ -11559 11006 -12836 -29571 -161 13288 -13872 -21605 1035 1817 -21172 -24475 -3088 5061
955E061j7835n914K2975L891l1281l600L1010l321k7669J2959K7625j5150k3163
$$ 5061 -12774 -18688 4287 8178 -23103 -26703 4307 986 -26683 -13724 13901 -1249 -24412
968b4412J4113J6265j3653j4868J2383J7315j0248j9391J4079K1781j8049k0927
$$ -24412 -10299 5966 -7687 -22555 -10172 7143 -3105 -22496 -8417 13364 -4685 -25612
980b5612K3522J5950k8237j0393K8671O522k4027K64K2748k77k0815m477J8548
$$ -25612 -2090 13860 -14377 -24770 3901 10423 -13604 -13340 9408 9131 -11684 -16161 2387
993B387M355k0450k97K9035J063k9938L203K6782j2922k5272J7905K3052j4897
$$ 2387 6742 -13708 -14005 15030 16093 -13845 -10642 16140 3218 -22054 -4149 18903 4006
1006D006j4803J4593J2669j3322j5330J1751J6629j1989j7782J8682J8859k2567
$$ 4006 -10797 3796 16465 3143 -12187 -436 16193 4204 -13578 5104 23963 1396
1018A396j4550K6635Q717k8441l020K5039r56k1153L290K0045J195j7806k536
$$ 1396 -13154 13481 22198 -6243 -9263 15776 14820 -6333 -3043 17002 18197 391 -2145
1031b145J8801j45k5368J395K9158m086k5142J3281K2981j9137k1682J7223J4511
$$ -2145 16656 16511 -8857 -7462 21696 17610 -7532 5749 28730 9593 -12089 5134 19645
1044A9645j5132r644J5693J2406j3539j5165J2730J4940j8509j5664K3716J3960
$$ 19645 4513 -5131 10562 22968 9429 -5736 6994 21934 3425 -12239 11477 25437
1056B5437k6160o785K7284K42k6539K896K1883m559j8452K393J6701m03j8119
$$ 25437 -723 -7508 19776 20018 -6521 -3625 18258 13699 -4753 -2360 14341 13938 -4181
1069d181J772K2552l620k6829N165K4415j3544k0831J9614J9535j9508j4138J6595
$$ -4181 -2409 20143 16523 -10306 -5141 19274 5730 -15101 4513 24048 4540 -9598 6997
1082F997P687j6772j0047J3898J2290j2209j1902J7626J2466k4040j3296K4041
$$ 6997 14684 -2088 -12135 1763 14053 1844 -10058 7568 20034 -4006 -17302 6739
1094F739N773k5572K521K6284m652k2682M733J6937n512j6100K694J6681k370
$$ 6739 12512 -13060 -10539 15745 11093 -11589 -6856 10081 4569 -11531 -8837 7844 5474
1107E474j9433N225K3787q474k5439J2649K0430j8831j6321K1351J1529j9471
$$ 5474 -13959 -8734 15053 6579 -18860 -6211 14219 -4612 -20933 418 11947 -7524
1119g524p621J6714P166j4684r411J3206R244j7068j0399K3147J0702k5170n324
$$ -7524 -15145 1569 8735 -5949 -15360 -2154 7090 -9978 -20377 2770 13472 -11698 -17022
1132a7022K4807k539k5777O710K1500p772j6713P780J6193n035j5763K252J6202
$$ -17022 7785 5246 -20531 -13821 7679 -93 -16806 -9026 7167 2132 -13631 -11379 4823
1145D823o612k0741J0464K4656j2990j9843J7834J3613k2556j0367K0475O622
$$ 4823 -1789 -22530 -12066 12590 -400 -20243 -2409 11204 -11352 -21719 -1244 5378
1157E378j7101l995J5906O935j4428q831J4728P283k0484o434K5789L892k4623
$$ 5378 -11723 -15718 188 7123 -7305 -16136 -1408 5875 -14609 -21043 4746 8638 -15985
1170a5985K161K3221q378k0423R958J7458r773j4679P037J4741m276j5417O893
$$ -15985 -13824 9397 1019 -19404 -9446 8012 -1761 -16440 -9403 5338 1062 -14355 -7462
1183g462J7793j0768k0408J4412J8799j8691j3199K2076R249k0279m634J7916
$$ -7462 10331 -437 -20845 -6433 12366 -6325 -19524 2552 11801 -8478 -13112 4804
1195D804J952j7207m352J5681P347j3518n382J9299L448k4704k719K4891k603
$$ 4804 6756 -10451 -14803 878 8225 -5293 -10675 8624 12072 -12632 -15351 9540 6937
1208F937k2447J0221K1013j1394j5901J0887J2131j0222j3313Q210J4581n609
$$ 6937 -15510 -5289 15724 4330 -11571 -684 11447 1225 -12088 -3878 10703 5094
1220E094j4744J0709J6943j6507j7037J8907J3346k0453p348K1705L261j8570
$$ 5094 -9650 1059 18002 1495 -15542 3365 16711 -3742 -11090 10615 13876 -4694
1232d694k66J6638J324j5174m440J4584M989j6961k665K2293M23k3769M824K2521
$$ -4694 -4960 11678 13002 -2172 -6612 7972 12961 -4000 -6665 15628 16051 -7718 -2894 19627
1246A9627r889k0107J1814J5544j2096j0232J2204J1386r540j3432O701J3539
$$ 19627 9738 -10369 1445 16989 4893 -5339 6865 18251 8711 -4721 1980 15519
1258A5519j0266j4715J6701J5601j8968j1340K1139M819k2429k368J9032j18j4942
$$ 15519 5253 -9462 7239 22840 3872 -7468 13671 18490 -3939 -6307 12725 12607 -2335
1271b335K142J5053L83j5428l975J5397J847j9470K280K2927n954k1736J0004
$$ -2335 -193 14860 15243 -185 -4160 11237 13084 -6386 -4106 18821 12867 -8869 1135
1284A135J8548j4198j4944J3954R778j2272q545J0516J0368r422j2238J0549J2878
$$ 1135 19683 5485 -9459 4495 14273 2001 -6544 3972 14340 4918 -7320 3229 16107
1297A6107j5622j3175J8399R389k1013m715K3025M02j9853J166J4917m433j3932
$$ 16107 485 -12690 5709 15098 -5915 -10630 12395 12797 -7056 -5890 9027 4594 -9338
1310i338J885J5171J044j5106m62J6880l038k2033N879K0415j0607j6852J4999
$$ -9338 -7453 7718 8762 -6344 -6806 10074 7036 -14997 -9118 11297 690 -16162 -1163
1323a163J4202j6025j0435J2981O336j1859p527R980J0565j1002j1381J4484J1149
$$ -1163 13039 -2986 -13421 -440 5896 -5963 -13490 -3510 7055 -3947 -15328 -844 10305
1336A0305j8814r144K0579L251k2128J224K0745l395j5459M474J2505m360j3939
$$ 10305 -8509 -17653 2926 6177 -15951 -14727 6018 2623 -12836 -8362 4143 -217 -14156
1349a4156R91J4522j5j6766M625J9799p628k0591J0803J6177j5438j2307J7520
$$ -14156 -13165 1357 1342 -15424 -10799 9000 1372 -19219 -8416 7761 -7677 -19984 -2464
1362b464Q958j4442n929J2061N585j1423q331J1850R492j4174r297J8753P615
$$ -2464 6494 -7948 -13877 -1816 3769 -7654 -15985 -4135 5357 -8817 -18114 639 8254
1375H254k1026k264K1453k699j9903M862J6268n828j2663O067J3080l221j2961
$$ 8254 -12772 -15036 6417 3718 -16185 -11323 4945 -883 -13546 -7479 5601 2380 -10581
1388a0581J428J4307n056j7390R151J9543j1187j5146J5636J0567j8069q103J5451
$$ -10581 -9153 5154 98 -17292 -8141 11402 215 -14931 705 11272 -6797 -14900 551
1401E51N820j2413l595J2479N735j1496q041J2849P807j7347n252K1214K387k1043
$$ 551 6371 -6042 -9637 2842 8577 -2919 -10960 1889 9696 -7651 -12903 8311 10698 -10345
1415a0345L385J9345o765j5966P810J2576p279j0770M907J2302l037j2892N562
$$ -10345 -6960 12385 5620 -10346 -2536 10040 2761 -8009 -3102 9200 6163 -6729 -1167
1428a167J5476r433j7365J2289J5298j5652r484J8423O923j6918m098J3651K043
$$ -1167 14309 4876 -12489 -200 15098 -554 -10038 8385 15308 -1610 -5708 7943 9986
1441I986j2389l579J2098O853j2475n758J6268L823k0449j205K1128l956j8415
$$ 9986 -2403 -5982 6116 12969 494 -5264 11004 14827 -5622 -6827 14301 10345 -8070
1454h070Q033J6033r147j1733Q254J0171p249j0807M701J2315n119j3504R753
$$ -8070 -37 15996 6849 -4884 3370 13541 6292 -4515 186 12501 7382 -6122 3631
1467C631J5471j3547j4302J5211R191j7708n001J7561K893j3878j195J1807J494
$$ 3631 19102 5555 -8747 6464 15655 -2053 -7054 10507 13400 -478 -1673 10134 11628
1480A1628j2668m491J2917M849j4478k296J8663r10k0410L725J8471q388j5195
$$ 11628 -1040 -5531 7386 12235 -2243 -4539 14124 13214 -7196 -3471 15000 6612 -8583
1493h583J0310J1773j0103r421Q422R401o109j1355N735J1953r932j3417J3330
$$ -8583 1727 13500 3397 -6024 2398 11799 5690 -5665 70 12023 2091 -11326 2004
1506B004J2966j5986q351J8099L936j8934k309J4250j80j1841J169J2599K000
$$ 2004 14970 -1016 -9367 8732 12668 -6266 -8575 5675 5495 -6346 -5177 7422 9422
1519I422j3408m758J3484J291j7291K282J9865m987j8433Q677J4202j1837j2046
$$ 9422 -3986 -8744 4740 6031 -11260 -8978 10887 5900 -12533 -3856 10346 -1491 -13537
1532a3537J1078Q684r065p989P987R383q096j1265Q898J1897j2709j1469J5544
$$ -13537 -2459 6225 -2840 -10829 -2842 6541 -1555 -12820 -3922 7975 -4734 -16203 -659
1545f59P878j8287l453J8263N54j5081J166J1589k654j1321m89J2589K612j2756
$$ -659 7219 -11068 -14521 3742 4296 -10785 -9619 1970 -684 -12005 -12494 95 2707 -10049
1559a0049j072J5892l119j9089N379J7156q896j3399J2687J0871j1816q793R558
$$ -10049 -11121 4771 1652 -17437 -12058 5098 -3798 -17197 -4510 6361 -5455 -14248 -4690
1572d690O051q404p480Q754J0270r420j0542J2421R714j6337o964J8038K905j7571
$$ -4690 1361 -7043 -14523 -5769 4501 -4919 -15461 -3040 6674 -9663 -16627 1411 4316 -13255
1586a3255M90J6072k313j2100L040J1426j930j1476j080J2498N39j4575L934J7729
$$ -13255 -12765 3307 994 -11106 -8066 3360 1430 -10046 -11126 1372 1911 -12664 -8730 8999
1600H999o341j6679R358J2925j2536j0356J4128P862j0574m974Q999N818q718
$$ 8999 2658 -14021 -4663 8262 -4274 -14630 -502 7360 -3214 -8188 811 6629 -2089
1613b089q426R232R477j1647p548J5890O213j7616k136J7076j188j5218L443J2822
$$ -2089 -10515 -1283 8194 -3453 -11001 4889 11102 -6514 -8650 8426 7238 -7980 -4537 8285
1627H285m016j0111L614J0982j280j1577M97J3571l611j4962P160J5872r813j2396
$$ 8285 4269 -5842 -2228 8754 7474 -4103 -3606 9965 6354 -8608 -1448 14424 4611 -7785
1641g785J2953Q897j3551o747J1643M335r375l999J0110N992r397p774J1039O791
$$ -7785 5168 14065 514 -6233 5410 9745 370 -3629 6481 12473 3076 -4698 6341 13132
1655A3132j4801m661J7365J478j6441K372J5468n071j2821N519R792m880r618
$$ 13132 -1669 -6330 11035 12513 -3928 -1556 13912 8841 -3980 1539 11331 6451 -3167
1668c167L437J0591j462j2544M125J3660p837j5062J1008J1730j2845p804J4013
$$ -3167 270 10861 9399 -3145 980 14640 6803 -8259 2749 14479 1634 -6170 7843
1681G843N759j2637m015R918K109r456m028R865O941j0681o167J2969L548j6849
$$ 7843 13602 965 -3050 6868 8977 -479 -4507 5358 12299 1618 -4549 8420 11968 -4881
1695d881j134J6976k843j4947N812J2289o577r864N687P937m377r434L094J0920
$$ -4881 -6015 10961 8118 -6829 -1017 11272 4695 -5169 518 8455 4078 -5356 -2262 8658
1709H658m238j2444P524J2954j0908j1269J3283O500j4453m805J3131K718r860
$$ 8658 4420 -8024 -500 12454 1546 -9723 3560 10060 -4393 -9198 3933 6651 -3209
1722c209j165Q914K166j0746m680J0137N018j2567k321J6245n66j6900L157J4047
$$ -3209 -4374 4540 6706 -4040 -8720 1417 6435 -6132 -8453 7792 7226 -9674 -6517 7530
1736G530o858j1905P632R729o673p405N274P605m878r850M445J1467o904j1783
$$ 7530 672 -11233 -3601 6128 -545 -7950 -2676 4929 51 -9799 -5354 6113 -791 -12574
1750a2574J0561J0080j3354o899J4500L729j3661j679J0391j22q612q60R926K866
$$ -12574 -2013 8067 -5287 -12186 2314 6043 -7618 -9297 1094 972 -7640 -8500 1426 4292
1764D292j0582l749J1808J446j4675J108J5314l243j4147P550J1551r084r138
$$ 4292 -6290 -10039 1769 3215 -11460 -10352 4962 1719 -12428 -4878 6673 -2411 -11549
1777a1549O875O785n902o333O046Q732n961j0098P207R933j0954q996J3916O298
$$ -11549 -4674 2111 -3791 -10124 -4078 4654 -1307 -11405 -4198 5735 -5219 -14215 -299 5999
1791E999j4430k513J4250j31j1294P37Q890p31q559r75J0336K346j1527o62J3419
$$ 5999 -8431 -10944 3306 3175 -8119 -7382 1508 777 -7782 -8757 1579 3925 -7602 -8264 5155
1806E155j974j4983N094J3680q084j0505J0184Q508q765n970O965N481p150o152
$$ 5155 3181 -11802 -6708 6972 -1112 -11617 -1433 7075 -1690 -7660 -695 4786 -2364 -8516
1820h516O293R142p663q672J0820P796j3203n181J4325J456j3825J502J2254j474
$$ -8516 -2223 6919 -744 -9416 1404 9200 -4003 -9184 5141 6597 -7228 -5726 6528 5054
1834E054r330J691Q306n60r267m10J0682K42j2154K894J3962n210j2884Q076R814
$$ 5054 -4276 -2585 5721 5161 -4106 -4516 6166 6408 -5746 -2852 11110 5900 -6984 1092 10906
1849A0906j0284p149R919O116p804m284P115N026o994p005P944P453r876o247
$$ 10906 622 -6527 3392 9508 1704 -2580 4535 9561 2567 -4438 3506 10959 1083 -5164
1863e164J2910M810j4265j248J3702j982j2173L066J0018k335q381K010Q803j092
$$ -5164 7746 12556 -1709 -2957 10745 8763 -3410 -344 9674 7339 -1042 968 9771 8679
1877H679j0076J448J0910l298j2298N830J2586q585r588J0204P106j0923n124
$$ 8679 -1397 51 10961 7663 -4635 1195 13781 5196 -4392 5812 12918 1995 -3129
1890c129Q701L580p198l889P525N485q092o417R861N007j2941l740J4168P49j3524
$$ -3129 5572 9152 1954 -1935 5590 11075 2983 -3434 6427 11434 -1507 -5247 8921 9670 -3854
1905c854L147J1762m689j0013L345Q060l310p584K169R121j835j0599L334J0899
$$ -3854 -707 11055 6366 -3647 -302 7758 4448 -3136 -967 8154 6319 -4280 -946 9953
1919I953o555j1950R055Q829r910o208J0746L971r974l161P477K738p049m329
$$ 9953 3398 -8552 503 9332 -578 -6786 3960 7931 -2043 -5204 2273 5011 -2038 -6367
1933f367P676N319r479m473J1746K119j3776m8J3147k827j2130M816R960n369
$$ -6367 1309 6628 -2851 -7324 4422 6541 -7235 -7283 5864 3037 -9093 -4277 5683 314
1947C14p853M419O911l650p999K633Q977l496j0403P002J0233r688q355J0335
$$ 314 -7539 -3120 3791 141 -7858 -5225 3752 256 -10147 -3145 7088 -2600 -10955 -620
1961f20N275j1272l379J0514J990q335j502P708K600q781m002R334L559j1231
$$ -620 4655 -6617 -9996 518 2508 -5827 -7329 379 2979 -5802 -9804 -470 3089 -8142
1975h142j221J3372r12j3656L358J1529n663r068N986P266m846o046L991P409
$$ -8142 -9363 4009 3097 -10559 -7201 4328 -1335 -10403 -4417 2849 -1997 -8043 -4052 3357
1989C357l894q873M417R326o451r293J0391P289j0929n337J1381K622j0363j377
$$ 3357 -537 -9410 -4993 4333 -2118 -11411 -1020 6269 -4660 -9997 1384 4006 -6357 -7734
2003g734R011N96p386j221Q126K928r077k729J0504R52j2358J722J2658l845j0784
$$ -7734 1277 1873 -5513 -6734 1392 4320 -4757 -7486 3018 3970 -8388 -6666 5992 2147 -8637
2018h637O345Q926o527p001N410N621m715n834M854Q266m832q667O496Q028r660
$$ -8637 -2292 6634 107 -6894 -1484 4137 -578 -6412 -1558 6708 1876 -6791 -295 7733 -1927
2033a927o787J1257M800j0906j727J0873K48q889k00P313O0p227r46R136J706
$$ -1927 -8714 2543 7343 -3563 -5290 5583 5831 -3058 -3258 4055 4115 -3112 -4058 5078 6784
2048F784j0062m85J1578k371j2074N022J0892o508q857P901O406o820m785N905
$$ 6784 -3278 -3763 7815 5444 -6630 -1608 9284 2776 -6081 1820 8226 1406 -3379 2526
2062B526M766n187n955M974P244o295p331R967O137j1057m648J1521J217j1058
$$ 2526 7292 2105 -3850 1124 8368 2073 -5258 4709 10846 -211 -4859 6662 7879 -3179
2076c179Q83R656q74p227Q24O760j51q250j130R551K02j0288K844J1178n225j0638
$$ -3179 -2296 7360 6486 -741 83 6843 6692 -1558 -2688 6863 7065 -3223 -379 10799 5574 -5064
2092e064P103Q106p962o178P870M596o145l921N214M702n791o333P023O602r127
$$ -5064 2039 10145 2183 -3995 3875 8471 2326 -1595 3619 8321 2530 -3803 3220 9822 695
2107F95n667J1560K953j1524j010J1428j848r905K137P600j762o492J119P736
$$ 695 -4972 6588 9541 -1983 -2993 8435 6587 -3318 -1181 6419 4657 -1835 -716 7020
2121G020m80r086M38R288k955j0212N319J0138p724p231Q472M928q598m504P035
$$ 7020 6540 -2546 -2108 7180 4225 -5987 -668 9470 1746 -5485 2987 7915 -683 -5187 1848
2136A848L395n860l800O662M661p535n972Q809M256j0713k640J1755o67j0370
$$ 1848 5243 -617 -4417 2245 6906 -629 -6601 2208 6464 -4249 -6889 4866 4199 -6171
2150f171K257R377l215p808J880O464j991o705J335Q092r39r642L168R349n999
$$ -6171 -3914 5463 2248 -5560 -3680 2784 793 -5912 -4577 3515 2576 -7066 -3898 5451 -548
2165e48r430P283P698q841n067R155K942p432k847N791K769n802m007O679M908
$$ -548 -9978 -2695 5003 -3838 -8905 250 3192 -4240 -7087 -1296 1473 -4329 -8336 -1657 3251
2180C251q572m380J0629K538j1941M19J1011l215r318M037P942l357o605K837
$$ 3251 -5321 -9701 928 3466 -8475 -8056 2955 -260 -9578 -5541 2401 -956 -7561 -4724
2194d724O193k594p588K350Q771l126q993O517Q094p914p178R255M252r535j961
$$ -4724 1469 -1125 -8713 -6363 2408 -718 -9711 -3194 4900 -3014 -10192 -937 3315 -6220 -8181
2209h181Q372J861o429j878N815L162p491l290Q317L302r763j109J1413j381j0265
$$ -8181 191 2052 -4377 -6255 -440 2722 -4769 -8059 258 3560 -6203 -7312 4101 2720 -7545
2224g545K842R738m632p716M732O339l479n401L250O428k625p933L742Q516n825
$$ -7545 -4703 5035 403 -7313 -2581 3758 279 -5122 -1872 4556 1931 -6002 -2260 6256 431
2239D31q024Q504O518r077l176R014J482q529r90P159J345n821j653P043K558
$$ 431 -7593 911 7429 -1648 -4824 4190 5672 -2857 -3847 3312 4657 -1164 -2817 4226 6784
2254F784q370k351R577P62j0228J502J0484l426q690M947P005n406n273M001N513
$$ 6784 -1586 -3937 5640 6402 -3826 -2324 8160 4734 -3956 991 7996 2590 -2683 1318 6831
2269F831l377n753L670O874m269p440N801P267q179n897R376L344r525o71R064
$$ 6831 3454 -2299 1371 8245 3976 -3464 2337 9604 1425 -4472 4904 8248 -1277 -1948 7116
2284G116K55p457q34O391P27o574j566Q150J727r002k59R951k522j0043L525Q844
$$ 7116 7371 -86 -920 5471 6198 -376 -1942 6208 7935 -1067 -1326 8625 6103 -3940 -415 8429
2300H429n289p030O332N439n226m483M051M111l963n718M958O740o676o636Q037
$$ 8429 3140 -3890 2442 7881 2655 -1828 2223 6334 2371 -3347 1611 8351 1675 -4961 3076
2315C076N546r547l064R165O89q771J84P636n60n724r2N687O59p186j289Q368
$$ 3076 8622 -925 -3989 5176 5865 -2906 -2722 4914 4354 -1370 -1462 4225 4884 -2302 -3591 4777
2331D777j58r282K277R591m534q423N716O355o834m532N686L913m398l822L637
$$ 4777 4619 -4663 -2386 7205 2671 -5752 -36 6319 -515 -5047 639 4552 154 -3668 -31
2346c1M829m766o119O208N327p726m707R755K453r279l41Q128j267p197J128N760
$$ -31 4798 32 -6087 121 5448 -2278 -6985 2770 5223 -4056 -4397 3731 2464 -4733 -3605 2155
2362B155j88n949L65O447j01p876M03Q451k402r169N013Q120n966o224O827L948
$$ 2155 1967 -3982 -3617 2830 2729 -5147 -4744 3707 1305 -7864 -2851 5269 -697 -6921 -94 3854
2378C854o493l467N047L473m591l557M592M585n624m834P219L777q871k266R541
$$ 3854 -2639 -6106 -1059 2414 -2177 -5734 -1142 3443 -2181 -7015 204 3981 -4890 -7156 2385
2393B385L37q943J931P174k462n636J698M801o89n618L5P503j098p618K674Q220
$$ 2385 2722 -6221 -4290 2884 422 -5214 -3516 1285 596 -5022 -4987 2516 1418 -6200 -3526 4694
2409D694n104p442N938N971o675l575O705K622n477k836M704L040n115l925O280
$$ 4694 -410 -7852 -1914 4057 -2618 -6193 512 3134 -2343 -5179 -475 2565 -2550 -6475 -195
2424a95M428p055l422Q630J470r658N61Q747j963p031L046N609k440m767J313
$$ -195 4233 -2822 -6244 2386 3856 -5802 -5241 3506 1543 -5488 -2442 3167 727 -4040 -2727
2439b727N334r03o340J363P570k867p785N311P213o590n325P124L400p045j922
$$ -2727 2607 1704 -4636 -3273 4297 1430 -6355 -1044 6169 -421 -5746 1378 4778 -2267 -4189
2454d189O045K095m625k504M889L069n568l717P224K862q163j116R650j176q800
$$ -4189 1856 3951 -674 -3178 1711 4780 -788 -4505 2719 5581 -2582 -3698 5952 4776 -4024
2469d024K781P300l605n351K892N211k551m183J776N630k071o920L045P200m965
$$ -4024 -1243 6057 2452 -2899 -7 5204 2653 -1530 246 5876 3805 -3115 -70 7130 2165
2484B165o542P300N115p595l001P354J054n927j124N185J236m314k097N620K494
$$ 2165 -4377 2923 8038 443 -2558 4796 5850 -77 -1201 3984 5220 906 -1191 4429 6923
2499F923o725k432Q183J54q020J085Q684l384o817M020M971l696m246L191L899
$$ 6923 198 -2234 5949 6103 -1917 -832 7852 4468 -2349 1671 6642 2946 -1300 1891 5790
2514E790k553m934K736N856l256o810N473N940p154m642P729K284p447q00O865
$$ 5790 3237 -1697 1039 6895 3639 -3171 2302 8242 1088 -3554 4175 6459 -988 -1788 5077
2529E077k00m950r03M611J222n761j249O145J925p519l72P905k140q010L134O837
$$ 5077 4877 -73 -976 3635 4857 -904 -2153 3992 5917 -1602 -1974 5931 3791 -4219 -1085 5752
2545E752m340m807M214M040l617l374J973M143k958n285M059N310m795n716O685
$$ 5752 1412 -3395 819 4859 1242 -2132 -159 3984 1026 -4259 -200 5110 315 -5401 1284
2560A284L882p732k319P708O12p038P80M905l78m307n11M778J113o432j167P190
$$ 1284 5166 -2566 -4885 2823 3435 -3603 -2823 2082 1704 -2603 -3114 1664 2777 -3655 -4822 2368
2576B368j16p690K060P471l691o770N076M960n878l088M222K738l023l061K767
$$ 2368 2252 -5438 -3378 4093 402 -6368 -1292 3668 -2210 -5298 -1076 1662 -1361 -4422 -1655
2591a655M295l900n566N591M567o689l416P951J608p736K22O723j464n427J148
$$ -1655 2640 -1260 -6826 -1235 3332 -3357 -6773 1178 2786 -4950 -4728 1995 531 -4896 -3748
2606c748M258k07m287k1N324K13o751K79P953k729p218M193O339n112m354N349
$$ -3748 510 303 -3984 -4005 1319 1532 -5219 -4940 3013 284 -6934 -2741 3598 -1514 -5868 -519
2622e19L176m873k591L493L051l177l361L811M537n571l965P235K481q062j135
$$ -519 2657 -2216 -4807 -1314 1737 -1440 -4801 -990 3547 -2024 -5989 1246 3727 -4335 -5470
2637e470P878j02p009K129N322j633m774J039M318n66m865O06O572j339o674K487
$$ -5470 2408 2306 -4703 -2574 2748 1115 -3659 -2620 1698 1132 -3733 -3127 3445 2106 -4568 -2081
2653b081P136m468o116N882L906n707k344N535J980m404k051L308K704l717l242
$$ -2081 5055 587 -5529 353 4259 -1448 -3792 1743 3723 -681 -2732 576 3280 -437 -3679
2668c679N234L574o622k062P302O05p611J210O954k558n469K976M505j877l826
$$ -3679 1555 5129 -1493 -3555 3747 4352 -3259 -2049 4905 2347 -3122 -146 4359 2482 -1344
2683a344O44M874j087n666J775O118k649o366M750N576n680l913N947K296n601
$$ -1344 -700 4174 3087 -2579 -804 5314 2665 -3701 1049 6625 945 -2968 2979 5275 -326
2698c26j395M747J535l860j833L969K722n157k744O439J896p174l33P554j333
$$ -326 -1721 3026 4561 701 -1132 2837 5559 402 -2342 4097 5993 -1181 -1514 6040 4707
2713D707p083K780N664l070m829K580M034j654l701R24N090k043n720L070O030
$$ 4707 -2376 404 6068 2998 -1831 749 4783 3129 -572 352 5442 3399 -2321 749 6779
2728F779m736n049N756L891o392k151O098N97n048p83M110R95l354k677N109K478
$$ 6779 2043 -3006 2750 6641 249 -1902 4196 4793 -255 -1038 3072 4067 713 -1964 3145 5623
2744E623o154j990P292k18p688J553P177k999n491L720L467k948l245K001K897
$$ 5623 -531 -2521 4771 4553 -3135 -1582 5595 2596 -2895 825 4292 1344 -1901 100 2997
2759B997j222m678K240N538l602n364M504M715o288l668O693J861o286m66N206
$$ 2997 1775 -2903 -663 4875 1273 -4091 413 5128 -1160 -4828 1865 3726 -2560 -3026 2180
2774B180M6m236r99L838J201m375j942N705J193o700n9P407k491o506L329N295
$$ 2180 2226 -2010 -3009 829 2030 -2345 -4287 1418 2611 -4089 -4148 3259 768 -5738 -2409 2886
2790B886m199l922L823L094l183k843K244L677k542m593L213N124n040m150O217
$$ 2886 -1313 -5235 -1412 1682 -1501 -4344 -2100 1577 -965 -5558 -2345 2779 -2261 -6411 -194
2805a94K992p194j006O220j46n279J32M970K42l899j317M204J371n567o31O515
$$ -194 2798 -4396 -5402 818 672 -4607 -4475 495 737 -3162 -4479 -275 1096 -4471 -5102 1413
2821A413m66o846K437N962l274n308M384L414l993k674L341K839k421l138K428
$$ 1413 947 -5899 -3462 2500 -774 -6082 -1698 1716 -2277 -4951 -1610 1229 -1192 -4330 -1902
2836a902M523l756m658N140L789n903k459O415J426o199M61N121p30m404R02L637
$$ -1902 2621 -1135 -5793 -653 3136 -2767 -5226 1189 2615 -3584 -3123 1998 1268 -3136 -2234 1403
2852A403J24l498o79M794P06o433Q37P005k399o418M251M987m575l272M135K570
$$ 1403 1527 -1971 -2650 2144 2850 -3583 -2746 4259 1860 -4558 -307 4680 105 -3167 968 3538
2868C538l693j891K707K870k766l058L099M060m217m156O333K237o788m64O417
$$ 3538 -155 -2046 661 3531 765 -2293 806 4866 649 -3507 2826 5063 -1725 -2189 4228
2883D228q23n468J840M301j039l795K46L710N64m776J44N692j180o261L116N821
$$ 4228 3405 -2063 -223 4078 3039 -756 -510 3200 3764 -1012 -868 4824 3644 -2617 499 6320
2899F320m247m929N141K711m646j629M041J579l480j846K674L299l722l661M956
$$ 6320 2073 -2856 2285 4996 350 -1279 2762 4341 861 -985 1689 4988 1266 -2395 2561
2914B561L055o104j652O427L58o547J051N432k092m187J677L893j234l416P05
$$ 2561 5616 -488 -2140 4287 4645 -1902 -851 4581 2489 -1698 -21 3872 2638 -778 -73
2929g3L615m20n252J128N971k709n445M389M274n494l169N399J763m717p95L695
$$ -73 3542 3122 -2130 -1002 4969 2260 -3185 1204 5478 -16 -3185 2214 3977 -740 -1535 2160
2945B160Q49k508k842L856K491m530k682N610J632o780M13O431j595n712K544
$$ 2160 3009 501 -2341 1515 4006 -524 -3206 2404 4036 -2744 -2331 4100 2505 -3207 -663
2960f63L880k126l537J806L084j364l334Q61M499j483n593L196M996m451m254
$$ -663 3217 1091 -2446 -640 2444 1080 -2254 -1393 3106 1623 -3970 -774 4222 -229 -4483
2975d483N673K567n376j336M532L91l833r50L411J403k891k558M226K274n679
$$ -4483 1190 3757 -1619 -2955 1577 1968 -1865 -2815 596 1999 -892 -3450 776 3050 -2629
2990b629j323O363l48o602K165N629l057l956K977K594k222k582J464K733r36
$$ -2629 -3952 2411 2063 -4539 -2374 3255 198 -3758 -781 1813 -409 -2991 -1527 1206 270
3005B70m087J728N292l296m883M248M077n850k073N485Q06m554j35L586M01l526
$$ 270 -3817 -2089 3203 -93 -4976 -728 3349 -2501 -4574 911 1717 -2837 -2972 614 1015 -2511
3021b511m80K936J816m166j836N431J133o225O82O241k402n707L070M149l237
$$ -2511 -2991 -55 1761 -2405 -4241 1190 2323 -3902 -3220 3021 619 -5088 -2018 2131 -1106
3036a106k552K787K221j603l239J625L271j601m429L102M575m519l367N423K066
$$ -1106 -3658 -871 1350 -253 -3492 -1867 1404 -197 -4626 -1524 3051 -1468 -4835 588 2654
3051B654n704o23M870l1m161N21L281L59l073q01L472J627n491k46N864p77n848
$$ 2654 -3050 -3673 1197 1166 -2995 -2474 807 1166 -1907 -2708 764 2391 -3100 -3346 2518 1741 -4107
3068d107K146N502l160m182L754K984l667j785K557K497k262k773K255L646k933
$$ -4107 -1961 3541 381 -3801 -47 2937 -730 -2515 42 2539 277 -2496 -241 3405 472
3083D72l936M168L319n200j769N996M18n330P59M156p61l452N21K903P65l729
$$ 472 -3464 704 4023 -1177 -2946 3050 3468 -1862 -1103 3053 2292 -1160 -639 2264 3029 -700
3099g00l43M908j90n362Q13N671k259n358L790M233m213k318L464J871k752k325
$$ -700 -1043 3865 3675 -1687 -874 4797 2538 -2820 970 5203 990 -1328 2136 4007 1255 -1070
3115a070K497K344k076l190L175L706m155l309N432J964o023m18N507j181m013
$$ -1070 1427 3771 1695 -1495 1680 5386 1231 -2078 3354 5318 -705 -1123 4384 3203 -810
3130h10J437L084r55k909K01L466J2m110K60M731j073n575K782M865l709m236
$$ -810 627 3711 2756 -153 48 3514 3526 -584 -324 4407 3334 -2241 541 5406 1697 -2539
3146b539M279K591l594k064L182J104j899k233K259K644l113k840L871K884n554
$$ -2539 1740 4331 737 -1327 1855 2959 1060 -1173 1086 3730 617 -2223 1648 4532 -1022
3161a022j341N684q5n479P69M635k109l373J534K995n42l084l68L803O4n165J174
$$ -1022 -2363 3321 3236 -2243 -1474 3161 1052 -2321 -787 2208 1666 -1418 -1786 2017 2081 -3084 -1910
3178a910N177k794m982M158L783m444k534M172J196l626m72K112J874k439k213
$$ -1910 3267 473 -4509 -351 3432 -1012 -3546 626 1822 -1804 -2276 -164 1710 -729 -2942
3193b942K754K585m393j874M768J347n735N3N513j446m232J754L415k020k786
$$ -2942 -188 2397 -1996 -3870 898 2245 -3490 -3437 2076 630 -3602 -1848 1567 -453 -3239
3208c239J220K634k45l429L76M439j546m629K366M781m313l199M642K269m479
$$ -3239 -2019 615 370 -3059 -2683 1756 210 -4419 -2053 2728 -1585 -4784 -142 2127 -2352
3223b352r52L556M70k897r25K334J630k659j782L761J658m501j011N369l56n379
$$ -2352 -3304 252 722 -2175 -3100 -766 864 -1795 -3577 184 1842 -2659 -3670 1699 1343 -4036
3239d036J833M040k079l357K557K425j866j979Q76K403j84l925J381M365k570
$$ -4036 -2203 1837 -242 -3599 -1042 1383 -483 -2462 -1586 817 633 -3292 -1911 2454 -116
3254a16l940M003K876m593j611M298O60l566m9K868P87k594j233K870J377l102
$$ -116 -4056 -53 2823 -1770 -3381 917 1577 -1989 -2038 830 1617 -977 -2210 660 2037 -1065
3270a065j724M566Q18n105O39N153k089m216K719K828k339k026J667K721j525
$$ -1065 -2789 1777 2595 -2510 -1871 3282 1193 -3023 -304 2524 185 -1841 -174 2547 1022
3285A022k638Q94L267j530l740K804L749l921k706M730J511m817PL902l79l059
$$ 1022 -1616 -722 2545 1015 -2725 79 3828 -93 -2799 1931 3442 -1375 -1368 2534 2155 -904
3301i04K25K514L85k113j150L303Q26m017n32M758o71m968K149M390k935l132
$$ -904 -679 1835 2220 107 -1043 2260 3086 -931 -1463 3295 2624 -2344 -195 4195 1260 -1872
3317a872L176J900k144j927J447K216j223k660J615L332k914l284M078K323m770
$$ -1872 1304 3204 1060 -867 580 2796 1573 -1087 528 3860 946 -2338 1740 4063 -707
3332g07j115N031P1m387R64K963n95k588o8K571Q12k953o11L733O0m624P81M865
$$ -707 -1822 3209 3280 -1107 -143 2820 2225 -363 -431 2140 2952 -1 -612 3121 3181 -1443 -662 4203
3350D203k557l982L267K839l125j797K849J206k350j265J468K191k019k773K647
$$ 4203 1646 -2336 931 3770 645 -1152 1697 2903 553 -712 756 2947 928 -1845 802
3365H02L072l998k181M866J013n268Q6M541j295k741M26K510n33j967q66L017
$$ 802 3874 -124 -2305 2561 3574 -1694 -1608 2933 1638 -1103 -677 1833 1300 -667 -1533 1484
3381A484L45l816K21M801j641m418K428L853l243k800L349J287k884j208K626
$$ 1484 1829 -1987 -1766 3035 1394 -3024 -596 3257 14 -2786 563 1850 -1034 -2242 384
3396C84Q93j348k475K332J934k630k653L968J876m468j006M840l87m407J253L071
$$ 384 1277 -71 -2546 -214 1720 -910 -3563 405 2281 -2187 -3193 1647 1260 -3147 -1894 1177
3412A177j205k496Q10K373o07k551R7L331l00m161J132M392k538l583L052L229
$$ 1177 -28 -2524 -1714 659 52 -2499 -2402 929 629 -3532 -2400 1992 -546 -4129 -1077 2152
3428B152m163j532L245Q99k481q76K015J362k071j611K745J710l589j832M538
$$ 2152 -2011 -3543 -298 601 -1880 -2756 -741 621 -1450 -3061 -316 1394 -2195 -4027 511
3443E11P20m958P49M508j769l097J703K382j445j699M90K789n24l069M43L893
$$ 511 1231 -3727 -2978 1530 -239 -3336 -1633 749 -696 -2395 -1905 884 360 -2709 -2266 1627
3459A627j234m219K655L646l696k593M127J356l483n27K849N66j945r59J895J731
$$ 1627 393 -3826 -1171 2475 -1221 -3814 313 1669 -1814 -2341 508 1074 -871 -1830 65 1796
3475A796k648j693L412J382m197m01M675n66m461J685L044j306k526J462K461
$$ 1796 -852 -2545 867 2249 -1948 -2349 2326 1760 -2701 -1016 2028 722 -1804 -342 2119
3490B119j179k296N69L001q88l378J515L862k171l708L589K207l692j627M104
$$ 2119 940 -1356 -787 2214 1326 -2052 -537 3325 1154 -2554 1035 3242 -450 -2077 2027
3505B027J88k833j60K613K70j910r51K084J342l175j002M092N81m763O77M527
$$ 2027 2215 -618 -778 1835 2105 195 -756 1328 2670 -505 -1507 2585 3166 -1597 -920 3607
3521C607j852l400K326K586k431j647J651J643q85k464J594K447j478l601K484
$$ 3607 1755 -1645 681 3267 836 -811 840 2483 1598 -866 728 3175 1697 -1904 580
3536E80L189l461j967M063N94l629o33L474j73k384p4K337M16k232j078K941R04
$$ 580 3769 308 -1659 2404 2998 -631 -1264 2210 2037 -347 -421 1916 2332 100 -978 1963 2867
3553B867m239K96L949q48m092K089L210k505k300K429J743j904j791J227K289
$$ 2867 -1372 -1076 2873 2025 -2067 22 3232 727 -1573 856 2599 695 -1096 131 2420
3568B420j470k616J832K717k259l109L319K365m113p43L887p1l558N35K535m37
$$ 2420 950 -1666 166 2883 624 -2485 834 3199 -914 -1657 2230 2159 -1399 -864 1671 1234
3584A234j799m74K363N70k834n75L551K00m412R09M013k380k952K561K495l018
$$ 1234 -565 -1039 1324 1894 -940 -1515 2036 2236 -2176 -1267 2746 366 -2586 -25 2470 -548
3600e48j146J832J442j614j581J415K009j729k699K765K499l971j659M309N68
$$ -548 -1694 138 1580 -34 -1615 -200 1809 80 -2619 146 2645 -1326 -2985 1324 1892
3615A892l794j58L489q55k239N18J791J45k391k14K598K83l805L51L921q28l926
$$ 1892 -1902 -2060 1429 574 -1665 -1147 644 789 -1602 -1816 782 1065 -2740 -2389 1532 704 -3222
3632c222K197K968k576k108K244J623k111p81J425J517j500k257J473K546k450
$$ -3222 -1025 1943 -633 -2741 -497 1126 -985 -1766 -341 1176 -324 -2581 -1108 1438 -1012
3647a012k363L537J386l789q77M271k61l584N60K869r74k198R60J440J80k582
$$ -1012 -3375 162 1548 -2241 -3118 1153 892 -2692 -2132 737 -237 -2435 -1475 -35 145 -2437
3663b437J70L299k45m143J312M004k609k944K993K463l164j457K832P51j695j486
$$ -2437 -2267 1032 787 -3356 -2044 1960 -649 -3593 -600 1863 -1301 -2758 74 825 -870 -2356
3679b356J437J914j528j707J911K191l315j667M102N48m035N90L614j162k802
$$ -2356 -919 995 -533 -2240 -329 1862 -1453 -3120 982 1530 -2505 -1915 1699 537 -2265
3694b265J585J772o81j537O2K330O2l003P99L361j629l121K005L440l569j620
$$ -2265 -680 1092 411 -1126 -1064 1266 1328 -1675 -876 2485 856 -2265 -260 3180 -389 -2009
3710b009L458J028k921l54K027Q49j808j413K233J373k146j510L244J116l738
$$ -2009 1449 2477 -444 -798 1229 2078 270 -1143 1090 2463 317 -1193 2051 3167 -571
3725e71k25L682p33l547J416K663j211j934J425J591p54k317M49K618o71k744
$$ -571 -796 2886 2153 -1394 22 2685 1474 -460 965 2556 1802 -515 -66 2552 1881 -863
3741h63J266L159j921l068L221J481l246p97K762N96k294l37K004N89j760j389
$$ -863 403 3562 1641 -1427 1794 3275 29 -768 1994 2590 296 -41 1963 2552 792 -597
3757e97K173J393k905j024L355O91m200J226L394j703l048K143J630j803j345
$$ -597 1576 2969 64 -960 2395 3086 -1114 112 3506 1803 -1245 898 2528 725 -620
3772f20J174J273n32k122R13K523j227l328K319K519k808k233L468R62l252l0
$$ -620 554 1827 1295 -827 86 2609 1382 -1946 373 2892 84 -2149 1319 2281 -971 -1001
3788a001K284k00j915MJ372J250k441j080K831Q06l762J63L390n42l612J879K526
$$ -1001 1283 1083 -832 -828 544 1794 -647 -1727 1104 1910 -1852 -1689 1701 1159 -2453 -574 1952
3805A952k264j628J518J335j322j123N69J816q53k472J159L105k331k498L164
$$ 1952 -312 -1940 -422 913 -409 -1532 -963 853 0 -2472 -1313 1792 -539 -3037 127
3820A27J747l506j154L788n02k413M1J896K74j878m62J923Q87k631m97L154j77
$$ 127 1874 -1632 -2786 1002 500 -1913 -1872 24 298 -1580 -2042 -119 768 -1863 -2360 794 617
3837F17l427J048L466j939k719K293J856j804j531J536J100r90j793Q88K157j243
$$ 617 -2810 -1762 1704 -235 -2954 -661 1195 -609 -2140 -604 496 -494 -2287 -1399 758 -485
3853d85k655L052J658k893j462L586N78l834O07K891p14j957M00J636K46k100
$$ -485 -3140 -88 1570 -1323 -2785 801 1379 -2455 -1848 1043 329 -1628 -1228 408 654 -1446
3869a446J50J886L83k857L22L184j360k789K147K233k529j307K179N99j307r29
$$ -1446 -1296 590 973 -1884 -1562 1622 262 -2527 -380 1853 -676 -1983 196 795 -512 -1441
3885a441J071J451o94k082J603J938k178k411L453J754l776l58L090j64k743O41
$$ -1441 -370 1081 387 -1695 -92 1846 -332 -2743 710 2464 -1312 -1670 1420 1256 -1487 -846
3901h46K226n52j543k25J928K45k150k08K535J07l288J008L289k024k420K471
$$ -846 1380 828 -715 -940 988 1233 -917 -1125 1410 1517 -1771 -763 2526 502 -1918 553
3917E53J717k382r93J631J198j449j304J079J861j401j977K081K035k876j279
$$ 553 2270 -112 -1105 526 1724 275 -1029 50 1911 510 -1467 614 2649 -227 -1506
3932a506L188N34l452N39L097j104k683J548J820p75j834M15J656K06k370O6K948
$$ -1506 1682 2216 -1236 -697 2400 1296 -1387 161 1981 1206 -628 -213 1443 1649 -721 -655 2293
3949B293r73l071J903K766k920j143K405Q34j916p12J611O66j302j334J777J509
$$ 2293 1320 -1751 152 2918 -2 -1145 1260 2094 178 -534 1077 1743 441 -893 884 2393
3965B393j809j938K908J053l107l20L105p07k658J297K025j244j589J305J053
$$ 2393 584 -1354 1554 2607 -500 -820 2285 1578 -1080 217 2242 998 -591 714 1767
3980A767l71j755k1K539p33k817J227K840k106k077K537J386l058k83K036J42
$$ 1767 1396 -359 -380 2159 1426 -1391 -164 2676 570 -1507 1030 2416 -642 -925 1111 1253
3996A253j749K21R50R41j634j047J877J452k998j163L363M36l410R89K283j323
$$ 1253 -496 -275 675 1616 -18 -1065 812 2264 -734 -1897 1466 1902 -1508 -519 1764 441
4012D41j903J539J513j829m04p9J441l89j635L71K339q89k614J825K049k299j591
$$ 441 -1462 77 1590 -239 -643 -722 719 330 -1305 -934 1405 516 -2098 -273 1776 -523 -2114
4029b114L005K42k531R3J736j63j432m78J419J207k001r91K272R49l029k42K969
$$ -2114 891 1133 -1398 -1305 431 268 -1164 -1642 -223 984 -1017 -2008 264 1213 -1816 -2058 911
4046I11n72k967J895J546j316j263P75R27n95r97N91J417m65k432J181K731k553
$$ 911 339 -2628 -733 813 -503 -1766 -991 -64 -659 -1656 -1065 352 -113 -2545 -1364 1367 -1186
4063a186k077K760J572k979m04K711j31k013R3J512mr42r59J285J320k493j88
$$ -1186 -3263 -503 1069 -1910 -2314 397 266 -1747 -1654 -142 -146 -1088 -2047 -762 558 -1935 -2123
4080b123K749k42k705R81K471j781j644J445J782j550j223J109J336p41j499O77
$$ -2123 626 384 -2321 -1340 1131 -650 -2294 -849 933 -617 -1840 -731 605 -136 -1635 -958
4096i58J969j290j757J791J673k307j244L177K06l039M95K272k15j242k17J088
$$ -958 1011 -279 -2036 -245 1428 -879 -2123 1054 1260 -1779 -1284 988 773 -469 -686 402
4112D02Q45j639q67J976N48k419r8L067q16k576J484K286k251j261K029Q23j189
$$ 402 1247 -392 -1259 717 1265 -1154 -1252 1815 999 -1577 -93 2193 -58 -1319 710 1533 344
4129C44p69P71J333p82k032J848J591j715k068K815J043k822j88K763o85j911
$$ 344 -425 346 1679 897 -1135 713 2304 589 -1479 1336 2379 -443 -631 2132 1447 -464
4145d64N32J549k02j383l05J568P33k160n70L058q62k700J406K555j805j844K069
$$ -464 68 1617 1415 32 -273 1295 2028 -132 -702 2356 1494 -1206 200 2755 950 -894 1175
4162A175R65k025p57K022J51j169r25J414J213j235k080K166J651k567j010K565
$$ 1175 2140 115 -642 1380 1531 362 -563 851 2064 829 -1251 915 2566 -1 -1011 1554
4178A554M92k825K61K285o84j496M40J006j98j096j11J536J75k249K75K569r87
$$ 1554 2046 -779 -518 1767 1083 -413 27 1033 835 -261 -372 1164 1339 -910 -635 1934 947
4195I47k937K033K127k077j366K094O55j508n59R72M38q47j194J274J788j969
$$ 947 -1990 43 2170 93 -1273 821 1476 -32 -591 381 819 -28 -1222 52 1840 -129
4211a29j333K270R22k798l03K746n34k312P93J672j052q77L69J208l26j372o06
$$ -129 -1462 808 1730 -1068 -1371 1375 841 -1471 -678 994 -58 -935 -566 642 316 -1056 -1662
4228a662K702k91k847J205K695k117j846K364R57k308m41J683K85j109m69R55
$$ -1662 1040 749 -2098 -893 1802 -315 -2161 203 1160 -1148 -1589 94 379 -730 -1199 -244
4244b44P25p88j693J760J257k368j064K964J16k837R28K432j261j642R13P58k52
$$ -244 481 -307 -2000 -240 1017 -1351 -2415 549 665 -2172 -1244 1188 -73 -1715 -802 -44 -296
4261b96j077K40J209Q3j995L03K504j215k353J979J745k543j043K589L73k141
$$ -296 -1373 -1133 76 159 -1836 -1533 971 -244 -2597 -618 1127 -1416 -2459 130 503 -1638
4277a638M55R32L91j073p52J192J355k058q67K245N61k568J27K841j027k487J477
$$ -1638 -1183 -251 140 -933 -1685 -493 862 -1196 -2063 182 743 -1825 -1698 1143 116 -2371 -894
4294h94J548j070j175J173J021q04j002m6J429R9k252J301K231j768j724K156
$$ -894 654 -416 -1591 -418 603 -201 -1203 -1249 180 279 -1973 -672 1559 -209 -1933 223
4310B23J195k392n43K162l8j295l0R09O60j070r45J401J168k085p29K880j08k836
$$ 223 1418 -974 -1517 645 607 -688 -718 191 851 -219 -1164 237 1405 -680 -1409 1471 1363 -1473
4328a473Q81K343j395j539J468J232j234r81R43P79m50j599P83K282j080k419
$$ -1473 -592 1751 356 -1183 285 1517 283 -698 245 1024 574 -1025 -242 2040 960 -1459
4344a459J731K022k286r66K420J25k349O05J515l45p72j31J135K92j374p09K128
$$ -1459 272 2294 8 -958 1462 1587 -762 -157 1358 1013 241 110 1245 1537 163 -546 1582
4361A582M05k745L13K942j458k126J615J814j898q51Q69J290j074q60M32J225
$$ 1582 1987 -758 -445 2497 1039 -1087 528 2342 444 -407 462 1752 678 -182 250 1475
4377A475n46j827J246K000j960j474K341Q31k708K96K150n65k016O28J267k39
$$ 1475 929 -898 348 2348 388 -1086 1255 2086 -622 -326 1824 1259 -757 -129 1138 899
4393H99r28m41J348M43j520p51K548k96k375Q20K151j727j804J589J450j651p00
$$ 899 -29 -470 878 1321 -199 -950 1598 1302 -1073 -253 1898 171 -1633 -44 1406 -245 -945
4410i45J053O70o78j160P45J678j301j662J865J087k419q60K909k7k471O09J359
$$ -945 108 778 100 -1060 -315 1363 62 -1600 265 1352 -1067 -1927 982 955 -1516 -907 452
4427D52p5j070k2R90J65j146k77J752n9k389L39K398j042k107J423J928k282q66
$$ 452 377 -693 -715 275 440 -706 -983 769 710 -1679 -1340 1058 16 -2091 -668 1260 -1022 -1888
4445a888K038L9q81n18L40R60o58p77P07J639j689j362K250Q52k763k6K812n33
$$ -1888 150 189 -692 -1210 -870 90 -568 -1345 -638 1001 -688 -2050 200 1052 -1711 -1737 1075 542
4463E42k623J540J177p02j279P04P45K11j310l47J992m06k399J134K607k059j391
$$ 542 -2081 -541 636 -66 -1345 -641 104 315 -995 -1342 650 244 -2155 -1021 1586 -473 -1864
4480a864J895J096k214m89J555K98q41m38J006O57j124j377J826R62k056l26K189
$$ -1864 31 1127 -1087 -1576 -21 277 -564 -1002 4 661 -463 -1840 -14 948 -1108 -1434 755
4497G55P7k550Q51K066r62j580J381M76l51p91j72J228J36j530o5K483j069k041
$$ 755 832 -1718 -867 1199 237 -1343 38 514 163 -628 -800 428 564 -966 -1031 1452 383 -1658
4515a658J895J228j939q39J828N69j815k32J332K30j029o95J442Q11j291j383
$$ -1658 237 1465 -474 -1313 515 1084 -731 -963 369 599 -430 -1125 317 1128 -163 -1546
4531a546K399K98j890n05K818q14k022J112J284o30j103M45Q71l45j015K08J412
$$ -1546 853 1151 -739 -1244 1574 760 -1262 -150 1134 504 -599 -154 717 372 -643 -435 977
4548I77n18j539J189J640j575j292J480J136j837j61J370J77j264j78J126J89
$$ 977 459 -1080 109 1749 174 -1118 362 1498 -339 -500 870 1047 -217 -395 731 920
4564I20p59r85J587P06j776m80K313Q4k618O80K059j330j357J232J133r71q61
$$ 920 161 -824 763 1469 -307 -787 1526 1610 -1008 -328 1731 401 -956 276 1409 438 -423
4581d23N46R39R9j623L54J720r41j770K172P80k084o95K080K09j840N81J238m10
$$ -423 123 1062 1161 -462 -108 1612 671 -1099 1073 1853 -231 -926 1154 1363 -477 104 1342 932
4599I32r02l41J183P85j604q21J720M23k078J42K584q66k112J334J319j535o42
$$ 932 30 -311 872 1657 53 -768 952 1375 -703 -561 2023 1157 -955 379 1698 163 -479
4616d79J057M47n29o47L73Q85l58j394R66J428j601j359K142O69k305n8J862o55
$$ -479 578 1025 496 -151 222 1107 749 -645 321 1749 148 -1211 931 1600 -705 -763 1099 444
4634D44p95j20Q68L10j164l64J208M17j577J54J665n65k126J155J538j197j231
$$ 444 -351 -471 397 707 -457 -821 387 804 -773 -619 1046 481 -1645 -490 1048 -149 -1380
4651a380J422P54j613j37O24N52m45j258J021J423j416j055J512R04j950p54J955
$$ -1380 42 796 -817 -954 -330 222 -223 -1481 -460 963 -453 -1508 4 908 -1042 -1796 159
4668A59J64j678L21J173k92q28m04J129P1p82m35J437N57k408P80J726r57j797
$$ 159 323 -1355 -1034 139 -153 -981 -1385 -256 -185 -967 -1402 35 592 -1816 -1036 690 -267 -2064
4686b064J360J133j100p25J399K69j453K70J28R37l61j479J038J428j488j062
$$ -2064 -704 429 -671 -1396 3 272 -1181 -911 -783 154 -207 -1686 -648 780 -708 -1770
4702a770J795O42k314Q2K101o81j053K20R87j36o30J73P03J04j215m13K175j9
$$ -1770 25 667 -1647 -1565 536 -145 -1198 -978 9 -127 -757 -584 119 223 -992 -1405 770 751
4720G51k293J276J606j553j221J756O15j408k05R87K82n90m68L40J115r33r33
$$ 751 -1542 -266 1340 -213 -1434 322 937 -471 -676 311 593 3 -465 -125 990 57 -876
4737h76J439Q14k206LK035j82j897N44J663q02j022L64R77j32p26J58R58j66j455
$$ -876 563 1377 -829 -826 1209 1027 -870 -326 1337 535 -487 -123 854 722 -4 154 1112 946 -509
4756e09L45J689j145j438J528J252j868l35J395J03q54k49P69O06j110o73R13
$$ -509 -164 1525 380 -1058 470 1722 -146 -481 914 1017 163 -86 683 1289 179 -494 419
4773D19J045j603m55J816M14k155K51K278j228j481J120R43j120l27J41Q86k88
$$ 419 1464 -139 -594 1222 1636 -519 -268 2010 782 -699 421 1364 244 -83 58 944 656
4790F56r01K59J098k41j638R43J452j362j305J900L64j519P4J083k19o66j22O04
$$ 656 -245 14 1112 871 -767 176 1628 266 -1039 861 1225 -294 -220 863 644 -22 -144 460
4808D60K55n12q55J437M42j985jJ956l86j858J028J018n18j495Q65R44p37n18
$$ 460 715 203 -652 785 1227 -758 -759 1197 811 -1047 -19 999 481 -1014 -149 795 58 -460
4826d60K07R12p5j530P65J453j138j470J579O21j626J0J373j39j355J58J398m01
$$ -460 -253 659 584 -946 -181 1272 134 -1336 243 864 -762 -752 621 482 -873 -715 683 282
4844B82o46k08Q26L35j181n27J488M64k104K63K037q55j429Q64J214j117o31M89
$$ 282 -364 -572 254 589 -592 -1119 369 833 -1271 -1008 1029 174 -1255 -391 823 -294 -925 -436
4862d36Q24l18j007K30J111m04j195M61J364j146j116J867K42j271k4J460q58
$$ -436 388 70 -937 -707 404 0 -1195 -734 630 -516 -1632 235 477 -794 -818 642 -216
4879b16n58l8Q67J50r71p7J287j66j472oJ916r3k127Q33J387j441m51P71N18o99
$$ -216 -774 -812 55 205 -766 -843 444 278 -1194 -1200 716 623 -1504 -671 716 -725 -1176 -405 113 -586
4899e86l39P96M61k59j286O66J321j040j342J759P03j370o49J538p7j484M64J040
$$ -586 -925 -129 332 73 -1213 -547 774 -266 -1608 151 854 -516 -1165 373 296 -1188 -724 316
4917C16l59o22j75P30K02q53k04J440o9j653K24K107j277q94J000P23j128o18
$$ 316 -43 -665 -840 -110 92 -761 -965 475 406 -1247 -1023 1084 -193 -1087 -87 636 -492 -1110
4935a110R50M99p14n91N36J066o50p42O77J190j354q76J599L90j714L92Q68k52
$$ -1110 -160 339 -375 -966 -430 636 -14 -756 -79 1111 -243 -1119 480 870 -844 -452 416 164
4953A64q45O89K90J07o82k33J254p8j332J28J748o88j326P50J253j025r73J689
$$ 164 -681 8 298 405 -277 -510 744 666 -666 -538 1210 522 -804 -54 1199 174 -799 890
4971H90K22j307L3O43L15p18m31Q22Q02q59q79Q45J309j987j76J794l58j541Q57
$$ 890 1112 -195 -162 481 796 78 -353 469 1271 412 -467 378 1687 -300 -476 1318 960 -581 276
4990B76P87o28n12L49N38k51o85P1J119k40j006M06J525j210j337J451O84j273
$$ 276 1063 435 -77 272 810 559 -126 -55 1064 824 -182 224 1749 539 -798 653 1337 64
5008F4l67R68K07n85n49P94K69p43o25R07R47j445q19J954K3j834O44J322q86
$$ 64 -303 665 872 287 -262 532 801 58 -567 340 1287 -158 -977 977 1000 -834 -190 1132 246
5027B46q96R10N12l21r35J26J023j76r36l5J231l58j498R52J295j401q59J484
$$ 246 -650 260 772 451 -484 -358 665 489 -447 -482 749 391 -1107 -155 1140 -261 -1120 364
5045C64L55j452J90N58L57m77n97R28N50q58q33P08Q21j028l59J448l39j302N91
$$ 364 719 -733 -543 15 372 -105 -702 226 776 -82 -915 -207 614 -414 -773 675 336 -966 -375
5064c75P01l42q74J035M53n89o89P3J153l99j109J75J583j198q77J267P85j783
$$ -375 326 -16 -890 145 598 9 -680 -607 546 147 -962 -787 796 -402 -1279 -12 773 -1010
5082a010R4R36N15j381k09J224K0l97o26O66O08q08p27J259M46j782O57J303m94
$$ -1010 -916 20 535 -846 -1055 169 189 -208 -834 -168 440 -368 -1095 164 610 -1172 -515 788 294
5101B94j284N47P79n71m91O92L15m83p00L32J032o15j208P77J583j555o21J531
$$ 294 -990 -443 336 -235 -726 -34 281 -202 -902 -570 462 -153 -1361 -584 999 -556 -1177 354
5119C54J98j422L07J009m50n74J14N39O8q14m18J338K77j369k76J607l50j673
$$ 354 552 -870 -563 446 -4 -578 -464 75 143 -671 -1089 249 526 -843 -1119 488 138 -1535
5137a535J202J108r52p48R24J86k04m63L84N13l29o65K58J183o79j262J078J009
$$ -1535 -333 775 -177 -925 -1 185 -19 -482 -98 415 86 -579 -321 862 183 -1079 -1 1008
5155A008j708J10J004N0j048K19P19J66n68%J90N82n90p21J088J33j238K36J580
$$ 1008 -700 -590 414 464 -584 -365 354 520 -48 -48 142 724 134 -587 501 634 -604 -368 1212
5174A212r48j151J267P76j341k20N70M85p62j65M14O32m88r56R49J153j602p03
$$ 1212 264 -887 380 1156 -185 -405 165 650 -112 -277 137 769 281 -675 274 1427 -175 -878
5192h78J701J17j488L85J420m86j118L73O99k70m93j14P77L79j130k20J540o50
$$ -878 823 940 -548 -163 1257 771 -347 26 725 455 -38 -152 625 1004 -126 -346 1194 544
5210E44j170N29J738j454m31P24L01q51K08M76K32o71n67P36O23q43p07J203L89
$$ 544 -626 -97 1641 187 -244 480 781 -70 138 614 846 175 -392 344 967 124 -583 620 1009
5229A009j136l53J249J40j234M05Q00m11q57O2P15P6q41J76J041m27j192Q05P92
$$ 1009 -127 -480 769 909 -325 80 880 469 -388 -326 389 465 -376 -200 841 414 -778 27 819
5248H19r96m27J009L52q77n08J203j71m96k17O16M06l68j100J046L10j185m29
$$ 819 -177 -604 405 757 -120 -628 575 404 -92 -309 307 713 345 -755 291 601 -584 -1013
5266a013J249K46j380L47J074l53q89J44R33m93m03j58J033k18r55J83P50M4j370
$$ -1013 236 482 -898 -551 523 170 -719 -575 358 -135 -538 -696 337 119 -836 -653 97 141 -1229
5285a229R06P81q86o50R26M52q59k17P79J25m86l74M89N14n82q10J116N39j164
$$ -1229 -323 458 -428 -1078 -152 300 -559 -776 3 128 -358 -732 -243 271 -311 -1121 -5 534 -630
5304f30p00J504m04j108R28M51n01m43O06J69L16j095K92Q94k59j019L08J087
$$ -630 -1330 174 -230 -1338 -410 41 -460 -903 -297 -128 188 -907 -615 279 20 -999 -691 396
5322C96o88j092J194P14j098j87R55J14j118N54L47J54o33j85N05M56j085O7R97
$$ 396 -292 -1384 -190 524 -574 -761 194 308 -810 -256 91 245 -388 -573 -68 388 -697 -630 367
5341C67mr65PJ049k35j068R15K17l3q18L61N48k74o30K84J123n22j050R48Q09
$$ 367 363 -602 -595 454 219 -849 66 283 250 -568 -207 341 67 -563 -279 844 322 -728 220 1029
5361A029j239m09J270J5r42K5O96k18o41M69K42N77r99k8N24N71j322J05J647
$$ 1029 -210 -619 651 666 -276 -251 445 227 -414 55 297 874 -125 -153 371 942 -380 -275 1372
5380A372q73j070N91P19n47p48P87M72n83n39N85M34N9q59J19J277j204n98R32
$$ 1372 499 -571 20 739 192 -556 231 703 120 -419 166 600 659 -200 -81 1196 -8 -606 326
5399C26O62j216k09J108r8j029M97L13j47r4j77O66L21r11j39R55k14j060J98
$$ 326 988 -228 -437 671 573 -456 41 354 207 113 -64 602 923 12 -127 828 614 -446 -248
5418b48J007p57m77P78N03q53k26M67K29j92l90M25O17p69q29J018Q23j426j89
$$ -248 759 2 -475 303 806 -47 -273 194 423 231 -159 266 883 114 -715 303 1126 -300 -489
5437d89J138l81m75j34N92J36o83k3M30J0j54k11M91J27n73k2R86n70q65N78P08
$$ -489 649 268 -207 -341 251 387 -296 -319 111 121 -33 -244 247 374 -199 -221 765 195 -670 -92 616
5458F16o93l50Q47j14m10q1M36J01l15o48N38R23q57n16N83P56j440J18J103j56
$$ 616 -77 -427 420 306 -104 -185 251 352 37 -611 -73 850 -7 -523 60 816 -624 -506 597 441
5478D41r63M84M51o32r6j01N94ql71m21J036k19r17L98J193j031q23J192L74r60
$$ 441 -522 -38 413 -219 -315 -416 178 170 -201 -622 414 195 -722 -324 869 -162 -985 207 581 -379
5498c79J06M37K35p71m0n3M97k46o94O21O65p44l45J022k4j361M24Q69l74l20
$$ -379 -273 164 399 -372 -412 -465 32 -214 -908 -287 378 -366 -711 311 287 -1074 -650 219 -155 -475
5518d75M69N9j05j29k17M50mo31M19N13k42j094P50N83p90k47P15n1m88j9M11
$$ -475 -6 53 -52 -181 -398 52 48 -583 -164 349 107 -987 -237 346 -444 -691 24 -27 -515 -534 -123
5539a23L07m45l98L20O27q93m98J255L23j323Q4J331l45j264O68Q76m46n17n4
$$ -123 184 -261 -659 -339 288 -605 -1103 152 475 -848 -764 567 222 -1042 -374 502 56 -461 -515
5558e15M67kk23j01Q22k85j155O83J108p35j132J203L80r11j56P97J87n56K2K45
$$ -515 -48 -50 -273 -374 448 163 -992 -309 799 64 -1068 135 515 -396 -552 245 432 -124 -102 143
5578A43j29Jp26R42M41j117O8J171k11j100N74O27o41n67P17k3Q1k83N0N76l70
$$ 143 14 15 -711 231 672 -445 -377 794 583 -517 57 684 43 -524 193 170 251 -32 18 594 224
5599B24m96J86R14l22q17O85O49j358R1Q56J07p72Q0N19m71KJ16j49O45m21q70
$$ 224 -272 -86 828 506 -311 374 1023 -335 -244 612 719 -53 27 546 75 77 193 44 689 268 -602
5620f02J489N9j222k1J233m64j057R32P50q97j99M65J3j40k40MN85l15p23K70
$$ -602 887 946 -276 -297 936 472 -585 347 1097 200 1 466 479 339 99 103 688 373 -350 -80
5640h0Q06o08n91Q57K71j079K90P32l16m25K69O8K5k73k24N25K22q35Q1R10k51
$$ -80 726 118 -473 384 655 -424 -134 598 282 -143 126 194 219 -54 -278 247 469 -366 -285 625 374
5661C74r80M22N93l88n48O09L48q03%N57N7l54L1l99R32o46n71R34L91r59n68
$$ 374 -606 -184 409 21 -527 82 430 -373 -373 184 241 -113 -82 -481 451 -195 -766 168 559 -400 -968
5682i68J165j66o56K47M18J86n79R3O0J22k11m88R03j36p17J16J019n62r19Q15
$$ -968 197 31 -625 -378 40 226 -353 -260 -200 -78 -289 -777 126 -10 -727 -611 408 -154 -1073 -258
5702b58N36q10j68P28J49m99l77L98J49j8n76M65P81o59o85R97O1p82q0J136m66
$$ -258 278 -532 -700 28 177 -322 -699 -301 -152 -170 -746 -281 500 -159 -844 153 214 -568 -648 488 22
5723B2r96R16R4J60n49J44k5L27n77j80J049p9j334N14J058q90l84N37K39n76
$$ 22 -974 -58 36 196 -353 -209 -234 93 -484 -664 385 306 -1028 -514 544 -346 -730 -193 46 -530
5743e30l0Q63m8l95k75K39N49j25j074P81M69q17K9O89k15j83k58O48N3m53M0
$$ -530 -560 303 255 -140 -415 -176 373 248 -826 -45 424 -393 -364 325 110 -73 -331 317 370 -83 -43
5764d3K46K60q95K16M26l4q07K84R04o55p06P45M32r11K53M65P1k82k03N70q6
$$ -43 203 463 -432 -216 210 176 -631 -347 557 -98 -804 -59 373 -538 -285 180 251 -31 -234 336 250
5785B50l72j66m4N78m30k27P62J38j137P00Q65o95o22N70M10m84J18j59O6L93
$$ 250 -122 -288 -332 246 -184 -411 351 489 -648 52 917 222 -400 170 580 96 214 55 121 514
5805E14o53K2O42k29p01J28J101n50p01P62j23m44j27N75J08j94l17M59K71l36
$$ 514 -139 -117 525 296 -405 -277 824 274 -427 335 212 -232 -359 216 324 130 -187 272 543 207
5825B07n53L87N93j128M6J059r0r43J02Q61o12J31O2K30l15m41P70J36l39l09
$$ 207 -346 41 634 -494 -448 611 521 -422 -320 541 -71 60 122 352 37 -404 366 502 163 -146
5845a46J48J026n98o79K05O15r74j56J171k85n06K81J54K43l12k26J74K41l49
$$ -146 2 1028 430 -249 -44 571 -403 -559 612 327 -179 102 256 499 187 -39 135 376 27
5864B7n07O42L08o43j29Q56l28q36P27L07l19q4L3M59m00l20k53R87k40j024Q31
$$ 27 -480 162 470 -173 -302 554 226 -610 117 424 105 21 54 513 113 -207 -460 527 287 -737 94
5885I4M54n70m81Q33p1q07K17L43M7p05O86k33M37k66n29N28K28n21j23P83n72
$$ 94 548 -22 -503 330 259 -548 -331 12 59 -646 40 -193 244 -22 -551 -23 205 -316 -439 344 -228
5906b28k92L26L19o44Q7M99j91j10J06J97j18k31l10L64N30l43q19Q69K29j113
$$ -228 -520 -194 125 -519 -432 67 -124 -234 -128 69 -49 -280 -590 -226 304 -39 -858 11 240 -873
5926h73J43P45M50j079N0N72k27j93K16j63L75j61p98R13J42j120O62O69o49n29
$$ -873 -730 15 465 -614 -564 8 -219 -412 -196 -359 16 -145 -943 -30 112 -1008 -346 323 -326 -855
5946h55Q62J55o02J50K65J64J36n58J07L56l06m32O87K20k47j054J423k03q98
$$ -855 7 162 -440 -290 -25 139 275 -283 -176 180 -126 -558 129 349 102 -952 471 268 -630
5965f30N3Q29k28l32P8M00L7l47j0L23K94p74J42N07q9q14N10P97o01n33N93J20
$$ -630 -577 252 24 -308 -230 170 207 -140 -150 173 467 -307 -165 342 253 -561 -51 746 145 -388 205 325
5987C25m35j22L61L0j5k50R1N80o59j63N01N01p88l39J116n77o90P37O71q83o2
$$ 325 -110 -232 129 159 144 -106 -15 565 -94 -257 244 745 -43 -382 734 157 -533 204 875 -8 -70
6008g0L26k02Q7j0m96R88p1r07M56O69n73o55P60K94o04k47N93K44o12j82M05
$$ -70 256 54 141 131 -365 623 552 -355 101 770 197 -458 302 596 -8 -255 338 582 -30 -212 193
6029A93J31k42l02K44O07r72k26J237j54j147N67N25n00L0J91L8l83O8Q8J06J89
$$ 193 324 82 -220 24 631 -341 -567 670 516 -631 -64 461 -39 -9 182 220 -163 -95 -7 99 288
6050B88n28k3O70J10r93L54P38o68m76Q28O9p85R2P55k15r3k27O5J46j08n23O92
$$ 288 -240 -263 407 517 -476 -122 616 -52 -528 300 369 -416 -324 431 216 123 -104 -39 107 -1 -524 168
6072A68K76p32j34R53j92n30M46p1l35n1K68j01L37n63J91L27J05p23L05O67o94
$$ 168 444 -288 -422 531 339 -191 255 184 -151 -202 66 -35 302 -261 -70 257 362 -361 -56 611 -83
6093h3n81Q93N68q80l02L82J22k36K20o6j51j72k34L65O30p51j66O99J35j043
$$ -83 -664 229 797 -83 -385 -3 119 -117 103 37 -114 -286 -520 -155 475 -276 -442 257 392 -651
6113f51J91R77m62o63O47J28k29k95P37l49M9m08j08P43k59o76O39K50l64q75
$$ -651 -460 517 55 -608 39 167 -62 -357 380 31 80 -328 -436 307 48 -628 11 261 -103 -978
6133i78J101J15p26m4J057o22j3l01K19K66n74j74O65J48p24L09N75m01n47O35
$$ -978 123 238 -488 -532 525 -97 -110 -411 -192 74 -500 -674 -9 139 -585 -276 299 -102 -649 -14
6153a4J89j87m12M74Lk32q7L46J99l04n44M31M25m15l82R83l27n29l08R64j35
$$ -14 175 -12 -424 50 53 -179 -266 80 279 -25 -569 -138 287 -128 -510 473 146 -383 -691 273 138
6174A38m63K51l2K38l68q3K94Pj94QM75l02o59M34Q37r03q9O17j46l18q9O03k85
$$ 138 -325 -74 -106 132 -236 -319 -25 -18 -212 -204 271 -31 -690 -256 581 -322 -411 206 60 -258 -347 256 -29
6197b9L11l85K32L28k43m78J67N25n15l32N29L28p27M55L80m18j67Q3J68k1j40
$$ -29 282 -103 129 457 214 -264 -97 428 -87 -419 110 438 -289 166 546 128 -39 44 212 191 51
6218E1n4L23ro06K3P61J17r35M26O53m05l23L51K55q30J35M50j80r6L7J26OJ96
$$ 51 -3 320 311 -295 -272 489 606 -329 97 750 345 22 373 628 -202 -67 383 203 107 144 270 276 472
6241D72r54N80O32j015K45Q34m15q51P93L29n20j08J32p2K09o92K9P34p5p05N03
$$ 472 -482 98 730 -285 -40 794 379 -472 321 650 130 22 154 82 291 -401 -372 362 287 -418 85
6262H5K52m81m46Q72L7k16k94L03M6k04j80K12J77k56n87Q29J27p67K76M53o8
$$ 85 337 -144 -590 282 319 103 -191 112 158 -46 -226 -14 163 -93 -680 149 276 -491 -215 238 170
6283A70p48N44M30l66o32N72q5R3r2k15O97m80k40k21Q01l51q74R01L68n88k20
$$ 170 -578 -34 396 30 -602 -30 -115 -22 -114 -329 368 -112 -352 -573 228 -123 -997 -96 272 -316 -536
6304e36O20j21j27j61K57k62P8k99K17M55m29k99Q65R7q92K22R45o93n16O98K31
$$ -536 84 -37 -164 -325 -68 -330 -252 -551 -334 121 -308 -607 258 355 -537 -315 630 -63 -579 119 350
6325C50m39k25K34p9J51P3m05M12Nn60K74L04o27J72K01O08p74j90M30M78o08
$$ 350 -89 -314 -80 -159 -8 65 -340 72 77 -483 -209 95 -532 -360 -159 449 -325 -515 -85 393 -215
6346b15J1K60j83K48j40j92K30j5n32Q16K00o57o3N31J27q26M90K39m22M1k5L15
$$ -215 -204 56 -127 121 -19 -211 19 4 -528 288 488 -169 -232 299 426 -400 90 329 -93 -52 -77 238
6368B38j43m43L10K91j56m83K90O86q75k24P30n12K38j11M66k74j70k6K36P0l50
$$ 238 95 -348 -38 253 97 -386 -96 590 -285 -509 221 -291 -53 -164 302 28 -142 -168 68 138 -212
6389b12m0K11J59m74K11O09m79l31K84L45k32j85K48l4l03L63n2q3K21o44M82
$$ -212 -252 -41 118 -356 -145 464 -15 -346 -62 283 51 -134 114 80 -223 140 88 5 226 -418 64
6410F4K20j54m42P44J2o67Q3P05l43n92N60J42j27m22J23M0J29j99j55L64J43
$$ 64 284 130 -312 432 444 -223 -140 565 222 -370 190 332 205 -217 -94 -54 75 -124 -279 85 228
6431B28q58O75P38p50l94L34N95k74n80M38Nj19R1O2M51m63n09M04M82o68j07
$$ 228 -630 45 783 33 -361 -27 568 294 -286 152 157 38 129 191 642 179 -330 74 556 -112 -219
6452b19M57K1l43o8N82l91n0N2K07J75k46l53L74K91n80j17P31l62n88L51O05
$$ -219 238 259 -84 -152 430 39 -11 41 248 423 177 -176 198 489 -91 -208 523 161 -427 -76 529
6473E29m20l41L56J26m91K69J16o8L30m94J92K89l08l32N86j14n16M82M09p62
$$ 529 109 -232 124 250 -241 28 144 76 406 -88 104 393 85 -247 339 225 -291 191 600 -162
6493a62J13j63N73l59r4j68N90m67l34M2O66J99o81L06K89o76r1M11J81o44m0
$$ -162 -49 -212 361 2 -92 -260 330 -137 -471 -429 237 436 -245 61 350 -326 -417 -6 175 -469 -509
6514e09P64j07k18l35M35j69J57l88L86K48j005L32M71o7k23k3M19l52j72M02
$$ -509 255 148 -70 -405 30 -139 18 -370 16 264 -741 -409 62 -5 -228 -251 168 -184 -356 46
6534D6J98m13J44m7j00K93q33N64M05l17m21M14l5k42k11Q80n73k82n1N10J0l77
$$ 46 244 -169 -25 -72 -172 121 -712 -148 257 -60 -481 -67 -102 -344 -555 325 -248 -530 -581 -71 -61 -438
6556d38K43J89M50o29l98L90J95o42q7M95K81m43N95m3k70L20j61k58p0k7L46
$$ -438 -195 -6 444 -185 -583 -193 2 -640 -727 -232 49 -394 201 158 -112 208 47 -211 -281 -308 38
6577C8K88m49j83k0P19m70k56J83M78l77o2J77o7Q0m36O96k30k97K29L01n2l27
$$ 38 326 -123 -306 -326 393 -77 -333 -150 328 -49 -111 66 -1 79 -357 339 109 -188 41 342 290 -37
6599c7k45J008o42j21l7O88l60n06M38pj4l86M19m9J20j86N1M18n93m07M79L93
$$ -37 -282 726 84 -37 -74 614 254 -252 186 179 165 -221 198 149 269 83 134 552 -41 -448 31 424
6621D24m50OK52J11m21k06N21m3j69J62l8q2l80J09N48R2p73J62R30m85n47N41
$$ 424 -26 -20 232 343 -78 -284 237 194 25 187 149 67 -313 -204 344 436 -337 -175 755 270 -277 264
6643B64r0qk84K64L73j33j76J4K52J7o23j36M80j48l61M29J47k49J17R3k76k8
$$ 264 174 166 -118 146 519 386 210 224 476 493 -130 -266 214 66 -295 134 281 32 149 242 -34 -62
6665f2j05K86k20J08k71J30L09k92M8J93J40o08j03P85n07k00N86R2m08o5L55
$$ -62 -167 119 -101 7 -264 -134 175 -117 -69 124 264 -344 -447 338 -169 -369 217 309 -99 -164 191
6686A91j49j37M85n87L54k91l92O32K27n69j54N36J02l69J6L90N4n11L74k58K36
$$ 191 42 -95 390 -197 157 -134 -526 106 333 -236 -390 146 248 -121 -105 285 339 -172 202 -56 180
6707A80K7j33m2Qj84RK01j3k50n7M06j71j73M39o9l32L0J7J51K85p95N48j39J9
$$ 180 207 74 32 40 -144 -135 66 53 -197 -254 152 -19 -192 247 178 -154 -124 -107 44 329 -466 82 -57 -38
6731c8n68O19L47r21M88J31J05p39N21L34q8l31L85k69J65l49J40N58m59k12j5
$$ -38 -606 13 360 -561 -73 58 163 -576 -55 279 191 -140 245 -24 141 -208 -68 490 31 -181 -196
6752a96J33Jk43O23r7o97N43k27J6J28k28M0L56j56j78k50P92n89n73P44K59r34
$$ -196 -63 -62 -305 318 221 -476 67 -160 -144 -16 -244 -204 152 -4 -182 -432 360 -229 -802 -58 201 -733
6774g33N12N13m24j79M83l06K67k15k05J38M05l82j07M36L8o90Q60j75p24J17
$$ -733 -221 292 -132 -311 172 -134 133 -82 -287 -149 256 -126 -233 203 241 -449 411 236 -488 -371
6794c71K08K87m44L98j95J93j39L84l61J38k20l42P08J07j090P18K55J87n90L03
$$ -371 -163 124 -320 78 -117 76 -63 321 -40 98 -122 -464 244 351 -739 -21 234 421 -169 134
6814A34K3j26j26q0K42p9k6k79N36q2m87M54J13l30n5K60J02k15J51pK28m10j43
$$ 134 157 31 -95 -175 67 -12 -38 -317 219 137 -350 104 217 -113 -168 92 194 -21 130 123 351 -59 -202
6837b02J53j65K63j98N03R0p49M63J97M5o66J80O05m01j16m9M3Q6j76N10Pl40
$$ -202 -49 -214 49 -149 354 444 -305 158 355 400 -266 -86 519 118 2 -47 -4 82 -94 416 423 83
6859H3k66J93J15q9m08O32N3j43n64O70K90n71K73l8j40J84j56j33M31l61k92
$$ 83 -183 10 125 36 -372 260 313 170 -394 276 566 -5 268 230 90 274 118 -15 416 55 -237
6880b37N39k16l63M76L50m11m76N62q5k13J05r2J03K56k96J02M02m40j51J72j6
$$ -237 302 86 -277 199 549 138 -338 224 139 -74 31 -61 42 298 2 104 506 66 -85 87 71
6901G1R3l58K09L03n57R0N87m83j94K92J85k07O3j28k1L22k20m04M61l41m8K6
$$ 71 164 -194 15 318 -239 -149 438 -45 -239 53 238 31 94 -34 -55 267 47 -357 104 -237 -285 -259
6923b59M29j00m36J60J49j2q2k7N05k14j35K84k43J35o09K88L43k23k82N82l22
$$ -259 170 70 -366 -206 -57 -69 -151 -178 327 113 -22 262 19 154 -455 -167 176 -47 -329 253 -69
6944f9m8lJ06k26q3J80K42k4L7k19K59j57n13P9O34p0k29J92Q3m84j04J37jQ9
$$ -69 -117 -120 -14 -240 -323 -143 99 75 112 -107 152 -5 -518 -439 195 125 -104 88 171 -313 -417 -280 -281 -192
6968a92J03j8J24J36o33M89J21n58K5N35K33p08L68K29n39K6L23k73K72k76K05
$$ -192 -89 -107 17 153 -480 9 130 -428 -403 132 365 -343 25 254 -285 -259 64 -209 63 -213 -8
6989hj10K70l18Q3k9K13p55Q08l6k09l40L61M89o09J47q4K93Kk19k56P40n33j93
$$ -8 -118 152 -166 -83 -112 101 -654 154 118 -91 -431 -70 419 -190 -43 -127 166 168 -51 -307 433 -100 -293
7012b93J4K62j36p1L24k0K5m59N30m2l54J49K52k80n7K35k19L35j86j87N60n02
$$ -293 -279 -17 -153 -224 100 80 105 -354 176 134 -220 -71 181 -99 -156 79 -140 195 9 -178 382 -120
7034a20k62M32L49l81k06N35o60L48q1j65q8L92Nj95L34k53m19O09K2k64j24L07
$$ -120 -382 50 399 18 -188 347 -313 35 -46 -211 -299 93 98 -97 237 -16 -435 174 196 -68 -192 115
7056A15l09J09M03l15K4j04n1J78K25l10j51K14M12p93L09N46p70K05r9J08J1
$$ 115 -194 -85 318 3 27 -77 -128 50 275 -35 -186 28 440 -353 -44 502 -268 -63 -162 -54 -43
7077d3K30K28j29r7m5P1J21j39k97K56N9p3l20M16J79n03K32J44l12n9J63J79
$$ -43 187 415 286 189 144 215 336 197 -100 156 215 142 -178 238 417 -86 146 290 -22 -81 82 261
7099B61k5j91m23L40k83K33J28L18n21k49M32M40n49o4L80pk76j6N09l85K11p86
$$ 261 236 45 -378 -38 -321 -88 40 358 -163 -412 20 460 -89 -153 227 220 -56 -72 437 52 263 -523
7121e23O35L65o84M4K07J2k97n5N78j58l0J07p3Q9o83L72J53j19J39n29M47K56
$$ -523 112 477 -207 -163 44 56 -241 -296 282 124 94 201 128 217 -466 -94 59 -60 79 -450 -3 253
7143B53m74j0N29m11j38K48L75m68k91P03m09l11N64l87L58k75m46M70J13j10
$$ 253 -221 -231 298 -113 -251 -3 372 -96 -387 316 -93 -404 160 -227 131 -144 -590 -120 -7 -117
7163a17k9Q8M0p01L96K72k98O3L82k83j1R9k85N66k87k07K23J93l91p0J42K63
$$ -117 -146 -58 -18 -719 -323 -51 -349 -286 96 -187 -198 -99 -384 182 -105 -312 -89 104 -287 -357 -215 48
7185D8j32m73Q82l55j59k24L03J58j12k81J97M21o38L8L62J85n06M33J84l39l61
$$ 48 -84 -557 325 -30 -189 -413 -110 48 -64 -345 -148 273 -365 -327 35 220 -286 147 331 -8 -369
7206c69L32K60j51o2K47j35L7j39k66M34J14m90L99j13o0l96N76j00n0j57J22
$$ -369 -37 223 72 10 257 122 159 20 -246 188 302 -188 211 98 38 -358 218 118 68 -89 33
7227C3k13j18N22m54J12J73mk0J91n53J26O11m30j25J36K71k94j8K60m1l62J72
$$ 33 -180 -298 224 -230 -118 55 51 31 222 -331 -205 406 -24 -149 -13 258 -36 -54 206 165 -197 -25
7249b5oJ43j1l86M52K50l22l71M30j85m5O4K25j2j69J29L82l19j90k7K38n57K
$$ -25 -31 112 101 -285 167 417 95 -276 154 -31 -76 -12 213 201 32 161 543 224 34 7 245 -312 -310
7272c10O1L49j3k27L8L83k71l26L71K05j66j89M25j79j30k34K5K68k36K43j90
$$ -310 -249 100 87 -140 -102 281 10 -316 55 260 94 -95 330 151 21 -213 -188 80 -156 87 -103
7293a03J9k16j77N07M98p78J28L90j50M0k1K7m3n4k13K60l6j35J9K74k53k95N91
$$ -103 -84 -300 -477 30 528 -250 -122 268 118 158 137 164 121 67 -146 114 78 -57 -38 236 -17 -312 279
7316B79J56n29j20L72r5k12l9M03k2m19J46K65L19m00j06L9K55n99K35L13k61
$$ 279 435 -94 -214 158 63 -149 -188 215 193 -226 -80 185 504 104 -2 37 292 -307 -72 241 -20
7337b0m18M72L97l39K24l88j50N24lm24M11l89l40M35K52j42n85K82M09l76K16
$$ -20 -438 34 431 92 316 -72 -222 302 299 -125 286 -103 -443 -8 244 102 -483 -201 208 -168 48
7358D8l10J67K82j38PJ43o16L19m6L18k55l23N74m3k69J78j9K6l58L23L64m60
$$ 48 -262 -95 187 49 56 199 -417 -98 -144 174 -81 -404 170 127 -142 36 17 43 -315 8 372 -88
7380h8j97K72M3M52r11K48J3K58o87N78Q8k33j57K54K8k99K87J04j96p1J47j85
$$ -88 -285 -13 30 482 -429 -181 -168 90 -597 -19 69 -164 -321 -67 -39 -338 -51 53 -143 -214 -67 -252
7402b52L7K06l32K71L36o06L08%P0o5L44j77J24j89l07m6K91o4r8K92J77o04L24
$$ -252 -215 -9 -341 -70 266 -340 -32 -32 38 -27 317 140 264 75 -232 -278 13 -51 -149 143 320 -284 40
7425D0M2m46k7J84L69k27J23M7J60n57J39K00K23j00n08J48L00j74j91O13j72
$$ 40 82 -364 -391 -207 162 -65 58 105 265 -292 -153 47 270 170 -338 -190 110 -64 -255 358 186
7446A86k97j5M24n32J80L2J61j78J11N7j60J68J41l35n2K12r9M59j96m0m32N17
$$ 186 -111 -126 298 -234 -54 -22 139 -39 72 129 -31 137 278 -57 -109 103 4 463 267 227 -205 312
7468C12j92m80N18j37o8K16j5p8J99k07l3K68m4k63o3L58p7m45L41J08k57l2N26
$$ 312 120 -360 158 21 -47 169 154 76 275 68 35 303 259 -4 -67 291 214 -231 110 218 -39 -71 455
7491D55o8p6k92j44K26O9J95l10R2J52n92K74q7l6k3O00no21M24J35j59k24l53
$$ 455 387 311 19 -125 101 170 365 55 147 299 -293 -19 -106 -142 -165 435 430 -191 233 368 209 -15 -368
7514c68O36o6k63j21M33k32j91l5K08j28k13K74J41m72K93j67L60j79L63k42k42
$$ -368 268 202 -61 -182 251 19 -172 -207 1 -127 -340 -66 75 -397 -104 -271 89 -90 273 31 -211
7535b11J57j21L65N0l04J2R3j64k98P80m72J6m0J8K04Lk18J78J57j65l17O1L27
$$ -211 -54 -175 190 240 -64 -52 41 -123 -421 359 -113 -97 -137 -119 85 88 -130 48 205 40 -277 -216 111
7558A11j35l82M67N11p94j20L18j09k65J55N1J05L35n95K89L35n20j02K17M04
$$ 111 -24 -406 61 572 -222 -342 -24 -133 -398 -243 -192 -87 248 -347 -58 277 -243 -345 -128 276
7578B76n48J08K36j27j61Q5J39l1j08M5K42j58K87l51J63l86M91j56L57l62k89
$$ 276 -272 -164 72 -55 -216 -131 8 -23 -131 -86 156 -2 285 -66 97 -289 202 46 403 41 -248
7599b48M90mn34K36K68j77j44K59n7M99o72j28L65l88K8L2N00j88m50M27K46l72
$$ -248 242 238 -296 -60 208 31 -113 146 89 588 -84 -212 153 -235 -207 -175 325 137 -313 114 360 -12
7621a2q3k5j59L1n8K44J89j8k66K21j98J64k55N37J35p64N6M82Po08L07P6Rj12
$$ -12 -95 -120 -279 -248 -306 -62 127 109 -157 64 -134 30 -225 312 447 -317 -261 221 228 -380 -73 3 12 -100
7645a00J07l24O37n70K01n3R1l09p1N80l46n9N37k08l78j79N29j19J55P1m64J85
$$ -100 7 -317 320 -250 -49 -102 -11 -320 -391 189 -157 -216 321 113 -265 -444 85 -34 121 192 -272 -87
7667h7J55J71l36L36k44q9J82J92k37m6K56l91k8J38J09j11j53l8L50Oj81N7J42
$$ -87 68 239 -97 239 -5 -94 88 280 43 -3 253 -138 -166 -28 81 -30 -183 -221 129 135 -46 11 153
7690A53M8m04K65L49k77j77M11j75m02L40K55j59j68m7J09n1k7l74M09N7m51M59
$$ 153 201 -203 62 411 134 -43 368 193 -209 131 386 227 59 12 121 70 43 -331 78 135 -316 143
7712A43J2J80k19P3p9p6m5N1R4J26k93N3j14N48m75r2O66m74l51M99j7r1k33O2
$$ 143 155 335 116 189 110 34 -11 40 134 260 -33 20 -94 454 -21 -113 553 79 -272 227 210 119 -114 -52
7736e2M97j90m41K96l08L98j03l31M78l21j80O38m54j08O4J19K3m6K44j76j99
$$ -52 445 255 -186 110 -198 200 97 -234 244 -77 -257 381 -73 -181 -117 2 25 -21 223 47 -152
7757a52j70K11J09J09J5r9K3k4l1k69L72j19k97J16M06j11m3kk10p2p8K72R1j66
$$ -152 -322 -111 -2 107 122 23 46 22 -9 -278 94 -25 -322 -206 200 89 46 44 -166 -238 -316 -44 47 -119
7781a19k06K59J82l40J80m2n6j16k4K95Q6O6k74J95k0j08K59k26M1k68NL77m05
$$ -119 -325 -66 116 -224 -44 -86 -142 -258 -282 13 99 165 -109 86 66 -42 217 -9 32 -236 -231 146 -259
7804b59j98L28M5l86K15L77m0J32L3l33n9Q1k15J63K57j80L27k34j96m2j10K85
$$ -259 -457 -129 -84 -470 -255 122 82 214 247 -86 -145 -64 -279 -116 141 -39 288 54 -142 -184 -294 -9
7826ij30Q8q2L12j92K95m00J84j0j64n4O6K40k09NL69l28p8M4L19m13K71J25l78
$$ -9 -139 -51 -133 179 -13 282 -118 66 56 -108 -162 -96 144 -65 -60 309 -19 -97 -53 266 -147 124 249 -129
7850a29nQ8K44l00M87p20N29J93n06J25K11l23Q2K82k87K10j34J42J58m04J44
$$ -129 -134 -46 198 -102 385 -335 194 387 -119 6 217 -106 -24 258 -29 181 47 189 347 -57 87
7871H7l47J08M39k90l42L79j20q4O04k73m49N48l75L36m24J61P2j58J24J50q4
$$ 87 -260 -152 287 -3 -345 34 -86 -170 434 161 -288 260 -115 221 -203 -42 30 -128 -4 146 62
7892F2o7j6k07M17j76r5K17K45k76R9j09K12q6j89j16j74J66J99j23J54k7j24
$$ 62 -5 -21 -228 189 13 -82 135 380 104 203 94 306 220 31 -85 -259 -93 106 -17 137 110 -14
7914a4K59j09J36o78O73k41K35n16L50k9l17J71k5O0o7J85j90N64k27n63L81m6
$$ -14 245 136 272 -406 267 26 261 -255 95 66 -251 -80 -105 -45 -112 73 -117 447 220 -343 38 -8
7936hq1m8K99j87j59M85o5n13L95k48J75m3k68M8M93n06K72J48m40K55P1J99j12
$$ -8 -89 -137 162 -25 -184 301 236 -277 118 -130 45 2 -266 -218 275 -231 41 189 -251 4 75 274 162
7959A62l07P2q5M16j87k69Q7N3J01j01J52J0l48k3L84j90j86L87k43J05M7K92
$$ 162 -145 -73 -158 258 71 -198 -111 -58 43 -58 94 104 -244 -267 117 -73 -259 128 -115 -10 37 329
7981C29N3m15n2K5J87j32j93K31K19k55J14l62M92m50K58K5j51J05Q2J03j53k84
$$ 329 382 -33 -85 -60 127 -5 -198 33 252 -3 111 -251 241 -209 49 74 -77 28 110 213 60 -224
8003b24K07k16L12J05k03M21j46m42K11m0J41j69q7L57n60j05O64j55l10K07J70
$$ -224 -17 -233 79 184 -19 402 256 -186 25 -15 126 -43 -130 227 -333 -438 226 71 -239 -32 138
8024A38m9j17J84j21q0K0m3o5N4J24K4k72J96k78J11O06l60n5M9k6J38k34L0J99
$$ 138 89 -28 156 35 -45 -25 -68 -133 -79 45 69 -203 -7 -285 -174 432 72 17 66 40 178 -56 -26 173
8048A73j84j06l7L52J3j18p2J04l8Kn8k64J73J62k66K82J1k15k7k8R2q8K44j23
$$ 173 -11 -117 -154 198 211 93 21 125 87 89 31 -233 -60 102 -164 118 129 -86 -113 -141 -49 -137 107 -16
8072a6N4j28M0L56r4j31l3K81l31L27l16J21m27L00p8L33k50J12K58m55J11l45
$$ -16 38 -90 -50 306 212 81 48 329 -2 325 9 130 -297 3 -75 258 8 120 378 -77 34 -311
8094c11J6J41o4L66pj86Q7K01k99r5L74N9j56k01L31j16m3j74R6l79L78l9K64
$$ -311 -295 -154 -218 148 141 -45 42 243 -56 -151 223 282 126 -75 256 140 97 -77 19 -360 18 -21 243
8117B43o3j64j18J33J37l5j53M49k67m6k32J26J84qj77K09j90j3J17l73K64k4
$$ 243 180 16 -102 31 168 133 -20 429 162 116 -116 10 194 186 9 218 28 15 132 -241 23 -1
8139aj87K47K1m43K53J74l02M32k71J39l3k14J36P1n6k69M43j63n8n6J15m9J5
$$ -1 -188 59 80 -363 -110 64 -238 194 -77 62 29 -185 -49 22 -34 -303 140 -23 -81 -137 -22 -71 -56
8162e6j3L81l47k96O23k30m25J11L30J09j50J80m16j78O09j42J80p41M59O8K3
$$ -56 -69 312 -35 -331 292 62 -363 -252 78 187 37 217 -199 -377 232 90 270 -471 -12 56 79
8183G9K2k84K49p0k65R2J99J95
$$ 79 101 -183 66 -4 -269 -177 22 217
8191B17
$$ Imaginary data points
##PAGE= N=2
##DATA TABLE= (X++(I..I)), XYDATA
0@%%%%%%qJ6j6K4l2L2m0N6o6P5r6J19j37J60j90K22k56K94l40L91m46N08n76O52
$$ 0 0 0 0 0 0 0 -8 8 -8 16 -16 16 -24 32 -34 41 -55 64 -73 87 -103 119 -137 157 -183 208 -238 270 -306 346
30C46p36Q26r27J040j160J293j442J604j780J973k187K423k682K967l286L646
$$ 346 -390 436 -491 549 -611 682 -760 844 -936 1037 -1150 1273 -1409 1558 -1728 1918
46A918m049M503n020N620o325P162q178R445j1072J3247j6331K1083k9439M8468
$$ 1918 -2131 2372 -2648 2972 -3353 3809 -4369 5076 -5996 7251 -9080 12003 -17436 31032
60C1032j71985k8401K13481j11924k9137Q1535P152j62841k9590J16430P1469
$$ 31032 -140953 -169354 44127 -67797 -96934 -15399 -8247 -171088 -200678 -84248 -12779
71a2779r2312l5742J05051N5807j19323l2541J14355q971j45967M3646J62172
$$ -12779 -105091 -140833 -35782 20025 -99298 -131839 -17484 -26455 -172422 -128776 33396
82C3396j9939j22588K8276P0767n0212n8890P8938R7128n2777j23396J9519J01211
$$ 33396 13457 -109131 -80855 -10088 -60300 -119190 -40252 56876 4099 -119297 -99778 1433
94A433k9100o5251R8344Q5065j16713r0353R8504N1177r3835k0983J00655L0817
$$ 1433 -27667 -92918 5426 90491 -26222 -116575 -18071 33106 -60729 -81712 18943 49760
106D9760o7718j1662P2838O335j07741l8542J08470M7423q1886J1344J08423m1089
$$ 49760 -17958 -29620 43218 49553 -58188 -96730 11740 59163 -22723 -11379 97044 55955
118E5955j29045L6013J05206l9581p2462N2228O5848m3502n7518M6524O9691m9515
$$ 55955 -73090 -37077 68129 28548 -43914 8314 74162 30660 -26858 19666 89357 39842
130C9842q8134M6960Q0137o2627o0073R7294N7130j01119m0219R0630J2133q9881
$$ 39842 -48292 -1332 78805 16178 -43895 53399 110529 9410 -30809 59821 71954 -17927
142a7927q035P8103J3706o1984o436P4955J0527r3455k0049R0232j715r2782L1742
$$ -17927 -25962 52141 65847 3863 -2573 72382 82909 -10546 -30595 59637 57922 -34860 -3118
155c118J00425m3162q8665M6931O5642n1593n2648M5299M3773m8609n3709M8243
$$ -3118 97307 54145 -34520 12411 78053 26460 -26188 19111 62884 14275 -39434 8809
167H809P1237m1306o3183N3567M1048r2755m5770R5921L7110p7593m010P8012
$$ 8809 80046 38740 -24443 29124 70172 -22583 -68353 27568 64678 -12915 -16925 61087
179F1087p250p8730r196N2429j937n8911Q770Q8305J1459q7209q777O5407l7987
$$ 61087 53837 -24893 -34089 18340 16403 -42508 -33738 54567 66026 -21183 -29960 35447 -2540
192b540q0905N8451Q9824m7213o4192M3247L6020n1922l6576M9213M2063m7123
$$ -2540 -83445 -24994 64830 17617 -46575 -3328 32692 -19230 -55806 -6593 35470 -11653
204a1653n2071M8655N3840n8353m6783P3380L4662q4189j8243Q1593m112q4859
$$ -11653 -63724 -15069 38771 -19582 -66365 7015 41677 -42512 -60755 20838 16726 -68133
216f8133M846P3915N650m6574P074M4901k1424p9168J640Q4621M685o4587L0677
$$ -68133 -63287 10628 16278 -30296 -23222 21679 255 -78913 -77273 7348 12033 -52554 -21877
229b1877O8225n5740p6114M9159N1404n2786l3091N9414L8476m2815l5364L4035
$$ -21877 46348 -9392 -85506 -36347 15057 -37729 -70820 -11406 27070 -15745 -51109 -17074
241a7074K6922n1668l7908O4542M5903o5894l1054P1914J0620p5555O344P3241
$$ -17074 9848 -41820 -79728 -15186 30717 -35177 -66231 5683 16303 -59252 -52908 20333
253B0333j5101o8225R924N2744n524m2075J4696N6271j3213o9330R603O3527k9145
$$ 20333 5232 -62993 -53069 -325 -5849 -47924 -33228 23043 9830 -59500 -49897 13630 -15515
266a5515o2671N0694O6609m7899m5357N1090K3409o1568k8144N0649L3392l4359
$$ -15515 -78186 -27492 39117 -8782 -54139 -3049 20360 -41208 -69352 -18703 14689 -19670
278a9670k3744M5837K7528n9633l4391O3691K2508p0645n783P7045l991o6682
$$ -19670 -43414 2423 29951 -29682 -64073 -382 22126 -48519 -54302 22743 18752 -47930
290d7930J7585N8317k1894n2048J5432M4111j4335m6506J7341O0646j3743n8880
$$ -47930 -30345 27972 6078 -45970 -30538 13573 -762 -47268 -29927 30719 16976 -41904
302d1904K6859N4015m9825n6978N5189M6224m8328k0836N6197J6874n2592k3452
$$ -41904 -15045 38970 -10855 -67833 -12644 33580 -14748 -35584 20613 37487 -15105 -38557
314c8557L7266J9469l9778j7843N6282K8676n8164j9857O1641l12p0524J0737
$$ -38557 -1291 18178 -21600 -39443 16839 45515 -12649 -32506 29135 28823 -41701 -30964
326c0964O7001j6613n1808K5529M6364k1301m0173J6730L9185j9535m8695K0794
$$ -30964 36037 19424 -32384 -6855 39509 18208 -21965 -5235 33950 14415 -34280 -13486
338a3486N5295k5369m7898M5300M6372n5360m0262N1728K0161n2381r636N4544
$$ -13486 41809 16440 -31458 13842 60214 4854 -35408 16320 36481 -15900 -25536 29008
350B9008J6782l9367j5199L6298J0174n1474j8142N9336J7346n7091K493O5391
$$ 29008 45790 6423 -8776 27522 37696 -13778 -31920 27416 44762 -12329 -9836 55555
362E5555j5677o4432J8906N0114k8101m0949K9583M0345k0320l5697J9285L9271
$$ 55555 39878 -24554 -5648 44466 16365 -24584 4999 45344 25024 -10673 8612 47883
374D7883k5981m7716K9495M5466m1551l9272N5524L4138n4297j9394M9936L848
$$ 47883 21902 -25814 3681 49147 7596 -31676 23848 57986 3689 -15705 34231 38079
386C8079n2299p162M3581J0818l4198o616M3490R290n5191j2314N3544m059n8634
$$ 38079 -14220 -21382 22199 33017 -1181 -7797 35693 44983 -10208 -22522 31022 26963 -31671
399c1671J8984O0919k2130m7199K8322L3355l5581l5087K5624L2691j9310l1329
$$ -31671 -12687 48232 26102 -21097 7225 40580 4999 -30088 -4464 28227 8917 -22412
411b2412K5742L8634l2481m2386L7651L2261n2430k6727N6609J8056n0102k966
$$ -22412 3330 41964 9483 -32903 4748 37009 -15421 -42148 14461 32517 -17585 -20551
423b0551M6258l063m5729m741L6637N062l9311l366M8754L852n3093M880N3772
$$ -20551 25707 22644 -23085 -27826 8811 13873 -25438 -28804 19950 23802 -29291 -24411 29361
436B9361k1277n7747K5831M6586k9953l2016L5687K8950l1909k9978K3031K6521
$$ 29361 8084 -49663 -23832 22754 -7199 -39215 -3528 25422 -6487 -36465 -13434 13087
448A3087k7468l3249L2589L7479l7089k8169M9758J9838n9722j6979M9753K350
$$ 13087 -14381 -47630 -15041 22438 -14651 -42820 6938 26776 -32946 -49925 -172 2178
460B178m2306R641M4446l303l9544l415L3460l86m3296J652N0650n072m8338K1306
$$ 2178 -40128 -30487 13959 10656 -28888 -32303 1157 771 -42525 -40873 9777 4705 -43633 -22327
474b2327M9212l2020m7106L0887L1949l2960k0411L5374K2619k8771k5233K5790
$$ -22327 26885 -5135 -52241 -21354 10595 -22365 -42776 -7402 15217 -13554 -38787 -12997
486a2997K7615l0319l0068L6187K5464m5929j5902N6977J1571n2282j986M2888
$$ -12997 14618 -15701 -45769 -9582 15882 -30047 -45949 11028 22599 -29683 -31669 11219
498A1219r860l9807R869L7803l528l3829N173M0709l505m6180N961M3517k2043
$$ 11219 1359 -38448 -28579 9224 5696 -28133 -22960 17749 14244 -31936 -25975 17542 -4501
511d501m3867L6611M7132l2462l2461L1897J7782l6866j7581L2772K1924k6180
$$ -4501 -48368 -11757 35375 2913 -29548 2349 20131 -16735 -34316 -1544 20380 -5800
523e800k1110L3711K6210l7195k5549M0637J1346n1036j582N8252J838m4737P170
$$ -5800 -26910 6801 33011 -4184 -29733 10904 22250 -28786 -30368 27884 29722 -15015 -7845
536g845L4030j5344l3915J1577L4986m990l5887P065M2347r210m2635J8619L9444
$$ -7845 26185 10841 -23074 -11497 23489 18499 -17388 -10323 32024 22814 -19821 -1202 38242
549C8242l2420l7457L9191L2066l5694k0477L3298J3842k8407j2149K9182J4608
$$ 38242 5822 -31635 7556 39622 3928 -16549 16749 30591 2184 -9965 19217 33825
561C3825l4544k4288L6244K5539l5060q469M6736k237n6163R72M5430q343l2779
$$ 33825 -719 -25007 11237 36776 1716 -6753 39983 37746 -18417 -17445 27985 19642 -13137
574a3137J7633L4106j1639l1024O893K7141j4944l9096J5345M7020j2399l5101
$$ -13137 4496 38602 26963 -4061 2832 29973 15029 -24067 -8722 38298 25899 -9202
586i202K7347K7133m5705l0690M1098K3558l0011j0310L0047P102l2131j3625
$$ -9202 18145 45278 -427 -31117 9981 33539 3528 -6782 23265 30367 -1764 -15389
598a5389L1354J6901l4937j7286L9330J1072m4716j242M6638q040m3743J4781
$$ -15389 15965 32866 -2071 -19357 19973 31045 -13671 -14913 31725 23685 -20058 -5277
610e277L7936j8145l4682J1046K5201j0142k2289J7916L4315j8474m4789J3361
$$ -5277 32659 14514 -20168 -9122 16079 5937 -16352 1564 35879 17405 -27384 -14023
622a4023L1894k6325k4168M3288K6326m0976j9693L1070N370l3625p141K9720
$$ -14023 17871 -8454 -32622 10666 36992 -3984 -23677 7393 12763 -20862 -28003 1717
634A717J1826k4968q954L2447Q923m3268j3406M0471K094l9656J3627M2528j9038
$$ 1717 13543 -11425 -20379 12068 20991 -22277 -35683 4788 6882 -32774 -19147 23381 4343
647D343l9821J7619K9199j6907k3367J3852K2084j6505k7445J9641L5443k0437
$$ 4343 -35478 -17859 11340 -5567 -28934 -15082 7002 -9503 -36948 -17307 18136 -2301
659b301l4834K5403K5280l7559k0129M1688J4360l7784o193L4287N101k9738o647
$$ -2301 -37135 -11732 13548 -24011 -44140 -2452 11908 -25876 -32069 2218 7319 -22419 -29066
672b9066K4065M424l1356m635M1586Q751m1290j041L8458j3124l9638J9716L5713
$$ -29066 -5001 -577 -31933 -36568 5018 13769 -27521 -28562 9896 -3228 -42866 -23150 12563
685A2563k1577k7917K2276K5494j5571k1149J2805J9371k1085k7944K6119L5551
$$ 12563 -9014 -36931 -14655 10839 -4732 -25881 -13076 6295 -14790 -42734 -16615 18936
697A8936k4698k4817L2381J4844m1718j1324L8808N106l1523J284L1405M050k5889
$$ 18936 -5762 -30579 1802 16646 -25072 -36396 2412 7518 -24005 -22721 8684 12734 -13155
710a3155o867K4118J811l3500O36M3977R1m0055Q674L4853k0161l0556K6493K7322
$$ -13155 -20022 4096 5907 -27593 -26957 17020 17111 -22944 -14270 20583 422 -30134 -3641 23681
724B3681k4028k3423J8363K0450j5097j7678K0249K3623k4486k8116K6911K3059
$$ 23681 -347 -23770 -5407 15043 -54 -17732 2517 26140 1654 -26462 449 23508
736B3508l4082j5120M1449J1927l5025k066L0817p209l3818R40L0658O839k1019
$$ 23508 -10574 -25694 15755 27682 -7343 -9409 21408 14199 -19619 -18679 11979 18818 -2201
749b201J34K8147n426m1187L108L9564q851l2718K2775L1563k6177k6233K3095
$$ -2201 -2067 26080 20654 -20533 -17425 22139 13288 -19430 3345 34908 8731 -17502 5593
762E593J7342k2445j5706K0846J9276j8024k1458K1314K1376k7344j9461L4628
$$ 5593 22935 490 -15216 5630 24906 6882 -14576 6738 28114 770 -18691 15937
774A5937J4062l9118r155L6442M02l0296P594K9771n241k8098j543K1721r38k5957
$$ 15937 29999 -9119 -18274 18168 18570 -11726 -4132 25639 20398 -7700 -9243 12478 11540 -14417
788a4417N929L5942m509l6108J0095K9394k3270k9708K7748K5567k3299j4872
$$ -14417 -8488 27454 22945 -13163 -3068 26326 3056 -26652 1096 26663 3364 -11508
800a1508K2951J1564k2989j5596J7823J7424k0258j7096K7399J7463l2836j2693
$$ -11508 11443 23007 18 -15578 2245 19669 -589 -17685 9714 27177 -5659 -18352
812a8352L6009M581l6579J350L1948p837k8687R127K6912l447k2461K261K2376
$$ -18352 17657 22238 -14341 -12991 18957 11120 -17567 -8440 18472 15025 -7436 -5175 17201
825A7201p899l1833Q569L5201j1096k8822K2054K5620k8957k4131K5372J4283
$$ 17201 9302 -22531 -13962 21239 10143 -18679 3375 28995 38 -24093 1279 15562
837A5562k3836q328K4210J2750k0413j5855J8535J3664k6143j3761L2557J1401
$$ 15562 -8274 -16602 7608 20358 -55 -15910 2625 16289 -9854 -23615 8942 20343
849B0343l4283m124L4909m361l1649Q672K6758j1384k4313P416K1402m423k0838
$$ 20343 -13940 -18064 16845 12484 -19165 -10493 16265 4881 -19432 -12016 9386 4963 -15875
862a5875P120K6673r937l2068J1949K6866k0926k3560K9305K1856k6570j3851
$$ -15875 -8755 17918 7981 -24087 -12138 14728 -6198 -29758 -453 21403 -5167 -19018
874a9018K2442M801k4507q384K2065J2954j8407j1309K3636R887l1561j0026L2768
$$ -19018 3424 8225 -16282 -24666 -2601 10353 -8054 -19363 4273 14160 -17401 -27427 5341
887E341K107l2959O813L1997j0410k6985J1117K1659j0586k0435Q247J9789q677
$$ 5341 7448 -25511 -18698 13299 2889 -24096 -12979 8680 -1906 -22341 -14094 5695 -2982
900b982k3567J1333K8903j4316k6265K0231K0198k8480j8375K9179J3276k4261
$$ -2982 -26549 -15216 13687 -629 -26894 -6663 13535 -14945 -33320 -4141 9135 -15126
912a5126m769K3752M602k2799r242J8615Q825k1801o552L0526P512l2135j885
$$ -15126 -19895 3857 8459 -14340 -23582 -4967 3858 -17943 -24495 6031 13543 -18592 -20477
925b0477L0039p816k9513J2345K7125j2892k0159J2623J8122r774j7650Q974K0255
$$ -20477 9562 1746 -27767 -15422 11703 -1189 -21348 -8725 9397 -377 -18027 -9053 11202
938A1202j1947k4077J5691K5277j9400j9307K7136J5442k9250j0739K5106L843
$$ 11202 -745 -24822 -9131 16146 -3254 -22561 4575 20017 -9233 -19972 5134 8977
950H977k2545j037K3263O905j8416p862J9702M017k7680k897L2111J933k8803
$$ 8977 -13568 -14605 8658 15563 -2853 -10715 8987 13004 -14676 -17573 14538 16471 -12332
963a2332Q131K8178j4939k5390J5133J9287j3888j4531J3369J6900j0454j8243
$$ -12332 -4201 23977 9038 -16352 -1219 18068 4180 -10351 3018 19918 9464 -8779
975h779J1623K0715j5847k2135K1318J8791k6275j2341K9329Q888k5886k527K2346
$$ -8779 2844 23559 7712 -14423 6895 25686 -589 -12930 16399 25287 -599 -3126 19220
988A9220j158k2544j962J9931N849j8149k270K4303N95l0148K14K8430q566k6030
$$ 19220 18062 -4482 -6444 13487 19336 1187 -1083 23220 23815 -6333 -6119 22311 13745 -12285
1002a2285J6856K4920j6398j9190J4152J2829j5045j3667J3059J6509j1548j7671
$$ -12285 4571 29491 13093 -6097 8055 20884 5839 -7828 5231 21740 10192 -7479
1014g479J5291J8263k0816j6925K4453J1199k8702o269K7278J301k2699J945K0128
$$ -7479 7812 26075 5259 -11666 12787 23986 -4716 -10985 16293 17594 -5105 -3160 16968
1027A6968j311j9452k376J7340Q64k2139J026K7925j645k7847P562K3246j7745
$$ 16968 15657 -3795 -6171 11169 12033 -10106 -9080 18845 17200 -10647 -3085 20161 2416
1040B416k3292J9225J8526j6088j1581J5410J0409j5209j4610J2201J4688j5618
$$ 2416 -20876 -1651 16875 787 -10794 4616 15025 -184 -14794 -2593 12095 -3523
1052c523j5319K1501J5461k5487j1153K6810K776k7874J455K4148l879k0327L595
$$ -3523 -18842 2659 18120 -7367 -18520 8290 11066 -16808 -15353 8795 4916 -15411 -11816
1065a1816J7666j323j7289O61J9582l287k5508M619K5543q481k2537J6831K0252
$$ -11816 5850 4527 -12762 -12101 7481 4194 -21314 -16695 8848 367 -22170 -5339 14913
1078A4913k0047j7172J7141J0367j6954q121J5725J1470j2471j2174J4230J1661
$$ 14913 -5134 -22306 -5165 5202 -11752 -19873 -4148 7322 -5149 -17323 -3093 8568
1090H568k1810j3531K4396J0892k4662j669K6792m314k4904M774J9297n523j6015
$$ 8568 -13242 -26773 -2377 8515 -16147 -17816 8976 4662 -20242 -15468 3829 -1694 -17709
1103a7709M421J6408j955j7392L615K1389o850k5280J0203K3252j5568j7980K0473
$$ -17709 -13288 3120 1165 -16227 -12612 8777 1927 -23353 -13150 10102 -5466 -23446 -2973
1116b973J4673k0604r549J8486O872j5893q531J3671R554j4057r302K0381J0915
$$ -2973 11700 -8904 -18453 33 6905 -8988 -17519 -3848 5706 -8351 -17653 2728 13643
1129A3643k4394q378K4941R66k5396N228K4640p042j9084Q500J5904o420j6389
$$ 13643 -10751 -19129 5812 6778 -18618 -13390 11250 4208 -14876 -6376 9528 3108 -13281
1142a3281L284J5783l824j7709R178K3471j1323k2814J4913J6447k0480j2172
$$ -13281 -9997 5786 1962 -15747 -6569 16902 5579 -17235 -2322 14125 -6355 -18527
1154a8527K2572Q839j8345l950J6210N395j5414q688J4181Q669j7098o716K4308
$$ -18527 4045 12884 -5461 -9411 6799 12194 -3220 -11908 2273 10942 -6156 -12872 11436
1167A1436N731k5712j273K4229n808k1967R857J9089r950j4970Q515J4395n614
$$ 11436 17167 -8545 -9818 14411 8603 -13364 -3507 15582 5632 -9338 -823 13572 7958
1180G958j3784M754J6370q937j9574J2758K0734j5922j6365K1493J0930k2156
$$ 7958 -5826 -1072 15298 6361 -13213 -455 20279 4357 -12008 9485 20415 -1741
1192a741o922J9123J946j6904k022J6946O566j3928o938J5872L755k2590l300
$$ -1741 -8663 10460 12406 -4498 -6520 10426 16992 3064 -3874 11998 15753 -6837 -10137
$$ [...]
8191A06
##END NTUPLES=NMR FID
##END=
