##TITLE=1H_Pr M-1 
 CDCl3
 8 sc, 
 13.1.2025
##JCAMPDX= 6.0         $$ Bruker NMR JCAMP-DX V2.0
##DATA TYPE= NMR FID
##DATA CLASS= NTUPLES
##ORIGIN= UXNMR, Bruker Analytische Messtechnik GmbH
##OWNER= root
$$ XWIN-NMR		Version 3.5
$$ Mon Jan 13 16:22:29 2025 Russian Standard Time (UT+4h)  she@DPX200
##.OBSERVE FREQUENCY= 200.1315
##.OBSERVE NUCLEUS= ^1H
##.DELAY= (6, 6)
##.ACQUISITION MODE= SIMULTANEOUS
##.ACQUISITION SCHEME= undefined
##.AVERAGES= 8
##.DIGITISER RES= 18
##SPECTROMETER/DATA SYSTEM= spect
##.PULSE SEQUENCE= zg30
##.SOLVENT NAME= CDCl3
##.SHIFT REFERENCE= (INTERNAL, CDCl3, 0, 15.7039)
##AUDIT TRAIL= $$ (NUMBER, WHEN, WHO, WHERE, WHAT)
$$ ##TITLE= Audit trail, XWIN-NMR		Version 3.5
$$ ##JCAMPDX= 5.01
$$ ##ORIGIN= Bruker BioSpin GmbH
$$ ##OWNER= she
$$ F:/spectra/data/she/nmr/H-F/1/audita.txt
$$ ##AUDIT TRAIL=  $$ (NUMBER, WHEN, WHO, WHERE, WHAT)
(   1,<2025-01-13 16:21:21.18 +0400>,<she>,<DPX200>,
      <created by zg, POWCHK disabled, PULCHK disabled
       configuration hash MD5:
       00 E9 B6 7A A2 85 ED C7 34 08 36 98 17 FE 4E 26
       data hash MD5: 16K
       1E 51 61 A4 23 E1 1B 38 A3 97 AC 71 80 8D F5 DB>)
$$ ##END=
$$ 
$$ hash MD5
$$ 2C AD CD BA AE 46 71 57 82 F1 02 26 E2 41 E1 BE
##$RELAX= 
##$RELAX= 
##$RELAX= 
##$RELAX= 
##$RELAX= 
##$RELAX= 
$$ Bruker specific parameters
$$ --------------------------
##$DU= <F:/spectra>
##$EXPNO= 1
##$NAME= <H-F>
##$PROCNO= 1
##$TYPE= <nmr>
##$USER= <she>
##$AMP= (0..31)
100 100 100 100 100 100 100 100 100 100 100 100 100 100 100 100 100 100 
100 100 100 100 100 100 100 100 100 100 100 100 100 100 
##$AQSEQ= 0
##$AQ_mod= 1
##$AUNM= <au_zg>
##$AUTOPOS= <>
##$BF1= 200.13
##$BF2= 200.13
##$BF3= 200.13
##$BF4= 200.13
##$BF5= 200.13
##$BF6= 200.13
##$BF7= 200.13
##$BF8= 200.13
##$BYTORDA= 1
##$CFDGTYP= 0
##$CFRGTYP= 5
##$CHEMSTR= <none>
##$CNST= (0..31)
1 1 145 1 1 1 1 1 1 1 1 1 1 1 1 1 1 1 1 1 1 1 1 1 1 1 1 1 1 1 1 1 
##$CPDPRG= <>
##$CPDPRG1= <>
##$CPDPRG2= <>
##$CPDPRG3= <>
##$CPDPRG4= <mlev>
##$CPDPRG5= <mlev>
##$CPDPRG6= <mlev>
##$CPDPRG7= <mlev>
##$CPDPRG8= <mlev>
##$CPDPRGB= <>
##$CPDPRGT= <>
##$D= (0..31)
0 1.2 0 0 0 0 0 0 0 0.06 0 0.03 0 0 0 0 0.0002 0 0 0 0 0 0 0 0 0 0 0 0 
0 0 0 
##$DATE= 1736770880
##$DBL= (0..7)
120 120 120 120 120 120 120 120 
##$DBP= (0..7)
150 150 150 150 150 150 150 150 
##$DBP07= 0
##$DBPNAM0= <>
##$DBPNAM1= <>
##$DBPNAM2= <>
##$DBPNAM3= <>
##$DBPNAM4= <>
##$DBPNAM5= <>
##$DBPNAM6= <>
##$DBPNAM7= <>
##$DBPOAL= (0..7)
0.5 0.5 0.5 0.5 0.5 0.5 0.5 0.5 
##$DBPOFFS= (0..7)
0 0 0 0 0 0 0 0 
##$DE= 6
##$DECBNUC= <off>
##$DECIM= 24
##$DECNUC= <off>
##$DECSTAT= 4
##$DIGMOD= 1
##$DIGTYP= 9
##$DL= (0..7)
0 120 120 120 120 120 120 120 
##$DP= (0..7)
150 150 150 150 150 150 150 150 
##$DP07= 0
##$DPNAME0= <>
##$DPNAME1= <>
##$DPNAME2= <>
##$DPNAME3= <>
##$DPNAME4= <>
##$DPNAME5= <>
##$DPNAME6= <>
##$DPNAME7= <>
##$DPOAL= (0..7)
0.5 0.5 0.5 0.5 0.5 0.5 0.5 0.5 
##$DPOFFS= (0..7)
0 0 0 0 0 0 0 0 
##$DQDMODE= 0
##$DR= 18
##$DS= 0
##$DSLIST= <SSSSSSSSSSSSSSS>
$$ [...]
##$SUBNAM2= <"">
##$SUBNAM3= <"">
##$SUBNAM4= <"">
##$SUBNAM5= <"">
##$SUBNAM6= <"">
##$SUBNAM7= <"">
##$SUBNAM8= <"">
##$SUBNAM9= <"">
##$SW= 24.0689530833862
##$SWIBOX= (0..15)
0 0 2 0 0 0 0 0 0 0 0 0 0 0 0 0 
##$SW_h= 4816.95568400771
##$TD= 16384
##$TD0= 1
##$TE= 0
##$TE2= 300
##$TE3= 300
##$TEG= 300
##$TL= (0..7)
0 120 120 120 120 120 120 120 
##$TP= (0..7)
150 150 150 150 150 150 150 150 
##$TP07= 0
##$TPNAME0= <>
##$TPNAME1= <>
##$TPNAME2= <>
##$TPNAME3= <>
##$TPNAME4= <>
##$TPNAME5= <>
##$TPNAME6= <>
##$TPNAME7= <>
##$TPOAL= (0..7)
0.5 0.5 0.5 0.5 0.5 0.5 0.5 0.5 
##$TPOFFS= (0..7)
0 0 0 0 0 0 0 0 
##$TUNHIN= 0
##$TUNHOUT= 0
##$TUNXOUT= 0
##$USERA1= <user>
##$USERA2= <user>
##$USERA3= <user>
##$USERA4= <user>
##$USERA5= <user>
##$V9= 5
##$VALIST= <valist>
##$VCLIST= <CCCCCCCCCCCCCCC>
##$VD= 0
##$VDLIST= <DDDDDDDDDDDDDDD>
##$VPLIST= <PPPPPPPPPPPPPPP>
##$VTLIST= <TTTTTTTTTTTTTTT>
##$WBST= 1024
##$WBSW= 4
##$XGAIN= (0..3)
0 0 0 0 
##$XL= 0
##$YL= 0
##$YMAX_a= 181871
##$YMIN_a= -340869
##$ZGOPTNS= <>
##$ZL1= 120
##$ZL2= 120
##$ZL3= 120
##$ZL4= 120
##$ABSF1= 10
##$ABSF2= 0
##$ABSG= 5
##$ABSL= 3
##$ALPHA= 0
##$AQORDER= 0
##$ASSFAC= 0
##$ASSFACI= 0
##$ASSFACX= 0
##$ASSWID= 0
##$AUNMP= <proc_1d>
##$AZFE= 0.1
##$AZFW= 0.1
##$BCFW= 1
##$BC_mod= 2
##$BYTORDP= 1
##$COROFFS= 0
##$CY= 11.3945322036743
##$DATMOD= 1
##$DC= 2
##$DFILT= <>
##$DTYPP= 0
##$F1P= 15.6554695791079
##$F2P= 12.8336369535428
##$FCOR= 0.5
##$FTSIZE= 0
##$FT_mod= 4
##$GAMMA= 1
##$GB= 0.15
##$INTBC= 1
##$INTSCL= 1
##$ISEN= 128
##$LB= 0.24
##$LEV0= 0
##$LPBIN= 0
##$MAXI= 10000
##$MC2= 0
##$MEAN= 0
##$ME_mod= 0
##$MI= 1.114404
##$NCOEF= 0
##$NC_proc= 0
##$NLEV= 6
##$NOISF1= 3.799351
##$NOISF2= 2.8
##$NSP= 1
##$NTH_PI= 0
##$NZP= 0
##$OFFSET= 15.70392
##$PC= 1
##$PHC0= -26571.46
##$PHC1= 11.98744
##$PH_mod= 1
##$PKNL= yes
##$PPARMOD= 0
##$PSCAL= 0
##$PSIGN= 0
##$REVERSE= no
##$SF= 200.130013532006
##$SI= 16384
##$SIGF1= 3
##$SIGF2= 2
##$SINO= 400
##$SIOLD= 16384
##$SREGLST= <1H.CDCl3>
##$SSB= 0
##$STSI= 0
##$STSR= 0
##$SW_p= 3612.71676300578
##$SYMM= 0
##$S_DEV= 0
##$TDeff= 0
##$TDoff= 0
##$TI= <>
##$TILT= no
##$TM1= 0
##$TM2= 0
##$TOPLEV= 0
##$USERP1= <user>
##$USERP2= <user>
##$USERP3= <user>
##$USERP4= <user>
##$USERP5= <user>
##$WDW= 1
##$XDIM= 8192
##$YMAX_p= 0
##$YMIN_p= 0
$$ End of Bruker specific parameters
$$ ---------------------------------
##NTUPLES= NMR FID
##VAR_NAME=  TIME,          FID/REAL,        FID/IMAG
##SYMBOL=    X,             R,               I
##VAR_TYPE=  INDEPENDENT,   DEPENDENT,       DEPENDENT
##VAR_FORM=  AFFN,          ASDF,            ASDF
##VAR_DIM=   8192,          8192,            8192
##UNITS=     SECONDS,       ARBITRARY UNITS, ARBITRARY UNITS
##FACTOR=    0.0002076,     1,               1
##FIRST=     0,             0,               0
##LAST=      1.7004516,     0,               0
##MIN=       0,             -340869,         0
##MAX=       1.7004516,     181871,          0
$$ Real data points
##PAGE= N=1
##DATA TABLE= (X++(R..R)), XYDATA
$$ [...]
2270A858J356j234n63J183j343n14J296l86j894J614L64j107Q92R06k230N5Q01
2287A054j291k83J548m07j158J147m05q86Q49O91k058K40N92j697J94J866n59
2304e63n02R22o19j186J258k51j627N69R82j416R63J258j343o33J002r90p27J493
2322a410p9j258J110J083j897J019P60j470l53J728j341l22J931n08j084J582
2338e09K0j467J152N18k047O15J251j302M98J273k68q51J460k89j528J307J16
2355e1j216R60J086j012L21J686j298p21J044l65j017J764j81j149J123P02q60
2372H16N0J036j407l05J664j056r31J807k58j014J740j2j454R60J20j485O71J042
2390A984j328K0J411n81j083J452l45j440Q46O5j301P59J296j154k22J328j174
$$ plain form
2270 1858 3214 1980 1417 2600 1257 743 2039 1653 -241 1373 1737 630 1522 2428 198 253 1054
2287 1054 -237 -520 1028 621 -537 610 205 -681 168 859 -1199 -959 -367 -2064 -1870 -4 -563
2304 -563 -1065 -143 -762 -1948 -690 -941 -2568 -1999 -1017 -2433 -1470 -212 -1555 -2188 -1186 -2176 -2903 -1410
2322 -1410 -1489 -2747 -1637 -554 -2451 -1432 -672 -2142 -2495 -767 -2108 -2430 -499 -1007 -2091 -509
2338 -509 -489 -1956 -804 -286 -2333 -1718 -467 -1769 -1271 2 -266 -1117 343 54 -1474 -167 -51
2355 -51 -1267 -307 779 -233 88 1774 476 -245 799 434 -583 1181 1000 -149 974 1676 816
2372 816 866 1902 495 190 1854 798 -133 1674 1416 402 2142 2130 676 1636 1756 271 942 1984
2390 1984 656 676 2087 1506 423 1875 1530 90 936 1001 -300 459 1755 601 379 1707 533
2407E33n33J069p03j623J569M85j452J222O86j503K53J011j678k32J740j079r33
2424a168J452j76j022J362L65j852N91J138j713j27J622j049m15J097p63p01J444
2441H5j34j584J063N54j644P35J301j268K45J188j124r60J226j41j330J286O77
2458A75j281R26Q20j433K8J036j234j70J515j166m67J592j93q97J032N90j682
2475h09O63N18j750O44J711j117l73J214l96j084J424P0j747P96J73q33P11J439
2493A254q87l56Q03o53p17J179l07p36P84K52r27J001P12j510J90N28j030l07
2511g27J279j40m60Q12k19j006Q93N30j300L30O64j232J51J498r64o08J189o21
2529F9q50J247M3j113L10P78j529P37J528j011p8P21p02j303J387l02p55J113
$$ plain form
2407 533 0 1069 366 -1257 312 797 -655 567 1253 -250 3 1014 -664 -896 844 -235 -1168
2424 -1168 284 108 -914 448 813 -1039 -448 690 -1023 -1150 472 -577 -992 105 -658 -1359 85
2441 85 -49 -1633 -570 -16 -1660 -925 376 -892 -647 541 -583 -1543 -317 -458 -1788 -502 175
2458 175 -1106 -180 640 -793 -765 271 -963 -1133 382 -784 -1251 341 148 -749 283 873 -809
2475 -809 -146 372 -1378 -734 977 -140 -513 701 305 -779 645 715 -1032 -236 -63 -896 -185 1254
2493 1254 367 11 814 161 -556 623 316 -420 364 616 -311 690 1402 -108 82 610 -420 -727
2511 -727 552 412 -48 764 545 -461 432 962 -338 -8 656 -576 -425 1073 109 -499 690 69
2529 69 -781 466 509 -604 -294 484 -1045 -308 1220 209 131 852 150 -1153 234 -68 -823 290
2547B90O03j552R89O38j565KJ024p03o38J390l2j045J231n84o89K87R14j225J96
2566d69Q66r58k68J296m86n48J154l64j103R41m3j115N28P31q74J53J519j145
2584a85j10P37p93o65J108j40q08J119Q67j639N65Q19j636J51J333j021o54J184
2602B32j88j075J714j1j302O53O07j160L28J161j371j26J271p05n67J477n16j286
2620h64R33K43j417Q22J144j259M39P77p35k97J021j055r29J637n5p66O20P40
2638I99j377K95J131j365l1R69l36r05J334k67q47J074O01j380P97K11j277k5
2656c99J343r19l02J447o28j090J354q4j246P57N86j635N71J326j012K34J007
2673A310j066p90R86k21o89J010L11j672J075P89j094L7R74j109o06J309m40q89
$$ plain form
2547 290 893 -659 330 968 -597 -595 429 -274 -912 478 446 -599 632 48 -641 -354 560 -665 -469
2566 -469 397 -561 -829 467 -19 -567 587 223 -880 61 18 -1097 -569 162 -712 -559 960 -185
2584 -185 -295 442 -351 -1016 92 -48 -856 263 1130 -509 56 875 -761 -610 723 -298 -952 232
2602 232 44 -1031 683 672 -630 23 630 -530 -202 959 -412 -538 733 28 -539 938 422 -864
2620 -864 69 312 -1105 -283 861 -398 41 818 83 -214 807 -248 -1177 460 405 -361 259 999
2638 999 -378 -83 1048 -317 -348 621 285 -620 714 447 -400 674 1275 -105 692 903 -374 -399
2656 -399 944 25 -277 1170 542 -548 806 722 -524 233 819 -816 -245 1081 69 303 1310
2673 1310 244 -546 440 219 -470 540 851 -821 254 1043 -51 -14 960 -149 -755 554 114 -775
2691g75J350j4j616R91M37j081M14R58j374j55J329r09l15J356q80q79J353k90
2709a00j206Q17P20j218J10J014j064K0J288j303n72J169j12j019J121N70j607
2726a372P06P36j119K56Q27p96l05J079p57o15J198J20j165J374K2j197O00M55
2744D7j037M64M59k18l76J295o40j205J265Q97j671M41J032j211L74J330j360
2761a14k11J330r50m09J110j03r43N99N54j067O82J115j304l5Q43r59l22J198
2779A014p8r63J330j55r30R27M14j548L10Q02j025J51J234k22p91Q10l52q32J121
2798A217k9j255L74O95r24n8J219q31j85Q67m18j374J271L89j349N97M03j076
2816d67L71J081r93j36N98o20q32J291o57l64Q32L38j224O33O88j200j8J025j166
$$ plain form
2691 -775 575 561 -1055 -64 373 -708 -294 664 -710 -865 464 -445 -760 596 -284 -1163 190 -100
2709 -100 -1306 -489 231 -987 -877 137 -927 -907 381 -922 -1494 -325 -437 -1456 -335 235 -1372
2726 -1372 -666 70 -1049 -793 34 -762 -1067 12 -745 -1360 -162 -42 -1207 167 189 -1008 -408 47
2744 47 -990 -526 -67 -285 -661 634 -6 -1211 54 951 -720 -279 753 -458 -84 1246 -114
2761 -114 -325 1005 55 -354 756 653 -290 309 863 -204 478 1593 289 254 1097 138 -184 1014
2779 1014 936 -27 1303 1148 218 1145 1559 11 321 1123 98 249 1483 1261 470 1280 928 96 1217
2798 1217 1188 -67 307 1002 78 20 1239 408 223 1090 672 -702 569 958 -391 206 609 -467
2816 -467 -96 985 -8 -144 454 -166 -998 293 -364 -728 104 442 -782 -149 539 -661 -679 346 -820
2835h20k47J362o27l92Q39m31r24P28P72j831J107O63j152oJ234q89n99J468o83
2854d28j057J125J49q61N33O30j049K17J402j019o24J341j250k42J141j21q90
2871a003R81K73r31N60J85o34j50R21o62o63J667k12j022R41j99j058R03O23j569
2890a049Q59O97n56n19J047p87j27R33k88q79J030k50p27O26J033j240L75P08
2908H86p20n30Q59l98r34J438Op46N26M27j289N49J067j216k78J432j089k52J169
2927I07m19q22R25L36j118M63N36r21J61M12m42l17J453q66q07J221k76r21Q19
2946C24M90r65L57J010j446L11J167j233o88J123j02p06J132n86m33N33N04j042
2964b50J50O43q35O7J020m39o31J176m56r36R18m3n17K53J77q29J62N80k5k01
$$ plain form
2835 -820 -1067 295 -332 -724 115 -316 -1240 -512 260 -1571 -464 199 -953 -959 275 -614 -1213 255 -428
2854 -428 -1485 -360 -211 -1072 -539 91 -958 -741 661 -358 -982 359 -891 -1133 8 -113 -1003
2871 -1003 -22 251 -680 -120 65 -569 -719 202 -460 -1123 544 332 -690 251 52 -1006 -103 520 -1049
2890 -1049 -190 507 -49 -568 479 -308 -435 498 210 -669 361 111 -616 10 1043 -197 178 886
2908 886 166 -364 495 97 -837 601 607 -139 387 814 -475 74 1141 -75 -353 1079 -10 -262 907
2927 907 488 -334 591 927 -191 272 808 -113 48 460 18 -299 1154 288 -519 702 426 -495 324
2946 324 814 -151 206 1216 -230 81 1248 15 -673 450 348 -358 774 188 -245 288 792 -250
2964 -250 -100 543 -292 -225 795 356 -275 901 445 -491 427 384 -133 120 297 -532 -370 210 185 -16
2984a6P36l65j126J069k41o33P87J86r91O84M70j018P5J047q84l06O84j34n40
3003e16P89L58j341N88M37o56K55N92j076j90J101o26l46P71O8j058O67N79j201
3022h05O67M74p93k20J096r17L2R31o43l65O31k10r18Q38N81r38M13N17p06l43
3042f78R62n86m62J147l10q48P70L54r73L74P86j167K66Q46j196j47J336k56m75
3061b57J015n74p31J77R07j006O48M29n27r4P54o91m51J236o94q14R44O5p91R60
3081E05P44j499K08J021n78p05R18m78p04J111l9p39J101J38j374Q31M82j014
3099g1L2R28q90m31J540n85m87N26P4q26M10N37j119M14P15p36J29O00o18m76
3119c34P76P8j012N01O68j010K21O61j142K11R15o40n14J188q09l62O53L56r89
$$ plain form
2984 -16 720 355 -771 298 57 -576 211 397 -594 90 560 -458 -383 664 -220 -526 158 24 -516
3003 -516 273 631 -710 -122 315 -341 -86 506 -570 -760 341 -285 -631 140 208 -850 -183 396 -805
3022 -805 -138 336 -457 -677 419 -498 -466 465 -178 -543 88 -122 -1040 -202 379 -559 -146 371 -335 -678
3042 -678 284 -302 -764 383 73 -775 -5 349 -624 -250 536 -631 -365 481 -715 -862 474 218 -257
3061 -257 758 184 -547 -370 537 -469 179 608 81 -13 741 50 -401 835 141 -673 271 336 -455 505
3081 505 1249 -250 -42 979 401 -304 614 136 -568 543 504 -235 866 1004 -370 461 943 -71
3099 -71 -39 889 -1 -432 1108 523 36 562 636 -190 220 757 -362 52 767 31 160 760 142 -334
3119 -334 442 520 -492 9 677 -333 -112 549 -593 -382 533 -107 -621 567 -242 -604 49 405 -584
3138e84O60N43j006M28K95o18k79P58p44L7Q53k89p64N40M25j030J002M5j141
3157h69M32N68l99m77J153n85j90L86k51o01Q56p2m34L16L19m53r0Q70r65J10
3177c76J77j10m01J001j73r81N99O21r77K82P04q56m9R53q93j77J164j21p32O01
3197B56J76r26K97O49q57K01O42p52Q7Q27m44p49R64m45n32O40L47p59J5N94n22
3218b91M9P58n09l15N85m17m61N82Q8p20O66O16j166J53O59p62J4Q87o84n93J243
3239C82j40q00J044n1j118L83N22q03J76J005r75J99O69m25p80J310m32q26P21
3258F1O81j002J53L07n58J77P53k52l56L68l73k96P44N46j259K32N28q43K58N98
3278D67k60l47R77o98k79N65R2o52M67L12p69K22O48q33m5R85n02k58M95k27m78
$$ plain form
3138 -584 76 619 -387 41 336 -282 -561 197 -547 -510 343 54 -710 -170 255 -775 227 272 -869
3157 -869 -437 131 -268 -745 408 -177 -367 19 -232 -833 23 -49 -483 -167 152 -301 -391 479 -486 -376
3177 -376 -199 -309 -710 291 118 -863 -264 357 -620 -338 366 -490 -539 414 -479 -656 508 387 -345 256
3197 256 432 -494 -197 452 -405 -204 438 -314 -227 600 156 -593 371 -74 -606 34 381 -378 -363 231 -291
3218 -291 -242 516 7 -308 277 -140 -601 -19 69 -651 15 631 -535 -382 277 -485 -471 416 -268 -861 382
3239 382 242 -558 486 435 -683 -300 222 -581 -405 600 -375 -176 493 68 -712 598 166 -660 61
3258 61 742 -260 -107 200 -358 -181 572 320 -36 332 -41 -337 407 953 -306 -74 454 -389 -131 467
3278 467 207 -140 837 139 -140 425 517 -135 332 644 -125 97 745 -88 -133 852 350 92 587 360 -118
3299a18M39k1m49M72N59r29J20Q42p36k54O86n54m88P22k0o15P57k5p78M32O05
3320F47r02J49M05l55l28P08l80m07R75j12j195P52L01o11l3O62p27K9P88m25
3340e9m58O68o06q0N53j07o53N60N31o92j26P55r54j78P66m95n76J104j50m11
3360f08J69M17p35j86R97o31j98R72r99q8R72m15k39J60K45r35Q13M84r57j15
3380h77R95q75M25Q01k63q81P57M8q25O58L7p34P43O09q65l13J056o80l11Q17
3400C22j66n59N50K93m35M04Q4m69J63M74o63q9O73O0r26N80Q8j2N32K55j374
3421b15N25N58n56J6Q18j093n9J080n90n77O46O29j326L78K02n39L70K86o08j66
3441b21Q01k29l61K79j09m78O32P7m87J38N05r78J90P91m94k97N45l27m05P41
$$ plain form
3299 -118 321 300 -149 323 882 -47 73 915 179 -75 611 57 -431 291 271 -344 413 388 -390 42 647
3320 647 -255 -106 299 -56 -384 324 -56 -463 512 400 -795 -43 258 -353 -386 276 -451 -422 366 -59
3340 -59 -517 151 -455 -535 18 -89 -742 -182 349 -343 -469 286 -668 -846 -80 -575 -1151 -47 -197 -608
3360 -608 -439 -22 -757 -943 54 -577 -775 197 -802 -890 82 -333 -572 -412 -167 -1102 -289 195 -762 -877
3380 -877 118 -757 -332 469 206 -675 82 130 -695 -37 0 -734 9 618 -247 -560 496 -184 -495 322
3400 322 156 -403 147 440 5 409 493 24 187 661 -2 -91 582 642 -284 296 384 372 904 1159 -215
3421 -215 310 868 312 328 1146 53 -6 1074 484 -93 553 1182 -144 234 436 -103 267 553 -55 -221
3441 -221 580 351 -10 269 160 -318 314 391 -96 42 547 -431 -241 550 56 -241 304 -23 -428 313
3461C13J24p04O49j55p30K65N24o10j11R01n54l35N96l70m61N67L99q08J35P92
3481D27j052K42O55n75j47N29l52o9K29j72l29P70j09n33O30P3n22J48L80q49
3501f26L75M21J49r48J078o1l15j09K88o03K47L37o51rP18N2n90P91o14l49L79
3522d0K06m40K5Q99o39j46K50l87K39M42k95q01R42M7p97R52Pj013L66M86o27
3543c24Q7M23l16q1K21p0o20Q72k25m32M20K28q51N59L36o11J00N42j28o44P84
3564B70o9p77M83L95q39K84O49n68K0N78l94o46R27j37m87O25k60k71L89Q9l85
3585a24K41M85o15r6P20m76o40J201k57q34P48J15o20J37N25n25Q7O58n62l82
3605b14Q09l28l63Q01l48n53P02Q6r35M46P67r74J25P09o71r5K92j9m72O30R4
$$ plain form
3461 313 437 -267 382 227 -503 -238 286 -324 -435 466 -88 -423 173 -197 -658 -91 308 -500 -365 427
3481 427 -625 -383 272 -303 -450 79 -273 -342 -113 -285 -614 156 47 -486 144 217 -305 -157 223 -626
3501 -626 -251 170 319 -629 449 388 73 -36 252 -351 -104 233 -418 -427 291 343 -247 544 -70 -419 -40
3522 -40 166 -274 -249 650 11 -135 115 -272 -33 409 114 -687 255 302 -495 457 464 -549 -183 303 -324
3543 -324 -237 186 -130 -211 10 -60 -680 192 -33 -465 -45 183 -668 -109 227 -384 -284 258 130 -514 270
3564 270 201 -576 -93 302 -537 -253 396 -172 -152 426 32 -614 313 176 -311 314 54 -217 172 261 -124
3585 -124 117 602 -13 -109 611 135 -505 696 439 -395 353 468 -152 -15 510 -15 72 730 168 -214
3605 -214 595 267 -96 705 357 -196 506 592 -343 103 870 -104 21 730 59 -36 256 237 -235 395 489
3626D89o19L46R7m27N2N10m07k41O20l01j80N33K1o80K96L33p25K17M05n58J25
3647i4O06p53J45N71o28l90Q70m93k05J60N14n80L53K87p30L60K52n09m23O08
3667g9n1o50P64j50m27J23O33k84n88O88n72rM31l18j75O92j15n95R05j40o02
3688e19P7O27m24k17P60o19n30J079l56m35P94l97j79J44J58l92L30M30o85O3
3708b91M09n7k9K50j05k87Q8J03l48L73L36p35M08J41l83L91m6l17J56K7J98n03
3730b21M83j3m17J46P22n77r3O48p31K0M51N0n13M20l91l62N13N05l82k17M18
3751D59k41%l3l7k04P8J06k82M86J29o76L41K80m80k99R16o69k91Q24qp03Q56
3773E52k39o17K25L56q28L45L66m25R2J35j81R2K73j40n52P59j74q68P06N2k19
$$ plain form
3626 489 -130 216 313 -114 -62 448 41 -200 420 119 -61 472 493 -187 109 442 -283 -66 339 -219 -94
3647 -94 512 -241 -96 475 -153 -543 327 -166 -371 -211 303 -277 76 363 -367 -7 245 -264 -687 -79
3667 -79 -130 -780 -16 -166 -593 -470 163 -121 -709 -21 -593 -602 -171 -489 -664 28 -87 -682 223 83 -519
3688 -519 -442 185 -239 -456 304 -315 -845 234 -122 -557 237 -160 -339 -195 -37 -429 -99 331 -354 -291
3708 -291 118 61 32 282 177 -110 -22 81 -267 106 442 -293 115 256 -127 264 218 -99 57 84 282 -221
3730 -221 262 249 -168 -22 700 123 30 678 -53 -33 418 468 -45 375 -16 -378 135 640 258 41 459
3751 459 218 218 185 148 -56 22 128 -154 332 461 -215 126 406 -74 -373 543 -126 -417 407 399 -304 552
3773 552 313 -304 -79 277 -551 -206 160 -265 -173 -38 -219 -127 146 6 -546 213 39 -829 -123 -71 -290
3794b90P1N44p78Q4L94j53j2K66%m88J62L96n66K29N46n59j38P23m71l19O10l71
3816a20j95P01P1o65J68L30l89L6L56j52l35O10l89l0K62Q0o77L42O9k78L28K13
3838C36m13J44L20k74l18L35R1n05K55N00n61L37N9n12O71M1o19j44N98k39l96
3859b94M80k55m60N84K10k19k4L43m57K63J85m80j79M76Oo56P80l72o58P21r0
3880i6m22L08j7P0J51K69l58JK38k84k36M74j31p77P77J04k56L21L0l05n24P30
3902F7k54l31K77r8j07N12k19k85K26J31j56J19L79n03l05M54k21r3N14L91r29
3923d31K80N07q33L42M40j72k16K87k50K25j39j96q8K62j66J20J65J60p59L91
3943g1M91o42M6O18qo37M55k59m3M29L89p36o9K98l02R8M28o2l60O93m29l04J53
$$ plain form
3794 -290 -219 325 -453 -369 25 -128 -140 126 126 -362 -200 196 -370 -141 405 -154 -292 431 -40 -359 251 -120
3816 -120 -315 386 457 -208 -40 290 -99 -63 293 141 -194 416 27 -3 259 339 -338 4 73 -205 123 336
3838 336 -77 67 387 113 -205 130 221 -284 -29 471 -90 247 306 -206 465 506 -113 -257 341 102 -294
3859 -294 186 -69 -529 55 265 46 22 365 -92 171 356 -124 -303 173 179 -477 303 -69 -727 -6 -96
3880 -96 -518 -210 -227 -157 -6 263 -95 -94 144 -140 -376 98 -33 -810 -33 71 -185 136 166 -139 -663 67
3902 67 -187 -518 -241 -339 -446 66 -153 -438 -212 -81 -237 -118 261 -242 -547 -93 -314 -407 107 498 -431
3923 -431 -151 356 -477 -135 305 133 -83 204 -46 179 40 -156 -244 18 -148 -28 137 297 -462 -71
3943 -71 420 -222 -176 442 434 -203 252 -7 -50 379 768 32 -37 261 -41 57 485 423 63 756 327 23 176
3966A76R6m39M67J60q39K47P37n28l4O77n49q3K25K5k37J35q2k55K09L15m30K21
3988B14m9l32J23K48k95L5N84j29o21N71k37l37K44J52k10j91L81l92j25P97k39
4009A92m97L24q9j89M96J59r62N50K43o05O3L09m63OO27n20M5J54K49p59L12N35
4031A80p74L40N92q05j56P21m37k73P33j51m73N38J1o43L41M41o50P0P51m65P6
4052c3j28r6l35L91L99m77J42K56j98k73N69l67k25P23p26Q1K99k27j92M27K20
4073B30o08R2P63q32K04N35l56k39K89j61j03K59j54K16q1K83p33M57R9k95R3
4094d2J55l3l14N66j78j82K00R1r33P58L92k26m37M57k14Q2L13j38m12P38l58
4115B85p33Q37J13m50J79K79n28k03P19m50R0O15o42k8J79K48n86O18j25n73P6
$$ plain form
3966 176 272 -167 300 460 -379 -132 605 77 43 720 171 88 313 338 101 236 154 -101 108 423 -7 214
3988 214 165 -167 -44 204 -91 -56 528 399 -222 349 112 -225 19 171 -39 -230 151 -241 -366 431 192
4009 192 -305 19 -70 -259 237 396 -566 -16 227 -378 -315 -6 -469 -463 164 -356 -311 -157 92 -667 -355 180
4031 180 -594 -254 338 -467 -623 98 -339 -612 121 -30 -503 35 46 -597 -256 185 -465 -395 356 -109 -33
4052 -33 -161 -257 -592 -201 198 -279 -137 119 -79 -352 217 -150 -375 348 -378 -297 2 -225 -417 10 230
4073 230 -378 -286 477 -355 -151 384 28 -211 78 -83 -186 73 -81 135 54 337 -396 61 160 -135 -42
4094 -42 113 80 -234 332 154 -28 172 263 -670 88 480 254 -183 274 60 142 455 317 -95 643 285
4115 285 -448 389 502 52 231 510 -18 -221 498 48 138 753 111 83 262 510 -76 542 417 -156 -80
4136h0N19l72l81O09k39j12J75r7k02L42J53p99M35K30m15JN15k08n63P91p2o24
4158c94N49n5m35L18K36o12K82J76k93j03M74k93p07J080k97n98O62J16k10L25
4178B21n28J29j31R6j83R1J18N8k52K72L2j79N2L99m78J17K65n63QL94P7l50O52
4201C17m35j5r2K00k45N02K67o05m8O78m07j21K32r6l41K05K10l40M87K20q57
4222b84J26L50m24K60N61k81k84L12l08r5L2K23o16N92J42o14QP39m14j17K35
4243A43k74J4K95L81r88M10L84m11K2K82k15k54L09k05j78O35m16k92M21k13j37
4264b87K64K95p90J73M62l83J12J05N3l08L15J66m97N18k59o47P46K80o86J74
4284a94L63o46J17O44m59l49O63r8m09K09K46m69K45L09l16r2L64j75k20M84o3
$$ plain form
4136 -80 439 67 -314 295 56 -56 119 22 -180 162 315 -484 -49 181 -234 -233 282 74 -489 302 230 -394
4158 -394 155 100 -335 -17 219 -393 -111 65 -228 -331 143 -150 -857 223 -74 -672 -10 106 -104 221
4178 221 -307 -178 -309 -213 -396 -305 -187 -129 -381 -109 -77 -256 -204 195 -283 -166 99 -464 -456 -62 15 -335 317
4201 317 -118 -133 -225 -25 -270 232 499 -106 -154 524 117 -4 228 132 -209 -4 206 -134 353 573 -284
4222 -284 -158 192 -232 28 589 308 24 336 28 -67 -35 188 -428 164 306 -308 -300 439 25 -92 143
4243 143 -131 -117 178 559 -429 -19 365 -46 -24 258 43 -211 98 -107 -285 350 -66 -358 63 -150 -287
4264 -287 -23 272 -518 -345 117 -266 -154 -49 4 -304 11 177 -320 198 -61 -708 38 318 -368 -194
4284 -194 169 -477 -360 284 -175 -524 139 41 -368 -159 87 -382 -137 172 -144 -236 128 -47 -267 217 154
4305A54m78N25n6k66L24r5k69K18J91m37m5L90k02j4R1L8l49O39K27q19M14K60
4327D41o27K05O16n78o8l3K33j21K17l48J37OL12l61K0L28l46j27J044q21j63
4348c4K60R1m85N03l4k33J99l06K09l45N38j60k57N81n04k45N56P1o45M36J40
4369C36m64M75j2j53m16M86j17n06Q07j34n41N18o9o09J98L47p89O49K04l66K2
4390a34M67m28P6l0P3j73J94J20l37J1M51l37l85L82Pl19J27J80m66O62k00J60
4412A01l76K55n70L82L60m37LL09k67j86L74k5j98J14J42m34M11J38n03M04n5
4433e8m03L58J82o6o11P68j23m78M82j7m16K23K78l48k86P04m53l70N38j77J23
4454a50M20m18K7L1L57o91J73O58p20N79n5K5l24J77J18m35K48J03m90N08J49
$$ plain form
4305 154 -324 201 145 -121 203 108 -161 57 248 -189 -234 156 -46 -60 31 69 -280 359 586 -233 181 441
4327 441 -186 19 635 57 -11 -44 189 68 285 -63 74 80 392 31 51 379 33 -94 950 129 -34
4348 -34 226 317 -168 335 301 68 267 -39 170 -175 363 203 -54 527 23 -222 334 405 -240 196 336
4369 336 -128 347 335 182 -234 252 135 -371 436 302 -239 279 210 -399 -201 146 -643 6 210 -156 -134
4390 -134 333 -95 -19 -49 24 -149 45 165 -172 -161 290 -47 -432 -50 -43 -362 -235 -55 -521 141 -59 101
4412 101 -275 -20 -590 -208 152 -285 -282 27 -240 -426 -52 -77 -275 -161 -19 -453 -42 96 -407 -3 -58
4433 -58 -461 -103 79 13 -598 170 47 -431 51 34 -382 -159 119 -229 -515 189 -264 -634 -96 -273 -150
4454 -150 270 -148 -121 -90 267 -424 -251 407 -313 266 211 236 -88 89 207 -228 20 123 -367 141 290
4475B90k38k89M38k37k60Q20m71k44Q01m60j24K54L43o82J54J11j29p0L00P0o94
4496c17L78K2k41M58L52o91J79M92o16j42M48j35k20L88j14l34N85r7o76N47R1
4517C57l73J46N4m24K52L37m74L4R6L12n41M41k65J05K23L16o02n8M04m93J64
4538A1M29k40n18J97j1q6L67k13l78L25j65q4M30J49l91j85L58p3k35L24N1m99
4560d37M56jl05P7J08j08j41L17m10L54J99p0j91J50k71j81M20K64n14j80M49
4581a5m6j42L47j76l58M45Jk70J67M6n65M87K19k85K75R9l04l08N84m22K00J15
4603I4J61l46M04N3l83p4L76p44J78L18j3qM72m85l55N66j89k27L84M7o37M40
4625C2L21o30l4K93j51o9N23j85l06N89l64K8j46O21n64j25L63N6p12R36k83l00
$$ plain form
4475 290 52 -237 201 -36 -296 524 53 -191 610 150 26 280 623 -59 95 206 77 7 307 377 -317
4496 -317 61 83 -158 300 652 -39 140 632 16 -126 322 187 -33 355 241 -93 492 395 -281 266 357
4517 357 -16 130 184 -240 12 349 -125 -91 5 317 -224 217 -48 57 280 596 -6 -64 340 -153 11
4538 11 440 200 -318 -121 -132 -218 149 -64 -442 -117 -282 -366 64 213 -178 -363 -5 -78 -313 11 62 -437
4560 -437 19 18 -287 -210 -102 -210 -351 -34 -444 -90 109 39 -152 -2 -273 -454 -34 230 -284 -464 -15
4581 -15 -61 -203 144 -32 -390 55 56 -214 -47 -1 -566 -79 140 -145 130 229 -75 -383 201 -221 -21 94
4603 94 255 -91 313 366 -17 -91 285 -459 -281 37 24 16 488 3 -352 214 25 -202 182 229 -408 32
4625 32 353 -277 -311 -18 -169 -238 285 100 -206 383 19 47 -99 522 -42 -167 196 252 -460 476 193 -107
4647a07J81K89l98M7O28n36j41K28l05j94N67j42j35N68m45k80L81R3l49O8M0
4668E8n0j66O40l70j72N51j36k76M8K84p17K46K85n29K30M78m63K40R5l41K3L33
4690B91P6n94P74m27j67k47P50o24K97K63m64k37M16K53q79O16J30n13M77n2k35
4711i6J30L50k38l01O30l17m88N14j04l92N77J7n77K35or3Q2L3J82j5k6k90K73
4734H0pj22j63M80J99p41K46m2l31K28J79n77M24K52j06Q2Om70K25J96J19j89
4756c2M4n7o8n26J187l94n24N32k41o9R9L00o25J08M12l45m7O78n74j60K79m34
4778d57K61L02k62nJ11r5l65L94m0J27k8K40j83l26M48k94j66N54k70m31L96K29
4800A40k92M66K26n81K08J1P1m57M11m21j18N04j58l23M58J90k97m63M43Rk6L83
$$ plain form
4647 -107 74 363 -35 12 640 104 -37 191 -114 -308 259 117 -18 550 105 -175 206 299 -50 18 58
4668 58 8 -158 482 112 -60 491 355 79 127 411 -306 -60 225 -304 -74 404 -59 181 276 -65 -42 291
4690 291 367 -227 547 120 -47 -294 456 -168 129 392 -72 -309 107 360 -519 97 227 -286 191 139 -96
4711 -96 34 384 146 -155 475 158 -330 184 80 -312 265 282 -295 -60 -66 -159 -77 -44 138 123 97 -193 80
4734 80 73 -49 -212 268 467 -274 -28 -70 -401 -173 6 -571 -147 105 -1 81 87 -383 -158 38 157 -32
4756 -32 12 -45 -113 -639 548 154 -370 162 -79 -148 -49 251 -374 -266 146 -199 -246 432 -142 -302 -23 -457
4778 -457 -196 106 -156 -161 -50 -145 -510 -116 -156 -29 -57 183 0 -326 122 -172 -338 216 -54 -485 -89 140
4800 140 -152 314 540 -41 167 178 249 -208 203 -218 -336 168 10 -313 145 335 38 -425 18 27 1 384
4822C84l08K7J88l64k44K50N10n31K47J79m25n0J14K1J43K75k73l26M93k34r3
4843a7M02O8n84j35O01m48k1M75k3k18J58k54j71N50j37j98J11P7n49K83L63l14
4865A9r5K81m36R3L55j11k80K04j6Q0L02j65j61L6J6J42n00M12p1l83K51J12l07
4888b22N26l35L3J20K5j49j21K83j48k56L32J49m03M21k2o52M26Ll35K09L21j93
4910A2k65L14r7m19N93Q4k44l18N05n29J10O3J58n71O86mm89L84K45l48l6K00
4932C4k64j16J40l18K36N43k49k77K65J4k62K28k62k25K84O31q70K17L59k11j25
4953b28O56l37l10K09mk82L17J49o6J7L76q04Q7M66j10m93K97M36p38L99K44l02
4975b1K62j87j26L74m9m91m8O51k95N2R1J1l20K65k27R5N57m91j26j31L70k44
$$ plain form
4822 384 76 103 291 -73 -317 -67 443 -88 159 338 -87 -137 -23 -2 141 416 143 -183 310 76 -17
4843 -17 385 453 -131 -266 335 -113 -134 341 318 100 258 4 -167 383 246 48 159 236 -313 -30 333 19
4865 19 -76 205 -231 -138 217 106 -174 30 14 94 396 231 70 106 122 264 -236 176 105 -278 -27 85 -222
4888 -222 304 -31 2 122 147 -2 -123 160 12 -244 88 237 -166 255 233 -419 7 10 -325 -116 205 12
4910 12 -253 61 -36 -455 138 222 -22 -340 165 -364 -254 -191 -33 -604 82 78 -411 -27 218 -130 -166 34
4932 34 -230 -346 -206 -524 -288 255 6 -271 -6 8 -254 -26 -288 -513 -229 402 -468 -251 108 -103 -228
4953 -228 428 91 -219 -10 -14 -296 21 170 104 121 497 -307 -220 246 136 -357 -60 376 -362 37 281 -21
4975 -21 241 54 -72 302 253 -238 -286 365 70 122 213 224 -96 169 -58 37 594 103 -23 -154 216 -28
4997b8K6K69n49K67J64l0o8jK55l39j80M15l45L70l53J11n4K06N0n15L57j4l40
5020c26M14M76j269Q23K37o21K77j1J94j80k1j14j84O06N8o40L77j57m6L31k67
5041d3O0p1K40n12O9J76j7k39L56J68n79L50J21M5l12N2r4n6N33j43m13L18k00
5064a91O5k6L03l46q4M85j35k10J17j8l42N58Kl86J47J82m63M17Q0l21J01N6r7
5087a06j50M96l83K3K93n9l22L35j21k7M08l40l45K17P8P6j13J66l1p7Q2J33j57
5110G6P2K22m90rK63j92k17L52J01m18L23J2l48L25J29l63N19j56k58J5O8j32
5132a06o8K79R6k41nm1j50K69N3l15K93K64k30k81M64n5n26N28n3m54L66l24j3
5155b50L76q1M7k49M80n68L08J8l5J85j5j29m08O30j21k88L45J95q87N58P3k05
$$ plain form
4997 -28 -2 267 -282 -15 149 119 51 50 305 -34 -214 201 -144 226 -127 -16 -70 136 186 -329 28 14 -326
5020 -326 88 564 -705 118 355 -266 11 0 194 14 -7 -121 -305 301 359 -281 96 -61 -107 224 -43
5041 -43 17 -54 186 -326 -257 -81 -98 -337 19 187 -392 -42 79 124 -188 -136 -230 -286 247 104 -309 9 -191
5064 -191 -126 -152 151 -195 -279 206 71 -139 -22 -40 -382 176 178 -208 -61 121 -342 75 155 -166 -65 -9 -106
5087 -106 -256 240 -143 -120 173 114 -208 127 6 -21 387 47 -298 -81 -3 73 -40 126 95 18 100 233 76
5110 76 148 370 -120 -129 134 -58 -275 77 178 -240 83 95 -253 72 201 -162 357 201 -57 -42 26 -106
5132 -106 -174 105 201 -40 -45 -86 -236 33 86 -229 64 328 98 -183 281 226 -300 228 175 -279 87 -237 -250
5155 -250 126 45 92 -157 323 -245 63 81 46 231 216 87 -321 309 188 -100 245 440 -447 111 184 -21
5177b1k38K75p3o43J107j41k54K98K8o17M60R0j87q0j87L72k94L44q1l74J23M22
5199C29m51J21N77n49l15N64m62QM78l26k09L57J59k57J68mQ7q4j32J39k61J52
5221H9M0k52K62J85n09M15J20o54L19l1k84J92L38k40j44K12jm46N27j66k56J59
5243a25rN5m0L97n04J48J62k97J54J48j44l96L21K53k60k29K70r9P3J45K8j39
5265h8O1J01k58M38k89k60M40j43m85P00N9m24J14L55o61J82K65L7m65J78J56
5286A3l13J71K63j07P1K13j67k86L45Qp07N45J98m26M42L36q69L05K13n26K42
5307c6N21l10j89L93k72l51N64n03K36K31l5k79Q5L83o45n4K87L47m84L87O4k34
5329A06R8k00J15M9J57j74P8K60k77P3P7o33O9M37r0j35N9k19J46J9J31Kk22p9
$$ plain form
5177 -21 -259 16 -57 -700 407 266 12 310 338 -279 181 271 84 4 -183 189 -105 239 158 -216 -93 329
5199 329 -122 -1 576 27 -288 276 -186 -178 300 -26 -235 122 281 24 192 188 275 191 59 198 -63 89
5221 89 129 -123 139 324 -185 230 350 -304 15 -16 -300 -108 230 -10 -154 58 57 -389 138 -28 -284 -125
5243 -125 -134 -79 -119 278 -226 -78 84 -213 -59 89 -55 -451 -130 123 -137 -366 -96 -195 -122 23 51 -88
5265 -88 -27 74 -184 254 -35 -295 145 2 -483 217 276 -148 -34 321 -340 -158 107 144 -321 -143 13
5286 13 -300 -129 134 27 98 311 144 -142 203 211 -496 49 247 -179 263 599 -270 35 248 -278 -36
5307 -36 485 175 -14 379 107 -244 320 -183 53 284 249 -30 55 438 -207 -261 26 373 -111 276 340 106
5329 106 204 4 119 168 325 151 229 489 212 285 362 -271 -202 235 145 10 69 -150 -4 15 146 148 -74 -153
5353a53L04m91O72m32J6L17J02n21L16J06l61k9%K73j60p5j6J05K26k8j74p1K98
5376B24m41L48j19o22O99K16m02k86K90Q3J10l08L31k07K32j85m17J02K50L8j2
5397g6L35o14J54M57j92k06N4K63k43k49K08l07L13M09m00l9K40j84j49L14j75
5418h7j00J36K32j97L4ql7j5K89Rp01N70l0m66M97L15q26N07k39J76r5L58j95
5441A27O4l6j71m0L79l00j22M51J05n60K98P4l20L99K6m29L7L68m36L11j38o3
5463B4N4J9R3P5j3j23l93P3M38m09o4M50L4l70K39j16k59M33q2l1j67M70o72L60
5487F3J77J58m33K00k01r4K75O1k96N75l71j92j14K44j74J37L66m17Q2J72j3n97
5509c92M18O1k08J56J71k69K11q5J3k43K85p9j50K36j10k53K26J31l39j5M53o07
$$ plain form
5353 -153 151 -340 332 -100 -84 233 335 -186 130 236 -125 -154 -154 119 -41 -116 -132 -27 199 171 -3 -74 224
5376 224 -217 131 12 -610 89 305 -97 -383 -93 -10 100 -208 123 -84 148 -37 -454 -352 -102 -64 -76
5397 -76 259 -355 -201 256 64 -142 -88 175 -68 -317 -109 -416 -103 306 -94 -133 107 -77 -226 88 -87
5418 -87 -187 -51 181 -16 18 10 -27 -42 247 256 -445 125 95 -371 126 441 -385 122 -117 59 -36 322 127
5441 127 191 155 -16 -56 323 23 -99 352 457 -103 195 269 -51 348 374 -55 -18 350 -86 225 87 24
5463 24 78 97 190 265 252 129 -264 -191 247 -162 -226 224 258 -112 127 11 -248 185 103 72 -95 375 -297 63
5487 63 240 398 -35 165 -36 -130 145 206 -90 485 114 -78 -192 52 -122 15 381 -36 46 218 205 -392
5509 -392 26 87 -121 35 206 -63 148 63 76 -167 118 39 -111 125 15 -238 -12 119 -220 -235 218 -389
5531c89L83L84k86n70N15N6l44P7J27k85L70K25l74j98M90j56o8K10l51L3N6J81
5553H6k74L12J49j54M4L8j10k66L39N8n82K26K59k98l3M96l58j95J86o1lJ52o3
5576e2j72M28k46k12J30P9l33M17J00n57L23K31m45K19M03n07J60L06l20J55J03
5597B10l9m38M00L06n79M63k43k02R2L53j69k62L27j29j68M55k75k00P6M62n23
5618h3J41J19m07L01L53k14l01L72k62l20M15J10j37k10L28m99J85L77nn52M10
5639A21q5p6J04n2r7J38Q0j91k97M79j01j19J98j51o5K6L17m51Q8L21l99K24R6
5662A08j74j55J0L80k85K08N2k93M05k7m20J17N27m99m3M21j49q9j94O3n1L92
5684C04K6o77L50j12q6K65J84l41R4J47m20j3M63j43R5k26L3L93l39K74l22k28
$$ plain form
5531 -389 -6 378 92 -478 37 93 -251 -174 -47 -332 38 263 -111 -309 181 25 -43 167 -184 -151 -95 86
5553 86 -188 124 273 119 163 201 91 -175 164 222 -360 -134 125 -173 -206 290 -68 -263 -77 -138 -141 11 -52
5576 -52 -224 204 -42 -254 -124 -45 -378 39 139 -418 -95 136 -309 -90 313 -194 -34 272 -48 107 210
5597 210 171 -267 133 439 -140 323 80 -122 -30 323 154 -108 219 90 -78 377 102 -98 -22 440 -83
5618 -83 58 177 -230 71 424 210 -91 281 19 -301 114 224 87 -123 205 -294 -109 268 263 -289 121
5639 121 36 -40 64 12 -85 53 133 -58 -355 124 23 -96 102 -49 -114 -88 229 -222 -134 187 -212 12 108
5662 108 -66 -221 -211 169 -116 92 144 -149 256 229 -191 -74 453 -46 -89 332 183 94 -100 -37 -88 304
5684 304 330 -347 3 -109 -195 70 254 -87 7 154 -266 -279 184 41 136 -90 -57 336 -3 271 -51 -279
5706b79K27j33J6M12j9o16M98l92R1N96m5n79K35J11m7k04L80l10j97J96m7L7
5728f9K49J65o60O57l42j34J77M4j33J11K7j43mJ79K9n06N71O8n15l5O69m18j33
5751a46L66j43l32N01j00k37J18j0k17J03L05jm50M25m85K62K67l29J25j4J22
5772A30m92K95k9j02K74K46l46J0J36l86K04L01l59j59N78k8l04R0L13k49l42
5793b19M33k82r1M17m92Q1J8O1P5k8J16l18K15J45k38J13L10l41Lj18n5R3N62
5816D60n09j39J45K95k08J39K96k99n89P98l15N6j07q0j1r8L34j73m7Q0pj76L20
5839A65r5j82L76l12J54pl35J03J28L2K2K99k44l41J62M33o35L06J38%j87o2K23
5862A41j98j36N78n16K5p1r7M70n1P7p47P85l21j19K11P0k26J06J08Q5k94L04
$$ plain form
5706 -279 -52 -185 -169 243 224 -392 106 -286 -195 401 356 -223 12 123 76 -128 252 -58 -255 -59 -106 -69
5728 -69 180 345 -315 342 0 -134 43 87 -46 65 92 -51 -55 124 153 -353 218 286 -229 -264 405 -13 -146
5751 -146 220 77 -255 246 146 -91 27 17 -200 -97 208 207 -243 182 -303 -41 226 -103 22 8 130
5772 130 -362 -67 -96 -198 76 322 -24 -14 122 -264 -60 241 -118 -277 301 273 -31 59 372 123 -219
5793 -219 214 -68 -159 258 -234 -153 -135 -74 1 -27 89 -229 -14 131 -107 6 316 -25 -22 -140 -195 -102 460
5816 460 -49 -188 -43 252 44 183 479 180 -409 389 74 130 23 -57 -68 -166 168 -5 -52 28 21 -155 165
5839 165 70 -112 264 -48 106 99 -236 -133 -5 27 49 348 104 -237 -75 358 -277 29 167 167 -20 -82 141
5862 141 -57 -193 385 -131 -106 -177 -274 196 145 222 -525 260 -61 -180 31 101 -125 -19 89 174 -120 184
5884A84K54o63N21k53j83R8q1j58L48j79J79K21N4n73K14J22m81J29M33m25J45
5905i4J59m2k49M67m80R6l04N05J48j39j0j27L5P0N3k97KN10m40M1J95m03J95
5928a09J6K05l60L87m2k66L71m82p3O39j62l07J84J39l70Q6Pj2j7M49N0m72K6
5951a13M68m94P0N19n39J32J52o0k60K73J23k18J92N3l34J20R2m33L77N8j64K3
5973C7J90k77LM17k65n9L44l8l04J60Q7m70K55L60o57K65rR9j88K43k38l12O37
5996B80k95l48O76m1l81L44k17j94K26j20J25l0K1k04K3m7J79k45J80K33k13j40
6018a88j12K35j3J72r8j58K56j99j50K58O8Pk60J69No2J18l37K03N1q2j17M28
6041A94k64m6LK27m9l24M08m15K54L93j34m35K99J71k35k02q2j43J97M19k45j40
$$ plain form
5884 184 438 -225 296 43 -140 -42 -123 -281 67 -112 67 288 342 -231 -17 105 -376 -247 186 -239 -94
5905 -94 65 23 -226 241 -239 -143 -447 58 206 67 57 -70 -35 35 88 -209 -207 303 -137 -96 99 -304 -109
5928 -109 -93 112 -248 139 97 -169 202 -280 -353 286 124 -183 1 140 -230 -144 -137 -149 -166 283 333 -139 -113
5951 -113 355 -139 -69 450 -89 43 195 135 -125 148 271 53 245 298 -36 84 176 -257 120 178 14 37
5973 37 227 -50 -47 370 105 46 390 352 48 208 295 -175 80 440 -217 48 39 138 -50 193 -45 -357 280
5996 280 -15 -363 313 272 -109 235 18 -176 50 -70 55 25 46 -158 -135 -182 -3 -248 -68 165 -48 -188
6018 -188 -300 -65 -78 94 -4 -162 94 -105 -255 3 71 78 -182 -13 -8 -70 48 -289 -86 -35 -117 -234 194
6041 194 -70 -116 -113 114 65 -259 149 -266 -12 381 247 -188 111 282 47 -155 -237 -380 -183 236 -9 -149
6063a49K58o7J66l71M05p20O60J65m54K8M63m12k10M21k4K0J82j57O4l68n8M5
6085a13K62j30l2J98r7j67J02J32k84K8K39M9o17N92M2m91J25N22n94K17K25k34
6107b6J5K26j04j90K00k76j24J51M73l56J23k23p8J00L55n1L9Km44k9L23K39m01
6130e6l31L31k41J06L24k16r3L34k04j88O6J7l6L28K0k65L80l37m32M03K03l97
6152b84L11J48j37o8Q5O2k35P3k6J0J55P9l39J08J99o1k76n4K02kk20L59j39R3
6176D3k66M37k18M2O7Q2j24l74K80J11J37n61M00K07l36j30J68N9o3L93l18j73
6198a37L66l06q1J4L00j23q7L24l90k25N54l34J25Rj78L5K16O9q5M8L5r6K6J46
6222B25m32J2M10l30J68J80n12K83K5n2j38J13O8J10k05K86n23M31l1N7l88Oj9
$$ plain form
6063 -149 109 42 208 -163 242 -478 182 347 -107 -79 384 -28 -238 183 159 179 361 204 268 -100 -158 -113
6085 -113 149 19 -13 185 88 -79 23 155 -129 -101 138 187 -430 162 204 -287 -162 360 -234 -17 208 -26
6107 -26 -11 215 111 -79 121 -155 -279 -128 345 -11 112 -111 -189 -89 266 215 254 256 -188 -217 106 345 -56
6130 -56 -387 -56 -297 -191 133 -83 -176 158 -46 -234 -168 -151 -187 141 161 -104 276 -61 -493 -90 113 -284
6152 -284 27 175 38 -30 55 117 -118 -45 -71 -61 94 173 -166 -58 141 80 -196 -250 -48 -50 -270 89 -50 43
6176 43 -223 214 -4 38 105 187 63 -311 -31 80 217 -344 56 263 -73 -203 -35 24 -39 354 36 -137
6198 -137 229 -77 -158 -144 156 33 -54 270 -120 -345 209 -125 0 9 -169 -134 82 151 66 114 149 53 79 225
6222 225 -207 -195 215 -115 53 233 -279 4 29 -23 -161 -48 20 130 -75 211 -312 119 88 145 -243 -237 -256
6245b56J19J57k05J89P1j3j33K44J38k80j10N1J34l68O08m66j24k2K56k14L50
6266A26J71l65J97M67o18k39M19k2l38L04J60k46J1M6j79j21J75k88J43K39l01
6287b59j53M60j24J50j63M64n41J29K68k59j23L95m90L28J27k57K2K39l40L57
6307B30q4k07O4L22j36Lm6P3q8k72J07J54j60K70Q5n32L12J60m57L01L14l85j0
6330A8l0J28q4j09K02m64J62L91k06n1J21k77J67K41m21R9J91j81m9N95o46m3
6352b46K21k8J22N9j19k75J36J67j45jJ50R6l15P1P1l31J6N42l93mr5K75k25M28
6376A77o6k74J83J60l73J84j30J16K30K03o92K20J10j32R5N5j99R1J84j35n5q0
6398a28k0R5m97N79J99m26L8o4j87L52J7j1K28j84Q9P9j6k61K66j21j55J67K13
$$ plain form
6245 -256 -137 20 -185 4 75 62 -71 173 311 31 -79 -28 106 -262 346 -120 -244 -266 -10 -224 126
6266 126 297 -68 129 596 -22 -261 158 136 -202 102 262 16 27 73 -106 -227 -52 -340 -197 42 -259
6287 -259 -412 48 -76 74 -89 375 -166 -37 231 -28 -151 244 -246 82 209 -48 -26 213 -127 230
6307 230 146 -61 3 325 189 192 146 219 131 -141 -34 120 -40 230 315 -217 95 255 -202 99 413 28 18
6330 18 -12 116 32 -77 125 -339 -177 214 8 -43 78 -199 -32 209 -212 -113 78 -103 -152 443 -203 -246
6352 -246 -25 -53 69 128 9 -266 -130 37 -108 -109 41 137 -178 -107 -36 -367 -351 191 -202 -206 -301 -26 -251 177
6376 177 111 -163 20 180 -193 -9 -139 -23 207 410 -282 -62 48 -84 11 66 -133 -42 142 7 -48 -128
6398 -128 -148 -53 -550 29 228 -198 -160 -224 -411 -59 -42 -53 175 -9 80 159 143 -118 148 27 -128 39 252
6421B52l1k49R2KJ00p6k18J10J56J41k45k55J99J40k64K76k5N5j97J02j30J33
6443F8M4j34mK21m53M9L53N5l02L01J34p77K83K01K01l69L87k93j12L08q4j34
6465e7N35l90k16L43j7m88L3O87n61N05j78k4k50K52l29r1M09k86n5L27k97L8
6487a10j19K88l9k66L26j3m45O43k18nj06J01l01J74r8n1K45j71p0j0M20l15J42
6510Bj81O1j06J08Oj64p8N19k09j88O10n21K4l8n1K69j24j0R2m0O2l80K60K56
6534A79j9m13M49j25k44K26J42l74J13M2j24J54J11j84m4J50j18q0J46J85p0j31
6556b9K10r3l6P3M5L1K8j19l53O30l65p4m4M34k01j20k26K90N1J24j42j81L3O9
6580C5j38K0K88K4k7l5k79M10k24q9M4J03n95L04K37O1j76M26j90n06M12N9j01
$$ plain form
6421 252 221 -28 64 66 166 90 -128 -18 138 279 34 -221 -22 118 -146 130 105 160 -37 65 -65 68
6443 68 112 -22 -26 195 -258 -209 144 199 -103 198 332 -445 -162 39 240 -129 258 -35 -147 161 77 -57
6465 -57 478 88 -128 215 198 -290 -257 430 -131 374 196 172 -78 174 -155 -246 163 -123 -178 149 -148 -110
6487 -110 -229 59 20 -246 80 67 -378 265 47 42 -64 37 -264 -90 -188 -239 6 -165 -235 -245 175 -140 2
6510 2 -179 -118 -224 -116 -110 -274 -352 167 -42 -230 380 -141 -117 -155 -206 63 -61 -71 21 -19 43 -337 -77 179
6534 179 160 -253 196 71 -173 53 195 -179 -66 -24 -148 6 117 -67 -111 39 -79 -159 -13 172 102 -29
6556 -29 181 88 52 125 170 201 229 110 -243 387 22 -52 -96 338 137 17 -209 81 132 256 114 -67 -34 35
6580 35 -103 -83 205 229 202 167 -112 298 74 -15 29 132 -463 -159 78 139 -37 389 199 -307 105 164 63
6603F3l2J24j90L17k91K21r9m5j73J10M3L7m87P00p7m75L09l63L85j70l7k7k48
6626d05J32M02l63J61L82n62P1L24j86j62J90k13j05L55j7j99P3J18r9j28N64
6647C33n67J87J71l08J92J57k82m8p7n4M28j82N62q60M53j83j4J63m3j08J45J27
6669A92k1oP5j50j60N7m1j5k88O47r3l43N9N5K11p2K79l85K33o2j90r1K74n8k38
6694a31n1J05J55r1N0J0J29j61l16O19q4m57L24p8j78L03j58P7k01L31k83Mpj82
6718b71L77L1j5j46j31L22k74k3M45l04K52k4k80k65M5L68j08K21l07n7O5L07
6740B28n43K89K8j58K6K57k81j28N34m36n1M80k46M2l1J68j63RL1L3m22L02J1
6763b1k07R4M7l0O0K04p15O26j4L0j01K0K99o05J68K65j83k7n1r1l4K35k52L31
$$ plain form
6603 63 31 155 -35 282 -9 212 113 68 -105 5 48 85 -402 298 221 -254 55 -308 77 -93 -130 -157 -405
6626 -405 -273 129 -234 -73 309 -253 -182 142 -44 -206 -16 -229 -334 21 4 -195 -122 -4 -103 -231 333
6647 333 -234 -47 124 -184 8 165 -117 -165 -242 -296 132 -50 512 -348 105 -78 -92 71 28 -80 65 192
6669 192 171 165 240 90 -70 -13 -54 -69 -357 290 197 -146 -87 -32 179 107 386 1 234 172 -18 -109 165 107 -131
6694 -131 -182 -77 78 -13 37 47 176 15 -301 318 234 -223 101 23 -155 148 -10 67 -134 197 -86 -82 -89 -271
6718 -271 106 137 122 -24 -155 167 -107 -130 315 11 263 239 -41 -306 -261 107 -1 220 -87 -144 -79 228
6740 228 -315 -26 2 -156 -130 127 -154 -282 252 -184 -235 245 -1 41 10 178 15 24 55 88 -334 -32 -21
6763 -21 -228 -134 -87 -117 -57 147 -568 58 44 74 -27 -7 292 -313 -145 120 -63 -90 -141 -232 -266 -31 -283 48
6787D8n8j08q4K84j96j07N1M3q0K83o4k34K43j16l26L44M08m47p2L20k97J85J91
6810B11l47J25n82O80l38L02K10j49l87L18J36k91L42j37mk43K02j60j03L19k2
6831H2R5J71l52K11j32j7j02J54m60L48N7o4j16J47j5Q3k77M22j21j96Q0l41K14
6854a29L20k93J46j99K93k42J49Q2j11j23j1J14j16L16j71N2l80M49m04L73K0
6875A35j11k92L33k02J7M13l54K31K9l48r5L13j12J10Q2K5j08m7r5J78m38L57
6897B1J3m5j87K78l46J55j30Q6J51J74k27q7K84j9p2k3pk41R7K57l23N8Q0j47
6921b00k47N53k25j12M02K9l36m9K91r3j30K74q0l65K90L58m01J34j61J02L84
6942D18p03L97n6rK5M1k40j17M15j61J05j37qJJ55k12K56j87L4J31k11j4L42k34
$$ plain form
6787 48 -10 -118 -202 82 -114 -221 -170 -127 -207 76 12 -222 21 -95 -421 -77 331 -116 -188 132 -165 20 211
6810 211 -136 -11 -593 87 -251 51 261 112 -275 43 179 -112 230 93 89 -154 48 -112 -215 104 82
6831 82 177 348 -4 207 75 58 -44 110 -350 -2 55 -9 -125 22 7 90 -187 235 114 -82 -2 -343 -129
6854 -129 191 -102 44 -155 138 -104 45 127 16 -107 -118 -4 -120 196 25 77 -303 146 -258 115 135
6875 135 24 -268 65 -137 -120 293 -61 170 199 -149 -244 69 -43 67 149 174 66 19 -76 102 -336 21
6897 21 34 -11 -198 80 -266 -111 -241 -155 -4 170 -57 -144 140 121 49 26 19 -222 -125 132 -191 -133 -53 -200
6921 -200 -447 106 -119 -231 171 200 -136 -185 106 13 -117 157 77 -288 2 360 -41 93 -68 34 418
6942 418 -285 112 56 47 72 113 -127 -244 171 10 115 -22 -30 -29 126 -86 170 -17 17 148 -63 -77 265 31
6966C1m19O12Jm49J65P5KJ87k62l34K72L67l36R0M6k22k52M55K07l48J84j77j35
6989b40J60q8P3J71r6k41J66K11j13J03J12Jl23L43l91OM8M80n22K05m3l35j16
7012d29L00K30l81J46J30j30K38k87O7O8P5J41m52J26L22k23M0j80M31l87J09
7033d6j56K21K1Oj15M99m69J01n0R2m56O06m3k22j9Q9l27K73L34k83j13N98m83
7056E8J37l8k73k8L37k56o1J65J51n14K68M30m32QL59k86k90K64j0j38Q7J10j57
7079a09K56J75k03L9j61J6k61L69Km01M20p6n8l37L34l32J29K05L10m13J99j29
7101b6p6K19j22O1J17k42J89N4n5k50q3M32k15k50J30L3k32K16K12j00K7p9o5
7124a05K38qm74mO20m49J36j09K96l82M39j06l05K30L03p72J74N31m01k7K72j63
$$ plain form
6966 31 -388 224 225 -224 -59 16 18 205 -57 -391 -119 248 -88 2 48 -174 -426 29 236 -112 72 -105 -240
6989 -240 -80 -168 -95 76 -20 -261 -95 116 3 106 218 219 -104 239 -152 -146 -98 382 -140 65 22 -313 -429
7012 -429 -129 101 -280 -134 -4 -134 104 -183 -116 -48 27 168 -284 -158 164 -59 -19 -199 232 -155 -46
7033 -46 -202 19 40 46 -69 430 -39 62 12 104 -352 254 211 -11 -30 59 -268 5 339 56 -57 541 58
7056 58 195 157 -116 -144 193 -63 -124 41 192 -322 -54 376 -56 -48 311 25 -265 -1 -11 -149 -62 48 -109
7079 -109 147 322 119 158 -3 13 -248 121 123 -278 142 66 8 -329 5 -327 -198 7 317 -96 103 -26
7101 -26 -102 117 -5 56 173 -69 120 174 119 -131 -214 218 3 -247 -117 -84 -316 -100 112 12 39 -40 -105
7124 -105 133 125 -349 -353 267 -182 -46 -155 141 -241 198 92 -213 17 320 -452 -278 253 -148 -175 97 -66
7146f6j63L5J60k35M30n14L49p3K08l14m8K36m0m07M09K4j15N1J68p17O36j48
7168a34o8M3J17l14L40J37Pk96l4M26K7J3l14j42L07J46m47J96J28j67j1K60m01
7191a81L86n7N4l44L55%m26k8L18m45L47M13q08L69K41J09n06P6J90p5O5K25k71
7214Gp8L78k61J37j41ok23N15j55l05J05j57L34j99j89K22K44P6k42k3k6r0O1
7237a6o6K82k82J1K6j5lJ32m3r6O5l6j54L68J38p30N35r3k9J91Jj92N0j98j96
7262c50L82J19L5k56K41r9j13M36l05j9k22N6K26j9R0l27rR5J87m26K04J90k75
7285a59K24J28k65j2J30J28M9k77J10p1RR8k71k5kK90j05R3R0l82O61n06k5J81
7309I1j3J29n50M93l94J68Q5k45M86k03j22K7K69m20L35k65r9QK18j05k8Ro8J69
$$ plain form
7146 -66 -229 -194 -34 -269 161 -353 -4 -77 131 -183 -231 5 -35 -442 -33 -9 -124 -73 95 -622 14 -134
7168 -134 -202 -159 -42 -356 -16 121 128 -168 -202 224 251 264 -50 -192 115 261 -186 10 138 -29 -40 220 -181
7191 -181 205 148 202 -142 213 213 -213 -241 77 -368 -21 392 -416 -47 194 303 -203 -127 63 -12 53 278 7
7214 7 -71 307 46 183 42 36 -187 328 173 -132 -27 -184 150 -49 -238 -16 228 304 62 39 13 -77 -16
7237 -16 -82 200 -82 -71 -45 -60 -63 69 26 -70 -5 -41 -195 173 311 -419 116 23 -6 185 186 -6 44 -154 -350
7262 -350 32 151 186 -70 171 72 -41 395 90 71 -151 -95 131 112 202 -125 -134 -39 148 -278 -74 116 -159
7285 -159 65 193 -72 -84 46 174 223 -54 56 -15 -6 92 -179 -204 -206 84 -21 72 162 -220 441 -65 -90 91
7309 91 78 207 -343 150 -244 -76 9 -236 250 47 -75 -48 221 -199 136 -129 -228 -220 -2 -107 -135 -126 -194 -25
7333b5P4J16m87K31O41p34oJ98LK65j78M1l38L0M8L25m59K36m4p4J41J7k10K71
7357H2J33k4k44J9j14M0M03j14j47L95l59J11j03l06L54l67K20P7j95J77k76J46
7379i2K01J72k66K93k10j70J81l34J60J42N8j96L08K3m00J82K8K07k28j5J4j80
7401a22L03l56MK20J88k55k15L15K14n76N46k33j26J10J02r5k4r6J5K11o7m10
7423c47J02J65L57m49K65J84m05J52j7j39j16l2M38K24k79k65O9L05k95J12K15
7444B44l04J76L4K6l26J29M3o7Q9l1pL15j74j01l21N75l95k94K44O2R8j60J48
7467Ck21L01J44m52M64k97L07l60J98k54J69j42Q8q4j40M57l86N57l76j75j7R1
7489a25J15l29M08J17k52J98k29Nk39N01Pm24L76J47k93J69J98n02P3J04q6J65
$$ plain form
7333 -25 49 165 -322 -91 550 -184 -190 8 11 276 98 139 -199 -169 -121 204 -255 -19 -63 -137 4 21 -189 82
7357 82 215 191 -53 -34 -148 -108 295 181 34 429 70 181 78 -228 126 -241 -21 56 -139 38 -238 -92
7379 -92 109 281 15 308 98 -72 109 -225 -65 77 135 -61 247 270 -130 52 80 287 59 44 58 -122
7401 -122 181 -175 -171 49 237 -18 -233 82 296 -280 266 33 -93 17 119 24 0 -96 -81 130 63 -347
7423 -347 -245 -80 277 -172 93 277 -128 24 7 -132 -248 -280 158 382 103 -162 -93 212 -83 29 244
7444 244 -60 116 150 176 -150 -21 22 -45 44 13 6 321 147 46 -275 300 -95 -389 -145 -83 15 -145 3
7467 3 -218 83 227 -225 239 -58 249 -111 87 -167 2 -140 -52 -136 -276 181 -205 352 -24 -199 -216 -125
7489 -125 -10 -339 69 186 -66 132 -97 -92 -331 170 177 -247 129 276 -17 152 350 -152 -79 25 -61 104
7511A04Kl56n2P66k59l64J11K15Q4l19K16l33L39j9n19N78o3k74J05L24j49p3
7533F4l23J57j19L67m57O71k36p7k62M15R4k95J65n4l21K2M71j92l23J94m2K71
7555A90k41J30K20j91K14m77j88M19p6K5k36N37p20K70L24k5p9J19l10r7L32K06
7577C46m04kK2K0K38l87K26j54J71j99L20k16j97k7K82m0j59M5nO6K44K4j07k13
7601a06J43q4k48M30J85m12K18L5m38L06K2j94K74j27k5j02J40L2J58m8Nl12J83
7624C5j51p6J68k7j13j9P12o41K82m73J24k43O17j84l4j42L45k30k11L18r5K16
7646A78J7k98o2M83k64l1l5O9k13K29M1p3j38K72J83j67K3k18J07j42M4j73R9
7669f9N06p76M52O3j10q0K1J24k86K48m0l67L15L8l13K80R1j03k3K66l28J29L6
$$ plain form
7511 104 106 -250 -302 464 205 -159 -48 167 251 -68 148 -185 154 135 -384 194 131 -143 -38 286 137 64
7533 64 -259 -102 -221 146 -311 360 124 47 -215 200 294 -1 164 110 -211 -189 282 90 -233 -39 -81 190
7555 190 -51 79 299 108 322 -155 -343 76 0 25 -211 326 -394 -124 200 175 96 215 -95 -192 140 346
7577 346 -58 -60 -38 -18 220 -167 59 -95 76 -123 197 -19 -216 -243 39 -1 -160 -115 -120 -54 190 214 107 -106
7601 -106 37 -47 -295 135 320 -92 126 161 -277 29 51 -143 131 4 -21 -123 17 49 207 159 164 -148 35
7624 35 -116 -192 -24 -51 -164 -183 529 -112 170 -303 -179 -422 195 11 -23 -165 180 -50 -261 57 -38 178
7646 178 195 -103 -165 318 54 23 -12 57 -156 73 114 41 -97 175 358 191 214 -4 103 -39 5 -168 -69
7669 -69 437 -339 113 176 66 -14 7 131 -155 93 53 -314 1 39 -274 6 97 -6 -29 237 -91 38 74
7692G4j25N1o8j20j19M75J90m12L54l65K26L1l42K28L2J04l07m7J66j92J56l07
7714c17L29N3l43K73k76L42l9j18j63N13r5k46K04%K5m60L25J56l47K34nl35L62
7737G2q6q3kK73o47L78J07o8J21j78j11J84q0J97k15R8j70J88m3m5L8q2O7J15
7761B8j7m5j85J8J77j58l10M54N6o7J06j03k4k6K30j48n3O9l7J37l31K94l63K47
7785e1N58p09M49j60j78J60j37K9L61j12n7l97J80k85L04J18j35m16M61K16n21
7806c22P7L81l17j37O39m74K05L5k36K47j36L7k67L17O3kk44J20j31J25j48kJ20
7829e0j68J73m7MJ92n2J13k32L0n9L01l41k4J95M9r1m0j9p3K9m9K5R7k41M05j64
7855c7J98q5l42K43L0j22J19J35n40M08K41j84l52M91l4k7j78J74l99L00J52l69
$$ plain form
7692 74 -51 0 -68 -188 -307 168 358 -54 300 -65 161 192 -150 78 110 214 -93 -140 26 -166 -10 -317
7714 -317 12 65 -278 -5 -281 61 22 -96 -259 254 159 -87 117 117 142 -318 7 163 -184 50 45 -290 72
7737 72 -14 -97 -99 174 -473 -95 12 -56 65 -113 -224 -40 -120 77 -138 -40 -210 -22 -65 -110 -72 -154 -87 28
7761 28 11 -34 -219 -201 -24 -182 -492 -38 18 -49 57 -46 -70 -96 134 -14 -67 2 -35 102 -229 65 -298 -51
7785 -51 507 -202 247 87 -91 69 -68 -39 322 210 153 -244 -64 -349 -45 73 -62 -478 -17 199 -322
7806 -322 -245 136 -181 -318 321 -153 52 87 -149 98 -38 -1 -268 49 112 110 -134 -14 -145 -20 -168 -170 -50
7829 -50 -218 -45 -92 -88 104 52 165 -67 -37 -96 205 -136 -160 35 84 -7 -47 -66 -139 -110 -159 -134 -37 -278 127 -37
7855 -37 161 76 -266 -23 7 -115 4 139 -401 7 248 64 -288 203 169 142 -36 138 -261 39 191 -178
7877a78J36j91L11l01L16j84J80k09L2k62L88K35m07J50J59j11J23q0l3l31M00
7898A43j24k28K37k97K99K4k6k07K07J26j03k23Kk5K79j23j08K96ok65N9K60l63
7921a66J51l01K52K31j78K41k77J00R2j76K04k08K06l18L09j33m2n1n7L63k50
7942hJ1j24L5n0k1Q6K48m08J26K77l61J01K91K1k34J62k7J21j89K76l36J10j56
7965d9J64J21n56L91K16m16L73k74k81L78Kk38O94n11N6r7K1j24qM32m19M1J07
7988B3o0Qp5k36L99k6mm18J06M08l47J14N9J44kJ87n57Q2L97k56J20nm03k14L98
8013a58J77J47m29K43j06K61p9K34j36o8K18n44J86l0q9K4K30j87O6N6N2m22K12
8036a42K69k20L64j66k95L38j92o1K64l82L54j43K7J98k31K98J01k10k91M19l06
$$ plain form
7877 -178 -42 -233 78 -223 93 -91 89 -120 -88 -350 38 273 -134 16 175 64 187 107 74 -257 143
7898 143 19 -209 28 -269 30 54 28 -179 28 154 51 -172 -170 -195 84 -39 -147 149 143 -122 -63 197 -166
7921 -166 -15 -316 -64 167 -11 230 -47 53 145 -31 173 -35 171 -147 162 29 -13 -64 -121 242 -8
7942 -8 3 -121 -86 -136 -157 -71 177 -231 -105 172 -189 -88 203 224 -10 152 125 246 57 333 -3 107 -49
7965 -49 115 236 -320 71 287 -129 244 -30 -311 67 69 -169 525 14 70 -27 -6 -130 -138 294 -125 -84 23
7988 23 -37 -29 -104 -340 59 33 29 -389 -283 125 -222 -108 -49 95 93 280 -277 -195 202 -54 66 61 -342 -556 -158
8013 -158 19 166 -263 -20 -126 135 56 290 154 86 304 -240 -54 -84 -173 -149 81 -106 -40 16 68 -354 -142
8036 -142 127 -93 271 105 -190 148 -44 -105 159 -223 131 -12 15 213 -18 280 381 171 -120 299 -7
8057gj48J82n1J44K24m34n9M33j19l29K3K91k50O6L84l95J70j48Q2r9j07J40K8
8080B1k02K25n5K02k32J54l28L03J20l52K15q4j78K89k63P5K95O1kl79N47l34
8102I8N8K79m55n5L98l88J0j28J62j43J37J9j4K5R8j4k37N02m52Mo8Q9l7K64k17
8127f5J0R8K37j04o7k6M9j03j83K40J47l23N2k5M20l25R9Q2q5j56rL4q4J98J71
8152B82n54N28j24l54Q8j24M34j58j19m9j32M26j22j12J72j34j63J11K71K66n42
8173a09j23K69k60J96M50m13M4J01j38KM8j48J57j43o7J51k86M52
$$ plain form
8057 -7 -155 27 -24 120 344 -90 -149 284 165 -164 -141 150 -100 -34 350 -45 125 -23 59 -40 -147 -7 21
8080 21 -181 44 -11 191 -41 113 -215 88 208 -144 71 -13 -191 98 -165 -90 205 266 264 -115 432 98
8102 98 156 435 -20 -75 323 -65 -55 -183 -21 -164 -27 -8 -22 3 101 87 -150 352 -100 -96 -164 -75 -112 152 -65
8127 -65 -55 43 280 176 109 83 132 29 -154 86 233 -90 -38 -63 357 32 131 213 128 -28 -37 -3 -87 111 282
8152 282 -272 256 132 -222 -134 -258 176 18 -101 -150 -282 144 22 -90 82 -52 -215 -104 167 433 -109
8173 -109 -232 37 -223 -27 423 10 54 155 17 19 67 -81 76 -67 -134 17 -269 183
8191A83
$$ Imaginary data points
##PAGE= N=2
##DATA TABLE= (X++(I..I)), XYDATA
0@%%%%%%qJ6j6K4l2M0n4O2p2Q8j11J35j59J87k19K55k95L42l94M50n14N88o67
29c54P54q51R57j074J203j345J501j669J854k059K282k525K796l099L432l801
45a998M216m682N210n811O507p326Q299r482J0957j2856J5408j9042K4682l4731
59b0649N8170k16216j62174K05119L0378K3741q1508o0252n356N6887k3637j6207
71b11704O787K0651K4696N6623k926j8546J4792M671m6521l551L0222L3697M3841
84d7268J4729p0582m6619N0204P9203N4564K0542n9387q0047r62M0097J6260L0358
97A092L6005R944K1554K5561l2253l9450L487p189j6694K4920L8425L9008O0930
110A65340J6531p1534o7405j1906J2892M6436N2938j0486k9695J4162J1818q727
$$ plain form
0 0 0 0 0 0 0 0 -8 8 -8 16 -16 24 -30 32 -40 48 -63 72 -87 100 -119 136 -159 183 -211 239 -275 313 -354
29 -354 400 -451 506 -568 635 -710 791 -878 976 -1083 1199 -1326 1470 -1629 1803 -1998
45 -1998 2218 -2464 2746 -3065 3442 -3884 4415 -5067 5890 -6966 8442 -10600 14082 -20649
59 -20649 37521 -178695 -340869 -135750 -105372 -81631 -163139 -223391 -228747 -171860 -195497 -211704
71 -211704 -204917 -184266 -159570 -102947 -105873 -124419 -109627 -104956 -151477 -155028 -124806 -91109 -47268
84 -47268 -32539 -103121 -149740 -99536 -20333 34231 54773 -4614 -84661 -85623 -45526 -29266 1092
97 1092 37097 47041 68595 94156 61903 22453 25940 18751 2057 26977 65402 104410 165340
110 165340 181871 110337 42932 31026 43918 90354 143292 132806 103111 117273 129091 120364
122A20364J1771L539k1540M333O301k7197k207L4269M711r546L553r365M567M2846
136A66399k36o7894n1840j3053J5885O5664N8540j5765l6036j3638k9430k9664
148D8932J137m974j801L7057K0565k0044K1J2569j7016k2221k4002m2996J337
161a1436O2236L4680j7891k7913l5086j4057M2303L0994l1090l4419j2979j3632
173b8290J0384K6226o215m030K7495K356l0217j5956j3822j6033J3182R333k1866
186d7453O568M3738K0416l919k2263n6609l8365K5816L0113M594J2176N709j1499
199c0978Q679N894l0847j8335J1612l114o350J2398l64K739K9826O335l0713j1823
213e5041M432l939R288N835k7233j0234K9899J8899N726J1764j1857k5092p47
$$ plain form
122 120364 132135 135674 114134 118467 124768 97571 95364 129633 134344 124798 128351 118986 123553 166399
136 166399 166163 98269 46429 33376 49261 114925 173465 157700 121664 108026 78596 48932
148 48932 50069 45095 43294 80351 100916 80872 80893 93462 76446 54225 30223 -12773 -11436
161 -11436 50800 85480 67589 39676 4590 -9467 32836 63830 32740 -1679 -14658 -28290
173 -28290 -17906 8320 2105 -1925 25570 27926 -2291 -18247 -32069 -48102 -34920 -25587 -47453
186 -47453 -40885 2853 23269 19350 -2913 -59522 -97887 -72071 -41958 -37364 -25188 -19479 -30978
199 -30978 -22299 -16405 -47252 -65587 -53975 -57089 -63439 -51041 -51405 -48666 -18840 -12505 -43218 -55041
213 -55041 -50609 -54548 -45260 -39425 -66658 -76892 -46993 -28094 -22368 -10604 -22461 -47553 -48300
226d8300n847k2707R280L0332R334R656R745j6724p867J5041j2380l0813k020
239f3270J0901J4915L4852J4113k5121j0009J0501p434o657K339j3724j967K8897
252a1664R760j0845J0915J0786o170R06r334l0117M4K9302P506l396P030j769
266B954O628K5713m505l7189j3783N705L872J9321J4399j1845M089K5736j574
279C9521j9097q922j4617o543K1320R498j2620J0416K1987J283j95o693k9419
292E919j0326K0693L634q085R758O537K586J8078Q21k7904p704P570p359j904
306A2314P467p590N082K7871M266j6986k764o256j4414M348J753j5830O826K4217
320C0304K934R2N888j3628j3451M662j0411j8338J0248J6255K732J1295N157j6674
$$ plain form
226 -48300 -54147 -76854 -67574 -37242 -27908 -18252 -8507 -25231 -33098 -18057 -30437 -61250 -63270
239 -63270 -52369 -37454 -2602 11511 -13610 -23619 -13118 -20552 -27209 -24870 -38594 -40561 -11664
252 -11664 -1904 -12749 -1834 8952 2782 3688 -5646 -35763 -35719 -6417 1089 -2307 4723 2954
266 2954 9582 35295 30790 -6399 -20182 -14477 -10605 8716 23115 11270 15359 41095 39521
279 39521 20424 11502 -3115 -9658 11662 21160 8540 18956 40943 42226 42031 35338 5919
292 5919 -4407 16286 19920 11835 21593 28130 30716 48794 49615 21711 14007 21577 14218 12314
306 12314 19781 12191 17273 45144 49410 32424 29660 23404 8990 13338 15091 -739 6087 30304
320 30304 33238 33330 39218 25590 12139 16801 6390 -11948 -1700 14555 17287 28582 33739 17065
334A7065l666P548j5079j7311L600K78M055J9983L853j3930N560O458j4667q996
348e249l466j4097M767K1034j794q068J1376M966m756K760j2673k5814K295J5851
362a2868k172J837R860j644N947J4714j5551k7627k485K279l19J4112N462r395
376a7850J0798J7356j0091j4916m882j2060j14J8058j669j1389J2351J3362j968
389c014L398n110k0933n57J4346p768r091P855L462Q504K1304j701k1697l362
403a4364j117j1032J918O875m567J1516K2512k060j0713J157r234j0609N271k425
417a6872r188J5587J8868j172j89k11j4372l070J1068p017j0417P918K554j225
431g738J3304N950p944M199M075j6228q507N503l666K613J4432j163m232J6469
$$ plain form
334 17065 13399 20947 5868 -11443 -7843 -7565 -3510 16473 20326 6396 11956 18414 3747 -5249
348 -5249 -8715 -22812 -18045 2989 1195 -6873 4503 9469 4713 7473 -5200 -31014 -28719 -12868
362 -12868 -15040 -13203 -3343 -4987 960 15674 123 -27504 -29989 -27710 -28029 -13917 -8455 -17850
376 -17850 -7052 10304 213 -14703 -19585 -31645 -31759 -13701 -15370 -26759 -14408 -1046 -3014
389 -3014 384 -4726 -25659 -26216 -11870 -19638 -28729 -20874 -17412 -8908 12396 10695 -11002 -14364
403 -14364 -15481 -26513 -24595 -17720 -22287 -10771 11741 9681 -1032 125 -9109 -19718 -14447 -16872
417 -16872 -26060 -10473 8395 7223 7034 6823 -7549 -10619 449 -6568 -16985 -9067 -6513 -7738
431 -7738 5566 11516 3572 7771 11846 -4382 -12889 -7386 -11052 -8439 5993 4830 598 17067
445A7067O785j2771p984j1211j6216Q837K0867J721L598J1231n135q106J611j2109
459a815j2977J0516Q991o257N730Q659k097O587N804j8756j4460R118M695J306
473E044O680q384j2019J4273J7244k769j417k948j6856m884O827o839q57J9372
487A2467J0555j601L164q856j6385K884L928j3871k513J2596Q166J4454J3534
500C8522j5508k3690k373Q77q75J2103L979r076N012R084p150j133P443o507o372
515D336L259q167o850J4195Q051o821K241K623n332Q301P084j7399j6240l82n58
530a1659Q393K2618P002q096n36q664j9100k168O627k155O559J1045m499J48J2629
545A8144l664j5635o342q963n475J7713J5236o034l189n82j0098P96J1269l928
$$ plain form
445 17067 23852 11081 3097 -8114 -24330 -15493 5374 7095 10693 21924 16789 8683 10294 -1815
459 -1815 -14792 -4276 4715 -1542 4188 12847 10750 17337 23141 4385 -10075 -957 3738 5044
473 5044 11724 3340 -8679 5594 22838 20069 18652 15704 -1152 -6036 791 -6048 -6905 12467
487 12467 23022 21421 24585 15729 -656 2228 6156 -7715 -10228 2368 10534 24988 38522
500 38522 23014 -676 -3049 -2172 -3047 9056 13035 3959 8971 18055 10905 9772 17215 10708 4336
515 4336 7595 -572 -7422 6773 14824 8003 10244 12867 7535 15836 22920 5521 -10719 -11101 -11659
530 -11659 -3266 19352 26354 18258 17722 9058 -10042 -12210 -5583 -7738 -1179 9866 5367 5515 18144
545 18144 14480 -1155 -7497 -16460 -21935 -4222 11014 4980 1791 1209 -8889 -8093 3176 -752
559g52n693M341p862j2630N267Q927L693J1237K518j7747o875O416m276m409N84
574a7261q869O19K3370J4730n396o673j4935k0503J477J1378K000P851J4083l545
588a674p913R5p019n682R673pj3151Q08J0049L736J0392L947j8037j0258J0147
603a4894O098J755M022j1074j4613P741J2282M418J0748O236j3395r651j640r075
617b1042J310J6652M600k907P830L253k798N861m645k1107p125R684Q157J5469
631A3192J6140p968j3914p69m386m304J0430N704o498K089L020n173N436J2757
645B5756m889p212R89n444j799J1464o36j1719J513O969K431J1300P158j3742
659B2139j1851k886q445j699J5787R397K465O869n918j6958k008M015o112n07
$$ plain form
559 -752 -6445 -2104 -9966 -22596 -17329 -8402 -4709 6528 9046 -8701 -15576 -9160 -13436 -17845 -17261
574 -17261 -26130 -25511 -2141 12589 7193 520 -14415 -34918 -33441 -22063 -20063 -12212 1871 -1674
588 -1674 -9587 -9492 -16511 -22193 -12520 -12527 -25678 -24870 -14821 -11085 -693 3254 -14783 -25041 -14894
603 -14894 -8796 -7041 -3019 -14093 -28706 -20965 -8683 -4265 6483 12719 -676 -10327 -11967 -21042
617 -21042 -19732 -3080 1520 -1387 6443 9696 6898 12759 8114 -12993 -20118 -10434 -2277 13192
631 13192 29332 21364 7450 6681 2295 -2009 8421 14125 7627 9716 12736 7563 12999 25756
645 25756 20867 13655 14644 9200 7401 18865 18229 6510 8023 14992 17423 28723 35881 22139
659 22139 10288 7402 -1043 -2742 13045 22442 24907 31776 25858 8900 6892 10907 4795 4288
673D288L017m177N749J6961j44j1937n815r219o396J0848O807o524L64K838o660
688@m22P817l473j848N523q686j4405K264N004J302R688K514j1213QQ088n047
704b886o628l572j1566k184J6989J1206j78L334n334j5700k837J960n311M808
718a7899J1695k088k268N773k291l380N178m336j2287K848O805L4N642M394r056
733a1236j883R390p15k162L434o373r612M618M303o01J0511Q746o081m260r6r371
749a1388k529Q017j499k651R529O026q83M796j952j3103k329L598l609K680J0283
764D986O08p08O059n143q081N316K985o165M09P20n805O646J2278k930m439K289
780I025m467l504O652l445r104N007O713j545O868M834p382k107K261r688o732
$$ plain form
673 4288 7305 3128 8877 25838 25694 13757 7942 -1277 -7673 3175 9982 3458 3822 6660 0
688 0 -422 7395 3922 2074 7597 -1089 -15494 -13230 -8226 -6924 2764 5278 -5935 -5927 2161 -2886
704 -2886 -9514 -13086 -24652 -26836 -9847 1359 1181 4515 -819 -16519 -19356 -17396 -22707 -17899
718 -17899 -6204 -8292 -10560 -4787 -7078 -10458 -5280 -9616 -21903 -19055 -12250 -12216 -6574 -2180 -11236
733 -11236 -13119 -3729 -4444 -6606 -3172 -9545 -19157 -14539 -10236 -10837 -326 8420 2339 -1921 -2017 -11388
749 -11388 -13917 -5900 -7399 -10050 -521 5505 4622 9418 7466 -5637 -7966 -4368 -7977 -5297 4986
764 4986 5594 4886 10945 5802 -2279 3037 6022 -143 266 986 -4819 1827 14105 11175 6736 9025
780 9025 4558 1054 7706 4261 -4843 164 6877 5332 12200 17034 9652 7545 9806 118 -6614
795f614O982L547J938R016r21r055L657L649p443l620K32o327M061J3033j4m995
811G126L351k168n247L868j086r210K020N545k986K747P218l196j109M093o776
826D190r097L474J193l554O240L728l915L675N822p486n387J145n564j880Q026
841F10O2l214O641K697n466J144j41q775p97M253m436m74Q827K24j673M839k935
858A386p917K109j16p814J219O090n54M525O704o468n949L713k728n802L697p02
874h607m210Q174O697m871m71L293o005k174L554n636m326Q056L286k342N184
889c98J112n764L111K351r294l399M309j132L253Q658j333m352N782k22p523l61
905e202l71n529N671Q444k493l38N887k375l857K408n176o242O354M943k906M053
$$ plain form
795 -6614 368 3915 5853 14869 13948 4893 8550 12199 4756 1136 1368 -4959 -898 12135 12121 7126
811 7126 10477 8309 3062 6930 5844 -3366 -1346 4199 1213 3960 11178 7982 6873 10966 4190
826 4190 -4907 -1433 -240 -3794 2446 6174 2259 5934 11756 4270 -1117 28 -5536 -7416 610
841 610 672 -2542 4099 6796 1330 2474 2333 -6442 -7239 -2986 -7422 -7896 931 1155 -518 4321 1386
858 1386 -6531 -4422 -4538 -12352 -11133 -5043 -5597 -1072 5632 -836 -6785 -3072 -5800 -11602 -7905 -8607
874 -8607 -12817 -4643 2054 -2817 -3288 5 -6000 -8174 -4620 -10256 -14582 -6526 -3240 -5582 -398
889 -398 714 -5050 -1939 412 -8882 -12281 -7972 -9104 -5851 2807 1474 -2878 2904 2682 -4841 -5202
905 -5202 -5573 -11102 -5431 3013 520 182 6069 3694 -163 2245 -2931 -9173 -2819 2124 -782 3271
921C271K914m507K071N376p157m500L601k170k134O877J492l455O152L641o893
936D579o25P55o585r02N994k591J32R061J190m319J779k735q137K144L488n352
952b124K983P087k102L97M627n425n456M026j179n849L456K495l323M875M948
967I436n051j287M003n066m608K459k705j934Q454L096m849K791J996o346J41
982E30J403q068j600Q210J040r4N104k135n775L742k8p431M70L113l245K705N945
999C886l463j115O115k302o408R91j864m237O327M140n033J521N433k357l1K081
1015C684p738o208N906O84r87O394J701l761K683J779q621j590L747l437J57N896
1031B89j719j284O707m3o759J030n32m775L012M156m965J25N674j616l34N172
$$ plain form
921 3271 6185 1678 3749 9125 1968 -2532 1069 -1101 -3235 3642 5134 1679 7831 11472 4579
936 4579 3954 4709 -1876 -2778 3216 625 757 9818 11008 6689 8468 5733 -2404 -260 3228 -2124
952 -2124 859 7946 5844 6241 10868 5443 -13 4013 2834 -3015 441 2936 -387 4488 9436
967 9436 4385 3098 7101 2035 -2573 -114 -2819 -4753 3701 6797 1948 4739 6735 389 530
982 530 1933 -6135 -7735 475 1515 1421 6525 4390 -1385 2357 2329 -5102 -4632 -1519 -4764 -2059 3886
999 3886 423 -692 5423 3121 -3287 -2296 -4160 -8397 -2070 2070 -2963 -1442 3991 1634 1603 3684
1015 3684 -4054 -10262 -4356 -3672 -4659 1735 3436 -325 2358 4137 -4484 -6074 -2327 -5764 -5607 289
1031 289 -1430 -2714 3993 3950 -2809 -1779 -2311 -7086 -4074 82 -4883 -4758 916 -700 -1034 4138
1047D138k387o412J678j725n398M542O487j902L372L104n945l180L521m099m305
1062h511M166Q91r09O962L212o130M9R24o623m87M682j618J25N886k770m161N085
1079G73J926k940K232j004p508N16N532j111J030M804k581j538N823j915o935
1094b896R96n24l847M856O184j615L136L741o757n666J255k244l25Q588P82m794
1110H70L195K541l588J734O85p568j001N931k97o87M945k317m219M610J217m139
1126A912K475K224p585j280L011k236L111Q426j323m775N41l810m301L655J559
1141A604m509L205N273j756J849K935p249o004K082j533p32P780K444m022Q91
1156B258k62n480J813M564l936k268K365l068r71O604L08m141L052k10m435J889
$$ plain form
1047 4138 1751 -4661 -2983 -4708 -10106 -5564 923 -979 2393 5497 -448 -3628 -107 -4206 -8511
1062 -8511 -4345 -3454 -4363 2599 5811 -319 -270 654 -5969 -6456 -1774 -3392 -3267 2619 -151 -4312 773
1079 773 2699 -241 1991 987 -6521 -6005 -473 -1584 -554 4250 1669 131 5954 4039 -2896
1094 -2896 -1900 -2424 -6271 -1415 4769 3154 6290 10031 3274 -2392 -1137 -3381 -3706 4882 5664 870
1110 870 4065 6606 3018 4752 5437 -2131 -3132 2799 2502 1815 6760 4443 224 4834 6051 1912
1126 1912 4387 6611 -974 -2254 757 -1479 1632 10058 8735 3960 4501 691 -3610 45 1604
1141 1604 -2905 300 5573 3817 5666 8601 1352 -4652 -2570 -4103 -4835 2945 5389 1367 2258
1156 2258 1996 -3484 -1671 2893 -1043 -3311 -946 -4014 -4985 1619 1927 -2214 838 628 -3807 -1918
1172a918J540n475q34M226k492J623P608n52m117j77m574o552M650N088j204K683
1188d77K771m406LM514m663m760K458p62j058O141K518m238J735K062n788k45
1204d195M046k983l37M300l365l394N278K938j942L500r60p224K80L840l320M0
1220c498N008j735L01N992j689m921J160j672n124L405L829j992M250M300m631
1235B983l197J726k909j922N031q00l920M390K509l112K862J731o054l39L707
1250B686l493k020N081j230k303N060N07l862L286R39n961q80K066k834J607O247
1266D896j294k261L731k046m537K555n47m444K901L965k624J742M103l045k480
1281F15K358l859l871M916J208k789L262J791l648K468K749n408k084L179l020
$$ plain form
1172 -1918 -378 -5853 -6687 -2461 -4953 -3330 4278 3726 -391 -568 -5142 -11694 -7044 -1956 -3160 -477
1188 -477 2294 -2112 -2109 2405 -2258 -7018 -4560 -5322 -6380 -239 2279 -1959 -224 1838 -3950 -4195
1204 -4195 -149 -3132 -3469 831 -2534 -5928 -650 2288 346 3846 2886 -4338 -4058 -218 -3538 -3498
1220 -3498 1510 -225 76 6068 4379 -542 618 -1054 -6178 -2773 1056 -936 3314 7614 2983
1235 2983 -214 1512 -1397 -3319 1712 912 -3008 1382 3891 779 3641 5372 -682 -1021 2686
1250 2686 -807 -2827 2254 1024 -1279 3781 4288 426 3712 4651 -1310 -2190 -124 -2958 -1351 4896
1266 4896 3602 1341 5072 3026 -1511 1044 497 -3947 -1046 2919 295 2037 6140 3095 615
1281 615 2973 -886 -4757 159 1367 -1422 1840 3631 -17 2451 5200 -208 -2292 887 -2133
1296b133o18N117j092k542M777J204m928R24M96m532J417L415l397l68N551p03
1312B588j441L094k582n214K310J644m147K336L133k742J947M365m173k983K748
1327H83k312l144L612K82k568M745K536l468o5J742m584j562L707k488j813N593
1343A096O45k370K865K76n201J232K274m461J06L982k472l42N014j266l071L546
1359A853j005m432J771Q07l725K248L798k316Q38M455k795l455J400k562l107
1374f227M662J998k371L095K046l831K12K001m527j853L622j447j326N228P30
1389B012l713K616J3n143J454K902k514o46K639k615k73N283o7l464J702j585
1405a399l657K842J965l807J022L895k122P97M099l278l966K425j722l277L785
$$ plain form
1296 -2133 -2751 2366 1274 -1268 3509 4713 -215 709 1205 -3327 -1910 1505 -1892 -2260 3291 2588
1312 2588 1147 4241 1659 -3555 -1245 399 -3748 -1412 1721 -1021 926 5291 1118 -1865 883
1327 883 -1429 -4573 -961 -679 -3247 1498 4034 566 501 2243 -2341 -3903 -196 -2684 -4497 1096
1343 1096 1741 -629 2236 2512 -2689 -1457 817 -3644 -3538 444 -2028 -2370 2644 1378 -1693 1853
1359 1853 848 -3584 -1813 -1006 -4731 -2483 1315 -1001 -163 4292 1497 -1958 -558 -3120 -6227
1374 -6227 -1565 433 -1938 1157 3203 -628 -416 1585 -2942 -4795 -1173 -2620 -3946 1282 2012
1389 2012 -1701 915 928 -4215 -2761 141 -2373 -3019 -380 -2995 -3268 2015 1948 -1516 186 -1399
1405 -1399 -5056 -2214 -249 -4056 -3034 861 -1261 -464 3635 357 -3609 -1184 -2906 -6183 -2398
1420b398L016j324K477J734m939j059K910k837j089L470j752j548N589J102l652
1435c00J464N52m708K176K701k924k47L509j638j151M693r47k420K735p51m669
1451a925J049K211j924K583M413k921r63L009k374l051K566j089l105M138K900
1466E517k416K124K094m658j368K093k363o57M568o15k912L266L71k822K447R65
1482E634m706j86K907l349L48L715j649j518L822j037l331K199k16m594J161K033
1498A233k510J752M482k272k340J946k898l062L182J23l358L185K542k797J208
1513D16J476m292j040K044k146j803M087j79j976L442k6m361J455K087l707J4
1529d509J932k937o04M815n02j659L005q17l705J336O09m015J881L171j823N19
$$ plain form
1420 -2398 618 -706 1771 3505 -1434 -2493 417 -2420 -3509 -39 -1791 -3339 2250 3352 -300
1435 -300 1164 1716 -2992 -816 1885 -1039 -1286 2223 585 -566 4127 3180 760 3495 2744 -1925
1451 -1925 -876 1335 -589 1994 6407 3486 2523 5532 3158 107 2673 1584 -1521 2617 5517
1466 5517 3101 5225 7319 2661 1293 3386 1023 366 4934 4319 1407 4673 5044 2222 4669 5634
1482 5634 928 742 3649 300 648 4363 2714 1196 5018 3981 650 2849 2633 -1961 -800 1233
1498 1233 -1277 475 4957 2685 345 2291 -607 -3669 -487 -364 -3722 -537 2005 -792 416
1513 416 1892 -2400 -3440 -1396 -3542 -5345 -1258 -1437 -3413 29 3 -4358 -2903 -816 -4523 -4509
1529 -4509 -2577 -5514 -6118 -1303 -1805 -3464 -459 -1276 -4981 -3645 -3036 -7051 -5170 -1999 -3822 -3303
1545c303L650k605j125K932k470l794K820J045j573L273K471l399j30K673l070
1560b605n58K704j988j916L289P71j709L157J362m010R90J231l343M73L813k362
1576g01r15M005m82j611L209j044l716R05J408k265J529L345k309K65L209k549
1592B283k276K780j154l014K941P28k607K994K636l051l65K102k894j321L348
1607C130j758j949L124O91j938K156J090l814R04J370l451n82K925j084R6L889
1623D799j230k994J779K16l800J591Q43k612J441L409k049l54K432j966k776K469
1639A198j130k858L049J316k355J518J722k789N51K940l281k219K080j299r89
1654b546L559J105k851J671R98l180K35J530l083k34K711l94n74L456m34l400
$$ plain form
1545 -3303 347 -2258 -3383 -451 -2921 -6715 -3895 -2850 -4423 -1150 1321 -2078 -2208 465 -2605
1560 -2605 -3163 -459 -2447 -4363 -1074 -303 -2012 1145 2507 -1503 -513 718 -2625 -2152 1661 -701
1576 -701 -1616 2389 1907 296 3505 2461 -1255 -350 1058 -1207 322 3667 1358 1623 4832 2283
1592 2283 7 2787 1633 -1381 1560 2288 -319 2675 5311 2260 1895 3997 1103 -218 3130
1607 3130 1372 -577 2547 3238 1300 3456 4546 732 1636 3006 -445 -1027 1898 814 910 4799
1623 4799 3569 575 2354 2570 -1230 361 1204 -1408 33 3442 1393 1039 3471 1505 -1271 1198
1639 1198 68 -2790 259 1575 -780 738 2460 -329 222 3162 -119 -2338 -258 -1557 -2546
1654 -2546 1013 2118 -733 938 1936 -1244 -1009 521 -2562 -2796 -85 -479 -1053 2403 1969 -1431
1670a431J321l49l621K195K854k673M19K713k349n26L151j706k713J729k35k729
1686c950K755J684k667J260K251k909l12K772k161k015J944p62k061L790J791
1701A410k454J209M00l682n0K386k398j13L174o10j181L275m24k962J635p9l881
1718d345J294L096j629J076K421k912j476K669l34j573J983p98l169K497K483
1733A283k046R03K172k961o69K625j784j743K652q94j288L148J445k315J345R29
1749B802m161n93K532j183J07L582j118j686K337P3k615J273O72l297J150K655
1765B530j402L18K434j588k092K425q60k081K190K75k627J361K127k001J166K173
1781D348l041j278K380j895j497K456M51k003K537R19k763O63J367l108p04K220
$$ plain form
1670 -1431 -110 -459 -4080 -1885 969 -1704 -1285 1428 -921 -1447 1704 -2 -2715 -986 -1221 -3950
1686 -3950 -1195 489 -2178 -918 1333 -1576 -1888 884 -1277 -3292 -1348 -2110 -4171 -381 1410
1701 1410 -1044 165 565 -3117 -3167 -781 -3179 -3292 -118 -728 -1909 1366 942 -2020 -385 -464 -4345
1718 -4345 -3051 45 -1584 -508 1913 -999 -2475 194 -140 -1713 270 -528 -3697 -1200 1283
1733 1283 -763 140 2312 -649 -1318 1307 -477 -2220 432 -462 -1750 1398 2843 528 1873 2802
1749 2802 -1359 -1952 580 -603 -496 3086 1968 282 2619 2692 77 1350 2022 -1275 -125 2530
1765 2530 1128 1446 3880 2292 200 2625 1765 -316 1874 2149 -478 883 3010 1009 2175 4348
1781 4348 1307 29 2409 514 -983 1473 1924 -79 2458 3377 614 1277 2644 -464 -1168 1052
1797A052j702j50L271m94k230J870k36k994J408R21k985P90K617j481n38K527
1813A646j598j700K585r00k893J704N92j882J548K036k292k06K180j547j710J288
1829a149j045j620K801O08j713J706J276k820N10J384k875m64K580j079o48K927
1845C79l72j882K052k05k852Q82J199k139Q95K986k119l62K924j246j580J518
1861G8p36k184K002J353k029J152K157k562L63K099j976j317K196r41j310K670
1877A015P01k169J922J036k407K01J449k227q90K802p82o86K780R2k023J347l29
1894A832k546Q41J881j941N67K528j541q51K028o63j979J426k25k040J260K031
1910B608j912P32J818k621l41K665j994j350J840p59j642K356O82j561J072Q92
$$ plain form
1797 1052 -650 -800 2471 1977 -253 1617 1381 -1613 -205 716 -2269 -1479 1138 -343 -881 1646
1813 1646 48 -1652 933 33 -2860 -1156 -564 -2446 -898 1138 -1154 -1360 820 -727 -2437 -1149
1829 -1149 -2194 -3814 -1013 -405 -2118 -412 864 -1956 -1446 -62 -2937 -3401 -821 -1900 -2548 379
1845 379 7 -1875 177 -28 -2880 -1998 -799 -2938 -2043 943 -1176 -1538 1386 140 -1440 78
1861 78 -658 -2842 -840 513 -1516 -364 1793 -769 -406 1693 -283 -1600 596 -345 -1655 1015
1877 1015 1716 -453 1469 2505 98 299 1748 -479 -1369 1433 651 -35 2745 2837 814 2161 1832
1894 1832 -714 127 2008 67 634 3162 1621 770 2798 2135 156 1582 1357 -683 577 2608
1910 2608 696 1428 3246 625 284 2949 955 -395 1445 686 -956 1400 2082 521 1593 2485
1926B485k406l29J941j943m96J939o20j315K725K61k129J444o13l204N38K099
1942C77r22M32K101j644j546K176j075k017J891r5j852J418J407j783M07J819
1958A094k370o28J978j199j373K285n63k104J527J471j551J367Q82k693o62J402
1974a137j121l70K300o16j126K156J61j642N49K35k438M13J994q04M88K465j779
1991b72j668J601k35j811K143L22k052J447J005j403L99J975j853j260J874n97
2007c85j379K107J42j997J771J172j604R09J414k459r94J837j264n68L007k70
2023A439j451J613L7k452R79P83j534L66J718j200o2K280q71j975J837q25j935
2040a253J807J174j718O40Q91j541l1K637j597j105J519j021j847J906K53j399
$$ plain form
1926 2485 79 -250 1691 -252 -748 1191 571 -744 1981 2242 113 1557 944 -2260 -1722 377
1942 377 -545 -113 1988 344 -1202 974 -101 -2118 -227 -322 -2174 -756 651 -1132 -725 1094
1958 1094 -1276 -1904 74 -1125 -2498 -213 -776 -2880 -1353 118 -1433 -66 816 -1877 -2539 -1137
1974 -1137 -2258 -2628 -328 -944 -2070 86 247 -1395 -846 -611 -3049 -2636 -642 -1446 -958 1507 -272
1991 -272 -1940 -339 -574 -2385 -242 80 -1972 -525 480 -923 -524 1451 -402 -1662 212 -385
2007 -385 -1764 343 485 -1512 259 1431 -173 736 2150 -309 -1303 534 -730 -1298 1709 1439
2023 1439 -12 1601 1638 -814 165 948 -586 -220 1498 298 236 2516 1645 -330 1507 682 -1253
2040 -1253 554 1728 10 650 1541 0 -31 2606 1009 -96 1423 402 -1445 461 714 -685
2056f85J801Q43j911K96J354k232m97J485r11o99K286N18j807J771k95k789Q86
2073e86Q57j269K97J951j121m82J377l39j889J960k89k252J573N82j590R79J431
2090A190j276l56J681j402p99J869q53j765J756Q05j699J583J160j552n09Q07
2106F40j593l94J933l99j125K354l29j356J361K36k157J58J551j847P66J794j057
2123E36q20J536p26j351J601L38j945P50O29j419R49J769j691J22J269j391j415
2140a259J704N0j882J773N00j402J141J019k048k12Q54j442n59K318l04j100J522
2157F73p1j801Q67R03k152M94J323j727K40J807o82r78J796r15j576J358L32k034
2175b143J043J120j535O84J865j833l88J492j214j206J316L43j312J738P90j523
$$ plain form
2056 -685 1116 1959 48 344 1698 -534 -1031 454 -457 -1156 1130 1648 -159 1612 1317 -1472 -586
2073 -586 271 -998 -701 1250 129 -353 1024 685 -1204 756 467 -1785 -212 370 -1220 -241 1190
2090 1190 -86 -442 1239 -163 -962 907 54 -1711 45 850 -849 734 1894 342 -167 640
2106 640 -953 -1347 586 187 -938 1416 1087 -269 1092 1328 -829 -671 880 -967 -201 1593 536
2123 536 -284 1252 526 -825 776 1114 -831 -81 548 -871 78 1847 156 278 1547 156 -1259
2140 -1259 445 495 -1387 386 886 -516 625 1644 -404 -616 238 -1204 -1763 555 251 -849 673
2157 673 602 -1199 -332 571 -1581 -1087 236 -1491 -1251 556 -126 -1104 692 -223 -1799 -441 -109 -2143
2175 -2143 -1100 20 -1515 -831 1034 -799 -1187 305 -909 -2115 -799 -456 -1768 -30 760 -763
2191g63N57R53j711k08J349j322l99J896j10r47J258L55j322O86P66j856O73J127
2209I82j248nJ565o73o60J689l20j251O56J71k066J283J499j134O34J114j350
2226H86m46J087n87j270J423p2j457J883R90k031N60P37j667N1J229n15q26J722
2244A697m72j383J169P60j528L24O93j653R7R83r15MJ672p45j075J660j085j205
2262a002J145J75j881O31J457j162J06J829k223p45J242o35p61J378M32j624Q01
2279h37R49j506N17J111k118j89J490p52p33J897l24j343P25Q34j857J201N86
2296c49j558k29J644q81k40K072o76j459J602l82j051R82N58j506O78J598j181
2313c78J97J455j470j442J701j82q33J472N89j425Q66P58r79j59R81q69r13J890
$$ plain form
2191 -763 -206 747 -964 -1172 177 -1145 -1544 352 242 -705 553 908 -414 272 1038 -818 -145 982
2209 982 -266 -271 1294 621 -39 1650 1330 79 735 906 -1160 123 1622 488 1122 2236 886
2226 886 440 1527 940 -330 1093 1021 -436 1447 2437 406 966 1703 36 87 1316 801 -25 1697
2244 1697 1225 -158 1011 1771 243 567 1260 -393 -296 687 -228 -224 1448 703 -372 1288 203 -1002
2262 -1002 143 318 -1563 -932 525 -637 -531 1298 -925 -1670 -428 -1063 -1824 -446 -14 -1638 -837
2279 -837 112 -1394 -877 234 -1884 -2073 -583 -1335 -2068 -171 -495 -1838 -1113 -279 -2136 -935 -349
2296 -349 -1907 -2136 -492 -1373 -1613 459 -217 -1676 -74 -456 -1507 -525 33 -1473 -795 803 -378
2313 -378 -181 1274 -196 -1638 63 -119 -952 520 1109 -316 550 1308 329 170 1151 282 -631 1259
2331A259o63o68J730k1j487R01N19j354J13J550j811K5J644r95N2J584n37j376
2349D65J063o77j006O53J028j479P34J336r29n32J212q13j303R15K15j571J562
2366H73N52j346O56N58j317k35J222j342q25K044p69j376J908q8j188N75M56j283
2384i25l6J268j568J78J239q33l46J146j04j385J256l16j458K98J494j481M90
2401a083J601j010p68J557j267j124J844m30j372J486O24j188P52J035j786O1
2417a068R09m59j171K244n13j104J157M15j273Q30P24j576K43J211j211K33J256
2434H47p12p20J483j29j383J144N01j658K68J335j298M88J561j161q34J381l73
2451G40j302J260L92j443J138J093j603M75Q85j736o4R58p17k56J659n89r99J212
$$ plain form
2331 1259 596 -72 1658 1637 150 1051 1570 216 329 1879 68 93 1737 742 794 2378 1841 465
2349 465 1528 851 -155 498 1526 47 781 2117 1188 656 1868 1055 -248 667 882 -689 873
2366 873 1425 79 735 1293 -24 -259 963 -379 -1204 840 71 -1305 603 515 -673 -98 358 -925
2384 -925 -961 307 -1261 -1083 156 -677 -1023 123 19 -1366 -110 -426 -1884 -1586 -92 -1573 -1083
2401 -1083 518 -492 -1260 297 -970 -2094 -250 -680 -2052 -566 58 -1130 -378 657 -1129 -1068
2417 -1068 -159 -618 -1789 455 -58 -1162 -5 410 -863 -33 691 -885 -642 569 -642 -409 847
2434 847 135 -585 898 769 -614 530 1031 -627 -359 976 -322 166 1727 566 -268 1113 740
2451 740 -562 698 1090 -353 785 1878 275 750 1635 -101 -165 793 76 -180 1479 890 -109 1103
2469A103Q9j411P33J251j952j48J284j171l23J946m49j072Q46Q1j572J038K71
2486E44j424K93J459j163O5J359q98o63O54p17p21J257K93j273O05R78j320K09
2504d63J308j753m56J267p53l93J477p6r99M97L56j055L70R88j215l19J146o54
2522g27j98J297n16j178J119j72j217R31P05j261j4J487j058K21J420j160j004
2539a325J096n86p32J242N70j202P55P98j301J22R31p45q94J437p07q29J718N41
2557H89j568O85P93j600O47J048j250k03J368j063n18J597k79r00J067l7j285
2574f09J88J292j378N49J002q98k06J361p22j141J466l99j415J406L41j001Q33
2591F69L55j006K09P24p96p28J427n60n42R87N6j104J034O95j519L59M77r57l20
$$ plain form
2469 1103 1192 -219 514 1765 -187 -335 949 -222 -545 1401 952 -120 726 807 -765 273 544
2486 544 -880 -587 872 -291 -226 1133 235 -428 226 -491 -1212 45 338 -935 -330 648 -672 -463
2504 -463 845 -908 -1364 -97 -850 -1243 234 158 -841 -344 12 -1043 -673 315 -900 -1219 -73 -727
2522 -727 -925 372 -144 -1322 -203 -375 -1592 -661 44 -1217 -1231 256 -802 -581 839 -321 -1325
2539 -1325 -229 -815 -1547 -305 265 -937 -182 616 -685 -563 368 -377 -1271 166 -541 -1370 348 889
2557 889 -679 6 799 -801 -154 894 -356 -559 809 -254 -772 825 546 -354 713 676 -609
2574 -609 -421 871 -507 42 1044 146 -60 1301 579 -562 904 505 -910 496 837 -164 669
2591 669 1024 18 227 951 155 -573 854 294 -248 739 795 -309 725 1420 -99 260 737 -220 -540
2610e40J386o05p86J409j82j084J200K18j571M21R83j122j04J653r21m90J108
2627I73o96q76J092O3j321J255P25j603M18J182j376k48Q74p88o90J320N2j063
2645g07J100L67j449P09Q03j235o1Q80j109j32J261l61o91J391q10n01Q76o9j015
2664g53O85P58j229j35J431n07r54J215r78q80J077M45j026Q36M20j176K29J082
2682E40j064j59R87o16r20J738m33j075J095Q8j376O34P98q64l45J436j256l17
2700a109J448k83j058J307m82j077Q31M50j121O37J105j258k63J540p36p61J237
2717D07n47j186J184Q58j839J186N93j187K6J128r48n01J065j28r03J062J50r01
2735d81J061K66r20R3R74j566J88J440j111j8J121k77j040J352L3j405N08L43
$$ plain form
2610 -540 846 241 -545 864 682 -402 798 1016 -555 -134 849 -273 -377 1276 355 -135 973
2627 973 277 -599 493 556 -765 490 1215 -388 30 1212 -164 -412 462 -326 -1016 304 356 -707
2645 -707 393 760 -689 20 823 -412 -473 407 -702 -834 427 66 -625 766 -44 -545 331 262 -753
2664 -753 -68 690 -539 -674 757 250 -704 511 -467 -1347 -270 175 -851 -15 405 -771 -542 540
2682 540 -524 -683 304 -312 -1232 506 73 -1002 93 181 -1195 -561 237 -627 -972 464 -792 -1109
2700 -1109 339 56 -1002 305 -177 -1254 -423 27 -1094 -457 648 -610 -873 667 -69 -830 407
2717 407 -140 -1326 -142 716 -1123 63 656 -531 -505 623 -325 -826 239 111 -792 270 420 -481
2735 -481 580 846 -74 19 993 -573 -385 1055 -56 -74 1047 770 -270 1082 1115 -290 218 561
2753E61j236O60J634j521l8J279m12j145R67p6r41J075m4j211J048M79p13l54
2771A2J189j227l40Q37j90o52J235J10j112P40L43j405O36O52j226Q8Q32l68o06
2790d52J460m17j139J008Nj337R71O00j430L38Q76o71k47J054o92n92R74k21q93
2809h05J054K82j317M91N75n85J05P85j020o26J333l87n88P89K00q55P13K37j177
2828g96P13L03o49l01J203q47q0R16k94j188J085L62j189K61R56p01l2R30n72
2847H0o76J068l41o85R63k06j286Q55J126j674M16J444j137m03J351r01o54J287
2865F27m13j064J306K48r97L33M35j112L1Q33l39k22P10k89p27R47q8r13M27M82
2885B15j409P24J039j318m8J205o43m83P42q2j033P96P3p02P72N41j069N50N85
$$ plain form
2753 561 -675 -15 1619 98 60 1339 927 -218 749 673 -268 807 763 -448 600 1079 366 12
2771 12 1201 -26 -366 471 281 -371 864 974 -138 602 945 -460 176 828 -398 -310 522 154 -452
2790 -452 1008 591 -548 460 465 -872 99 699 -731 -393 483 -188 -435 619 -73 -665 309 88 -805
2809 -805 249 531 -786 -295 280 -305 -200 585 -435 -1061 272 -115 -703 86 286 -569 144 381 -796
2828 -796 -83 220 -429 -730 473 -374 -454 462 168 -1020 65 427 -762 -501 455 -246 -278 652 80
2847 80 -596 472 131 -554 409 203 -1083 -228 898 -776 -360 1084 -53 -456 895 -6 -660 627
2865 627 214 -850 456 704 -293 40 475 -637 -606 227 -112 -334 376 87 -640 307 219 -694 -267 215
2885 215 -1194 -470 569 -749 -797 408 -235 -718 24 -58 -1091 -295 -222 -924 -152 389 -680 -130 455
2904D55j066K08P22p21p61J292m1r50J015J06j141N39P98j144r6J304q77k93J301
2923F50l25n89O36j87j179J194L13j250P03J148j352j08J019m15n65J059m99q49
2941e96J137K89j013M93P96j047j29J045k85r57J259l70j095R67K29p59R54L01
2959A219j302N06L97r15J65J038q25j82J014j35j054R55q5p82P50J0r51k7J080
2978H76q30J01R75j68j006Q17j84j244J244L56q52K29P33j028J3Q57q81k68P70
2997E10n71r40J604p7r98P62L67j230N11N40p89k07Q93j127j60J238k40p34L66
3016b82N14j321N83N28q49K31O24p92L19P41n84m46O04k07o45L34Q39r15Q3J077
3036D36j302n7J207o70q12J443m85p27P14L88q03L26K47o84J16R70r74l08J298
$$ plain form
2904 455 -611 -403 319 -402 -1163 129 88 -862 153 259 -882 -343 455 -689 -785 519 -358 -651 650
2923 650 325 -264 372 185 -994 200 513 -737 -34 1114 -238 -346 673 258 -307 752 253 -596
2941 -596 541 830 -183 310 1106 59 -70 975 690 -267 992 622 -473 494 723 -36 918 1219
2959 1219 -83 423 820 -95 70 1108 283 101 1115 980 -74 881 796 14 764 774 -177 -204 876
2978 876 46 147 1122 954 -52 765 581 -663 581 937 85 314 1047 19 32 889 8 -260 510
2997 510 -61 -1001 603 526 -472 290 657 -573 -62 478 -311 -518 375 -752 -912 326 86 -648 -282
3016 -282 232 -1089 -506 22 -827 -596 28 -764 -445 296 -288 -734 -130 -337 -982 -648 191 -724 -641 436
3036 436 -866 -923 284 -386 -1198 245 -240 -967 -253 135 -668 -342 -95 -779 -663 307 -667 -975 323
3055C23q20k10R02M10j363R39p9q20N10M70o47j83J135p77k55J219n23j049J082
3074B64K01r96K31R85q83L14P79j025j5P12l91n04P94r1q50Q16M56j086N69M02
3094F82p08k87R00p66n9R63l79p49R17L24q28M02K7o72m7J293j438K33J101n94
3114C15p38J159r5j166O66R7m16J13P82r01M68M51q02l42Q72p7o71Q86k41r96
3134f36J066J18p69M92J30r77L90P21n93m69J166j6j243Q81J95p60N00J50m78
3153a32L46J55l94m68R73k30k20P10l92q85Q71M08j128L23O91p78k21J382q74
3172A37k25L80l48l57N81L15r37M53P46j109j69J196p14j72M84j95q23J083k82
3191D4l49N29J73q15M01L28q52K77O86o09l69Q42j9o85O72n14n25N69L05p55K38
$$ plain form
3055 323 -497 -707 195 605 -758 181 102 -718 -208 262 -385 -568 567 -210 -465 754 231 -818 264
3074 264 465 -531 -300 685 -198 116 895 -130 -145 567 176 -328 466 375 -475 341 797 -289 280 682
3094 682 -26 -313 587 -179 -238 725 346 -403 514 838 10 412 439 -233 -280 1013 -425 -192 909 315
3114 315 -423 736 641 -525 141 238 -178 -65 717 -184 284 735 -67 -409 463 386 -285 601 360 -636
3134 -636 430 548 -221 271 401 -576 -186 535 -58 -527 639 623 -620 261 456 -304 196 346 -132
3153 -132 214 369 -25 -493 480 250 30 740 348 -537 334 742 -386 -63 628 -150 -371 1011 137
3172 137 -88 292 -56 -413 168 483 -454 -1 745 -364 -533 663 -51 -223 261 66 -757 326 44
3191 44 -305 224 397 -418 -17 311 -541 -264 422 -187 -556 286 267 -418 254 -260 -785 -216 89 -666 -428
3212d28P34r71k5O87k40j59M79j9n65O77N4p48O65L72r47K5O79q02K9R00o48n01
3234g52J107p3l01K93J03j004M15N34q49J13Q39m43k62N11j11n71Q57K25j030
3253c99O50K61r66P02N34q86j99J031n19l33M22R7r84P21M2m76K98O26o82j29
3273a89Q68r30q0N69J11o34J035k96q03O58M42r36L42J14k68O4P00n47m79R47
3293F88m67o61P20l3n16K25Q83j020M7N84l46k34N01n61k06O36k21q96J052j83
3313hl91M04M14j230J36J128o23k64R47n26o67J123k74l96N6L14n39K49M12p21
3333d56k9R39n72l01N29j83n08L62R7n80M26N76n96J43N24p92k4R41l90o80R22
3354C48n18k62O21L71q69L31N93o81j36J022o47n11Q15o42k54P29O9l16J40K04
$$ plain form
3212 -428 306 -665 -690 -3 -243 -402 77 58 -507 170 224 -524 141 513 -434 -409 270 -532 -503 397 -251 -752
3234 -752 355 282 -19 274 377 -627 -212 322 -527 -414 425 -18 -280 231 120 -451 406 631 -399
3253 -399 251 512 -454 248 782 -104 -303 728 209 -124 298 395 -589 132 174 -302 -4 622 -60 -189
3273 -189 679 -251 -331 238 349 -285 750 454 -349 309 751 -185 157 271 3 67 767 220 -259 688
3293 688 221 -440 280 247 -269 -44 839 -181 -134 450 104 -130 371 -190 -396 240 19 -877 175 -8
3313 -8 -399 5 419 -811 -675 453 -170 -434 513 -13 -680 443 169 -227 -171 143 -396 -147 265 -456
3333 -456 -485 454 -118 -419 110 -73 -581 -219 -122 -702 -276 300 -296 -153 371 -421 -445 496 106 -574 348
3354 348 -170 -432 189 560 -309 22 615 -66 -202 820 173 -338 477 -165 -419 310 379 63 203 407
3374D07q75N86L35l66m0O10n33k49O25J77r72M86L08j112Q42M23p17K58M86m71
3394B08m03K25L4k03K34M80r59R29j30j070P29L06p33o6J411q52o30O35O8r08
3414f95Q64J48p32J20L85p12q7J118o99m95R19j30o44O89Q8j057O65Qn50K16P26
3435A45o56J08L69j77m78N90j97o71Q13n8n19Q64Pr53N44L21n80JP49n75l97J010
3457B60j25q45Q51K1p30O73k89k85J36Q09m83k01P88n14k48O09n09k45M41L40
3477D54q64L00P29o08L6N25o00m4O41k76o03J106l41j66J52N72p86M2M89p36k74
3498b52Q76j39n26Q04j71o38K80O08r34K38M37l31k21R09r90K21M83k45o18P11
3518E02l66m85N03M24p01K88N30p65k72N15k49k70O83k69n15N20O1m24J94K72
$$ plain form
3374 407 -468 118 453 87 47 657 124 -125 500 677 -295 191 499 -613 229 652 -65 193 679 208
3394 208 -195 30 64 -139 95 575 -384 545 415 -655 74 380 -353 -419 992 140 -490 145 213 -695
3414 -695 169 317 -415 -295 90 -622 -709 409 -290 -785 134 4 -640 49 137 -920 -255 -247 -797 -581 145
3435 145 -511 -403 -34 -211 -689 -99 -296 -967 -154 -212 -731 133 140 -813 -269 52 -528 -527 222 -353 -750 260
3457 260 135 -710 141 162 -568 105 -184 -469 -333 476 -7 -208 580 66 -182 427 -82 -327 114 454
3477 454 -410 -110 619 11 47 572 -28 -72 569 293 -310 796 455 289 441 1013 227 269 758 22 -252
3498 -252 624 485 -41 763 592 -46 234 842 -92 146 583 252 31 940 -50 171 654 409 -209 502
3518 502 136 -349 154 578 -123 165 695 -70 -342 173 -76 -346 337 68 -447 73 134 -290 -96 176
3538A76k60k45P15o24k90Q33q06n4O36L7k50J32R7n90j19P56n77K37M82n85l44
3559f43R45m21m15O33L37j111M34M17o52p6J168j058N1M75J1l34J94qm65N69J85
3580B36m99K54L22l73k77P29q11j69Q04j62n67P04J39p10M50J53m53L83M09n09
3600E3K0J79j5o55P76j79m42M34L36o48Q2M96p15O45J48n99j51K76p3m33O56k02
3622a1n10L06N52l48M8L77o30K9K72j95m13Q12k88n34N92K89p04K10P91j284J32
3643e07P47m72n25J020l79j91O74l71n92M95M70o11j89P65o16K04M83n76j91Q78
3663E16n31n05R95j78r17L96P91n82K7L13n56L4M33j97r1J82j29l95M49M51q29
3684c23N19J61n50J18N75p53J38L96l87k53N63M36p04K57J68m0j09R4m23K14L21
$$ plain form
3538 176 -84 -329 386 -238 -528 305 -501 -555 81 118 -132 0 97 -493 -612 144 -433 -196 286 -299 -643
3559 -643 302 -119 -534 99 436 -675 -241 176 -476 -552 616 -442 -391 84 95 -239 -45 -53 -518 51 236
3580 236 -263 -9 313 -60 -337 392 -419 -588 216 54 -513 191 330 -380 70 223 -230 153 562 53
3600 53 73 252 237 -418 358 179 -263 171 507 -141 -59 437 -278 367 515 -84 -235 41 -32 -465 191 -11
3622 -11 -521 -215 337 -11 37 414 -216 -187 85 -110 -523 289 1 -533 59 348 -356 -146 645 -639 -507
3643 -507 240 -232 -757 263 -116 -307 367 -4 -596 -101 369 -242 -431 334 -282 -78 405 -171 -362 516
3663 516 -15 -520 475 297 -620 -224 567 -15 12 325 -231 -197 236 39 -52 130 1 -394 55 506 -323
3684 -323 196 357 -193 -75 500 -253 -115 281 -106 -359 204 640 -64 193 361 321 212 306 -117 97 418
3705D18j48m56O29L1r48P11L7n98R27l16l32K36K43l43k98N85r5o18N00J51m80
3726a64K74L98p23K81K48m28K22N72q70k19Q79k13o36N26k1n26N93N6p05M12K73
3747B29o15J12M61j18m32N47l38o44O77J17n89N42N8n52J27M20n00j6N10n52j59
3768g15O24K73p68N79J18n80Q0K61k12J2M63k33n26Q03k26m16M76jk58L37j90
3789i9l19J5Q63p52j97O93l26k37M69L7p40P77j87m2K88O1m53p5K64r9l2L11k52
3812c2l09M51K71p09K66L82l14L4L42l22q3N00m06m88P46K4l82J3L65m92K31L21
3834D09k49j16J77j27l53M80m49l6N21j66n39O11K03l80j99K76k80O6P91j016
3854c76L38M32m45n34O06J05k93K48O8l75j36O95m82r6O34m04l55J12L61m60M85
$$ plain form
3705 418 270 -186 443 474 -474 237 274 -324 603 287 -45 191 434 91 -207 378 283 -335 165 316 -164
3726 -164 110 508 -215 66 314 -114 108 680 -190 -409 470 257 -379 147 126 -400 193 249 -456 -44 229
3747 229 -386 -274 187 69 -363 184 -154 -798 -121 -4 -593 -51 7 -545 -418 2 -498 -514 -4 -556 -715
3768 -715 -91 182 -586 -7 111 -469 -389 -128 -340 -328 135 -98 -624 179 -47 -463 13 12 -246 91 -99
3789 -99 -418 -403 460 -292 -489 204 -122 -359 110 147 -593 184 -3 -45 243 304 -149 -224 40 -59 -91 220 -32
3812 -32 -341 110 381 -328 -62 320 6 40 382 60 -23 477 71 -417 329 353 -29 -16 349 -143 88 409
3834 409 160 44 221 94 -259 221 -228 -264 257 91 -448 163 366 -14 -213 63 -217 -151 640 -376
3854 -376 -38 394 -51 -585 21 126 -167 81 149 -226 -362 333 -149 -245 389 -15 -370 -258 103 -357 128
3875A28J10n69J13M42q7l78N94m28n67J070o67J48N67j81n93N22K58j15o61M16
3895A22p21M43O94o00J6Q6l12k46P56J75o65q1P57o45J02M37k88l36P74n12k82
3916c26M52J40n99M51J87q43L63L30k68m2K35j55k53Q82l82l84L67p2m59M21L51
3937C96l80j37J45j39JK77o8l28N06k50r5K31L7l12K20R8m78j31M14n7j8L76j89
3960A19m40O77j13l57K28k3m97M28K57m10M46l86O9l41L48J38l67M45M4p89Q27
3981C03k29j38k94N13J2k70N2j34m03O98L77q61O56j18m91J95N78q50K0Q41q97
4002d40M03L35k43n50N55L92p79O99j55p88P50p6j43R1K95o20l14P75k40l60O61
4023B48l91Q8P8M04o52k6P44m16m38M49L7m25O97l66j50J33K79n73L71J26k50
$$ plain form
3875 128 238 -331 -218 224 137 -241 353 -75 -642 428 -239 -91 476 295 -298 224 482 367 -294 122
3895 122 -599 -156 538 -62 -46 40 -272 -518 238 413 -252 -333 424 -221 -119 318 30 -306 468 -44 -326
3916 -326 126 266 -333 118 305 -538 -175 155 -113 -155 80 -75 -328 554 172 -212 155 83 -376 45 396
3937 396 16 -121 24 -115 -114 163 95 -233 273 23 -72 159 196 -116 104 202 -276 -407 7 -50 -68 308 119
3960 119 -321 356 243 -114 114 91 -406 22 279 -131 315 -71 -2 -343 5 143 -224 221 265 -524 303
3981 303 74 -64 -358 155 167 -103 -51 -185 -588 110 487 -374 282 164 -327 -132 446 -404 -384 457 -440
4002 -440 -37 298 55 -495 60 452 -327 372 217 -571 179 103 -40 51 346 -274 -588 187 -53 -413 248
4023 248 -143 -55 23 427 -225 -251 493 77 -361 88 125 -300 397 31 -119 14 293 -280 91 217 -33
4044c3J95J2l22k3M33k46m03N19K24o23K54K70n27J83L98J9n15M17k81n87P36
4065A00p0l20M41q0k12p2L10J20n00O36l61j77K80P2m57N03j65l01L19j5k00r
4087a58L8j25J24M10l06k09J44K80n56M54l31J65J91j8k09j13O21m14l66O41j30
4108A33o37O69l85m3L42J80p13J70M99n01o6L31M5m25N89j41m14N72j2k08P2J64
4130B21p21J67L06j11k54N26j62l15P25k31p58P88J15n11qM30l77j05N24k55l02
4151c08N61n18m3K47P5k00M8O01o50Q1L43n72j00P84l68n32O89K85o33P1P44p49
4173a44K70M03p76K23M54p55N90J2k43Q4k42Kl7L39L70o98K56L21p91m9P69O4
4195D22n14K30K31m77L46J04o25L84J88n11K74L16j34n02O80n05J53M11M6p16
$$ plain form
4044 -33 162 174 -148 -171 262 16 -387 132 356 -267 -13 257 -270 -87 311 330 -185 232 -49 -636 100
4065 100 30 -290 151 71 -141 -213 97 217 -283 353 -8 -185 95 167 -290 213 48 -253 66 51 -149 -158
4087 -158 -120 -245 -121 289 -17 -226 -82 198 -358 96 -235 -70 121 103 -106 -219 402 -12 -378 263 133
4108 133 -504 165 -220 -263 79 259 -454 -284 215 -286 -352 -21 24 -401 188 47 -367 205 193 -15 57 221
4130 221 -500 -333 -27 -138 -392 134 -28 -343 382 151 -607 181 296 -215 -223 207 -170 -275 249 -6 -308
4151 -308 253 -265 -308 -61 14 -186 -138 463 -187 -106 237 -335 -435 349 -19 -551 138 423 -210 -139 605 -144
4173 -144 126 529 -247 -24 430 -325 265 277 34 118 -124 -122 -159 180 550 -148 108 429 -362 -411 358 422
4195 422 -92 138 369 -108 238 342 -283 101 289 -222 52 368 234 -268 412 -93 60 471 517 -199
4215a99M54J74m21k7M62l21L1L01p49m1N32m02n1M96j96n26O70j6n40L35j62j34
4237c30J25L98j27o09M57q3m89R29k78o76P75j68k04L96k11j21l03R46k99m94
4257c66P60n79j22K15j20k48N72l4o43L58L52l98j04L75j76k69L76n2k53K17K92
4278A53o25L89M64o24L5N94p07J68N86m58l47L57M01m74J87J62m28J70L06m41
4298a32M7M98k93m29O04j03j09L11n6l91M95j81j99k20M44p7j23J46j79JL61q0
4320C35m16L49o8k67J75M53o35M9M21j28k99J22M51n06j9M10n94L90K12q20L54
4341c1L53m02J22J87q0j68K85pm60M08R1n91K90L63n14QM55j28m28K61O9k21K55
4364A17m16k37N60J06m26L04J38o42oM42j71j15L03nk34PJ26j44J27O55j012L44
$$ plain form
4215 -199 255 429 8 -19 443 122 153 454 -295 -336 196 -206 -257 239 43 -483 187 171 -369 -34 -196 -330
4237 -330 -205 193 66 -543 -86 -169 -658 271 -7 -683 92 -76 -280 116 -95 -216 -519 427 128 -366
4257 -366 394 -185 -307 -92 -212 -460 112 78 -565 -207 145 -253 -357 18 -158 -427 -51 -103 -356 -139 153
4278 153 -472 -83 381 -243 -208 386 -321 -153 433 -25 -372 -15 386 -88 99 261 -167 3 309 -132
4298 -132 -85 413 120 -309 295 192 83 394 338 -53 442 261 62 -158 286 209 86 232 53 54 415 335
4320 335 -81 268 200 -67 108 561 -74 -25 396 268 -31 91 542 36 17 427 -167 223 435 -385 -31
4341 -31 322 -80 42 229 149 -19 266 259 -201 207 298 -293 -3 360 -154 -146 309 181 -247 14 83 -138 117
4364 117 -299 -536 24 130 -296 8 146 -496 -502 -60 -231 -346 -43 -48 -282 -275 -149 -293 -166 489 -523 -179
4386a79M78m72q4L10J12p18N24j70n1j34O83m85K93k27Kk11N98l25m82N45m45
4407d38j89N44J42m50M09J97k14j26M86l97k41L81k62j21M49j66k95L70J55j92
4427D2l4K38l57r5L99j12l08N60J3l34j39J74k29J13L12q58L01Q2J83p6P22m56
4449A41m57N55j67M6K91j36o19M03K72l06j73K59j48Q3J41j60M3J78K38n53MN42
4471D77l36j38O53m29k67L5j0j90O00j93n19M75p9l66K81N37n80k43P06l89n78
4492e53R94l99m37O77k75N0K43l04j44L32J2o08N04R9j66j04L40j00l67J81O8
4513D3j80L9K10m92M31J47l91j66O09k86j12j20M00n89O35J39n86Q9N96n86n23
4534f93R10l0m99P26l00n06K48L01j39J03J43m88J24M70p55J85N96o83K7N10J3
$$ plain form
4386 -179 299 -173 -257 53 165 -553 -29 -199 -250 -384 299 -186 107 -120 -118 -329 269 -56 -538 7 -438
4407 -438 -627 -83 59 -391 18 215 1 -125 361 -36 -277 104 -158 -279 170 4 -291 79 234 42
4427 42 8 246 -111 -206 193 81 -227 333 346 12 -127 47 -182 -69 243 -615 -314 -232 -49 -125 597 141
4449 141 -316 239 72 118 409 273 -346 57 329 23 -150 109 -39 44 185 25 68 246 484 -69 -65 477
4471 477 141 3 656 227 -40 -5 -15 -205 395 202 -317 158 79 -287 -6 531 -49 -292 414 25 -553
4492 -553 441 42 -395 282 7 57 300 -4 -148 184 196 -412 92 191 25 -79 261 161 -206 -25 43
4513 43 -137 -98 112 -380 51 198 -193 -359 250 -36 -148 -268 132 -457 178 317 -269 -180 416 -170 -693
4534 -693 217 187 -312 414 114 -392 -144 157 18 121 264 -224 -100 370 -385 -200 396 -287 -260 250 263
4555B63m61M04k49J6Qo5k4j52N19o39O1L82j22m49R53l15p40N16j41P1p0K00j79
4578b13n4K70k4j29K43P8k46L1M33l99q5M45n54O3K30j67j56L11q4j18J98j27
4600e4l14O06j73n31K02N41l95r7J11L38q03O66m12m8O77l63j61M40l6M7m95L46
4622I2n6l48P52l14l55L08l26k92O56k57o4kM20p48M78M60n53j20K85L75q02N71
4644A60j6o50O92j43j28j65L20j60o5O68m11j51J46J15l07M34J02n61J19j40n0
4665a91J09M49n58L65k7K46l54q3M4j32o1M66l71J58M8l57M10j14j65P1M31o76
4687b92k45O67j25J06K05l47j04K9N59n86j37M15j87L49j70Q8m92J91P3m77K44
4708b36M33l72l73N57j40j65M43j87m01M03L27n25L44M03r01L94l26j24L62N34
$$ plain form
4555 263 -198 206 -43 -27 -19 -84 -108 -260 259 -380 -319 63 -59 -508 445 130 -610 -94 -235 -164 -234 -34 -213
4578 -213 -267 3 -21 -150 93 171 -75 -44 389 -10 -95 350 -204 -141 89 -78 -234 77 -7 -125 73 -54
4600 -54 -368 238 65 -466 -264 277 -118 -215 -104 234 -569 97 -315 -363 314 -49 -210 230 194 241 -254 92
4622 92 36 -312 440 126 -229 79 -247 -539 117 -140 -204 -206 214 -534 -56 404 -149 -269 16 391 -411 160
4644 160 144 -506 186 43 -85 -250 70 -90 -155 513 102 -49 97 212 -95 339 441 -120 -1 -141 -191
4665 -191 -82 367 -191 174 147 393 39 -44 0 -132 -193 273 -98 60 108 -249 161 47 -118 -47 384 -292
4687 -292 -537 130 5 111 316 -31 -135 -106 453 -133 -270 145 -42 307 137 225 -267 -76 -3 -480 -236
4708 -236 197 -175 -548 9 -131 -296 147 -40 -441 -38 289 -236 108 511 -390 4 -322 -446 -84 450
4728D50l55j91O8l69KN43M0o49j70P69r2j96M32l77R1J43k24k26L24Mk08n4K26
4751a9r8J97j55j66O4M13l24m3K92K2n12N46k89l1J55l48J67mK38j40n35O08m5
4774gJ12L22n13j33J11J68j20j02P23p34J07K91k42q1R1Rj69K93M8k29oK29j51
4797A7J07j5L4p40N97k6M0M36p4n12j27J77J6K4K68l45M6L68n69J80M76l69r6
4820h7J06L36m94QL7L12l57N65k27j5Q2k09j69J54L7l36O45l17m54M24J42m23
4842b40L40M56l68l54N41m35K5L39j77l85J59J45k00K4M43k9m08L08m70L2J75
4863g9J6J47m6j28O1j0P2l29J25L70k30k87L76J12p21P49n99K59L41l62J52j76
4885a87M28k76M6k0k74p7N83k61k33L04l26M2J91J42l16J88R2m05K54N28n88M5
$$ plain form
4728 450 95 -96 -28 -397 -395 148 188 -461 -631 138 46 -150 282 -95 -4 139 -85 -311 13 17 -191 -245 -19
4751 -19 -117 80 -75 -241 -177 236 -88 -131 161 183 -329 217 -72 -103 52 -296 -129 -133 105 -35 -570 38 -7
4774 -7 105 427 -86 -219 -108 60 -60 -162 561 -173 -66 225 -17 -98 -7 2 -167 126 174 -55 -61 168 17
4797 17 124 109 143 -597 0 -26 14 450 376 -136 -263 -86 -70 -46 222 -123 -77 291 -278 -98 378 9 -87
4820 -87 19 355 -139 -131 -94 218 -139 426 199 184 266 57 -112 42 79 -257 388 71 -383 41 183 -240
4842 -240 100 556 188 -166 375 -60 -35 304 127 -258 -99 46 -154 -130 313 284 -124 184 -286 -254 -79
4863 -79 -63 84 38 -90 -29 -39 33 -296 -171 199 -31 -318 58 170 -551 198 -401 -142 199 -163 -11 -187
4885 -187 241 -35 11 -9 -283 -360 223 -38 -271 33 -293 -251 -60 82 -234 -46 46 -359 -105 423 -165 -120
4907a20K75l62j34j03K48k99M45R4l68j38R35o35nK91m62Q1K55K47n18N34j07
4928A54l28J99K79k53j3J24m13J55O72l86k31J82j0l53M58j18m63N59J77m79%
4949h8J59j48n2N95k97l78K01Q4k82N9N73p51K2N21r0k34K89o2k71M2M11j60j09
4972C4Q9k19L67K43l35j82L9l1m8K99r0o12O94K8p00L36J08l25L81R1k91J40M4
4995F0M0l29O18l44j61L25j77k72J97k3J58p0K50l93k8N5L61o17N14Rm84K18O6
5018b7l83J59M35p6o5K46l97o5J77J94l01Mj2k36L39J02o00L92O6N2k39L76K69
5041D10o47L26J44l01p9L01j55K97J11o25l7N32m44M2N36o3k20q5j36L9J00n3
5063gk81M9L67l25P6L65r1k89kJ12R7O5K59n24J49Q1l77L38J35j23k80M90k28
$$ plain form
4907 -120 155 -207 -341 -444 -196 -495 -50 44 -324 -462 473 -162 -167 124 -338 -257 -2 245 -273 261 154
4928 154 -174 25 304 51 38 162 -251 -96 576 190 -41 141 131 -222 236 118 -345 214 391 -88 -88
4949 -88 71 -77 -129 466 169 -209 -8 76 -206 -147 426 -325 -303 218 128 -106 183 121 -150 -108 303 143 34
4972 34 123 -96 271 514 179 -3 36 5 -43 256 166 -446 248 276 -424 -88 20 -305 76 167 -124 16 60
4995 60 100 -229 389 45 -116 209 32 -240 -43 -66 92 22 272 -121 -149 -94 267 -350 164 173 -311 -93 -27
5018 -27 -410 -251 184 108 43 289 -108 -173 4 198 -103 -99 -111 -347 -8 94 -506 -114 -48 4 -235 141 410
5041 410 -237 89 233 -68 -147 154 -1 296 407 -218 -255 277 -167 -125 411 348 128 43 -93 -54 46 -7
5063 -7 -288 -239 128 -197 -121 244 153 -136 -138 -26 71 136 395 -129 20 101 -276 62 197 74 -206 284 56
5086E6l71L17r6J50k62L56k96j48J73L27l39M42j72m78O82k21m65M00K92p72P13
5107B88Q3r98K94N89k55N2L9J2k13q1K48o15N74K07j03k66L97k68L61l65J6R7
5129I3P8m6j95K59k73j68J92MK06j61K45j22k13N68m80K1q8j2j30M79j01l55L39
5152A40K6j84Q6O6l5k88N66jm43L5L84o50M09K08q03M08M84o47R7J43k83J98J96
$$ plain form
5086 56 -315 2 -94 56 -206 150 -146 -294 -121 206 -133 309 137 -341 341 120 -345 55 347 -425 288
5107 288 371 -627 -333 256 1 53 92 104 -109 -190 58 -557 17 224 121 -145 252 -16 345 -20 -4 93
5129 93 171 125 -70 189 -84 -252 -60 -56 150 -11 234 112 -101 467 -13 8 -80 -92 -222 257 156 -199 140
5152 140 166 -18 68 134 99 -189 377 376 -67 -32 352 -298 111 319 -484 -76 408 -239 -142 1 -282 -84 112
$$ [...]
8191b12
##END NTUPLES=NMR FID
##END=
