##TITLE=1H_Pr L_27
 CDCl3
 8 sc, 
 2.4.2024
##JCAMPDX= 6.0         $$ Bruker NMR JCAMP-DX V2.0
##DATA TYPE= NMR FID
##DATA CLASS= NTUPLES
##ORIGIN= UXNMR, Bruker Analytische Messtechnik GmbH
##OWNER= root
$$ XWIN-NMR		Version 3.5
$$ Tue Apr  2 15:43:23 2024 Russian Standard Time (UT+4h)  she@DPX200
##.OBSERVE FREQUENCY= 200.1309
##.OBSERVE NUCLEUS= ^1H
##.DELAY= (6, 6)
##.ACQUISITION MODE= SIMULTANEOUS
##.ACQUISITION SCHEME= undefined
##.AVERAGES= 8
##.DIGITISER RES= 18
##SPECTROMETER/DATA SYSTEM= spect
##.PULSE SEQUENCE= zg30
##.SOLVENT NAME= MeOD
##.SHIFT REFERENCE= (INTERNAL, MeOD, 0, 15.7039)
##AUDIT TRAIL= $$ (NUMBER, WHEN, WHO, WHERE, WHAT)
$$ ##TITLE= Audit trail, XWIN-NMR		Version 3.5
$$ ##JCAMPDX= 5.01
$$ ##ORIGIN= Bruker BioSpin GmbH
$$ ##OWNER= she
$$ F:/spectra/data/she/nmr/H-F/1/audita.txt
$$ ##AUDIT TRAIL=  $$ (NUMBER, WHEN, WHO, WHERE, WHAT)
(   1,<2024-04-02 15:42:20.87 +0400>,<she>,<DPX200>,
      <created by zg, POWCHK disabled, PULCHK disabled
       configuration hash MD5:
       00 E9 B6 7A A2 85 ED C7 34 08 36 98 17 FE 4E 26
       data hash MD5: 16K
       D2 85 7D 1C 7B A7 33 14 1F FA 34 C4 38 52 5E 41>)
$$ ##END=
$$ 
$$ hash MD5
$$ 2D 48 79 93 41 E4 7E 4F 30 24 15 C6 2B E4 A0 D9
##$RELAX= 
##$RELAX= 
##$RELAX= 
##$RELAX= 
##$RELAX= 
##$RELAX= 
$$ Bruker specific parameters
$$ --------------------------
##$DU= <F:/spectra>
##$EXPNO= 1
##$NAME= <H-F>
##$PROCNO= 1
##$TYPE= <nmr>
##$USER= <she>
##$AMP= (0..31)
100 100 100 100 100 100 100 100 100 100 100 100 100 100 100 100 100 100 
100 100 100 100 100 100 100 100 100 100 100 100 100 100 
##$AQSEQ= 0
##$AQ_mod= 1
##$AUNM= <au_zg>
##$AUTOPOS= <>
##$BF1= 200.13
##$BF2= 200.13
##$BF3= 200.13
##$BF4= 200.13
##$BF5= 200.13
##$BF6= 200.13
##$BF7= 200.13
##$BF8= 200.13
##$BYTORDA= 1
##$CFDGTYP= 0
##$CFRGTYP= 5
##$CHEMSTR= <none>
##$CNST= (0..31)
1 1 145 1 1 1 1 1 1 1 1 1 1 1 1 1 1 1 1 1 1 1 1 1 1 1 1 1 1 1 1 1 
##$CPDPRG= <>
##$CPDPRG1= <>
##$CPDPRG2= <>
##$CPDPRG3= <>
##$CPDPRG4= <mlev>
##$CPDPRG5= <mlev>
##$CPDPRG6= <mlev>
##$CPDPRG7= <mlev>
##$CPDPRG8= <mlev>
##$CPDPRGB= <>
##$CPDPRGT= <>
##$D= (0..31)
0 1.2 0 0 0 0 0 0 0 0.06 0 0.03 0 0 0 0 0.0002 0 0 0 0 0 0 0 0 0 0 0 0 
0 0 0 
##$DATE= 1712058140
##$DBL= (0..7)
120 120 120 120 120 120 120 120 
##$DBP= (0..7)
150 150 150 150 150 150 150 150 
##$DBP07= 0
##$DBPNAM0= <>
##$DBPNAM1= <>
##$DBPNAM2= <>
##$DBPNAM3= <>
##$DBPNAM4= <>
##$DBPNAM5= <>
##$DBPNAM6= <>
##$DBPNAM7= <>
##$DBPOAL= (0..7)
0.5 0.5 0.5 0.5 0.5 0.5 0.5 0.5 
##$DBPOFFS= (0..7)
0 0 0 0 0 0 0 0 
##$DE= 6
##$DECBNUC= <off>
##$DECIM= 32
##$DECNUC= <off>
##$DECSTAT= 4
##$DIGMOD= 1
##$DIGTYP= 9
##$DL= (0..7)
0 120 120 120 120 120 120 120 
##$DP= (0..7)
150 150 150 150 150 150 150 150 
##$DP07= 0
##$DPNAME0= <>
##$DPNAME1= <>
##$DPNAME2= <>
##$DPNAME3= <>
##$DPNAME4= <>
##$DPNAME5= <>
##$DPNAME6= <>
##$DPNAME7= <>
##$DPOAL= (0..7)
0.5 0.5 0.5 0.5 0.5 0.5 0.5 0.5 
##$DPOFFS= (0..7)
0 0 0 0 0 0 0 0 
##$DQDMODE= 0
##$DR= 18
##$DS= 0
##$DSLIST= <SSSSSSSSSSSSSSS>
##$DSPFIRM= 0
$$ [...]
##$SUBNAM2= <"">
##$SUBNAM3= <"">
##$SUBNAM4= <"">
##$SUBNAM5= <"">
##$SUBNAM6= <"">
##$SUBNAM7= <"">
##$SUBNAM8= <"">
##$SUBNAM9= <"">
##$SW= 18.0517689322627
##$SWIBOX= (0..15)
0 0 2 0 0 0 0 0 0 0 0 0 0 0 0 0 
##$SW_h= 3612.71676300578
##$TD= 16384
##$TD0= 1
##$TE= 0
##$TE2= 300
##$TE3= 300
##$TEG= 300
##$TL= (0..7)
0 120 120 120 120 120 120 120 
##$TP= (0..7)
150 150 150 150 150 150 150 150 
##$TP07= 0
##$TPNAME0= <>
##$TPNAME1= <>
##$TPNAME2= <>
##$TPNAME3= <>
##$TPNAME4= <>
##$TPNAME5= <>
##$TPNAME6= <>
##$TPNAME7= <>
##$TPOAL= (0..7)
0.5 0.5 0.5 0.5 0.5 0.5 0.5 0.5 
##$TPOFFS= (0..7)
0 0 0 0 0 0 0 0 
##$TUNHIN= 0
##$TUNHOUT= 0
##$TUNXOUT= 0
##$USERA1= <user>
##$USERA2= <user>
##$USERA3= <user>
##$USERA4= <user>
##$USERA5= <user>
##$V9= 5
##$VALIST= <valist>
##$VCLIST= <CCCCCCCCCCCCCCC>
##$VD= 0
##$VDLIST= <DDDDDDDDDDDDDDD>
##$VPLIST= <PPPPPPPPPPPPPPP>
##$VTLIST= <TTTTTTTTTTTTTTT>
##$WBST= 1024
##$WBSW= 4
##$XGAIN= (0..3)
0 0 0 0 
##$XL= 0
##$YL= 0
##$YMAX_a= 29827
##$YMIN_a= -99523
##$ZGOPTNS= <>
##$ZL1= 120
##$ZL2= 120
##$ZL3= 120
##$ZL4= 120
##$ABSF1= 10
##$ABSF2= 0
##$ABSG= 5
##$ABSL= 3
##$ALPHA= 0
##$AQORDER= 0
##$ASSFAC= 0
##$ASSFACI= 0
##$ASSFACX= 0
##$ASSWID= 0
##$AUNMP= <proc_1d>
##$AZFE= 0.1
##$AZFW= 0.1
##$BCFW= 1
##$BC_mod= 2
##$BYTORDP= 1
##$COROFFS= 0
##$CY= 11.3945322036743
##$DATMOD= 1
##$DC= 2
##$DFILT= <>
##$DTYPP= 0
##$F1P= 15.7292609196834
##$F2P= 12.9074282941183
##$FCOR= 0.5
##$FTSIZE= 0
##$FT_mod= 4
##$GAMMA= 1
##$GB= 0.15
##$INTBC= 1
##$INTSCL= 1
##$ISEN= 128
##$LB= 0.24
##$LEV0= 0
##$LPBIN= 0
##$MAXI= 10000
##$MC2= 0
##$MEAN= 0
##$ME_mod= 0
##$MI= 1.114404
##$NCOEF= 0
##$NC_proc= 0
##$NLEV= 6
##$NOISF1= 3.799351
##$NOISF2= 2.8
##$NSP= 1
##$NTH_PI= 0
##$NZP= 0
##$OFFSET= 15.70392
##$PC= 1
##$PHC0= -25301.84
##$PHC1= 15.38731
##$PH_mod= 1
##$PKNL= yes
##$PPARMOD= 0
##$PSCAL= 0
##$PSIGN= 0
##$REVERSE= no
##$SF= 200.130013532006
##$SI= 16384
##$SIGF1= 3
##$SIGF2= 2
##$SINO= 400
##$SIOLD= 16384
##$SREGLST= <1H.CDCl3>
##$SSB= 0
##$STSI= 0
##$STSR= 0
##$SW_p= 3612.71676300578
##$SYMM= 0
##$S_DEV= 0
##$TDeff= 0
##$TDoff= 0
##$TI= <>
##$TILT= no
##$TM1= 0
##$TM2= 0
##$TOPLEV= 0
##$USERP1= <user>
##$USERP2= <user>
##$USERP3= <user>
##$USERP4= <user>
##$USERP5= <user>
##$WDW= 1
##$XDIM= 8192
##$YMAX_p= 0
##$YMIN_p= 0
$$ End of Bruker specific parameters
$$ ---------------------------------
##NTUPLES= NMR FID
##VAR_NAME=  TIME,          FID/REAL,        FID/IMAG
##SYMBOL=    X,             R,               I
##VAR_TYPE=  INDEPENDENT,   DEPENDENT,       DEPENDENT
##VAR_FORM=  AFFN,          ASDF,            ASDF
##VAR_DIM=   8192,          8192,            8192
##UNITS=     SECONDS,       ARBITRARY UNITS, ARBITRARY UNITS
##FACTOR=    0.0002768,     1,               1
##FIRST=     0,             0,               0
##LAST=      2.2672688,     0,               0
##MIN=       0,             -99523,          0
##MAX=       2.2672688,     29827,           0
$$ Real data points
##PAGE= N=1
##DATA TABLE= (X++(R..R)), XYDATA
$$ [...]
1847C73q19n45O88R0Q25o53p66K13J20J065m53o53j79N8J171K57q83k13m27J023
1867B92M25n54mp35R25L37l09p0r56N95J93N84J03j072k95O72L36M60q56p22K69
1888c82P72M47o92k64j10M14O72j67o10k34j92Q70L21p19l18k20N75N04M5p80
1908f8m92O93M51J35m38r60K55Q75OK4o83J52L77M18J53j022j25Q7M37O83p44
1929B14n35J83M3J034m25n57j42l0J056k08l26o06r5R11L4r0k54q61O63O10j06
1950E13k65j179O71L51M77p9j066K78K23N91J97r05m45J24P94L3m38l27j64M29
1970a87Q86o15m13n17M25R26j11m84j76k56N67J72K9q65j58O44L33R7k55r85M33
1991e10M64M83j54q98J79K17O08Rq23j68NK63R06p52m42QL82P26o02l85m00M51
$$ plain form
1847 373 -446 -991 -303 -213 612 -41 -807 -594 -474 591 138 -515 -694 -636 535 792 -91 -304 -731 292
1867 292 717 163 159 -576 349 686 377 307 -649 -54 139 723 826 -246 -541 131 467 927 71 -651 -382
1888 -382 390 837 145 -119 -229 185 857 690 80 -154 -346 524 845 126 -192 -412 163 667 712 -68
1908 -68 -560 133 584 719 281 -679 -424 451 457 481 -202 -50 327 745 898 -124 -249 -162 275 958 214
1929 214 -321 -138 -95 939 514 -43 -185 -215 841 633 307 -299 -394 517 551 461 207 -654 9 619 513
1950 513 248 -931 -260 91 568 489 -577 -299 -76 515 712 -193 -638 -514 280 313 -125 -452 -616 -187
1970 -187 699 84 -329 -846 -421 505 394 -90 -266 -522 45 217 246 -619 -777 -133 200 297 42 -943 -510
1991 -510 -46 437 283 -615 -436 -219 389 398 -425 -593 -588 -325 581 -171 -613 -605 -223 503 -99 -484 -884 -433
2013d33R06m80o7p26J19O73M5J19q37l49R09K79R9l48m77K82J88N87k67p66L2
2034e12K98R96m88n69p2Q6Q51j78l43Q6o06O80P31k68o59n70L87J152m77j01q29
2055d05L60N12J12j50l68j04L90M09P9o69m38N73J34M07l95l92J9O6O30r3p35
2076e8j20J26N44K07p56k15q4O21N27p20P6o04P55N85n70n3o97LP67lQ6o98J1
2099b70N83O1K35q83k12N20o6O90m62o43J43J10Q03l36o62j40M02P59j27m65k65
2120b25O7K68L15k13n6p79Q07L61k14l83l58J88O00R6l70k85j50M05JL55o74k48
2142d92J86K86N66p40j64k6M12N01m65n83Q3j18P16m1m11k92j41Q95q9k40l73
2163e30m99P41L92j30j41q66L10Q27j50n8o80j44N78N18o5n64oj38L07N29m08
$$ plain form
2013 -433 473 -7 -74 -800 -681 -8 37 156 -681 -1030 -121 158 257 -91 -568 -286 -98 489 222 -544 -512
2034 -512 -214 782 294 -275 -347 -261 590 412 69 155 -451 229 960 692 33 -537 -150 1002 525 424 -405
2055 -405 -45 467 579 429 61 -43 347 756 835 166 -272 301 435 842 447 55 74 140 770 677 -58
2076 -58 -178 -52 492 699 -57 -272 -356 265 792 72 148 -456 299 884 314 261 -436 -433 334 331 417 -281 -270
2099 -270 313 374 609 -274 -486 34 -32 658 196 -447 -304 -194 609 273 -389 -529 -127 632 505 40 -225
2120 -225 -158 110 425 212 156 -623 184 545 331 -52 -410 -222 378 474 104 -181 -331 74 75 430 -244 -492
2142 -492 -306 -20 546 -194 -358 -384 28 529 64 -519 -436 -554 162 121 -290 -582 -723 172 83 -157 -530
2163 -530 -1029 -288 104 -26 -167 -1033 -723 104 -46 -104 -784 -928 -350 168 103 -461 -467 -605 -298 231 -177
2184a77k18K92m7N41m81l17L9J43M51K13o04M6k23N15J63n7j46m05N84L64j7l56
2206C03n41N15J02K81m52n37K16M29L66j2q61O8K49L09J89o02k3J03J84O58r33
2227A1O3k55O0P49k43k54m20L27N96j23m38l12l06Q52J80R4m07l92J55L85J58
2248D80l3o49Q5K66P1m2k33k11P66j23L32p89j97K28K87L66n59q9j90J34P38m58
2270A80k3n97L67O80l86J33m56n16P85Pp2k91o0J5L43L20m86m59L90J1N26l3q21
2293d43L71j8K56p5k76o2j06N07K01j01n45j09L7M59l0m75k24J70O60l37r1l53
2315e84j02O63J49n5l87j97M39J7K12k67m63O1L50J29Q8l74l06N0Q48l82k53M0
2337c24m38P20K92n35J6m86N19L24k21M7m08J98M46K35k74n95J10N67j65J76o99
$$ plain form
2184 -177 -395 -103 -150 391 -90 -407 -368 -225 226 439 -165 -119 -342 173 336 279 133 -272 312 676 659 303
2206 303 -238 277 379 660 208 -329 -113 316 682 670 -191 -123 126 435 624 22 -1 102 286 944 11
2227 11 74 -181 -121 628 385 131 -289 38 634 511 73 -239 -545 307 487 581 174 -218 -63 322 480
2248 480 447 -202 -117 149 220 178 -55 -266 500 377 709 -80 -277 -49 238 604 45 -44 -234 -100 638 180
2270 180 157 -440 -73 607 221 354 -102 -618 167 174 102 -189 -249 -234 109 429 -57 -516 -126 -115 411 378 -443
2293 -443 -72 -90 166 91 -185 -247 -353 154 355 254 -291 -400 -363 96 66 -409 -633 -463 197 -140 -231 -584
2315 -584 -686 -23 126 71 -316 -513 -74 -57 155 -112 -575 -514 -164 -35 53 -321 -627 -577 271 -111 -364 -324
2337 -324 -762 -42 250 -285 -269 -755 -236 88 -133 -86 -494 -296 150 385 111 -484 -374 193 28 204 -495
2358d95R5L28ML38m80kL74j71J27l42k03K63K24M30k99k73l0j95O72n3k47k9l62
2381c26M25L71k45k68J8j43M61j04j24l48o1N28R3j22l76p0N10J6K50j59k95L02
2403C33o0K11k26k51l48L83L04K39p18M77l75M64K04n77M2k79J64L84p7l09l31
2424c46K89N44n59K62p52J70O77q9M5p92K28N04K01j31m23j35K25L3N42n76m1
2445a24m0j69O06j92k04J17k67M54P5m23L4j84O04Mm51j00q7L10K23J09n24q7
2467c16K75J37j74L00n76O1K65J50L33o20m7m3J32M62m47m17J35LN63k69k13n
2489c11J20L50l85j0k07j26N12K01k21l2m70P00k08MJ2n27N07q4J41l8k75O8J8
2512b61M87R2o41mJ97mK80o0n21R3L53L37l57l55k5M15mJ47k90j88j61O10j04
$$ plain form
2358 -495 -400 -72 -68 270 -210 -212 162 -9 118 -224 -427 -164 60 490 191 -82 -112 -307 365 312 65 36 -326
2381 -326 99 470 225 -43 -25 -168 293 189 65 -283 -344 184 277 155 -221 -291 219 235 485 326 31 333
2403 333 273 484 258 7 -341 42 346 585 -133 344 -31 433 637 60 102 -177 -13 371 294 -15 -346
2424 -346 -57 487 -72 190 -562 -392 285 196 241 -551 -323 181 382 251 -172 -307 -82 -49 493 -83 -124
2445 -124 -164 -333 273 81 -123 -6 -273 181 256 -167 -133 -317 287 291 -160 -260 -347 -37 186 295 -229 -316
2467 -316 -41 96 -78 222 -354 -293 -28 122 455 -165 -212 -255 -123 339 -108 -525 -390 -387 176 -93 -306 -311
2489 -311 -191 159 -226 -236 -443 -569 -57 144 -77 -109 -579 121 -87 -83 -71 -598 -91 -175 -34 -72 -347 -279 -261
2512 -261 226 318 -323 -327 -130 -134 146 86 -435 -342 11 348 -9 -364 -389 26 22 169 -121 -309 -470 140 36
2535C6J99k95k45K12M32j22k85n14O75K36m8J78n19N5K07R1J11m77K30m68N60
2556B49K51o79K0J37Q8K34j50k89L9m2O41j15j97j75m4K38J53j65j79j33J36K63
2578B81K00m39m73L04J37K76k47m40K38L10k5L03n18j82M10L0J62m11P4l93M10
2599GL22m29J86k49L51J73o10K45N2j57K38r4N9j44q8J47OK76l07r1j1K26N19
2622F27m34m26L49j01M86l95o3J8k27N45j38j90j64Q5L42J8l77j04n5J37K80l9
2644A74k48l09J98P3J27q6o4o1L06k90J07k77j67K73N4L44m17j67L52R7M43m86
2666b4k03q6J01L41J65n68%QK33J40k34k8k52M35J23J04l10j90O3L70o5l8j56
2689g1l4J59L02l1m70p1J30j1O47n02RQ5j68O80n17k23P3J25J16J07n00j74K24
$$ plain form
2535 36 235 -60 -305 -93 339 217 -68 -582 93 329 281 459 -60 -5 202 293 404 -73 157 -311 249
2556 249 500 -179 -159 -22 66 300 150 -139 -100 -142 499 384 187 12 -32 206 359 194 15 -118 18 281
2578 281 481 42 -431 -127 10 286 39 -401 -163 147 122 425 -93 -275 135 165 327 -84 -10 -403 7
2599 7 329 -100 86 -163 188 361 -249 -4 48 -109 129 35 94 -50 -138 9 15 291 -16 -107 -118 108 627
2622 627 193 -233 116 15 501 106 43 61 -166 379 241 51 -113 -28 314 332 -45 -149 -204 -67 213 174
2644 174 -74 -383 -185 -112 15 -71 -135 -196 110 -180 -73 -350 -517 -244 -190 154 -263 -430 -78 19 462 -24
2666 -24 -227 -313 -212 129 294 -274 -274 -266 -33 107 -127 -155 -407 28 151 255 -55 -245 -182 188 123 85 -71
2689 -71 -105 54 356 325 -145 -216 -86 -97 550 48 57 142 -26 654 137 -86 -13 112 228 335 -165 -339 -115
2712a15L09K5j97J55l62K80L11l62J3k20K84j41j8K5k48M4M25J65Q1l61r2mM51
2735D48J9o76j3R4L66j8r3J84l15J60L23l17k63j89L44J26L47o67Q6m3K87J4k33
2758b9J0l15M33L06j52n0l19q2M34J80l10k44J77l24M70l8l58J17J66r4L19k49
2780D8k86J18K08P3j47k22M5K51o4j28J81j3m22N30n2j02k28q9K14J16J9k90j13
2803c53J97K01K89k68k87J78l4r9M42m69p7K09K00j57rj37Q3Q1L21l96j89M5L9
2826a90K74l3j01m59L80K89k19J30k43L6L1K93n2M9n03L58q2J74J5o04M79m04
2848c82O26j03k12P9j24J00J97L8n08J36n1M64n5pl30j92N85J56n18K33m02O60
2870C90j35J5m10K0L17P7k00k7k05l5N10J19l75m40N05o4K52l0l62O8L81l16N51
$$ plain form
2712 -115 194 219 22 177 -185 95 406 44 57 -163 121 -20 -38 -13 -261 -217 208 373 454 93 1 -3 448
2735 448 467 -209 -222 -128 238 220 127 311 -4 156 479 162 -101 -290 54 180 527 -140 -54 -97 190 204 -29
2758 -29 -19 -334 99 405 253 203 -116 -198 236 416 106 -138 39 -285 185 147 -211 -94 72 -22 297 48
2780 48 -238 -120 88 161 14 -208 -163 88 24 -104 77 64 -358 172 120 18 -210 -299 -85 31 50 -240 -353
2803 -353 -156 45 334 66 -221 -43 -77 -176 266 -203 -280 -71 129 -28 -37 -174 -91 -10 311 -85 -274 -229 -190
2826 -190 84 51 -50 -509 -129 160 -59 71 -172 -136 -105 188 136 185 -318 40 -42 132 147 -457 22 -382
2848 -382 244 141 -71 8 -116 -16 181 219 -289 -153 -204 260 205 198 -132 -324 261 417 -101 132 -270 390
2870 390 255 270 -140 -120 197 274 74 47 -158 -193 317 436 61 -379 126 62 314 284 -78 -10 371 55 606
2893F06m18j92j30K2K25k31M17l58Q1K97k92L16m22J81K14j17J31m70K25%J88
2914B73M0m49m9L73J62n8k68L9r1J44L17k75m31J57J21j9K55n13J54R6k5J18M3
2937A14J28m87L06j34K00Q8m39N1K67Q1k33p5j95N29j35K11l34k63L39j04K10
2958A25j32l00K53J23r2K3k90K37m4M39k0l91n2j98L38Nk10M01l24L7N7J73j96
2981c8o05P11J9L6q0j15j75M16k94N12n19k85K70K11Qj72k4m4k77N82J7m21J26
3004a41j6M66l72J93j7j55r3K22J07j88k36M63m53K41ok44L18M3k2r4k55J42J8
3027g9K08R0l16k29L06j48M30q7q9j59K05J90k26N9k2l06M93O7l57R6l22L52N
3050A61j48k5J70M7p2o4j3k06K09J5L5k12j09L02k44N40J4k89j84J25L9M15m75
$$ plain form
2893 606 188 -4 -134 -112 113 -118 299 -59 22 319 27 343 -79 102 316 199 330 -140 85 85 273
2914 273 313 -136 -185 188 350 292 24 63 -28 116 433 158 -273 -116 5 -14 241 -272 -118 -22 -47 71 114
2937 114 242 -245 61 -73 127 215 -224 -173 94 175 -58 -133 -328 201 66 277 -57 -320 19 -85 125
2958 125 -7 -307 -54 69 -23 0 -290 -53 -97 342 322 -69 -121 -319 19 24 -186 215 -109 -72 -15 158 -38
2981 -38 -643 68 87 123 43 -72 -247 169 -125 387 -132 -417 -147 64 72 -100 -124 -168 -445 137 154 -267 -141
3004 -141 -157 309 -63 130 113 -42 -135 87 194 6 -230 233 -220 21 15 -229 89 132 110 16 -239 -97 -79
3027 -79 129 219 -97 -326 -20 -168 262 175 86 -73 132 322 96 155 133 -173 320 387 30 126 -196 156 161
3050 161 13 -12 158 205 133 69 56 -150 59 74 109 -103 -212 90 -154 386 400 111 -73 52 91 506 31
3073C1k81N19j76m6k57J84J9p4O15j90l14l4l91O10K6l3k25k01K12J33J95o80
3095c58K21L12k3M1M6m44K42l2J37j68r8J99j98L5L75k91j21k6J81J47j3j57j26
3118a19m5K87j07K2r6k21K62M29n59k4l7L30L1r2k51j91M07l7R1l59R7J37o7J55
3142D3Kk07j58K11J44M4l01K17k2J52l4j64j52J22J67Km5k70j0Q1K36j9J52n08
3166c17M21l42J91J30j92o4J00K52q5j43k41L03k01K16K02k68j01J79j86J32J05
3187I1p4k96M01O1l18O8k83M65r4J15j72l59N26o7R8j45r6J9J92k30L05k97L4
3210e6M67m13L45q5n17J52M06m24L26q1r8J24o3m5j00J07M3K41P4l11l8MJ54R7
3234C09j08j01P5J63k14O5k89k29K47K45p0J24j13j96K98j79K83j58l38J61q9
$$ plain form
3073 31 -250 269 93 47 -210 -26 -7 -81 534 344 30 -4 -395 215 241 208 -17 -218 -6 127 322 -358
3095 -358 -137 175 152 193 239 -205 37 5 142 -26 -124 75 -123 -88 287 -4 -125 -151 30 177 164 7 -119
3118 -119 -164 123 16 38 -58 -279 -17 412 -147 -171 -208 122 153 61 -190 -381 26 -11 80 -279 -182 -45 -112 43
3142 43 45 -162 -320 -109 35 79 -222 -5 -27 125 91 -73 -225 -103 64 66 21 -249 -259 -178 58 39 191 -317
3166 -317 104 -238 -47 83 -109 -173 -73 179 94 -49 -290 13 -188 28 230 -38 -139 40 -146 -14 91
3187 91 17 -279 122 183 -135 -67 -350 115 21 136 -36 -395 131 64 162 17 -79 -60 132 -98 207 -90 -56
3210 -56 411 -2 343 258 -259 -107 299 -125 201 120 22 146 83 38 -62 45 88 329 403 92 54 58 212 309
3234 309 201 100 175 338 124 189 -100 -329 -82 163 93 217 104 -92 206 27 310 152 -186 -25 -114
3255a14M03n8k71L3J57J03n44L33P9k46K94n7p8j57l5J93o5m4j64k5K90P7k42
3278a38J98l76K09K27k59K18m45K60l3L21l13M00k85J09j22K5j60k0L63k34K91
3299B36k56J4J75l41k38N03q9l1j73L67M1Jj61m36L32J25P4m22M2J7K04J73l20
3322a63n4K84l50K36L3j54M5j03K28K1j75N1j07J55K14k69j3M9j53P2K11q4J48
3345A22m25M70o2j5j21k10K07K0k2M2m5p0Q6J95n1l67K24o5L69J24o28K09L4p
3369A4P3K9m7l51K09L86l76n0j27K29n8J22Pp2n7K18l03L96r2l25J92K65k47J68
3393B03l69N46j62k33J50k66l8K63P1J4q8o4P2P1J35m88K92r4j22L82n50L54o7
3416A2J9L27j72k22K03j74J87l59J54o7M1J41j60K22j51Rr0L64l09j19K42j52
$$ plain form
3255 -114 289 231 -40 -7 150 253 -291 42 121 -125 169 112 34 -123 -158 35 -30 -74 -238 -263 27 104 -138
3278 -138 60 -316 -107 120 -139 79 -366 -106 -139 182 -131 269 -16 93 -29 -4 -164 -184 179 -55 236
3299 236 -20 -6 169 -172 -410 93 4 -27 -200 167 208 209 48 -388 -56 69 143 -279 -237 -220 -16 157 -163
3322 -163 -217 67 -283 -47 -14 -168 -123 -226 2 23 -152 -101 -208 -53 161 -108 -121 -72 -225 -153 58 -26 122
3345 122 -303 167 105 90 -31 -241 -34 -14 -36 6 -39 -109 -23 172 121 -246 -22 -87 282 406 -222 -13 21 14
3369 14 87 116 69 -282 -73 313 -63 -113 -240 -11 -69 53 60 -12 -69 149 -154 242 150 -175 17 282 35 203
3393 203 -166 380 218 -15 135 -131 -169 94 165 179 91 27 99 170 305 -183 109 15 -107 275 -275 79 12
3416 12 31 358 186 -36 167 -7 180 -179 -25 -92 -51 90 -70 152 1 10 -80 284 -25 -144 98 -54
3438e4j19L22k12m9M0J07J6Q4n03M90J66j12j18j54J51ll87L20J31k10J92m67
3460c69J15P5L40l0j06nj59K75k09J9K19l58J47P6j95M1Q8J15k38K19oj00N3j05
3484i8O7l3L3j71L38k73K26p9j35L17r3l59K42J79J09n29J00q0%K94Q2r6k23M63
3508B81j32j05J90m90m8K95j00P36k54l07n7O1k82N19j67L9k82L84l27J96j22
3529B8l38N97J6l00L5K0r4N6J19j27p9J36j84J66k50K65j19L7K3N49k47l62P2
3552A9J31J55j92p6j46R3l0J02j57K81j09k4k38K67K01l50L61j10l9j21n6J15
3574G7jk9q9r7j3L64k64K44j18j13l6J42K32k94O8O6J22j39j21q5n9J59J11J18
3598B45l09J69o3K33k03j84L86l86J69J02O2l04k48K87M28k66Ok00K52j1k61J47
$$ plain form
3438 -54 -173 149 -63 -112 -72 35 51 135 -368 122 288 176 58 -96 55 52 -335 -15 116 -94 98 -369
3460 -369 -254 -179 161 131 25 20 -139 136 -73 -54 165 -193 -46 30 -165 -124 -36 79 -159 60 54 -46 7 -98
3484 -98 -31 -64 -31 -202 136 -137 89 10 -125 192 99 -260 -18 161 270 -259 -159 -239 -239 55 137 41 -182 281
3508 281 149 44 234 -256 -304 -9 -109 627 373 66 9 70 -212 307 140 179 -103 281 -46 150 28
3529 28 -310 287 303 3 38 58 -36 20 139 12 -67 69 -115 51 -199 66 -53 -16 7 556 309 -53 19
3552 19 150 305 113 37 -109 -16 -46 56 -101 180 71 47 -191 76 277 -73 288 178 139 18 -38 77
3574 77 76 47 -42 -139 -152 212 -52 192 74 -39 -75 67 299 5 73 139 261 122 1 -84 -143 16 127 245
3598 245 -64 105 42 275 72 -112 274 -112 57 159 221 -83 -331 -44 384 118 124 -76 176 165 -96 51
3620E1k93rQ2j07K51J30p5j51q2M27k89n8K3J56j92m7K14m7o5n9J80Q0L7j87P5
3645D5p5J09j78m54K47M74j60j31j17K19j78L83p4k39L1J58O8k75J86K39j20j73
3667a5K81k81L8k84K28M34o35L94j14j55K29r6R3k07J29k27K11N0p4n9J68J88
3689B96m21J38k25R2J47k9K58j00j34j13J53K70l85p6J97j54J3L72q6k14O4K31
3711B94k69J1J97k97J83J24m40l2m2J70J77l7J26k02J74J75j00j91O4K30k64j68
3733a17J42k1j21j2R1P9l10J99o6M95m47L4k56K69K25j79l30K45j02L15K6p7j25
3756d3n2K39m23J00L49j36q0R8m02N93l01n5J80m8%Lp7J08l67K58qq1K48n0k6
3781B7R3j20k30J38O8P1k39mK13j88Q9R1j23J18jN4k08M04l27J82l04Q5N8L0j87
$$ plain form
3620 51 -242 -251 -169 -276 -25 105 30 -121 -203 224 -65 -123 -100 56 -136 -183 31 -16 -81 -140 40 120 157 -30 45
3645 45 -30 79 -99 -553 -306 168 8 -123 -240 -21 -199 184 110 -129 -98 60 128 -147 39 278 158 -15
3667 -15 266 -15 23 -261 -33 401 -234 160 46 -109 120 24 117 -90 39 -188 23 73 -1 -60 108 296
3689 296 -125 13 -212 -120 27 -2 256 156 22 -91 62 332 -53 -129 68 -86 -73 299 213 -1 63 294
3711 294 25 36 233 -64 119 243 -197 -229 -271 -101 76 39 165 -37 137 312 212 21 85 315 51 -117
3733 -117 25 4 -117 -129 -38 41 -269 -70 -136 359 -88 -54 -310 -41 184 5 -325 -80 -182 133 159 82 -43
3756 -43 -95 144 -279 -179 170 34 -46 52 -350 243 -58 -113 67 19 19 22 -55 53 -314 -56 -64 -145 103 53 27
3781 27 120 0 -230 -92 -24 47 -192 -196 17 -171 -82 9 -114 4 3 57 -151 253 -74 108 -196 -111 -53 -23 -210
3806b10L72J30k16k12J35p5LQ7q8J11j76J62J04k01Kj16J42Q2O4M1j14k29r5K68
3830b9M9L2J5p2M5j35q3n2K52j51M17k04k34K22j76K32J87n10l4K64r1K32j60
3853A6j30K00n8l4q0O9k3n4K25L67m04m7OJ39m6j56K13j65j80L06j86j6L31k72
3877B1j9J84p4k72L89k47j49M25l11j79M60l3m29L34K2k70M3J70K9k24K68j36
3899Bol3J49k61L5K22J96l48L0J21k99J40P4O6L3k48J65M5Q8j97p5K3M32l78r9
3924a23K51lr8j23R1j96L24j99K15k04JJ08L1J61n23L22Q3n60K55J72P0k28J41
3947c2K59l08k01K05J10k2J97k01l0j86O7J91j55K18L0j82r7J13l13L22k17K62
3969C0j30J93q7l3p1K8Q8n8o9K73l01K34J41k34k10L32k56P3J80l44J04L05k46
$$ plain form
3806 -210 162 292 76 -136 -1 -76 -73 14 -74 37 -139 23 127 -74 -72 -188 -46 36 100 141 27 -202 -297 -29
3830 -29 20 52 67 -5 40 -95 -178 -230 22 -129 288 84 -150 72 -104 128 315 -195 -229 35 -56 176 16
3853 16 -114 86 28 -6 -86 -17 -40 -94 131 498 94 47 53 192 146 -10 203 38 -142 164 -22 -38 293 21
3877 21 2 186 112 -160 229 -18 -167 258 -53 -232 228 195 -234 100 122 -148 -105 65 94 -130 138 2
3899 2 -4 -37 112 -149 -114 108 304 -44 -14 107 -192 -52 22 88 121 -127 38 83 171 -26 -101 -78 354 -24 -123
3924 -123 128 125 27 -96 -5 -201 123 -76 139 -65 -64 44 75 236 -287 35 118 -442 -187 -15 55 -173 -32
3947 -32 227 -81 -282 -77 33 11 208 7 -23 -209 -142 49 -106 112 142 -40 -137 -24 -337 -15 -232 30
3969 30 -100 93 6 -27 -98 -70 18 -40 -109 164 -137 97 238 4 -206 126 -130 -57 123 -221 -117 188 -58
3992e8R6k87J65P0J18l69Q6J97n6j17L8K25j5qj30J1kn6Q7p6N5K10q5J19k52J69
4018A35m0j11O7k23J45P7o8j5R8p1J07k35L32k69j59K76p5l9P1q6J94l52j94M71
4042C6K35k40M6J72o4k69NK96n7L2q2l68J36J18P9n0J91j00m6N6j10L9j81R1K2
4067a3r7K27o9J7r5R5k9N0j96O3j50N48j84k13K34j71j18J85Nk41L75l60J78o1
4091b0R0J3J70j87P9K3Oj06k51K13K71p2j06j59J2o3k18L10j12Q8J9Mp4j76K08
4116c8N8r5L5j27Q6rP3k81K92j01O7K34q4k9J85l11K10o3L4k87J89L09k90J76
4140B33n13M78k8m73L38M1j00K12k09p2j05M38k50k72N05k48L10l37Oj39L74k25
4162c6J35l33J28Q8Q4Q2o8p2l11M18M2j70m3J14q8K77k97l7J04P8P5Q6l91J97
$$ plain form
3992 -58 38 -249 -84 -14 104 -265 -179 18 -38 -155 -117 108 93 85 -45 -34 -36 -92 -5 -81 -26 184 99 218 -34 135
4018 135 95 -16 51 -172 -27 50 -18 -33 65 -6 101 -134 198 -71 -230 46 -29 -68 3 -83 111 -241 -435 36
4042 36 271 31 77 249 185 -84 -79 217 160 192 110 -258 -122 -4 75 25 216 116 70 126 16 55 -126 -35 -13
4067 -13 -110 117 48 65 -30 65 36 86 -110 -47 -197 351 167 -46 188 17 -101 84 89 -152 223 -137 41 -20
4091 -20 70 83 253 66 145 168 174 68 -183 30 301 229 123 -36 -24 -87 -305 5 -107 -19 0 4 -70 -246 -38
4116 -38 20 -75 -40 -167 -81 -90 -17 -298 -6 -107 -40 194 110 81 266 -45 165 102 136 -151 38 347 57 233
4140 233 -280 198 170 -303 35 76 -24 188 -21 -93 -198 240 -10 -282 223 -25 285 -52 -46 -185 189 -36
4162 -36 99 -234 -106 -18 66 148 80 8 -303 115 157 -13 -56 58 -30 247 -50 -87 17 95 170 256 -135 62
4186F2K27l07j56NK93k58L16k08j54P8K37L0R9k69Lj9N5J8k09J37J51n4j66J44
4210E5Jk28J8N15m88K99Mj89o0K5P6L4q8j8OJ47R5k04L2Q6J04j88j25K0O2J4p1
4237f6J76q2l0j87K4N1R5m3N9p6J65k45L6M3K98k53l3R7M4n2pj01K08mql79N9
4264b11J75n6J48N6o3l08K52J97qj86j97K18l4kr0K28m16L52m49O35N2k88q5L12
4288B32k80q0K30r3j28J07J59O5k59J61l14K33M6m54N33k69O7k5j04J86P8l09
4310b18MJ35j42K21Q9j54j20k7K50j26k3L16l8j58J08j1o9j13n8J55k03J97k48
4333b33J49P9r0K1J06j62N12m53%L03p4J8j65R4l05K85J64k98Q7j05P7pjoJ47
4358A43k05K80l23L09o0r0l47M13N2l05o1K13R4R2k5K0j16o1J07j54P2J0p6K05
$$ plain form
4186 62 289 -18 -174 -169 124 -134 182 -26 -180 -102 135 165 264 -5 -2 -21 34 52 -157 -20 131 77 -89 55
4210 55 56 -172 -154 361 -127 172 176 -13 -73 -48 28 62 -26 -44 -38 109 204 0 32 118 222 34 -91 -71 -9 5 -66
4237 -66 110 28 -2 -189 -165 -114 -19 -62 -3 -79 86 -159 -123 -80 218 -35 -68 29 73 21 14 -87 121 117 109 -270 -211
4264 -211 -36 -92 56 112 49 -259 -7 190 182 -4 -201 17 -17 -19 -109 119 -297 55 -394 241 293 5 -80 232
4288 232 -48 -128 102 9 -119 -12 147 212 -47 114 -200 33 79 -375 158 -111 -44 -69 -173 13 91 -218
4310 -218 -214 -79 -221 0 89 -65 -185 -212 38 -88 -111 205 167 9 117 106 37 -76 -134 21 -182 15 -233
4333 -233 -84 -5 -95 -74 32 -130 382 -71 -71 232 158 176 11 105 -200 85 249 -49 38 -67 10 3 2 -4 143
4358 143 -62 218 -105 204 144 54 -293 120 172 -133 -194 19 113 205 180 200 84 23 130 -24 48 58 -18 187
4382A87j32J47l39j2K95j05k05J26K9m09M41J96k20j83J96j35R8N1JJ19L0j90
4404a4K4J88r1L3j64m3J70J15l65Q8j57K66j16J09K42k9k35j43N16m14J90l56
4426a86j0M73j70k39L5K96j16j11j18L24k17J05m6J11N6j45J68j07l38P5L33k15
4448d2K3j56K99k75J04J22j37J09k11K71J40k00j97O1J0J4J1O6k72N09j85q8P
4471a7N9N6j33qJ07j09O0k4N4nl08K84o8k5J13J14l08K12J83L8l42rJ65j31j55
4496a97K59r5K00k52K17j11M3J31m11J91k49L99P5j78k4K13J11j22k13L5K15k69
4518c2J86l45J64p4J15j9j24O7Q6P8k90L25j83K23k25L76l60P3j76k6K05p0J92
4541A66k29L77K0k16j98J44j66J5J47M2J11k71J0n0J28J06P9l11k4J56J3j42j57
$$ plain form
4382 187 55 202 -137 -149 146 41 -164 -38 -9 -418 23 219 -1 -184 12 -123 -25 26 27 146 176 -14
4404 -14 10 198 107 140 -24 -67 103 218 -147 -59 -216 50 -66 43 285 256 21 -122 394 -20 170 -186
4426 -186 -196 277 107 -132 -97 199 83 -28 -146 178 -39 66 20 131 187 42 210 103 -235 -160 173 -42
4448 -42 -19 -175 124 -151 -47 75 -62 47 -164 107 247 47 -150 -89 -79 -65 -54 12 -260 249 64 -24 -17
4471 -17 42 98 -35 -43 64 -45 15 -9 45 40 -268 16 -52 -77 36 150 -158 54 237 275 -67 -76 89 -42 -197
4496 -197 62 -33 167 -85 132 21 64 195 -216 -25 -274 125 200 22 -2 211 322 200 -13 22 237 -32
4518 -32 154 -191 -27 -101 14 -5 -129 -62 24 102 -188 137 -46 177 -48 328 -32 41 -135 -161 44 -26 166
4541 166 -63 314 334 118 -80 64 -102 -87 60 102 213 -58 -48 -98 30 136 215 -96 -120 36 49 -93 -250
4564b50M00j31r0J60j9o4nn0L3k08K40rk26K67R9n1r7k3k24N28j53ok42N4q4J60
4590IR0Q4j71o2Q1J72k19L8J98j60M7k61J43k62L09J70j94j42p0M39l30Q5j8J30
4614A06p0p4J04J4k09K4J93J25J7k42R5j42o4J62L25o09M34q8n7k67L10K1r8K1
4638C1J10jj19m3O4k11L47rl26R8J92j1j06K7n1j03P0lK02L9J4j67j51R7j46N4
4664a02P2K04l52R5J32j61O4O0J63j97P3j15j1L62j05k26q1K34p7J69k85J27m5
4687bj78j03L96l7k74L43j34N5k70M80l51k89L00L9K06j18J06l73L24k61K21k7
4709E3j81M19l00K50m28J16J71J0j58L2J71j61J27j73O7J29l02J68J13O1P3o17
4731c60K99J37J37o8J22M4k31k4l09L76j56R8J00k45P0P7j13K09n3J9k11o1K54
$$ plain form
4564 -250 150 19 -71 89 70 6 1 -49 -16 -224 16 7 -219 48 147 96 -1 -24 -248 280 127 121 -121 -67 -151 9
4590 9 99 183 12 -50 31 203 -16 22 220 60 107 -154 -11 -273 36 206 12 -130 -200 239 -91 -6 -24 106
4614 106 36 -38 66 80 -129 -105 88 213 230 -12 83 -59 -123 39 364 -245 189 101 44 -223 87 108 10 31
4638 31 141 140 21 -22 42 -169 178 169 -157 -59 133 122 16 43 -8 -111 -41 -44 158 197 211 44 -107 -10 -156 -102
4664 -102 -30 174 -178 -83 49 -112 -48 12 175 -22 51 -64 -75 287 182 -44 -125 109 32 201 -84 43 -2
4687 -2 -180 -283 113 76 -198 145 11 66 -204 276 -75 -364 -64 -25 181 63 169 -204 120 -141 80 53
4709 53 -128 291 -9 241 -187 -71 100 110 -48 -16 155 -6 121 -52 15 144 -158 10 123 184 257 -360
4731 -360 -61 76 213 145 267 311 80 56 -253 123 -33 65 165 -80 -10 67 -46 163 110 129 -82 -143 111
4754A11j89m8J28Nm1J77j46j87K63l15K00J91j8q3j44L1P9L1k72N80l04r6j63
4777b10K4J65j59J82L2k10K08j19K06k37J37k1N0rJ62k12O1q5J15j2j32L08J3
4800B57m11K37r4l42K55K90k15j7M6k61K98o4r7J34rM2j67J8K04N9l61J13L9J02
4824E6q1q9j4N2J80j80L09j25j3k05J38j2J38m42K59j88n3K89O3n9J46j95L81
4847C55k98J21j97l1J99q2o4J17j47J45n1k82J88J76l71K17J3R8j80P1K1p1o7
4870a20J80J37m3k62K75kk80K82K4k31J02K5j29q0L37k26J1K60k7j32j4j47k68
4893c28M8N70m03Lj43J92K16nk32K43K7l16K56j34K27m31L61N8j02l87N29n6p4
4916A19J8l08K60k6q9j14n9K68j94K1K25k28J78k80k2L29L0mk71J42l3r0J7J11
$$ plain form
4754 111 -78 -126 2 7 -34 143 -3 -190 73 -242 -42 149 131 48 -96 -65 14 45 -227 353 49 -47 -210
4777 -210 -186 -21 -180 2 34 -176 32 -87 119 -118 19 -2 48 39 201 -11 50 -35 80 68 -64 244 257
4800 257 -154 83 -11 -353 -98 192 -23 -40 6 -255 43 -21 -118 16 7 49 -118 -100 104 163 -198 -85 -46 56
4824 56 -25 -114 -128 -76 104 -76 233 108 95 -110 28 16 154 -288 -29 -217 -270 19 82 23 169 -26 355
4847 355 57 178 -19 -50 149 67 3 120 -27 118 67 -215 -27 149 -222 -5 8 106 -74 -3 18 -53 -120
4870 -120 60 197 154 -108 167 165 -115 167 191 -40 62 87 -42 -122 215 -11 0 260 233 101 87 -60 -328
4893 -328 -280 290 -113 -110 -253 -61 155 150 -82 161 188 -128 128 -6 221 -210 151 209 107 -280 249 193 119
4916 119 137 -171 89 63 -26 -140 -199 69 -125 -104 121 -107 71 -209 -231 98 128 124 -147 -5 -38 -128 -111 0
4940@J16j30K2n2j00J92p1k6R8k7j22J91j10p1LJ80k16M6O9j18j54K50J02j7k99
4965b44L35j16M3J81k33L8K63k05p1j3K42l73K17k7L7J23K2n3j64R1j44J94m9
4988I4j82J79j11j15J36p4M1L13n51K76P8j09O6j30L51k16rj8J10o7p9j42K24
5011F5m6j44J39K3Qk53K46o1L1j92J56M00l12n4j25L28j59q6J52j22j42J03K03
5034A58l73J66O4k5K5kPL32l06n1J2J20k06K7Q9j04K6M2R7k10R5n3l1J95k05K53
5060A42r0j83K43k34K0l6J7K18p2Q5K14k87j47K07j70J48r6N7L7n7J31J79j22
5083B04j24j85L57j43l1J3m5j21nJ98k07O7K2k51K28J25j01K8j30J22k15K17L3
5106E6m5j5K05k72JJ14j67JPM5L85l89k83O36pj41k10P1K41j19j16j22j91L64
$$ plain form
4940 0 116 -14 8 -44 -144 48 -23 -49 49 22 -100 91 -19 -90 -87 93 -123 -77 -8 -126 -280 -30 72 55 -244
4965 -244 91 -25 18 199 -34 4 267 62 -9 -22 220 -153 64 37 74 197 219 166 2 93 -51 143 94
4988 94 -88 91 -20 -135 1 -73 -32 281 -270 6 84 -25 41 -89 262 46 37 19 129 62 -17 -159 65
5011 65 19 -125 14 37 45 -208 38 -23 8 -184 -28 372 60 6 -119 209 50 -36 116 -6 -148 -45 158
5034 158 -215 -49 15 -10 15 13 20 352 46 -5 7 127 -79 -52 37 -67 -41 1 98 -112 -17 -70 -101 94 -111 142
5060 142 52 -131 112 -122 -102 -138 -121 97 25 110 324 37 -110 97 -73 75 -21 36 73 16 147 326 204
5083 204 80 -105 252 109 78 91 46 -75 -80 118 -89 -22 0 -251 -23 102 1 29 -101 21 -194 23 56
5106 56 11 -4 201 -71 -70 44 -123 -122 -115 -70 315 -74 -357 279 272 131 -79 -8 233 114 -2 -124 -315 49
5130D9P9rr9R3oj70lN9J48k46o1L47j61nO3j7q0J33k51R4K62l37J61KK35l07J31
5157A04j37O4J57l41K46l8j55M1K29j55J7J14k96K82l20L22j80K35m6M3k26L37
5179B97m0j81J98k53j29K11M9j09k24J74L74m08k76K38J76k23L15l51M8P6j1Q2
5201C3k05L09j95rK4J23Q4k32j2O9J94k04J7J33r6Q5r5J64m3k07R7Q4k5j31l5
5226g3K64j78O2j59Mr9Q0R4M3K13k46J3q3n3L7J08J4R3r7j49K22jL8l47J71Q0
5252E1m01M00mj27K20k25p6J49K61k73j90M66l25J87j58J3J66m23K44j15J61n9
5274e8j83MK49M0K6O9k45J40n2%j77K18j7j4j88L97k46J61J09l27J6K99p0P2k35
5299a2K26m84M85j97J6P6j37Q9J20R4m11jJ74Nk20lK58l57O3L07l23K22M8p9K16
$$ plain form
5130 49 128 119 20 113 107 -63 -66 -7 141 -105 -166 181 20 15 78 61 -19 114 -137 -43 219 -118 43 45 280 -27 104
5157 104 -33 31 188 -153 93 55 -100 -59 170 15 32 146 -150 132 -188 134 -46 189 143 186 -40 297
5179 297 257 76 274 21 -108 103 152 43 -181 -7 367 -41 -317 -79 97 -126 189 -162 -114 -38 -49 33
5201 33 -172 137 -58 -67 -43 80 164 -68 -80 -11 183 -21 -4 129 33 118 23 187 144 -63 34 118 93 -38 -73
5226 -73 191 13 75 -84 -80 -179 -99 -5 38 251 5 18 -65 -118 -81 27 41 134 37 -112 110 109 147 -200 -29 51
5252 51 -350 50 46 -81 139 -86 -162 -13 248 -25 -215 251 -74 113 -45 -32 134 -289 -45 -160 1 -58
5274 -58 -241 -237 12 52 78 147 -98 42 -10 -10 -187 31 14 0 -188 209 -37 124 233 -94 -78 221 151 223 -12
5299 -12 214 -270 215 18 34 110 -27 62 182 276 -135 -136 38 43 -177 -180 78 -279 -216 91 -232 -10 38 -41 175
5324A75j48j09P6j38L68j01n3l6n7O0q4M4J59j04j4K66m89J54L2K82j06j33j42
5347i8J75o9Mk35M19J67l31r2K75j57r3Q8J56n6j55K46l04J33j64k9M18m31J72
5370C9J38k19L1k34J81P1J69l42L05j24q2n3K36j84j7K23j40j0K94j51j03l6m6
5393e4j6r2L90l23n0n1P1j59M10n9j80J81N2k88J6j5L41j80j51K5N5J10O3o5K8
5418E9lk18L68q8k16K36J63j56k0k02J4P9K68n21J59J03p7P2j56K67K8j97K59
5441B21j76j42o6KL72r9j88K46k07J87m19J01L12j57j70J8J73K03m3k85R5m8j99
5464b69M47Q9l26r5J23M3j55K84j82J0J14N5j26q7K97k85J9J82k51J76p3k36J63
5487h3J95J0j79J04j10P8j50J37J97n5q2j70R8K38l8k88nK23K6j29k00J39M14
$$ plain form
5324 175 27 -82 -6 -144 224 123 70 34 -23 37 -47 -3 156 52 38 304 -185 -31 1 283 177 44 -98
5347 -98 77 8 12 -223 196 363 32 -60 215 58 -35 53 209 153 -2 244 -60 73 -91 -120 298 -133 39
5370 39 177 -42 -11 -245 -64 7 176 -166 139 15 -67 -120 116 -68 -85 138 -2 -12 282 131 28 -8 -54
5393 -54 -70 -162 228 -95 -145 -196 -125 -284 126 67 -113 68 120 -168 -152 -167 174 -6 -157 -132 -77 33 96 31 59
5418 59 56 -162 206 118 -98 138 301 145 125 -77 -63 16 284 -237 -78 25 -52 20 -136 131 159 -38 221
5441 221 45 -97 -163 -161 211 112 -76 170 -37 150 -269 -168 144 -13 -183 -165 8 211 168 -117 -22 -70 -269
5464 -269 178 267 -59 -154 -31 12 -143 141 -41 -31 83 138 12 -75 222 -63 -44 138 -113 63 -10 -246 -83
5487 -83 112 122 -57 47 -63 15 -135 2 199 144 62 -108 -10 228 190 -98 -103 120 146 17 -183 -44 370
5510C70m17L84k24l68L33l87j4J83Q3L7J74k14K75m25L77n7j72L68l86m6M4J05
5532B3j23O4KmL5n1O6k26K39j3O4R9j00m1j14R7m4m3j97K50o6J7J47j79J01l4
5558c1J03j50j20K56k92J42rL66m09L48m13J19%n0J72NL22l12roQO4k94J80J4
5583Dq8K37j72m0l5J78J23k74j54L09J2J7q0nk40M13l3k38K7J75j21k86M36k7
5607A38j08j03L0J05j56N6M2O6j08j00j26K69L07k80J52k35M20l33J6P9j52r1
5629a12J60O8K01k48p9m1K9K0r4k9o3J57J0j15K11j56N7L22m33M23l64J37Ll5
5653B9J30q4n9l24J94Q0L31p6k04JK47m16J70k41J72p0J13j0K82o2k53J90j83
5676d3J57l46M04j82q6J36k83L83l22m6K43p5Q9j23J17q8K32j45j3P9O3k41lk7
$$ plain form
5510 370 -47 337 113 -255 78 -309 -323 -140 -57 -20 154 -60 215 -210 167 110 -62 306 -80 -126 -82 23
5532 23 -100 -36 -34 -38 -3 -54 12 -214 25 12 76 175 75 34 -80 17 -27 -70 -267 -17 -83 -66 81 -98 3 -31
5558 -31 72 -78 -198 58 -234 -92 -101 265 -144 204 -209 -90 -90 -140 32 37 359 47 38 32 40 104 -190 -10 4
5583 4 -84 153 -19 -59 -94 84 207 -67 -221 88 100 117 37 32 -208 205 172 -66 -39 136 15 -271 165 138
5607 138 30 -73 -43 62 -94 -38 4 70 -38 -138 -264 5 312 32 184 -51 369 36 52 131 -21 -112
5629 -112 48 116 317 69 -10 -51 -22 -2 -96 -125 -188 -31 -21 -136 75 -81 -24 298 -135 288 -76 61 64 29
5653 29 159 75 16 -308 -114 -34 297 221 17 18 265 -151 19 -222 -50 -120 -7 -17 265 203 -50 140 -43
5676 -43 114 -232 172 -10 -96 40 -243 140 -182 -228 15 -60 29 -94 23 -65 167 22 9 88 151 -90 -93 -120
5700a20k4r8K45J36j17J08m6lj34J10j06o5j38K04K8m4K86j18j82K10j43n9J13
5723D3J08k24J05L3l2m79M98n9j1J14l71K71r1o7L96M7k32J29j53k95J16L78k97
5746g3P8M5k27K41jj77J59n1Q9j71J29j6p6k2lP9n8K70k66J53l05J64Q0K4m1N2
5772G6j30m6j63L31J00l53J03L5M9j00M3P6K62m77J80n9Nj0O1K37n5k64oN3Km5
5798i5J0O7R3J34l94Q8n4K48m5K08l53L2M0%o7j63J29j97L42j37M0OOk00L95j95
5824f2Q0J09k75J84J17n4k18M7J19J74k84m5N0R9K1J37k48J53J56j30m79N82n6
5847A77j13j51jl4O0N2q6j02J90j35K38l6LR5m33M77j17j35J15l90K37l2K30j32
5871b3j82M41k36j41J91j6N2l27J48J2j37J49L53k42k22J95K7J04j25k55L87q4
$$ plain form
5700 -120 -144 -242 3 139 22 130 84 81 -53 57 -49 -114 -252 -48 -20 -64 222 104 -78 132 -11 -70 43
5723 43 151 -73 32 65 33 -446 52 -7 -18 96 -275 -4 -95 -162 234 281 49 178 25 -270 -154 224 -73
5746 -73 5 50 -177 64 63 -114 45 -6 83 -88 41 25 -51 -73 -76 3 -55 215 -51 102 -203 -39 41 65 24 76
5772 76 -54 -100 -263 68 168 -185 -82 -47 2 -98 -55 21 283 -194 -14 -73 -68 -78 -17 220 165 -99 -105 -52 -50 -95
5798 -95 -85 -18 75 209 -185 -97 -151 97 52 260 -93 -61 -21 -21 -88 -251 -122 -319 23 -114 -74 -68 -62 -262 133 -62
5824 -62 18 127 -148 36 153 99 -119 -72 47 221 -63 -108 -58 41 62 199 -49 104 260 130 -349 233 177
5847 177 64 -87 -88 -122 -62 -10 -96 -198 -8 -143 95 59 62 157 -276 201 84 -51 64 -326 -89 -121 109 -23
5871 -23 -205 236 0 -141 50 34 86 -241 -93 -81 -218 -69 284 42 -180 15 42 146 21 -234 153 69
5893F9j41M1J04j31q4j0J87j92K31r7J16r5j35K40k75J19J44L1k12L16j73P3r2
5916C4j11N8J94j06M9J05j17J04l05J10Mj27j1K48j00L7l4r7L6J92j69k38K83
5939C9k11L15j36k84K41r8J61J54k49p4K98j72o1J84O9o5l0R5j12jL8m43L85j40
5963i7J67k91L12k1k06K09j57K06k5l8j04N1j17K0O7J00j64M5J68j89O5kK69j77
5987I1j30J44K6j97q0n9J27K31k92L16j97K14n4k48L04j40k62K08N9j37l06O38
6009B56k75m0K13j07R8j91j3l3J05J53l07R5kJ6j44l7L26n0Q8j43j71J48j13J0
6033a18M10n91L56R9j8k42J7K45K3j46j31J95l13L46Q4l18Rq6M46k87J76j18j4
6056B4J02l78L16q6n5K5j42j2K36j9P5p2j90J32j55J74O0J09j77j60M08k54R3
$$ plain form
5893 69 -72 -31 73 -58 -142 -152 35 -157 74 -23 93 -2 -137 103 -172 -53 91 122 -90 226 53 126 34
5916 34 -77 -19 175 69 118 223 106 210 -95 15 19 -108 -119 129 29 66 32 -65 -29 163 -6 -244 39
5939 39 -172 143 7 -277 -36 -134 27 181 -68 -142 156 -16 -77 107 176 111 81 176 64 63 101 -342 43 -97
5963 -97 70 -221 91 70 -136 73 -84 122 97 59 -45 6 -111 -91 -24 76 -88 -43 125 -64 1 -1 268 91
5987 91 -39 105 131 -66 -146 -205 -78 153 -139 177 -20 194 140 -108 196 56 -206 2 61 -76 -382 256
6009 256 -19 -59 154 47 145 -46 -59 -92 13 166 -141 -46 -48 -32 -176 -213 113 63 151 8 -163 -15 -128 -118
6033 -118 292 -299 57 156 138 -104 -87 158 181 35 -96 99 -214 132 216 -102 -93 -179 267 -20 156 38 24
6056 24 126 -252 64 -22 -77 -52 -194 -206 30 11 86 14 -176 -44 -199 -25 35 144 -33 -193 215 -39 54
6079E4j20l5qM32m23K13q0p6J12L4j76m1k39M22kk2N2r2j31R0%J45o1Q8j81J69
6105A24j80l4P7K12m54L45j8JO1j73j36O7K56k53j5K8j26K97j8j61J3J34j32j01
6129a86K70K48n77J04K43J08m27J23NJ10j90K40j17k38J91J8Q2q4O4j55J41k1
6151d8J30m6k49J09r8K01j12L09L6m8l14K5J99Pk0k75K5k0J80Jj78N0P7q1O6J88
6177A14o0j30N1N7l13J21J29pn2Q9l8j88K8K24J7o8k17K02J6L1O4j20M9m8Q4j05
6203g0L17l13J6j13J8K07p5K22j58k01p1K72k9j15n2n4J09j06K34p8K17k02l59
6226c84N33m13L4K58OJj07n8J31k74M13L2l64J49J62k60K34k02K10k38J13K31
6248B07j61l8p0n9J10K2j21J23J57l0R7k67j80J47o9O7j7N2J6J71k85J88k7N1
$$ plain form
6079 54 -66 -101 -109 323 -100 113 33 -43 69 103 -73 -114 -353 69 67 45 97 5 -126 -36 -36 109 48 136 -45 124
6105 124 -56 -90 -13 199 -255 90 72 73 134 -39 -175 -108 148 -105 -120 -92 -218 79 61 -100 -87 47 -85 -186
6129 -186 84 332 -245 -141 102 210 -217 -94 -89 21 -169 71 -46 -284 -93 -75 7 -77 -13 -168 -27 -48
6151 -48 82 36 -213 -104 -202 -1 -113 196 232 184 -130 -105 94 101 81 -194 -169 -189 -9 -8 -186 -136 -59 -140 -74 114
6177 114 54 -76 -25 32 -281 -160 -31 -38 -90 -1 -39 -227 -199 25 42 -26 -243 -41 -25 6 70 -50 -1 -49 35 -70
6203 -70 247 -66 -50 -163 -145 62 -13 209 51 -150 -221 51 22 -93 -145 -199 -90 -196 38 -40 177 -25 -384
6226 -384 149 -264 -230 28 34 35 -72 -130 1 -273 140 172 -192 -43 119 -141 93 -109 101 -137 -24 207
6248 207 46 8 -62 -121 -11 11 -110 13 170 140 237 -30 -210 -63 -132 -65 -82 -30 -14 157 -128 60 33 84
6272H4k8K00M6m50j6J82j34O1j28K86k58J63J45j28p4K31j90j45K69j12K58P8
6294C40n57K97j57J42j87J15j89L40k26k2k00J99K49k48q0O1K36R3j70O1J08j32
6316G3j8K04k67R6N7j36J36l33K90o0p6j94L45j27O4p0J12q6p4M7J2j00Q2K42
6340B19l69K98l22L24k10j2k04K46P2j87L29J06j60j50j49n6j4L79m27L05K16
6361B34r1r7N3k82J00n4O4J94j49J98j09o7j22J17nm8L2K56m77L60j49j6k21L19
6385D0K4p5J60l41J77PN7n2J57r2j33%j7O5L8j32J5K13r0J67Q0l90J3N7n2J32
6411B8L4J08J48k71L57n96K50J68j61m9k32J70PJ71K3j00j44J20k30j28L74O3
6433A10j1J52k16k00K81po6o3K16r0J00j70O5l4k15K52l6O1k46J56R8l33K01Q4
$$ plain form
6272 84 56 256 302 -148 -164 18 -116 -55 -183 103 -155 8 153 25 -49 182 -8 -153 116 4 262 340
6294 340 -217 80 -77 65 -122 -7 -196 144 -82 -104 -304 -105 144 -104 -184 -123 113 206 36 97 205 73
6316 73 55 259 -8 88 145 9 145 -188 102 42 -34 -228 117 -10 54 -16 96 10 -64 -17 -5 -105 -23 219
6340 219 -150 148 -174 150 -60 -72 -276 -30 42 -145 184 290 130 -20 -169 -225 -239 140 -287 18 234
6361 234 143 46 99 -183 -83 -137 -73 121 -28 170 61 -6 -128 -11 -16 -64 -32 224 -253 107 -42 -58 -279 40
6385 40 64 -11 149 -192 -15 -8 49 -3 154 62 -71 -71 -88 -23 15 -117 -102 111 21 188 268 -122 -109 -52 -104 28
6411 28 62 170 318 47 404 -192 58 226 65 16 -216 -46 -39 132 155 55 -89 31 -199 -327 47 110
6433 110 99 251 35 -165 116 109 43 -20 196 106 206 36 101 67 -148 104 68 129 -117 39 137 -196 5 89
6457H9j84r9J00KJ83j72Q5K07J22m00J60k36K08l2k45J03M4r0K45j11n3L38j86
6480G8o6l2q9L7K40j36q7q5pK54k38l6J73J49j95J96j18K0q9J44K91n27qJ87l57
6505c01M23j40o4L61l17K04o4j14m8rR9N3k69J55o5k2J79l3p4K30j54r3J95l23
6529a91J10O6J62l29K27K2J10L7K01o03j8K14J32J5J32m79J10J81l8R8l27K23
6551E5P2k7r0J3K09j96O3l03J75NJ14j88J91p2j25p5K27k9J10k5k45L59m1j26
6575E1j7k26K27J7J14K5j56k10J52K1O5J75k79M1j35J45j17n5J00J02K61k26K37
6598C12j51j66m9K89k05K07j73l36K25OQn8K5M1J02L0l25J46L8J52p9J03J28l26
6622e6P9r5k7L67k47K99m27J56k39J56l8K53j20q8K6K05k17J16j02K5Q2r0k25
$$ plain form
6457 89 -95 -194 -94 -92 91 -81 4 211 333 -67 93 -143 65 33 -212 -109 -65 -155 90 -21 -74 264 78
6480 78 12 -20 -109 -72 168 32 -55 -140 -147 107 -131 -167 6 155 -40 156 38 58 -31 113 404 -123 -131 56 -301
6505 -301 122 -18 -82 279 -38 166 102 -12 -60 -69 30 83 -186 -31 -96 -118 61 28 -46 184 30 -63 132 -191
6529 -191 -81 -15 147 -182 45 67 177 214 415 -188 -206 8 140 155 287 -192 -82 99 61 159 -168 55
6551 55 127 100 10 23 232 36 99 -204 -29 -24 90 -98 93 21 -104 -179 48 19 129 104 -141 218 177 51
6575 51 34 -192 35 52 166 191 35 -175 -23 -2 63 238 -41 0 -135 10 -107 -162 -62 40 301 75 312
6598 312 161 -5 -54 235 30 237 64 -272 -47 -41 -33 -91 -66 -25 77 107 -218 -72 -34 118 39 142 270 -56
6622 -56 23 -72 -99 268 21 320 -107 49 -190 -34 -72 181 61 -27 -1 204 -13 103 1 26 108 18 -207
6645b07l6M90k02j57j33J53o9K19J9j15r9J99q6j33K22K0j17j16J01J46l31K54
6667B2K1j21J60O8k5k45j44K33l05M41kj35J46J8r6J18J0j55L7m0m0j76M47j62
6691G5j21N1J8O5l27J64O8j79J72j73K36p9kK73j58m2l14K51J13p9K3J14k61J8
6715i4L77o8k61j94K51P2R7n1j36rj05J66q3l0J19l39P7M70k05j09K3P3k00KJ31
6740b6K4j91M6K76j43l8K84l02o4L70l34Q4K04o28L82j61J65P1J01j7R3o9k11
6763h4k1j3K22l22N84m10o8L8L4j38J35mL7J81J30j76l30J91K68k22j23R8r3R4
6787HJ76k64J47j17R6N7p0k18M24O7n19m0J56J22k08K79k21R1O0Mj05P6J99j02
6811I8j26J17k52N3J39L4k0k77M19j37nj0j1qr0J44N5P9l36lq3K56k6j61l7L27
$$ plain form
6645 -207 -243 247 45 -112 -245 -92 -161 58 77 -38 -137 62 -24 -157 65 85 -32 -148 -47 99 -232 22
6667 22 43 -78 82 150 125 -120 -264 -31 -336 105 103 -32 114 132 36 154 164 9 46 6 -34 -210 237 75
6691 75 -46 5 23 88 -239 -75 -7 -186 -14 -187 49 -30 -32 241 83 41 -273 -22 91 12 35 149 -112 -94
6715 -94 283 215 -46 -240 11 83 180 129 -7 -16 -121 45 -38 -68 51 -288 -211 259 54 -55 -32 41 -159 -157 -26
6740 -26 -2 -193 -147 129 -14 -52 232 -70 -134 236 -98 -14 190 -438 -56 -217 -52 19 120 103 196 127 -84
6763 -84 -105 -118 104 -218 366 -44 -112 -74 -40 -178 -43 -47 -10 171 301 125 -205 -14 254 32 -91 7 -86 8
6787 8 184 -80 67 -50 46 103 33 -185 239 306 -213 -253 -97 25 -183 96 -125 -34 26 30 -75 1 200 98
6811 98 -28 89 -163 -110 29 63 43 -234 185 48 43 33 22 14 -76 68 123 202 -134 -137 -220 36 10 -151 -188 139
6837A39m04L69k87k0M37j18J2k71J63K2n3J37j36Q8L5p8k06J49k75L67j2j18J69
6860A09k69K6J19QK7J20L0k4l77J54J4M4JK04m50L65J83k52L3j41J26J27k26q6
6884a35J69J58p8j25j08o4m8K17pj43J09J63o1J1k12J47J55j43P3K41m86J54m9
6907f2p5K19j57j47K19P7l5K82k49k16J66j32J69J64m04J24p4J30o4j10K12k91
6929b54K51o2P3j49k4J75l33M34l4j51KJ96j74K01k96K02L1k24M4K35k94K00J3
6952F2r5O4N4j7k49o6K91J31k92k50N40l72K70m9j65J52Q8M7k26K54r1m3J21j46
6976A3n3r1K96k81Q5j05N8qnPP9j98M09l35P8J43k08L2M5J92j26K08K5l85K86
7001A61j91J42O5k08j02J27N3J98l0m9j87P4j35J73K31j36j03k42J12l14K32J57
$$ plain form
6837 139 -265 104 -183 -203 234 116 128 -143 20 42 -11 126 -10 78 113 35 -171 -22 -297 70 58 -60 109
6860 109 -160 -134 -15 -7 20 140 170 146 -231 -77 -63 -19 -18 186 -264 101 284 32 65 -76 50 177 -49 -135
6884 -135 34 192 114 -11 -119 -183 -231 -14 -21 -164 -55 108 47 58 -154 -7 148 5 78 319 -167 -13 -62
6907 -62 -137 82 -75 -222 -3 74 39 321 72 -144 22 -110 59 223 -181 -57 -131 -1 -65 -175 37 -254
6929 -254 -3 -65 8 -141 -165 10 -323 111 77 -74 -72 124 -50 151 -145 57 88 -136 -92 143 -151 49 62
6952 62 -33 31 85 68 -181 -247 44 175 -117 -367 173 -199 71 22 -143 9 97 144 -82 172 81 38 159 13
6976 13 -40 -131 165 -116 -31 -136 -78 -86 -91 -84 -5 -203 206 -129 -51 92 -116 -84 -39 153 27 235 260 -125 161
7001 161 -30 112 177 -31 -133 -6 47 245 215 166 -21 53 -82 91 322 186 83 -159 -47 -361 -129 28
7023B8j72K44k26p5K93l4j69j8J03J4L8k35L47j30J04k61M6r2R9K55k39p8J09
7046d9J72k84K71k45K92k29k1N2J30j14m3L6N7n09N27j09l2J70r7K49l57n2J61
7069b4J89l92K41r9j30L05N1j92L30k73l7j13K14L6q3J38l07O8N3p6K30k17M6
7092d2J07n9j09J19k7L7k19K07J41k25J98j46M5J1N1k17K03n8m9J28j45J92p6
7115F7M5J0k56jL14j50j5j73J10J35k51J60P1N0k13N0L8O6j11J02j50J77Q4r2
7139F7j88J06j39K49J37m62L38N9n1k4j24r5K87J36j89k59J56k2j28M3m6J76m8
7162b1l6j0q7J69j43J97j78M14l36Q0P3k8p2j31J94j95R4J51l34p7J65J57k3K15
7186B38l48J46l19N14j96j1j7k73K60R1k6J87j88K1m0l2j15K8k5L2j12L03P5l19
$$ plain form
7023 28 -144 100 -126 -201 92 58 -111 -129 -26 -12 26 -209 138 8 112 -149 -103 -195 -96 159 -80 -158 -49
7046 -49 123 -161 110 -135 157 -72 -93 -41 89 -25 -68 -32 25 -484 43 -66 -98 72 -25 224 -133 -185 -24
7069 -24 165 -227 14 -85 -215 90 141 -51 279 6 -31 -144 70 106 23 161 -146 -78 -25 -101 129 -88 -42
7092 -42 65 6 -103 16 -11 26 -193 14 155 -70 128 -18 27 38 89 -128 75 17 -32 96 -49 143 67
7115 67 112 122 -134 -135 179 29 14 -159 -49 86 -165 -5 66 116 -97 -47 -9 57 -54 48 -102 75 159 67
7139 67 -121 -15 -154 95 232 -230 108 167 116 92 -32 -127 160 296 107 -152 4 -18 -146 -103 -149 27 -21
7162 -21 -57 -67 -154 15 -128 69 -109 305 -31 49 122 94 22 -109 85 -110 -16 135 -199 -276 -111 46 23 238
7186 238 -110 36 -283 231 35 24 7 -266 -6 85 59 246 58 79 39 7 -108 -80 -105 -73 -185 118 193 -126
7210a26K26J45l16P7k16J45J08j65J66L6l5j48O8q3N07l97L7q4l8q5L68j46q0
7233c6M7k21qL21l39J0J26P6o2r0L79l34J07J18l79L46rJ73k87p9o4M80j68j93
7257h6L36l11J35J05k52M63k93k32R4pq1J23j41J75o4J65j64J93Op1k06L77l63
7280i9j21K36M8qk75L11k39K70oo2j69J87j06r3K26j58j20K60J28K3l86K2J69
7303C8%Jk59J90J98J51k07k02m7L67l45L80k59l4R1l25R3K66M9k82J61k65Q9n7
7327b08M90j63k01J35J43l95K96l82K59K93m91j52M95J59k74qk21J29O6P3P7m0
7349H0P1n51K08K25j80R6K17p1k64K46j50o6O8K95k63j34K1N4N1nM0k8N6r8j98
7374b80K79L3j52N1o0K11J83l13o5k1K29Ok48J0J44l8J07P7k91J77n1Mj6p8Q8
$$ plain form
7210 -126 100 245 -71 6 -210 -65 43 -122 44 80 45 -103 -35 -118 389 -8 29 -55 -93 -178 190 44 -36
7233 -36 11 -210 -218 103 -236 -226 -100 -24 -86 -176 203 -131 -24 94 -285 61 52 225 -62 -141 -205 275 107 -86
7257 -86 250 -61 74 179 -73 390 97 -135 -41 -48 -129 -6 -147 28 -36 129 -35 158 164 93 -113 264 -99
7280 -99 -220 16 64 56 -219 92 -147 123 117 55 -114 73 -33 -126 100 -58 -178 82 210 233 -153 -131 38
7303 38 38 39 -220 -30 168 319 112 -90 -137 230 -115 265 6 -28 63 -262 -169 97 146 -136 25 -240 -151 -208
7327 -208 282 119 -82 53 196 -199 97 -285 -26 267 -224 -376 119 278 4 -4 -225 -96 -30 43 120 80
7349 80 151 -400 -192 33 -147 -51 166 95 -169 77 -73 -139 -71 224 -39 -173 -152 -98 -47 -52 -12 -40 16 -82 -280
7374 -280 -1 32 -120 -69 -129 82 265 -48 -113 -134 95 101 -147 -137 7 -31 76 153 -138 39 -12 -8 -24 -102 -14
7399a4K31k98N6R8j93J64j83m2K04M6j67K89J50k69r9q8PN2j71L01k57M60m04
7422a27J99Qk27J5K17k25K67l40q5N4K56N0q5M5j50J59K31k53K00l93J44j37N75
7445C98j63q7j58j19L1J96p2J83n3p4Rk9j38J80N9j91K61m06J64l20M39m2k3L19
7469C64l05k12k39J60K98j24j46K07j74L93q9j35m8J14nj53J88m18L38J9q1J97
7491A49j96l7m6L02Ol33J43L0J62q4P9j69RJ72j99Q1J36k25J4J44k20N4j76J69
7515c5K00Lj27j2k9qm8k33J16K47m4M6J63j7k23n4J15o7J0O0q7J3o5M23m27j05
7541a85K73oL6j68J7l0M6N6j31L8L23K14o70m9L0K35P1j55l4o8J34q2K5Q3n4N5
7567Dj40K35m0P9k70l6O5m1J22J24j87J58p8K9K0j91N1J37j17K74o2j4q5j09p2
$$ plain form
7399 -14 217 -81 -25 73 -120 44 -139 -181 23 69 -98 191 341 72 -27 -115 -108 -56 -227 74 -183 277 -127
7422 -127 72 80 -147 -132 85 -140 127 -213 -298 -244 12 62 -23 22 -128 31 262 9 209 -184 -40 -177 398
7445 398 235 148 -10 -129 -98 98 26 209 156 82 91 62 -76 104 163 -28 233 -173 -9 -329 110 68 45 364
7469 364 59 -153 -392 -232 66 -58 -204 3 -171 222 133 -2 -50 64 59 -94 94 -324 14 33 -48 149
7491 149 -47 -84 -130 172 178 -155 -12 18 180 96 175 6 15 187 -12 69 205 -20 -6 138 -82 -28 -204 -35
7515 -35 165 168 41 29 0 -8 -56 -289 -173 74 30 76 239 222 -1 -55 60 -7 3 63 -24 -11 -76 347 -80 -185
7541 -185 88 82 118 -50 -33 -63 -17 39 -92 -54 269 483 -187 -236 -206 29 100 -55 -89 -157 -23 -105 -80 3 -51 4
7567 4 -136 99 59 138 -132 -168 -103 -144 -22 102 -85 73 -5 24 44 -147 -96 41 -76 198 136 122 37 -72 -144
7592a44O8K4pK90m29K63J36l67J32O3p8j47K55r2J57l79J35J39n9J64l5nj18J77
7616A43j89K78l40L8O1l25K66K99j38j80R5j03J77j9O2K3j52N9N3k73K66l39L59
7639A21Q0l90R1Q4l54M38k6J43k71J40l3J8L6m1J83m20J75j0NM9k66J85j39M34
7663B32j13j11N3j76l0n5J04n9K14j52J05j19K55j86K03O6k71k71M22O7k7nq5
7686F1Nk50L50n8m03M02j35N0r1j16J67j04K41l62L52j04J58n9j82k42M66r1K88
7709C43k19j75Q1J84k81p7K20j1o0J05p8ol4M7R8l55J86p9O2k79K66R8k40K72
7733F8k07j4j26M93l20J81k68J92n4J04r1j61N0K11j11LJ27j36N0K79m07J08K1
7756hkk11N6L36j52j21J39k56L35M8k88l7K31j97L68P9m56J61J7m4l6K0j40P4
$$ plain form
7592 -144 -76 -52 -59 231 -198 65 201 -166 -34 29 -49 -196 59 -33 124 -255 -120 19 -40 124 89 84 -34 143
7616 143 -46 232 -108 -70 -9 -334 -68 231 93 -87 8 -95 82 63 125 148 -4 55 108 -165 101 -238 121
7639 121 201 -189 -98 -14 -368 70 44 187 -84 56 23 41 77 36 219 -201 -26 -36 -31 18 -248 -63 -202 232
7663 232 119 8 61 -115 -145 -200 -96 -155 59 -93 12 -107 148 -38 165 231 -40 -311 111 178 151 146 61
7686 61 66 -184 166 108 -295 107 -28 22 -69 -185 -18 -122 119 -243 109 5 163 104 -78 -320 146 55 343
7709 343 124 -51 30 214 -67 -144 76 65 5 110 32 26 -8 39 137 -218 -32 -111 -49 -328 -62 36 -204 68
7733 68 -139 -153 -279 214 -106 75 -193 -1 -55 49 -42 -203 -153 58 -53 -50 77 -59 -9 270 -137 -29 -8
7756 -8 -10 -221 -165 171 19 -102 37 -219 116 164 -124 -161 70 -127 241 320 -136 25 42 -2 -38 -18 -158 -84
7780h4O9J23J69o08K36J75J37j36j11Ok05J95J10k14n2n5N8J77K57j41k51J32
7802a3o9P0P0j55P3J98k62J00N1R2l15L55k47K61k90j11J42k53M30k02l0O6J39
7825A00O6k88L5M33m09K40j16l3q2J32p5N2K8l38K77J3j42L46l22k9O6J77l50
7848b19Q6J63j75k18N16l15K18pJ7L8k9r6J2J02j21M63j82m76J71J23Q9j51J33
7871A42J22k17J43j76J54K7l4j14p4M9k57L08p5O8q8K71m74J15R3K3P6N7r9k01
7895a61K35j19J55j40O7n4O8j70K59q6k25K03r6N2P6P7j5j76J3N0M2k05J5J08
7919b7M9p0J43J40k42J54j32rl5j07K41J61k13j9J46k30K92l44J65q2P6l02M36
7942A91j66r7J68j09L2L7j42j1J14L8j79R2J29l3j97K53m9q8j7J50pp6k93K96
$$ plain form
7780 -84 -15 108 277 -331 -95 80 217 81 -30 -24 -229 -34 76 -138 -190 -245 -187 -10 247 106 -145 -13
7802 -13 -82 -12 58 -97 -24 174 -88 12 63 155 -160 195 -52 209 -81 -192 -50 -303 127 -75 -105 -39 100
7825 100 166 -122 -87 346 -63 177 61 28 -54 78 3 55 83 -255 22 35 -107 239 -83 -112 -46 131 -219
7848 -219 -133 30 -145 -363 153 -162 56 49 66 104 75 -21 -9 93 -28 435 253 -223 -52 71 160 9 142
7871 142 264 47 190 14 168 195 161 47 -27 22 -235 73 -2 66 -22 249 -225 -110 -17 6 82 139 40 -161
7895 -161 74 -45 110 -30 37 -17 51 -119 140 54 -171 32 -64 -12 64 141 126 -50 -37 13 55 -150 -135 -27
7919 -27 22 -48 95 235 -7 147 15 6 -29 -136 105 266 53 34 180 -50 242 -102 63 -19 57 -245 191
7942 191 25 -72 96 -13 19 56 -86 -97 17 55 -124 -32 97 64 -133 120 71 -17 -34 116 109 33 -260 36
7966C6j04j3L19j80J09j43k84L63k49J40k17J01J97j54J20P7r6L89l62J4R1k19
7988f5Qk06L83k36Q2J39R1j14j16K50j64j68L11n9l68K9J90P8N0j92M1P9k1Q7
8012A09l40L7J93N9k79J15k16L30P5%N7l9J19j54l19K18J14j49L75k13l54L90
8034A28m2n7j68J08J69J24j78j1r5j00q9L16j45J31j68K71q0k25P3L32k17M3j64
8057d4k91L50j96K29%J26k12MJ44n7j89K25J0j34j14M0J50J11N8m21K04J06l9
8080F0p3J58j59m1rK93k88MJ41K5J15m54L6P7J25n4oQ6k83K25J46j11L1J23k29
8105f2J39p4o0j0K0J01n4J15m0N9l23J54P5l5J11k7k35l7oQ0Q8j12R5j18K01k90
8131b45J80k36J18K73j6q7J8oQ7p2j62K05k06K12N4k88J29J91P%j16J6R6p3k15
$$ plain form
7966 36 -68 -81 238 58 167 24 -260 103 -146 -6 -223 -122 75 -79 41 118 22 411 49 63 154 -65
7988 -65 -57 -263 120 -116 -34 105 196 82 -34 216 52 -116 195 136 -232 -203 -13 65 115 -77 -36 43 22 109
8012 109 -231 -194 -1 58 -221 -106 -322 8 83 83 140 101 220 66 -253 -35 79 -70 305 92 -262 128
8034 128 86 29 -139 -31 138 262 84 73 -22 -122 -211 105 -40 91 -77 194 114 -111 -38 294 77 120 -44
8057 -44 -335 15 -181 48 48 174 -38 -34 110 53 -136 89 99 -35 -149 -109 41 152 210 -211 -7 99 60
8080 60 -13 145 -14 -55 -64 229 -59 -55 86 111 226 -228 -192 -115 10 -44 -50 36 -247 -22 124 13 44 167 -62
8105 -62 77 3 -57 -67 -47 54 0 115 75 134 -189 -35 40 5 116 89 -146 -183 -189 -109 -21 -133 -38 -156 45 -245
8131 -245 -65 -301 -183 90 74 -13 5 -1 86 14 -148 57 -149 63 117 -171 -42 149 156 156 40 56 152 79 -136
8156a36K87J33l2m51K30L1j13j82J13J78N2k00q1J46PM8N8j14qJ93k29O3K19j42
8180G0k21O1j17M5K42J26J9k23j5N1j03
$$ plain form
8156 -136 151 284 252 -199 31 62 -51 -233 -120 58 110 -90 -171 -25 -18 30 88 -26 -34 159 -70 -7 212 70
8180 70 -151 -90 -207 -162 80 206 225 2 -13 38 -65
8191f5
$$ Imaginary data points
##PAGE= N=2
##DATA TABLE= (X++(I..I)), XYDATA
0@%%%%%%%%%%%%%%Oj4J6j6J6j6K4l2L2m0M8n6O6p4Q8j04J20j36J52j72J96k22
36a18K48k76L11l48L86m29M77n29N85o46P15p92Q72r59J055j161J280j412J559
55H18j724J912k127K376k665L011l434L959m634N541o832Q827j2360K0540p8886
70f5678l3845O6510j1482j138k6454P737J7860K1335j1674j1824J4245J1482M153
83a8773K0054j1549j2657p229Q697K4844J5256q26j9215q564K5758N293r282j1675
97A32K38J9607N670r318j8951r923J7260p18o447M795L352M881m779m818m165
112c184m72J4358k942J356J0805j3797r025K956O189M215n748k611J62J7345J0220
127B9827k6457j3655P761J5145J6003j0765j7480p251P901R628j1535n568j959
$$ plain form
0 0 0 0 0 0 0 0 0 0 0 0 0 0 0 0 6 -8 8 -8 8 -8 16 -16 16 -24 24 -32 34 -40 48 -56 64 -72 80 -92 104 -118
36 -118 130 -146 165 -183 203 -226 251 -278 307 -339 376 -416 456 -503 552 -609 671 -741 818
55 818 -906 1006 -1121 1255 -1410 1601 -1833 2126 -2508 3033 -3799 5028 -7332 13208 -65678
70 -65678 -99523 -33013 -44495 -45633 -72087 -64350 -46490 -25155 -36829 -48653 -34408 -22926 -18773
83 -18773 1281 -10268 -22925 -30154 -21457 3387 18643 17817 -1398 -9962 15796 21089 11807 132
97 132 370 19977 25647 16329 -2622 -12545 4715 3997 -2450 2345 5697 10578 5799 981 -3184
112 -3184 -3656 10702 7760 9116 19921 6124 -2901 55 6244 10459 4711 2100 2262 19607 29827
127 29827 3370 -10285 -2524 12621 28624 17859 379 -6872 1029 10657 -878 -6446 -8405
140h405j167J1968M085l898j1172j0936P226J1268J5449l538k2517j964J0746
153b855J1092k636j5437j459R354J8184K421j9942l674M147P598J0529j112m035
167A2175m701K195J345l934L745p906m602J2046L799k820r910q924N527P708O040
182A1783r297p122Q841J378k776r079p199P585O872L276p526q544M282p39K990
197e275J802m044J670J262N706L96q106m068n588R141J2968m992q472p899M288
212a1211R281O85m673r627O254J4430j651m850j0214m624R267P034K765p640n316
227a0090Q15O58P577j812q450J333M717R849L65r790o326j815J3120N896o728
242f81m157l603O306M392m228l867l927Q514P446k000j078q302j069O828K853
$$ plain form
140 -8405 -9572 2396 6481 2583 -8589 -19525 -12299 -1031 14418 10880 -11637 -13601 -2855
153 -2855 8237 5601 -9836 -11295 -1941 16243 18664 -1278 -4952 -805 6793 17322 16210 12175
167 12175 7474 9669 11014 7080 10825 2919 -1683 10363 14162 11342 1432 -7492 -1965 5743 11783
182 11783 2486 -4636 4205 5583 2807 -6272 -13471 -5886 986 4262 -3264 -11808 -7526 -8265 -5275
197 -5275 -3473 -7517 -5847 -4585 1121 1517 -6589 -10657 -16245 -7104 5864 872 -7600 -15499 -11211
212 -11211 -1930 -1245 -5918 -15545 -9291 5139 3488 -1362 -11576 -16200 -6933 101 2866 -4774 -10090
227 -10090 -9275 -8617 -1040 -2852 -11302 -9969 -5252 4597 4962 -4828 -11154 -12969 151 6047 -681
242 -681 -4838 -8441 -2135 2257 -1971 -5838 -9765 -1251 6195 4195 3117 -5185 -6254 574 3427
257C427J688o140j365K848J205L826q851n569O244N752O375n189p742j066L131
272a426Q553k851n914J046M43P105j84p695m136l38R143M699k285l136p149M415
288B90O189m70k215o111L541N905J794k124j1334q83P126M151L877p475m429K332
304A64L541M535o389l261K540K350P853l653p652k874Q77Q584J272l023l248l518
320a902P516K330l593l560l517O551N580n24m849r176K735N019J934N6p339k33
336b972L819K656J37q159j057K888M303N956o978n544j78K534O206k457l651j697
352d194J406Q035k118n088k732n67Q604L211k277n140m639N458K837m52k576n877
368f109L834M260J062k591q320P57L796M834K159p848k835J642L125L241n741
$$ plain form
257 3427 5115 -1025 -2390 458 1663 5489 -3362 -8931 -2687 3065 9440 4251 -3491 -4557 -1426
272 -1426 7127 4276 -1638 -592 -149 6956 6772 -923 -5059 -5397 3746 8445 6160 3024 -4125 290
288 290 6479 6009 3794 -2317 1224 7129 8923 6799 -4535 -5418 1708 5859 9736 2261 -2168 164
304 164 3705 8240 1851 -1410 1130 3480 11333 7680 28 -2846 -1969 6615 7887 4864 1616 -1902
320 -1902 5614 7944 4351 791 -2726 3825 9405 8881 4032 -5144 -2409 2610 4544 4600 -2739 -2972
336 -2972 847 3503 3640 -4519 -5576 -2688 1615 7571 593 -4951 -5129 -2595 3611 1154 -2497 -4194
352 -4194 -2788 5247 3129 -1959 -4691 -5258 3346 6557 4280 -860 -5499 -41 2796 2344 -232 -6109
368 -6109 -2275 1985 3047 456 -7864 -7107 -3311 1523 3682 -4166 -7001 -5359 -2234 1007 -4734
383d734l216N92M309O263n188m574j922J210Q070L59k785k976o68N501Q19j228
399a68l696l267O561L888j30l980o091L003M055L622j777n958J814L068L087q05
415C226o542k65L058M827J863o109j916l98L011N052l124k056j635K482N480j835
431E119l467m636M93Q139Q27k147n669k834N483K554j67n078l621N707K919Q25
447D447l898o043K486K827M501m08n456j177kM583K801m704k639o50N274N117
463G059l631m016m074L571P317j373k840m548R48N846l07k162m616L03N161K77
479B915Q82l773l597K313J685K756j328l846J08P91M389j788n169j22R31O103
495C250Q42o027k225K82M869K055m363j611o13L866K427l491k096k791K868L857
$$ plain form
383 -4734 -7950 -7358 -3049 3214 -1974 -6548 -8470 -7260 810 1169 -1616 -4592 -5260 241 1060 -168
399 -168 -3864 -7131 -570 3318 3188 -792 -6883 -3880 175 3797 2020 -3938 -2124 944 4031 3226
415 3226 -3316 -3581 -523 4304 6167 58 -1858 -2256 755 5807 2683 627 -1008 1474 6954 5119
431 5119 1652 -2984 -2491 5648 6475 4328 -1341 -4175 1308 3862 3695 -1383 -5004 703 3622 4447
447 4447 549 -5494 -3008 -181 4320 3912 -1544 -2721 -2723 1860 4661 -43 -2682 -3332 1942 7059
463 7059 3428 -588 -4662 -1091 6226 4853 2013 -2535 -1587 4259 3952 1790 -2826 -2523 2638 2915
479 2915 3797 24 -3573 -1260 425 3181 1853 -1993 -1885 -1094 3295 1507 -3662 -3784 -2853 3250
495 3250 4092 -1935 -4160 -3878 991 3046 -1317 -2928 -3541 325 2752 -739 -2835 -5626 -2758 1099
511A099m57Om604j539M241K601J271n235k757L881M164K819n972n208L224M501
527B035M872k916n778O93K631M265o99l724m47n58M619J739k426j959m354K771
543G64M479K82j980n665L01N025R97j565o238M40M610J740o6o310j505L519J356
560A84Q44l020j555J208Q04K134k425j565K28o30M404L55l083j710j335M362K432
577A632k395l477j410N433K455k761l164l018N263L895j254k197l225K259L445
592A481L74k29l602O08K210J897K694m159k734P44L245N286k304n066j091K539
608A893N765j367m557k048M77O701o77l892k005j662M193J846j585j737k487J626
624D84J307J222j63m907N63K449K107J510n771j682K252L460J806m252j599Q18
$$ plain form
511 1099 642 648 -3956 -5495 -1254 1347 2618 -2617 -5374 -1493 2671 5490 -482 -5690 -2466 2035
527 2035 6907 3991 -1787 -1094 1537 5802 5103 1379 932 374 4993 6732 4306 2347 -2007 764
543 764 5243 5525 3545 -2120 -1819 3206 4203 2638 -3600 -3160 1450 3190 3124 -3186 -4691 -1172 184
560 184 1028 -1992 -3547 -2339 -1535 599 -1826 -3391 -3163 -3793 611 966 -2117 -3827 -5162 -800 1632
577 1632 -763 -4240 -5650 -217 2238 -523 -3687 -6705 -1442 2453 1199 -998 -4223 -1964 1481
592 1481 1855 1626 -1976 -1368 842 2739 5433 1274 -1460 -716 2529 7815 5511 445 -646 1893
608 1893 7658 6291 1734 -314 163 6864 6187 2295 290 -1372 2821 4667 3082 1345 -1142 484
624 484 1791 3013 2850 -2057 -1494 955 3062 4572 -1199 -2881 -629 2831 4637 385 -1214 -396
640c96L099K305m537j646J039J499L549k117k780J6J20K492k57j087j613j299
656a613L716M55l88k459l691L553L599K74k770m417J728L767J971k379m577J671
672a560L020J873R4n171l06J861J822K463k290k429j153J637L867j444j721k702
688b139KN319K2k235l719j395M588K277j051l909k056L373J354R20k690l275K649
705a965J739R27k82l566l11J144K568O64k764j018k38K798K371l027j851o07K623
722g95L050j691k716j449J780L185r39j317k504P75L658p60m52k320j209L037
738f67J302O64k436k483J469J912K464j896l621P59J214L213r6m660o16J507L453
755A482P82k989j435o71L046K088k313r65j568J684L010o03j110k871K31L200
$$ plain form
640 -396 2703 5008 471 -1175 -136 1363 4912 2795 15 31 151 2643 2386 1299 -314 -1613
656 -1613 2103 2558 2170 -289 -3980 -427 3172 3446 676 -3741 -2013 1754 3725 1346 -3231 -1560
672 -1560 1460 3333 3427 -1744 -2050 -189 1633 4096 1806 -623 -1776 -139 3728 2284 563 -2139
688 -2139 -2137 3182 3204 969 -2750 -4145 443 2720 1669 -2240 -4296 -923 431 1351 -1339 -4614 -1965
705 -1965 -226 701 419 -3147 -3458 -2314 254 918 -1846 -2864 -3102 -304 2067 -960 -2811 -3418 -795
722 -795 2255 564 -2152 -3601 -1821 1364 425 -892 -3396 -2621 1037 277 -175 -2495 -3704 -667
738 -667 635 1299 -1137 -3620 -2151 -239 2225 329 -3292 -2533 -1319 1894 1798 -2862 -3478 -1971 1482
755 1482 2264 -725 -2160 -2831 215 2303 -10 -975 -2543 -859 2151 1548 438 -2433 -2202 998
771I98J172M7l445j008K724J438J376l154k694K708J650J696k001l032Q78J233
787E86L105j246k741Q9n8K971O03k717p84o26K624J852j427j583k085K108K437
804C108m80q95l168J305L029k83k96l638l80K917R78J64k761j521J754J036J881
821B750k359k667J307M56K857j225k936j59J53L370L18k691r31j063L397J463
837B040k076j054j412K247K526q79j289k719J386K952K84o63k752l8K643O73P99
854B668k911j331K114P97J947k570j970O17J211K723j340k525j08j25L207l23
870B081k453j162k38K725J014j746j788j741K497J584r72q91k755J615J638K42
886c50o42l068M7K215J090P3l247p23J469J250J587k902j180N56J468K569j685
$$ plain form
771 998 2170 2217 -1228 -2236 488 1926 3302 148 -2546 162 1812 3508 1507 -1525 -647 586
787 586 3691 2445 -296 -207 -265 2706 3309 592 -192 -818 1806 3658 2231 648 -1437 671 3108
804 3108 2628 1733 -1435 -130 2899 2616 2320 -1318 -1698 1219 2197 2361 -400 -1921 -167 869 2750
821 2750 391 -2276 -969 -513 2344 1119 -1817 -1976 -1823 1547 1865 -826 -1757 -2820 577 2040
837 2040 -36 -1090 -2502 -255 2271 1392 103 -2616 -1230 1722 2006 1343 -1409 -1447 1196 1869 2668
854 2668 -243 -1574 540 1337 3284 714 -1256 -639 572 3295 1955 -570 -678 -803 2404 2081
870 2081 -372 -1534 -1772 953 1967 221 -1567 -3308 -811 773 -199 -1090 -3845 -2230 -592 -350
886 -350 -992 -4060 -4013 -1798 -708 -635 -3882 -4605 -3136 -1886 -299 -3201 -4381 -3825 -2357 212 -1473
903a473k011j15R42L045n17j177j207k97L294P59j190j383j120K793J790n22j646
920c5j780J612K205N21q04k913R10J381J482M0l212P1J087J761J234k922r99L58
938cJ320K049j388j590j100J369K494r43j114j506J74L024m5j124j637j197K740
955A523R70o13j538j850K159J230M21j156k690Q43J723J140m96k726o3Q31K002
972A710P26k815o66k4K038K079k127j671k10J354K369j123j299j301P83K580n14
989A889m74j675q51K648Q82j47j636j812J649R18J262j524k208P38R70J388m84
1006A533k732M30O51J976K55k607m20j57K211R51j793r71o19J413J912j286m31
1023C16j642K80K492Ko14j995m40K233O14Pk416j165K367Q54M98j745k129J457
$$ plain form
903 -1473 -3484 -3599 -2657 388 -129 -1306 -2513 -2810 484 1243 53 -1330 -2450 343 2133 1611 -35
920 -35 -1815 -203 2002 2523 1719 -1194 -284 1097 2579 2619 -593 -522 565 2326 3560 638 -361 -3
938 -3 1317 3366 1978 388 -712 657 3151 2208 1094 -412 -238 2786 2741 1617 -20 -1217 1523
955 1523 2493 1880 342 -1508 651 1881 2302 1146 -1544 -701 1022 2162 1666 -1060 -1123 -292 1710
972 1710 2436 -379 -1045 -1069 969 3048 921 -750 -960 394 2763 1640 341 -960 -177 2403 1889
989 1889 1415 -260 -1111 1537 2419 2272 636 -1176 473 1391 2653 1129 -1079 -341 629 2017 1533
1006 1533 -1199 -769 -118 1858 2113 -494 -914 -1071 1140 2091 298 -673 -1292 121 2033 747 316
1023 316 -1326 -1046 1446 1448 834 -1161 -1601 632 1246 1253 -1163 -2328 39 893 1391 -354 -2483 -1026
1041a026Q90J167j014k101N58N93J654k86k086l06KK027R17j656p15j034J718
1058f98K037j299j040j717J469K336n33j012k148O67K427O0J8k060o65K126M67
1075D35N23j326j811J465K86J778r77j915N12P2K426N0k383m85K0K390M61j868
1093c47m22q22K262J116j403p37j346J283K030q53q1j882L03J482N54o8k016r6
1111a043R85J006P89j786j415R92R89J545j447j518J1J387K031j203j735o6K41
1128b37K157J13j670l83l42J409J118p10j130j067J147J377jm67k293O86K216
1145A923n1J2k297p36J752J094L75k246q71J288Q03J194j813j172M27L69J608
1162A659m18j719l14M2J533M61j102j320n63K113Q64o60r29j765J704J453k64
$$ plain form
1041 -1026 -136 1031 17 -2084 -1526 -933 721 435 -1651 -1957 -1955 72 989 -667 -1382 -2416 -698
1058 -698 1339 40 -1000 -2717 -1248 1088 555 -457 -2605 -1938 489 549 567 -1493 -2158 -32 435
1075 435 958 -368 -2179 -714 -428 1350 373 -1542 -1030 -958 1468 1518 -865 -1350 -1330 1060 1521 -347
1093 -347 -769 -1591 671 1787 384 -353 -1699 -416 1614 761 680 -1202 -899 583 1137 1069 -947 -1043
1111 -1043 -58 948 1737 -49 -1464 -472 517 2062 615 -903 -892 495 2526 1323 -412 -478 -237
1128 -237 1920 2033 363 -20 -362 1047 2165 1455 325 -742 405 1782 1781 1314 -979 -293 1923
1145 1923 1872 1884 -413 -1149 603 1697 2072 -174 -1045 243 1046 2240 427 -745 -318 51 1659
1162 1659 1241 -478 -792 -750 783 1244 142 -1178 -1741 372 1236 576 -353 -2118 -414 1039 775
1179G75j112j673J042J274Q00r42j854Q85O46O42P55k037n18P43O54J269j423
1196g4j234L1Q92K100j287j199n10J06K257O5j689n25m88J966O33j124j140p27
1214a947J920N27k08j036j514J451J148K26l92j793r7J185R25L80j884m52L00
1231a261J234J316j699j248K33J047J499j140j151n54Q91J748p55k76j181%J706
1248D09J27n50p76r13J510P78J08j131j451J145Q21O73n90k085R40J002R93j12
1266H98j949n5P23J262N31j694m62j68J422J209j277n77m33O70J938p43p02j171
1284e78J44K078M5k91j550o05K057N34m05j142j467J980O48N97j065j510M94P85
1302G49R14l84j621K55n6J430O42j933j26l71P90J270r59j189p12J490J089r15
$$ plain form
1179 775 -337 -2010 -968 306 1106 164 -1690 -805 -159 483 1238 -799 -1317 -574 80 1349 -74
1196 -74 -1308 -1277 -385 1715 428 -771 -1281 -1175 1082 1147 -542 -1067 -1555 411 1044 -80 -1220 -1947
1214 -1947 -27 500 292 -744 -2258 -807 341 567 175 -1618 -1715 -530 395 775 -1109 -1561 -1261
1231 -1261 -27 1289 -410 -1658 -1425 -378 1121 -19 -1170 -1724 -833 915 160 -116 -1297 -1297 409
1248 409 536 -14 -790 -1703 -193 585 693 -438 -1889 -744 77 750 160 -1925 -985 17 1010 898
1266 898 -1051 -1106 -383 879 1410 -284 -746 -914 508 1717 440 -137 -570 100 2038 1295 593 -578
1284 -578 -434 1644 1689 1398 -152 -757 1300 1834 1429 287 -1180 800 1448 2045 980 -530 -36 749
1302 749 1663 1279 -342 -87 -143 1287 1929 -4 -130 -501 289 1559 600 -589 -1301 189 1278 363
1320C63n68j164M16J905k58k49j400l78J337N41K49j417n92Q69L83J112j082j515
1338a448R70K57J667n31j567j93L90J643J02j265l60j85J484R32j290o85o15R61
1356B67J446n77o94j026M23J211K39l58j511j53J562J74J7j441q88J392N05M76
1374A064j277j254O14O17J169q42j666L72J1J359j47j339k36l37J563O10j041
1391g60p88p48J599N48l86o39j140Q13J513j87k91j264NJ257Q70j27j692j01J051
1410d67J92J168j367j014P39M41R98p07p78P5K72J563m41r55l05k07J861J05r46
1429B27o65l53R75J298o27p49j018Q80J229k62l17j575Q79J148K37q9j613k09
1447f04P48O47N64j228m21J60M79J466j203j031K61K39J489l10j024k85JJ029
$$ plain form
1320 363 -205 -1369 -953 952 694 445 -955 -1333 4 545 794 -623 -1215 -346 37 1149 67 -1448
1338 -1448 -478 -221 1446 915 -652 -845 -455 1188 1290 25 -335 -520 964 1896 606 -79 -694 267
1356 267 1713 1136 442 -584 -161 1050 1289 931 -580 -733 829 1003 1020 -421 -1309 83 588 1064
1374 1064 -213 -1467 -853 -236 933 91 -1575 -1203 -1192 167 20 -1319 -1555 -1892 -329 281 -760
1391 -760 -1548 -2296 -697 -149 -535 -1174 -2314 -1501 12 -175 -466 -1730 -1725 -468 402 275 -1417 -1518 -467
1410 -467 -275 893 -474 -1488 -749 -308 690 -17 -795 -720 -448 1115 674 -281 -586 -793 1068 1173 227
1429 227 -438 -791 184 1482 855 106 -912 -32 1197 935 618 -957 -78 1070 1307 1218 -395 -604
1447 -604 144 791 1355 127 -294 -134 345 1811 608 -423 -162 77 1566 1256 232 -53 -52 977
1465I77K97o36p21m55J666J69k84q39q56J012Q13P6o70r76M67P69M08j65j414
1484c62n2O21P89J33j360n60J08R80J035j138o42j57O92Q21j52j094m05P0J501
1503H28l41o38m05n87J449L68j53p68j015J272M49l9o23j234R53R57L46m22j237
1522h40j2P80N05J26j304k70K38J126M12q32m29l73P29R41n58m38p49JJ525Qm95
1543I1q63m74J423L08l61q07o54Q70Q10J24r09j135R97N13L14k5j540j0Q18J030
1563E20k46j270Q6rQ83O03j065l32k10P68Q12n58p89l68L61J389n07m24q00J9
1583a137J333j3J52j134n37J390J15J63p51o81R42K48O62l99j000R0M17J199q6
1602I73j224k38L42J051L73r50m90J00Q54P65p42o92m33Q32R02m14j54j001L06
$$ plain form
1465 977 1274 638 -83 -538 1128 1297 1013 174 -682 330 1143 1219 549 -427 40 809 1217 1052 -362
1484 -362 -414 207 996 1129 -231 -791 -683 297 1332 194 -448 -605 87 908 756 -338 -743 -673 828
1503 828 487 -151 -556 -1143 306 674 521 -247 -1262 10 459 420 -203 -1437 -484 473 819 397 -840
1522 -840 -852 -72 433 559 -745 -1015 -777 349 761 -71 -500 -873 -144 797 239 -199 -948 -947 578 586 91
1543 91 -772 -1246 177 485 124 -683 -1337 -467 343 467 -442 -1577 -580 -67 247 222 -1318 -1328 -510 520
1563 520 274 -996 -910 -919 -36 567 -498 -830 -1040 -272 540 -18 -807 -1175 -814 575 68 -356 -1156 -1137
1583 -1137 196 183 335 -799 -1336 54 169 332 -419 -1100 -158 90 752 353 -647 -557 -140 1059 973
1602 973 -251 -489 -147 904 1277 327 -163 -63 791 1556 814 122 -311 521 1423 1009 855 -146 160
1621A60Q71J93r6j171O5Q50L95M29j267p15J070K49M06o53j173N66M44O66j48
1640A141j286L7K65Q79q9q42k70n74J167M70k97n47j012Q25R07l14m83j290L73
1659i40J240J24k89p66n27J215M78j2j091j82L63O89N04j259l86M10J88P88r7
1678D50q43l05L90R69j1o64n60j76J165N15p65n69k88O27J093l82r44n28M39O57
1698B70J70k39j002k25J109n9M29j033p41Q95M22J62m37r41L48M62P31n38o05
1717h22k21K5J308j54r22o09K30J125L19l71n14r16J177M56k53j53j162N73R49
1736F5K43l86q81m0Q18P02o8j297J40N95K75P60j086k85k70O07J161p34n95q2
1756c58q3J514n01m41m60j33J341J63p02k99n09R06P60m56o41n20N88N07N98o22
$$ plain form
1621 160 1031 1224 1128 -43 22 872 1267 1696 429 -286 784 1033 1439 786 -387 179 623 1289 1141
1640 1141 -145 -108 157 1036 947 105 -165 -739 428 898 601 54 -958 -133 774 460 -23 -1313 -940
1659 -940 300 424 135 -631 -1158 57 535 523 -568 -750 -387 302 806 -453 -839 -429 -241 547 450
1678 450 -393 -698 -308 661 650 -14 -574 -750 415 930 165 -404 -692 -65 1028 646 -298 -826 -387 270
1698 270 440 201 -801 -1026 83 24 453 -580 -1321 -426 -4 158 -279 -1220 -872 -410 321 -217 -822
1717 -822 -1043 -1018 290 136 -786 -1395 -1165 -40 279 -92 -606 -1522 -345 111 -142 -295 -1457 -884 65
1736 65 308 -78 -959 -999 -181 521 453 -844 -704 -109 166 926 -160 -445 -715 -108 1053 319 -276 -358
1756 -358 -441 1073 572 131 -329 -462 879 1042 340 41 -468 438 1198 742 101 -419 169 676 1274 652
1776F52j114N25N98R0K66q92k85M68O46K5p38j64l37O42R79j176j32k73L16R39
1796A035k60n63o84J74J171j44o02l12n87J207k32K59n88o33O38P20j6n07p34
1815f58M23L75L74q6j254L45K14O43N04j226k31L87M20M86n81m51m04N91O70j76
1835C65l91q04P8J160j00k52n72k29Q28M63k03o13n43R12N0J37j17o99J18N34
1855A22L22M8j234J42M43O37K66r53m79R5O93L85p45l56j52K52J000m76n54l35
1875h79M20M20Pl02p99O0J059J3Pp53l39L15O66K85n40n32J55M43O80k92j017
1896i23M55nP78K95r07m14K77P29R2k93m57m70R23P39p00j76o29O31N65lk77o46
1918d16P4P89K40j87o69k59O17K67M08o06o01N38R3L92l76m97j69N53M87N7r30
$$ plain form
1776 652 -462 63 661 751 1017 125 -160 308 954 979 241 77 -260 382 1361 185 53 -220 96 1035
1796 1035 775 212 -472 -298 873 729 127 -185 -772 435 203 462 -126 -759 -121 599 583 76 -658
1815 -658 -235 140 514 428 -826 -481 -267 376 880 -346 -577 -190 230 716 135 -316 -720 -129 541 365
1835 365 -26 -830 -752 408 308 56 -516 -745 83 546 343 -270 -813 99 149 286 169 -530 -412 122
1855 122 444 492 -742 -600 -157 480 746 -207 -686 -591 102 487 -258 -614 -766 -514 486 10 -544 -879
1875 -879 -459 -39 -32 -334 -1133 -1073 -14 -1 6 -747 -1086 -771 -105 180 -360 -892 -737 -294 386 94 -923
1896 -923 -468 -473 305 600 -307 -721 -444 285 377 84 -373 -843 80 819 119 -57 -686 -55 510 507 230 -416
1918 -416 -342 447 687 500 -169 -428 189 456 864 258 -343 195 288 680 304 -193 -362 191 678 735 -195
1939a95j86M14L92N53p63l85n9M76O18n9o95m99O25N33k96q2r65M30Q64j47J95
1960G69p93l11N35J87L09n41n64K45M82L28q9r99L35J19R86n14m74k51q6Q96N
1981E74m69j90l26N64O18p30R2q92L58N85j4m6r09N28K33J13M23j008l9N69J17
2002A51p1p08NK66K33L66k96q92K65K72O25j29n35j27q4R59or68K72l67R16L40
2024D87m31n76m88P10L51l8q1o44K48M27L60l46n89j13L91M55K02r41J49J55K41
2045g1M25l87p64J2O80M62m3m01l95P3N60Kj75n99oP93J85o05J20p37P75J03J16
2068A23r9q62L39M46L67k25r74M89J29L36L16j121K74M6O32J93p76j5j51L43P44
2089E54o05R7n04K10O84k05K11o53k25J202l52k97o4l97P21J96K83l23j038O40
$$ plain form
1939 -195 -381 33 425 978 215 -170 -229 247 865 806 111 -388 237 770 474 392 -573 -143 721 574 769
1960 769 -24 -335 200 387 696 155 -409 -164 318 646 557 -442 -107 12 998 484 10 -241 -327 569 574
1981 574 105 -85 -411 153 771 41 133 -759 -401 184 170 124 -785 -257 -24 89 512 -496 -535 34 151
2002 151 80 -628 -623 -357 -124 242 -54 -946 -681 -409 216 87 -448 -575 -659 300 294 -674 -402 -769 147 487
2024 487 56 -520 -1008 -298 53 15 -66 -710 -462 -35 325 -21 -610 -723 -332 123 325 -616 -467 -312 -71
2045 -71 354 -33 -797 -785 -105 357 314 -87 -482 -409 151 153 -22 -621 -627 166 351 -254 -134 -871 -96 7 123
2068 123 24 -838 -499 -53 314 89 -885 -396 -267 69 385 -736 -462 -416 216 409 -367 -382 -533 -190 554
2089 554 -51 46 -458 -248 436 231 442 -211 -436 766 414 117 53 -344 377 573 856 533 -505 135
2109A35L64K17k82m54J99q6N41L69j189K23J20L58M91p71l4m32P43M12q72k00
2129a48k9M64K95l7m52m1k15Q89j45l21k32n79J047j63l9o87l93Q38P2J70k03
2150I1m83J35j54N18J24o99j1K22L73K28o83q3j91O57N88q62J74m94J09Q60k87
2171A32j22n57L01M53r0L5n74k48P11J74L67n95n69Q73n03Q16k80o77K86j73O38
2192C98k0o33k14L49K54K03l87l15K3L99J55l57R2n97K63O27m55J2m82K57K19
2213b09J41j03l13j03N93p3L28o63j02M45j25M39o56l6O9K50N98l35o14K68j91
2234c92P78l37m70K52j95P20K59n50l45j43N51J26J9k6o85Q3Q90k46L4n81k6O27
2256C43L0O3n24k14L85L93L32o47l03J81K09M18l32n85K83Q8L86%k36l98q6P77
$$ plain form
2109 135 499 716 434 -20 179 93 634 1003 -186 37 157 515 1006 235 201 -231 512 924 52 -148
2129 -148 -177 287 582 545 93 52 -163 726 581 260 28 -551 496 333 294 -393 -786 52 124 294 91
2150 91 -392 -257 -411 107 231 -468 -479 -257 116 344 -339 -422 -613 44 632 -230 -56 -550 -441 419 132
2171 132 10 -547 -246 207 117 152 -422 -670 41 215 582 -13 -582 291 -212 604 324 -353 -67 -240 398
2192 398 378 -255 -469 -120 134 337 -50 -365 -342 57 212 -145 -53 -650 -387 240 -215 -203 -685 -428 -209
2213 -209 -68 -171 -484 -587 6 -67 261 -402 -504 -59 -184 255 -401 -437 -368 -118 480 145 -469 -201 -392
2234 -392 386 49 -421 -169 -364 356 615 65 -280 -423 128 254 273 247 -438 -355 535 289 323 -258 -284 343
2256 343 373 436 -88 -302 83 476 808 161 -142 39 248 666 334 -251 32 120 506 506 270 -128 -214 563
2278E63L41n77j1k06J90N14o97J24m44L31N70k72j01l31Q3J57K77J80p97r5K45
2299D4K61K02n86K13J42j62O87q00J6j50j51Q50k64n2m15J0O39k11j59k32l55
2320d73Q67q1r5l29l72L52J71K42k31m76L13K74K76j86m03Q1L0K81K53o53l38
2341d97L62J97O05r40K74J2o02R42l86j48K6k74O56l7k49l98l3O27L92l37k42
2362e0k70J48K33K7j99o75N76RM23k65n17K54K32N2J69p50Q4k2L77M84m63l10
2384d53j9L03L99k83k84j47K61N26k45j56k04l92O86K28k62j87k53N93K91k04
2404A98l01l21m1N64J20k39j77K47j41K46op4j89j66N96J12m73Q5l33L50N66m67
2426A56j18k64J50M44j19J02m83l40P91k6J8l84k91N83j2K84l35m84M65j2K22
$$ plain form
2278 563 904 327 316 110 300 814 117 241 -203 128 698 426 325 -6 77 234 511 691 -106 -201 44
2299 44 305 507 -79 134 276 114 801 1 17 -133 -284 566 302 250 -165 -155 484 273 114 -118 -473
2320 -473 394 313 218 -111 -483 -131 40 282 51 -425 -112 162 438 252 -151 -70 -40 241 494 -159 -497
2341 -497 -135 62 667 -273 1 13 -589 353 -33 -181 -155 -429 227 190 -59 -457 -490 137 529 192 -50
2362 -50 -320 -172 61 88 -111 -786 -210 -201 222 -43 -560 -306 -74 -22 147 -603 -519 -541 -164 320 -143 -453
2384 -453 -472 -169 230 -53 -337 -484 -223 303 58 -98 -302 -694 -8 220 -42 -229 -482 111 402 198
2404 198 -103 -424 -465 99 219 -20 -197 50 -91 155 149 75 -114 -280 316 428 -45 40 -293 57 623 156
2426 156 38 -226 -76 368 249 351 -132 -472 319 293 311 -73 -364 219 207 491 156 -328 137 125 347
2447C47j40n83L52M8Q04m56l27J40j92J52M34n93k2k5J71N14o05L22o64K56K73
2468B06m8n7j20k65O30l9l27k14L2L92j01J87k20n04L94K20L28m69l53j4L38J88
2490A84Kn10M4R8M37J13o93J08m73M46O60o18o1J0J78K36j30o6k51l45M27J07
2512i7K67l85J02P7K3J69m20l69M09L20L62n65l89J68K89J28j24l45%K45M47k31
2534H1n12J10lM18K41l07j02m06K48O97n71Q8l81K28J96n4q1k22K1J87L22K4l70
2557a48j90K00r6M10j84p30N59J41L24k90k40NJ8M40j20j59k70j13N94O2m87K96
2579B2n24L43K61L8j74m82L41P20o05L03k42j25M23j34J46l46p1qL90J36k66j41
2601EK3J52M33n79k18P0K54L52q0k31l01j5O49j70l63K1j34L68L00k59k63j59
$$ plain form
2447 347 207 -376 -24 24 828 372 45 185 -7 145 579 -14 -36 -61 110 624 19 341 -323 -67 206
2468 206 158 101 -19 -284 346 307 -20 -234 -202 190 89 276 56 -448 -54 166 494 25 -328 -342 -4 184
2490 184 186 -324 -280 -182 255 368 -325 -217 -690 -244 416 -202 -263 -253 -75 161 31 -35 -286 -631 -204 -97
2512 -97 170 -215 -113 -36 -13 156 -264 -633 -224 96 458 -107 -496 -328 -39 89 -35 -380 -380 -135 312 81
2534 81 -431 -321 -324 94 335 28 -74 -480 -232 465 -106 -18 -399 -171 25 -29 -110 -332 -311 -124 198 222 -148
2557 -148 -338 -138 -234 176 -8 -738 -179 -38 286 -4 -244 -239 -221 219 99 -60 -330 -443 151 213 -274 22
2579 22 -502 -159 102 140 -34 -516 -175 545 -60 243 1 -124 299 165 311 -35 -106 -114 276 412 146 5
2601 5 28 180 613 34 -184 -114 140 492 412 181 -120 -135 514 344 -19 2 -132 236 536 277 14 -145
2623a45L3K42J40R2o24J20J28J38J46l10k66O77l46J9k23R6K21L17K14n87j35
2644e3j68J59J31M8j30m00K25M76j47j39j99j5N17j44O2k77l38K89M07k16m9l70
2666c31L63J97l7J65n04J12q9J79J60k82l14J53L77L2p4k72l0J11L66l94P8n2
2688h6k73M08j54K41l92o8J66L47l66R9l01M74l68M93j29m35K64Q9K70l31k45
2709b97o7J82L53n1l01p2K21k07L65j69k88J98n8L78k32P8n64M38N58k18P3p43
2731d23J10M55j49K9o4j28n2M97L24m89m11K27j8L41o4m59L11k12K02Q9j10q5
2753g9QJ21L00m75K24m44L85K60k73K37m80J44L83r7l01k80K16K18J72j59k24
2774a44r3L81K22k13j23o1L0J8M67m82k60L61J7N1J48l16l3K8J61J15l38R0j13
$$ plain form
2623 -145 -112 130 270 362 -262 -142 -14 124 270 -40 -306 371 25 44 -179 -83 138 455 669 82 -53
2644 -53 -221 -62 69 117 -13 -413 -188 288 141 2 -197 -212 305 161 223 -54 -392 -103 304 88 39 -331
2666 -331 32 229 192 357 -147 -35 -124 55 215 -67 -381 -228 149 181 107 -165 -195 -84 282 -112 -34 -86
2688 -86 -359 49 -105 136 -256 -324 -158 189 -177 -78 -379 95 -273 220 91 -344 -80 9 279 -52 -297
2709 -297 -364 -182 171 120 -181 -253 -32 -239 126 -43 -331 -133 -191 187 -45 33 -531 -93 465 247 320 -423
2731 -423 -313 142 -7 22 -42 -170 -222 275 599 110 -301 -74 -92 249 185 -274 37 -175 27 116 6 -79
2753 -79 -71 50 350 -125 99 -345 40 300 27 264 -216 -72 311 214 -87 -367 -151 67 239 80 -144
2774 -144 -237 144 366 153 30 -31 -1 17 484 2 -258 103 120 171 319 3 -30 -2 159 274 -64 26 -87
2797h7M18J09m59j33o8J20L89l17j01l03K77J70J3J58j43k52L44j51K03k40m21
2818d74O33j79L80m10l14Q5L14J01%j14p5j76L86O5o53J77K1J5L74l09K38m45
2840c60R8M02l24J01k99K15J57J94l0l38K03k42J42K32k59k18K76k3K27o14J85
2861b75J0QO34j08k76l7k80N75Jm11J7o5K50J26j6l90K2M21j89j11L83n26Q5J51
2885aR1lk68j89K75J47K18m13k4Ol0O11m94l1J98o5L72m34p0j28J37M26l12K20
2909B39o73M20J64q1Q6l89o3K16K10K00m74p5J93J47R3j12k69K26K43q6j81L7
2931G1j10K51k0N6l11K6J68m4L67l52Q7k34J25J39J53l85P9J34P0j01J16j42m14
2954b71L29K32o6n8m08K51J39J72k05l50K58O0N6j83l0L26k48J28J01k43J41j49
$$ plain form
2797 -87 331 440 -19 -152 -220 -100 289 -28 -129 -432 -155 15 28 186 43 -209 135 -16 187 -53 -474
2818 -474 159 -20 360 -50 -364 -279 35 136 136 22 -53 -229 157 222 -431 -254 -233 -218 156 -153 85 -360
2840 -360 -262 140 -184 -83 -382 -167 -10 184 154 -184 19 -223 -81 151 -108 -326 -50 -73 154 -460 -275
2861 -275 -265 -257 377 269 -7 -44 -324 251 252 -159 -142 -207 43 169 153 -237 -215 206 17 -94 289 -237 -152 -1
2885 -1 90 87 -181 -370 -95 52 270 -143 -167 -161 -191 420 -74 -105 93 28 400 -34 -104 -232 -95 331 19 239
2909 239 -434 -14 150 69 155 -234 -297 -81 129 329 -145 -220 -27 120 213 101 -168 58 301 215 34 71
2931 71 -39 212 192 248 -63 -37 131 87 454 102 189 -45 80 219 372 -13 66 200 270 169 285 143 -271
2954 -271 58 290 224 166 -242 9 148 320 115 -235 23 83 139 -44 -74 252 4 132 233 -10 131 -18
2976a8o2K54m8r8j19Q9L1o1R7k06j21L23L66k33n37L71O7R0j36j22l59L74J89
2999A31j48J02n53N09J7j22J06q2j64K1K16p4l24L16j62J74M78p59J12L8R8J21
3021E1J40m44K6j91N21l4J33n15m8O41k75L1Q9m00L01k75K11j05m12M37j37L93
3043A38J17l57p0L6K56K21l85P6o4r7K37L9l73l9K19J87j98M33l90K0L12l99K36
3066A55l04J45J21j39L5%j32P3J43rj54j6R0K19k90K20k93J75q8K98l9r2q9k86
3090b57N36q3k05l8O3j30L46l26J9J91Rp2J52r4J8q5P7J62j43j98J85J18R8l8
3114C05m36j5M36j23J58l19RJ06J45L09l99j45R0J43o0j93j13J44j90K61lo6j66
3137a22J8L7L60l73J32j13L8J39o8J63m08J67j88K27k0l57L34j12L2L51k59J95
$$ plain form
2976 -18 -80 174 126 28 -91 -2 29 -32 65 -141 -262 61 427 194 -343 28 95 185 49 -73 -432 -58 131
2999 131 -17 85 -468 41 58 -64 42 -40 -204 -183 33 -41 -365 -49 -211 -37 441 -318 -206 -168 -70 51
3021 51 191 -253 -227 -418 103 69 202 -313 -361 280 5 36 125 -275 26 -249 -38 -143 -555 -118 -255 138
3043 138 255 -102 -172 -136 120 341 -44 32 -32 -129 108 147 -226 -265 -46 141 -57 376 -14 6 318 -81 155
3066 155 -149 -4 117 -22 13 13 -119 -46 97 88 -66 -82 8 227 -63 157 -136 39 -49 249 210 118 29 -257
3090 -257 279 196 -9 -47 16 -114 232 -94 -75 116 125 53 205 111 129 44 121 283 140 -58 127 245 343 305
3114 305 -131 -146 290 167 325 6 15 121 266 575 176 31 121 264 204 11 -102 42 -148 113 110 44 -122
3137 -122 -104 -67 293 -80 52 -61 -23 116 48 211 -197 -30 -218 9 -11 -368 -34 -146 -114 237 -22 173
3159A73m43J73K30j89l0l3J8L01k29k5J1k57K40j35K67K7k72j33K67k1Q7k50N4
3182a69j03K03K5k23L0L46l46M25k95j54Q5L6K96l28J0q4J6K9J51Q3l96K4M29
3205I0j40o2j38Q1K26k38M4j86n0J10M44k98M2j71J23Q7M6K14l68j87L69j2n4
3228b8R5K3j51K05j17p5l01M03k75M09l32J25K8r7K64j10L6j96j97L35L6n2j06
3251g8k09N26j83J20k99M2K1J02J0o3j03J87J67O5j48j09R8rn8P2r0J06o59N65
3275G3P2J94l23j14J67R4R3j68l7k18K34j14K39k67P2K20k88J99k02l0j00K78
3297G4K42k40j66K87l87M27j33l22P1K44M5n7l0p1k39J70J74k02J86k29J17J22
3319H3J98n26j1J98J66M6M3l05k03L67l37M68n04J22K00j08L09n30J64o4L68m2
$$ plain form
3159 173 -270 -97 133 -56 -86 -119 -101 200 -29 -54 -43 -300 -60 -195 72 99 -173 -306 -39 -60 27 -223 -169
3182 -169 -272 -69 -44 -267 -237 109 -237 188 -107 -261 -176 -140 156 -172 -162 -246 -230 -201 -50 33 -363 -339 90
3205 90 -50 -112 -250 -169 57 -181 -137 -323 -373 -263 181 -117 -75 -246 -123 -36 10 224 -144 -331 38 26 -28
3228 -28 67 90 -61 144 27 -48 -349 54 -221 188 -144 -19 9 -88 176 66 102 -94 -291 44 80 28 -78
3251 -78 -287 239 56 176 -123 -81 -60 42 52 -11 -114 73 240 305 157 48 146 137 79 151 61 167 -492 73
3275 73 145 339 16 -98 69 163 256 88 51 -167 67 -47 192 -75 -3 217 -71 128 -74 -104 -204 74
3297 74 316 76 -90 197 -190 237 104 -218 -147 97 142 85 55 -16 -255 -85 89 -113 73 -156 -39 83
3319 83 281 -245 -256 -58 108 154 197 -108 -311 56 -281 187 -317 -195 5 -103 206 -324 -160 -224 144 102
3341A02k01r8l8Q4J90j7j26M5k39J53L17j52j01k61K15J72k45J71R5l53L95L2
3363A40K02m26k07N47k58J40l46P5J40M7o1N1l26K56k3J04j14q3j8k22M92j4l78
3386b82N8K22O7N2j64l6l9L3P4P2j53o3K47N3j01j61o9K37J78j81Q2j33j0o8J03
3411A8J83l65k42O05k82L03j00J1k04m5M20j58J6K0l66K78j8r9k18k18N77K06
3433C22j16n1k33O9L84m83L09l20j7L21j92J46q1K9o9J11J41m37J60j44J37L88
3455C74k11J13l31K42J87k45l89M02j6L7j9qm05O0K24M1j56r8J31p6Q5J08N5k99
3479a94n7OK28m2k10J20Q5M6K00l7l80M01j25k9j89k2K05nj32Q5J6k11L12j84
3503a13L67k80Mk46L49p9J49l15O5K37m45L01MJ34l70L97j95J70l17L4J61J30
$$ plain form
3341 102 -99 -197 -235 -151 39 22 -104 -59 -298 -145 172 20 -81 -342 -127 45 -200 -29 66 -287 108 140
3363 140 342 -84 -291 256 -2 138 -208 -133 7 54 -7 44 -282 -26 -49 55 -59 -142 -160 -382 110 96 -282
3386 -282 -224 -2 65 117 -47 -83 -122 -89 -15 57 -96 -159 88 141 40 -121 -190 47 225 44 126 -7 -17 -85 18
3411 18 201 -164 -406 199 -83 220 120 131 -73 -118 302 144 160 180 -186 92 74 -25 -243 -461 116 322
3433 322 206 155 -78 -9 375 -108 201 -119 -136 185 -7 139 58 87 18 129 270 -167 -7 -151 -14 374
3455 374 163 276 -55 187 374 129 -260 142 126 163 144 136 -269 -209 15 56 -100 -198 -67 -143 -58 50 105 -194
3479 -194 -251 -245 -17 -59 -269 -149 -64 -18 182 145 -235 166 41 12 -177 -199 6 1 -131 -46 -30 -241 71 -113
3503 -113 254 -26 -22 -268 81 2 151 -164 -99 138 -307 -6 -2 132 -238 159 -36 134 -183 -149 12 142
3525A42m6J6k38k2M82m38r4j26J8K79Q6Kj86j04K66j66K24k81Q1j13M70l61KR3
3549a4j87J08L17j8l70J62K3OJ14q9j65J47J29Mj95J51o6k10K80J2j0K1m04K26
3573b8P1j76J36l83K47M21l02K41k92K14l12J0K22j70M3L8j55M91m42j1L86k82
3595c3K20J05l44K94m71M64j37k27L89m50L17K03m44k1O6L1O0P1L6p2J36J31k08
3618A16k86K40r8J8n8K87l23L9J47R4r3j4j47L45k12Q3M1n64K13M7J57n2J54j85
3642e1j36J88L5j7j94M9n4L74m27l3K22M1K17q6j86j07L32j32M1j43j57L99m84
3665c09N41l51N6L5N5l06K48J21j42j13K81k1l0j94r2N9K46j06j12r8J17K0K37
3688A42k68J51k28K00J04l35L18o3K3m3J85l23N7J10N6j8j12Q8l8j69J36J59j14
$$ plain form
3525 142 96 112 -126 -148 334 -104 -198 -324 -306 -27 59 61 -125 -229 37 -129 95 -186 -105 -218 252 -109 -107 -14
3549 -14 -201 -93 224 206 -164 -2 21 27 141 52 -113 34 163 167 -28 123 57 -153 127 139 129 150 -254 -28
3573 -28 43 -133 3 -380 -133 288 -14 227 -65 149 -163 -153 69 -101 -58 -20 -175 316 -126 -137 249 -33
3595 -33 187 292 -52 242 -229 235 98 -129 260 -190 127 330 -114 -135 -69 -38 22 93 129 57 193 324 116
3618 116 -170 70 -28 -10 -68 219 -104 -65 82 176 83 69 -78 267 55 138 179 -385 -172 -125 32 -20 134 -51
3642 -51 -187 1 36 19 -175 -126 -180 194 -233 -266 -44 -3 214 128 -58 -165 167 35 76 -67 -224 175 -309
3665 -309 232 -119 -63 -28 27 -279 -31 90 -52 -165 116 95 65 -129 -221 -162 84 -22 -134 -232 -115 -95 142
3688 142 -126 25 -203 -3 101 -234 84 21 44 1 186 -137 -80 30 86 68 -44 44 6 -163 -27 132 18
3711A8rp3J41j1k43j45K92k40L62L03o97K74k81M88K50n83K62j32k6J73k28J75
3733G0k10L17J23k35p8j25j0J48pL0p0K11k01M1mj54Q9L24k62K71l47J45J85l94
3757a43J92qJ50k81J05P7k18L00n8n2O4o6J26M0n09K70j4m7L29k05n7K18l34L05
3781A84k90P5j06K71O2m00Q8J40k8Q9j72J30j22J4Q8m3Kq8J59l3k7R7q1j43J38
3806DK43l45pl8J70k0J74J01k77l1m5K38m2l28L22Q9k38Q8O2j42P2q1L5k15M7
3831a64p6q4M79j63K7j15j67K75P6R3l09p0K76p2q2K31m9l53L97k56N1L8l09J79
3855a47L25pn18P7K57J47Q4j26j24J67k02J78j80j39J56P0J92j0k42O3j84K77
3877A14L4j56J88k91OP1k93M11k2pJ0k3Ml6k7k7K55l23L75k06k8K4n7j51K55j47
$$ plain form
3711 18 9 -64 77 66 -177 -322 -30 -270 92 395 -302 -28 -309 179 429 -154 108 -24 -50 123 -105 70
3733 70 -140 177 300 65 -13 -138 -148 0 -7 23 -47 164 -37 4 0 -154 -65 259 -3 268 -79 66 251 -143
3757 -143 49 41 191 -90 15 92 -126 174 116 64 128 62 188 228 -281 -11 -25 -72 257 52 -5 213 -121 184
3781 184 -106 -31 -137 134 196 -204 -116 24 -4 85 -87 43 -79 -65 23 -20 -18 -106 53 20 -7 90 9 -134 4
3806 4 247 -98 -105 -143 27 7 181 282 5 -26 -71 167 125 -203 119 208 -30 58 120 -22 50 -31 4 -211 -164
3831 -164 -240 -324 155 -8 19 -96 -263 12 88 181 -128 -198 78 6 -76 155 106 -247 150 -106 -55 -17 -326 -147
3855 -147 178 171 -347 -270 -13 134 218 92 -32 135 -67 111 -69 -208 -52 18 210 200 -42 21 -163 114
3877 114 148 -8 180 -111 -105 -34 -327 84 62 55 65 42 46 10 -17 -44 211 -112 263 57 29 53 -4 -155 100 -47
3903d7j63O85o11L22j95J66k13N3R4k89P5q5L24M4o4j00K11m6j10J55j34J00j78
3926fK11o5l9j71K05j2J2m3k3j33J71R1j00l68O5J39M2J0j1K38k03R6j22J7l20
3951c19L36l6J35R9l81P7j37J02J08k25J52M4J00R6k79N5j07P1J08k02P6p3P3
3974a27O8J32k9p9J20m0j02j94K68k31M32l21J84l31L13k1O2j6p5J22l67L89J56
3997C13j98m10L53j83L0m8j8L6Q9J0L8M2j5j50J90k71K92L1k49J36j28j88M32
4020A34j65n7L6n8Q8k2R4j80J11j27n9K39l3J66m07J36J20l0o5j32J85M5J30l00
4044a51K06K6k06R6Q1nq4K42k67qn3L7L77n12L09O3j30L15m98J95J35j31J1k2
4068B6J81l28K54j02P3J6L3k35M0P2PJ4j96J54R4N8l75R4J29K84n78K85j2L10
$$ plain form
3903 -47 -210 475 -136 186 -9 157 -56 -3 91 -198 -123 -208 116 160 96 -4 207 161 51 206 72 172 -6
3926 -6 205 140 101 -70 135 123 135 92 69 -64 107 198 98 -270 -205 -66 -24 -14 -25 213 10 106 -16 1 -319
3951 -319 17 -19 116 215 -166 -89 -226 -124 -16 -241 -89 -45 55 151 -128 -73 -180 -109 -1 -203 -127 -200 -127
3974 -127 -59 73 44 -35 85 45 -57 -251 17 -214 218 -103 81 -250 63 42 104 88 13 135 -232 157 313
3997 313 115 -295 58 -125 -95 -143 -161 -125 -36 -26 12 54 39 -111 79 -192 100 131 -118 18 -110 -298 134
4020 134 -31 -88 -52 -110 -22 -44 50 -130 -19 -146 -205 34 1 167 -240 -104 16 -14 -79 -211 -26 19 149 -151
4044 -151 55 81 -125 -29 52 47 -37 205 -62 -70 -123 -86 291 -221 88 151 21 336 -162 33 168 37 48 26
4068 26 207 -121 133 31 104 120 153 -82 -42 30 37 51 -145 9 103 161 -214 -120 9 293 -285 0 -12 298
4092B98j77L4qJ34k98j4j20J62j67K82q6j28J7Q2K18j66J33k71Q8o9N6R4m19L62
4116C7J31k79L6K42J65k47j36KK77l05N9J98l72J75J12M0j80J12k22R9J09k36
4138a83K77j07O7J34n3j56j43K38k04J07j49R0j01J10K11j48R9j77J36k34K9L7
4160a20K11j50L1M00k53j2j71j44P7p2K25N9L1j81K02J64j69n4q4m3J17q0J64
4183A48l47J93J18N7J43j30j33j39J84O6K5k79J3K6K23k22k5m5J63j39K04K4j00
4206B8j07k30J04J09J02K8O2j85P9j01nJ46k34N51l39j58K84J9l63K72L2k06K36
4229A24j70J81k93K21M2J13o7j18ppK77k95k7J22j69R2lj30K34k69j04L16R0p1
4253H2q9qJ43n3p3N2l05J72j70J11N36m52J0l77N58j60j69K14q6K34Pl4k34J32
$$ plain form
4092 298 121 155 147 281 -17 -31 -151 11 -156 126 40 -88 -71 11 229 63 196 -75 13 -56 0 94 -325 37
4116 37 168 -111 -75 167 332 85 -51 -49 228 -77 -18 180 -192 -17 95 135 -45 67 -155 -56 53 -183
4138 -183 94 -13 54 188 135 -21 -164 74 -130 -23 -172 -82 -183 -73 138 -10 89 -88 48 -186 -157 -120
4160 -120 91 -59 -28 372 119 107 -64 -208 -131 -203 22 81 112 -69 133 297 128 74 -10 -53 64 -16 148
4183 148 -199 -6 112 169 312 182 49 -90 94 160 185 -94 -81 -55 168 -54 -79 -124 39 -100 104 128 28
4206 28 -79 -309 -205 -96 6 34 96 -89 -10 -111 -116 30 -204 347 8 -150 134 153 -210 62 94 -112 124
4229 124 -46 135 -158 63 105 218 151 33 26 19 296 1 -26 96 -73 19 16 -114 120 -149 -253 63 153 82
4253 82 -7 -15 128 75 2 54 -251 -79 -249 -138 398 -54 -44 -421 137 -23 -192 22 -64 170 177 143 -91 41
4277D1j20J13k99K33J09j65K79nj18K0p8k35O9O8K39j57K88j23j43l4j45J46J48
4300A31J07l62J89Oj42J21m8j01K42l33K31j8O1j35R9J82n67M63j28J38j52J78
4322A62o1o5j93L04j41P1k42K70k63L98l05j63L38j60L8N8j09j69K61l33J70K7
4344a07L01m01L83q1O9r4j26k4K29k38j79K62M3L5J48j84j94n1N18k38K8n6j12
4367f9J61j39j08P5J61k02J61j08o2J80k02J76j90J78K1k36K32P0O7k31k71J67
4389a69j72K94J72o3K23l18N2k86M52r7n7j77J22q5J07J52K0k68J14J5Q8Q1K1
4412B21k12K9J95l33J10j60J96qj31P5j69K59k74J22j31J46n6J55n1J1p3l6J39
4435B4j25J72j7r9L0K90l71J03O7P4R7k63J99K3k58q0n6k7J39N7j46N0P4K3j71
$$ plain form
4277 41 -79 34 -265 -32 77 -88 191 186 68 88 10 -225 -156 -88 151 -6 282 159 16 -18 -163 -17 131
4300 131 238 -124 65 71 -71 50 2 -99 143 -190 41 23 84 -51 48 230 -337 126 -2 136 -16 162
4322 162 101 36 -157 147 6 77 -165 105 -158 240 -65 -228 110 -50 -12 46 -63 -232 29 -304 -134 -107
4344 -107 194 -207 176 95 164 70 -56 -80 149 -89 -268 -6 37 72 220 36 -158 -209 309 71 99 43 -69
4367 -69 92 -47 -155 -80 81 -121 40 -68 -130 50 -152 24 -166 12 33 -203 29 99 166 -65 -336 -169
4389 -169 -341 -47 125 62 285 -33 19 -267 185 88 31 -146 -24 -109 -2 150 170 -98 16 31 119 200 221
4412 221 9 38 233 -100 10 -150 46 38 -93 -18 -187 72 -202 -80 -211 -65 -121 34 -17 -6 -79 -115 24
4435 24 -101 71 54 -45 -15 275 -96 7 74 148 245 -18 181 204 -54 -134 -190 -217 -78 -21 -167 -117 -43 -20 -191
4460a91M85j74k30KP1j27K71rK1o5j85K61N4J37l03q8O7r7J13k74J70J14O6j88
4484i9K4P5j60L36k15l3n0J8J1K30p7k01q6L73k18J56qj29J3o3J66l94L43%p3
4509f1L6J2m6K03k83J46J45k77L06l66J62J55l35K42j37M5R8k5P7j21j02K23m6
4532E1J95j86j8k4k46K53l3K18j55N1k95M58m5k66J92k79K88k83J56Qj48K80l07
4555a35L90l15PJ09j96J82l52L19M7l77M09j89J63k03K02l5K85l38o2P1r6j24
4577b38JK16K31j61k3m1J20j02J30p1j66O8n2q6J70%m4P7j47K08n0m1j82P4J25
4602A6n3K33K5r5Oj93K02p0m9j4L21m06J22K50k21m8j60K32o5j45J9L79m15M05
4626B76m57J80j79j46L21LJ65k24P7r3j8P2J41p1J85j04j0j25k48K11K20l97L42
$$ plain form
4460 -191 294 120 -110 -108 -37 -164 107 98 119 54 -131 130 184 321 18 -70 -3 -100 13 -261 -91 23 89 -99
4484 -99 -75 0 -160 176 -39 -72 -122 -104 -93 137 60 -141 -227 146 -72 84 76 -53 -40 -103 63 -331 12 12 -61
4509 -61 -25 -13 -59 144 -139 7 152 -125 181 -185 -23 132 -203 39 -98 -53 45 20 97 -24 -126 97 51
4532 51 246 60 42 18 -228 25 -8 210 55 106 -189 269 224 -42 150 -129 159 -124 32 40 -108 172 -135
4555 -135 255 -60 -53 56 -140 42 -310 9 56 -321 88 -101 62 -141 61 26 311 -27 -89 -18 -114 -238
4577 -238 -237 -21 210 49 26 -15 105 3 133 62 -104 -36 -88 -174 -4 -4 -48 29 -118 90 40 -1 -183 -109 16
4602 16 -37 196 221 126 132 -61 141 71 22 8 329 -77 45 295 74 26 -134 98 33 -112 -93 286 -129 276
4626 276 -181 -1 -180 -326 -5 -2 163 -61 16 -77 -95 -23 118 47 232 128 118 -7 -255 -44 176 -221 121
4649A21j02k23L1J54J83p6j86J70j86L21r8k09j54K80J52k76L38m61M4L54l08
4670a31m3J99j49Q7J43k10J60k54M3l5l2K90q8j00J50m7J25p5k70L11j03L82l98
4693d5j20J6K27n1l1J9K02n12J37L62j44j24K35k26K3j02J10j9N4K11l39K44k9
4716I8j14K88l79K98k74J24L3pJ32J47n00J68O7m9K08n3o6j62K84m16K95L7j40
4739A9n2K1k37M35k87K69p6J00k99O9L27k84j04l5L95k11j36L10p1j12p8j02J95
4762E6l1j56J47N1J04j58k61J38J16j23Q2n4K43K2k04j50J77J04j43q3L7M0l2
4785g8J8L9RP6j51J54k0K6j96Q1p9j17L96k62K72L4j62K9J4n0k58J62J89m0k16
4810a30mM5O9j08l5K00J13j59k07K35m7J96J27l01J81j66L89m45m2K61k07J76
$$ plain form
4649 121 19 -204 -173 -19 164 88 -98 72 -114 207 109 -100 -254 26 178 -98 240 -221 -177 177 -131
4670 -131 -174 25 -124 -37 106 -104 56 -198 -155 -190 -222 68 -20 -120 30 -17 108 33 -237 74 -29 353 -45
4693 -45 -165 -149 78 27 -4 15 217 -295 -158 204 60 -64 171 -55 -32 -134 -24 -43 11 222 -117 127 98
4716 98 -16 272 -107 191 -83 41 74 67 199 346 -154 14 81 32 240 187 121 -41 243 -173 122 159 19
4739 19 -33 -12 -249 186 -101 168 92 192 -107 -38 289 5 -99 -134 261 50 -86 224 153 41 -37 -139 56
4762 56 25 -131 16 67 171 13 -248 -110 6 -117 -35 -89 154 176 -28 -178 -1 103 -40 -123 -86 -46 -78
4785 -78 -60 -21 -12 64 -87 67 47 73 -123 -42 -121 -238 158 -104 168 202 40 69 83 33 -225 -63 126 86 -130
4810 -130 -134 -89 -20 -128 -163 37 150 -9 -216 19 -28 168 295 -6 175 9 398 -47 -89 172 -35 141
4832A41l26M03n41K60O2J15k93P9M9J14q5k73L25k77K87P9L01j71l41L85j95k39
4854a41J04J45j26n7J39l8p0J72j06L02l24J27K4k83O9j4RJ38l13L51j65J74j56
4877c9N6p7J28p9J11l04J14K71m55j5L71K41l91J43j25J1N0J56k87K31j59j15
4899a63N1M10j12k77K1Q7p8J66Nj32k44M75j14j66J07KJ55k66N3j37J25l2j17
4922a81J22K40q2k65J54n1l0J18l7K28k79K19l18lK46l51J29K09k64M38k42q6
4944h6O5R2O0p0J85j25q8K26l90J47N4o6k81K55k29L08J33m50Q6L2L58k93J65
4967H8p6p7q4QR9L5M9L3q3m3N5J18l97M56l80J98r2M5K10j29J7n9j1qj32J27J39
4994A06j2lk34J7R6q4J63l6j43J02k3k39L80K51k99j64J97j09j29L05J5M7j64
$$ plain form
4832 141 -185 218 -323 -63 -1 114 -179 -100 -51 63 -22 -295 30 -247 40 119 420 249 -92 293 98 -141
4854 -141 -37 108 -18 -75 64 26 -44 128 22 324 0 127 151 -132 -63 -77 -68 70 -243 108 -57 117 -39
4877 -39 17 -60 68 -11 100 -204 -90 181 -274 -289 82 323 -68 75 -50 -39 11 167 -120 111 -48 -163
4899 -163 -112 298 186 -91 -70 17 -61 105 110 -22 -266 209 95 -71 36 38 193 -73 -20 -157 -32 -64 -181
4922 -181 -59 181 99 -166 -12 -63 -93 25 -12 216 -63 156 -162 -165 81 -270 -141 68 -196 242 0 -86
4944 -86 -21 71 131 61 246 121 33 259 -131 16 70 4 -277 -22 -251 57 190 -260 -174 -142 216 -77 88
4967 88 12 -65 -149 -141 -42 -7 42 75 -8 -51 4 122 -275 181 -199 -1 -93 -48 162 33 50 -9 -20 -28 -160 -33 106
4994 106 94 91 -143 -126 -30 -114 49 13 -130 -28 -51 -290 90 341 42 -122 75 -34 -163 142 157 204 40
5017D0k4j19K22j19K59j35k03M31j77P8j32r7K1l4p3M4J96k39k2l8O7q8L10k36
5041f8J96R7l13M9m3J55J54l46J1N4R5J25j17J8k63L43j22k21r0K12K18j08j10
5064g4J73k8q9P2J22M1k38J90j32n8P7K27l22J7J31n8J8k8n6L95n36k4M43l76
5088a13J7j15L5L20n3m6jk08O0jJ97j42K4P6Lm4J15k28J16j31K04l52M29j51R9
5113A10p3j67K04J02l7j23k08O9K85j45j82L13k78rL52j89M3j2j75J61j79M52
5135C14m38k02L53j59K29k20M5k08K34r8R8o9J25K0j74K6O3q9K46j66K0K12j42
5158B0R4N4j50J61j75pj4k36J45k5k09L43J31l10K37j29P6r4J25%j4pk21nJM3
5184a66L80n0l53J47J05k28J08K26J55o40J88K12p9J52k13l9K80Nj29J2J02j93
$$ plain form
5017 40 16 -103 119 0 259 124 -79 352 175 253 121 24 45 11 -62 -18 178 -61 -83 -121 -54 -142 168 -68
5041 -68 128 225 -88 -39 -82 73 227 -119 -108 -54 41 166 49 67 -196 147 25 -196 -286 -74 144 36 -74
5064 -74 99 71 -18 54 176 217 -21 169 37 -21 56 283 -39 -22 109 51 69 41 -15 380 -156 -180 263 -113
5088 -113 -96 -211 -176 144 91 45 44 -164 -104 -105 92 -50 -26 50 53 9 124 -104 12 -119 85 -267 162 11 110
5113 110 37 -130 74 176 139 16 -192 -123 162 17 -165 148 -130 -139 213 24 67 55 -120 41 -138 314
5135 314 -124 -326 27 -132 97 -123 -78 -286 -52 -150 -52 -121 4 24 -150 -124 -61 -150 96 -70 -50 162 20
5158 20 114 168 18 179 4 -3 -17 -253 -108 -133 -342 1 132 -178 59 -70 6 -88 37 37 23 16 -205 -210 -209 -166
5184 -166 214 164 -189 -42 63 -165 -57 169 324 -316 -128 84 5 157 -56 -95 185 190 61 73 175 -18
5206a8K73l96Q9j76Q0J91j09LK77l55J39K27pm52L34j1j10k1L7K59k18Q2j45K42
5230B15n76M31Q9j60Q3P2l57O3J53Q0K3q7O9k04Jj30J39K72k00k84L82Q2k95J52
5254A3O7j15M6J16O6j28j22j8R3N9J33l50O7N5m3M5j00j10J08J07L5k1j90J71
5278a6l00L15N5K0lQk02k3J0J40J33k46R0j05J52j86L09l32J18L2k45L71j43p5
5302a23J61j18J9MJ54k32L3K64j13r6Q8j41K61o9N6l68J95P3j47m6J50k85K78
5325bm1J09M7j96J20J38k50N0O0j48J74j77J98j81L43l02j21Q4N9j57K4J35J44
5348A10K3j76N9j33J50j37K27j44J0J01l55K07J8K50j59l3n7J65Mj40J89m21J03
5371a39J45R5l6J7QOl48M58k80K64j62K8k6JJ69j13K1k31J02J7n4k1J11J2N4J3
$$ plain form
5206 -18 255 -141 -52 -228 -148 43 -66 -63 214 -141 -2 225 218 -234 100 89 -21 -42 -5 254 36 118 -27 215
5230 215 -361 70 159 -1 82 154 -203 -140 13 93 116 29 98 -106 -105 -235 -96 176 -24 -308 74 156 -139 13
5254 13 80 -35 11 127 193 65 -57 -75 18 77 210 -140 -73 -18 -61 -16 -116 -226 -118 -11 24 3 -187 -16
5278 -16 -316 -1 54 74 71 79 -123 -146 -136 4 137 -109 -19 -124 28 -158 151 -181 -63 -31 -276 95 -48 -123
5302 -123 38 -80 -61 -57 97 -135 -102 162 49 -47 41 -100 161 92 148 -220 -25 48 -99 -145 5 -280 -2
5325 -2 -43 66 113 -83 37 175 -75 -25 35 -113 61 -116 82 -99 244 -58 -179 -95 -36 -193 -169 -34 110
5348 110 133 -43 16 -117 33 -104 123 -21 -11 90 -265 -58 -40 210 51 18 -39 126 130 -10 179 -242 -139
5371 -139 6 101 65 82 90 96 -252 206 -74 190 28 56 30 31 200 87 108 -123 -21 -4 -58 -79 32 44 98 111
5397A11m50M40R8k54J69k7p9J3l98N15j27n5j13L63l03J9o9J04k12k0K24J89m7
5420I1j88J9J30K38l07j44Q2r4K23k81L27j30J99p7j23O5l2K03l42N13m56q4J67
5443aJ8L5P7k12j99L21j42O3n4L4q4J50k4J12j64J67j1m9%j97j85K37j57J1J04
5468a50L73l07m3N1J27l4n3J53o2m1l1K31j79J57j55P8j23j10K21q3NK1K11n7
5492B00k74r0J07j0K90l06o9J00J14j63J8J69J94m50K49L9r5Kj64J84J75l5m14
5515b29M87j86r0K5J03k09k5M74k66qj01K0j22K45l87N13K5n8k47r4L38j49k1
5538C8l42J60o3J33OM18n44R8J27o7K02k91o1K52l2j78K01p3K30j02p7k45J93
5561a7J76l95M35k00j50J81j63J35J7J81k91J13j8K27k72J04l65K93J69m6L7k71
$$ plain form
5397 111 -339 101 199 -55 114 87 8 21 -377 138 11 -44 -157 206 -97 -78 -147 -43 -255 -275 -51 138 91
5420 91 -97 -78 52 290 -17 -161 -79 -173 50 -231 96 -34 165 88 -35 30 -2 201 -141 372 -84 -168 -1
5443 -1 17 52 129 -83 -282 39 -103 -40 -94 -60 -144 6 -18 94 -70 97 86 37 37 -160 -345 -108 -265 -254 -150
5468 -150 223 -84 -127 -76 51 17 -36 117 55 14 -17 214 35 192 37 115 -8 -118 103 20 25 46 257 200
5492 200 -74 -164 -57 -67 223 -83 -152 -52 62 -101 -83 86 280 -170 79 118 23 25 -139 45 220 185 -229
5515 -229 258 72 -18 7 110 -99 -124 350 84 76 -25 -5 -127 118 -269 244 269 211 -36 -130 208 59 38
5538 38 -304 -144 -207 -74 -68 350 -194 -96 31 -36 166 -125 -186 66 34 -144 57 -16 214 112 35 -210 -17
5561 -17 159 -236 199 -1 -151 30 -133 2 19 200 -91 22 4 231 -41 63 -302 -9 160 114 151 -120
5583a20N4j30M03l72J47n4K20k91K72l91N8R8K7J55p8p5Q7M0O0l33J18K06j24
5606b3q8N2J81k55N19l65Q8l16K07p9Q9P0r6J05l24K10k9Mj94N4J71j18q1m8J63
5631a03o7K69k22J8J76m12j31L99J05j18J48l25M99J6n10L42J47m38L10n9Q1J62
5653B87l88K39k49k1K43p7p4J8O7l18R9K34o3Jj01P2L2j11MJ73p5N7l7K9j11k2
5679i2N5p4J05J80k81K63n8k50J59Q6l37J12J05oq5j45N24k64Lm8J14q6K00j76
5703Dj07L32j24j05L31n42J08K55j38n9k6J53k10J41k02J83k73L10p0m2K57p8
5725I8j52K53j11M9q9j8j17L94l74L06k76J53j48J01J8j85J81j96J10J14N8J37
5747C06k51J40k09K23k00j47J71K9J2J92m55J09K41j22j83J62q6J24J63r9j03
$$ plain form
5583 -120 -66 -196 207 -165 -18 -72 148 -143 129 -262 -204 -106 -79 76 -2 -77 10 50 110 -223 -105 101 -23
5606 -23 -111 -59 122 -133 386 21 109 -207 0 -79 10 80 -16 89 -235 -25 -54 -50 -244 -190 -19 -137 -218 -266 -103
5631 -103 -170 99 -123 -105 71 -341 -472 -73 32 -86 62 -263 236 252 -258 84 231 -207 103 44 125 287
5653 287 -101 138 -111 -132 111 34 -40 -22 45 -273 -174 60 -3 -2 -103 -31 1 -110 -106 67 -8 49 12 41 -70 -92
5679 -92 -37 -111 -6 174 -107 156 98 -152 7 93 -244 -132 -27 -33 -118 -263 261 -3 0 -48 66 -20 180 4
5703 4 -103 229 105 0 331 -211 -103 152 14 -45 -71 82 -128 13 -189 -6 -279 31 -39 -81 176 98
5725 98 -54 199 88 137 48 30 -87 307 -67 239 -37 116 -32 69 87 -98 83 -113 -3 111 169 306
5747 306 55 195 -14 209 9 -138 33 62 74 266 -189 -80 161 39 -144 18 -68 56 219 120 17
5768A7j65J4K04J64O7m28J33O4K5j23n8J72O1Q6q6k24K9k16K01r8L06R9k02M0
5792H2N0m5M7j05k0J20k57J14J7lL4k28K76r1n0o1O4P9p5Q7j52K61k34N1j25n1
5818b15M56k66J0L39n21k44N75j55j5R1k11K27j61o6L06q4k69J15q4P2K14O7l33
5841a52K97jj32l4j62J8P4R5j87L62k0j76qm8L5O9j81J35j21K65m5l69K55mP1
5866C6nJ03K35m84K40J00k24j48K32L2r8k21L06l33L11L5k58K56k48M1J87j9J13
5889A89j23Q3j61mn2kJ43M6R5j20l08M23j14q2KmK06k85R9J96k30p5M8MJ71j25
$$ plain form
5768 17 -148 -134 70 234 301 -127 6 70 95 -28 -86 86 147 233 147 -77 -48 -264 -63 -161 145 244 42 82
5792 82 132 87 134 29 9 129 -128 -14 3 0 34 -194 82 -9 -59 -120 -56 23 -52 35 -117 144 -90 -39 -164 -215
5818 -215 241 -25 -15 324 -197 -441 134 -21 -36 55 -156 71 -90 -156 150 66 -203 -88 -172 -100 114 181 -152
5841 -152 145 144 12 -22 -184 -166 -92 3 -184 178 158 -18 -26 -74 -39 30 -151 -16 -137 128 83 -286 -31 -35 36
5866 36 31 134 369 -115 125 225 1 -147 85 117 19 -202 104 -229 82 117 -141 115 -133 -92 95 76 189
5889 189 66 149 -12 -16 -68 -70 73 119 214 94 -214 209 95 13 15 11 217 -68 31 227 -3 -78 -30 -26 145 20
$$ [...]
8191c9
##END NTUPLES=NMR FID
##END=
