##TITLE=1H_Pr KAz-Q
 200.13MHz, CDCl3,
 8 sc
 
 9.9.2025
##JCAMPDX= 6.0         $$ Bruker NMR JCAMP-DX V2.0
##DATA TYPE= NMR FID
##DATA CLASS= NTUPLES
##ORIGIN= UXNMR, Bruker Analytische Messtechnik GmbH
##OWNER= pz
$$ XWIN-NMR		Version 3.5
$$ Tue Sep  9 15:34:19 2025 Russian Standard Time (UT+4h)  she@DPX200
##.OBSERVE FREQUENCY= 200.1313
##.OBSERVE NUCLEUS= ^1H
##.DELAY= (6, 6)
##.ACQUISITION MODE= SIMULTANEOUS
##.ACQUISITION SCHEME= undefined
##.AVERAGES= 8
##.DIGITISER RES= 18
##SPECTROMETER/DATA SYSTEM= spect
##.PULSE SEQUENCE= zg30
##.SOLVENT NAME= CDCl3
##.SHIFT REFERENCE= (INTERNAL, CDCl3, 0, 14.3821)
##AUDIT TRAIL= $$ (NUMBER, WHEN, WHO, WHERE, WHAT)
$$ ##TITLE= Audit trail, XWIN-NMR		Version 3.5
$$ ##JCAMPDX= 5.01
$$ ##ORIGIN= Bruker BioSpin GmbH
$$ ##OWNER= she
$$ F:/spectra/data/she/nmr/H-C/1/audita.txt
$$ ##AUDIT TRAIL=  $$ (NUMBER, WHEN, WHO, WHERE, WHAT)
(   1,<2025-09-09 15:33:05.68 +0400>,<she>,<DPX200>,
      <created by zg, POWCHK disabled, PULCHK disabled
       configuration hash MD5:
       00 E9 B6 7A A2 85 ED C7 34 08 36 98 17 FE 4E 26
       data hash MD5: 16K
       BC 9B C8 AA 25 CF 98 46 33 01 B6 E2 D0 A8 17 61>)
$$ ##END=
$$ 
$$ hash MD5
$$ DE 96 00 2E 5C 0E 7C 5E 05 84 8E 6D 67 93 4F 5F
##$RELAX= 
##$RELAX= 
##$RELAX= 
##$RELAX= 
##$RELAX= 
##$RELAX= 
$$ Bruker specific parameters
$$ --------------------------
##$DU= <F:/spectra>
##$EXPNO= 1
##$NAME= <H-C>
##$PROCNO= 1
##$TYPE= <nmr>
##$USER= <she>
##$AMP= (0..31)
100 100 100 100 100 100 100 100 100 100 100 100 100 100 100 100 100 100 
100 100 100 100 100 100 100 100 100 100 100 100 100 100 
##$AQSEQ= 0
##$AQ_mod= 1
##$AUNM= <au_zg>
##$AUTOPOS= <>
##$BF1= 200.13
##$BF2= 200.13
##$BF3= 200.13
##$BF4= 200.13
##$BF5= 200.13
##$BF6= 200.13
##$BF7= 200.13
##$BF8= 200.13
##$BYTORDA= 1
##$CFDGTYP= 0
##$CFRGTYP= 5
##$CHEMSTR= <none>
##$CNST= (0..31)
1 1 145 1 1 1 1 1 1 1 1 1 1 1 1 1 1 1 1 1 1 1 1 1 1 1 1 1 1 1 1 1 
##$CPDPRG= <>
##$CPDPRG1= <>
##$CPDPRG2= <>
##$CPDPRG3= <>
##$CPDPRG4= <mlev>
##$CPDPRG5= <mlev>
##$CPDPRG6= <mlev>
##$CPDPRG7= <mlev>
##$CPDPRG8= <mlev>
##$CPDPRGB= <>
##$CPDPRGT= <>
##$D= (0..31)
0 0.7 0 0 0 0 0 0 0 0 0 0.03 0 0 0 0 0 0 0 0 0 0 0 0 0 0 0 0 0 0 0 0 
##$DATE= 1757417585
##$DBL= (0..7)
120 120 120 120 120 120 120 120 
##$DBP= (0..7)
150 150 150 150 150 150 150 150 
##$DBP07= 0
##$DBPNAM0= <>
##$DBPNAM1= <>
##$DBPNAM2= <>
##$DBPNAM3= <>
##$DBPNAM4= <>
##$DBPNAM5= <>
##$DBPNAM6= <>
##$DBPNAM7= <>
##$DBPOAL= (0..7)
0.5 0.5 0.5 0.5 0.5 0.5 0.5 0.5 
##$DBPOFFS= (0..7)
0 0 0 0 0 0 0 0 
##$DE= 6
##$DECBNUC= <off>
##$DECIM= 32
##$DECNUC= <off>
##$DECSTAT= 4
##$DIGMOD= 1
##$DIGTYP= 9
##$DL= (0..7)
0 120 120 120 120 120 120 120 
##$DP= (0..7)
150 150 150 150 150 150 150 150 
##$DP07= 0
##$DPNAME0= <>
##$DPNAME1= <>
##$DPNAME2= <>
##$DPNAME3= <>
##$DPNAME4= <>
##$DPNAME5= <>
##$DPNAME6= <>
##$DPNAME7= <>
##$DPOAL= (0..7)
0.5 0.5 0.5 0.5 0.5 0.5 0.5 0.5 
##$DPOFFS= (0..7)
0 0 0 0 0 0 0 0 
##$DQDMODE= 0
##$DR= 18
##$DS= 0
##$DSLIST= <SSSSSSSSSSSSSSS>
$$ [...]
##$SUBNAM0= <"">
##$SUBNAM1= <"">
##$SUBNAM2= <"">
##$SUBNAM3= <"">
##$SUBNAM4= <"">
##$SUBNAM5= <"">
##$SUBNAM6= <"">
##$SUBNAM7= <"">
##$SUBNAM8= <"">
##$SUBNAM9= <"">
##$SW= 18.0517328524113
##$SWIBOX= (0..15)
0 0 2 0 0 0 0 0 0 0 0 0 0 0 0 0 
##$SW_h= 3612.71676300578
##$TD= 16384
##$TD0= 1
##$TE= 0
##$TE2= 300
##$TE3= 300
##$TEG= 300
##$TL= (0..7)
0 120 120 120 120 120 120 120 
##$TP= (0..7)
150 150 150 150 150 150 150 150 
##$TP07= 0
##$TPNAME0= <>
##$TPNAME1= <>
##$TPNAME2= <>
##$TPNAME3= <>
##$TPNAME4= <>
##$TPNAME5= <>
##$TPNAME6= <>
##$TPNAME7= <>
##$TPOAL= (0..7)
0.5 0.5 0.5 0.5 0.5 0.5 0.5 0.5 
##$TPOFFS= (0..7)
0 0 0 0 0 0 0 0 
##$TUNHIN= 0
##$TUNHOUT= 0
##$TUNXOUT= 0
##$USERA1= <user>
##$USERA2= <user>
##$USERA3= <user>
##$USERA4= <user>
##$USERA5= <user>
##$V9= 5
##$VALIST= <valist>
##$VCLIST= <CCCCCCCCCCCCCCC>
##$VD= 0
##$VDLIST= <DDDDDDDDDDDDDDD>
##$VPLIST= <PPPPPPPPPPPPPPP>
##$VTLIST= <TTTTTTTTTTTTTTT>
##$WBST= 1024
##$WBSW= 4
##$XGAIN= (0..3)
0 0 0 0 
##$XL= 0
##$YL= 0
##$YMAX_a= 366347
##$YMIN_a= -415478
##$ZGOPTNS= <>
##$ZL1= 120
##$ZL2= 120
##$ZL3= 120
##$ZL4= 120
##$ABSF1= 10
##$ABSF2= 0
##$ABSG= 5
##$ABSL= 3
##$ALPHA= 0
##$AQORDER= 0
##$ASSFAC= 0
##$ASSFACI= 0
##$ASSFACX= 0
##$ASSWID= 0
##$AUNMP= <proc_1d>
##$AZFE= 0.1
##$AZFW= 0.1
##$BCFW= 1
##$BC_mod= 2
##$BYTORDP= 1
##$COROFFS= 0
##$CY= -3
##$DATMOD= 1
##$DC= 2
##$DFILT= <>
##$DTYPP= 0
##$F1P= 0
##$F2P= 0
##$FCOR= 0.5
##$FTSIZE= 0
##$FT_mod= 4
##$GAMMA= 1
##$GB= 0.15
##$INTBC= 1
##$INTSCL= 1
##$ISEN= 128
##$LB= 0.25
##$LEV0= 0
##$LPBIN= 0
##$MAXI= 10000
##$MC2= 0
##$MEAN= 0
##$ME_mod= 0
##$MI= 1.114404
##$NCOEF= 0
##$NC_proc= 0
##$NLEV= 6
##$NOISF1= 3.799351
##$NOISF2= 2.8
##$NSP= 1
##$NTH_PI= 0
##$NZP= 0
##$OFFSET= 14.38212
##$PC= 1
##$PHC0= -1565.027
##$PHC1= 15.79228
##$PH_mod= 1
##$PKNL= yes
##$PPARMOD= 0
##$PSCAL= 0
##$PSIGN= 0
##$REVERSE= no
##$SF= 200.129724274929
##$SI= 16384
##$SIGF1= 3
##$SIGF2= 2
##$SINO= 400
##$SIOLD= 16384
##$SREGLST= <1H.CDCl3>
##$SSB= 0
##$STSI= 0
##$STSR= 0
##$SW_p= 3205.1282051282
##$SYMM= 0
##$S_DEV= 0
##$TDeff= 0
##$TDoff= 0
##$TI= <>
##$TILT= no
##$TM1= 0
##$TM2= 0
##$TOPLEV= 0
##$USERP1= <user>
##$USERP2= <user>
##$USERP3= <user>
##$USERP4= <user>
##$USERP5= <user>
##$WDW= 1
##$XDIM= 8192
##$YMAX_p= 0
##$YMIN_p= 0
$$ End of Bruker specific parameters
$$ ---------------------------------
##NTUPLES= NMR FID
##VAR_NAME=  TIME,          FID/REAL,        FID/IMAG
##SYMBOL=    X,             R,               I
##VAR_TYPE=  INDEPENDENT,   DEPENDENT,       DEPENDENT
##VAR_FORM=  AFFN,          ASDF,            ASDF
##VAR_DIM=   8192,          8192,            8192
##UNITS=     SECONDS,       ARBITRARY UNITS, ARBITRARY UNITS
##FACTOR=    0.0002768,     1,               1
##FIRST=     0,             0,               0
##LAST=      2.2672688,     0,               0
##MIN=       0,             -415478,         0
##MAX=       2.2672688,     366347,          0
$$ Real data points
##PAGE= N=1
##DATA TABLE= (X++(R..R)), XYDATA
0@%%%%%%%%%%%%Qj6J6j6J6j6K4l2L6m4N3o1P2q8J00j12J30j50J71j95K20k48K80
35A48l14L54l97M42m92N46o06O75p46Q23r12J007j109J220j344J483j633J800
53I45j987K195k433K704l014L378l811M331m975N794o870Q361j0560J4125k0851
68a2668L7751j58406k82155L80618K94290r2719k21031j12670M4656K15619J05741
79A99026j71183j81863O5114J30216N4064l7172r6131m2146M7512O4945N6678
90H9060m1883j24789k0936J36512P9992r4526r1385K8648N3026M6538k360q8844
102c0947l6925Q1406N8049n1831o3134K4357L5096Q98O098l2400l9599N1285N8848
115F1201m6678p3064L7768O9880l0686l3781K0398j4668q460M4389N713n5126
$$ plain form
0 0 0 0 0 0 0 0 0 0 0 0 0 0 8 -8 8 -8 8 -8 16 -16 20 -24 29 -32 40 -48 52 -60 70 -80 91 -104 116 -132 148
35 148 -166 188 -209 233 -259 287 -319 356 -390 433 -479 528 -581 639 -705 778 -855 945
53 945 -1042 1153 -1280 1424 -1590 1788 -2023 2308 -2667 3127 -3743 4618 -5942 8183 -12668
68 -12668 25083 -133323 -415478 -34860 259430 166711 -54320 -166990 -122334 93285 199026
79 199026 27843 -154020 -88906 41310 95374 58202 -37929 -80075 -32563 32382 89060
90 89060 47177 -77612 -98548 37964 117956 23430 -67955 -39307 13719 60257 57897 -30947
102 -30947 -67872 13534 71583 19752 -43382 -19025 16071 16969 23067 -9333 -48932 2353 61201
115 61201 14523 -58541 -20773 49107 18421 -15360 5038 -9630 -18090 26299 32012 -23114
127b3114j5637M9336Q450l0582J5979J19l8813J0717M4932J1553m2244m0676K8923
140b1057N4847j773m8259j7897L0307R251M363J4089m5367k7111O3392J9179n2251
153a8287j237K9074k3594j0062M8847r526m9623K6893K2429k3629J5382J0011
165A6678l1158m89L0590j609j9992O266J282j1437J6897M616j8986O227L077o953
179d991Q873J382n352J098K094j948l15J2195l250j9357J0341J3897j0502o310
193b145O790L111j2733m02J9592j1009j4074J6983n222j1850K0044O991k6348
206a0272n301L0417k49k3715J0231L700j1970J3689J701j5948N964O801j0407
219e359k954J3372j757j5440O920N348n790J1315l566j8063J2578J4375j0729
$$ plain form
127 -23114 -38751 10585 19035 -11547 4432 4551 -34262 -23545 21387 32940 -9304 -49980 -21057
140 -21057 33790 32017 -16242 -34139 -3832 5419 9782 23871 -21496 -48607 14785 33964 -18287
153 -18287 -19524 9550 -14044 -24106 24741 15215 -34408 -7515 14914 -8715 6667 16678
165 16678 -14480 -14969 15621 14012 -5980 286 1568 -9869 7028 11644 -7342 -1115 1962 -4991
179 -4991 3882 5264 -88 1010 3104 1156 841 13036 9786 -9571 770 14667 4165 -2145
193 -2145 4645 7756 -4977 -5379 14213 3204 -10870 6113 891 -10959 9085 16076 -10272
206 -10272 -15573 14844 14595 -9120 1111 4811 -7159 6530 8231 -7717 -1753 5048 -5359
219 -5359 -8313 5059 3302 -12138 -5218 130 -5660 5655 2089 -15974 -3396 10979 250
232B50q607R258J594j2629J1517Q577k0526L093J4385j4036j623J4914n740j4239
246a3812J0165J1154j4224K709J4448j7985k982K2047n218j1419N088Q33k506
259a702N712L786j3270q82J3879q200n346J2030n156o989N707K927L58J03m67
274B490n896J167J4424m227j4549P750N489n243K18M025l886p742P255N247j0692
289d170N978M075j5242O601J4321r546q131P748K629p585O997N886j5069J392
303d116J1522r085R59O905j1048l422J0405K375r177o13O326n832K155Q721q962
318b887k645P883l666j177N597M67q173j557J1033k584r041O915j481n169P668
333A183J065q320J376P359l597o042J0845M73j2608Q458N759r299L983M247p450
$$ plain form
232 250 -8357 901 2495 -10134 1383 9960 -10566 -7473 6912 -7124 -8747 6167 427 -13812
246 -13812 -3647 7507 -6717 -4008 10440 -7545 -10527 11520 6302 -5117 -29 804 -1702
259 -1702 4010 7796 -5474 -6356 7523 -677 -6023 6007 851 -6138 -431 2496 2854 2957 2490
274 2490 -3406 -2239 12185 7958 -6591 1159 6648 1405 1623 5648 1762 -5980 1275 6522 -4170
289 -4170 1808 5883 -9359 -2758 11563 2017 -6114 1634 4263 -3322 3675 9561 -5508 -4116
303 -4116 7406 -1679 -720 6185 -4863 -8285 2120 4495 -4682 -5295 1031 -4801 -2646 6075 -2887
318 -2887 -5532 2351 -1315 -2492 3105 3572 -4601 -6158 4875 2291 -6750 165 -1316 -6485 1183
333 1183 2248 -6072 -4696 2663 -934 -6976 3869 4342 -8266 192 5951 -3348 635 4882 -2568
348b568M8P118k865p049P173J765j0331O401O173r608J745M904l679Q58L830j862
364B053m805M809M932p987J112O652o914j507N482o73m605p6L924k663j101N664
380D297o280l586J1368k101q032L917M157l211n36M877n098m162R565k047q246
395e118P054n05p166O111L237o671k120N814m77l821O183j897p745Q016L833o801
411b073J399K224l545j16N245n58q375L025N229m989J304K221n406R46N083j118
427D96l683K577K960n261J402O386n233j508M147l322k28N003j885m995Q79N164
443B899l050j897M382l536k568N190K87j201K06j189O92N50L167n15n368K082
459A31K158j527J618j26m443j247N357K370n822m12K992n056N022O086r218l136
$$ plain form
348 -2568 -2520 4598 1733 -5316 1857 3622 -6709 -308 5865 -3743 -1998 2906 -773 85 3915 2053
364 2053 -2752 2057 6989 -998 114 6766 -148 -1655 3827 3154 -1451 -1527 2397 -266 -1367 4297
380 4297 -1983 -5569 5799 3698 -4334 -417 3740 529 -7 4870 -228 -4390 5175 3128 -5118
395 -5118 1936 1431 -5735 376 3613 -3058 -5178 636 159 -3662 2521 624 -7121 895 4728 -2073
411 -2073 -674 1550 -1995 -2111 3134 2576 -5799 -2774 2455 -2534 -1230 991 -4415 -3469 1614 496
427 496 -3187 -610 2350 -2911 -1509 4877 -356 -1864 2283 -1039 -1267 3736 1851 -3144 -2265 2899
443 2899 -151 -2048 2334 -1202 -3770 1420 1707 506 712 -477 215 765 3932 3417 -1951 131
459 131 2289 762 2380 2254 -2189 -3436 1921 4291 -1531 -1943 1049 -4007 1015 7101 -2117 -5253
475e253Q286L51m047L227N15p330L200O791p079L35M837q551L53J0110m378o344
491d977L735J625m128N194L557j0383N46J0127m889k741M770l329k391M793P18
506B227l458l09J966m016J596N767n012k498L748k160P10M246j686m581N32O154
522C226j3m576J031j45l08K752p47k344n38P23J885j298k14J407k524L47K082
539G46K94L09j647j006Q81K628K590n402l261O289M65l047J414n58k881J666L291
556B771k245l401M354j196l068N636j030m689M044k50l092N014J365p184o36Q096
572D489k653n414N804j870n776P247J585p556K205L741l119k50L995k776k798
587c146N027j168l169N379j368n704M313K091l092K34Q87j611n62L407j054l535
$$ plain form
475 -5253 3033 3384 -663 2564 3079 -4251 -1051 5740 -1339 -1004 3833 -4718 -4365 5745 1367 -4977
491 -4977 -1242 383 -3745 1449 5006 -5377 -4831 5296 407 -2334 2436 -893 -3284 1509 2227
506 2227 -1231 -1540 426 -3590 -1994 3773 -1239 -3737 11 -2149 -1439 2807 1121 -3460 -2928 3226
522 3226 3213 -1363 -332 -477 -785 1967 1220 -1124 -1662 -939 946 -352 -566 841 -1683 -1336 746
539 746 1040 1349 -298 -1304 -423 2205 4795 -607 -3868 2421 2886 -161 1253 695 -2186 -520 2771
556 2771 526 -2875 1479 283 -2785 2851 1821 -2868 1176 926 -2166 2848 4213 -2971 -3607 4489
572 4489 1836 -3578 2226 356 -5420 1827 3412 -4144 -1939 1802 -1317 -1567 2428 -348 -3146
587 -3146 1881 713 -2456 2923 1555 -4149 164 2255 -837 -603 284 -1327 -1889 1518 464 -3071
603c071K329O13j002K188j010j228J229PK33K70n0J52j241r9J763p57j107j90
621i71J240k03j576J942j77k673K804J325k780Q72J570p73j326J938N20k480J818
638A070Q71l344J802J593l192O19K063k038o05J941L3k733K124K003l771J713
654A49K515l722O04L205k506j550K453N7l323K113K062m089Q55L240l494m23L582
671A728k039j383J942J88j568J580J381k839j39K578k105N40J405k016l63J519
687D09j58q68N9J74o14j66K120j230j003O61N02J047l02q32j65n84J827J033k457
706e47k23J141q50P32K53k79j893J018J802j597j48J876k614O38K562r83j206
723c18O36J67m75O46Q17k240l16K438j343n00J484j572n39J572L48j098j03J366
$$ plain form
603 -3071 -742 -129 -1131 1057 47 -1181 48 55 288 558 508 660 -581 -680 1083 326 -781 -971
621 -971 269 66 -1510 432 255 -2418 386 1711 -1069 -197 1373 600 -726 1212 1732 -748 1070
638 1070 1941 -1403 399 1992 -1200 -581 1482 -556 -1161 780 813 -1920 204 2207 -1564 149
654 149 2664 -1058 -454 2751 245 -1305 1148 1205 -2118 -5 2057 -2032 -1177 2063 -1431 -1854 1728
671 1728 -311 -1694 248 436 -1132 448 1829 -1010 -1149 1429 -676 -136 1269 -747 -1110 409
687 409 251 -617 -558 -384 -998 -1164 956 -274 -1277 -616 -114 933 631 -201 -366 -950 877 1910 -547
706 -547 -770 371 -479 253 506 227 -1666 -648 1154 -443 -591 1285 -1329 -691 1871 888 -318
723 -318 318 485 10 656 1473 -767 -1083 1355 12 -488 996 -576 -1115 457 805 -293 -396 970
741I70j402j12K642j360j677K068o26o07P04N33j545p05J620j56j743K001m86
758A19k046J842R20j452L03M15l41k03J637k99k136J263O09j130J222n49j414
775a240O66R17j74j034Q4K73m39R02Q28j555K61R34l55j87O22k13q07J44J725
794A352r42j194J476p40n56J179m99j068N26J009o12p29J393m78j229J784j83
811D89r03J097k46r07O40O59p63k90M94q4j017J492k39j293O35N66o44K00M21
830C07j35o91J006O42j412M99O39j084K39R70j100k63j10J079j205rR85j263N3
849h53J508n50o43J002n44k58N45M13r07j09J431q28q65J784j293n73P96l12j49
868d05nN44m37l47J059j41r09J020l40n89Q85O7k08n49M53L99p86K05R32j657
$$ plain form
741 970 -432 -544 2098 738 -939 1129 503 -104 600 1133 -412 -1117 503 347 -1396 605 119
758 119 -1927 -85 835 -617 -314 101 -240 -443 1194 895 -1241 22 631 -499 723 174 -1240
775 -1240 -574 343 169 -865 -781 -508 -947 -45 783 -772 -511 423 68 -119 503 290 -517 -373 1352
794 1352 410 -784 692 -48 -604 575 76 -992 -466 543 -69 -798 595 117 -1112 672 489
811 489 -414 683 437 -470 170 829 66 -224 270 186 -831 661 422 -871 -236 330 -314 -114 307
830 307 172 -519 487 1129 -283 216 855 -229 10 980 -120 -383 -493 586 -619 -628 357 -906 -853
849 -853 655 105 -538 464 -80 -338 207 620 -287 -396 1035 207 -658 1126 -167 -740 56 -256 -405
868 -405 -410 134 -303 -650 409 268 -641 379 39 -550 335 402 194 -355 98 497 -289 -84 848 -809
888h09M98M26n36o8M37j64n65N54J015j023J57J098j138J72J037q60n18R15l50
907B78n21J47M53r71K72J061p93l49J020j084k01P87N76o35j26N67j10p93J271
926H49o96m52O11r7o21M66j73l77j3N78N5q89R99q6p60P70k7k30q9M07J34n16
948a57L38L22j006O18O78j041J11K72p32M55Q2q8j80j43Q11p11J47N94m07m0L49
969B72J7L3m24M30k85o07J255o29r82J065P8r40M40N05q43R6Q23k22o94J316l09
990C95j033J240j34j070J377l36p88M50O95o79j053J344k71r28J412l25j345J129
1008H0K70l61K20J31l81%M31J30p07M97o0o82P84j08o95J02M7M20k30Kj89k09
1030e08J98O85q04O47n8l58N59q4k80R3m20N96j77m11K51j2j76p2L44K06n03J47
$$ plain form
888 -809 -311 115 -421 -489 -52 -216 -781 -227 788 -235 -78 1020 -118 54 1091 231 -287 628 278
907 278 -243 -96 357 -614 -342 719 -74 -423 597 -487 -688 99 675 40 -86 481 371 -422 849
926 849 153 -299 312 215 -406 60 -113 -490 -503 75 130 -759 240 154 -606 164 137 -93 -182 225 359 -157
948 -157 181 503 -503 115 793 -248 -137 135 -597 -142 -60 -148 -328 -471 340 -371 -224 370 -37 -77 272
969 272 289 322 -102 328 43 -564 691 62 -920 145 223 -717 -277 228 -615 -519 304 82 -612 704 395
990 395 -638 602 468 -602 775 439 -349 101 796 117 -936 408 137 -791 621 296 -1049 80
1008 80 350 -11 209 340 -41 -41 390 520 -187 310 250 -432 352 244 -451 -349 -302 118 -112 -110 -299 -508
1030 -508 -310 375 -429 218 160 -198 361 277 -3 90 -330 266 89 -322 -71 -83 -259 -331 13 219 -284 -137
1052a37O34r34O64K32n66k42R81l93p7Q7J21r48N16Q95j223j31O01p39L42J049
1072G32r02m14O97K03m17N07J97j281O16J280j132p8M52r02N2J113m12q55L56
1091a88M93n79L94L66j222K59J172j063M1N47p68M64O20k9n42M3J25k68K14K97
1111C76n99m9K33k57k6K89j55q1J64K21L6q2k26k32N57K74n66M50m87q9O36m26
1133c9j28K47m97Q6P9N06l88l99N76m8p1O43o63l52O81K80o50M81l1n08N5M72
1155C32n15l45N18j67k76R05l66q66P87N6l02J17O89q02k06J062j92p29Q01l78
1175A23l94O41j44l45l51J83K0J11O35n12n91O86L92o88N78l10k06N79m4r1k94
1196b2L67k93p0K70k13k83J59J7j98M14m42J64Q5j25M80l35j11L7J77P7lR5r8
$$ plain form
1052 -137 497 -437 227 459 -107 -349 632 239 162 249 370 -578 -62 833 -390 -521 80 -659 -317 732
1072 732 -170 -584 113 316 -101 406 603 -678 -62 1218 86 8 460 -442 -390 723 311 -544 -188
1091 -188 305 -274 120 486 -736 -477 695 -368 -327 220 -548 -84 536 507 -35 8 133 -135 79 376
1111 376 -223 -272 -39 -296 -322 -33 -188 -269 -105 116 152 70 -156 -388 169 443 -123 327 -160 -249 387 -39
1133 -39 -167 80 -417 -331 -252 254 -134 -533 43 -5 -76 567 -96 -448 233 513 -137 344 313 -195 -140 332
1155 332 -183 -528 -10 -177 -453 452 86 -780 7 63 -239 -122 567 -235 -441 621 429 -300 501 123
1175 123 -271 370 226 -119 -470 -287 -267 -156 479 -33 -624 62 454 -234 344 34 -172 407 363 272 -22
1196 -22 345 52 -18 252 39 -244 -85 -68 -266 148 -294 -130 -45 -170 310 -25 -136 -99 78 155 152 247 149
1219A49p13Q02l17j82J85o0m01O38l6k57R2l3j12J70L55M1n85O22O7n75L63k02
1241A1j54k32M01Rj62K19k98p7N28j64m50N27j03j34K42p6N5j78J72K09m56K4
1263h7M24o14J4M14m0m41J61P4J56j99L23o00jO25k70NM88n27P4M4L67l92M9K37
1287B84m61J92o4K05l66Q9l3o8J35mJ59m35N27J35m76J14K07m0J7o1j66J92jK09
1311B90k69j73M16p09O3N91l77l4K84j57K08N4q9m81M23J49J15j64J07m25N8L71
1333B51k86q2J25O3k61M3L03j10j34L25k97k73O03l57J4P3J1J0k3J87m6k55j37
1356b53J87l1r0k9J17j83M23n42O7O17j01k53J73P1k48P1O6J68k28m2J06j84K01
1379H3p1r0J23l37j0L53N7M1N7j99J79L6j94K9M1r5L45j04k06O8j19J97l62K24
$$ plain form
1219 149 -564 238 -79 -261 -76 -136 -537 101 65 -192 -100 -133 -245 -75 280 321 -264 358 425 -150 213 11
1241 11 -143 -375 26 35 -127 92 -206 -283 245 81 -369 158 55 -79 163 87 142 -36 136 345 -111 -87
1263 -87 337 -277 -263 151 111 -330 -169 -95 61 -138 185 -415 -416 209 -61 -56 432 -95 -21 23 390 -2 47 284
1287 284 -177 15 -49 156 -210 -121 -154 -222 -87 -91 68 -367 160 295 -181 -67 140 100 117 56 -110 82 81 290
1311 290 21 -152 264 -445 -382 209 -168 -202 82 -75 133 187 98 -383 40 189 304 140 247 -178 -120 251
1333 251 -35 -117 8 71 -190 -147 156 46 -88 237 -60 -333 270 -87 -73 0 11 21 -2 185 139 -116 -253
1356 -253 -66 -97 -187 -216 -99 -282 141 -401 -334 283 182 -71 102 173 -75 -4 62 230 2 -40 66 -118 83
1379 83 12 -78 45 -292 -302 51 108 149 206 7 186 222 28 57 98 3 348 244 38 106 -13 184 -178 46
1403D6j24O1j56j10L54J74l72J19K27K9J5n14L69m1k09L64L8n40L07j21R8J68
1425A82l54J12J5P1j9j20J55J6j51K27j61M5J8K50k17j3J48J42l55R8m3k7j70
1448a51n0P6J00o0j10J33K45k39J13J49m3J32l88J15l08N00k55m3q1j0J10j51
1470b16P1N4J14j62k71M21j59k28N39K13l63l3L5j64M61k9j82j39l7q4o4K38r5
1493h0k44K89J72m40M02L6k38j81M00k84J31J60R0l87M82K34p12J85k07k8L49
1514A29n5n4k63J86J46l4K26j10k83%K93l02J91J55m19O1L86l66J83k45J85j43
1536a33L9Q5j82o5O3K65j57J67l13J23L1M9K12m54J66J13Q6J85m42L84l85j71
1558c34M58j21l7J17j91J26j31pq3L69j60mN1J38j18j24K78O0n07K58l6k22J48
$$ plain form
1403 46 -78 -17 -173 -283 71 245 -127 -8 219 248 263 -251 118 77 -132 232 270 -270 37 -84 14 182
1425 182 -172 -60 -45 26 7 -113 42 58 -93 134 -27 18 36 286 69 56 204 346 -9 89 46 19 -151
1448 -151 -201 -125 -25 -85 -195 -62 183 -56 57 206 163 295 -93 22 -286 214 -41 -84 -165 -175 -65 -216
1470 -216 -145 -91 23 -139 -410 11 -148 -376 163 376 13 -20 15 -149 312 283 101 -38 -75 -159 -223 15 -80
1493 -80 -324 -35 137 -303 99 135 -103 -284 116 -168 -37 123 213 -174 308 542 -170 15 -192 -220 129
1514 129 74 20 -243 -57 89 55 281 171 -112 -112 181 -121 70 225 -194 -133 253 -113 70 -175 10 -133
1536 -133 -94 -9 -191 -256 -193 72 -85 82 -231 -108 -77 -28 184 -270 -104 9 95 280 -162 222 -163 -334
1558 -334 124 3 -34 83 -108 18 -113 -120 -203 166 6 2 53 191 73 -51 227 287 -220 38 2 -220 -72
1581g2J16k12j53N89l79J6M06m43n0Q7j10L46j65Q2j22J35J53j84j85L47m28N0
1603a76J82k20K4K14r3l2RR6k12M45j74k93K50p7l9M9J18L12l64q3l6J50L2j04
1627b2k6K40o13K28M58k30j02L75k10j40M13j50k31j56O33o22K37K2k32pJ21R1
1649G7p0M29k86k09K52kl48j53L25n3J37J00k81J21K16j32k92J37J23j52J14j38
1671h5L77k28q2O4k60L12l36J24j0l9K95j49J06J7j8j57K8q1n9J96J88o4j00l02
1695b63L25K37l26J08R1l81L42l00J20N7K40m17K73k9Q4j31r7Q6k32K12N1r5K29
1718A84j29p1J13J77n07J64R5O0J10j05o0P3J38n69L30m2J12p2J91m27RJ81mM8
1742aJ01j8j10J28o1K99n91L78j30K1J07L03m07J62j25p8j2l9o2J85m5j27j88
$$ plain form
1581 -72 44 -168 -321 268 -111 -95 311 -132 -182 -95 -205 141 -24 58 -64 71 224 40 -145 202 -226 -176
1603 -176 6 -214 -190 24 -69 -101 -92 4 -208 237 63 -230 20 -57 -96 -47 71 383 19 -64 -100 50 82 -22
1627 -22 -48 192 -421 -193 265 35 -67 308 98 -42 371 221 -10 -166 467 -155 82 104 -128 -135 -14 77
1649 77 7 436 150 -59 193 191 -157 -310 15 -38 99 199 -82 39 255 123 -169 -32 91 -61 53 -85
1671 -85 292 64 -18 46 -214 98 -238 -114 -124 -163 132 -17 89 106 88 -69 -41 -122 -181 15 203 139 39 -263
1695 -263 62 299 -27 81 172 -209 133 -167 -47 10 250 -167 106 77 161 30 -67 19 -213 -1 50 -45 184
1718 184 55 -16 97 274 -233 -69 26 86 196 91 31 104 242 -327 3 -39 73 1 192 -235 -226 -45 -49 -1
1742 -1 100 82 -28 100 39 338 -253 125 -5 16 123 426 19 181 56 -22 -34 -73 -135 50 5 -122 -310
1765c10K86Q3j77L15k19j53M40k18R1l2j56P4R6M6m15L41r8K58k74p5M3l9q5K53
1789G5j46j23L68l28K92Q4Rl14J56o5j2JJ04k86K18l8k18K57j78R9o6J11j24J51
1813B7n2J72k25M14k95J66k42rJ14O5ok95R1j47L21j60j61J31J60k25M12l18K
1836f0P8O0j54N4J70J0k61L02m16K60l22K66L9k1j61L55l78o7K9M5N5J49K2K06
1860B60k65j07j61J83J23Pk11K72j17K28k12k58K68n9k14L64j41o1n5L26l1m14
1882b75K27R6jo3N5J00L8l50J95Q3k06k8N8K50j30j27m2Q7J14j40K13n6p7j84
1906a63K98l33J18M00l66q2J60n6P4Q4K3j90J53K0j96J49j87j66L08J24k18j4
1928f0J84J77l44K69Q1l68j35N00m86M77l31o9k1N9jln2K9J40j66K64k23K14J22
$$ plain form
1765 -310 -24 59 -118 197 -22 -175 265 47 138 106 -50 24 120 166 -249 92 -6 252 -22 -97 -54 -93 -178 75
1789 75 -71 -194 174 -154 138 222 231 -83 73 8 -4 -3 101 -185 33 -5 -223 34 -144 -45 -111 0 -124 27
1813 27 -25 147 -78 336 41 207 -35 -44 70 135 129 -166 -75 -222 99 -61 -222 -91 69 -156 256 -62 -60
1836 -60 18 78 -76 -22 148 158 -103 199 -217 43 -279 -13 26 5 -156 199 -179 -246 -217 -172 -117 32 54 260
1860 260 -5 -112 -273 -90 33 40 -171 101 -16 212 0 -258 10 -49 -263 101 -40 -101 -156 170 139 -275
1882 -275 -48 48 47 -16 39 139 177 -173 22 105 -101 -129 -71 179 49 -78 -120 -33 81 -59 154 98 21 -163
1906 -163 135 -198 -80 320 -46 -128 32 -24 50 134 157 -33 120 140 -56 93 -94 -260 48 172 -46 -60
1928 -60 124 301 -43 226 307 -61 -196 304 -182 295 -36 -105 -126 -67 -68 -71 -123 -94 46 -120 144 -79 135 257
1952B57l00j83M60l30J83m9j20K83l25J2K5R5L3O3j95R2oK44j72j03M2K1j40L5
1976g8M6J36J5k57r4K29R8k15p9L98l26J08Q6k41L11n6r4K71j85R5m84K46K19
1999A49m6k81K86j29J4j25K56k59L09k93J48j38K89l17K2J4O2M3p3K83j0k00j77
2022a73k7K32j11J51l3q2J65n0j31K3M8J33m9J75k77o1k3K19o3j46j3N3J02k34
2046a72J39j36L96j09j31j53L5N0L18k19k13L29k21K6M7Mj03J78p8L23l33J22
2068I9p1L0P6j97j30K79m6qJ13j57j43J5LJ04J05J3Rj17j18L16j6l94K01j23N9
2093i8J33l6j58L91l12R5K41J3o9o2q2k12K82Lj47j43M91m90M1J36NL8j21K9L59
2118C27k26k58L0K08j0K10j84J2j97m7J75k60J40Q3N0m28K94J8K22N0k00K37m54
$$ plain form
1952 257 -43 -226 234 -96 87 38 -82 201 -124 -112 -87 8 41 104 -91 1 -5 239 67 -36 6 27 -113 -78
1976 -78 -32 104 119 -138 -232 -3 95 -120 -199 199 -127 -19 67 -174 137 81 -13 258 73 168 -316 -70 149
1999 149 103 -178 108 -21 -7 -132 124 -135 174 -119 29 -109 180 -137 -115 -101 -39 4 -69 214 204 4 -173
2022 -173 -200 32 -79 72 39 -43 122 72 -59 -36 12 145 96 271 -6 -67 -90 129 66 -80 -93 -40 62 -172
2046 -172 -33 -169 227 118 -13 -166 -131 -81 237 18 -195 134 -87 -61 -14 -10 -113 65 -13 310 -23 99
2068 99 28 58 134 -63 -193 86 40 32 145 -12 -155 -140 -137 -33 72 85 94 -23 -141 175 159 -235 -34 -157 -98
2093 -98 35 -1 -159 232 -80 15 256 269 200 138 56 -156 126 129 -18 -161 330 -160 -119 17 22 60 -61 -32 327
2118 327 101 -157 -127 81 71 281 97 109 -88 -135 40 -220 -80 3 53 -375 -81 -63 159 209 9 246 -208
2141b08K70k9K7J33m97K83o1J10j23J76Q6k00O6L5j63R1J19j05L53l97Q3J28k79
2164a02K53j89R0l17J57L46k50k5o1Q3J18k2J03j20O3j98L98j90K1L9n11K00K87
2187A73k66R5J42j53o0k3K88O1k31k7K02L2k28j10M3OK66l52K81k03L03l47L48
2210B40k32j20K2L80j28l23Q9p5N37k29l10J50j39k8K64l68L17K48l53k58M26
2231A10m51K16J08K6J25J14k36Q4k79K83l5k11P7nk39L52j61K27mm1j22J52l25
2254b35K35j0N4j4J05j7O3m0j25J56J37o1k77J78r1n0j00J93J35k15K2p5j02O2
2278g2J42J64l26n5L51k03J62k06kN9L5K36k26J05l2J9k49J06J0r1Q6l0q7k45
2302c49M58J82m19L09lk88L64k28O9J3M4J09q7r9K6l29L09j47j11J52J44k27j31
$$ plain form
2141 -208 62 33 60 193 -304 -21 -82 28 -95 81 167 -33 33 68 -95 -4 115 10 363 -34 49 177 -102
2164 -102 151 -38 52 -265 -108 238 -12 -37 -98 -15 103 81 184 64 127 -71 327 137 158 197 -314 -114 173
2187 173 -93 2 144 -9 -69 -92 196 257 26 -1 201 233 5 -105 -62 -56 210 -142 139 -64 239 -108 240
2210 240 8 -112 -90 290 162 -161 -72 -147 390 161 -149 1 -138 -166 98 -270 47 295 -58 -316 110
2231 110 -341 -125 -17 9 134 248 12 96 -183 100 65 -146 -69 -74 -313 39 -122 105 101 60 -62 90 -235
2254 -235 0 -10 44 30 135 118 181 141 16 172 309 248 -29 149 58 8 -92 101 236 21 43 -32 -134 -72
2278 -72 70 234 -92 -147 204 1 163 -43 -45 14 49 285 59 164 132 151 -98 8 18 -73 13 -17 -104 -349
2302 -349 109 291 -128 181 178 -110 254 26 95 108 152 261 174 75 101 -228 81 -66 -177 -25 119 -108 -239
2325b39M59j04j68J06J98k90j07PK11k20L3J92j9J8O1l39K20K83l63O1K8Kk0J64
2349A74k94J60O0l02R7M0R6L0j02R4j47L6R6Kp2k8KJ50m9J67r5Q1j81R6n5J41
2375A97J28m15oK32r5n4J05k35J16Mj7J87m27J1J25K47j16Q6j93R7Q9k80J43J62
2399I1m2j41r1L09k13j50N17l68P7j45J79J1O5N9j59J22r9j55K65p5J87J27k40
2422A31n5k95M00m1l26M08k51k5p8J17K41j27o1J71O2l92J98j95L86l78K04Mk29
2445a31K84q6j74l4j4J23N3l9q5J84j84J01j00nk3J37J55J07j11l55J69Q8k60
2468b00K53r0M5L7l12Q2K87j45J41N1k74oj59L76m4J54l91j24J48K22o5k17K11
2491b0j67M40r5J03l63K82o1j79m6J46q1j52M15P2j98l88J8L74q5k35k0K74Q8
$$ plain form
2325 -239 220 116 -52 54 252 -38 -145 -138 73 -147 -114 78 59 77 138 -201 19 302 -61 0 28 30 10 174
2349 174 -120 40 100 -202 -105 -65 31 61 -41 53 -94 -58 38 40 -32 -60 -58 92 43 210 115 196 15 111 56 197
2375 197 325 -90 -96 136 41 -13 92 -143 -27 -23 -40 147 -280 -269 -144 103 -13 73 -120 -23 66 -214 -71 91
2399 91 49 -92 -183 126 -87 -237 280 -88 -11 -156 23 34 99 158 -1 121 22 -133 132 57 244 371 131
2422 131 76 -219 181 140 -186 222 -29 -54 -132 -15 226 99 38 209 271 -121 77 -118 268 -110 94 98 -131
2445 -131 153 67 -107 -141 -155 -32 21 -18 -103 81 -103 -2 -102 -107 -130 7 162 269 158 -197 -28 60 -200
2468 -200 53 -37 8 45 -267 -185 102 -43 98 149 -125 -131 -290 86 42 196 -195 -319 -171 51 -14 -231 -20
2491 -20 -187 253 158 261 -102 180 119 -60 -106 40 -41 -193 222 294 96 -292 -274 100 15 -220 -240 34 122
2514A22k3lq3j3p2O6J71m8l45J4K07R8J53l75J20J06k06m8j4K07M8j39n5R5OK58
2540B47j96R1k52n9j1N00l08j49Q2l2j51L23J73l59M71k98k15K10k7Q4r5J23J48
2563C00m01J9K31l58L99r2k49J09k68J97OJo7K06K07q7Jk40O4J48j49l2R5qp7
2588d5j45N7N6J12k64M11k2k51qj60L18q4J61k41J54m80M66j01J26J31j50j95
2610a54K78j30j74J45K93j74j85j8K57j13P0n2k01J0L09j1l64L36j72q2K96j67
2632cJ5M9M4Qj22j40J53L6k69K86J42n12K31J05J61j83K9r1K96n13K37O4M8L7
2656A08p3J1j27J70p6O0l2p6k89J28N8M84j42l10L03j65n5j94K11K51k62k9R7
2679E1J02n9j26Q2k83K11j32J45j70J4J38p6M3L6Q2j73o2J8P6J69j51K32O2j06
$$ plain form
2514 122 99 96 13 0 -72 -6 165 117 -228 -214 -7 91 244 -131 -11 95 -111 -159 -173 34 82 -57 -112 -17 -11 247
2540 247 51 142 -110 -169 -180 320 12 -137 -55 -87 -238 85 258 -101 370 72 -143 67 40 124 29 152 300
2563 300 -101 -82 149 -209 190 98 -151 -42 -310 -113 -107 -106 -173 33 240 153 154 -86 -22 126 -23 -55 40 32 -45
2588 -45 -190 -133 -77 35 -229 182 160 -91 -99 -259 59 -25 136 -105 49 -431 35 -66 60 191 41 -154
2610 -154 124 -6 -180 -35 258 84 -101 -119 138 25 95 43 -158 -148 161 150 -214 122 -50 -132 164 -3
2632 -3 12 61 105 113 -9 -149 4 40 -229 57 199 -313 -82 23 184 1 30 -61 235 -278 -41 23 71 108
2656 108 35 46 -81 89 13 73 41 -35 -324 -196 -138 346 204 -106 197 32 -23 -217 -6 245 -17 -46 51
2679 51 153 94 -32 50 -233 -22 -154 -9 -179 -165 -27 -103 -60 -24 58 -115 -177 -159 -83 86 -65 167 229 123
2703A23j53j32J25j02J49j63P5K74o7j97J40j50J07p9ol31N37M13m90j01J00k7
2725D5j34Q5j11n1K47j92L17k94p4L16l14J60QK35l20J76p3M0j10L5J62l35L69
2748A87j45r8m1K43J15m9l12p6J56J34k23r8K58q4K01m6m3n1P7j81N8J8k12K47
2772C5P4n3j36q4J15K18j45O2l3j12k0j4J88P2j48q9K5J88n1j00n1J5J75j50l7
2797e6lL7N7J19j67J85j36j19q6L08l14J30J01j02j67J88R8k65K52m41L29lM7
2820hN2N4k79N5p1L28Q2k58j12J53k84M09k8k59J1J74k98M5Q4J31j04j38K09j0
2844f2K72j83P2o2n6Q1q4k89K49j0j0K33k06M1L9o1j45K83m1K4k8Q3k78L31l17
2869a24L15N9k63l8J06j04K15m8j98oJ73M6l01K45J10k20k58N25j50j25j17P6
$$ plain form
2703 123 -30 -162 -37 -139 10 -153 -78 196 129 -68 72 -78 29 -50 -56 -387 150 563 73 -28 72 45
2725 45 -89 -4 -115 -166 81 -111 206 -88 -162 154 -160 0 8 243 -77 99 26 66 -44 -9 153 -182 187
2748 187 42 -56 -97 146 261 212 -100 -176 -20 114 -109 -207 51 -33 168 122 79 28 105 -76 -18 0 -212 35
2772 35 109 56 -80 -164 -49 169 24 86 53 -59 -79 -93 95 167 19 -70 -45 143 92 -8 -59 -44 131 -19 -56
2797 -56 -59 -22 35 154 -13 172 36 -83 -169 139 -175 -45 56 -46 -213 -25 73 -192 60 -381 -52 -55 -8
2820 -8 44 98 -181 -126 -197 131 213 -45 -157 -4 -288 121 93 -166 -155 19 -279 -234 -150 -19 -123 -261 -52 -62
2844 -62 210 27 99 37 -19 62 -22 -311 -62 -72 -82 151 -55 -14 25 -36 -181 102 61 85 57 140 -138 193 -124
2869 -124 191 250 -13 -51 55 -49 166 118 -80 -86 87 133 -168 77 187 -33 -291 234 84 -41 -158 -82
2891h2L92l87M7M3l7K52k32J2r1l6j17J54O0J08k94K21l65J54K84j03j72J67L5
2914A3jk8o9L18j06l49JL66J1m7k7K86l35r4K72k79J6J9J07j11M6r2l41N98j01
2939G3J00Mk93J38K4k43L84l1j33j77J39l1p9J04J38k24J16J20J35J3m11j08L86
2962A44j59%J56j13P9k46K83l3j61q6L23j04j37r0r9K40K02l45M34l47q5K76m7
2985H5P9l52Q0K45j77N9j0oL17l07J36k00Q8j80J15q8mq7L16J4j27q7l69N12J67
3010B19l66j55M51j21k79J67O8j14K54j71j34K37J59k34r4L84r0J28n47J14J15
3031ij60K04J56J63o64R6K17m1j06K05k72K07k23L27k15R6j36K08N0P4j59p7j1
3054g0JL95m68K93M6j93K19k1l04j24J95l3l1K03j2j84P8K36k81K55j98R7j50
$$ plain form
2891 -82 310 -77 -30 13 -24 228 -4 8 -83 -119 -236 -82 -22 86 -208 13 -352 -198 86 -17 -189 -22 13
2914 13 12 -16 -85 233 127 -222 -221 145 156 109 82 368 33 -61 211 -68 -52 -33 74 -37 9 -83 -424 174 73
2939 73 173 177 -116 22 46 -197 187 156 23 -154 -15 -46 -125 -21 117 -107 9 129 264 277 -134 -242 144
2962 144 -15 -15 141 28 107 -139 144 111 -50 -136 187 83 -54 -144 -243 -3 199 -146 288 -59 -144 132 85
2985 85 164 -188 -108 137 -40 19 9 3 320 13 149 -51 37 -143 -28 -116 -120 -207 109 123 -4 -91 -460 52 219
3010 219 -147 -302 149 28 -251 -84 -16 -130 124 -47 -181 56 215 -19 -113 271 181 309 -238 -124 -9
3031 -9 -169 35 191 354 -310 -214 3 -38 -144 61 -211 -4 -227 100 -115 -19 -155 53 103 177 18 -59 -70
3054 -70 -69 326 -142 151 197 4 223 202 -102 -226 -31 -64 -95 108 96 -88 -10 226 -55 200 2 99 -51
3077e1n4K09N7j60j4L3r7K42k70j38O9K42j46J17j94P1jk7M6P1M4M6O9j10j6n4
3103a6j23pJ93l27K88n6J24k0k8j69l35N95j83j49J86N1J29k23J19J08k02K11
3125A66m6k34j5K86j44J28l40L31j93N8p7N8K47l72J06Q6ql64J65L11j35L0o6
3148b2o2J5K2J38q0j57K53p6j42J70m32M82j73J7J16K30j52J1j47k16K78j39O6
3171@J60j76p4K11j80J27J28j76p3J86M7l16J26J51m51R9J10OR6J40o5j06R7l83
3195c16J98K2r4L62J06o76N08o1j20j95N44l19N37m60J72l39P4K2l21K09K80j25
3217Hm9p4j23K24r2J42l09M51j54l0k8J91k40p4j64N03k9J73k37j97k4J32L8j15
3241g7N8M7N7P3k70J87%l31J12J9J72m0K09k22j98K33J4kj7j59q0J82J29q2J11
$$ plain form
3077 -51 -105 104 161 1 -13 20 -77 165 -105 -243 -174 68 -78 39 -155 -84 -85 -112 -66 5 49 95 164 54 38 -16
3103 -16 -139 -146 47 -280 8 -48 76 56 28 -141 -476 119 -64 -213 -27 24 153 -70 49 157 -45 166
3125 166 120 -114 -129 157 13 141 -199 132 -61 -3 -80 -22 225 -147 -41 45 37 -327 -162 149 14 44 -22
3148 -22 -84 -69 -47 91 11 -146 107 31 -111 59 -373 109 -64 -47 69 299 147 158 11 -205 73 -66 0
3171 0 160 -16 -90 121 -59 68 196 20 -53 133 180 -136 -10 141 -310 -211 -101 -95 1 141 76 -30 67 -316
3195 -316 -118 -96 -190 172 278 -398 110 49 -71 -266 278 -41 496 36 208 -131 -57 -35 -356 -147 133 8
3217 8 -41 -115 -238 -14 -106 36 -273 178 24 -6 -34 157 -83 -157 -321 182 153 326 89 -108 -132 0 38 -77
3241 -77 -19 28 85 158 -112 75 75 -256 -144 -125 47 7 216 -6 -204 29 43 41 24 -135 -215 -33 96 14 125
3266A25p4j4R5N1m76J36N1J89l10K18L0r4M60n94J67L31k41k38J50l5N0p9M20
3289C18m17qJ59O7oj41J24R3q4J20l61J71P0j80R0K18k75J3K00l38K6J74J17l31
3313a81L51j00j43j15J78m5J10j55J38l7j47K05j37j59K48k76K35j53J55r1J50
3334C1M4J7j42k6P6L10j78l29K23j66J10L7K27J14k28L8m9qj93L24r0j94L72j36
3358A84j67M3k8r2J86l77L45j52J95j45M5J28J81l24L28k93k45K70j22L9o7j07
3380a75L06j01M0r9k9N9k54J76P4K05m04K03j98L0M29l0k19k04J62j25K42j50
3402f2n2J17k2j19Q7L65l55J91l65J67J24k32J82QM9J57l80L26k85K54j64m6r2
3425a47J97k52J11O4J54NP3j43j2n02M80J06p1j06K9K3K05k21J46m0kJ2j78J55
$$ plain form
3266 125 51 37 132 183 -293 -157 -106 83 -227 -9 21 -73 387 -207 -40 291 50 -188 -38 -73 -23 -102 318
3289 318 -99 -107 52 119 113 -28 96 189 105 225 -136 35 105 -75 15 233 -42 -29 171 -167 -141 33 150 -181
3313 -181 170 70 -73 -188 -10 -55 55 -100 38 1 -146 59 -78 -237 11 -265 -30 -183 -28 -119 31
3334 31 75 92 -50 -76 0 310 132 -197 26 -140 -30 7 234 348 120 158 109 101 -92 232 142 -52 320 184
3358 184 17 60 32 -60 126 -251 94 -58 137 -8 37 165 346 22 350 57 -188 82 -40 -1 -68 -175
3380 -175 131 30 70 -29 -58 1 -253 -77 -3 202 -202 1 -197 -167 262 232 13 -191 -29 -154 88 -62
3402 -62 -114 3 -19 -138 -51 314 -41 150 -215 -48 76 -156 26 34 83 240 -140 186 -99 155 -9 -55 -147
3425 -147 50 -202 -91 -27 127 132 205 62 50 -452 28 134 63 -43 -14 9 214 -7 139 99 97 109 -69 86
3449H6l72J14oJ81J26r9K9j67J14RkJ49l02K13j68r1N7KJ06J65k96j89J99J07
3473c5Q5L6j64n2l9L59l65R7L76m85L28J65l75N4l2J75j66r1m9K21J4k77J80j9
3497e9J19j06k72L44r3j62K23K84k00j9j14J01j6K29m16J50n1k5J2OK48m28L22
3520G7j94P2J13k05L0K59k06oK45k58K16k97K42p8n0p9K05j7K0m5J3j84J88q5
3544b4j81N8L1M6J42k2r0J45j04K07k85K85k95K06j05J17k74J33J82k17J07k72
3566b10j8J65l3K00j19J9M8k89L25j23K62k84j26J31j9L73l35J08r1J52r4k94
3588b52R2K62j73J3J43J60j19j18%j39N4J02J13k2j91J75j7OK3r1l22L10R3j40
3612c8O3j94J25J08j30LJ31n9j46J19K00l55K01o4J45M6J17j12k05J27m9m5O5
$$ plain form
3449 86 -286 -172 -178 3 129 30 59 -108 6 15 13 162 -140 73 -95 -186 -129 -127 -21 144 -152 -341 -142 -35
3473 -35 50 86 -78 -130 -169 190 -175 -78 298 -187 141 306 -69 -15 -47 128 -38 -129 -178 43 57 -220 -40 -59
3497 -59 60 -46 -318 26 -67 -229 -6 278 78 59 -55 46 30 259 -157 -7 -58 -83 -71 -65 183 -245 77
3520 77 -117 -45 68 -137 -107 152 -54 -60 185 -73 143 -154 88 10 -40 -119 86 69 89 44 57 -127 61 -24
3544 -24 -205 -147 -116 -70 72 50 -40 105 1 208 -77 208 -87 119 14 131 -143 -10 172 -45 62 -210
3566 -210 -228 -63 -96 104 -15 4 52 -237 88 -35 227 -57 -183 -52 -71 302 -33 75 -16 136 42 -252
3588 -252 -160 102 -71 -58 85 245 126 8 8 -131 -77 25 138 116 -75 100 83 89 112 21 -301 9 102 -38
3612 -38 25 -169 -44 64 -66 -63 68 9 -137 -18 182 -173 28 -36 109 155 272 160 -45 82 33 -12 53
3635E3L7Qk48K89j03Rj1J56j85r0J68j2J86j32r5n9k57J82K57Kj34j01Q2Kj95
3660a91L15l88j54N50k36J10j64J1J2N5O3J83j61K40n18K79r8%J45L0k90K40k7
3683Fr6J71k35L68n08pJ22J77J95j94P7n1k23j6L57P2j39o4K27M8n15%K78J75
3707B25n13K64l3J99M4l57J26L01p2j92L0P1k42K43k5k4M0R4M1k63m8N6J39m04
3731c00M1J36P4l0J22m4J22l16J77j66K45M6k17O4k59J49K27k11J73K41j52k39
3753a17J73j01kl0L25k84J27j50R3j36QN5n4K53j34J36m36M31k48J79j58N9n3
3776f4ML8J26J39l30J81K00j38k17K66j68M6l9m51N21l40J90J4j54m4J64m7K66
3799A63M6j62j36K18j55k5k27K92k3J33n13M53o1K4m1K2m5O2O5j79K08k18Q9M7
$$ plain form
3635 53 90 98 -150 139 36 45 34 190 5 -85 83 71 257 125 30 -29 -286 -104 153 155 21 -80 2 4 -191
3660 -191 124 -264 -418 132 -104 6 -158 -147 -135 -80 -17 166 5 245 -273 6 -92 -92 53 83 -207 33 6
3683 6 -90 81 -154 214 -294 -301 -179 -2 193 -1 76 25 -198 -214 143 215 76 12 239 287 -228 -228 50 225
3707 225 -288 -24 -57 142 186 -171 -45 256 184 -8 22 93 -149 94 69 45 85 179 220 -43 -91 -35 104 -300
3731 -300 -259 -123 -49 -79 43 -1 121 -195 -18 -184 61 107 -110 -46 -305 -156 71 -140 33 274 122 -117
3753 -117 56 -45 -47 -77 248 -36 91 -59 34 -102 -94 -39 -93 160 26 162 -274 157 -91 88 -70 -11 -64
3776 -64 -60 -22 104 243 -87 94 294 156 -61 205 37 83 44 -407 114 -226 -36 -22 -176 -220 -56 -103 163
3799 163 209 47 -89 129 -26 -51 -278 14 -9 124 -389 64 3 27 -14 8 -37 25 90 -89 119 -99 -10 37
3823C7N4j04K2j18J1j27L85M3j83k0J02K3l14L7K16n9J2j67p7K87R7m53K92L95
3847C91m99j4M5Q4koM0j39J57L1m6j50o5l1J61J42j85N8k07K10j6R4p6M5Q4p3
3873C3J82n46M82j5P5n31L36J17l36K3L7K94j04j38K81P5j77M5k76J76j13j36
3895b16l6N86j96J26l66O4m3j87J8K45k16L00L8k33J24J55l43K93j14p6Q0j01
3917i8J28j45J17k31N01j51K6n24K94J62j39j96K25j81K19O4j11o0K36J8k26J71
3939I9j63O6k9L4J9L02j51k41p9K03k5j55J13q1P0%M6j4L51m88J33LJ58j76j9
3964b4Q5j16J65J98o27K75PJ96j8J15l24J68k55K70j25K7j10N4J79L8O2k29J7
3987B8O0j88M5K72l37L30k12j7k62L33k38J87P9k62K02q5O6J46K6l3j23Jj22Q3
$$ plain form
3823 37 91 -13 9 -109 -98 -225 160 203 20 0 102 125 -189 -152 64 5 17 -150 -227 60 157 -296 -4 391
3847 391 -108 -122 -77 7 5 -1 39 -100 57 88 42 -108 -173 -204 -43 99 -86 -28 -235 -25 -41 53 -23 22 106 33
3873 33 215 -331 151 136 211 -320 16 133 -203 -180 -143 151 47 -91 190 265 88 133 -143 33 -80 -216
3895 -216 -252 334 138 264 -102 -38 -81 -268 -250 -5 -221 79 117 -116 8 163 -180 113 -1 -77 3 -98
3917 -98 30 -115 2 -229 272 121 147 -377 -83 79 -60 -256 -31 -212 7 71 -40 -100 136 154 -72 99
3939 99 -64 2 -27 7 26 328 177 -64 -143 60 35 -120 -7 -88 -18 -18 28 14 365 -123 10 13 171 -5 -24
3964 -24 61 -55 110 308 -319 -44 -37 159 141 256 -68 100 -155 115 -10 17 -93 -39 140 178 240 11 28
3987 28 88 -100 -55 217 -120 210 -2 -19 -281 52 -186 1 80 -182 20 -65 1 147 173 140 17 18 -104 -21
4011b1j30J55mk01L91l12J83o5l11J36L71J1m38J11K43k80K55kr0kj81J9P4j82
4035b70M64j95o2o2P0P2j27N0Lj09J18K32r3N6r5l4J55l37N2J38L66k40l49P6
4059a21m7J10p3P5J53o3lJ38k28Q5Q6k61K14j85J7L8J56m1j21K30L4j01k32N3
4083h7MJ97j21R6M9o3n7j9J61k03j51J93j61J66K08n3p4k17K36j15Q8j73J93j93
4107i6J08o8L40m74J40j55O3J21N4J8L7k82J36K35l80m7J32J5NmJ97k84L37j22
4131B6j00l9K18k1k51oL51m13K49J21k79N2R7lk29L19k4j45K8LJ68q1l17J02J55
4156a9L8j83L69m89O03k97m5J26P8j85k3J03j17K02k33Rj14K48l3j02J56j08l7
4179e3j41L74m19L41kj53K15j4j25j83J45l18N23l59K63J7J0j5j86J99K3j36P4
$$ plain form
4011 -21 -151 4 0 -201 190 -122 61 -4 -315 -179 192 203 -235 -124 119 -161 94 92 2 0 -181 -162 -88 -270
4035 -270 194 -1 -63 -125 -55 17 -110 -60 -57 -166 -48 184 91 147 52 18 173 -164 -112 26 392 152 -197 -121
4059 -121 -168 -58 -131 -56 97 34 31 169 -59 26 112 -149 65 -120 -103 -65 91 50 -71 159 193 92 -140 -87
4083 -87 -83 114 -7 89 138 75 18 -1 160 -43 -194 -1 -162 4 212 159 85 -132 104 -11 77 -96 97 -96
4107 -96 12 -56 284 -190 -50 -205 -142 -21 33 51 88 -194 -58 177 -203 -250 -118 -103 -98 -102 95 -189 148 26
4131 26 -74 -113 105 84 -167 -173 178 -235 14 135 -144 -92 5 2 -227 92 68 -77 -49 -46 122 41 -276 -174 -19
4156 -19 19 -164 205 -284 319 22 -23 103 181 -4 -27 76 -41 161 -72 -63 -177 71 38 -64 92 -16 -53
4179 -53 -194 180 -239 102 100 -53 162 148 23 -160 -15 -333 190 -169 94 111 121 106 -80 119 142 6 80
4202H0Oj8o1r7J69j38k15L35j61J9j27N03k90o9J39j86J50Q0K4j78m0K15J07r9
4226A48k74M7J52j74J71r8O2J10J32j09j50O0k68J12o1J15R6K82n91K51r6L9M9
4249EK29k06j54J14j05J87nn2J61o9j41QN6j55J44N84n66J92K2l83L2K25j63N1
4273A1M4r1O3k9k77N4J63J22N3j36j9o2K39j48J36j71j21M9J70R1k33R9M0N1p6
4298B2J10n0k36n6K32j06K29j67L1J03j20pj38r2J07Q0L17j96J89j60k63M36k53
4321A2m1O5%J7N9n21K78N2K53k46J19Mnl1Mj78kJ76M9O2j89N2Nq6L4qL27k70j38
4350a47M21n05J43K86j75j00J39j20L7j12NJ15K90j42j26O5o4J55j02o4j18K11
4372I2p0j37R9K1k0J84j43o6J07j63O7p4K99L2l19J53k8m7J77l12K80l3j67L44
$$ plain form
4202 80 86 68 7 -90 79 -59 -274 61 -100 -81 -208 295 5 -64 75 -111 39 119 143 -35 -75 140 247 148
4226 148 -126 -79 73 -101 70 -28 34 144 276 167 17 77 -191 -79 -140 -25 71 353 -238 13 -83 -44 5
4249 5 234 28 -126 -12 -117 70 65 13 174 105 -36 -28 28 -127 17 601 35 227 249 -134 -102 123 -40 11
4273 11 55 -36 27 -2 -279 -225 -62 60 113 -23 -42 -104 135 -13 123 -48 -169 -120 50 141 -92 7 47 98 22
4298 22 132 82 -154 -210 22 -84 145 -22 9 112 -8 -15 -153 -245 -138 -58 259 63 252 92 -171 265 12
4321 12 -29 36 36 53 112 -409 -131 -79 174 -72 47 51 46 15 19 -159 -161 15 64 126 -63 -11 -6 -92 -58 -66 261 -9 -147
4350 -147 274 -231 -88 198 23 -77 62 -58 -21 -133 -128 -13 277 135 9 74 10 165 63 -1 -119 92
4372 92 22 -115 -16 5 -15 169 26 -40 67 -96 -29 -103 196 228 -91 62 34 -13 164 -148 132 99 -68 276
4396B76k73J15l32K83m4j58J49J57m02R5K27p1J71l5j06j26r8j06K74p0k2P1K55
4419B30l65K5J48j01K5N4j13J65j13R4n5J20k72K47J00j98L64k57l36L86k76j01
4441b29K91J07k52J29j12N8k21L63o5m3j71L09k97j18K12J86j45j53J2L28R7o07
4463c21J80k6J72j7j21pRN1l9P9Q6k69N1K18J10j58j60L20j85P3n6p2oo7K78j72
4489d9J48m3p5J4Rk17K97o7j40j24L20k7j33K17j94L0J63k45J11J30k98L65k63
4512g1J19Nk91O43o67J67J5K27k05l2J47m0j23L8O2R2R9Nl4j36j0n9l62K82L06
4537A77j12Qk88J21P8j4jl0J14J5J69k50l7K87j89J14m11K52j84O0L61l48j35
4560b43J41J48n3J54j37J1j19J63n5l3k02N57j49j61j42J12J21j37N0J27j16q
$$ plain form
4396 276 3 118 -214 69 25 -133 16 173 -229 -134 93 22 193 158 52 -74 -172 -278 -4 -74 -96 -25 230
4419 230 -135 -110 38 -63 -38 16 -97 68 -45 49 -6 114 -158 89 189 -9 355 98 -238 148 -128 -229
4441 -229 62 169 -83 46 -66 -8 -229 134 69 26 -145 164 -133 -251 -39 147 2 -151 -139 189 286 -321
4463 -321 -141 -167 5 -12 -133 -140 -131 -80 -119 -40 46 -223 -172 46 156 -2 -162 158 -27 46 -10 -82 -88 -155 123 -49
4489 -49 99 56 -19 -5 4 -213 84 17 -123 -247 73 46 -87 130 -64 -34 129 -116 -5 125 -173 192 -71
4512 -71 48 53 -238 405 -262 -95 -80 147 -58 -90 57 17 -106 -68 -6 86 185 190 156 20 10 -49 -411 -129 177
4537 177 65 73 -215 -94 -16 -30 -31 -61 53 68 237 -13 -50 237 48 162 -249 3 -181 -121 240 -108 -243
4560 -243 -102 46 -7 147 10 21 -98 65 10 -23 -225 332 183 22 -120 -8 113 -24 26 153 37 29
4582B9r3J98l09K28k18J47N8m7R8m4K9l8K5j56J16n3m5j95N9K69o4K3J60q6k24
4607a33K28k47J25j09J40qR6j73J53Mk57K89ok40KJ24r4J30p6O2J02n6m4K05N0
4632B67l17q4J5l7J55L9J95k23m4j01J96j53J18j49J58j21j75J15O6J28nK02j41
4655A04k34J13M4n5j41M22j59k17m3O6K45k81j39M94l3o6l22J81O7j77J46j0R5
4678A00Q4l91M4R9Q5k32L28nO9j19Qj32j94L14o1j07K15j62R7l74M50m2j82J23
4702A5K35mm01M85j96k44PK15k66K22l12M69l9o7L0j26k09o8K28J07k40K15j98
4725a42JK34k44L54m76J09J76j94O9nJ72J77j48k34oj28N63j80r7m3L38j77j85
4748f6J52J4k43P8p3N5K78m18L70j15M4Q1J9k67K30O7j52k86K00O2k4k1m0J14
$$ plain form
4582 29 -64 134 -175 53 -165 -18 40 -7 91 47 76 38 63 -93 23 -30 -75 -270 -211 58 -6 17 177 91 -133
4607 -133 95 -152 -27 -136 4 -4 92 -81 72 76 -181 108 102 -138 -136 -12 -106 24 -52 10 112 56 12 217 267
4632 267 -50 -134 -119 -156 -1 38 233 10 -34 -135 61 -92 26 -123 35 -86 -261 -146 -80 48 43 245 104
4655 104 -130 -17 27 -28 -169 253 94 -123 -166 -100 145 -136 -275 219 186 120 -202 -21 46 -131 15 5 100
4678 100 184 -207 -163 -64 21 -211 117 112 181 62 70 -62 -256 58 -3 -110 105 -57 40 -334 116 74 -108 15
4702 15 250 246 -155 330 134 -110 -103 112 -154 68 -244 225 186 119 149 23 -186 -254 -26 81 -159 56 -142
4725 -142 -141 93 -151 203 -273 -164 12 -182 -113 -118 54 231 83 -151 -157 -285 278 98 1 -42 296 119 -66
4748 -66 86 100 -143 -65 -138 -83 195 -223 147 32 76 157 176 -91 139 206 54 -232 -32 30 6 -15 -55 59
4772E9n9k97J39LJ90m0l0M9o5K73k71P5k18K62L3j56L2J84m62K4J03K37m3j94
4796a72K40j44j5J34k08K64J0mj90J05O3J2M9l02Q7J61n0K6q5k53J52L91j15k36
4820h0K32j45j73M46l1l92q8J70J88k18m5J34J7j3L3M8k97J39K61k31l4J18l4
4843EJ21q0j69J79Q7j45J79k03l8K20r9J4K80l91n2J6j8K18l3j5r5n7j12L21k44
4868a11k40J96Q9J51j88J82K07j85K2kk1k48L13j44l64P65l22j0k06N8J42M2m07
4891b81J06J2J96K76j21j83p8K00k52M05k01j75J67k55R4K74k49O2j04o4J57J38
4913A24j15K50l68J64k9N8j49L2r4j00Q1L2K41M3j03j92O3J16J94l9j84Q8j86
4936g3k86M30k6k08L44j29L0J1rj35J46n2N2P1j34Nn2m7P9KQ8j63j20J51j53N3
$$ plain form
4772 59 0 -297 -158 -155 35 -5 -35 14 -51 222 -49 26 -192 70 103 -53 -21 163 -299 -275 -172 65 22 -172
4796 -172 68 -76 -91 43 -165 99 109 105 -85 20 83 95 144 -158 -71 90 40 66 -19 -272 -120 271 156 -80
4820 -80 152 7 -166 280 249 -143 -231 -61 127 -91 -136 -2 15 2 35 83 -214 -75 186 -45 -79 39 5
4843 5 126 46 -123 56 143 -2 177 -26 -64 156 57 71 351 -40 -92 -76 -94 124 91 76 -19 -76 -188 133 -111
4868 -111 -351 -155 -66 85 -103 79 286 101 123 121 100 -148 165 21 -343 422 100 90 -116 -58 84 126 -281
4891 -281 -175 -163 33 309 188 5 -73 127 -125 280 79 -96 71 -184 -90 184 -65 -3 -107 -171 -14 124
4913 124 9 259 -109 55 26 84 -65 -33 -127 -227 -146 -114 127 170 67 -125 -62 54 248 209 25 113 -73
4936 -73 -359 71 45 -163 181 52 82 93 84 -51 95 43 95 166 32 37 -15 -62 17 19 107 -56 -176 -25 -178 -125
4962a25O5L40k24k84L56k21l0J83m15O31k41J28k38O1j13j08J96K06l7J76k08
4983I8k53J45o6N2q9K45k58j4L7N4K7kK45j63j20J46R4j18L7J4j41K36j66L5J21
5008A96k16P1k02J72J35l56K82j99j79L19j49M2J7M34l11Q6L49m30nQ4j78k38
5030b76K72M2m3K11j83J15l7K4j49n4pmL36j09l79Q5O8K09N7j21j81N2R3j70K61
5055A12j14l43M02R4l93L16j02k30J55K18j9j67m1K63k2j2K17R4m66j34n6QO1
5078a59k4N1J81N6q1Nj01J78p8j52J44j27O1j15K91R2k12J04k23L35j06k29K10
5101A01p7Q8k7r5R0m6O6j42j78L71j53Mq6j2L03l42L20k38L08J8K4k14j25j4j16
5126a72J69j91K2J58j31k6L69r1j74j92J18R0K03J3kk2oj66J81k76j42KN44l97
$$ plain form
4962 -125 -60 280 56 -228 128 -93 -123 60 -355 276 35 163 -75 -14 -127 -235 -39 167 130 306 98
4983 98 -155 -10 -76 -24 -113 132 -126 -140 -103 -49 -22 -24 221 58 -62 84 178 60 97 111 -30 206 40 75 196
5008 196 -20 51 -151 21 156 -200 82 -117 -296 23 -126 -84 -67 367 56 142 491 61 56 140 -38 -276
5030 -276 -4 38 -5 206 23 138 101 125 -24 -78 -85 -89 247 138 -241 -156 -88 121 178 57 -124 -72 21 -149 112
5055 112 -2 -345 57 151 -242 74 -28 -258 -103 115 96 -71 -112 151 129 117 334 428 -38 -172 -228 -220 -159
5078 -159 -183 -132 49 105 24 29 -72 106 28 -124 20 -107 -46 -161 130 222 10 114 -109 226 120 -109 101
5101 101 24 112 85 -10 80 34 100 -42 -220 151 -2 2 -84 -96 207 -135 185 -53 255 273 297 83 -42 -56 -172
5126 -172 -3 -194 -172 -14 -145 -171 198 107 -67 -259 -141 -51 152 165 163 141 135 -31 150 -126 -268 -266 278 -119
5150a19K60k23O3j69J88j5l10N41k59k25K60P7j69Q5j7K11k18J96q2k91K88j34
5172f2J64qj39K36l00L29m79K89J19l32QK76k89J84K05l69K88L7j61J74m01J87
5194d4L12k32J25P0j48p7l8l8r0K86L5j93J62o4q5K3k42N67l36M41j88k68Qj06
5218a20K34j27j24k69N00l84L38j09J26j53L38j03m8L7n6j6J93j38k46K05l71
5239b93K99l9K9L0L09j39j26J15l27J05K03k96J71J0j4k73q4M69M6k25Q9P9k6
5262A12k44O8op3N8J24j9j47j05M46m07J48j9K01J25k92L3l01K26J13K5j36O7
5285ck33K79j8j41K57k14m7O2J49J13j84j34K70l15Q3j90L41J9K9J3j26j10J35
5308C5q5J42j9M0J22j23kj03Q1J81j54l75M68l82K61p0j81M10k09m0Q1j44O4o6
$$ plain form
5150 -119 141 -82 -19 -188 0 -15 -325 216 -43 -268 -8 69 -100 -15 -32 179 -39 157 75 -216 72 -62
5172 -62 102 94 -45 191 -109 220 -259 30 149 -183 -175 101 -188 -4 201 -168 120 157 -4 170 -231 -44
5194 -44 268 36 161 231 83 6 -32 -70 -160 126 161 -32 130 66 -19 4 -238 329 -7 434 246 -22 -14 -120
5218 -120 114 -13 -137 -406 94 -290 48 -61 65 -88 250 147 99 136 80 64 257 119 -127 78 -293
5239 -293 6 -33 -4 26 335 196 70 185 -142 -37 166 -130 41 51 37 -236 -320 149 195 -30 59 138 112
5262 112 -132 -64 -70 -143 -85 39 20 -127 -232 214 -193 -45 -64 137 262 -30 3 -298 -72 41 66 -70 -3
5285 -3 -236 43 25 -116 141 -73 -120 -58 91 204 20 -114 156 -159 -76 -266 75 94 123 136 10 -100 35
5308 35 -50 92 73 113 235 112 110 7 88 269 115 -260 208 -174 87 17 -164 246 37 -3 78 -66 -2 -68
5332f8J1qO6p7j89J76R7J67k98O3J51R5p2j55K40k1m9J12k8P6j85J42j55k56Q5
5357h0N0J0o7K24n7K4l88L22N3l33L04r9M3N1p9J0N1j59L47k31nj20J01N2j08
5382h4K42k11M35l99K15l19J07j42J70l9k03L83k23j7Q8l8m4o5J14K36k83K88
5404B11j35k91O7L21O9j35j8j95Q3r1M16l80R3k05J81j46M6L41p1K30l55j70J02
5427c2L6r7J0k00K63k01J72k8M43n30O2K26k59J04N9m1mJ49j06P0k33J01P6J04
5451A44k00J79j32O9k04K29m92M57P2l22J24k10J40Q0L16k57K5k24K61R4j70j96
5473b17j0K59J76k73j50K69PJ61n5l38K19l04K82j41m6K87l46K42K6k03R7K83
5495B25l99J75RP3j97K30l01L95n6k99K58L4k59j09K21M5n9l7M5J06k16L3K95
$$ plain form
5332 -68 -57 -65 1 -76 -265 -89 8 175 -123 -60 91 186 114 -41 199 178 129 241 213 289 104 246 91 -165 -80
5357 -80 -30 -20 -87 137 80 104 -284 38 91 -242 62 -37 6 57 -22 -12 39 -120 227 -4 -9 -129 -28 24 -84
5382 -84 158 -53 382 -17 198 -121 -14 -156 14 -25 -228 155 -68 -85 3 -35 -79 -144 -30 206 -77 211
5404 211 76 -215 -148 173 242 107 89 -106 -23 -114 302 -78 15 -190 -9 -155 -109 232 161 391 36 -134 -32
5427 -32 4 -93 -83 -283 -20 -221 -49 -77 366 -164 -102 124 -135 -31 28 -13 -17 132 26 96 -137 -36 40 144
5451 144 -56 123 -9 60 -144 85 -407 50 122 -200 -76 -286 -146 -66 250 -7 18 -206 55 149 -21 -217
5473 -217 -227 32 208 -65 -215 54 61 222 167 -171 48 -256 26 -115 -161 126 -220 22 48 -155 -58 225
5495 225 -174 1 10 83 -114 116 -185 210 154 -145 113 147 -112 -221 0 45 -14 -51 -6 100 -116 -83 212
5518B12k07J62o6k92J63j36J96j19j53N14j33l16K87Pk60K91k14R1K82k54j21
5539f6Q2j23J29J76m23L17k2j56K16j61Q2j26R4m1J66l21J71p0K9L98k05k88K24
5562H2k86M25k05R9n7j85K84l68K18oN1K63l28j07oJ47KP5k11J19l2j52J84p7
5586g1K85k88J13j13R9k84L39k53K73J25p5P4k59r2K52l62L97k24J96k35J2M0
5608e1j48L80l71K60J15J36l71R7p8j15J51L3k44M48l05J0m7K35o4o9P5l0j79
5631a32O8k5J30j54J71N9j78J16j15q1J42R2q7Nj16K46R6k4j63r9K18k38l5K48
5655A44j37n7J41N4O6k28r3J54j09Q2K79m83J37K54k26j05J47mJ08n3j71j84K90
5678Fk76J24K18K51n53n2j07K05J67j0K00j17M9q7k9oO0k44L99l8O1k25qJ61l81
$$ plain form
5518 212 5 167 101 -191 -28 -164 32 -87 -240 274 141 -175 112 119 -141 150 -64 27 309 55 -66
5539 -66 16 -107 22 198 -225 92 70 -86 130 -31 51 -75 19 -22 144 -177 -6 -76 -47 351 146 -142 82
5562 82 -204 221 16 115 58 -127 157 -211 7 1 52 315 -13 -120 -126 21 23 98 -113 6 -26 -178 6 -71
5586 -71 214 -74 39 -74 25 -259 80 -173 100 225 150 224 -35 -127 125 -237 160 -64 132 -103 -91 -51
5608 -51 -199 181 -190 70 185 321 -50 47 -31 -146 5 38 -206 242 -63 -53 -100 135 71 2 77 47 -132
5631 -132 -64 -89 41 -113 58 117 -61 55 -60 -141 1 93 6 11 -105 141 237 213 50 -49 169 -69 -104 144
5655 144 7 -50 91 145 211 -17 -110 44 -65 17 296 -187 -50 204 -22 -127 20 16 124 71 -100 -284 6
5678 6 -270 -146 72 323 -230 -282 -389 -184 -17 -27 173 56 105 18 -11 -17 43 -201 198 160 221 -4 -12 149 -232
5703b32O0O4L89l41P3O2j28J69j75K99m57L00Q2K1j45J26K4j99p4O2j94J85j83
5726b12J15L2l92K52K32j21l7L06k20OK7R6m7N3p3k5j11n0K90k86N01j27l47R0
5750d8k73K67Q1m3k66L65m50R2K06J58j08mJ27k20J74K4m06M21n4L9J27J6j13
5773A12j0j48j02R6k20K15n2J55j42J51j69J69j36o4O3Q1K53m79M4J55J66K5j56
5796Gj56K51j28J04m3j37J81R4l60K40K9J50j66k3J28k45M1J92j62m1j45K35J92
5819B38j23O1j52J12k53L8J61ok54L6K41J17k82J77j75J28j36J23q4j31R2J59
5841H7j26P7K13m13L95l43J65J61k25Lq4j57M46m05M1OK31mJ09j32Q6q2J49N4
5865B52m14L07q3k63K25j60L23o1p8R5j34j5N6r7Q5j6j80K91k41J72k20J51j3
$$ plain form
5703 -232 -172 -108 281 -60 13 75 -53 116 -59 240 -217 83 165 186 41 167 191 -8 -82 -20 -214 -29 -212
5726 -212 -97 -65 -457 -205 27 -94 -131 175 -45 -39 -12 84 37 90 17 -8 -119 -169 121 -165 336 209 -138 -48
5750 -48 -321 -54 27 -16 -282 83 -367 -275 -69 89 -19 -23 104 -116 58 82 -324 97 43 82 209 225 112
5773 112 102 -46 -148 -52 -272 -57 -109 46 -96 55 -114 55 -81 -145 -82 -1 252 -227 -183 -28 138 163 7
5796 7 -149 102 -26 78 35 -102 79 173 -187 53 82 232 66 43 171 -74 -33 159 -3 -44 -189 46 238
5819 238 115 176 24 136 -117 -79 82 76 -178 -142 99 216 -66 111 -64 64 -72 51 -33 -164 -72 87
5841 87 -39 38 251 -162 233 -110 55 216 -9 -6 -90 -247 199 -206 -165 -159 72 68 177 45 131 49 198 252
5865 252 -162 145 62 -201 24 -136 187 126 48 143 9 -6 50 -47 38 22 -158 133 -108 64 -156 -5 -18
5888a8J16R8j35k42L17k75K54l91L07l31L25K20k17J48k56l0J25k8J08J41k54
5909a8o2j38K93j4n3J40j85K23j04J29n23O16m7l25jL54l33J78J67o6k95K9n7
5932i2j19Q2k0L19l57J13J10o3qJ06j42R4K3Nk36L58j63lO3R5l4kk81L44j95l21
5958c24K63K23l21RK84k7J12l57N15r0k51l13J32J56O5j35m9K0K23q0J09m06K76
5981C4n1p1K13j56R8n9N8N4m01J39J73j1O4k94L20j35m5J19J21l51L17j43l2m3
6005h2J35J14q5M2j42J28M2k30J47k81J20J18K34k39J47l36J58R5k18M57l3k55
6027C6q2L6Q4j50o2J82M0m8M4o4l02K54L28o0r5j5k78R3k9r8O6L0L51j59j87J06
6053B1Q2J10j94L6k62L30j92K74l10k34K88n0K19l62L20l49K01J88k1k62P9L27
$$ plain form
5888 -18 98 196 61 -181 136 -139 115 -276 31 -300 25 245 28 176 -80 -110 15 -13 95 236 -18
5909 -18 -80 -218 75 61 8 148 -37 186 82 211 -312 304 257 -68 -69 285 -48 130 297 231 -64 -35 -92
5932 -92 -211 -129 -149 170 -187 -74 36 -27 -35 71 -71 23 46 51 -185 173 10 7 70 165 131 129 -152 192 -3 -324
5958 -324 -61 162 -159 -150 134 107 219 -138 377 287 36 -277 -145 11 76 -59 -108 -88 135 55 164 -242 34
5981 34 -17 -88 125 -31 67 8 66 120 -281 -142 31 20 84 -210 110 -25 -70 49 170 -181 136 -7 -39 -82
6005 -82 53 167 82 124 -18 110 152 -78 69 -212 -92 26 260 21 168 -168 -10 85 -133 324 291 36
6027 36 -46 -10 74 -76 -138 44 84 36 80 16 -286 -32 296 236 141 126 -152 -59 -88 -186 -120 -90 261 102 -85 21
6053 21 103 213 19 55 -207 123 -69 205 -105 -339 -51 -101 118 -244 76 -273 -72 116 95 -167 -88 239
6075B39L8l89o0N08k90P8k08J23k04J85j14j57L04j18J71P6j46J62j61l4J49N7
6097B09m40N67j48j62M8J04l09L9L19Q3l98j05K98k49N4j02K82l88J84j8J90M2
6119A00k83K2K37m1l94K59j71L09J21j31l83PL66j09J56j31J3K6J06k14K7L09
6141B01k37m3j10o9J07j99L34k27M45j29j84N3L28j91j27J10j33J84N1n44L02
6162g8J31j28l2P0j3N9L3o5R2j36K05k12Qo7K93l48K90k8j79J37k10J02p2J89
6186D1q6L2%n9j76K31p0O5R3l52K49j23L46k23K19j78o3J49m0j22n4Mo8K07p4
6211e2P8J78j86J5l1k45K75J62j87k30J3M05k54J5Q2j86kM56l55k04N52j83k28
6234a12P3j54M6J99J2j21O1J04j64K89k77j84N63k38mJ04l08J05N7oJ23j60k17
$$ plain form
6075 239 277 -112 -172 336 46 124 -84 39 -165 20 -94 -251 53 -65 106 182 36 198 37 3 152 209
6097 209 -231 336 188 26 74 178 -131 -92 227 310 -88 -193 105 -144 -90 -192 90 -298 -114 -132 58 100
6119 100 -183 -161 76 35 -359 -100 -271 38 159 28 -355 -348 18 -91 65 -66 -53 -27 79 -135 -108 201
6141 201 -36 -79 -189 -258 -151 -350 -16 -243 202 73 -111 -58 270 79 -48 62 -71 113 164 -380 -78
6162 -78 53 -75 -107 -37 -50 9 42 -23 69 -67 138 -74 -66 -133 160 -188 102 74 -105 32 -178 -76 -148 41
6186 41 -45 -13 -13 -72 -248 -17 -87 -22 71 -281 -32 -155 191 -32 187 9 -54 95 55 -67 -121 -117 -185 22 -52
6211 -52 26 204 18 33 2 -243 32 194 7 -223 -210 195 -59 -44 38 -148 -150 306 -49 -253 299 116 -112
6234 -112 -39 -193 -147 52 64 -57 4 108 -56 233 -44 -228 335 97 93 197 -111 -6 51 45 168 8 -209
6257b09j19L23J18k62K36J50j91j78Q6J14k35J60n5J77k83K52N9j23J32j7k41
6278a06j1n9J09l6m9K05P4j6k44J00N6j03K44m7j22j87M6K04l12m6M94k03l1Q1
6302D1l04J93L53j74K9k53M6r7J51j81P3L67o9j48J06r5J38k60n2K46l71N24k39
6325B4j03N8r0m6L14j94K4J34k0l35m7L25J64j87n4Nj42P2R5j64L80j37M1Mk38
6350a17j62L78n9j39L8O9J77l00K78k33J27r1j42L36l6n1J80q5k67K42n31N70
6372A82k32j2n1N3L01l76J80k53K54o4L2j42j08K62n1J70m6l9N7N0r9J86j61k03
6396a10L59k68R1M1k32O7J6K30j85R1j71k42K36J07K19m00j6J8p0M3J54q6%L68
6420B60j37j06j71J52j36L70m03K18RR6j52J14k43K49k14j48J85Ln8J52J5l6P
$$ plain form
6257 -209 -328 -5 113 -149 87 237 46 -132 -46 68 -167 -7 -62 115 -168 84 143 20 152 135 -106
6278 -106 -117 -176 -67 -103 -152 53 127 111 -133 -33 23 -80 164 117 -5 -192 -146 58 -254 -300 194 -9 -40 41
6302 41 -263 -70 283 109 138 -115 -69 -166 -15 -196 -123 244 175 27 133 38 176 -84 -136 110 -261 263 24
6325 24 -79 -21 -111 -157 157 -37 -13 121 101 -234 -281 44 208 21 -33 -28 -170 -98 -3 -167 213 76 117 121 -117
6350 -117 -279 99 40 -99 -61 8 185 -115 163 -70 57 -34 -176 160 124 73 253 168 -99 143 -388 182
6372 182 -50 -62 -113 -60 241 -135 45 -208 46 -18 14 -128 -236 26 -25 145 99 60 117 167 68 254 93 -110
6396 -110 249 -19 72 113 -119 -52 -36 194 9 100 -71 -313 -77 30 249 -151 -167 -149 -219 -176 -22 -108 -108 260
6420 260 123 17 -154 -2 -138 232 -171 47 56 152 0 114 -129 120 -94 -242 -57 -54 -112 40 55 19 26
6443B6J70k66P2J95j67k21j5K7J08L71k12j99K39K9l08J45k42K89q1L99j80k47
6465f8J52Q7N2j77p7k2P9L0L04k83jj05o4J24l7k9p9J82j38L30l56Q2K22j23L1
6490A16j60P1j19O0r9J73K14l84N7J78Lk51J78PJ15o7j73j9j64L44J9J20R1j14
6514A96k89q0J52J56j45j04N7k98J79J33J48o7n0J33m0j94J07J37m25M71L7l81
6536a67K54O7L6j12o8J67l03L34k26j86J54j87K83M1k13j6K70j83N6J84k54K91
6558B22k16j6J93j80j71K38K24l49K3J69m9o6k07J51N1j73J5J77jk74J63L54m82
6581b04m7K31J88p3J4k19O2R8o1l42L45M7L4k01oR9n4l4J36L3r6QK57j46j87P5
6607d3J66j48nJ80j03j21J24r8j24L35n9j35k09K51J07j63r3Pp2L52l80K20J0
$$ plain form
6443 26 196 -70 2 197 30 -191 -206 -179 -71 300 88 -111 128 157 -151 -6 -248 41 -40 359 179 -68
6465 -68 84 171 223 46 -31 -53 26 56 360 77 76 -29 -93 31 -6 -35 -114 68 -70 260 -96 -14 208 85 116
6490 116 -44 27 -92 -32 -131 42 256 -128 -71 107 110 -141 37 44 159 92 -81 -100 -264 80 99 219 310 196
6514 196 -93 -173 -21 135 -10 -114 -57 -355 -176 -43 105 38 -12 121 81 -113 -6 131 -294 177 214 -167
6536 -167 87 154 190 78 10 177 -126 208 -18 -204 -50 -237 46 87 -126 -142 128 -55 1 185 -69 222
6558 222 6 -10 183 3 -168 70 294 -55 -32 137 88 22 -185 -34 17 -156 -141 36 35 -239 -76 278 -204
6581 -204 -251 -20 168 95 109 -110 -48 50 -11 -353 -8 39 73 -128 -134 -35 -89 -123 13 46 -50 -42 215 69 -118 -43
6607 -43 123 -25 -30 150 47 -74 50 -48 -172 163 104 -31 -240 11 118 -45 -138 -131 -203 149 -231 -11 -1
6630aj04k54P3M90m1k04k29K25J30n5J53P2k14J10r8Lj31n9R3M7O7m9o6K46j60
6655D4j57K66k11K10l71P3J94j53J39J47k1k19J22j22P0k13j08J37j02L01J72
6676A98k21J35k12L72l69J89j61p4mJ38o7K32K39l08k39M47l72K3J89k60n7K86
6698A04q6j14J22j23n2M97l15k49J53K25k25R9q3QJ32r6j50J75l2j36J7M42k40
6721G3q7P9k15J69J30L9l33j5L86k72m4J84k2n5j63J63K3l57N47l12J76j71p7
6744a54K17p9J56l8j07l0M8j73n0M0J71j26N4R4O2k3q2P6k18O4o1r8N56k33O4
6769A30j11j16k0L80l00M7R9l1O7j60J58j81J80J58j76J64k67oK19l25K4M7Q0
6792F0j95J78q2J67o0r1P4j09J3R9j22J05J01o5K9o7k00K04n2p3J09K79j40j66
$$ plain form
6630 -1 -105 -359 -286 204 163 -41 -270 -45 85 30 183 255 41 151 53 56 -75 -134 -41 6 73 24 -42 204 44
6655 44 -113 153 -58 152 -219 -146 48 -105 34 181 160 -59 63 -59 11 -202 -310 -173 -275 26 198
6676 198 -23 112 -100 272 -97 92 -69 -143 -147 -9 -76 156 395 87 -152 295 -77 -54 135 -125 -182 104
6698 104 18 -96 26 -97 -149 348 33 -216 -63 162 -63 36 -47 -39 93 -3 -153 22 -10 -146 -129 313 73
6721 73 -14 65 -150 19 149 188 -145 -160 226 -46 -90 94 72 17 -146 17 40 -317 230 -82 94 -77 -154
6744 -154 63 -16 140 102 -5 -35 13 -160 -210 -170 1 -125 -71 23 85 62 -20 56 -162 -98 -159 -257 299 66 130
6769 130 19 -97 -117 263 -37 10 109 78 145 -15 143 -38 142 300 124 288 21 15 234 -91 -67 -20 60
6792 60 -135 43 -39 128 68 -23 51 -58 -45 54 -68 37 138 73 102 35 -165 39 -13 -86 23 302 162 -4
6816dO7j48K01k1M6o8J23j39J96l02O6l1j99J36m4K16j62Q4j93O1K24ok1j30K90
6841B42k60K18k20p2J41m9l6J49o5L16l51K64k45jm7K3k57J23N6mJ01k37K54j14
6865g1L7P6q8j8k0J83k84J16P2m0pm4K15j5j57o5N5J39k40J84J37l41l7K63K6
6890G6rj53j39L77j48J63O4k17J68l76J00p0MR0K36k17j78J94j22L39k49k7K89
6913A95k2j91J9k9j22Q0j54O7n4J61J88R7k30LQ1M4j79oK85j62R7j75K8j03q3
6938a65J47J10o7N2L4k36n0Q0J1L0Q8j56L7K37k53j50L18J39m14J23K07j73K02
6961A51n5j02o3p7K15j19j12q1J61K1K88j04k39j3R1KJ87j32k37J59p3j2j17J56
6985a05M04m18J23J42k14P3k01J05J74j44l6J44k42O6J55k58K92q5k2K60l70J07
$$ plain form
6816 -4 63 -85 116 95 141 73 196 57 253 -49 17 -14 -213 -77 -121 95 -67 17 -176 -115 109 103 82 -48 242
6841 242 -18 200 -20 -92 49 0 -36 113 48 364 13 277 32 31 -16 7 -250 -127 -71 -75 26 -211 43 -71
6865 -71 -34 42 -46 -64 -84 99 -185 -69 3 -37 -44 -88 127 112 -45 -110 -55 84 -156 28 165 -176 -213 50 76
6890 76 67 -86 -225 152 4 167 231 14 182 -194 -94 -164 -160 -70 166 -51 -229 -35 -157 182 -67 -94 195
6913 195 173 -18 1 -28 -150 -70 -224 -157 -211 -50 138 235 5 8 89 133 -46 -52 233 71 168 -7 21 -82 -165
6938 -165 -18 92 25 77 111 -125 -175 -95 -84 -54 34 -122 -85 152 -101 -251 67 206 -208 -85 122 -51 151
6961 151 96 -6 -69 -146 69 -50 -162 -243 -82 -61 227 123 -116 -129 -38 -36 151 19 -218 -59 -132 -144 -261 -105
6985 -105 299 -119 4 146 -68 5 -196 -91 83 -61 -97 47 -195 -129 26 -232 60 -25 -47 213 -157 -50
7007e0R8Q6L85n31n4K41j52J31q6m2J6k60J54n1j55K28J21j58J02k34K48m03J79
7030a87j0M30nk80rR3m1l6j7N9K24q1r6l28K79J6L4J42M2l29J01M7j97J77k6k67
7056b65K52KM7j63L33l81L21j47K07j86k04M11l35K86k40J88j9j4j66R8j61K93
7078A57q1k5L6J22n4j34j79J61K8J42l88L44k64K30j31L4M9M9j61j29M72k69K53
7101B62m26L19o5m45K73M4K62l50O3mJ84J08m38L48r9J6n4j63J47J59j20L5j88
7124a32J02j42J47O7ok35J68j03P8j00L44l90K10J2J33k01m0J65m5l2J3J99m48
7147b36L38q8j04J1J2p3J46k20L42l44K12r4l0N4J7J69k92K43J4j64J44k52k4
7170b19j21K67J5q3L07l24K84l25K42Q2n9j53j9K45l54J40kJ60j35p9J80n8J28
$$ plain form
7007 -50 48 134 519 -12 -66 175 23 154 68 26 42 -218 -64 -115 -270 -42 79 -79 23 -211 37 -366 -187
7030 -187 -197 233 228 -52 -61 32 -9 -45 -62 -3 221 140 44 -284 -5 11 45 187 229 -100 1 48 -149 28 2 -265
7056 -265 -13 -11 36 -127 206 -175 146 -1 206 20 -184 227 -108 178 -62 126 107 93 -73 25 -136 157
7078 157 76 51 87 209 155 21 -158 3 31 173 -215 129 -135 95 -36 -2 47 96 -65 -194 278 9 262
7101 262 -164 155 90 -355 -82 -38 224 -126 -63 -67 117 225 -213 135 36 52 -2 -165 -18 141 21 56 -132
7124 -132 -30 -172 -25 42 36 -199 -31 -134 -56 -156 188 -202 8 20 153 -48 -88 77 32 0 13 212 -236
7147 -236 102 14 -90 -79 -67 -140 6 -214 128 -216 -4 -98 -128 -74 -57 112 -180 63 77 -87 57 -195 -219
7170 -219 -340 -73 -58 -141 166 -158 126 -199 43 125 66 -87 -106 139 -215 -75 -77 83 -52 -131 49 -9 119
7193A19j62J1j1j5K07j15j68K78j17J30k07J1J10P0j84M10p8n21p2K98K47j29
7215A12n30J74K23JQ4l23K13l47M17j48J28j5J93pJ02o33K69J66j82K49j40j8
7237a2m4O6J17j3j21q0j4K23k5o3k09K37J9k55J58k32M08l76M69j94l6m3L44k84
7261D0j26r8J53n7J86J28m19J22j28M23j51o9r9J42l18K62J28q5j31o3L9n7r2
7284b70N96k93O5j06M7j16m7J47kP4P3O5o46N78k63j36L70l7k74L96O2k92j34
7307a43J86j8QP6j02J57j35O9L8J8o6O0j05J11j08J60l51J98n0j64K32op3O3L39
7332C94m93Q5j34R9J49k69M41m02K7J60l94K97J89l54K21O3j97J58j5j13K15k30
7354a03K80k07J45r9J15j10l18M47L6m36L18K23l45j10M74n8l00O4m8j22K51j66
$$ plain form
7193 119 -43 -32 -43 -58 149 34 -134 144 27 157 -50 -39 71 141 -43 367 289 -232 -304 -6 241 112
7215 112 -418 -244 -21 -20 64 -259 -46 -393 24 -124 4 -11 182 175 277 -356 -87 79 -103 146 6 -12
7237 -12 -56 10 127 114 -7 -87 -101 122 97 34 -175 62 81 -174 -16 -248 160 -216 253 59 23 -20 324 40
7261 40 -86 -184 -31 -88 98 226 -193 -71 -199 224 73 4 -95 47 -271 -9 119 34 -97 -160 -121 -178 -270
7284 -270 326 33 98 -8 39 -77 -124 23 21 95 168 233 -413 165 -98 -234 136 99 -175 221 283 -9 -143
7307 -143 43 25 33 109 7 164 29 98 136 154 88 148 43 154 46 206 -145 53 3 -161 71 65 -8 55 394
7332 394 -99 -14 -148 -49 100 -169 272 -130 -103 57 -337 -40 149 -205 16 79 -118 40 25 -88 127 -103
7354 -103 177 -30 115 16 131 21 -297 150 186 -250 68 291 -54 -164 310 252 -48 16 -32 -154 97 -69
7376f9l6J76k26L19k88J86Q3r8q8m3J32J73n29M04j02r9L41j72J7j59J43l7J62
7399A90l22L0k7N47k78O5l60J11J39K5k70J80Q6j28J30k96j95L01R0k2n1j9N3
7422b1pQ2O9k23J46k1j76j95K47K05j17J34j15nq6j18J66K40L7m7j14O1k51J36
7446B7p5m4J63r8N5K55j08k99j0J66O3m5j48L09k31o8J78n9l1K20k77M9L13j31
7470A74k37OKK10k11M9k02L61r7j71J82j42J7J36k62k29O39n02K60J69Kq8j53
7493h7j18K77j51k7j33K01R8k3l6Qj98j45O14j19k64n4K84L8r4n5j64k6J00K6
7517d8M7K32k69J45q2J26m4j00J19j56K31l51N5q9J79N6k56n9M0J97l5J59l13
7540b16K33J99K0m12J02M1JK58k90k38L12p1J09l0j74L30j12r0J25j07l23M56
$$ plain form
7376 -69 -105 71 -155 164 -124 62 145 47 -41 -84 48 221 -308 96 -6 -105 236 64 81 -78 65 28 190
7399 190 -132 -102 -129 418 140 205 -155 -44 95 120 -150 30 116 -12 118 -178 -373 -72 18 -4 -55 -74 -21
7422 -21 -28 54 123 -100 46 25 -151 -346 -99 106 -11 123 8 3 -83 -201 -35 205 242 195 81 142 -109 27
7446 27 -48 -92 71 -27 28 283 175 -124 -134 32 95 50 -98 211 -20 -88 90 31 0 220 -57 -8 305 174
7470 174 -63 -57 -55 155 -56 -7 -209 152 55 -116 66 -76 -59 77 -185 -414 225 -277 -17 152 154 66 -87
7493 -87 -205 72 -79 -106 -239 -38 60 37 1 9 -189 -334 280 161 -103 -157 127 165 71 16 -148 -174 -74 -48
7517 -48 -1 231 -38 107 25 151 107 7 126 -30 201 -150 -95 -184 -5 51 -205 -264 -224 -27 -62 97 -216
7540 -216 17 216 236 -176 -74 -33 -32 226 -64 -302 10 -61 48 18 -156 174 62 -28 97 -10 -333 123
7562A23k32M78n50L34j91k4k83L96k26K02j13N0J35l2l9m7N0l63O84n12K5J48
7584A3l35L64j17j0Q0p1K79n6M3j79J17k02j54N2J85r0j5M01l05K2N2m8n8K3J6
7609GJ21n7j37M8J19k28J63j09J16j07J26kN9k33J94j23O8J57k17J46q1Nk96K32
7633b9j42K23PPj06k4J8L1J57l38K9K27j56n3J52J77l02J5k34M07M2l20K77l9
7657B6k07K19k64J58J55k57L4P7L16j28J28k98R7j95L33j04J38k53j56L29K8j96
7679b0k33K24j11K1K60m32L62m0q0N3J60k13Q3J13j55K5j65M4l5j57K11K44k33
7702g4O2P8P0k67K22j8pk42L36m6m4k08K12k6k26N85l79j27j24K93j0r3J94l49
7726a88J32rN17m06n6J49k90M14m47L68l04L12k16K57m63L27m3k1K09j74K6J16
$$ plain form
7562 123 -109 369 -181 153 -38 -62 -345 51 -175 27 -86 -36 99 67 28 -19 31 -332 352 -160 -135 13
7584 13 -322 42 -75 -85 -5 -76 203 147 190 11 128 -74 -228 -176 9 -81 -96 305 0 22 74 26 -32 -9 7
7609 7 128 71 -66 -18 101 -127 36 -73 43 -64 62 60 119 -114 80 -43 25 182 -35 111 30 35 -261 -29
7633 -29 -171 52 59 66 -40 -64 -46 -15 142 -196 -167 60 -96 -149 3 180 -122 -107 -341 66 108 -212 65 26
7657 26 -181 38 -226 -68 87 -170 -136 -59 257 129 257 -41 56 -139 194 90 228 -25 -181 148 176 -20
7679 -20 -253 -29 -140 -119 141 -291 71 31 -49 4 164 -49 34 147 -8 17 -148 -104 -139 -296 -85 159 -74
7702 -74 -12 66 136 -131 91 73 66 -176 160 114 70 -138 74 48 -178 407 28 -99 -223 70 60 -33 161 -188
7726 -188 -56 -65 452 46 -10 139 -151 263 -184 184 -120 192 -24 233 -230 97 54 33 242 68 94 210
7748B10Q3p1o09L40L1l03L48N8J52k69J78l12kJ89J7P0j06Q0Q2j15l07ON33n17
7772b34L72n3j38J11j20oJ52m5M9Q5k44K74J97l45k7j24j27J33L28k66K65N3m65
7795a75J23M5kN9j13J4q1L01j42r1J94l45K66l7K55k20r3R1J76j70j09J27k88
7818b15L10J07k42J5J37q4K1r3o8M8o0M3M4RL1k56M35k6k91J0K51j57p1j03K84
7843G9J00L2m55J84J58n4j14J78K9n4K67l41J19o2M2m5Q3k22J75q3m9Q7R0l64
7867b20L37p0J46l51P8J39m5n0J73q8K32m97P5l1K52k1rp3J56j21j09J37O4k4
7891H0k10K54l49J75K56j85J9J51l77K26J28j18j60L36m10L8j87L27j20L71l35
7912i0K69j56n4Q5M0No6K18n04L35m9j22L40l46P1k6P8J4M1o1J11M7k33K80j78
$$ plain form
7748 210 293 222 -387 -47 -16 -319 29 87 239 -30 148 -164 -166 23 40 110 4 84 166 51 -256 -250 283 -234
7772 -234 138 85 -53 58 -62 -68 84 39 88 173 -71 203 400 55 28 -96 -223 -90 238 -28 237 290 -175
7795 -175 -52 -7 -9 50 -63 -49 -130 171 29 -62 132 -213 53 16 271 51 -42 49 225 55 -54 73 -215
7818 -215 95 202 -40 -25 112 28 49 -44 -112 -64 -124 -81 -37 -28 3 -253 182 156 -135 -125 126 -31 -102 -205 79
7843 79 179 211 -244 -60 98 44 -70 108 137 83 350 9 128 66 108 63 146 -76 99 16 -33 54 144 -220
7867 -220 117 47 193 -158 -80 59 14 -36 137 49 281 -216 -141 -172 80 59 50 -23 133 12 -97 40 104 80
7891 80 -130 124 -225 -50 206 21 40 191 -186 40 168 50 -110 226 -184 -146 -333 -6 -126 245 -90
7912 -90 179 23 -31 54 94 99 33 251 -253 82 33 -89 251 -95 -24 -50 28 42 83 22 133 180 -53 227 49
7937D9j94Q9J02n0N2R9l2n5k64K67j65M28n8j15q1qnl04J09K64m35L62o8J7Q2
7962H6j76Q0o5p3Q1P9j8P6j4m9J0o7J21R4j11m0m18L33p5K73m6j07J44M7l31k9
7988a95K02J54Jr3j1j11j36M09k68j28J10K88j20N2j19K24k10o2k72K79n6J17
8010E5N5m1q3J30m9mP8k73L54k82P9j39MK09Q1j52j49l2K44N0j2k13j6Nq1K46
8036F4k3q4J71J05l99K41j48PO5K07k09J61j19J1L5K2k03JL1k0j89K00n7N2K93
8061B15j00k58K7QJ74j36J5k35M88l78J48k63L67O2k78R2L2L0Q8k84J55K39k77
8084f9Q2n0K25l7k7k81J44R3o5Pk19J89J1qj43n5N01j47l60o9K73J57j89K6J63
8109A52k47L53o04J79L32k4k27j0J01J03k87J57J10j43o1L89p8k6j74L15k26k64
$$ plain form
7937 49 -145 -56 46 -4 48 147 115 60 -204 63 -102 326 268 153 72 64 59 -245 -136 128 -307 55 -13 4 86
7962 86 -90 -10 -75 -148 -67 12 -6 70 56 7 17 -50 71 165 54 14 -404 -71 -146 127 81 -26 118 165 -166 -195
7988 -195 7 161 162 69 58 -53 -189 220 -48 -176 -66 222 102 154 35 259 49 -13 -285 -6 -62 55
8010 55 110 69 -14 116 67 63 141 -132 222 -60 19 -120 -116 93 174 22 -127 -159 85 135 123 -90 -106 -101 -182 64
8036 64 41 -43 128 233 -166 75 -73 -66 -1 206 -3 158 39 50 85 107 -96 -95 -64 -84 -273 -73 -130 -78 215
8061 215 115 -143 -116 -108 66 -70 -55 -290 198 -180 -32 -295 72 134 -144 -52 -20 10 98 -186 -31 208 -69
8084 -69 13 -37 188 151 124 -157 -13 80 15 22 -197 -8 3 -5 -148 -203 298 151 -209 -278 -5 152 -37 -11 152
8109 152 -95 258 -346 -167 165 141 -86 -96 5 108 -179 -22 88 -55 -116 273 195 169 -5 310 84 -180
8131a80P9Q9M2Lj69PR2l9K72k09p8K54j54lN4N8j49j49J44N6j07M6Lk85K07L87
8157B71k16j60qP1j56L94m83K20K35l24J99N9m04N04l00l18L95j6N1p1Q0J0kJ52
8181A83l04k9J39j92L26M3l17K03k08O5
$$ plain form
8131 -180 -101 -12 30 33 -136 -129 -37 -76 196 -13 -91 163 9 6 60 118 -31 -180 -36 20 -87 -41 -38 -323 -116 271
8157 271 55 -105 -113 -42 -198 196 -287 -67 168 -156 43 102 -302 202 -98 -416 -21 -37 14 -57 23 33 31 183
8181 183 -121 -150 -11 -203 123 166 -151 52 -156 -91
8191i1
$$ Imaginary data points
##PAGE= N=2
##DATA TABLE= (X++(I..I)), XYDATA
0@%%%%%%%%%%Qj6J6j6K4l2M0m8N6p2Q7j02J19j36J60j92K24k56K95l42L90m45
32b38N08n74O48p32Q23r22J032j154J287j431J589j763J952k155K378k624K893
49A517l188L512l869M265m705N193n743O365p074P896q856R996j1378J3093j5289
64h265J8216k2334K8601l9408O3141k10256J60529L76123k77998k41437m5646
75a98734J56902J67564N1273k17150j48397J15208J75776p488p8802r2877k821
86g9546P7466O3399k36n6515j02051J6221J35484N6930j21300r1210O3096P9363
98D1101R969k4600p3695j7362R0313N0902o7400o3013L6891N3107j3607j4412
110H194j7906k5780M4216M9744n1427o6981M2414P4989l3433n4738K6910R878
$$ plain form
0 0 0 0 0 0 0 0 0 0 0 0 8 -8 8 -8 16 -16 24 -24 32 -40 47 -55 64 -72 88 -104 120 -136 159 -183 207 -238
32 -238 270 -304 344 -388 435 -487 545 -609 678 -753 836 -927 1025 -1130 1248 -1376 1517
49 1517 -1671 1841 -2028 2237 -2468 2725 -3018 3347 -3727 4169 -4687 5309 -6069 7024 -8265
64 -8265 9951 -12383 16218 -23190 39951 -170305 -9776 366347 88349 -153088 -198734
75 -198734 -41832 125732 177005 -40145 -188542 -73334 102442 94954 16152 -76725 -79546
86 -79546 -2080 61319 61083 4568 -97483 -81262 54222 111152 -10148 -101358 -38262 41101
98 41101 51070 26470 -47225 -64587 25726 76628 9228 -53785 -16894 36213 22606 8194
110 8194 -9712 -35492 8724 58468 7041 -59940 -17526 57463 24030 -30708 -3798 6080
122F080j2761L3505N262n1498j1051N4173J4223m2626J674J3991k9841Q471M2897
135C2499l738m5026k7616L6968N0282j6347n3189j0601M1769J7207j4450K770
147A0528k5376k3176N8361K4442o1103j1677L9797j1440k0049L6760J7n3788J9362
160a7342L8837k8193k529J7802k5619l311L3391k69k5377L760J2012r459Q778
173B481R056k1312J089J1454q247M317L608q962P92L272p59n53O580P1j6148P894
189e367J8729j1128q658Q950M489q786k226J6992n132j9504J5149M484j5833J3704
203E863Q330k3872n860K9219L364k8594O140J5340j2464P223Q322j7117L539J1281
217A0714q316m747J0811N39j5873L438J1761q373K552J494j6278R037J6828j2347
$$ plain form
122 6080 -6681 26824 32086 -19412 -30463 23710 37933 -4693 -3019 10972 -18869 -10398 32499
135 32499 28761 -16265 -43881 -6913 43369 27022 -26167 -36768 5001 22208 7758 10528
147 10528 -14848 -38024 20337 44779 -16324 -28001 11796 356 -19693 17067 17084 -36704 -17342
160 -17342 21495 -6698 -9227 8575 -17044 -20355 13036 12767 -12610 -8850 3162 -6297 2481
173 2481 11537 -9775 -8686 2768 -5479 -1162 2446 -6516 -5724 -2452 -3211 -3764 2816 2887 -13261 -5367
189 -5367 13362 2234 -6424 2526 7015 -1771 -3997 12995 7863 -11641 3508 7992 -7841 5863
203 5863 14193 -9679 -15539 13680 17044 -11550 -5410 9930 -2534 4689 13011 -4106 -567 10714
217 10714 2398 -2349 8462 9001 -6872 -3434 8327 -46 2506 4000 -12278 -3241 13587 1240
231A240j1164R773O438j0783M451J2268j7208l515J9291r887q563J4598l465j4805
245a1331P164J2995j2496o325J5726j1058r699K2283j669j7380O816O073l033
258a934K985L235r539l031J4832l564j1094J0931r00j0588O365M076k459j625
272b310j438j986P65J1399j637j5669P262J1181o295j911M415k489n063N022P276
287H522r826l63P991j1765J392J5367r003j1512Q612N727o943K085P626j1136
301c226k397J5736o236n362R078p121n469J1671J990j0104k437P592k863l139
315b287Q209o500o584R518p51m219M998N87o324o69R983J97j1297M988L842p011
331c320N200K652q433n90P233k176p662P274L937j2963M302J0409j0058J07P386
$$ plain form
231 1240 -9924 -151 6287 -4496 -45 12223 -4985 -8500 10791 904 -7659 6939 3474 -11331
245 -11331 -4167 8828 -3668 -9993 5733 -5325 -15024 7259 5590 -11790 -4974 1099 -1934
258 -1934 1051 4286 -5253 -8284 6548 2984 -8110 2821 1921 -8667 -2302 1774 -685 -2310
272 -2310 -3748 -5734 -4969 6430 4793 -10876 -3614 7567 1272 -639 3776 1287 -3776 1246 8522
287 8522 -1304 -1667 6324 -5441 -4049 11318 2315 -9197 -585 5142 -1801 284 7910 -3226
301 -3226 -5623 10113 3877 -1485 7593 472 -4997 6674 8664 -1440 -3877 3715 852 -2287
315 -2287 5922 -578 -7162 2356 1605 -2614 2384 2971 -3353 -4022 5961 6158 -5139 -151 3691 -3320
331 -3320 1880 4532 -3901 -4491 2742 566 -7096 178 4115 -8848 -4546 5863 -4195 -4088 3298
346C298o238j499Q028j334p245M640N148r554K204Q980r816k153P706l545j938
361c318L905j530l925L405N513o228j659Q194m051l638O940l03m575OM143p30
377B149l673M355k377n849R486P56j0944L667O431l318k277M184j479m940P963
392D134K134j0195N681L798q355M624N004p079l276N993J184n838L139J232q250
407f070O025O358q485n33M761k637m63M219N2p087J636P589m476k798M099m384
423b194k72N029k058m049J412L243l878j096O729l425m156N608r84j864M329q59
439A515m559J183M939j544m390L608r77m194M918J305l691l2j35N05R93J622m2
456A024m817J939M493j887K02O40l516L51M562K261o092l100N587k612O45O156
$$ plain form
346 3298 -2940 -4439 3589 2255 -4990 -350 4798 -4756 -2552 6428 -3388 -5541 2165 -1380 -3318
361 -3318 587 -943 -4868 -1463 4050 -2178 -3837 4357 306 -3332 3608 3305 -1270 -1264 2879 2149
377 2149 -1524 2831 454 -5395 4091 4847 -6097 -2430 4001 683 -1594 2590 1111 -3829 4134
392 4134 6268 -3927 1754 5552 -2803 1821 6825 -254 -3530 2463 3647 -2191 948 2180 -6070
407 -6070 -45 6313 -2172 -2705 2056 -581 -1044 3175 3227 -3860 -2224 5365 889 -1909 2190 -2194
423 -2194 -2466 2563 505 -3544 -2132 1111 -2767 -3863 2866 -559 -4715 893 -91 -1955 2374 1515
439 1515 -3044 -1861 3078 1534 -2856 752 -225 -4419 499 1804 -1887 -1919 -2054 -1549 -556 1066 1024
456 1024 -3793 -1854 2639 752 954 1594 -1922 -1571 2991 5252 -840 -3940 1647 -965 -320 5836
472E836p799m905R111J808n503J396K690n308J236Q221n544l756P015n200k277
487b979J0237l382q879M247L743m080J144M124p884k117J0996k748o621N493j013
502B81l055M990J476m065q82K700j589j80M545l479n024M737k97j783L106j380
518A01m384J060N720p3n603O28K932n92J841k99k949L14J074J486q26j447J505
535D88j851p28K820k33j357j031q42J883J871J221l906k822N917K541n000P65
551b64J389k640J438L345k225l714L444J058m378L422J501o049L265K273l575
566a710K995K339o304r09Q351p70p359M686K124o956N274L673q210M35N774l250
582A83k119L689j177l850L999J221m296L532J154o085L552L928l602q72J545o53
$$ plain form
472 5836 -1963 -6868 2243 4051 -1452 -56 2634 -2674 -1438 6783 1239 -2517 4498 -702 -2979
487 -2979 7258 3876 -5003 -756 2987 -1093 51 4175 -3709 -5826 5170 2422 -4199 1294 281
502 281 -2774 2216 3692 -373 -1255 1445 -144 -324 4221 742 -4282 455 158 -1625 1481 101
518 101 -4283 -3223 2497 2424 -3179 -2551 381 -211 1630 1331 -1618 -1304 -230 1256 430 -1017 488
535 488 -1363 -2091 729 496 -861 -1892 -2734 -851 1020 2241 -1665 -4487 1430 3971 -1029 -264
551 -264 1125 -1515 -77 3268 1043 -2671 773 1831 -2547 875 2376 -3673 -408 1865 -1710
566 -1710 1285 3624 -2680 -3589 4762 3992 -3367 1319 3443 -3513 1761 5434 -2776 -2341 3433 183
582 183 -1936 1753 576 -3274 725 1946 -2350 1182 2336 -3749 -197 3731 129 -743 802 149
598A49q26K335J03l985J298K032j816P15k24j663J359K74k87L59k32M58o82J17
616e16J850q60j291P47M84N20j926P96R30k688J509J996l138N2J925q22j156J801
634B13R21k409P11K205k725O31K688k847j98K558j060j842J712O15k854Q37L077
651B233l455l78L901l081q02L756j448k253K552J080l116R29K954l405l94L827
667B900k853k117M130j423k578K094O56j569K71J956k424p95L837j489j234K158
683A520j585n39J962l42o54o15K57k13o5J349j205j570J124P94j51N1q84r1J32
702g25Q26J726k398o79K153o79j23O22m88j613R12J927j732j083J977j607n22
719a506K776j153j677J147P40p21N23P33j371n73K742p55j837J935o95j020J276
$$ plain form
598 149 -677 1658 1761 -2224 -926 1106 -710 5 -219 -1882 -523 -249 -536 -177 -409 49 -633 -516
616 -516 1334 474 -817 -70 414 934 -992 -196 734 -1954 -445 1551 -1587 -1535 390 -432 -1588 213
634 213 1134 -1275 -564 1641 -1084 -453 2235 -612 -810 1748 688 -1154 558 1173 -1681 -844 2233
651 2233 -1222 -1600 2301 -780 -1582 2174 726 -1527 1025 2105 -1011 -82 2872 -533 -927 2900
667 2900 47 -2070 2060 637 -1941 153 809 -760 -489 1467 -957 -1752 2085 596 -638 1520
683 1520 -65 -604 1358 1016 362 -253 4 -209 -274 1075 -130 -1700 -576 218 67 118 -766 -857 -725
702 -725 101 1827 -571 -1250 903 224 101 723 235 -1378 -466 1461 -271 -1354 623 -984 -1506
719 -1506 1270 117 -1560 -413 327 -394 129 862 -509 -1082 1660 905 -932 1003 308 -712 564
736E64K20j427k51J100m99r85K303m81k402J937J164j628Q51P63j425j66J288
753I26P33k219R44O82k128J272J239k051k59J076m26r5P69K08j709N34J617j421
771c08L63R07j572O69J019n21r91M54N01m90k13Q18j310o80J633n16j48K19l43
790e09j5j01J644p51j199J457M31j531R92L28j453L44P24m90p67J181k23j498
808a436J397L95j299Q44O54j423N85R17n63o01Q55M48j128P15M02j395N87O80
826F34j162K29K78j0n40K67R79r72m65J415n46m64R28k81m54L69N56k80q93J234
846H22n75j119J546n32j150R53P6m12%J257j247m23J391l90q10J318j63r63J055
865F34ro63o3J94N2m31M71P4j203Q74K14j058O66M62k89j17K29N49p60k9J010
$$ plain form
736 564 784 -643 -894 206 -293 -1278 1025 544 -1858 79 1243 -385 466 1229 -196 -362 926
753 926 1659 -560 384 1066 -1062 210 1449 -602 -861 215 -211 -306 463 671 -1038 -504 1113 -308
771 -308 55 962 -610 59 1078 557 -434 20 521 31 -182 636 -674 -1354 279 -237 -385 -166 -509
790 -509 -524 -625 1019 268 -931 526 957 -574 418 746 -707 -363 361 -129 -896 285 62 -1436
808 -1436 -39 356 -943 -99 555 -868 -283 634 71 -530 325 773 -355 360 762 -633 -46 634
826 634 -528 -299 -21 -31 -571 -304 675 -297 -762 653 107 -357 571 290 -164 205 761 481 -412 822
846 822 247 -872 674 142 -1008 -55 21 -391 -391 866 -381 -804 587 197 -613 705 542 -421 634
865 634 625 -38 -101 93 145 -286 185 259 -944 -70 144 -914 -248 214 -75 -192 37 586 -174 -203 807
886H07j032M5Q82p80j41L09r2l98K0P69o89n11J266j019j68J409n79n55Q78P2
906D93o03J18N27m96m57J344p40r87J325l95r61Q70l5l07l7N43M8o84P03J08q00
927d23J001K41q78M03n5j44Q6L55jr47L36M17r85M72K91o38L01K33O7l84N01j33
949A16m28L14P99p62j91N11n77J13K56J39k32j96J44j73m54Q97m08m08N20Q8j33
970f5j32K71J49q32J000J82j169P66L03q02K95K78m35l35O58j22q74Q40K10j399
990a213J223P16j457N11N73p84K82J088o55r09O38O65j238R95J49j393L69J108
1008F68j065n8O36l12l1O76k67n31K86L42n82M33M59p71k84P57J27m21R5j97o27
1029f67M21N85l55k88K84m04L69L93o64N16l27N26j36l3j83J48l13R9K33K47n65
$$ plain form
886 807 -225 -180 702 -78 -219 90 -2 -400 -380 389 -300 -811 455 -564 -732 677 98 -457 421 493
906 493 -110 8 535 39 -418 926 186 -801 524 129 -832 38 3 -304 -341 202 250 -434 269 377 -423
927 -423 578 819 -59 344 289 145 231 586 585 -362 -26 391 -594 -122 169 -469 -168 65 132 -252 249 116
949 116 -312 2 801 39 -152 359 -218 -105 151 290 58 -138 6 -167 -621 276 -132 -540 -20 68 -65
970 -65 -197 74 223 -609 391 573 -596 170 473 -329 -34 244 -191 -526 132 10 -864 -24 186 -1213
990 -1213 10 726 -731 -220 353 -431 -149 939 284 -625 13 678 -560 435 584 -809 -440 668
1008 668 -397 -455 181 -131 -162 514 247 -284 2 344 -238 195 654 -117 -401 356 483 62 157 -40 -667
1029 -667 -246 339 -16 -304 -20 -424 -55 338 -326 190 -137 389 253 220 37 185 -128 -29 204 451 -114
1050a14k89O79o59M2P17r50k61J196k83n49K21O15o74J87R57j018j33M45m32J01
1070b02Q22o12q90Q95M24q51K62N58j509L13J634q18r09J305l58m45J141j55j325
1089g20K99P57k5n78Q03q13j60Q47j91m84J84p3l72J044k38n30K14M00l88K12
1109A88M52r10J10K85k53J49K15l58r5K26K00K6m09k5j76M54o5l4K20j82l56O51
1131C13R1l55K34p9n83M66M08m02o36L67M20o79O38j79j033J198km93L01N0m72
1152d27L93N03l08q18O29J82q79J165j40j323Q38O04n15l10K30j05k34J034J3
1171E32j167O61L84n23L33L08o59K63R8j54j50M48l05n76N98O5m89M8K32l38M97
1192A06j4P6j29j34L38j08L16j30n89N13k12J8J86l17j62J96m3O1J18n85L69K10
$$ plain form
1050 -114 -403 276 -383 -341 376 -574 -835 361 78 -471 -250 365 -309 -122 835 -183 -316 129 -303 -202
1070 -202 620 8 -882 13 437 -414 -152 406 -1103 -790 844 26 -883 422 64 -381 760 605 -720
1089 -720 -421 336 311 -267 536 -277 -437 410 219 -265 -81 -154 -526 518 280 -250 -36 364 -24 188
1109 188 640 -270 -160 125 -128 21 236 -122 -217 9 209 235 -174 -199 -375 79 14 -20 200 18 -338 313
1131 313 404 49 283 204 -379 87 495 93 -543 -176 244 -435 203 24 -1009 189 187 -306 -5 45 -427
1152 -427 -34 469 161 -657 -28 154 -725 440 300 -1023 -185 419 -96 -406 -176 -281 -515 519 532
1171 532 -635 26 410 -113 220 528 -131 132 230 76 -74 374 69 -507 91 156 -333 -285 -53 -391 106
1192 106 92 168 39 -95 243 135 451 321 -268 245 33 51 237 -80 -242 -46 -89 -28 90 -495 -126 84
1214H4o3o9N3J94l18K39M64o70J53K69k74L3o7j38L7J5J40j43n2K90o51L45M28
1237B99m67K33J97o38N42M66n40l9J5J02m89L40K10n78oM46m49L91J8j98n8j63
1259c66L77R2n86N37J23m2L68l40k65L10k63Q9q0K10j68l74O24l42j51M63m44
1280b28J45M43l45Q9j18j64L30k70N50l37k45M03k14J95o0k52jj36q8K56R6k74
1302b25L80j12J17j35J8J91k23j32K12J88l87K07pN8mk54L51m71j41K70J3j1k6
1325a23J67k53J30J51J20l22J70K15j71Q6q8p7L6K02l22k67L82M1j62q7J95L8
1347F1l33M40L4j83J30j96j86L36R2j13J02k07J9j37M26l91OJJ61l61K71J5k1
1370c4k14L85N0j38Q2j89K42k97L15k13Q1J56j48P3l0k45M29l72j85K46l22J88
$$ plain form
1214 84 21 -48 5 199 -119 120 584 -86 67 336 62 95 28 -110 -73 -58 82 -61 -113 177 -474 -129 299
1237 299 -168 65 262 -376 166 632 92 53 68 170 -319 21 231 -347 -353 93 -356 35 53 -145 -203 -366
1259 -366 11 103 -483 54 177 135 503 163 -102 208 -55 34 -46 164 -4 -378 246 -96 -247 216 -228
1280 -228 -83 360 15 104 -14 -178 152 -118 432 95 -150 253 39 234 174 -78 -79 -215 -303 -47 49 -225
1302 -225 155 43 160 25 43 234 11 -121 91 279 -108 99 92 150 146 -108 243 -228 -369 -99 -86 -97 -123
1325 -123 44 -209 -79 72 192 -130 40 255 84 170 82 5 41 243 -79 -346 36 77 -85 -172 23 61
1347 61 -272 168 202 19 149 -47 -233 103 195 82 184 -23 -4 -141 285 -106 -100 -99 62 -299 -28 -13 -34
1370 -34 -248 137 187 49 131 -58 184 -113 202 -11 70 226 78 151 121 -124 305 -67 -252 -6 -328 -140
1392a40N0OQ5N7m7R6M0O9j73P9l8qN4k77NK16k82k27M39J4p0J23k10L14n12L11
1418b6K83j25K71m29Q8R9k39o0J87J44M1m53r2R3k8K47J10l31k2K56KM7k26K96
1442A33k00K27K5P1k13N3j69l4L11r5k30j62K51j10K01j2k17K10j34K24j77K20
1464A73k90M9J69j6J87j98p2r9r1K13J4m0l36L76J31l53J14K43l83J84J34o0P6
1487A25k14J53k29kM58l65k7p3K1P2K33k56k01O49j95o9j43k25NL24L14k11k73
1510a29K49k28J08K81j84R8J34l99R3lQ8l13L02K34l62j96Q7J47R1M4n8mj15O2
1534B7K51p5k48Q4k24r5J12J24J10k20L2K79n03M40j80j9R7L25j73J9l22J33j66
1557a92O99l23k70L40k98L4q7R9j51L6J90q7k16L98j58j14J39K9o5O3j49q8L62
$$ plain form
1392 -140 -90 -84 1 58 11 107 147 216 43 122 84 76 130 -147 -142 74 -208 -435 4 18 -52 71 -139 175 -337 -26
1418 -26 257 132 403 -26 62 161 -78 -138 49 193 234 -219 -311 -218 -246 1 111 -220 -242 14 16 63 -163 133
1442 133 -67 160 185 256 43 96 -73 -107 204 109 -121 -283 -32 -142 59 47 -170 40 -94 130 -47 173
1464 173 -117 -68 101 85 272 74 2 -97 -188 25 39 -1 -337 39 170 -183 -69 174 -209 -25 109 49 125
1487 125 -89 64 -165 -167 291 -74 -101 -174 -153 -81 152 -104 -305 344 149 80 -63 -288 -283 41 355 144 -129
1510 -129 120 -108 0 281 97 195 329 -70 23 20 108 -205 97 331 -31 -227 -140 7 98 142 84 80 -35 27
1534 27 278 203 -45 39 -185 -280 -168 -44 66 -154 -122 157 -346 94 -86 -105 -8 317 144 163 -159 -26 -192
1557 -192 507 184 -86 254 -44 -10 -97 2 -149 -113 77 -10 -226 172 14 -100 39 68 3 66 -83 -171 191
1580A91o0k13m9K57j62J25K38j71n23K52J23J09j39J35j18J86k07j14M8Q9r0O4
1602b9J90k34J21M12n70j55L43k92j08J50L45L5K3L1k07MK3J99l81K48j01m0R1
1625I8k29K88j10J41m71L07j67k16K57L7J73n8m2l5J21J82k90j83Q3J42k03J54
1647b1j21p5M42m65K00K5m2K8J8OKP0k47K76l06J89P0p8R3K58l70J66M8m17J71
1672h0Q2k43L66k68J78k22J57K29j54l15Q7J1K56k0P1k33K8L71l73P4J10p6k63
1695b27K70Q4q7k40J64j61K08lk93M10qj72j16K63j55J41j52K7J61N0k88P3K4
1718b7n0MJ67J31l37J11O4n23N24m4q0O6j14K8L38j94J17m01J90P5j37J16j63
1741a39J3O5j15n2J60J21j61j10J98l18L69J19j75O0O5m18M54k0p1l54N62j86
$$ plain form
1580 191 131 -82 -131 126 -36 89 327 156 -367 -115 8 117 -22 113 -5 181 -26 -140 -92 -3 -93 -29
1602 -29 161 -73 48 460 -110 -265 78 -214 -322 -172 173 208 231 262 55 59 82 281 -100 148 47 7 98
1625 98 -131 157 47 188 -283 24 -143 -359 -102 -65 108 50 8 -27 94 276 -14 -197 -114 28 -175 -21
1647 -21 -142 -217 225 -240 -40 -15 -57 -29 -11 -5 -3 67 -180 96 -210 -21 49 -29 64 322 -48 118 166 -251 -80
1672 -80 2 -241 125 -143 35 -187 -30 199 45 -270 -183 -172 84 64 135 -98 -70 301 -72 2 112 36 -227
1695 -227 43 127 40 -200 -36 -197 11 8 -285 125 117 -55 -171 92 -63 78 -74 -47 114 164 -124 -51 -27
1718 -27 -77 -73 94 225 -112 -1 63 -460 64 20 -60 6 -108 -80 258 64 181 -220 -30 45 -92 24 -139
1741 -139 -126 -61 -176 -228 -68 53 -108 -218 -20 -338 31 150 -25 35 100 -318 136 116 45 -309 253 67
1763F7J87j64k27j86L88q1j61J75R8l03P5L14j36j69J90q7l6P5p8J91k63k8l2
1786a91O4KN9K1rj5M0o3K19r2j65J73k2r2j00L98m73K91j62O1J47k16j5K88P0
1811B18n3j89n7J15K18m10j45M52l14Q6K43l82M35n20L53j53J42o8L26n04J15
1832i2K65l23Q6K28l47K04j8j47K69j56o1P9L7j22pJ41L67o67J81J23jR8J11l92
1856a44K69j42K9L09m67K14%p6l9JJ00K3l29L37k17R7l32N72k71j21J24l1J4N7
1880b3j48L87m07P3K13k69K9K80N5R0l19n3k0J41r6j27J87o9K04o2K4q1L23l55
1904b3P0k22M06j72q8O8L4k83J98K38r2j33j04K23Nkk35L01k33RK85j82J09k95
1928a18J78l28M27o6M1j9k66M04k86R1j02K13j95Q0K79l67J62k45J14L7Nj73J45
$$ plain form
1763 67 254 90 -137 -323 65 -16 -177 -2 96 -207 -132 182 46 -123 67 -20 -56 19 -59 132 -131 -159 -191
1786 -191 -127 -125 -66 -45 -54 -69 -29 -92 127 35 -130 43 21 -71 -171 227 -246 45 -117 -56 91 -125 -140 148 218
1811 218 165 -24 -81 34 252 -158 -303 149 -165 -79 164 -218 217 -303 50 -103 39 -29 297 -207 -92
1832 -92 173 -150 -64 164 -183 21 3 -144 125 -31 -92 -13 24 -98 -105 36 403 -264 -83 40 39 137 248 -144
1856 -144 125 -17 12 321 -146 68 68 -8 -47 -46 54 77 -252 85 -132 -35 -367 205 -66 -187 -63 -94 -80 -23
1880 -23 -171 216 -191 -118 95 -174 -145 135 190 280 -39 -92 -112 29 -67 -194 -7 -76 128 66 90 9 332 -23
1904 -23 47 -175 231 59 -29 39 73 -210 -12 226 134 1 -103 120 125 123 -112 189 -44 -35 250 68 177 -118
1928 -118 60 -268 159 93 134 115 -151 253 -33 58 -44 169 -26 54 333 -34 128 -117 -3 34 39 -134 11
1951A1j59j8J62O1m3m8m9j05K81j49L09k55j51Q3r2K89n7j4j64J01j79k86K59
1974b13k5N3J12MM25k17k09KN2J90j62J56r0j00l54N51j46K02k47l21K75L8J4
1997a0J2J0k41K31O7r4J52m50M80r1L2r4o5k33R1J77Q3j52QJ99j93J6K04k19J61
2022H1l0j21J04L05l19q3o9K10j48M3L3J2l0k26K12J61j40j78K81j15M6l4j57
2045a62P3K5j79K60J81k41j22K81l4k40L82m64M93r7r7k28L8K10j74L0J11J55
2067B01r4p5M6J04k2J7q6j59j08L62j78lk55J83j7j8L4J81r1p8n3K80j58J95k62
2092e4J57n1j60J06j17j16L45m7j49K95m2O2o8l40L62l22L9J79K3p9Q7j45QP8
2116E1J34j93K10k77P3RJ20j78R7o0J51M4N9l88L0K77j94J97k19j91L3L76n1j39
$$ plain form
1951 11 -148 -166 -4 57 14 -34 -83 -188 93 -56 253 -2 -153 -70 -162 127 70 56 -108 -7 -186 -472 -213
1974 -213 -238 -185 -73 -69 356 139 -70 -68 -16 174 12 168 78 -22 -376 175 29 231 -16 -337 -62 -24 -10
1997 -10 2 12 -229 2 69 -25 127 -323 157 66 98 4 -61 -294 -203 -26 57 -95 -87 112 -81 -65 139 -80 81
2022 81 51 -70 34 339 20 -63 -132 78 -70 -27 6 18 -12 -238 -26 135 -5 -183 98 -17 29 -5 -162
2045 -162 -89 -64 -243 17 198 -43 -165 116 82 -158 224 -240 253 156 59 -169 -131 79 -95 -65 46 201
2067 201 107 32 78 182 160 177 91 -68 -176 186 8 5 -250 -67 -84 -102 -68 113 22 -56 -109 171 13 208 -54
2092 -54 103 52 -108 -2 -119 -235 110 63 -86 209 167 229 161 -179 183 -139 -100 79 102 23 110 -35 -27 51
2116 51 185 -8 202 -75 -2 7 127 -51 46 -14 137 181 240 -148 -118 159 -35 162 -57 -248 -215 161 110 -29
2140b9J37j02Qq6J04J70l66K65l1j4J05p9j01l9lJ45n7K3k97K05p6J78j67R2j48
2165a63K49Q7L8J03m17J49j78K06K3J30j42N3k14J32RK23k7k53K3k16R1L0j09
2188a73J67m7k47J93K48m60N05j68L3n8J11P4l24M17j88k5K44m32qj06J18Kj66
2211b90K94k02K92o6o2M09k08J31k85l68J57K28M6O6k48J66l30J84L57j66l58
2232b53K66J52k11K06j61P3K73k60O7m9l47K75l3l9lJ40m7J98k80J14J95m40J32
2255c2K12k46K28j54k6J37j86J97k15J96M0J46j93k0J6n9L2j00K68m49L81j60
2277A3qk5K5J69o3k30K86n1j57J38k02p1J86J87k04L0K79m9n7k78J69k3j70O2
2301d4j20J79O0J4j94J04j81J46j02O2J31j34M06j56J0m30N64j79k1k5k31K40
$$ plain form
2140 -29 108 6 14 -72 32 202 -164 101 70 56 161 82 -19 -58 -61 84 27 50 -247 -42 -118 60 -107 -15 -163
2165 -163 86 173 211 314 -103 46 -132 74 97 227 85 138 -76 56 65 288 261 8 31 -185 -94 -64 -173
2188 -173 -6 -53 -300 -107 141 -319 186 18 51 -7 104 178 -146 271 83 58 302 -130 -138 -244 -126 -124 -290
2211 -290 4 -198 94 28 -34 375 167 298 13 -355 -198 30 76 142 -106 60 -270 -86 271 105 -253
2232 -253 13 165 -46 160 -1 72 345 85 152 103 -244 31 -2 -41 -44 96 49 247 -33 81 276 -164 -32
2255 -32 180 -66 162 8 -18 119 -67 130 -85 111 151 297 104 84 100 41 73 -27 241 -208 173 13
2277 13 5 -20 5 174 111 -119 167 116 -41 97 -105 -176 10 197 -7 23 302 253 196 -82 87 64 -106 -44
2301 -44 -164 15 75 89 -105 -1 -182 -36 -138 -76 55 -79 327 171 181 -249 315 136 115 90 -141 99
2323I9j85j35K60j01QJ30l18P5K29m7j13J52J54j56m2J06j2Q4j86j18K3J7K13
2346A37J96j76j55j16K91J0l09o4J19k88L59Nj80J42o8J98j34o0Jn3K10j5L3n77
2370d94K23J75m8j56J91J91k69M97k46k37M03LK0k92J96j67k64J76O4L1R3k21
2392a31L76j04j95j50K66k8k31L41K5l15K16M9n4O0k7n5j10m0N9L58m8p3j82r1
2416h4q2K78l31L67k14m1L96n38J79M23j80o2K3j90J14n1J77pj82R3k15L73Nj73
2440G8K36l95J54k30L6J84Jk36L06l48R8K14k04K17p3j44J92J15k87m3K16k01
2462a14K76k25Q3J58j56m1P4N6R3j02N1j45j33R2N1J01j57J73j42j50K3L62j48
2485H0j41K15k5l86L19J0j4k55J34J72K71k92P0p7l04J68J60j92Q6L8K64l90K44
$$ plain form
2323 99 -86 -221 39 -62 -54 76 -242 -167 62 15 -98 54 208 52 10 116 104 188 2 -116 -93 -76 137
2346 137 333 157 2 -114 177 187 -122 -186 -67 -355 4 9 -171 -29 -97 101 -33 -93 -92 -145 65 50 83 -494
2370 -494 -271 -96 -144 -300 -109 82 -187 310 64 -173 230 233 253 -39 157 -10 -274 -98 -34 -3 90 -131
2392 -131 245 141 -54 -204 62 34 -197 144 169 -146 70 119 65 125 98 43 -67 -107 -48 310 262 189 7 -84
2416 -84 -166 112 -219 148 -66 -107 289 -249 -70 353 173 111 134 -56 58 7 184 177 -5 88 -127 246 251 78
2440 78 314 -81 73 -157 -121 63 64 -172 134 -214 -116 98 -106 111 38 -106 86 201 -86 -129 87 -114
2462 -114 162 -63 20 178 22 -19 55 111 204 102 153 8 -125 -33 18 119 -38 135 -7 -157 -134 228 80
2485 80 -61 154 129 -257 62 72 58 -197 -63 109 380 88 158 81 -223 -55 105 -87 -1 37 301 -89 155
2508A55l57j17K71J88j12k7J33k97P0K50l29L61k14k14Q0O19p15K69K12l45Q7
2529c2L1j48P7RJ79n6o2K16n91L46O3M9J1l32M39p0j10O3j38K9M2j05J22P6k55
2554a47J54m7JL74o7k33K68k23J47m5j61J42l83O33n80K68m4k12J20J85J9k13
2576d4k05L29r2J10J48L2k90Mj9L7K3j78M53l85J44M1k8o0J73k11K14k45n9K16
2600A08l10K33j24j2K7r3K92j43k78K37j13O4L1j7J96l8j39L19k73O0K68j55J33
2623B73l56l3L36l11qJ56J57j66J83n32M13%r5q2N8J0j26L18k12l8j02J92q2K3
2647b4j3j0q6K06j61m8J45l09J09R2K61j04k65L18j7k05PK64k06P3O2j12l9l5
2671i7N7Pm1j24L36j29O2Oo7K19m58N56m24L1P7K44m49L77j04k83O0K61q5P9k40
$$ plain form
2508 155 -202 -319 -48 140 28 1 134 -163 -93 157 -172 189 -25 -239 -159 460 -255 14 226 -119 -32
2529 -32 -1 -149 -72 -63 116 60 -2 214 -377 -31 32 81 92 -240 199 129 19 82 -56 -27 15 -90 32 108 -147
2554 -147 7 -40 -39 335 268 35 303 80 227 182 21 163 -220 413 -167 101 57 -155 -35 150 169 -44
2576 -44 -249 80 -12 98 246 278 -12 -8 -27 10 33 -145 308 -77 67 108 80 20 193 -18 196 -49 -108 108
2600 108 -202 31 -93 -105 -78 -171 121 -22 -300 -63 -176 -112 -81 -98 98 60 -79 240 -33 27 295 140 273
2623 273 -83 -116 220 -91 -99 57 214 48 231 -301 112 112 17 -65 -7 3 -123 195 -17 -55 -157 35 -47 -24
2647 -24 -37 -47 -133 73 -88 -136 9 -300 -191 -99 162 58 -207 111 94 -111 -104 160 -46 27 89 -23 -62 -97
2671 -97 -40 -33 -74 -198 138 9 71 77 10 229 -229 327 -97 -66 11 255 -194 183 79 -204 -144 117 32 111 -129
2696a29m4K37J34j29O4k50j22K76o2j02K1J12k30J09J5K17k05R6j38MJ60j84M52
2719C02l44J70j05J24q7j0j60K78o4j71k4K65k58Q4n6j80L39O2l59jN25k19O2
2742A73k71N9k67M50n2j06j9K2P7q1J37n3k95K30j8p7M03l98J41m0K14k84J96
2765A41l75L22k29K59n0q3J54N4N0rn10M0L32N3J46m89M67k73Mk29K42J35j54
2788bQ4J10l85L23j70J24j71j22J06Q4lk60M08k75N4J7l6k75L13r9j0J08l8N6
2812e9N5j79K16j10j08L45l87L35o0j05o4O1j66O3K3M23o9j79J29j37o3j39M14
2835B39k14k8O4j91K37j21q2K25k11L5j45K88o8o8p5J5L48m59L11j49K32J3k95
2858i9L74m36P2L75k61L06m28QJ97n7j40L8J66k65K46K4J26j75j58K57k26L75
$$ plain form
2696 -129 -173 64 198 69 133 -117 -239 37 -25 -127 -106 6 -224 -115 -100 117 -88 8 -130 -126 34 -150 302
2719 302 -42 128 23 147 60 50 -110 168 104 -67 -91 174 -84 0 -56 -236 103 165 -194 -195 330 111 173
2742 173 -98 -39 -306 144 92 -14 -33 -11 66 -15 122 69 -226 4 -14 -91 312 -86 55 15 229 -55 141
2765 141 -234 88 -141 118 68 -15 139 193 243 234 -276 -236 96 149 295 -194 273 0 4 -225 17 152 -2
2788 -2 82 192 -193 130 -40 84 -87 -209 -103 -19 -22 -282 126 -149 -95 -78 -114 -389 -76 -175 -185 -77 -115 -59
2812 -59 -4 -183 33 -77 -185 160 -227 108 48 -57 -121 -60 -226 -163 -140 283 214 35 164 27 -36 -175 239
2835 239 25 -3 61 -130 107 -14 -96 129 -82 -47 -192 96 28 -40 -115 -100 248 -211 100 -49 183 196 -99
2858 -99 275 -161 -89 286 25 331 -97 -89 108 51 -89 -51 115 -150 96 120 246 71 -87 170 -56 319
2880C19j75l25K81j3j42J0M6P7l09K15RK4r9J56k82M40r8j9lJ25Pk42J34m58L36
2905A4j87J41l14L60K33j45Ok9n4k01kPP2Q2J09K9j45R1l58N22k01n3K25k40J3
2930b5L2K42m5l57L10q6j25k05J73K41m21L16K10j19k76L3M6J69l57K44J59j07
2952E2j17l2K89j33K08n77J39R9M94l39l2L5p7P0n9%j52K33k42M8L43k38L9K08
2976B59k07j40L8r9K17o2J88m09J64K04k8m8l26K12J71j2K6j44K5J06j37j36J38
2999@k6p2r3J47J78k03p7n3K31j18j3J0J56j76M9N8p6K15o4j17on3J23k18J29
3024f9m4k5mL93m08K17j81j68K10jJ49k9J11p8J80n9k90K16j21J87n29N30l83
3047a96M26k60K56l42J79K10k30p5O7p7J22mj09l7Q7j46n9O03m49O8k6Q6l63L29
$$ plain form
2880 319 144 -181 100 87 -55 -45 1 78 -231 -16 -7 17 -82 74 -208 232 134 115 112 237 244 2 136 -322 14
2905 14 -173 -32 -346 14 247 102 108 79 25 -176 -178 -171 -99 -17 92 121 -24 67 -291 231 30 -23 202 -38 -25
2930 -25 7 249 204 -153 157 71 -54 -259 -86 155 -266 50 260 141 -135 -102 -56 113 -244 0 159 52
2952 52 -65 -97 192 59 267 -310 -171 -72 422 83 51 86 9 79 20 20 -132 101 -141 -93 250 12 51 259
2976 259 52 -88 -50 -149 68 6 194 -215 -51 153 125 77 -249 -37 134 122 148 4 29 135 -2 -138 0
2999 0 -26 -98 -191 -44 134 -69 -146 -199 32 -86 -99 -89 67 -109 -60 -2 -78 137 73 -44 -50 -103 20 -198 -69
3024 -69 -113 -138 -142 251 -157 60 -121 -289 -79 -80 69 40 151 73 253 194 -96 120 -1 186 -343 187 -196
3047 -196 230 -30 226 -116 63 273 43 -32 35 -42 80 76 -33 -70 17 -129 -188 415 -34 34 8 94 -269 60
3071F0k9kj13L8k66K70J61l80L44l7j5q5n9j67L57L42l96k67L14k47K44j56J78
3094H9k11J16l4r1K04j13k1j48K28n6J88j56j71K89j7j48Q0j41J91J24k69O9n
3117cp3q8J36p8J35o8j13K39k07J53j83p6J39J32m7Q2l29K39L0l6Mk7O6L2L6N9
3143A54o8J07l65J25K74r5K8%j45o5J78m5k41K80j67O5k31K78o0K9R4k04RK09
3167A44l19L20o9j28nj33L57l35J22N0j80O8J82k86J63m3K21j36k30L24J0poj85
3191a01o7R1P9M8q7K7Q3L6q8r5j88j80L57L31n1n06L43m2p4L00l57k2K66j08j56
3216a61L34k99m5J37O4k4k3L6k65J11J29J01P0k03l6L15l02J94M1k94K06M0j81
3239e5K20n0m68M14j1l3l9j06J19J36k38J35P8k17J60o8J60p0j93J10j80O5J57
$$ plain form
3071 60 31 29 -84 -46 -312 -42 119 -261 83 46 31 -54 -113 -280 77 419 23 -244 70 -177 67 -89 89
3094 89 -122 -6 -40 -131 73 -40 -61 -209 19 -37 151 -5 -176 113 96 -52 28 -113 78 202 -67 2 -3
3117 -3 -76 -164 -28 -106 29 -39 -152 87 -120 33 -150 -226 -87 45 -2 80 -249 -10 20 -16 -12 -39 27 59 95 154
3143 154 86 193 -172 -47 227 132 160 160 15 -50 128 83 -158 122 -45 20 -211 67 7 36 130 -74 -65 144
3167 144 -175 145 76 -52 -57 -190 167 -168 -46 4 -176 -108 74 -212 -49 -92 129 -7 -237 87 97 90 84 -101
3191 -101 -168 -77 2 50 -37 -10 73 109 21 -74 -262 -442 -85 246 195 -311 32 -10 -84 216 -141 -163 103 -5 -161
3216 -161 173 -126 -171 -34 30 6 -17 19 -246 -135 -6 95 165 -38 -74 241 -61 133 174 -120 86 126 -55
3239 -55 165 115 -353 61 50 17 -22 -128 -9 127 -111 24 102 -115 45 -23 137 67 -126 -16 -196 -131 26
3262B6k32J66l66M45p1K15k27P4m4l1K08k37l1J51j45L2K16j27j62K6J78j91J21
3285fL00m03J17k2j66J73Lj98L87j54k96L44j55L0J71o9l1J62J65k27r5m3j19
3308a32L72j15K02l26k3J07j09P2O4m15J98J24M3j96J80O2l87M23k15M6n6O2p7
3331i6K09j93J01J04N6J12l02l1K67k92J53k3k7L7o6n1KJ7K08j5j60K85j79q7
3355B9j55K00J39M4k49R7l18K74m5M0K4j49j33P9L97l00O5j06N3N5l1M3K9l79
3379b97L92J65k74j55q7J93o7L00l84M8K69n4OjK47q0k85K20O7m69K49J00j42
3402c9K24j78N6o1JoJ94p8l33J02J22L0r1J28P2j83j8L40l36j52L56n3p6L3j30
3427g6J16k37K49L6q7j15Q4L6o9JL3k13M33j37J80m54j17M09P4j80L4k55K92j10
$$ plain form
3262 26 -206 -40 -406 39 -32 183 -44 30 -14 -45 163 -74 -105 46 -99 -67 149 22 -140 -114 64 -127 -6
3285 -6 294 -109 8 -14 -180 -7 -4 -202 185 31 -265 79 -76 -46 125 56 25 187 352 125 30 -13 -132
3308 -132 240 125 327 1 -22 85 -24 48 112 -303 -105 19 62 -134 46 108 -279 144 -71 -25 -81 -19 -96
3331 -96 113 -80 21 125 181 293 -9 -40 227 -65 88 65 38 75 9 -42 -40 -23 185 170 10 295 116 29
3355 29 -126 74 213 257 8 105 -213 61 16 56 80 -69 -202 -123 274 -26 39 -67 -14 41 10 53 82 -297
3379 -297 95 260 -14 -169 -256 -63 -130 170 -214 -166 103 49 55 54 301 221 -64 156 223 -246 3 103 -39
3402 -39 185 7 63 2 3 -3 191 113 -220 -118 4 34 -57 71 143 -40 -58 282 -54 -206 150 97 21 54 -76
3427 -76 40 -197 52 88 1 -114 -30 6 -63 -62 -29 -242 191 54 234 -220 -337 72 146 -34 0 -255 37 -73
3451g3k42O40l56j59K90j13j61L93o44L91j38j57N16P4k51K55l08R4j92J62k31
3472b10J65J35l20M18j62P8j39L43m43O6R3j92q7L32oJ0j66O5q2J34J3m7q2l1
3496a15kj32L67n3K78k94L28m96O6O6J82l06L47j81Q4k31M5L2L10l32o6k8k07
3519c38O31k93j3M1k09oJ90m1j7K7j77k3J92J45n2Kk15L23q0q0l08N88l50J0L78
3544C25j71k22J67k54R3p3j51M15j82k22K81J87k26j94L00o6O1j3J7o0J1Jl63
3567c39J82L86j97j73K33j53L83m30K11j52K15l38N09m69J12M7J14k00j20K54
3587G5j39K3j34J27K99k56j71L64j26p7J87j46j71J36j79l5M17k72J20j27n0K16
3609H1o7l6j67J16P9K8K63l61K77n6L7j82M9J0J01k52J60K17k47K45l01n1n0K42
$$ plain form
3451 -73 -315 325 -31 -190 100 -13 -174 219 -425 -34 -172 -329 187 261 10 265 -43 51 -141 21 -210
3472 -210 -45 90 -230 188 26 104 -35 308 -135 -69 24 -168 -255 77 71 81 -85 -20 -102 32 45 -2 -84 -115
3496 -115 -117 -249 118 65 343 49 377 -119 -53 13 195 -111 236 55 139 -92 -47 -15 295 -37 -103 -131 -338
3519 -338 293 0 -13 28 -181 -187 3 -38 -55 -28 -205 -228 -36 109 57 59 -156 167 87 7 -301 287 -63 -53 325
3544 325 154 -68 99 -155 -62 -135 -286 129 -53 -275 6 193 -33 -227 73 7 68 55 72 12 23 24 -339
3567 -339 -157 229 32 -141 92 -61 322 -108 103 -49 166 -172 337 -132 -20 27 141 -59 -179 75
3587 75 -64 -41 -175 -48 251 -5 -176 188 62 -15 172 26 -145 -9 -188 -223 194 -78 42 -85 -135 81
3609 81 14 -22 -189 -73 6 34 297 -64 213 157 194 12 61 71 172 -80 80 297 50 295 -6 -57 -107 135
3633A35k78J9l8J53j06K07j28J19j00o5M47n64N6r7L48n7j46K98l03P9k0J59k5
3656I3j93J23j91J1O9J51q3j39j63K10K07j18K52o0j9k55Mk22K71J71j56K0j34
3679a51R8K3p8j90L14j49J96l61K65L2J1J15L9r4j91L83j78J00k4m9k25L42l88
3702a60K38Mk2j05m0K32m6J38k33J96j39k44K24J22l29j7M31l19L42j79j37o4
3724a07n5J47l06K19j06L15J28l43K61j85j92K30L1j49K33j78L5j1K14n3%l08
3746a80J99J16p0k66J79K07n8K2p1k6j64N2k76M29J57l38j03J51j90L05j23lj71
3769b22K51m07N62k49L2r2MR7K26j30l25rJ89k7J29kk12P77m62l31JL75l67r2
3793b84J59L1K10k56L03l14K73j13lJ38k66K37Jj87n2R6n9K12p1j00J5K3L1J39
$$ plain form
3633 135 -143 -124 -162 -9 -115 92 -36 83 -17 -82 365 -199 -143 -240 108 51 -95 203 -100 -21 -41 118 93
3656 93 -100 23 -168 -157 -88 63 -20 -159 -322 -112 95 -23 229 169 150 -105 -101 -323 -52 119 -37 -17 -151
3679 -151 -53 -30 -108 -298 16 -133 63 -298 -33 -1 10 125 164 70 -121 262 84 184 160 111 -114 228 -160
3702 -160 78 82 60 -45 -85 147 101 239 6 202 63 -181 43 165 -164 -181 250 -69 273 94 -43 -107
3724 -107 -162 -15 -321 -102 -208 107 235 -108 153 -32 -224 6 37 -112 121 -57 -22 -33 181 128 128 -180
3746 -180 19 135 65 -201 -22 185 127 149 78 52 -112 -60 -336 93 250 -88 -191 -40 -230 75 -48 -51 -222
3769 -222 29 -378 184 -65 -33 -125 -121 -24 202 72 -253 -262 -73 -100 29 27 -185 592 130 -201 -200 175 -192 -284
3793 -284 -125 -94 116 -140 163 -151 122 9 6 144 -122 115 116 -71 -123 -27 -86 126 55 -45 -30 -7 24 163
3817A63j40j39M04k95K03l66%K6K13j47n9JK89M2k63K29k73J09k39M86n85L73
3839C2J31j71n4nJ61j64O0k05J57nM3k98K52p5q7K26k72K66M5R7r1n2n7K09K04
3864C47n35L43P2l61M82m22M01k06j7p5j35Q8K1Q0Q7j79J49P9m43K60J21k58P2
3887b9J09R5l82K28m1j68K22R1j69k24N9K88j92K2O4l3k48R9J30J30j17m0J89
3910H3r9J73j44J49R5k11L18m88J78n7RJ6J98j95j41k31J32J71Q1R5r1M2n4Mk13
3935a80r0L53K51m94O2L9P5k8m0J3kK99k69j14J67j78K60r4j47J06L7P6p5J36
3959A63q3j44K05m09k5K53j22K68j71N1l3J65J0j21O4k51J4M22k12j43P2l2K20
3982A61l90J79j2J7J76q6N1k13j02L55O7l01J33k08M18k89K38j98k64K13K19l41
$$ plain form
3817 163 23 -116 288 -7 196 -170 -170 -144 69 -78 -137 -136 153 195 -68 161 -112 -3 -242 244 -341 32
3839 32 163 -8 -62 -67 94 -70 -10 -215 -58 -63 -20 -318 -66 -141 -228 -2 -274 -8 37 134 43 -9 -66 143 347
3864 347 -188 155 227 -134 348 -74 327 121 104 29 -106 -18 3 83 170 -9 140 219 -224 36 157 -101 -29
3887 -29 80 175 -207 21 -20 -188 34 125 -44 -268 -209 79 -113 -91 -27 -60 -308 -209 -79 51 -66 -106 83
3910 83 -16 157 13 162 257 46 364 -124 54 -3 6 22 220 25 -116 -347 -215 -44 37 132 41 83 29 33 -180
3935 -180 -270 83 334 -160 -98 -59 16 -12 -52 -39 -41 258 -11 -125 42 -136 124 30 -117 -11 26 102 27 163
3959 163 80 -64 141 -268 -293 -40 -162 106 -65 -14 -47 118 128 7 71 -180 -166 256 44 -99 -27 -59 161
3982 161 -229 -50 -62 -45 131 45 96 -117 -219 136 203 -98 35 -173 245 -44 194 -4 -268 -55 164 -177
4004a77k16N03j42R5j12J33q8J20k49P0J39k07J53r9m5J94m6k4n6nK5JP0L0p9
4029a2o2O3K0k55K90J89l01J00lJ28j41P9l33K25j78L13q6N6j47l0M3k25L60j05
$$ plain form
4004 -177 -393 110 -32 63 -49 84 -4 116 -133 -63 76 -131 22 -77 -122 72 26 2 -54 -59 -34 -33 37 67 -12
4029 -12 -74 -11 9 -246 44 233 -68 32 29 157 16 95 -238 -13 -191 122 36 92 -55 -85 -42 -267 93 -12
$$ [...]
8191C5
##END NTUPLES=NMR FID
##END=
