##TITLE=1H_Pr KOH-5
 200.13MHz,CDCl3,
 8 sc
 
 9.7.2025
##JCAMPDX= 6.0         $$ Bruker NMR JCAMP-DX V2.0
##DATA TYPE= NMR FID
##DATA CLASS= NTUPLES
##ORIGIN= UXNMR, Bruker Analytische Messtechnik GmbH
##OWNER= pz
$$ XWIN-NMR		Version 3.5
$$ Wed Jul  9 14:16:06 2025 Russian Standard Time (UT+4h)  she@DPX200
##.OBSERVE FREQUENCY= 200.1313
##.OBSERVE NUCLEUS= ^1H
##.DELAY= (6, 6)
##.ACQUISITION MODE= SIMULTANEOUS
##.ACQUISITION SCHEME= undefined
##.AVERAGES= 8
##.DIGITISER RES= 18
##SPECTROMETER/DATA SYSTEM= spect
##.PULSE SEQUENCE= zg30
##.SOLVENT NAME= CDCl3
##.SHIFT REFERENCE= (INTERNAL, CDCl3, 0, 14.3821)
##AUDIT TRAIL= $$ (NUMBER, WHEN, WHO, WHERE, WHAT)
$$ ##TITLE= Audit trail, XWIN-NMR		Version 3.5
$$ ##JCAMPDX= 5.01
$$ ##ORIGIN= Bruker BioSpin GmbH
$$ ##OWNER= she
$$ F:/spectra/data/she/nmr/H-C/1/audita.txt
$$ ##AUDIT TRAIL=  $$ (NUMBER, WHEN, WHO, WHERE, WHAT)
(   1,<2025-07-09 14:14:27.65 +0400>,<she>,<DPX200>,
      <created by zg, POWCHK disabled, PULCHK disabled
       configuration hash MD5:
       00 E9 B6 7A A2 85 ED C7 34 08 36 98 17 FE 4E 26
       data hash MD5: 16K
       68 0F 01 F9 F9 7C D0 6B FD 60 D6 09 E5 AF 72 A1>)
$$ ##END=
$$ 
$$ hash MD5
$$ 50 AB 96 93 EC DD E4 CB C0 51 55 ED 34 3B A0 B7
##$RELAX= 
##$RELAX= 
##$RELAX= 
##$RELAX= 
##$RELAX= 
##$RELAX= 
$$ Bruker specific parameters
$$ --------------------------
##$DU= <F:/spectra>
##$EXPNO= 1
##$NAME= <H-C>
##$PROCNO= 1
##$TYPE= <nmr>
##$USER= <she>
##$AMP= (0..31)
100 100 100 100 100 100 100 100 100 100 100 100 100 100 100 100 100 100 
100 100 100 100 100 100 100 100 100 100 100 100 100 100 
##$AQSEQ= 0
##$AQ_mod= 1
##$AUNM= <au_zg>
##$AUTOPOS= <>
##$BF1= 200.13
##$BF2= 200.13
##$BF3= 200.13
##$BF4= 200.13
##$BF5= 200.13
##$BF6= 200.13
##$BF7= 200.13
##$BF8= 200.13
##$BYTORDA= 1
##$CFDGTYP= 0
##$CFRGTYP= 5
##$CHEMSTR= <none>
##$CNST= (0..31)
1 1 145 1 1 1 1 1 1 1 1 1 1 1 1 1 1 1 1 1 1 1 1 1 1 1 1 1 1 1 1 1 
##$CPDPRG= <>
##$CPDPRG1= <>
##$CPDPRG2= <>
##$CPDPRG3= <>
##$CPDPRG4= <mlev>
##$CPDPRG5= <mlev>
##$CPDPRG6= <mlev>
##$CPDPRG7= <mlev>
##$CPDPRG8= <mlev>
##$CPDPRGB= <>
##$CPDPRGT= <>
##$D= (0..31)
0 0.7 0 0 0 0 0 0 0 0 0 0.03 0 0 0 0 0 0 0 0 0 0 0 0 0 0 0 0 0 0 0 0 
##$DATE= 1752056066
##$DBL= (0..7)
120 120 120 120 120 120 120 120 
##$DBP= (0..7)
150 150 150 150 150 150 150 150 
##$DBP07= 0
##$DBPNAM0= <>
##$DBPNAM1= <>
##$DBPNAM2= <>
##$DBPNAM3= <>
##$DBPNAM4= <>
##$DBPNAM5= <>
##$DBPNAM6= <>
##$DBPNAM7= <>
##$DBPOAL= (0..7)
0.5 0.5 0.5 0.5 0.5 0.5 0.5 0.5 
##$DBPOFFS= (0..7)
0 0 0 0 0 0 0 0 
##$DE= 6
##$DECBNUC= <off>
##$DECIM= 32
##$DECNUC= <off>
##$DECSTAT= 4
##$DIGMOD= 1
##$DIGTYP= 9
##$DL= (0..7)
0 120 120 120 120 120 120 120 
##$DP= (0..7)
150 150 150 150 150 150 150 150 
##$DP07= 0
##$DPNAME0= <>
##$DPNAME1= <>
##$DPNAME2= <>
##$DPNAME3= <>
##$DPNAME4= <>
##$DPNAME5= <>
##$DPNAME6= <>
##$DPNAME7= <>
##$DPOAL= (0..7)
0.5 0.5 0.5 0.5 0.5 0.5 0.5 0.5 
##$DPOFFS= (0..7)
0 0 0 0 0 0 0 0 
##$DQDMODE= 0
##$DR= 18
##$DS= 0
##$DSLIST= <SSSSSSSSSSSSSSS>
$$ [...]
##$SUBNAM0= <"">
##$SUBNAM1= <"">
##$SUBNAM2= <"">
##$SUBNAM3= <"">
##$SUBNAM4= <"">
##$SUBNAM5= <"">
##$SUBNAM6= <"">
##$SUBNAM7= <"">
##$SUBNAM8= <"">
##$SUBNAM9= <"">
##$SW= 18.0517328524113
##$SWIBOX= (0..15)
0 0 2 0 0 0 0 0 0 0 0 0 0 0 0 0 
##$SW_h= 3612.71676300578
##$TD= 16384
##$TD0= 1
##$TE= 0
##$TE2= 300
##$TE3= 300
##$TEG= 300
##$TL= (0..7)
0 120 120 120 120 120 120 120 
##$TP= (0..7)
150 150 150 150 150 150 150 150 
##$TP07= 0
##$TPNAME0= <>
##$TPNAME1= <>
##$TPNAME2= <>
##$TPNAME3= <>
##$TPNAME4= <>
##$TPNAME5= <>
##$TPNAME6= <>
##$TPNAME7= <>
##$TPOAL= (0..7)
0.5 0.5 0.5 0.5 0.5 0.5 0.5 0.5 
##$TPOFFS= (0..7)
0 0 0 0 0 0 0 0 
##$TUNHIN= 0
##$TUNHOUT= 0
##$TUNXOUT= 0
##$USERA1= <user>
##$USERA2= <user>
##$USERA3= <user>
##$USERA4= <user>
##$USERA5= <user>
##$V9= 5
##$VALIST= <valist>
##$VCLIST= <CCCCCCCCCCCCCCC>
##$VD= 0
##$VDLIST= <DDDDDDDDDDDDDDD>
##$VPLIST= <PPPPPPPPPPPPPPP>
##$VTLIST= <TTTTTTTTTTTTTTT>
##$WBST= 1024
##$WBSW= 4
##$XGAIN= (0..3)
0 0 0 0 
##$XL= 0
##$YL= 0
##$YMAX_a= 645631
##$YMIN_a= -694637
##$ZGOPTNS= <>
##$ZL1= 120
##$ZL2= 120
##$ZL3= 120
##$ZL4= 120
##$ABSF1= 10
##$ABSF2= 0
##$ABSG= 5
##$ABSL= 3
##$ALPHA= 0
##$AQORDER= 0
##$ASSFAC= 0
##$ASSFACI= 0
##$ASSFACX= 0
##$ASSWID= 0
##$AUNMP= <proc_1d>
##$AZFE= 0.1
##$AZFW= 0.1
##$BCFW= 1
##$BC_mod= 2
##$BYTORDP= 1
##$COROFFS= 0
##$CY= -3
##$DATMOD= 1
##$DC= 2
##$DFILT= <>
##$DTYPP= 0
##$F1P= 0
##$F2P= 0
##$FCOR= 0.5
##$FTSIZE= 0
##$FT_mod= 4
##$GAMMA= 1
##$GB= 0.15
##$INTBC= 1
##$INTSCL= 1
##$ISEN= 128
##$LB= 0.25
##$LEV0= 0
##$LPBIN= 0
##$MAXI= 10000
##$MC2= 0
##$MEAN= 0
##$ME_mod= 0
##$MI= 1.114404
##$NCOEF= 0
##$NC_proc= 0
##$NLEV= 6
##$NOISF1= 3.799351
##$NOISF2= 2.8
##$NSP= 1
##$NTH_PI= 0
##$NZP= 0
##$OFFSET= 14.38212
##$PC= 1
##$PHC0= -1202.53
##$PHC1= 12.7925
##$PH_mod= 1
##$PKNL= yes
##$PPARMOD= 0
##$PSCAL= 0
##$PSIGN= 0
##$REVERSE= no
##$SF= 200.129724274929
##$SI= 16384
##$SIGF1= 3
##$SIGF2= 2
##$SINO= 400
##$SIOLD= 16384
##$SREGLST= <1H.CDCl3>
##$SSB= 0
##$STSI= 0
##$STSR= 0
##$SW_p= 3205.1282051282
##$SYMM= 0
##$S_DEV= 0
##$TDeff= 0
##$TDoff= 0
##$TI= <>
##$TILT= no
##$TM1= 0
##$TM2= 0
##$TOPLEV= 0
##$USERP1= <user>
##$USERP2= <user>
##$USERP3= <user>
##$USERP4= <user>
##$USERP5= <user>
##$WDW= 1
##$XDIM= 8192
##$YMAX_p= 0
##$YMIN_p= 0
$$ End of Bruker specific parameters
$$ ---------------------------------
##NTUPLES= NMR FID
##VAR_NAME=  TIME,          FID/REAL,        FID/IMAG
##SYMBOL=    X,             R,               I
##VAR_TYPE=  INDEPENDENT,   DEPENDENT,       DEPENDENT
##VAR_FORM=  AFFN,          ASDF,            ASDF
##VAR_DIM=   8192,          8192,            8192
##UNITS=     SECONDS,       ARBITRARY UNITS, ARBITRARY UNITS
##FACTOR=    0.0002768,     1,               1
##FIRST=     0,             0,               0
##LAST=      2.2672688,     0,               0
##MIN=       0,             -694637,         0
##MAX=       2.2672688,     645631,          0
$$ Real data points
##PAGE= N=1
##DATA TABLE= (X++(R..R)), XYDATA
0@%%%%%%%%%%QqQj6J6k1K9l2M0m9N7o9Q2r7J12j31J53j75K01k32K64k99L39l84
34b04M34m89N49o13O85p64Q49r41J043j156J278j412J556j714J890k080K288k522
52a323K783l074L399l765M185m669N234n906O717p720Q999j0689J3031j6498K2148
67A2852l2879O0090k54167m80533O97917N45932l69504n47093J20203L77814L2851
78A63483j35530j0828j47061r7380K86637K61670k77034m20562J37096N14032
88B74523L664m62599j06569L01452J52003r5328j18971k8744O927Q2452J54608
99A63418p1101k70114L5761K87948K4020k37879p4411J69455O2095j24013K4314
110a0507R1726j32808q0021K05997J17971k18021j83098K12897K40010j93980
$$ y = [0, 0, 0, 0, 0, 0, 0, 0, 0, 0, 0, 8, 0, 8, -8, 8, -13, 16, -16, 24, -25, 32, -37, 45, -52, 60, -71, 82, -93, 108, -124, 140, -159, 180, -204, 230, -259, 290, -323, 362, -402, 447, -494, 549, -607, 671, -741, 815, -899, 991, -1089, 1199, -1323, 1460, -1614, 1785, -1980, 2205, -2464, 2770, -3136, 3581, -4139, 4860, -5829, 7202, -9296, 12852, -20027, 40063, -214104, -694637, 3280, 549212, 179708, -367385, -247182, 130632, 163483, 27953, 17125, -129936, -227316, 59321, 320991, 43957, -376605, -239509, 274523, 278187, -184412, -290981, 10471, 162474, 67146, -51825, -80569, -73642, 8810, 163418, 92317, -177797, -142036, 145912, 169932, -67947, -142358, 27097, 89192, -34821, -10507, 81219, -51589, -131610, 74387, 192358, -25663, -208761, 4136, 244146, 50166]
120E0166k29592J67419J72346j40006j16878J44319P9957k07005p1559K74723
130A23890O9786l09480j03116K82074J53016k24161j81554J61844J50795r8667
140B4427o2640N1854k7471m5840Q8356R1099j20131j63105J17222J97736q9971
151F1536j91443L2517J45519O928r3749k490M1969l9936P983R2416k6043j17199
163h1992J8516J28767N572j23536n127J09964k4170r2051N8328Q3024q2139j04170
175a09014Q7237J35319q0999j46798O4221J29310l2890q5298K2618M8898l9849
186g245j3020R1149m078j38362m313J59744M0763j58837q8700J30686J03804q7552
198B4039q4768K9371L8164J1634J5102r983o5920k5808J10668P5707j20437j11055
$$ y = [50166, -179426, -12007, 160339, 20333, -96545, 47774, 127731, -79274, -150833, 123890, 193676, -115804, -218920, 63154, 216170, -7991, -189545, -27701, 123094, 24427, -38213, 13641, -13830, -59670, 28686, 119785, -346, -163451, -46229, 151507, 61536, -129907, -97390, 48129, 55057, -38692, -41182, 787, -39149, -31166, 61250, 35207, -81992, -63476, 65291, 70863, -52673, -57800, 52164, 27994, -64057, -5729, 77295, -4844, -109014, -21777, 113542, 32543, -114255, -50034, 79276, 46386, -38912, -16294, 32604, -7245, -20265, 70884, 66806, -71556, -75869, 83875, 124638, -34199, -122899, 7787, 111591, 24039, -60729, -31358, 6806, 18440, 33542, 23559, -42361, -68169, 42499, 118206, -2231, -113286]
210a13286Q8844J31187l5483j35683j1647J03704K4693m8123k4277j8376K337
221c6110N1785L5084n2548q6137L7893J25427j5699j24173o506R6914L4692o1658
233a036m3589M0492J8893k4598J9229O119m7424o517N0332K6574n0383n2144N5424
246h628N7305m9935l6378L5864K4415j6307j9194K4150J7194m2952O76N1162j7148
259B0224m2496J1656L1994j59m0469j367M6970j6132l7639K8150K1393j9464j7067
272a4406J3152L2385j7792l6628L2982K3026l2615r186J6330Q504j3731j8949
284a6928K3190Q465l8872R704L3131j9028k3070Q619K8628L845m1678L142M4980
297B4128j1621k5023P231P764N359r323n058J2902j7478q402L2349o592l1756
$$ y = [-113286, -24442, 106745, 71262, -64421, -76068, 27636, 52329, 4206, -20071, -38447, -36110, 15675, 50759, -1789, -87926, -50033, 75394, 59695, -64478, -70984, 25930, 60622, -1036, -44625, -4133, 14760, -9838, 9391, 15510, -31914, -38431, 11901, 38475, -11908, -64052, -8628, 48677, -1258, -37636, -1772, 22643, 6336, -12858, 11292, 28486, -14466, -13790, 37372, 20224, -22272, -10616, 21378, 21219, -19250, -20617, 26353, 10221, -27418, 732, 22125, 2661, -14406, -1254, 31131, 13339, -23289, 9693, 32719, 104, -9082, 7248, 15752, 2021, -16928, 6262, 14727, -24145, -14441, 18690, -338, -23408, -14789, 13839, 17684, -23994, -20852, 24128, 12507, -12516, -5285, 2479, 7838, -1485, -6543, 6359, -11119, -19521, 12828, 6236, -25520]
310b5520L948K2771J5860k5140k5543L5420J9973k6685k828Q742K438M147n025
323B558N766l790j9381K0631J6472k8817j1100J5143J3505k388k4758L280K7073
336A4194r962r893R717j528K215K071k27N597j3008k481K3578q936k1308O637
350c334J0581K523j3434j2216J7803M553j3444N020K42m139Q191J622R4m529q062
365h529J6130Q378j9040n267Q004N938J49j4477j536J0260n605Q59M723j0320
379a0333j971Q803P080N92j4431j136J9640J609q614m233j927R267N330p244n209
394b777o321L742J4251m038j4294l866O500J6147N61j8475l609J0299J3981O099
408A8200j7328j4435J2093J9453M474k1863k0362J7269K1807n367j8235j3401
$$ y = [-25520, -21572, 1199, 17059, -8081, -33624, 1796, 21769, -4916, -7744, 998, 3436, 7583, 2558, 8324, 4534, -14847, 5784, 22256, -6561, -17661, -2518, 10987, 8599, -16159, -12879, 14194, 4232, -5661, 4056, 2528, 4743, 6814, 6587, 12184, -824, -3305, 20273, 11337, -9971, -3334, 7247, 9770, -3664, -15880, 1923, 6476, -6968, -1948, -1706, -5845, 2346, 3968, 4062, -467, -8529, 7601, 15979, -3061, -8328, -324, 5614, 5763, -8714, -10250, 10, -5595, -4736, -13, -10333, -12304, -3501, 3579, 4171, -10260, -11396, 8244, 9853, 1239, -2994, -4921, 4346, 9676, 2432, -2777, -9098, -5356, 8895, 4857, -9437, -13303, -6803, 9344, 9905, -8570, -12179, -1880, 12101, 18200, 872, -13563, -1470, 17983, 22457, 594, -19768, -2499, 19308, 13941, -4294, -17695]
420a7695Q499J8524K275r163j5943o116K4415K0533j4817k6307n921L1096K6259
433C5639k5410l2364N527K7084J4759j9337k6054M279J4280J1225J723k2250j5287
446b6186J4546K3157R676k4848k8111J9588L5401J877k8218k5654J9030L6537
458B6795p454k7974j0800R126K1594J063j7255p086m220Q927K3946m100k5513
471a2951j1974J8210L7731n561m7698m660L8844K1959j8979l6595L830L3483O99
484A6338j3681o742j0686N269J6369Q815p440l3022l731M9502J7194l8549l4132
497c4496J5720N2429O004n1628j7330K6421K2802L096k4970j9094Q514J2489J7563
510A7520l32l7555j4655L1082L3350k518n0108k2939N1586L9415k5274m5027r454
$$ y = [-17695, -9196, 9328, 11603, 2440, -13503, -19619, 4796, 25329, 10512, -15795, -21716, 9380, 35639, 10229, -22135, -16608, 10476, 25235, 5898, -20156, -15877, -1597, 9628, 11351, -10899, -26186, -11640, 11517, 21193, -3655, -31766, -12178, 23223, 25100, -3118, -28772, -9742, 26795, 19341, -8633, -19433, -10307, 11287, 12350, -4905, -11991, -16211, -7284, 16662, 12562, -12951, -24925, -6715, 31016, 25455, -22243, -26903, 11941, 33900, 14921, -21674, -17844, 15639, 16338, 2657, -4085, -14771, -9502, 6867, 15682, 8242, -24780, -28511, 20991, 38185, -364, -34496, -18776, 33653, 39657, -11971, -29301, -2880, 19922, 23018, -1952, -21046, -12532, -43, 17520, 17188, -20367, -35022, -3940, 29410, 26892, -23216, -46155, 5431, 44846, 19572, -25455, -34909]
523c4909M4582L0013l1575k9328K959J4828J8655l095j7439j2349p329K6566L2694
536C4273k7022m3718P484M7129K5785m2785m2822L1067M1239p486k6752j4422
548a8030J3140J5181l607K674q856k5382J0947L4031L491l1695k9894K7298M8326
561C7624j5184m3555l455K9029K5447j4207k9908K357J4532Q477M933j4785j7760
574a6455L361J5549J8587j1112l6992M67L7755J8192k2854l8153P606M7602Q153
587C1706l4664k1913J3747L0779J753k5434q632M060P196J4612k524k1354j3951
600b4619J3327L2602n36m1475j0782L4889K4645j6118l1811J873K9581N954j3474
613D056p871l351M880P825L401l904j7204n202K2719J1474j6245j8083K975K3409
$$ y = [-34909, 9673, 39686, 8111, -21217, -18258, -3430, 15225, 12130, -5309, -17658, -24987, 1579, 34273, 7251, -36467, -28983, 18146, 43931, 1146, -41676, -10609, 30630, 23144, -3608, -18030, -4890, 10291, 6684, 9358, 502, -24880, -13933, 20098, 23589, -8106, -38000, -10702, 37624, 22440, -21115, -24570, 4459, 29906, 15699, -14209, -11852, 2680, 11157, 16090, 1305, -16455, -13094, 2455, 21042, 9930, -27062, -26595, 11160, 29352, 6498, -31655, -24049, 23553, 31706, -2958, -24871, -11124, 19655, 21408, -4026, -12658, -8598, -1402, 13210, 10686, -10668, -24619, -11292, 21310, 20774, -20701, -31483, 3406, 28051, 11933, -19878, -18005, 11576, 17530, 4056, -3815, -7166, -2286, 5539, 8940, 5036, -12168, -17370, 5349, 16823, 578, -17505, -14530, 8879]
627H879P826j8021r559O753J0965N380q065p464K190J759M877L052q209p736k33
642g606R395R805j1338j5329N874J5482N167j1965j3466R898J4269j320p923o040
656e097K629Q391J012k558o567q663R534J2066p137j3738l674J3157J2287j1116
670E26j3133N640R635N405m887j0008M121O380J583P44p282m332O680K627L35
685D034m748q412N593P288l444k599m084P52R921r15n049L21j116O081L804o619
701H08j79K4j059O547k594o803J159n36L802K519q722l75M403L53M405l797n439
718e484O415K172Q19R03p884J724Q232k752k293m040k762Q983m88p477N90j495
734d837L682N693q490j742M815J033M162l791o057Q198K291l180J034n651K124
$$ y = [8879, 16705, -1316, -10875, -4122, 6843, 12223, 4158, -3306, -1116, 643, 5520, 8572, 363, -7373, -7606, 1789, 11594, 256, -15073, -9199, 6283, 11450, -515, -13981, -4083, 10186, 8866, 943, -5097, -2468, 5923, 6935, 4377, -2190, -10853, -1319, 10747, 3610, -10128, -13802, -645, 11642, 526, -12607, -6967, 2668, 8073, 3186, -6822, -2701, 3679, 5262, 6006, -1276, -5608, 1072, 3699, 4034, -714, -9126, -3533, 3755, 311, -2288, -6372, -5620, 4301, 3386, -1663, -1342, -2458, 3623, 7427, 808, 629, 653, -406, 6141, 3547, -3256, -2097, -2633, 1169, 3688, -5034, -5409, -1006, -653, 3752, -45, -5484, 931, 3103, 3922, 4825, -3059, -1335, 6897, 4145, 1852, -2188, -4950, 4033, 3545, -3932, -3342, -4837, -1155, 4538, -3952, -5694, -879, 154, 4316, 525, -5532, 2666, 4957, 1777, 2811, -2840, -716]
749g16O229n733j662J08k200N838j529o649M156N91P61K887o249K150O318l339
765I61P36K80l407N632l41m134J948k844R35M477o862j338M023k055L034j940
781h95m538O340J110k520K477l050J791M995m754J10J351k995M362j066n668K888
797f2m40m44J958n369R62M532l032J069K42k431N418k96l392L674j421J45K834
814C947l888j08J414k631K484p91m712K800L84j434J963k739Q69L380k182J647
830D03N10k197L231J095j737R26k300L29L549l750j562J143j203J796q78k752
846c397J954n92P15L324k778j580L401J795P44k737k486M753J039k468l44k788
862a445R45K509j571j132k393j563N536J371m883j304J948M261J804n101o45K990
$$ y = [-716, 5513, -220, -1882, -1774, -3974, 1864, 335, -6314, -2158, -1567, -806, 2081, -4168, -2018, 4300, 961, 1697, 1977, -1430, 4202, 3861, -273, 1675, -1169, -234, 4243, -2619, -3957, 66, -1989, 1045, -895, -5433, 907, 2017, -503, 1974, -1076, 715, 5710, 956, 1066, 2417, -578, 3784, 2718, -2950, -62, -502, -946, 1012, -4357, -3395, 1137, -1895, -826, -584, -3015, 2403, 2107, -1285, 2389, 968, 1113, 3947, 59, -49, 1365, -1266, 1218, 427, -4285, -1485, -1101, -2535, -572, -3311, -2442, 938, -1244, 403, 913, -1284, 1947, 3042, 1305, 2231, -69, 260, 3809, 59, -1503, -360, -1563, 233, -645, -3397, -1443, -2035, -1320, 2004, -774, -2354, 1047, 2842, 3586, 849, -1637, 3116, 4155, 1687, 1343, -1445, -500, 2009, 438, -694, -3087, -4650, 886, 2257, -2626, -3930, -1982, 2279, 4083, -1018, -1663, 1327]
878A327M72K975j896n141N49L153K802k538p628J841O130j239k670k073j89M257
894A32K37P88k3n158K096Q247p09o227l917M198Q799n082q793L222K672O1J58
911G01l023j84j585Q82P335j179r181K292P049L530l161q884L352Q553k087k875
927A535l114k004O273J005m219j827l235M078O083n340k600N55j59O771J599o541
943a140k309J278Q278M383j3635n723J2079M829n374q211n16R679j958o186N118
958E92j347n738M390O397J476j0138p221J6349R833j5266q286P204R530j54j3026
973e405N85Q590m923q18M522l859l087q83N504P985r804r177J0233P240r12o300
989e09o653Q385P644n356m357k969K147P571m370n312K757j684J87L837q35m68
$$ y = [1327, 1799, 4774, 2878, -2263, -1714, 1439, 4241, 1703, -5925, -4084, 2046, 807, -1863, -3936, -4125, 132, 369, 1157, 1134, -4024, -1928, 6319, 5610, -617, -4534, -336, 8463, 3381, -5412, -2190, 482, 543, 701, -2322, -2506, -4091, -3209, 4126, 2947, -6234, -3942, 3107, 6637, 3476, -5408, -2056, 6497, 4410, 1535, -1579, -3583, 2690, 3695, -524, -2351, -5586, -1508, 4575, -765, -3365, -2810, -2969, 3802, 5401, -1140, -3449, -2171, 6107, 10490, -3145, -8868, 3211, 8040, 2666, -5545, -6061, 3618, 1660, -4526, 592, -755, -6493, -2103, 4294, 5770, -4368, -11589, 4760, 14593, -673, -8959, -1755, 7775, 7621, -5405, -4820, 3770, -1153, -1971, 2551, -1308, -4395, -5278, 226, 8211, -1593, -10770, -537, 6703, 5791, -509, -7162, 1223, 8867, 3511, -846, -3815, -1668, 5903, 1533, -3779, -1022, -2706, -2519, 1318, 483, 15]
1005A5n775n10J5032J05j5676j755J2175Q921r200j4169R519J2213q941p184M699
1020e31K645l219m689P025O361j4399m803J6368N146j1232r569Q140J5569o912
1034E900j4074O131P499j884k970j825K152j192l898O248J627q983o85N014M116
1049C176n31p929l60P991K450j430n350l660Q878N122o994m952J022O021M12p208
1065c342J645L455n574n9P141rp737m276J0723R632j2309r384J0677R072n631
1080D024r079K776Q768m324o298O369J157p781q80P298L832r846o130J1010O647
1095G543q774m646M711N113j132m200K321J379m104L417K839m584k933J726L745
1110B421n64o214R25M295k281J93J805j770j046J936L909m6p429K108Q075k888
$$ y = [15, -5760, -6270, 8762, 8867, -6809, -8564, 3611, 12532, 3332, -10837, -1318, 10895, 1954, -5230, -531, 2114, -1105, -5794, 1231, 7592, -6807, -11610, 4758, 9904, -1328, -10897, -2757, 12812, 5900, -8174, -2043, 5456, 3572, 602, -1223, 929, -263, -4161, 2087, 3714, -5269, -5954, -940, 3176, 2645, -5284, -5644, 2347, 4797, 3367, -1983, -5643, 3235, 8357, 1363, -3589, -2567, 3454, 3866, -3342, -1697, 1758, -3816, -3875, 3266, 3257, -4480, -8756, 1967, 11599, -710, -10094, 583, 9655, 4024, -5055, -2279, 6489, 2165, -4133, 2236, 3393, -4388, -5268, 2030, 5862, -3984, -10114, 896, 7543, -1231, -5877, -1166, 3947, 2815, -1385, 936, 2315, -1789, 1628, 4467, -117, -3050, -1324, 2421, 1857, -4357, -3432, 863, -1418, -1225, 580, -1190, -2236, -300, 3609, 3563, -3866, -1758, 6317, 3429]
1126C429n612J068L539J99n106N60N165m976l949O627J776m985l076L874O922
1141E455n047o214P050L618m725j113K989J526l633k852O341O79q981J337O429
1156B859j344m405j645N067K447o939J758O058l836k148L415J796n93n303K598
1171b15O804n988m432N094P60k489j789M10L409l567k737O854r70n475L348K984
1187B001L56l034j689O315l6o790L721K491l669p61J092J480j300n535M832M110
1203C584p241l97N158J5j737j744K819M073o217m55P344k996l498J276J757J393
1219C134n479j326P367l373n476M510J604j564j799q8N194j382n361N518K436
1234C915m271j03J686J193p51m287L834K205o417R51L862k465j410m02K128K101
$$ y = [3429, -2183, -1115, 2424, 2623, -2483, -1923, 3242, -1734, -5683, 944, 2720, -2265, -5341, -1467, 5455, 408, -5806, 1244, 4862, 137, -976, 2013, 3539, -94, -2946, 3395, 4074, -4907, -3570, 2859, 1515, -2890, -4535, 532, 2979, -3960, -2202, 3856, 20, -2128, 1287, 3083, 2490, -2813, -215, 6589, 601, -3831, 1263, 2023, -466, -2255, -1845, 1564, -2003, -4740, 2114, 1144, -4331, -983, 2001, 2357, -677, -2366, 3949, 3913, -2877, 844, 3335, -334, -1095, -3, 1477, 177, -5358, -526, 3584, -3657, -4054, 1104, 1119, -618, -2362, 457, 4530, -1687, -2142, 5202, 2206, -1292, -16, 1741, 3134, -2345, -3671, 3696, 323, -5153, -643, 961, -603, -2402, -2490, 2704, 1322, -4039, 1479, 3915, -356, -459, 1227, 2420, 1669, -2618, 1216, 3421, -2996, -2045, 1817, -648, -2058, -2460, -332, 1769]
1250A769n116J167N776l777j630L259L11j05k293L83M639l943l226M546n2l201
1266a493j22O33K195k645k665N418j22l934K010K319m88j523q66M081L66n369
1282b205K669K960l225r86K04J425m20l739K096L258l806j113L016M70p54j529
1298a679J242L583k985j483M059j125j866Q10N88Q51l015j191L644j188k836J344
1314a247J178m76m94o15K086m40j386K649M48k205R06R47N46r34j944J878N29
1331A426k537M79P68j386M02n21J263l5k658K179K683k215r21J166J294P95k234
1348e2J27K330k270k77J325j165n19q32L65J989k383j467L077l39k53j52n05J786
1366G85N26j070J211n95j207K090l07j407N23j601J356K79k249Q64K02j317J797
$$ y = [1769, -3347, -2180, 3596, -181, -1811, 1448, 1759, 1654, -639, -256, 4383, 440, -2786, 1760, 1708, -1493, -1615, -982, 1213, -1432, -4097, 1321, 1199, -2735, -725, 1594, 1106, -417, -1283, 2798, 3164, -2205, 464, 3424, 199, -787, -583, 842, 422, -3317, -1221, 2037, -1769, -2882, 134, 604, -150, -1679, -437, 3146, 161, -1322, 2737, 1612, -254, 556, 1144, 1995, -1020, -2211, 1433, 245, -2591, -1247, -69, -545, -1039, -1654, 432, -8, -1394, 1255, 1703, -502, 404, 1351, 1897, 963, -981, 897, 1426, -1111, -632, 136, -1250, -848, -1369, -106, -141, -2799, -620, 2063, -152, -1073, 93, 1387, 2182, -52, 75, 2405, 135, -142, 1183, 18, -501, -1333, -968, 1021, -1362, -2829, 248, -91, -344, -496, -1001, 785, 1311, 241, 1452, 857, -350, 1740, 1433, 26, 549, -1052, 304, 583, -1666, -802, -600, -1917, -120]
1383a20r9j341J511q98J945J121l046O81J868o36Q95j715r78K392j164j028Q81
1400B69j793N95J231j904J213m36j389K805J80j247P13j027K137J881l715j04
1416e91K004p21J208k046j779K938j295j262J858j610k86R08p25K311n75k925
1432b588K927J603j057j39j813J778K800l362j163J955j181J249j475j816K680
1447C98j297j241K764o97j212M30l87L386l1m276J849K844n66r59k725J524L364
1464C168l925q55K274j252l87m07N4K682k724k057M738N03k519p24O48M141q37
1481B521m815K321K652j873q88p54O14J605l028K39K583k529q05J463O83J263
1497A252k329j312M224L37k214m7m52K707L52l457M07J670q01l00j067K96J106
$$ y = [-120, -219, -1560, -49, -947, 998, 2119, -927, -246, 1622, 986, 1881, 166, -812, 1580, 416, -612, 269, -1524, -929, 302, -1602, -389, -825, -2214, 591, 771, -476, 237, -790, 1347, 3228, -487, -591, 1413, 692, 1900, -146, -1925, 1013, -282, -1544, 314, -1296, -1582, -674, -1399, 912, 337, -2588, 339, 1942, 885, 746, -1067, 711, 3511, 149, -1014, 941, -240, 1009, -466, -2282, 398, -899, -2140, 624, -73, -1285, -855, -1242, 2144, 2113, -2163, -314, 2530, 1964, 1005, -1720, -196, 3168, -757, -1612, 662, -590, -977, -1384, -1330, 1352, -1372, -3429, 1309, 1812, -707, -1431, -783, 3358, 2521, -2294, 27, 2679, 806, -82, -836, -222, 1383, -1645, -1406, 1177, -1352, -2157, -694, -11, 1252, -1077, -2389, 1835, 2172, -42, -89, -541, 2166, 2518, -939, -532, 1138, 337, 37, -1030, -734, 372]
1514C72k463J29L195j442j962R21K065K071l529j992M544J320k643j553O36K340
1530B009j063l108K541Q89k943j83J973O70j628k323K832L097l051j536J845J385
1546A406M35k084j43K412j100p31O29p66j51k65p28J510q71j553J042M80M28M5
1564ej395Q17J909o49l27n68L39K198j281j666J380J5q91j08j47Q67j754j184
1582b450L003J35k485L1J749J382r90k357K632K153l013K32J021P0m51j773J910
1599G99R70l425k39K577m45j658o58J058K334k163p21K565l50q43J162k20J79
1616I22n45m85K337j319k217J798q0r97J30n32N64k22r98J928L7k280K286J010
1634A337j011j74k33J270M22k596J414J404k520O19O81m72k16k092J430K078l167
$$ y = [372, -2091, -1962, 1233, -209, -2171, -1250, 815, 2886, -643, -2635, 1909, 3229, 586, -967, -331, 2009, 946, -2162, 379, 1268, -1675, -1858, 115, 785, -843, -3166, -334, 2763, -288, -1824, 21, 1406, 1841, -243, -386, 2026, 926, 195, 824, 58, -93, -358, -1086, 424, -447, -2000, -958, -478, -50, -5, -1400, -583, 1326, 677, 350, -218, 121, 2319, 1038, -628, 752, 767, -124, -232, -379, 488, -1266, -2450, 553, 688, -1797, -1766, -17, 1365, 375, -1982, 650, 2803, -210, 22, 1043, 1113, 662, -1111, 799, 1769, -1656, -1895, 682, 237, -1421, -2079, -1021, 1313, -850, -1571, 994, 644, -199, 963, 743, 922, 377, -108, 2229, 910, -1307, 491, 411, -586, -456, -988, -424, -646, -1644, 284, 321, -1959, 327, 1337, 326, 152, -81, 1189, 1611, -985, 429, 1833, -687, -68, 613, 141, -75, -2167, -737, 1341, -1826]
1651a826j90K953o35p36j88O56J996j983j143L419j455j876J351N77J30j541j384
1668a875K761l6l216J711P17o80K13l93J193L68k083J982J400k103J48R14j51
1685H70K03j271j31J659k425M75J349j762k71J057k9O04j437K6K898j880r29K278
1703A284k28n64l4l09J554j281j856K738o04k131M65P51K02m66j601K007Q37k383
1721a619J321J294m65j12p72J368R22k232K61K021k230k47O55k92M96j485K20
1738h96J605k023n77K287n32k67J49J15J424j022j149K554r17r94Q82k83K50p27
1756a21j135J932p14j871J300P74j007K53M6Q88l06r76J544J071j874L76J012
1773A192j54l79j364J088R00k374K45J603j363o95Q12J48M65j472O06K327j541
$$ y = [-1826, -2016, 937, 302, -434, -622, 34, 2030, 47, -1096, 2323, 868, -1008, 343, 920, 1050, -491, -1875, 886, 850, -2366, -655, 62, -618, -405, -798, 395, 763, -1320, 662, 2062, -41, 107, 1021, 870, 1073, -198, -329, 1330, -1095, -620, 729, -1033, -1304, -247, -276, 328, -1109, -1083, 1815, -65, -994, 1284, 1056, 492, 458, 149, 1703, 422, -1434, 1304, 700, -1431, -966, -215, -13, -479, -2080, -73, 764, -1619, -298, 996, 531, 419, -353, 1015, 1937, -295, -34, 1987, -243, -490, 165, -127, 369, -1116, -896, 709, -1314, -1891, 396, -136, -403, -254, -139, 1285, 263, -886, 1668, 751, -243, 639, 356, 606, -121, -1256, 676, -38, -1909, -609, 165, -842, -589, -543, 345, 39, -937, 607, 1678, -196, 180, 1192, 1038, 659, -705, 383, 1283, -1091, -846, 757, -606, -1301, -489, -341, 124, -1348, -742, 1585, 44]
1790D4q89J275M44K53j250L74J733j753j080J388M7j127l49L06J081j337j107
1807a947K047L63j710P94P31L07p6q14J374K80j555P22M51j052N6n91O13M49j929
1826a487P90J083j585K83J228o60J44k12J056L19j536M71K136j084j168M66J11
1843C55M59j212n35J816j386j094J470K77p09n31R2J926m49k019J917R36r34k17
1861A62K43L51K88j880J351O96k453P59Q00q06L12j281R22R76j569N56J208j225
1879e90P10R54q47N29p18R9J539j668j059K064q48o53q6m82J487j150j189K553
1897F45o11j742J434N47M77l13j384K063R64k696Q02Q13p08M15q63p7O21j604
1915a217N71J077j194m0N21p14J624n33q11J140l63K89J087j959Q36J085j600
$$ y = [44, -845, 430, 874, 1127, -123, 251, 1984, 231, -849, 539, 586, -541, -890, -584, 497, -840, -1947, 100, 463, -1247, -453, 278, 585, 509, -305, 1069, 1349, -206, 516, 967, -85, -29, -620, -7, 442, -1487, -697, 386, -1199, -916, 312, -348, -204, -416, 640, 959, -577, -106, 2030, 946, -222, 244, 355, 814, -398, -933, 883, -503, -1597, -127, 150, -559, -1090, -998, 928, 479, -1540, 377, 1313, 379, 162, 405, 756, 1044, -836, 515, 1211, -1242, -483, 317, -489, -177, -1458, -536, 440, -1129, -573, 635, -590, 120, 1074, 227, 756, 38, 137, 1676, 8, -1051, 1013, 165, -488, -574, -1056, 431, -719, -1908, 645, 34, -1708, -274, 273, 750, 437, -947, 1116, 2080, -616, 186, 999, 291, 706, -157, -234, 387, -1217, -646, 431, -763, -803, -282, -996, 628, 95, -716, 424, 61, 350, 1437, -522, 314, 1399, -201]
1932b01N15n76q1J085j338o25J580j120k68Q29k57N55m53p87K360k38j925J143
1950A98M64L63Q7j617N59J021j491J00M63p07N59j324P09J110j344j86J268N7
1968B89j82j25n33K099l71j593R29p3j00J73j050O74L69j613K72R51o41k92k98
1987a115P38J384j742j40J917l95l39p0k09J267l85j211Q21n9p81J90m32M19R8
2006d4j275R96O18p92M97n81M01J048p95m92J149n08O42o13p78J178k62q70L56
2025a25L74n75q1o33J168J57j748N53J678n17m89k42J215Q12j656j60J407k00
2043I38p47j96K71O24j959k76J826n18j270N19M55P79r41j046K176K32j008M55
2061C14K12l22M70n18N08K62j221M53K55r24N79o17l10R57p15K70N03q31J323
$$ y = [-201, 314, -262, -343, 742, -596, -1221, 359, -761, -1029, -200, -457, 98, -355, -1142, 1218, 980, -945, 198, 662, 1025, 1112, -505, 54, 1075, -416, -316, 147, -560, -1, -1325, -616, 494, -850, -1036, 232, 289, 107, -18, -551, 1548, 1177, -416, 513, 440, 340, 513, -537, 137, 506, -1107, -835, 116, -525, -817, -1115, -377, 1007, -735, -875, 1042, 647, 308, 238, 29, 1296, 911, -300, 521, 462, -319, -129, -561, -142, -44, -1319, -323, 295, -497, 0, -581, -180, 868, 73, -419, 730, 222, 864, 251, -527, 651, 389, -481, -125, 249, -326, -407, -1040, 128, 285, -1463, -910, 768, 251, -238, -480, 735, 1547, -109, -269, 1138, 938, 191, -5, 266, 890, -1069, -1345, 481, -37, -1307, -788, -333, 446, -495, -1541, 635, 867, -141, 314, 526, 204, 674, 156, 664, 926, -295, 158, 413, -511, 68, -549, -859, 98, -617, -347, 156, -675, 648]
2080F48K29j424R33J33m6L52j302J326L45j802J25J228q13l67m81M01J164j751
2098a102j29K154n25j309N76M71Q18p77r77K165k03j878R52M79o99j13r75J331
2116B59M25k024Q89P75j049L52m4J95Q35q96L76J307j747P71O32r78K59k16l42
2135b21N55r51M0J061j002n93J071m46o0N0k56J782r95r23J870j06r28N01j05
2154C44R41r64j364J749l5j782L91R86k24j58j187J315O98j708O17J273o58k94
2172f0M37kR30j492k59J582j154k76O27o27K89k97k85O62o78m89J541q06m39J079
2192B83n5J90l80l54J507o59j208J350j31q26Pl58R64k88j568J182R60j359O5
2211f78L79N87j91r01J154R82j489j80J363o80J16p30L66P02j323l92J361q22
$$ y = [648, 877, -547, 386, 519, 473, 825, -477, 849, 1194, -608, -483, 745, -68, -435, -916, -515, 649, -1102, -1231, 923, 398, -911, -335, 136, 954, 177, -800, 1365, 1162, -716, 236, 715, 16, -97, -1072, 259, 684, -1340, -451, 324, -725, -373, -417, -222, 613, -283, 93, 1400, -347, 424, 1056, 78, 337, 121, -221, 334, -617, -577, 484, -518, -1111, -40, -486, -546, -496, -752, 1030, 35, -888, 982, 876, -52, 449, 344, 1285, 321, -1043, 706, 671, -1111, -720, 266, 42, -116, -1303, 12, 710, -998, -381, 892, 234, -60, 377, 375, 1305, -187, -446, 1136, -18, -294, 333, -294, -5, -302, -587, 75, -603, -1092, 449, -357, -796, 283, 228, 418, 38, -316, 1191, 532, -676, 674, 543, -283, -276, -634, 330, 42, -1526, -344, 616, -743, -678, -299, 288, 97, -804, 350, 1332, -157, -337, 1026, 346, 462, -268, 98, 800, -523, -915, 446, -376]
2229c76l61M22k29M92m24k67J370l91q24J245K8m92J34l7O68p10j088J330k32
2248B58r54L79J99J0m76l67R36M82j427O18Q40n20L29l91P80J35j057M23J172
2267A369j431k59M93j03K6o74j49J110r17m70J348o94k71N45R2L97p03K96J237
2286A242p71m53N54l58Lk83o05J013n02r81J269Qj061N49O3P39j75j027J093P16
2306A033j486O89N49l26K17q46L24N33j246nJ063j207L24j04k0P49o52k41J013
2325C61n11j04J070p05K86qk48N94m00r94J561p19n66N44l67n5r7m71J011q6j270
2346a174J364M52p64L29j64P83J56j637R34P85j304L96l7l28N75j089K52R93j140
2365f18m03J149k88J61J40m25R72l98k55Q06o55q8N69n18K6K76r25O17l95n67
$$ y = [-376, -737, -315, -544, -52, -476, -743, 627, 236, -588, 657, 685, 193, 327, 290, 958, 248, -840, 490, 258, -696, -317, -118, -108, -584, -951, -15, 467, -960, -342, 498, -22, 307, -84, 696, 831, -226, 197, 1369, -62, -321, 172, 69, 95, -579, -728, 382, -535, -1005, 343, -351, -622, -77, 15, 412, -291, 5, 1242, 471, 18, 572, 214, 217, -66, -671, 342, -160, -1141, 128, 136, -925, -376, -313, 426, 251, -776, 317, 1033, -453, 236, 785, 459, 676, -170, 154, 687, -559, -564, 499, -708, -384, -488, -508, 241, -411, -652, 361, -150, -254, 816, 111, 397, 389, 141, 735, 335, -659, 902, 183, -383, 161, -206, -261, -358, -829, 182, 96, -1174, 190, 642, -122, 207, 43, 826, 982, -655, 279, 1064, -240, 156, 119, -209, 366, -723, -471, 522, -618, -1021, 128, -160, 1, 141, -284, 688, 290, 35, 841, 186, 98, 667, 149, 175, 451, -474, 143, -252, -819]
2385h19P31j41o63Q27n5k7K63o37J258N8j457J193K25o14J76l10J88L71j319J94
2405e58R75q24o9M70j99L54o13m28J467k84n23M01n3N20j46n97R18n41j99L90
2425D61o57j39P06q46J84O37j203P07j33o7O74k70m19N71J29K66o8l84M36J03
2445F88r61M58J85p49L20k90l4L78r12L86P44m48l15N54J31O28r41o9J111l38
2465E26k29k7k95N14m78n45L29K46m31R5J14j25L75q66M86P55n41K0J57L8P36
2486H54q69j07J033n20k46k16j25M25k90o99O79Kq13K52L75L96j6p35M85Q62p47
2507b0L58L26l81K52l40j06M37p22l15M07k70L93J4m79M35k46k79N34k29K69M64
2528E02p42N71P70p92r6M1r3L96p19n45J165n66m25L87l36L05n3l56R91q8p46
$$ y = [-819, -88, -229, -892, -65, -120, -147, 116, -521, 737, 795, -662, 531, 756, 142, 318, 8, 196, 567, -752, -558, 417, -407, -476, -6, -205, 149, -464, -892, 575, 291, -232, 169, 116, 636, 490, -107, 811, 270, 71, 461, -196, -335, 371, -475, -291, 346, -857, -150, -283, -350, 324, 54, -365, 206, 335, 601, 533, 149, 585, 688, -273, 185, 370, -379, -59, -349, -383, -5, -917, -531, 213, -235, -550, 4, 135, 763, -178, -247, 864, 526, 297, 270, -25, 489, 11, -534, -205, 41, -390, -295, -181, -306, 69, -797, -311, 444, -97, -77, 80, 118, 854, -15, -122, 911, 391, 145, -71, -196, 229, -61, -760, -81, -79, -892, -640, -265, 131, 115, -620, -135, 727, -20, 338, 664, 283, 535, 195, 89, 526, -196, -511, -104, -374, 19, 33, -446, -11, -257, -536, -2, -231, 38, 502, -240, 331, 1101, 309, 213, 254, 161, 557, -162, -707, 458, -108, -533, -146, -482, -177, -230, -586, 405, 317, -429]
2549d29O99l29N79k73m51L59N31o63K45Q8m09M03p62J29O36r47O2P10o51M69j31
2570a35m97J021k52k53L64j30pP01q49j67P54m79R3l54k28N29p45j25J063o93
2590c89l8L04kO63l11q10J447j96p33K13k2L13J63r26M21P76j406J04L53k82l5
2611c93j81L32Q61j162K09R30k60j11K2j51O40n44l41O97l78m56N88p58J47K19
2631i0l78L96j16m19P05j16n30R55k04l44M08l07O37m9j161J203N6p69J17j05
2651a11J76r5j151Q10Q75j128J13O24n1J74p25P14P57j016k76J046l44n01j40
2670b49K51N26r00k92O97k94l08L28j10M83j96k81L97J37m63Q48n5o52P53l52
2690B68K6J39r17O50K37j034N32J0l10o0j69O11L65j003N87P34n00j99n2Q00j38
$$ y = [-429, 270, -59, 520, 247, -204, 155, 686, 23, 268, 356, -53, 350, -412, -283, 353, -594, -532, 178, -473, -4, -135, -632, 389, 137, -116, 248, 118, 111, 812, -37, -204, 550, 71, 164, -190, -418, 111, -634, -759, 304, -389, -427, -123, -125, 538, 227, -583, 864, 668, -65, 148, 126, 439, 602, -324, 97, 873, -533, -429, -76, -358, -393, -574, -242, 619, -543, -334, 596, 336, 225, 247, 96, 736, 192, -149, 548, 170, -286, 302, -456, -309, -90, -468, -72, -188, -607, 98, -18, -548, 407, 203, -141, 267, -40, 597, 548, -613, 590, 646, -123, -6, -111, 65, -30, -1181, -371, 504, -624, -511, 113, 62, 236, -489, 225, 982, -34, -310, 736, 392, -109, -249, 2, 528, -372, -664, 33, -261, -569, -241, -351, 132, -64, -345, 52, 189, -274, 574, 519, -133, 620, 268, 294, 433, -484, 166, 403, -631, -99, -89, -399, -459, -628, -17, 348, -655, -68, 666, 166, -33, -85, 715, 577]
2711E77q39j3J368r97o01O88p2j63m84j51J012q04k99R53k18j02J67J44L71l59
2731A78l52Q38k3r57M78K44n38K18l91L58j59m89M79M65q29J39L77j24K32m69
2751c25K33R23q03k32Q66n19q6L7K35K98j239J32R13n17n86N98J05n2l84k21J028
2772D04k88q54J079J20n98J87j56P20m25p38R21K58j311P65l09r5J43m00N07M46
2792C76q05M72K88l63j16J50K91N35r45oQ75j064k1N17q2k57k78j2N35n33l03
2813g46R41k4k26q6J06N98R5q27Q40k60m81M12J30n01J10o60P59J10r59P33J02
2834A66r48Q07J04j52J72o88P94K63o92L89J45P5k41k57oL69o65p3J039j153m02
2855i54P48nL0r7j07J040m74p92J051j57j45K32m78P75k04o26J84J67n60M13n
$$ y = [577, -262, -275, 1093, 96, -505, 183, 111, -52, -536, -687, 325, -479, -778, 175, -43, -145, 22, 166, 537, 178, -174, 664, 641, -316, 162, 406, -132, 86, -305, 53, -106, -595, -116, 349, -480, -341, 36, -88, 144, -325, -92, 831, 28, -204, 662, 143, 57, 94, 329, 627, -612, -480, 433, -84, -670, -72, 33, -19, -403, -624, 404, 116, -738, 341, 461, -137, 50, -106, 614, 189, -549, 372, 630, -681, 84, -225, -320, -177, -577, -70, 376, -429, 43, 331, -32, -148, 2, 293, 828, -117, -123, 752, -312, -333, 184, 102, -155, -433, -445, 90, -443, -746, 195, 171, -55, -141, -35, 563, 658, -169, 671, 411, -70, 342, 472, -29, 81, -579, 180, 290, -669, 64, 166, -782, 25, 129, -23, 149, -539, 255, 518, -174, 215, 360, 435, 194, -63, -69, 300, -365, -438, 601, -552, -954, -206, -211, -181, -278, -385, 655, 181, -611, 440, 283, 138, 370, -108, 667, 463, -163, 21, 188, -372, 41, 36]
2876C6q6P0p16N08J87k16m2N27n90N02j43q2L11l54K75M22o51Q8Q4M3m11k61M21
2899g8K61n95k79Q76k16m56O13J72j73J83n77J152l34p48M90n0o8j30j83M09k73
2920do14O49J73m80j38K2K94M21n38K53M39o33J98J16L4K08j65l95P18n90J3K02
2942A83q44L23K77m76KL59j13O56m52j55P16k86j94P5K6J62r1m20N84l31n21K96
2964b24K74n9k49m58Q93l9q55M47L72m5J21l51L90K04l31j44P00m61l31J50j31
2985a27J76m6l69M82M6m61K30k52M58J49n96L54j44J32O43n93k65P10m81J68J39
3006C53p92O21m89j56N81l60k68M43m3N2M64q46O70K57o10L12K75l93N09o53L76
3027C03J94o34j7M48n88K14q8j73L20j76k26O71l35K15J6l29L06M45p16K36L08
$$ y = [36, -50, 20, -696, -188, -1, -217, -259, 268, -322, 180, 37, -45, 266, -88, 187, 609, -42, 46, 130, 173, -238, -499, -78, 183, -412, -691, 185, -31, -487, 126, 298, 125, 308, -269, 883, 549, -199, 291, 241, 173, 43, -140, 269, -4, -618, 31, 204, -276, -414, -392, -98, 323, -215, 38, 477, -156, 42, 158, 192, 400, 235, -160, 558, -32, -19, 183, -661, -338, -61, -537, -535, -176, -289, 367, -85, -240, 476, 190, -4, 71, 97, 259, 168, -252, 332, 1, -520, -224, 50, -9, -258, -716, 177, 138, -717, -270, 102, 57, 178, -173, 217, 421, 90, -54, 646, 185, -146, 4, -127, 49, 3, -366, 116, 162, -299, -69, -321, 137, 286, -310, 44, -100, 32, 675, 82, -183, 527, 46, 214, 353, -439, 182, -307, -463, 118, -242, -510, -67, -110, -58, 406, -440, 230, 487, -123, 189, 464, 71, 580, -73, 303, 497, -137, -154, 294, -294, -80, -168, -341, -21, -197, -423, 248, -87, 128, 144, -185, 121, 566, -150, 86, 394]
3048C94n04M51j81k94M91o98K7O32n17OP8n14R24o7m43M12l42L76Nj64K67L7k81
3071I5K04M6j94p3o81K58N88p86L45L46l50K97m2m74P03O5n42M82N3m7M10j020
3093c17N23j7n50n1N19k85J1q0k0M71m63j28K64J55L61k48k74O69m18j49K27j72
3115B8J77p9l41L15N8o24L89Jk60%O1M3M40n40K01N81l00p0K56m79N96j53l41
3138d1P7J0l7M1n21K81N76q77K6K31K69J84p02K49O37m20J24N02m20R0j28k64
3160a13N66m23m12P15m25j97r6k37Q53n11j03Q4M04j48K89m33ML45q9L8L32n42
3182i9K46L3j38J14m56J10j00J83m11P30o37O26L4l24k1J6L11J69n59M32J62k98
3204A23K0J33m1L9n39l48P93m07l75P35l82L3Q9j89M67K81o66N73J96o66L93k17
$$ y = [394, -110, 341, 160, -134, 357, -341, -314, 318, -199, -193, -115, -629, 295, 228, -215, 197, -145, 231, 236, 72, 339, 376, 95, 299, 345, 151, 78, -603, -345, 243, -543, -198, 148, -202, 95, 53, -421, 282, 347, -195, 287, 340, 293, 703, -317, 206, 189, -361, -412, 107, -178, -167, -247, -267, 204, -259, -387, -123, 32, 393, 145, -129, 540, 122, -27, 200, 28, 205, 126, -215, 100, 158, -466, -77, -76, -336, -336, -275, -232, 208, -332, -131, 450, 150, 80, 336, -143, 453, 300, -41, 36, 46, 9, 50, -471, -190, 386, -491, -465, -234, 35, 219, -483, -234, 403, -17, 107, 609, 189, 279, 151, -113, 453, 30, -382, 333, -92, -289, -385, -622, 231, -280, -383, -299, 105, -43, 246, -187, -183, 162, 73, 111, 443, -99, 147, 180, 42, 156, -300, -190, -290, -107, -518, 212, -425, 201, 235, -89, -110, -94, 217, 386, -173, 259, 421, 123, 143, 276, 235, 274, -265, -613, 180, -227, -602, 133, -249, -216, -127, -316, 151, 432, -234, 339, 535, -131, 262, 45]
3226D5N83k39m52J72J80m43k07L29k85R7j24J2L41j75j0L49k94O71k54l03O94
3247F87m82n35O01j75m86P37l69k54M50m65K24j52m31J003L2o09N21l26j76M54
3267B49k66L14R8p90P05j33l18K68k37n1L80p83L9M79k55J25J78j07O3q5L20N80
3289G73p11p7M25k05J6j24k17L43l02j74J88j41k97N48l65m1K28KM84k17n06O33
3311B63j35k17M96o98L91N3j45j83O12r30N53J80l79K12n44K09L53k76rP27p51
3332b18L99J09l12N64l38r2N06p84r0N35o87L87J03n98M42J27l57N46l31k54P03
3353C60k87m8K06k26M57j36k44L07p9m73L68k58j79K36o43M91J77j86m8K09K1
3374B5K41j68l17P09o83J23L00rO8j25k88L36j42n19N30k6r7Kk15M6M38n34L51
$$ y = [45, 628, 389, -63, 109, 289, -154, -361, -32, -317, -220, -344, -332, 9, -166, -176, 173, -121, 550, 296, -7, 687, 205, -330, 271, 96, -390, 347, -22, -276, 174, -291, -67, -219, -650, 353, 385, -224, 297, -29, -205, 249, -17, 297, 395, -395, 310, 177, -141, 127, -110, -161, 219, -564, -525, -46, -301, -176, 2, -105, -42, -127, 193, 773, 62, -15, 410, 205, 221, 97, -120, 223, -79, -253, -65, -206, -503, 45, -320, -361, -133, -131, 353, 136, -370, 263, 128, -89, 407, -291, 100, 153, 8, -175, 437, -493, 60, 240, -139, 73, -471, -262, 91, -185, -194, 533, -218, 181, 290, -22, 542, 204, 112, 618, -166, -256, 279, -408, -21, 82, -516, -74, 53, -304, 242, -89, -343, 360, 73, 25, 231, 5, 462, 326, 82, 389, 310, -163, 205, -53, -232, 4, -639, -148, 29, -157, -205, 4, 25, 266, 98, -219, 490, -193, -70, 230, 221, 289, 164, -124, 212, 70, -449, 81, 55, -42, -40, -255, -209, 229, -305, 46]
3397D6N7l58K28J3J20L16k25j1J25n56L99K45n25J53K97l84jk16J04M83n71J02
3419a59L61j13R7k30p5N96l77o6L85m16j16M10m29J95r3l09L03j77j79M88k61
3440a65M2K28J5O8n3l29L43L47m85N53n30K35j79l37J14L47l41o7K47j76p8N0
3462a51N42l24k34K86K40m55r3K35Q9k0P7j47R3j88k02L47l77j79O99n20J06J57
3484a9j91K40O7l76K85K53j50K82k42L06oq13O50m48P9K83m45J68J70k84J15m5
3506a21l74O48pl12L96K38k88Qj19k8M12n08J62j18k17L21n51J75K24k03j62L67
3528e7k13K65K97m87M28P6m16L56m6k08M06m44J93K6l11l7K19j37n4n6k08K47
3550a61K24k62M21m19K38K50j01m6k8k01L66o8j90K35k82j69M51k39k68M52k68
$$ y = [46, 103, -255, -27, -14, 106, 422, 197, 186, 311, -245, 154, 399, -126, 27, 324, -60, -61, -277, -173, 310, -261, -159, 202, 89, 186, -44, -119, 477, 100, 34, 419, 3, -113, 297, -132, 63, -30, -339, -36, -213, -392, 96, -165, -123, 105, 120, 188, 135, -194, 149, 496, 11, 564, 34, 269, 90, -247, -133, 214, -127, -194, 53, -123, -201, -151, 391, 67, -167, 119, 359, -96, -189, 46, 135, 115, 192, 45, 138, -50, -252, 95, -282, -461, 238, -282, -176, -19, -210, 30, 97, -279, 6, 259, 109, 391, 149, 455, 449, -364, 286, -162, -83, 200, -245, -77, 93, -191, -76, -121, -495, 153, 146, -166, 230, 468, 180, 188, 69, 41, 453, -55, 107, -11, -228, 93, -458, -283, -59, -262, -424, -57, -270, -5, 292, -195, 233, 309, -107, 249, 203, -5, 401, -43, 150, 176, -135, -172, 47, -90, -144, -200, -408, -161, 63, -199, 222, -197, 41, 291, 190, 144, 116, -85, 281, 213, 23, 258, -24, -193, 258, 19, -249, 203, -65]
3571f5j6j78k6N87k71j35L69l14j5M25n71J98J86j28J63k94P8p2j04J48J3p9k52
3594c53L76%q6K13j39L54k29m00N72n7j38j86k55O98M6p60K97J58l32J19J62m11
3616c51M69k48l5K82j84k45N50j97J84k19n3M19j35k55nj55L20j84J3J18k71j53
3638c35K08J8m3K29l24K79mp6J31K59n45N24k85j04L96m4l64J60j55J17j10m47
3660e15O90l03K64j86q2J37K73l02K52J36m05K78j21j03J18j23mQ9m67K47M2l
3682h8J83k24J3N16m70Q7L70k52k20L50n79N22j44j32K86j46l25M15j59Mr8p1
3704a62j17L06k54k02N08k10J02J70K5qj39K10j6k85J27J65o20K46j3K15k07R3
3726f6k82O61l22N1K18l98N3K9L6J5J02n34O78n5j92p8j0J99m6k73K83P2j60P
$$ y = [-65, -81, -259, -285, 302, 31, -104, 265, -49, -64, 361, -210, -12, 174, 46, 209, -85, -7, -79, -183, -35, -22, -101, -353, 23, 23, -63, 150, 11, 365, 136, -264, 308, 251, 113, -73, -328, 370, 416, -344, -47, 111, -221, -102, 60, -351, 118, -130, -165, 117, -67, -312, 238, 41, 225, 6, -47, 372, 237, -18, -23, -178, 142, -42, -29, 89, -182, -335, -127, -109, -152, 77, -247, 32, 28, -48, 83, 342, -203, 321, 36, -68, 328, 284, -80, 80, -75, 42, -68, -515, 175, -128, 136, -50, -132, 5, 278, -24, 228, 364, -41, 237, 116, 13, 131, 8, 4, 93, -374, -127, -85, -88, 95, -129, -116, 400, -70, 17, 387, 135, -85, 265, -314, 208, 64, -68, 218, 72, -253, 162, 3, 7, -91, -162, -279, 27, -227, -429, 79, -131, -29, 141, 166, 158, 19, 229, 213, -72, 55, 220, -400, -154, -167, 48, -159, -66, -348, 313, -9, 42, 260, -138, -85, -56, -20, -5, 97, -437, 241, 186, -6, -84, -94, 105, 59, -214, 69, 141, -19, -12]
3750a2j31Q5K55m6j71K55l02K50k0j78mL56n48O0K5J88J37m28l8K98k75O9j5j34
3774c24N2J16K37m8j1M4K83m88K55p2J23J43k92m87N66k44J12J72l73J28J7j35
3796b26J20K57n81L34Q8k2J12%K06r7J1j05j04N4K9J20l24J97l53J4M69l89o8
3819b58M39k62l3J94J5K19l68R6J57k05j41n7L42k06J3k82N47o8m83Q05n09r9
3841a44K50qoO9j79K43K3l74M02K0m90M06r4k63J30p1pL59m97K09j19K5K30l87
3865b73Q0M11j81k54M99r8q9Q9L9k65L3J05j28j15O6p3p6J00N1k27L05j20k2K40
3889I7N7j89K38j14K60nm27j01J33r3J39j43K31J10k28k44P7j69j73M88j64M03
3911A83j75j24J80q6P7K53k43k81L88j52J14l11r3O85m07o1n1J7l4j4nK21j85
$$ y = [-12, -143, -58, 197, 151, -20, 235, -67, 183, 163, -15, -19, 337, -211, -151, -126, 62, 199, -229, -267, 31, -244, -175, -190, -324, -272, -156, 81, 33, 22, 66, 349, -139, 116, 44, 167, 310, 18, -469, 97, -147, -35, 137, -236, -108, -91, -226, -106, 151, -430, -96, -8, -30, 82, 82, 288, 191, 202, 97, -7, 47, 76, 196, -128, 69, -284, -270, 199, -190, -258, 181, -81, -114, 80, 95, 314, -54, 42, 199, -6, -147, -204, 138, -68, -55, -337, 210, 142, -341, 464, -45, -144, 106, 98, 92, 161, -18, 225, 248, -126, 276, 296, -194, 212, 118, -145, -15, -86, -93, 266, -231, -22, -141, -116, 114, -273, -193, 218, 37, -217, 282, 184, 95, 184, 223, -42, -9, 96, -32, -147, -81, -154, -230, -130, -79, -306, -1, -121, -143, 97, 154, -35, 203, 89, 349, 344, -83, -184, -51, -144, -5, -148, 83, 193, -35, -279, -202, -371, -544, -56, -220, 183, 8, -116, 64, -22, 55, 308, 65, -216, 172, 20, 134, -177, -270, 415, 8, -53, -104, -87, -121, -135, -140, 81, -104]
3934a04J12J22N7j56K48j09qk60J36K34l48j15J50q5j96L75k26J20J9k39j2N88
3956C03m50r4O80m93K98k63O1L74k12l28O12m61j74L8J43n4K9l30K77j06m7L29
3978A32k87K27K21k02L00k52r5J87k85J80K1J6m69P7J68P8q8j14M4m0o6J93kK76
4002B20k24J2k08K99j28j8J69k71J77j46N6L20m47N1M51p57L71n1p2L48j76j00
4024a24N3P6R8J09k42QM10l27J46q0l62Q8k2J30Rj8n1L56l36J06J38j46n7L11
4048B73l33l4K45l10P1Q8R2J84l75J55Q4k24m52M90o2K87m94RM63r3J04q0J27
4071B15J76k43m5k76K82K6j65J29mJ06m91MO9R0K84j40j24K32k83K70J15k3j33
4094G1J15l24J07K61j69J28k22Q4k45J14K21M8o67J51O23m71J6L80j24k0j12q5
$$ y = [-104, 8, 130, 187, 31, 279, 170, 162, -98, 38, 272, -76, -191, -41, -126, -322, 53, -173, -53, -34, -273, -285, 303, -147, -241, 439, -54, 244, -19, 42, 416, 204, -124, 488, 27, -147, -109, 34, -20, 9, -321, -44, -150, -197, 132, -155, 72, 293, 91, 391, 139, 44, 231, -54, 126, 147, 163, -306, -229, -61, 17, -71, -185, -141, -181, -247, -54, -56, 220, -4, 8, -200, 99, -29, -47, 122, -149, 28, -118, -62, 258, -189, -138, 313, -444, -73, -124, -196, 152, -24, -124, -71, 5, 103, 212, -30, -22, 388, 61, 207, 127, -235, -147, -169, -39, -30, -48, -99, 257, -79, 27, 165, 19, -38, 273, -60, -94, 151, -159, -88, 0, 92, 276, -99, 56, 140, -84, -536, -46, -108, 179, -315, -306, 157, 64, 168, 88, 215, 391, 148, 103, -173, 109, 135, -30, 99, 95, 201, -290, -286, -217, -127, 157, 17, -107, 125, -158, 112, 227, 204, 71, 186, -138, -31, 230, 61, 189, -33, 51, -194, -80, 141, 189, -478, -327, 296, -175, -159, 221, 97, 77, -35, -120]
4116a20K50n9K05j01J44j62k36J02J55q8j95l2M9J41l37K42M9l0m5K58J71l41
4138B0k10K80l6K36k00n0K44k40l13L05n0n7J47k41L07l08K85p4j53K59j21j82
4160a52n0K35J43k02J73j57K62j60k67J20OJ28l23mJ67p5k7L45l98J46K51m7n0
4183F4j81K86j02J85l88j7Q2j3L03l11j5J01M4qj88%K80j29q0M25j95k88N60l79
4207C6J34k44R7j44K93l51J43k76L29k34J44k64N02k93J66M8j29Q8j29R3J31l6
4229A04j77K15Qj70K08l1k33J13j58N4j87M24o9o03R0L12K7k2K87o0k44r8p3L33
4253E0J30j11j14L40o15M97k44j1Jj7M15m34J00J79k14k8j08K4j1M3K07J82k39
4276B2j37J32Kl08K95j25r7L48n15M87k19Q8j6m6k41K48j10K72J40j65L6J6l34
$$ y = [-120, 130, 71, 276, 175, 319, 157, -79, 23, 178, 90, -105, -137, -88, 53, -284, -42, 7, -23, -68, 190, 361, 20, -190, 90, 54, 290, 90, 40, 284, 44, -269, 36, -14, -71, 76, -165, 142, -166, 119, 45, -108, 151, 30, -152, -202, 33, 176, -26, 147, -10, 252, 92, -175, -55, -49, 79, -244, -248, -81, -156, -183, 162, -236, -90, 161, 114, 64, -117, 169, 67, 252, -136, -153, -71, -84, 219, -92, -107, -6, 38, 30, -158, -158, 122, -7, -87, 338, 143, -145, 415, 36, 170, -74, 23, -121, 172, -179, -36, -312, 17, -217, -73, -337, 165, -128, 38, 86, -43, 45, -84, 9, 140, 104, -73, 142, 150, -20, 188, 157, -76, 37, -121, -67, -254, 170, 101, -502, -412, -100, -73, -95, 192, 132, -112, -210, -283, 50, 180, 69, -45, 295, -320, 177, -67, -78, -77, -94, 321, -113, -13, 166, -48, -76, -184, -160, -171, -128, 79, 261, 22, -115, 17, 19, -289, 6, -119, -216, 132, -383, 104, -115, -27, -43, -89, -330, -82, -192, 80, 220, 55, 91, 107, -227]
4299b27L34R1k94ln3j55K66q7J5K80l22J8Nj11M84j58K5k18R4J90M1l05L13k51
4323b8l50M02r5R3k54l6K39j26L08j66p0k56N29p2j27p3K56j35P7j16p3J24l6
4346A5l4O6j63J67Ll02M13k23K69m8k6KJ72l25K25l76P9L73l53K80j78jj68M8
4370h5J15J10oj17J99m4k26Jr5Q0R5j68J7L25l72J21K28k27J17Q5l32J61k2j24
4394a64K10j05M7m3j14J25J14k22J02K0P2J96l97N3J2R5o5K16k98J49j4q0M8N1
4418HN8k34l23M77O1k71J40k67M53M3m5rj55L25l31o7J12J65K2j5n8k65k09N34
4442A49k08O0J71k38L5j10J17K27j88L6J29o2k78R1L37k36L7j43K53k05jj08r7
4465b32K05J33r2j86K5KK36J86k36q5KK14J96l30k01K12l32K68K89m12J90M7k6
$$ y = [-227, 107, 198, -96, -99, -152, -307, -41, -128, -113, 167, -155, -137, -132, -243, 241, 83, 108, -110, -16, 174, 215, -90, 223, -28, -378, 24, -71, 22, -232, -268, -29, -155, 153, -13, -83, -339, 190, 118, -9, -82, 174, 39, 116, 0, -73, 51, 15, -19, 47, -116, 51, 54, -248, 165, -58, 211, 163, 137, 139, 311, -14, 211, -165, -86, 287, -66, 214, 36, 35, -133, -85, 30, 140, 134, 17, 216, 172, -54, -53, -148, -68, 27, -141, -124, 201, -171, -50, 178, -49, 68, 153, -179, -18, -40, -164, 46, -59, -12, -55, -169, -44, 70, -152, -50, -30, 42, 238, -159, -106, -94, 1, -64, 152, -146, 3, -11, -91, -43, 8, 66, -168, -491, -14, 47, -224, -84, -351, 102, 145, 100, 91, -64, 261, -70, -137, -25, 140, 162, 147, 89, -176, -385, 149, -59, 1, 172, -66, -31, -141, -24, 203, 15, 51, 180, 118, -160, -69, 268, 32, 69, -74, 179, -26, -27, -135, -232, -27, 106, 14, -172, -147, -145, 91, 277, 41, -44, -42, 172, 368, 38, -163, 49, -283, -15, 274, -138, 52, 99, 73]
4488G3J5l25K28P5j15N8Q8j27M60l93o3K20j41n4J21p1o9J66n57J97J45k9K9P8
4512Im8r9o2K68k06K02J46K9j92J34J5l48K48k15M9n9J89j82J49l63K74l0j97
4535b89L28k77J52l9K16n7L2J3J62r2k07O2n5Q1K05k74l85L04RN2nL5n4K74m55
4560b64J91j4L07k74k2M5J23op2J82k22n7J24r2J64l93k6L03j22J32j32K9j08
4583b04L66j42j6r6Q4om6J58Ok13P7R2k06L04J19m61P2K04n39O49j97j0K1O2j08
4608c0K06r8L29j78j74L3l18K20M5q5l09Q5J59K62r4k75o2J40L4K21o7m25P28
4631C47m63jL57j39q7k22J62q5%J15j81K46q5J1o3K27j69J22K19j71k79K87j82
4654c4L9K29l86K62k18K53k35K50j19J77l53J21K58k34J33j30J36j50r6N9K15
$$ y = [73, 88, -237, -9, 66, -49, 9, 97, -30, 430, 37, -26, 194, 53, -1, 120, 49, -20, 146, -411, -214, -69, -98, -69, 9, -39, -138, -200, 68, -138, 64, 210, 239, 47, 181, 196, -152, 96, -119, -70, -129, 60, -122, 27, -336, -62, -92, -289, 39, -238, -86, -125, 91, 34, 66, 79, 241, 149, -58, 4, -51, 30, 235, -39, -424, -120, -111, -59, -64, -29, -83, 191, -264, -73, -87, 220, -54, -76, -31, 92, 86, 14, 196, -26, -83, 41, -51, 113, -280, -306, -3, -125, 7, -125, -96, -204, 162, 20, 4, -92, -8, -14, -60, 98, 104, -109, -32, 60, -146, 158, 277, -184, -112, 92, -447, 202, 5, -5, 16, 78, -30, 176, 78, 407, 229, 55, 88, -230, -10, 35, -50, -359, -274, -115, 147, 53, -222, -284, -144, -110, 111, 44, -381, 347, -116, -117, 240, 101, 14, -208, -46, -131, -131, -16, -197, 49, -36, -25, -88, 139, -30, 92, 311, 140, -139, 148, -34, 5, 234, -152, 110, -108, 145, -90, 160, 41, 218, -135, -14, 244, 10, 143, 13, 149, -1, -97, -38, 177]
4675A77m5j33L22j02k25K38l64J36j09kj66K64R8l8m17M91J1l11L33j69J5O1l6
4698B9J92n7p4J5k0J13j59k7r6K17p4j16OO9k46L57j12N7l2j44N1r2L17r0k33
4723a49j7L78k57N9q9K7J56M2k93j38K61K1K28J36k23k27J39Q6R5k64j0M27l83
4746EO4K3j60J33O1k50K21l54J50J22O0J10l79J01k3K36k23K89j18J64l29K82
4768A85j46j28K6M27j34m07P2J59o6m4L2r0J44m6n9m5K10l15M66L8q7j79J10J19
4792B42l37k1J88p1j78J51j20R0j13J55J5R3j39R6j42L49l97L34j16j41k5K63
4814A76j94L96l34k83J31L1J14L7j97O3p5M7J30J00k23J45Q8k78K25O7j08jP1
4837A28k28J73j48J04j40K8LO7k8N5j48P5K56j79j79L66k05L7L56k59J32k87J0
$$ y = [177, 132, -1, 321, 219, -6, 232, -132, 4, -105, -107, -273, -9, 89, 51, -366, 125, 136, -175, 158, -11, 4, 65, 29, 221, 164, 90, 105, 85, 198, 39, 12, -84, 133, 59, -57, -51, 18, -228, 129, 17, 74, 42, -102, -51, -143, 174, 84, -149, -166, 212, -45, 14, -75, -48, 108, 150, -143, -281, -20, 1, 229, 365, 142, -85, 54, 140, 235, -29, -39, 388, 5, 69, 92, -68, 65, 126, -124, 97, -257, -107, 15, 75, 185, -194, -93, -116, 120, -103, 186, 68, 232, -97, 185, 39, -89, -63, 364, 230, -177, -105, 54, -12, -56, -24, -114, 30, -16, -75, -120, 90, -225, 241, 279, 192, 13, 123, 242, -95, -116, 72, 1, -177, -26, -146, -56, -169, -14, 1, 94, -45, 51, -91, 258, -139, 195, 79, -62, -87, 176, -18, 378, 44, -239, -108, -77, 37, 74, -123, -60, -135, -88, 42, 142, -81, 64, 152, -126, 99, 166, 58, 57, 128, -100, 73, -75, 29, -111, -83, -80, -13, -41, 14, -134, -59, 197, 18, -161, 205, 0, 37, 393, 134, 266, -21, -11]
4860a1J31j18j84m5K48N4l33K54K7m78M14K65j24k60J74j07Q6k05M4M31k33Mk57
4883b23K30j46k7p3K89q5K6K00k12k51K63J44l42K56r2Q9J47j4k45k9j28K42P5
4906I4j90M4J29j15m03M30J17Nr1K8K07k22o8J91J14j13J5k1j35J64k49N22n36
4929h3oN85n76J77r2KO0M9k11J45j19J44j55J80k24O8N5J46p8j14J42J1j39l4
4953f7J12l23L17m6J90m68J34J55Q5o3o7p1K51q6k64K63q8k32K49l2J66J35Q7
4976C37n27K27K6l27J67q8J14M3K49l79M3K74j05O8k81L04j04Qoj20n3J71l56
4999c15L71Q0l40K54j76nn5J16J35J18l01J52K27N0j41j15k13J71p8J04j60R5
5021b6O9k65K84OJk96K26O0k33J62nj94m3L75O3j08j57K64%m57K64M8j20r1K55
$$ y = [-11, 120, 2, -182, -227, 21, 75, -258, -4, 23, -455, -41, 224, 100, -160, 14, -93, -7, -212, -168, 263, 30, 34, -223, 7, -139, -166, -239, 50, -35, -9, 191, -21, -272, -9, 135, -207, 49, -43, 46, 193, 179, -66, -95, -223, 19, 94, -96, -52, 77, -38, -441, -11, 106, 111, 20, 48, 255, 33, -35, 156, 270, 157, 172, 151, 16, 180, -69, 453, -83, -89, 496, -80, 97, 5, 7, 67, 116, -95, 50, -69, 75, -80, 100, -124, -56, -1, 145, 67, -47, 95, 106, -33, -67, 45, -278, 39, -7, 183, -285, -151, 4, 89, 26, -41, -112, 139, 53, -211, 52, -36, -268, -19, -51, 115, 250, 337, -190, 37, 63, -264, -97, -185, -71, -28, 221, -158, -115, 159, 54, 122, -159, 145, 41, 49, 43, -77, -130, 41, -315, 56, 136, -204, 50, -126, -131, -186, -70, 65, 183, -118, 34, 261, 311, 170, 55, -158, 13, -65, 39, -121, -26, 43, -222, 62, 68, 69, -227, -1, 59, -174, -12, -17, -211, -254, 121, 184, 76, -81, 183, 183, -274, -10, 38, -82, -173, 82]
5046H2k11K16j3J47q5n9j10K83l4k36J65M8j81j65N92m93J07J15j37j34J86n2
5068C1k9K11l77qK77p7k16mN5MK02m7m2J78l6j09J79k16j34J58J38r8r3J06m5
5093Hj76K35j05P4M1l8N0k3m04K94J29M8q6N8m6j70L52l59O4K43j31j58K7J81
5117A08k88j8J84lM3Pk1n7K08J8j24oK01j60j13K91m20L9K16k57pJ57n5R7J72
5142B12k87Q1j50K77p3K79o65L86L28k66K1k9j28Q1l3Q2m5j27R2m4k12M09j65
5165B4k36M75j41j18P1q5K74k77j0M0r5l8J37q1N3M4%j12K55k95J35J15m41L26
5189B0P6k60L27j43J37k79J91j54K90l61J45J0LJ13k1j11j86l2L29j2j67J36j39
5212h8j0R9k08J41Q7%P4j77p8K64j16l2k57J48P7J61M6r3j0j73J98j8K8k8R3l28
$$ y = [82, -129, 87, 74, 221, 136, 77, -33, 250, 216, -20, 145, 193, 12, -153, 439, -54, 53, 168, 31, -103, 83, 31, 2, 213, -164, -172, 105, 28, -188, -192, -137, -133, 69, 22, -20, 158, 122, 13, 192, -24, -158, 0, 138, 40, -53, 53, 8, -168, 67, -38, 36, 77, 39, 89, 66, -338, -44, 85, 133, 47, 105, 59, -111, 241, -118, -54, 189, 58, -100, -73, 108, -180, -198, -14, -17, 26, 33, 12, -45, 163, 181, 57, 51, 252, 92, -21, 270, -150, -111, 105, -152, -159, -2, -57, 40, 212, -75, 6, -144, 133, 60, 339, -326, 60, 388, 122, 143, 114, -14, 67, 34, 116, 71, -56, 36, -8, -220, 189, 24, -212, 263, 122, 4, 75, -10, 264, -13, -23, 17, -78, -116, 21, -60, -7, 37, 37, -75, 180, -115, 20, 135, -306, 20, 96, -164, 163, 20, 157, -122, 69, -85, 205, -156, -11, -1, 2, 115, 94, -17, -203, -235, 94, 82, -85, 51, -88, -98, 1, -207, -66, 21, 21, 95, -82, -160, 104, -12, -44, -301, -153, -76, 85, 131, 38, 28, -145, 53, 35, 63, 35, 128, -200]
5238b00M46k79n0J81q7j14r2J48l79M45j24J17J91k73K39j80n6K76l48L77l01
5259f3m1l3J77j00k4K99n11L39L5n9Rj44P5j53J45Q4j0k1R5N2o8l4j30J54Jm5
5285B9J04J19k36j11n3J56kl43J65L55j39R1PK5n5l7j05J41k43J59O1j2J4k26
5309a36k2R4K52k92K4p4m1R8K36j80k47L62K39l51J23j6P4l18K30k05K19N1j48
5332b8K56l9k23o8rR4J9j4q6L26l31N7k5J71j13j3K10J09k91K6M7M7j72J30n0
5357C0J24L3l55O8K11q5Mj78Q1J92Jm5q0L9j71J42j08K59k72J36K7P9l99N12k66
5382b1J05k10Q3m0k37M96k51L44j17J10k6m72M13q0M3Kj86%j5p1J29k60K41O4
5406D4l03K24L7O3O3q0M1k9j40J43q0R7m00K69P9R7j23N8k10K76k40L61l26N2
$$ y = [-200, 246, -33, -83, 98, 11, -103, -195, -47, -426, 19, -105, 12, 203, -70, 169, -11, -67, 209, -139, 238, -63, -104, -137, 40, -60, -84, 215, -296, 43, 78, 19, 28, -116, -41, -194, -49, 35, 25, 4, 99, 151, 83, 49, -81, 73, 74, 29, 133, 252, 16, -95, -148, 8, 6, -337, -172, 183, 44, 135, 142, 167, 112, 75, -30, 111, -132, 27, 88, 76, 90, -136, -158, -64, 188, -104, -80, -154, -195, -97, 139, -41, -288, 74, 313, -38, 85, 69, 143, -175, 55, -150, 69, 120, -28, 228, 189, -34, -102, -111, -17, 2, -12, -98, 228, -103, -46, -71, 100, -13, -26, 184, 293, 2, 28, 75, 122, -50, 80, 30, 154, 187, -168, -100, 111, 26, 30, -148, -67, 125, 126, 81, 1, 40, -131, 11, -97, 162, -110, 26, 53, 132, -267, 245, -21, 84, -126, -43, -83, -320, 176, -75, 269, 152, 262, 236, -236, 177, 97, 140, 142, -44, -44, -59, -130, -1, -261, -20, 44, -259, -35, 2, 65, 128, 48, 89, 60, -80, 63, -17, 80, -320, -51, 28, 125, 2, 60, -150, 126, -114, 247, -79, -27]
5430b7qj0M41k43k88J72N4k6n1k28M10j04l29J50r5J31j42J4M14l56j99L04p9
5453i5O7j07K30j60J67k10M4j05N19k55J9q8k10M09j20j63J24k63J56q8j4K9N9
5476e5q9K79J33o1j05j3j4L3j39m9J34J2L0l72K80n5K06k78J29k35O2k8L41J07
5500B53J04k45l9j83l4J93l8m6K24pl9q2j76N6n1O1J64pk27J29l12K03k4K36L5
5525A48j7k88J93o8n6J94O2k57l00L67K38j47k79J68j51J77m2l4r3J84j3K35j91
5548C0j11J07k63K10J95k80K74j57r9j0J07K08m1j52l64L95k6n1Q2l25J80K14
5570A23NL0J02j63j89J50k48L25k14J3M6m22M69j07K16j2L9l0n7j71O6MpM25k41
5595A52O1n38L94K29j26rk72M4J09Q8l14J30J67K4n0o4j36J39K37l29QJ45q2l1
$$ y = [-27, -35, -45, 396, 153, -135, 37, 91, 65, 14, -214, 196, 92, -237, -87, -182, -51, -193, -179, 235, -121, -320, -16, -95, -28, -135, 95, -65, 102, -108, -64, -169, 350, 95, 114, 26, -184, 225, 105, -58, 66, -197, -41, -129, -143, -114, -55, -144, 135, 268, 207, 102, 89, 75, 108, -31, -80, 54, 66, 96, -276, 4, -51, 155, -123, 6, -229, -167, -195, 146, 253, 357, 112, 73, -110, -144, 49, 11, -35, 189, 182, 143, 61, -115, -59, -110, -49, 115, 108, -119, 10, -302, -99, -123, 113, 148, 131, -157, 36, -32, -88, 106, 168, -89, -389, -22, 216, 69, -210, -42, -193, -16, -58, -92, -185, -1, -14, 221, 30, -81, 26, -237, -27, 168, -112, 162, 5, -94, -104, 3, 211, 170, 18, -346, 49, 23, -28, 54, -271, -91, 123, 128, 158, 260, 97, -92, 58, -190, 135, -79, -66, -20, -442, 27, -80, 136, 124, 163, 133, 76, -95, -29, -25, -32, 393, 152, 213, -325, 69, 298, 172, 163, -109, -65, 44, 132, -182, -52, 115, 139, 89, 25, -111, 28, 265, -64, -56, 89, 7, -24]
5619b4m7k2K32n5p7k03J37q9j8j26L16j32j09M4J82m3L38m5k16o2j04L32j70l19
5643b80K10j38K08j86J66l6K29Q2l36J6j21J40JK69l97L36j58P1K7J21k44R4k13
5666a39m0J09R6J52r6Pj66MK09k53L97l70j5L9K29j09k9k45K32kL4NM0L2k90J79
5692A0M9j98P6N8k1j25J73L5L6k89K59J63r2J84l51K80l75J42J35l33L09j38o3
5715g6j6J74k28M41l89n5L84k44P7k82J19Q4L9L8K4k88P8M9J27j36K17k48O2Q7
5739C8k65K83J04k65R3r9j00P5J67j21j04M46p9l5j51L2j35j04L56o8o1j08K1
5762h0j56O08n77L2L44j84k11J90j1j19J01K92j03k93K8J0K06j45p6J6J36Q1k93
5785b04M30k67K72q0l19J99j00L9L51k14o9Q8j40j88K00p2Q7j49J5J49J11k04
$$ y = [-24, -71, -93, 139, 84, 7, -196, -59, -148, -166, -292, 24, -108, -217, -173, 9, -34, 304, 259, 43, -19, -123, 209, 39, -280, -70, -208, 0, -186, -20, -56, 173, 255, -81, -65, -186, -46, -45, 224, -173, 163, 5, 76, 103, 224, -20, 74, -139, -179, -70, 26, 178, 82, 89, -77, -73, 136, -117, 280, -90, -105, -66, 163, 54, 25, -220, 12, 10, 44, 49, 89, 121, -169, 10, 59, -139, -63, -5, -26, -151, 22, 57, 93, -196, 63, 226, 134, 318, -33, 247, -128, 14, 149, -184, 125, -13, -76, -92, 82, -146, 295, -94, -149, 235, -9, 68, -214, -95, -11, 28, 66, 90, -198, -120, -71, 56, -80, 137, -111, -49, 38, -227, 56, 160, -105, -12, -111, -211, -136, 31, -90, -194, 252, 173, 138, -13, 19, -116, -220, 136, 68, 7, -101, -80, -236, 372, -205, -173, 171, -13, -224, -34, -45, -164, -63, 229, 126, -167, -139, -129, 77, -68, -144, -128, 8, 89, -204, 226, -41, 231, 151, -168, 31, -69, -30, 321, 107, 38, 126, -14, -202, -2, -74, 13, -136, -121, 28, 139, -65]
5807f5K61p6J69j89k43L9K92q5P3k3p0k5l6j02J58J45k26O5r5j22l5r3K24L18
5831B59l07O9j33n5L82j35j07L56j49j51Q2p7j27O0N7K2j95J41l2J73j64K48o15
5854c98K16J31j4rJ62k25L16k39k7L04l2n4j54o1K15j1m15M16K6n0K21m11K08
5877A15J6J34j42k34J07n7J33k32K80J25m60J92J26kj34o9K30j9k47J03j82L80
5899A63k22o6j24L70j46J73j50k34N07n50K32K43l58J64J39m30K26j18K85J42
5919B46j28k37L32j29j57j6rL61Ll80K20L8j56K84j30j09L38m63n8O4o4k3Q7K14
5943A28l07n2K05l43L72K10J8l21K3K88J17o61N50l16o1M46k42j06Q0p6N2k8q5
5966a09L30j59l1J79k15J76j21J28j22k1m4L48m62j6K60j39K5j03n2L86k40O8
$$ y = [-65, 196, 120, 289, 100, -143, -104, 188, 103, 176, 153, 83, 58, 22, -80, 78, 223, -3, 62, -33, -155, -190, -283, -59, 259, -48, 21, -112, -167, 215, 80, -27, 329, 180, 29, 111, 34, -93, -33, 24, 46, -149, -8, -40, 133, -31, 217, -398, -182, -51, -65, -74, 88, -137, 179, -60, -87, 217, 185, 131, -23, -84, 131, 120, -295, 121, 147, 97, 318, -93, 115, 131, 265, 123, -111, -4, -61, 72, -160, 120, 245, -215, -23, 103, 101, -33, -102, 128, 109, -138, -35, -217, 163, -59, -125, -249, 121, -25, 148, -2, -236, 271, -279, -47, 196, -162, 2, 141, -289, -63, -181, 104, 246, 118, -119, 213, 84, -73, -89, -98, 263, 266, -114, 106, 144, -12, 272, 142, 33, 371, -92, -150, -86, -150, -173, -86, 128, -179, -231, -26, -369, 3, 213, 231, -90, -67, 221, 338, -323, 227, -89, -150, 296, 54, -52, 28, -48, 4, -24, -109, 221, 62, 31, 210, -5, 171, 50, 178, 56, 35, -9, 339, -123, -139, 121, -18, 7, -96, -148, 238, -2, 66]
5988F6L2k9n3J08L2k46J02p5K34j91J14J6j40j08M16j71P5r8l03K15k17J92R1
6011F2j32j08N72l99j04J32m2P4K05n5l8k06ln4R3J33k86J38k6RK6j73L36k95
6035a41K96p8RJ23j20K87m76M2n3J01oj87J56j32M3J31j37J29n7P7J29k44N8o
6059e6q2L02R7k35j50R5J06O0k29J22k33K17r5j25K42M2l1lL39n38J68L10l80
6082e7N0P6j91K01n9R4N2L5l46K27j28m3J9m2K4j14P6K30k34j16P7L18j17q9J89
6107A32l1J57m18K23k2p5K8m6p2o7j12K45n6J22j00K71k20J8J92J2k18K01L3j15
6131H2k28M10j40k09K02n8N2O7k08j15J70j27j35L67k47lK85k01K6K26K9j28N8
6154A75j25l0n6m4Qm04N09j73j01M31j51J58r8j23r3p2J37M1m6K14k7q3r2K32
$$ y = [66, 98, 69, 16, 124, 156, -90, 12, -63, 171, -20, 94, 110, -30, -138, 278, 107, 182, 84, -219, -4, -221, -29, 62, -70, -178, 394, -5, -109, 23, -19, 55, 260, 205, 167, -39, -42, -96, -3, 130, -156, -18, -44, -35, -9, -182, 154, -141, 155, 77, 86, 209, 89, 376, -100, -58, -111, -10, -16, -203, -47, -179, -136, -5, -142, -13, -70, 7, 136, -108, -50, -56, -138, 164, 261, 26, -124, -29, 77, 137, -92, 30, -203, 14, -81, -206, 36, 78, 47, 44, 383, -155, 13, 323, -57, -7, 69, -122, 79, 20, 114, 166, 201, -145, 82, -46, -89, -70, -112, -88, -202, -126, 104, -130, -246, -169, 149, 32, -57, 132, 101, 258, -160, 63, 41, -34, -6, -52, -124, -191, -303, -58, -114, 8, -92, 179, -41, -23, 169, 181, -37, 164, 197, 82, -146, 264, 124, -85, 117, 59, 111, 178, -30, -145, 25, -102, -237, 130, -117, -120, 165, -36, -10, 216, 245, 117, 175, 50, 20, -36, -80, -72, -476, 33, -140, -241, 190, 39, 197, 99, -24, -117, -189, -52, -11, -57, 157, 130, 47, -45, 187]
6178A87j75l50L77Nj15N7R5j63K77l66K25J9L0j86J58j16j6j70M38k82J88J4j60
6201b9r9J64M4%l67L47k14j1L22k39M8r2L32l62K27ml36K74j22Mk6L6K38j60P5
6226E0j38J95k40L64j92l2q0o7K5O1r9l1J35K36l15PR6M6J23n35O95j46l19N2
6250a09K4K78j57k8j36PJ25R2j18O2o8m8K27J44k00K9J05j62R9j21j6M75m68j34
6274i8p0K74k73K08m7k55K01Q3j89L52j49m0J5L7J07k56j11J70K80k75Oj80J95
6297a5r4J67k75K10K23k22j04K14J4j69J85K51k76m5l9n1O7j04J10Pk73J16J18
6320A5P4R2m05J26K12M2l42M5Q6K00O8j74j51J91l2j22J50k55J04L32k95j19P9
6343g9J20j74J64k40K50M9k10K11qo9L0o2J92j76K4N5j79K36j02L7k39N2p9J96
$$ y = [187, 12, -338, 39, 44, -71, -14, 81, -82, 195, -171, 54, 73, 103, -83, 75, -41, -57, -227, 211, -71, 117, 131, -29, -128, 36, 80, 80, -287, 60, -154, -165, 157, -82, -34, -126, 206, -156, 71, 67, -269, 5, -117, -113, -139, -103, 135, -25, 50, -88, 107, -133, 231, 39, 7, -73, -140, -115, -54, -153, -184, -49, 187, -128, -121, -25, 21, 144, -391, 304, 158, -161, -109, -85, 193, 36, 8, -128, -121, 4, 96, -22, 40, -28, -76, 151, 295, 95, 124, 229, 67, 166, 45, 29, 504, 36, -98, -168, 106, -167, 41, -6, -261, -60, 23, -166, 186, 37, -3, 12, 49, 156, -100, -211, -41, 239, -36, -30, -210, -15, -109, 58, -217, -7, 216, -6, -110, 104, 118, -51, 134, 385, 109, 64, 25, -26, 41, -63, 47, 54, -219, -103, 15, 89, 181, -224, -98, 114, 156, -186, -141, -55, 145, 213, 39, -112, 79, 47, -75, 75, -180, -76, 256, -39, -158, -79, 41, -133, 31, -209, 41, 90, -120, 91, 83, 14, 44, -18, 174, -2, 22, 77, -102, 134, 32, 69, -170, -118, -197, -1]
6367aN1j59K11J41j24k56P8P6j68J98j18j29K1J45J96j66j77K56l31K05l02K45
6389a08q7K09P7K0O0k18P1M9J65n9k73J89n8J13j69J08l7j00Q6L40n28K88k39
6412a01k6P5j56J30K34j93J67J6j99P6n5j59K26K1l44M11j93J92k50K86j91Jj23
6435a55K58L9j54J11k21K22J77j20Q9j99%P2J41m26K60r8m4L5K43l81K67j36N2
6458C2l3o3K16r0k59L62mk22K92j74J12j74o8j05K18J08l22K86j20J25n7K3j19
6481c6p2M0M27m73J69K27j06o6j16J64j40k33K77j24J5Q2j33j8j6q4K54j05O6
6504aK4q4KLOK03j43O9L7k32K53l97L02m04L52N6k55K86jq6nq6M9J86n3m4j09
6531g2J99M2J3l80J01l3l12N83j90j12J90n7k91J84R6J05j4l04K54m4l7O6R2J70
$$ y = [-1, 50, -109, 102, 243, 119, -137, -59, 17, -151, 47, -71, -200, -179, -34, 162, -4, -181, 75, -256, -51, -353, -108, -195, 14, 91, 111, 171, -47, 24, 73, 238, 179, -94, 95, 37, 150, -19, 89, 52, -48, 38, 378, -150, 138, -101, -127, -52, -208, -78, 156, -37, 130, 146, -53, 23, -32, -191, 35, 56, -288, 123, -70, 122, -128, 158, -33, -32, -155, 103, 142, -12, 99, -122, 100, 277, 157, 246, 47, 47, 119, 260, -166, 94, -4, -48, -13, 230, -151, 116, -20, 32, -1, -64, 152, 62, -197, 165, 161, -61, 231, 57, 169, -5, -73, -178, 40, 148, -174, 112, -8, 117, 60, 83, -36, -108, -68, 359, -114, 55, 282, 176, 110, -6, 158, 18, -215, 62, -62, -47, 35, -98, -116, -132, -216, 38, -67, -1, 23, -61, -59, -56, -50, 153, 10, 79, 116, -116, 137, -260, 42, -362, -10, 46, -209, 77, 76, -10, -15, -101, -52, 134, 81, 37, -72, 127, 169, 182, -198, -97, -130, -442, 141, -49, -161, 29, -28, -319, -135, -39, 66, 52, -252, 2, -42, -79, -13, 79, 249]
6555B49j88r7Q4J97k31J57j38k65J56L10n12K61q9L22j46k26L22N5j25n0K41l03
6577a6J6j2j8J4l47K72QJ01J95K02m96J5j26k6L72J00o5p1j04k50M36J22m30J55
6601D7j78J64j45L7M35k52j68Rr9O18o51J23K21j86r3K39j17j27J22j60J4j15
6623b62j50K76n4j2J42R4m33L97k43j91P62k62m9m0K8o7j03P7J23J75O8m44M88
6646C20r6k83J57o3Q0n10M45k04P4J20l51M65j03O8k71L12j60rJ40k49j52N0K03
6669a7J0K33k67J26j51N1L0j18J66J46j27O2j85K00l33J73%q9J35J47k12l15N27
6692A92j85J09j78J16k73N9L81l48n2L08r1Q2o1l9j08K27M9P4j33R4l16K62N9
6715B28q2n9j24P3p8J9J8j68K41j40Q7K04j3k63K06r7J31j47j51J06N4l6J98m06
$$ y = [249, 61, -36, 48, 245, 14, 171, 33, -232, -76, 234, -278, -17, -106, 216, 70, -156, 166, 221, 96, 46, 287, -16, 0, -12, -30, -16, -363, -91, -83, 18, 213, 415, -81, -66, -192, -218, 154, 254, 189, 118, 14, -236, 200, 322, -108, 47, -131, 33, -112, -75, 360, 108, -60, -51, -150, 468, -183, -60, 161, -25, -118, 121, 4, -123, -1, -161, -147, -262, -412, -136, -190, -202, -60, 34, -399, -2, -245, -436, 326, 64, 15, -25, 3, -64, -167, -90, 33, 208, 276, -168, 320, 224, -59, 98, 35, 115, -395, 50, -154, -80, 40, -311, 154, 51, 119, -152, 160, 0, -9, 131, -118, -270, -220, -17, -7, 226, -41, 85, -66, -15, 15, -103, 63, 209, 82, 144, -41, 159, -174, -1, -1, -90, 45, 192, -20, -335, 192, 7, 116, -62, 54, -219, -160, 221, -127, -179, 129, 38, 120, 59, 20, -88, 139, 188, 262, 129, 223, -93, 169, 228, 146, 87, -37, 36, -42, -23, -5, -173, 68, -72, 15, 219, 206, -57, 149, 52, 183, 36, -115, -9, 45, 9, 207, -199]
6739a99M6K74o3k33K56k43p9K77o8J0J94l6K2J7j44j7o3nK2k97M88k00k96M93
6763A56K1k08k2N03l44j87N0k4L53l61J40l46J80PL5J41j48K02k96M58m91j58
6785c39M23j62O8k00K60L7q0K55l46L43k88J08j2l29L44M5j06L3j7n4J79j90O4
6808C6k57J97k50J35R1L5l2j14K25o6k25K74j33J12j88J01P1k90K64J80j62q5
6830h1r7j00L01M2o2o0J72K8m8j53r6J68j43K26K93m99K42j49j12PL35r0%n4n5
6855A5J83k65l8K50j13J32k31J42L3k34J48J89k92N7M8o2j03L16j55K01j12k30
6877a21Q9o5L0L84l59j15J55K1Q2k15MLN7N2j1k5n0M65n31Q4K33k77K71p5j16
6902c0j28R0K82Kk48j60M4O4N1J05k2N4j61J88Q0m87K36r2j34K34j00N2Q5j08
$$ y = [-199, -153, 121, 58, -175, 81, -162, -241, 36, -32, -22, 172, 136, 158, 175, 31, 14, -49, -54, -32, -329, 159, -41, -337, 156, 177, -31, -53, 450, 106, -81, -31, -55, 298, -63, 77, -269, -89, -82, -47, 94, -54, 148, -148, 310, -181, -339, 84, -78, -10, -210, 50, 87, 7, 262, -84, 259, -29, 79, 67, -262, 82, 127, 21, 54, 37, -17, 162, -28, 36, -221, -24, -274, -139, -48, -13, -45, -159, 66, 0, -225, 49, -84, 28, -160, -59, 12, -278, -14, 166, 4, -81, -178, -278, 23, 65, 3, -57, 115, 143, 95, -58, -154, 14, -129, 97, 390, -109, 133, -16, -128, -121, 214, 124, 124, 70, 15, 198, -67, -105, 145, 32, 164, -67, 75, 108, -126, 22, 211, -81, -24, 24, -38, -141, 175, 20, 221, 109, -121, -32, -97, -67, 317, -42, -157, -2, 19, 101, -114, -110, -107, -50, 2, -9, -34, -84, 381, -150, -66, 167, -110, 161, 86, -30, -158, -68, 214, 216, -32, -192, -148, -84, -33, 72, 50, 104, -57, 131, 211, -276, -40, -132, -266, -32, -132, -80, 5, -103]
6926a03j39K59l1J54J5J8nJ30j20k39J20k94K89l9l04N18k50j54J18R4l5K89n72
6949b81J95O1j25J30k18J45L67k4k43M03m06j03M47k39j05J28k03j1L31m09Q4
6970g6pJ20j67L14P6l66K77m4k97K48k74m0L73j61jl11M05k50J2K13j00l5K84
6993A93l13J97J83m78J94k01K75p0j16j78M76k38p7L5O6r2J05J65j39j50K7P2
7015f4J47J38j65l66J67J05j84L52M2l33O1J6J33JL5k5o5J01n5r3J37l53L68r
7039I1j3k07L97m34K62R6j80k68N9p8K87j68J26N1O4m34K55J58k20M17j23K03
7061C41k23q6q2N5Q2Nj64j02L33m7j46K52l52j62K05j30K08J11o4L39l71R2J04
7084A98l2k35J18o6J17n0j29j4Q5m9m5l1j31L82j00K5l18K02O1kj62K10J69m52
$$ y = [-103, -242, 17, -14, 140, 155, 173, 168, 298, 178, -61, 59, -235, 54, 15, -289, 229, -21, -175, -57, 37, 2, 291, -281, -86, -25, -150, -20, -238, -93, 274, 250, 7, 410, 4, -99, 348, 109, 4, 132, -71, -82, 249, -160, -76, -83, 37, -130, 184, 260, -106, 171, 127, -170, 78, -196, -236, 137, -24, -25, -336, 69, -181, -169, 44, -56, -91, 193, -120, 77, 260, -218, -24, -225, 50, -20, -136, -314, 162, -76, -153, -118, -52, -144, -39, 126, -13, -163, -136, -64, 83, 221, 56, -310, -143, -38, -222, 130, 172, -161, -100, -84, 49, 50, 85, 60, -5, 96, 41, -52, 85, -268, 100, 91, 78, -129, 268, -166, 96, 192, 12, -256, -197, -275, 12, -156, -30, 21, 85, -349, -94, 64, -156, 261, 138, 341, 118, 32, -50, 5, 87, 92, -72, -174, 159, 112, -34, 218, -134, -296, -91, -221, -13, 98, 34, 373, 2, 94, 198, 166, -69, 49, -17, 100, 50, -79, -93, -8, -57, -102, -133, -264, 118, 18, 43, -275, -73, -12, -14, -176, 34, 203, -249]
7108b49K96j92Q3J33m2J3n0J63k59L10k29M45o83K18j4o3K08K93p22J29K00KM4
7131C4N3K66l60j32J20M9m4R5k25K24k56K31J01j05k9j38K0J28jP2j29J4J26J49
7155B63k90K39k94j08R4J14Q0k35K12R1l09K25l90L89M3j56j18J33K32k02J43
7176A56Kn5O2r7O3l73K51M1O9k97L16l74K90M3J06k29o4J16m6J97j28K95n53L66
7200A57j61l7L09j83J09k60K88l92J73k40J1M09k85O2K91l92K11j13K23k71J92
7221A01o2l03N37l98J79J85j70Q4m39N19j51pm9n0r5J00k3K15m1j96K11k24K90
7244B13o2k46j4J71Q5m3j12K15l96K31j77J3L50m48J19%L2P6R4j90o6P7p8L66
7268B10m5j12pk26M33j15k1l43R6J67ql3l5j5jK10J1l44L80j6l05J62k01R9l0
$$ y = [-249, 47, -145, -62, 71, 29, 42, -8, 155, -104, 206, -23, 422, -261, -43, -57, -120, 88, 381, -341, -212, -12, -10, 34, 87, 353, -7, -139, -19, 30, -14, 81, -144, 80, -176, 55, 156, 51, 22, -116, -96, 32, 31, 103, -26, -12, 114, 263, -27, 212, -82, -190, -96, 18, 98, -137, 75, 166, -143, 82, -308, 81, 124, -32, -150, -17, 215, 13, 156, 158, 103, 165, 68, 131, -242, 9, 50, 119, -178, 138, -236, 54, 97, 203, -26, -90, 26, -20, 177, 49, 344, -209, 157, -4, -41, 268, 85, 194, -66, 222, -170, 3, -237, -226, 183, -102, -40, 251, -141, 70, -43, 180, -91, 101, 39, -264, 273, -125, 54, 239, 69, 153, -286, 233, 82, 75, 26, -24, -119, -19, -42, 173, 132, -64, 147, -77, 213, 151, -95, -109, 62, 147, 104, -8, 207, -189, 42, -135, -122, 228, -220, -101, -101, -69, 7, 101, -89, -155, -78, -156, 210, 165, 53, 46, -180, 253, 138, 117, -226, -130, 37, 29, -4, -39, -54, -55, 155, 166, -178, 202, 186, -119, 43, -158, -59, -89]
7293h9k6K67j74J66j77J37l61L95k24K46o1o3O1J68l33n0j3K6K01KL4l35K48j50
7317a05P5Mo8J78j2O0k92J20K47k76oq8J47j18J27J14K5J27k11K01o69K51J43
7340b6J29m8k18K57j64N8m8N2k25N39l24q2J39J9J4k5J7j95L10j12q3k53J35J73
7364C9j53qK15j85J84p4j03k8M6L71l64K48R0n1m8l06Q6R8j66J06N3j72j3j20
7388b55M05j20p0J24k83J87Q4R3j70j57pk0J40O6K44l50J20n5J17n5k47L27q2
7411C6o8J93j31J98m17K08J6j48L13j96L1p7K87j43L01l61p1K08k88J86l5j59
7433a17J69R0j40M3j7J08j5k29M13k94K31k32o0J34J23j12l08M69j44J34j93j62
7455a09j47O1J19L5J21K8j54L9N1lQ2oJ8j62mN1j73K08l32J46M8M9N9q8K24k61
$$ y = [-89, -115, 152, -22, 144, -33, 104, -257, 138, -86, 160, 99, 36, 97, 265, -68, -118, -131, -105, 96, 98, 132, -203, 45, -105, -30, -26, -94, 84, 72, 132, -160, -40, 207, -69, -75, -163, -16, -134, -7, 107, 132, 259, 48, 249, -420, -169, -26, 103, 55, -163, 94, -70, -12, -60, -8, -233, 306, -18, -100, 39, 58, 72, 47, 64, -131, 179, 67, -16, -269, -134, 39, -114, -122, 93, -92, 92, 18, -85, -113, -67, 304, -60, 188, 278, 227, 179, -127, -41, 57, -109, -3, 50, -122, -135, -255, 150, 30, -40, 84, -199, -12, 72, 165, -5, -162, -169, -189, -49, 17, 261, -89, 31, -24, 93, 38, -209, 118, 36, -32, 161, 30, 228, -189, 19, 35, -113, 200, 4, 35, -42, 245, 102, 403, 42, -29, 179, -109, 77, 42, -117, 52, 142, 2, 45, 28, 136, 121, -108, 305, 11, 242, 10, -50, 84, 207, 95, -213, 256, 112, 246, 53, -109, -256, -195, -76, -41, 80, 108, -46, -7, 44, 41, 123, 117, 135, -27, -31, 20, -153, 55, -277, -131, -83, -34, 25, -63, 161, -100]
7481a00L4j1j02K43l71N27k25j72J22K40j60K2q0o0nK87j72O3J38j37mj94K27
7504A10j70P8n0Q4p9j2O5n3J0K28Q9l02M5Rj52j03J17J60O4k40K16J37n32K69
7528a2J68j60PJ61m27J69J19J04j09K32k30J75k87o6K87l28J87j13j9K23R0m10
7550b39K15K72k47K48k46J53j21M1o6J62k04n1p0J52K9k47J35J46k35L82k51o4
7572a06J93K21p10K93O2J15j10J2J56j67l17J53K16j70M3L86l09j14j2n0L39j89
7594f5K20j00j15L1n4J64J86n35O0L02Q1k20J32J61m06L22k85J73n9L3l3M6J79
7617B18l46K09r9O2r7J5r8K63j94K2%K19k50q1J18J97j01Qk92K27J7l28L31M9
7641F9n8Rp0R7m6K65l05J82J17m63nJ73M94m29k87R8K50j5k9j47J2Q5J32j55K40
$$ y = [-100, -66, -77, -179, 64, -307, 220, -5, -177, -55, 185, 25, 47, -33, -93, -98, 189, 17, 80, 218, 81, 77, -117, 110, -60, 18, -32, 52, -27, -39, 26, -27, -17, 211, 300, -2, 43, 52, -100, -203, -86, 74, 138, -102, 114, 251, -281, -12, 156, -4, 3, 164, -263, -94, 25, 129, 20, 252, 22, 197, -90, -156, 131, -197, -10, -123, -142, 81, 171, -239, -24, 248, 1, 249, 3, 156, 35, 76, 10, 172, -32, -83, -153, -1, 28, -219, -84, 62, -173, 209, -42, -106, 87, 308, -402, -109, -47, 68, -42, -30, 126, -41, -358, -205, 11, -159, -116, 270, -39, -153, -165, -215, 124, -65, 155, 55, -60, -29, -83, 81, 267, -268, -208, 94, 175, -45, 87, 248, -158, 164, -121, 52, -7, 26, -7, 39, 218, -128, 81, -18, 44, -53, -38, -136, 127, -67, -45, -45, 174, -76, -157, -39, 158, 57, 65, -227, 0, 17, -311, 20, 69, 11, 20, -50, 47, 1, 266, -39, 143, 260, -203, -208, -35, 459, 30, -257, -159, 91, 76, 47, -100, -88, -3, 129, -26, 214]
7666B14O5l67O4R5O9L5k19n5M7K13j98k00n3L35K33m06j31K04k6K87l01o1J95
7689C9J2N5l96L17k57K26K50l65J16J0j82K85Jj45r6m4K83k2r9j2J45j7k34J14
7713a6L01l90K2K66l53J27K08j85j7K33q0P5q4n9m5l0M13o4l54J78r4q4j9N9j7
7738iK64j70N0k3j87o9J40j75J52J89k20p0No5K31o9P6j93J75O9R6l30K38J02
7762B07j47M5k88J96NR1k08K6K51l5k18J10q8K2q4L77k80r9L57o0j10k86J19j08
7786b05K79j04jO0p9M3J33k71j7P7J92j89N2J77q2k80R3k46L91N9m8j27J17j55
7810a31r4J79J05j05J2j8M2j51j55M15r9J91j74k99M10k93O6mQ5j44K86Q0j33
7833G1j51K07K3j53O8j69q7MK39j42j19K82o6r6J59K42j98O2l1k51N5J00J23k24
$$ y = [214, 279, -88, -24, 71, 140, 175, -44, -99, -52, 161, -37, -237, -290, 45, 278, -128, -259, -55, -81, 206, -95, -156, 39, 51, 106, -290, 27, -230, -4, 246, -119, -3, 7, -175, 110, 111, -34, -130, -174, 109, 87, -12, -24, 121, 104, -130, -16, 285, -105, -83, 183, -170, -43, 165, -20, -37, 196, 116, 191, 107, 48, 3, -27, 386, 322, -32, 146, 52, -32, -51, 8, -9, 255, 85, 135, 112, -75, -144, -4, -179, -27, 162, -58, -128, -123, -188, 43, -26, 50, -143, 32, 101, 197, -133, 105, 207, 60, 105, -183, 13, 18, 109, -99, -73, 178, 143, -75, 35, -53, -31, -115, 262, -18, -117, 240, 180, 70, -216, -97, -205, 74, -30, -31, 29, -50, -7, 126, -145, -162, -85, 107, -82, -30, 147, 65, -215, -122, -368, 23, 82, 34, -93, 24, -131, -225, -46, 59, -46, -34, -52, -10, -161, -316, 99, 0, 191, 17, -282, 128, -165, -99, -103, -18, -162, 124, 204, 71, -80, 127, 150, -3, 65, -104, -191, -187, 52, -90, -209, 73, 7, -89, 70, 312, 114, 176, 145, -106, -51, 49, 172, -52]
7857e2lK16l64L24j77K1L10m32N7J49M9k72L22j78J3K44n1r0j89J70q2J12k46
7880a49R8J79l72J58J26k2j3k1R0m43M30J96l78L7J91r5L81n00J01k8k8J12m1
7903IP4k7j06j84L08l19J76K27Q4l82k3L69k59Nj95K52M6P1k6k90J43L7J51o5
7927G6j06m35O54l39K54j67J30n6l2K05l77R9L01k40K40k88k14K77O6Mj39l8K62
7950A37J7l9n6n3K6J27K97l96K28l39L2o9J24o8K11k46P9j37R2J62k26n9L11k59
7974a04K89p7K1j79J95l7Q2j5K9j16j2o7N0j19j59L17j54N1o3j32J35m9j57O22
7998C51k91l14J43L1K43l28J39M57l42j00J31k63k00N04k2J30n26J41K04n2k77
8019b41L74j71J39j7j00P2j12J45ln5k60K07j60k8R3j78L23j08J93Q6q9j77K30
$$ y = [-52, -55, 161, -203, 121, -56, -35, 275, -157, -100, 49, 98, -174, 148, -30, -17, 227, 176, 86, -103, 67, -15, 97, -149, -51, 128, -244, -86, 40, 18, 5, -16, 74, -369, 61, 257, -121, -84, 107, 12, 393, -107, -6, -34, -62, 50, 9, 83, 56, -50, -234, 74, -245, -69, 158, 242, -140, -163, 206, -53, -48, -243, 9, 55, 126, 100, -190, -47, -10, 141, 76, -30, -465, 189, -150, 104, -63, 67, 11, -21, 184, -193, -94, 207, -33, 207, -81, -295, -18, 48, 52, -87, -125, 137, 154, 115, 59, 6, 32, 159, 456, 60, 288, -51, -19, -88, 36, -32, 179, -67, 12, -125, -33, 129, -97, -156, 155, -104, 185, 108, 129, -50, 145, 108, 190, 175, 204, 88, 76, 9, 59, -60, -219, 98, -56, -5, -68, -200, -65, -114, -271, 351, 60, -254, -111, -80, 163, -165, -26, 431, 89, -11, 120, -143, -343, 161, 139, 269, -257, -116, 88, 36, -241, 133, -38, 101, 84, -16, 56, -56, 89, 86, 31, -229, -22, -182, -210, -117, -295, 28, -80, 113, 199, 110, -67, 163]
8042A63k51N5J34j68Q5J26J72j96pj89N4J98k08L2N0j1j06l2K06j70K09j55k6
8065c5q9N2J72j15q3L2P8J51n4k23K37P3l05M3j83L98p3k88J89m0M1oK23q7l7
8090G1j07k24N48m08n1J13K21n0k20r5J99n6q4J20r0J22j43l4K2J2l9J87Q7j45
8114d4O2l8r0K33j35j80K22J20k00p9J00J24k4j52m1L35l43J80l5k7J06j54J35
8137G5J0J3k07J06P1N0O7j19Rm8j64K63r3N4j6J06L8k02k81J69J64q1j65R8Q7
8162Dk21J31K86j03j73K82j50m07O01k99J80j8l2j85J5Q6K0J66o3j66l6J75q0
8185A3n2N8j59P1N3j8
$$ y = [163, -88, -33, 101, -67, 18, 144, 316, 120, 113, -76, -22, 176, -32, 0, 50, 39, -67, -99, 107, -63, 146, -9, -35, -124, -72, 100, -15, -98, -66, 12, 163, 109, -114, 123, 196, -109, -66, -249, 149, 76, -212, -23, -63, -22, -28, 195, 108, 71, -36, -260, 288, -120, -171, -58, 163, 113, -107, -202, -3, -59, -143, -23, -113, 9, -134, -168, -146, -134, -173, 14, 101, -44, 18, -20, -110, 123, -12, -192, 30, 150, -50, -129, -29, 95, 71, -81, -122, 213, -130, 50, 15, -12, 94, -60, 75, 85, 98, -109, -3, 68, 118, 185, 66, 75, 27, -137, 126, 33, 87, 71, 177, 215, 13, -268, -99, 65, -16, -181, -83, 4, -217, -86, 200, 97, -76, 206, 56, -351, 250, -49, 131, 113, 81, -104, -89, -3, 17, 183, 120, -46, -82, 93, 13, -39, 19, -140, -69, -16, -34]
8191c4
$$ Imaginary data points
##PAGE= N=2
##DATA TABLE= (X++(I..I)), XYDATA
0@%%%%%%%qQqJ6j6K4l2M0m8N6p2Q8j12J37j61J92k31K72l13L67m30M95n67O51
31C48p44Q47r61J085j223J378j549J734j934K154k396K659k946L262l608L984
47B090m394M844n339N882o476P134p869Q689r610J0652j1843J3216j4823J6733
61H886j9046K1921k5603L0511l7420M7942o6091J05918l48639K80017O47235o03787
73D1844n08700K00451N14059m4684k38937n3339O938m6120K52639J65349k90663
84a163l54710K21943M72157n7907n15672n7758L86665J41367j99569j42068J9447
95h7268P7702O4105P8617q0729k18323N7303K95417p541k65811n4517K02122P5841
107A36918j45753k9557J03528q4120q4487J74154R0513k19655j49432K16169K17669
$$ y = [0, 0, 0, 0, 0, 0, 0, 0, -8, 0, -8, 8, -8, 16, -16, 24, -24, 32, -40, 48, -64, 73, -88, 104, -127, 145, -168, 199, -231, 264, -303, 348, -396, 451, -510, 575, -648, 730, -819, 915, -1019, 1135, -1261, 1398, -1548, 1714, -1894, 2090, -2304, 2540, -2799, 3083, -3393, 3741, -4128, 4561, -5049, 5603, -6240, 6976, -7847, 8886, -10160, 11761, -13842, 16669, -20751, 27191, -38900, 67018, -281621, -1604, 645631, 41844, -466856, -266405, 247654, 202970, -35967, -89306, -82368, -128488, 124151, 289500, -1163, -355873, -133930, 338227, 280320, -235352, -293110, 93555, 234922, 35353, -106715, -87268, -9566, 54539, 133156, 52427, -165896, -108593, 186824, 179283, -86528, -141045, 61077, 136918, -8835, -38392, 65136, -18984, -103471, 70683, 161196, -58459, -207891, 8278, 225947]
118B25947k04393k41301J83025K06469j50572j40390J36620R5202j70567p4594
128a34554K41526O6171l01953q5405K99276J25079k57297j75647J91849J73934
138A42979j29461j10267P3734J7627l9996O5277O5230j05761j25542J24898J87570
149A66288j07093k00728O2025J69607r824j21575j2664O6320j7000j5315O7729
160D7770k0756j07334K7616J27160l446j24752o499J20451n103r9292M3275Q5057
172H4147p2484r1757Q4956J18110q8032j46882P2508J39890n0508j09559K4078
183c5533O5988k6014k8676O4813L763j15549N250J53938K0624j62072o6156J46622
195B6998J00147j13515j00854N6246O0907p060j4534j7857m2072n784R0402N1814
$$ y = [225947, 21554, -219747, -36722, 169747, 19175, -121215, 15405, 110607, -59960, -134554, 106972, 173143, -128810, -214215, 85061, 210140, -47157, -222804, -30955, 142979, 13518, -96749, -23015, -5388, -45384, 19893, 85123, -20638, -146180, -21282, 166288, 59195, -141533, -79508, 90099, 80275, -41300, -53964, 12356, -4644, -19959, 47770, 27014, -80320, -52704, 74456, 71010, -53742, -60241, 60210, 55107, -44185, -910, 84147, 11663, -80094, 4862, 122972, 34940, -111942, -39434, 100456, 49948, -59611, -35533, 30455, 4441, -24235, 40578, 44341, -71208, -65958, 87980, 108604, -53468, -119624, 26998, 127145, 13630, -87224, -30978, 29929, 22869, 8335, -9522, -51594, -57378, 33024, 84838]
207H4838j19495r3884J11251J24708o0925j34731J0621J24406K2346p8616k6477
218c5958J2182J3561L8510J3035n7132o1593M4593J08904k7300j29653O848J13709
230C9706K3255p5647m0896N2042L7038l1123J730J5562l5889l645N0323J3044
242D5500n0752m2630N0859N6753n5919m9075M3553K8810k3953j9630J8112K0506
254B2134l1309q168N0666q899m7618J7326L5862o352l5820m926M3428q272m6187
267b8135K1980K7397k7250j7463J4291K4007j2831l6159K7528L2452l3830j3625
279b1638K6282P510j1275j4438J6347J6093l4118q99L6961j8450k9347J4414K2825
292A0267j401l5716j973M6648o863l5354J3403J6296J209m452o899J2789l898
$$ y = [84838, -34657, -128541, -17290, 107418, 46493, -88238, -77617, 46789, 69135, -9481, -35958, -23776, -10215, 28295, 41330, -15802, -77395, -32802, 76102, 48802, -80851, -74003, 39706, 62961, -12686, -53582, -1540, 35498, 4375, 6105, 21667, -14222, -17867, 32456, 45500, -5252, -47882, 2977, 59730, 3811, -45264, -1711, 27099, 3146, -16484, 1628, 22134, -9175, -17343, 33323, 24424, -23194, -5868, 29994, 23642, -12178, -17104, 26324, 18052, -28135, -6155, 21242, -6008, -23471, -9180, 14827, 1996, -34163, -6635, 25817, -8013, -21638, 4644, 12154, 879, -13559, 2788, 18881, -15237, -16136, 20825, 2375, -26972, -12558, 10267, 8866, -26850, -28823, 17825, 10962, -24392, -10989, 5307, 6516, 2064, -4835, 7954, 4056]
305D056j2265K6739n83l5238O712K5631M010k3696k3965L0480K4392l3329r885
318a6941J8790J953J576k635j2M235j2312J2772K0288k6797j4060K2864Q942q737
332I926k0638k44K6681q915k0618J0779K438l778L984k391L450n271m072K1527
346A2858k821k3005R855J5273k788j1609r874J4769Q566j8725j012O442o875N139
360c807K137n381j009l669J1447J0729j8119n200J5959N453k257r982j762J3479
374H018l118n817N087q012m135R790K570m373j0885j775J9248K131j4109r43M391
389a932Q381N697q955m035J682L725J1248m679j7012j11R555R019l853k0155k812
404a4237J5284Q321j754j6286j0058J7610J8164l759j9867j2411K0914K3185j2424
$$ y = [4056, -8209, 18530, 17947, -17291, -10579, 15052, 19062, -4634, -28599, 1881, 26273, -7056, -16941, 1849, 3802, 5378, 2743, 2731, 6966, -5346, 7426, 27714, 917, -13143, 9721, 18663, 9926, -10712, -10956, 15725, 6810, -13808, -3029, -591, -4369, -385, -2776, 674, -4597, -8669, 12858, 10037, -12968, -3113, 12160, 9372, -2237, -12111, 2658, 11224, -7501, -8513, -2071, -8946, -3807, -1670, -7051, -8060, -11729, -282, 10447, -7672, -12872, 3087, 8540, 6283, -3699, -5461, 8018, 4900, -917, 4170, -3842, -7977, 1813, 4383, 10, -10875, -12650, 6598, 8729, -5380, -6323, -1932, 6449, 12146, 3191, -844, 838, 4563, 15811, 11132, -5880, -5991, 3564, 12583, 8730, -11425, -14237, 1047, 9368, 7614, -8672, -18730, -1120, 17044, 13285, -6582, -18993, 1921, 25106, 12682]
417A2682k0933n219J2311J7267m875j7087j0320O15K0999J3242k2067k3895N830
430b1450L0245J8214k8759l0042J7998L1768N979k2870k2687J2398K1817K858
442A5469p306j9497j0467K0011J8604m111k4823k0906K4092L4439r587l1485j3400
455b8967K4905L5194j2759l3515l09J8592J7814l045k2686n327O254P625J4571
468A8347r148k7287k792K2144K4857j1401m4809J649M6702J3364k7976k9433J1184
481a4599L8302p71k4698m234p62O484J4976j671j3774k1931O38M3147J0057m7277
495a6113k5140K8083M4713k699n4159j1578M2273K1514j0351k5019j3990J9140
507c326J7626K973p405l0954p909L6969K2415j8693m3335j0860N3488L2921m0329
$$ y = [12682, -8251, -13470, -1159, 16108, 11233, -5854, -16174, -15559, 5440, 18682, -3385, -27280, -21450, 8795, 27009, -1750, -31792, -13794, 17974, 23953, 1083, -21604, -9206, 12611, 15469, 8163, -11334, -21801, -1790, 16814, 12703, -12120, -33026, -8934, 25505, 15918, -15567, -28967, -4062, 31132, 18373, -15142, -15451, 3141, 20955, 17910, -4776, -10103, -3849, 3776, 18347, 9199, -18088, -20880, 1264, 26121, 14720, -30089, -28440, 18262, 31626, 3650, -25783, -14599, 23703, 22932, -1766, -6000, -6762, -278, 14698, 13027, -747, -22678, -22040, 21107, 31164, -16113, -41253, -13170, 31543, 28844, -25315, -36893, 5380, 26894, 16543, -8476, -22466, -3326, 14300, 17273, 9868, -21086, -28995, 7974, 30389, 11696, -31639, -42499, 10989, 43910, 3581]
520C581m2158Q775M7017K3883l9489l0709J8344K2580R981q606k2381n283O323
533h142J9283J9854k9785m0676J9252M5991Q913m5153l6725L9428M5538j9755
545A8023l3029m265J9942J8690p619q381l147j5586J0920L1069p367l4685j7282
558c2717K9260M0590k2811m8616P366L6850J6074k0506k9226Q516K5354L918l972
571A0080j2795j2774J1253J6980O409j4400l0734O258L8833O785l1694k9727J5142
584b0384M5616M62m2704j4216K5104K8713m089k9277n669J6416Q933O118o054
597H969k0443n237J7865K2752q100l9986n535M0145J7635k6211k8848Q623L3440
610A5069L294k1755o385N133P652P879j310o557j0629j341K0806P673k1321j5810
$$ y = [3581, -38577, -29802, 17215, 41098, 1609, -29100, -10756, 11824, 21805, 13199, -9182, -14465, -8142, 11141, 30995, 1210, -39466, -20214, 25777, 34690, -10463, -47188, -7760, 37778, 18023, -15006, -19271, 671, 19361, 11742, 3361, 214, -15372, -4452, 26617, 19250, -15435, -32717, -3457, 37133, 14322, -34294, -26928, 9922, 25996, 5490, -23736, -15220, 10134, 14052, 10080, -2715, -15489, -4236, 12744, 19153, 4753, -25981, -19723, 19110, 25895, -5799, -35526, -20384, 25232, 25694, -17010, -31226, -6122, 22591, 18502, -10775, -16444, -28, 8905, 15023, 8969, -11474, -16711, 1154, 23906, 15806, -24180, -29715, 10430, 28065, 1854, -26994, -18371, 15069, 18363, -3392, -9777, -4644, 3008, 10887, 9577, 3020, -7609, -8950, 11856, 19529, -1792, -17602]
624a7602Q785K0647K542k1874r920J3351J0918M58r293o676O266O022K244R23
638F791p198n408M754Q346M183j1365j4162Q643J5067j250j4128j0767J1177J4725
652I408n696j1163j549N541R305R1n622l528k291Q701J0511r371j3276J375J2429
667D865Q018j3080j4288Q552J1329m91o866q756N631R670j321j904m209k273Q862
682C739L817l002l639n027N324P969n904n728j330P30P434j567q121P60J737L073
698B65L855o695r15M246J61M000pp535K791K981M38J914p549k672O584p89n37
715E36k275o347N852M164l336L95m218Q02J0118k470m567L39p78P101J958j0278
731c004J104K335Q48L742p686m770P383L75n81j577o245P202M929n541P72j036
$$ y = [-17602, -8817, 11830, 14372, -7502, -17422, -4071, 6847, 7305, -1988, -8664, -2398, 3624, 5868, 6791, -407, -5815, -1061, 7285, 11468, 103, -14059, -5416, 9651, 8401, -5727, -16494, -5317, 9408, 3712, -7451, -9000, -3459, 5846, 5937, 315, -3213, -5504, 3197, 13708, 4337, -8939, -7564, 4865, 12883, -197, -14485, -5933, 5396, 4905, -1961, -10717, -5086, 4584, 3263, 1359, -2850, -5123, 3739, 7556, 4554, 915, -4112, 1212, 9181, 3277, -2451, -3781, -3051, 4383, 2816, -5305, -4545, -2808, 265, 4120, -2575, -3490, 756, 917, 4917, 4910, -2625, 166, 3147, 3585, 5499, -2050, -4722, 1862, 1073, 536, -1739, -8086, -2234, 1930, -1406, -1011, -5229, -4427, 5691, 3221, -1346, -1007, -1785, 5316, 7274, -3004, -1900, 435, 1283, 5025, -2661, -7431, -48, 327, -254, -1831, -8076, -874, 4055, -1486, -714, -1750]
747a750J152P345m279m330M084j204L127M61q535L076L300l023J285m285j278
762d854P304l098k526L131k569L528L102n435K264J185j022M729m428l674O077
777C714j829j111l59n178M113K904n378R81l66m83N468l380k652M412j295K528
793B089J985n952K469K837k522J326k911j848N543l165k457J574k907K838J538
808D37m905K609J557j582L640j733j263M128j926R27J418m452K360J698l208J011
824G16j562j708L697k490j508K009k180J716K594l073J633M93m74M300k468k357
840f62L195m54K86P6l433R11O65j407J822k815k894L876J255q70j649j632M574
857H44K382l306J0N45O49K406j189k049n83o88L325R41o119j442K574K805K62
$$ y = [-1750, -598, 6747, 2468, -1862, 2222, 1018, 4145, 4606, -3929, -853, 2447, -576, 709, -3576, -4854, 2450, -648, -3174, -43, -2612, 916, 4018, -1417, 847, 2032, 1010, 5739, 1311, -2363, 3714, 1885, 774, 415, -4763, -650, 2254, -3124, -2143, -2509, -2992, 2476, -904, -3556, 856, -439, 2089, 4074, -1878, 591, 3428, 906, 2232, -679, -2527, 3016, -149, -2606, -1032, -3939, -1101, 437, -4468, -1859, -302, -1884, 1756, 23, -1240, 2888, 962, 1889, 3307, -1145, 1215, 2913, -295, 716, -846, -2554, 1143, -1347, -2855, -846, -3026, -1310, 1284, -1789, -156, 337, -137, 4163, 1695, -662, 2533, 2079, 2365, 2441, -992, -81, 584, -823, 999, -1816, -4710, -834, 421, -449, -2098, -3730, 844, 3226, -80, -70, 475, 1124, 3530, 2341, 292, -291, -979, 2346, 3287, -2832, -4274, -1700, 1105, 1367]
874A367n358j315M742J165O57o91l905K048N052P09k088n902J856P546k248n090
890a455j307O47L345j23k989R2l000R15Q115j634o810o81N086P460l887r222M894
907e54N379j490j042k597j156J412o10L796j209r524K507Q327K77m744o296L728
923c796J0275l026n287K51M6N771K184o695j013J39K234N140o226n149L211J69
939a772L146J201p704j095M838N239K351j1129m997J4691N108q420o275J459R543
954F184l27r475L374J902n998L067N226k377p225n515J4106R306j6478q204J1849
969e85R355k580j0991n06J1810k397n224M734k824m036J860L393M433q887r309
984a1754J0889Q058n894n961l492Q109Q908p463n566J809L010O389l205p458L737
$$ y = [1367, -3991, -5306, -564, 601, 1258, 567, -3338, -1290, 3762, 4471, 2383, -3519, -1663, 5883, 3635, -1455, -2762, -2115, 1230, 1107, -1882, -1790, -4790, -3875, 4240, 2606, -4204, -4885, 201, 7661, 3774, -5448, -554, 4825, 3335, 2293, -304, -1460, -48, -658, 3138, 1929, -7595, -5088, 3239, 3516, -1228, -7524, -3796, 6479, 3453, -1834, -1583, -1537, 4234, 6418, -277, -1290, -1151, 1083, 6223, -3, -5152, -1941, -1772, 1374, 2575, -5129, -6224, -1386, 3853, 6204, -4925, -9922, 4769, 9877, 1457, -4818, -3359, 6184, 5857, -3618, -244, 1658, -4340, -1273, 3953, 1576, -5649, -11164, 2942, 12248, -4230, -12434, -585, 8770, 6190, -4801, -5307, 6503, 4106, -1118, 3616, 792, -3244, -1384, 2009, 6442, -2445, -11754, -865, 7193, 1299, -4662, -8154, -45, 8863, 1400, -4166, -2357, 653, 7042, 3837, -3621, 116]
999A16J837j878K930k180k574k273q15J0525M60j6142l29J4811M833r495j1663
1014a1837R415J4730r532r019O915M032l572l454L944N400j1525o350J6494M028
1028I669j4724p342R688J3250p095j5313P468J1546m190l933j09K226J259l051
1042f51L763K395q970q44O924J473k986o629p01Q787J052m937k798j757P860N357
1058G338p990m507M386N693L81o534l98N881m328k096O425j157p767k287Q479
1073A519P173j1959r563J2191R654p924q427L786R695k673p385N725L907p579
1087a860q89P055K004q647n923R835O564j0474n852O493M746k177m780J687L789
1102A571l011J302M272l907k452L190L302j082n263N7N146k009k509J567j782
$$ y = [116, 1953, 75, 3005, 825, -1749, -4022, -4837, 5688, 6148, -9994, -10323, 4488, 9321, -174, -11837, -2422, 12308, 2776, -6243, 672, 4704, 1132, -2322, 1622, 7022, -4503, -10853, 5641, 9669, -5055, -12397, -2709, 10541, 3446, -11867, -4399, 7147, 2957, -976, -1085, 1141, 2400, -651, 3112, 5507, -3463, -4307, 2617, 4090, 1104, -5525, -6226, 2561, 3613, -1324, -4122, -5879, 1981, 7338, -652, -5159, -773, 4920, 5301, -1233, -1631, 4250, -78, -2174, 4251, 3094, -4673, -6960, 1519, 8692, -3267, -12830, -639, 9015, 1091, -7336, -3550, 6145, 3472, -3913, 1812, 5719, -1860, -2749, 4306, 6310, -2337, -8260, 1575, 8139, -2335, -8187, -1694, 3052, 875, -3905, -2218, 1571, -1440, -138, 4134, 227, -2225, 965, 4267, 3185, -2078, -2021, 3125, 1116, -1393, 174, -1608]
1117a608j292K068K026o96n465J153Q424j773o903K456M833ql752j69M976k731
1133A539m952N654K458o668k741L651N072m240p118O220N297n968j671M152J302
1148A987k056k370N488K476q380M12P914k073n284j081M059K622o847j146O778
1163B499l193m122M527J554j431k997J650O851l798o029O572K029l802m67J04
1178e3K795k170m125N468L77p020K605L973k033k197j149M718J916o553K534N486
1194D572m704o36K710L92m01l892K248M633o595k357N801m67l089j454J871L849
1210B481m640k631P793j093n328L159K685L0k843j790O801j041p288L782L127
1225C204l463j503O5K803k42o264M152M383n484l70L464M44k04k819K323M284
$$ y = [-1608, -2900, -832, 1194, 498, -4967, -3814, 4610, 2837, -4066, -1610, 3223, 3215, -537, -706, 4270, 1539, -3413, 2241, 4699, -1969, -4710, -1059, 4013, -227, -7345, -1125, 4172, -1796, -3467, 685, 1987, -69, -2439, 3049, 5525, -2855, -2443, 5471, 3398, -1886, -2967, 1092, 3714, -3133, -4279, 2499, -694, -4816, -289, 1265, -166, -3163, -1513, 5338, 1540, -4489, 2083, 4112, 310, -157, -53, 2742, 572, -3553, 1915, 2292, -4728, -2123, 1850, -183, -2380, -3529, 1189, 3105, -3448, -914, 4572, -132, -768, 1942, 2334, 1933, -1959, 289, 4922, -1673, -4030, 1771, 1304, -1785, -3239, -1368, 2481, -2159, -4790, 3003, 1910, -3418, -259, 2426, 2456, -387, -2177, 4624, 3583, -3705, 77, 3204, -259, -1762, -1697, 1106, 864, -5400, -1248, 3135, -2349, -2719, 745, 1189, 985, -1834, 489, 4773]
1241D773n672n95N303k319k813J057J061R88l857r89N305k805l811L956J004j178
1257e92q56J43M288j753l812M878J446m244O82Q82R56j609l219L864J184n358
1273c120J093K962j528j159o96K814J438m047J121M282k576j528K320P00r4l071
1289a089R06L592l942k238L477k39j722r02O91K696k234k089M192R2k560J688
1305C19P49P74j436j189L139J83l947J427J277j010p86q10J308kk425J809Q30
1322B10k532J069J647M83m78j379J710J689k265J02J559j352j53k07J15M53k637
1339a966P09K820k334j985J857O42N31j484k81K938p96j285K411n01j103Q51k32
1356G92J153j788k364K762L26j882j12n57O96J517k346R28P78j362K307N76j740
$$ y = [4773, -899, -1494, 3809, 1490, -1323, -266, 795, 1783, -2074, -3063, 2242, -563, -4374, -418, 586, -592, -1448, -1305, 2983, 1230, -2582, 2296, 3742, -502, 180, 1062, 2018, 409, -2810, 1054, 2238, -3120, -2027, 935, -593, -1752, -2448, 366, 1804, -2243, -1122, 3160, 584, -944, 1376, 2076, 1982, -1089, -183, 3409, -533, -2771, 706, 467, -1255, -2157, -1466, 1230, -1004, -3093, 1099, 1191, -1369, 319, 1068, 1842, 406, -783, 2356, 2539, -1408, 19, 1296, 286, -500, -1310, -2, -4, -2429, -620, 210, -2322, -1253, 394, 877, 399, -980, 730, 2419, 154, 256, 1815, 463, 310, 103, 218, 671, -1966, -1257, 1563, -771, -2756, -899, -257, 274, -1210, -1491, 1447, 651, -634, 1777, 1276, 173, 1024, 792, 1945, 157, -2207, 555, 881, -1001, -1113, -1670, -974, 543, -1803, -875, -97, -1459, 848, 1424, -316]
1373c16J035n09Q73J350k656J76J449j782P57K07k261R02n7J72O73j949p2K959
1391I51r65M2k9q53K747k04j941J253n82l13J725j787m58P50j933J573P41k565
1409a848O74k34P19K341k566j255L505J9m5n54k015L056K04k643J861p30j229
1426g40J268j030M98K5l217K336K344k145n53k24R99L260k641j803L015N2l64
1443A080K97k038J738K53k648K185K6k928J142KJ006P76m292J337L774j025j381
1460f96p60J111M092k652k862L583l80j213O1m01J330j460k511L470J011m252
1476b529j13J877K227m61m533K204M537k382j241N53O65J495k113r99K580j500
1492B67j892K039O2j7k005j568L594R40l284j10J116K114L62l186P20L164q62
$$ y = [-316, 719, 210, 1083, 2433, -223, -47, 1402, -380, 377, 584, -1677, -775, -832, -660, 13, -1936, -2008, 951, -14, 28, -1, -854, 1893, 1689, -252, 1001, 419, 106, 1831, 44, -414, 336, -1597, -24, 717, -1848, -1174, -1408, -689, 1652, -914, -2169, 1336, 1355, 1310, 756, -1259, 1797, 2001, -642, 1219, 489, -740, 528, -502, -4, 21, -3196, -860, 1484, -661, -1214, -1438, -439, 2821, 180, -1623, 1392, 1444, 1080, 1377, -661, 1077, 1330, -1318, 867, 893, -2035, -893, -891, 115, 891, -3401, -2064, 1710, 685, -696, -1456, -345, 3747, 1095, -1767, 1816, 1436, 223, 284, -117, 1213, -247, -2758, 712, 1723, -2529, -2642, -765, 1462, 1001, -3532, -1328, 3209, 827, -414, 139, 804, 2299, 186, -813, 1767, 267, -1625, 414, 476, 459, -1546, -3114, 480, 1420, -1864, -1974, -858, 1256, 1618, -1568, -848, 2316, 1454]
1509A454r46m4qJ550k387o33K908j251l187J104J831R45k656k431M254K172l808
1526a133p87K085K000n81k936J971K262l188j94J724Q9j685j866J946K625l345
1542a013k511K606J606n16j661k33K745k04j565J681O5o24O27o76J093n57j844
1559i81J034Q76j038k12j402M46J766q14j154L84N89J671n68j918K158R97j546
1576B88J08M64L47q93j713K439P01l255j91K409l4j228k216J973K648k584p91
1593a528K080M41o71o05P95K032k933p62L074m23k100k55O24J319j494j928K408
1610G4K11j834J057N69o49K28J38J600m8k526K012J135j753L03l13j66L59j013
1628f16N04N25k401J136J685j717m13N98L88J332j722K16K711k369k64K372r78
$$ y = [1454, 508, 464, 456, 2006, -381, -1014, 1894, 643, -2544, -1440, 391, 1336, -1320, -3751, 503, 2675, -1133, -1920, 165, 2165, 1584, -1352, 619, 2881, -307, -501, 1223, 1312, -373, -2239, -293, 2332, -1013, -3524, -918, 688, 172, -1489, -1722, 1023, 819, -746, 935, 1000, 376, 1003, 327, 1420, 863, -981, 53, 929, -109, -321, -1723, -1277, 489, -325, -1479, -1095, -506, 1165, 597, -1321, 837, 1834, 288, 396, 860, 1207, 314, -1399, 1040, 1741, -1514, -1705, 704, 670, -558, -2774, -801, 1847, -737, -1528, 552, 993, 322, -283, 512, 2544, -389, -1151, 1923, 1500, -600, -855, -231, 1088, -406, -2334, 74, 285, -1549, -492, 77, -572, -344, -206, 1394, 1346, -1180, 832, 1967, 214, 517, 204, 38, 397, -616, -112, 413, -1988, -852, 833, -884, -1297, -699, -311, 1021, -701, -485, 2226, -143, -407, 1965, 987]
1645I87m63r36L67K215k892j562L205n16j789K35N30J184j100j614L220J89k957
1662a697K067J377p95m03j147K034P03l291P05J941k125k8R2k4O59j892R20K194
1680A290k177n06K231p77L14J28o21J907j452p74K307j328j587J664n37j85m17
1697e20j287K499j065j966K534K01j268M33M91Q43j58j760K376J101k971M17J262
1714A162m30l13j585J133J154k628P3J843j086l47J83O62J146j920N5K626j235
1731D93q78J465l3o01l80k98J692j361j664J892l38r71R8P1J069p82j088K134
1749E20J46j360R50R82n24j56n67J528m59j677Q76J279j895k96N9N29%j520N73
1768a012J507j661K51J555l31P5n95Q07J041j647n93K310j243p96M37J51j61j039
$$ y = [987, 524, -412, -45, 2170, -722, -2284, 921, 405, -1384, -1149, -619, 565, -535, -2149, 1071, 1260, -1697, 370, 1747, 952, 549, -598, 1436, 2139, -1152, -447, 1494, -631, -659, -567, -591, 68, -1824, -904, 1290, -887, -1393, 838, 61, 375, 503, -118, 1789, 337, -437, 1870, 542, -1045, 619, 82, -103, -520, -1807, 692, -373, -2339, 195, 396, -872, -439, 52, 895, 737, -1023, 1353, 2454, -517, -100, 1162, 732, 419, -1166, -33, 1121, -1507, -1434, 409, -677, -1024, -841, -179, 967, -953, -898, 1728, 493, -385, 1080, 1047, 446, 66, -232, 1460, 99, -1565, 327, -11, -982, -884, -813, 256, -526, -1614, 520, 666, -694, 256, 1238, 714, 558, -9, 1519, 1060, -617, 259, 1538, -357, -653, -594, -65, -65, -1585, -1012, 495, -1166, -915, 640, 309, 384, -211, 596, 1637, -10, -603, 1707, 464, -332, 105, 256, 95, -944]
1786i44j93J802j084j768J614Q95p76m31K51J712n30j387J847K50j239k09J056
1803H66K6p13j494J613Q11k076l6J166m98k73m28O92P89j449M39J806j046j99
1821dL63N23K02j320M8J424j180q91J108o98m03J15M87L71j151o26K626n25j571
1840a102J000P16K38m46p60J911o36j958J447O55j365l64k14J308k85j981J231
1857f05J656j982K74P25q1Q31j009P13R30j678J60J680j159m82j80k1J335j481
1875c74r06J482j034n9J128r30J47K00m26K047j233j039K171O4j496J070k34p4
1893E04k8j370J511K01k699J261R55p60k3j088J561J199k233M55J559q18K36k5
1911C98K0Q50q72p52J750j404o97P89l19K46l37j264J164o6k42J160j026j34J994
$$ y = [-944, -1137, 665, -419, -2187, -573, 322, -454, -885, -634, 1078, 548, -839, 1008, 1258, 19, -190, 866, 892, 179, -1315, 298, 1109, -967, -1003, 163, -335, -608, -1036, -344, 445, -1004, -565, 1241, 195, -4, 359, 882, 1084, -236, -188, 1236, 56, -835, 273, -425, -828, -713, -226, 145, -1006, -1632, 994, 469, -1102, -102, 614, 852, 406, -354, 1557, 921, -1037, 410, 1065, -300, -664, -878, 430, 145, -1836, -605, 1051, -931, -657, 68, -13, 818, -191, 522, 1452, -226, -66, 1614, 455, -27, -207, -228, 1107, -374, -1280, 202, -832, -891, 237, -693, -546, -346, -772, 1275, 42, -997, 1174, 1238, -258, 812, 578, 504, 476, -894, 617, 818, -1881, -620, 335, -425, -448, -1536, 25, 1224, -1009, -554, 1005, 187, 423, 398, 418, 1268, 396, -356, 1394, -10, -707, 82, -237, 9, -328, -1592, -428, -494, -736, 424, -602, -736, 1258]
1930A258q83n07P59k84Q13m81j082J458r98r31J144j25o22J52j082J687M92k338
1948a570M71J489k39R7r49N30J806j503l15J307p29q8j92m11J124r84j296J360
1966i2J94r27k96l40J682M99k149J097J143o39L38o81O81Q88j688K00J170m57
1984F23j085R5K68Q38j622j068J940O70j389N7J76J087Kj271R67O60r01O03m60
2003A90P1O13j446J90J191j207k35J11o0J129j135o16J307N6k78L85n21P45M70
2022I60j258Q29M91o92j12m02N48K88j714J24J363o08o50m03R69J148j564r55
2040a638K601j87j140M65O85L83j116p26J866k62j541j25Q46J29o23j394J376
2057d01Q89j698P78K54n2O25m91P93M91j407N50O68j152K62K18n85O12m17n93
$$ y = [1258, 375, -132, 627, 343, 1156, 675, -407, 1051, 53, -878, 266, 141, -481, -329, -1411, 276, 768, -1570, -1099, 390, 151, 248, -701, -171, 1635, 132, -183, 1124, 395, 307, 115, -296, 828, -156, -1452, -92, 102, -825, -1121, -1461, 221, 720, -1429, -332, 811, 172, 510, -171, 510, 1398, -290, -90, 1080, 623, -462, -367, -99, 739, -883, -1951, -11, 659, -730, -673, -497, 590, 592, -679, 288, 948, 47, 650, 190, 261, 874, -572, -382, 809, -398, -633, -522, -582, 547, -588, -1204, 103, 159, -119, 266, -255, 490, 960, -298, 531, 1022, 330, 218, -184, 364, 652, -1062, -938, 425, -183, -833, -1236, -267, 881, -683, -1638, 963, 776, -364, 101, 786, 1169, 53, -673, 1193, 931, -610, -735, 111, 240, -383, -1777, -401, 488, -1210, -432, -178, -230, 395, -96, 697, 1188, -219, 331, 999, -153, 109, 327, -258, 354, -63, -656]
2076f56R58j116J84J111j601L17J050l82M28n04J73J192j048m80J619p30q26L99
2094H8m0Q26j130j242K435q55j567R08O52j53j93j035J869N15j964J073P50m27
2112E10k09l98N35J036k053L3J591j525P7L90p31R55o41p82J752r27p96J728n05
2131D0L4J66k61R51o30o69J535p62j252J535n38q40M74p45J153l69j609J829O97
2150G39j538N72L29N31j54j000J317Q93k103L13J227q11o7q02M41J040j781o27
2168a481K021j009l26K95M31O50j073lJ757n04j138J463o70k58K14n20P28n67
2186A0q70J247j81j314J276n71ML68p47J208l6j589J589P13j010K5M37J65Nj449
2206g20O12J335j702n94R77J6l25o01M46J162j083n23J706j96q17M28K61O88q81
$$ y = [-656, 302, -814, -630, 481, -1120, -803, 247, -135, 293, -211, -38, 1154, 106, -374, 1245, 515, -311, 88, 48, 874, -256, -1498, 937, 82, -1485, -577, 75, -78, -271, -1306, 563, 1078, -886, 187, 937, 510, 301, -97, 438, 1474, -579, -546, 1045, -480, -403, -13, -744, 211, -430, -1212, 540, -387, -1183, 545, 40, 74, 240, -21, 930, 300, -369, 1166, 404, -848, 687, 149, -691, -217, -962, 191, -178, -1787, 42, 739, -799, -227, 102, 633, 479, -521, 796, 1689, -414, -101, 1126, 315, 248, -554, -113, 927, -854, -1481, 540, -469, -795, -500, -69, 581, -492, -495, 1262, 758, -380, 1083, 413, 155, 369, -151, 577, 10, -860, 387, 206, -1108, 168, -403, -399, -31, -778, 430, 394, -1195, 394, 1107, 97, 122, 559, 724, 729, -720, -108, 1227, -475, -1069, -92, -76, -401, -1002, -556, 606, -477, -1000, 706, 510, -307, 121, 382, 1070, 189]
2225A89n41J355l65j319Q03J96m12k10l86Q41j89j209R71O32q63N36k64Q02l48
2244B19o50J189J51j001K98P28p31k90o04P04O12j678J83J279j071p3M22J16M40
2263B43n37K46R49p67l23R14j59j46m80r2J040o45r17R46q1r28M66l6J08l52l20
2284h71J152n5q69J188j5j49J78l93N48K62j791J066N79j345J26K34J53J17j233
2303a118M06J379j495l5J417q45K65J26j46J091j009p0J169q51l42M39n46N76
2321D11o62m22Q35l61q15J219m73m55Q30k8J82J19p69J131q0j096J018n0m65R8
2341A67m03N46R7j571R21O05j085q4M82M15K86r65L20J321q63l84P69l01K34r8
2361D09o90J029o40r92J387n71l11K09o59Q58J45j208J020O3n87J056j84m68P02
$$ y = [189, -352, 1003, 638, -681, 122, 318, -94, -304, -690, 151, -38, -1247, -276, 356, -507, 29, -235, 567, 219, -431, 758, 909, -92, 206, 934, 203, -87, -691, 13, 625, -1053, -870, 409, -662, -735, -313, -197, 243, -294, -48, 901, 134, -189, 725, 566, 420, -60, -152, 888, 243, -674, 272, 191, -737, -271, -307, -199, -551, -871, 281, 226, -643, 545, 530, 381, 559, 166, 714, 976, -815, 251, 830, -515, -389, -155, -2, 115, -1118, -712, 667, -828, -863, 554, -291, -26, 100, -46, 1045, 36, -34, 1135, 284, -58, 381, -165, 411, -251, -673, 162, -199, -1014, 205, -268, -723, 107, 79, 261, 380, -389, 742, 662, -434, 584, 534, 69, 167, -236, 310, 407, -1164, -243, 362, -723, -807, -325, 90, 376, -589, -269, 1052, 189, -195, 574, 273, 507, 409, -281, 748, 108, -884, 503, -68, -379, -170, -829, 29, 174, -1034, -14, 49, -538, 518, 334, -134, 568]
2380E68j76J26J55o08M78R3j320O38J36n83L85q29Q09N74j382O57O92o48L37l31
2400b29M04Q02j035L00J036j098m98R34k31j47l49m59N82K04p99J59L95j75M89
2419B85q58P61N34r32N12K58m10M18n03o6O59r02n0K14J2R1k83q45Q57K29j71
2440a90J73k01M53J53p76P64M15p19K57j9P2K93o61m12J042p80o83O34k59M79
2460C5m17l75R74j89k58J49M15j19L95p09K99O13p63R4J74k61N0k87m11P12k48
2481a27p33N89K38L72m43o56J308O3r35O55j23K47K92j096Q19K56j200N39j41
2500g6Jk13m28K39O26o45j58N51J40J01M9n62J096l21l02M78l65J04l7n61O20
2521C37J42j038K95j18J07N24j062RJ109m52m5M03j06M99j75q11J198k32r26O38
$$ y = [568, 392, 518, 673, 65, 543, 636, -684, -46, 90, -493, -108, -937, -128, 446, -936, -279, 413, -235, 102, -229, 175, 977, -58, 242, 1278, 180, -318, 616, 385, 238, -111, -570, 12, 216, -583, -424, -29, -204, 285, -573, 188, 722, -210, 302, 560, 150, 568, 65, -1, 658, -244, -294, -80, -68, 23, -260, -1105, -248, -19, -190, -17, -218, 235, 388, -388, 376, 791, 72, 329, 310, 382, 675, 14, -398, 644, -136, -819, -185, -444, 35, -382, -757, 217, 28, -230, -81, 334, 215, 610, -99, 200, 813, 50, 144, 318, 57, 107, -180, -591, 121, -127, -860, -271, -33, 339, -104, -760, 548, 611, -324, 331, 208, 455, 747, -349, 470, 726, -474, 65, -76, -75, -288, -716, -477, 149, -496, -654, -103, 37, 138, 187, -375, 721, 400, 98, 576, 211, 315, 278, -283, 337, 479, -559, -264, -382, -275, 249, -813, -804, 305, -147, -192, 211, 105, 604, 429, -382, 816, 584, -342, 296]
2541B96l58L0J85j001J063Q1j254N97L34l27M94j009M05J166r25J40Q27m51R7
2560C90k67j38P61p81j53P05o61k10m8k2K64N7m92M32j0n6O88m39k7O56k92j32
2582B25J62o36P99l51p33M69M78q66K38j26J47K54p27M57R11j265J98P69l0P9
2602D52q49N83R05r19RN46o02q7m05K2Q60o54q14J174k94p81O57j35M83o5m79
2623c93R91j64n86P42m9l98K4m8m8J00p52O11J05q58N29K21m94L12m44O34N89
2644F24j060O92P26j152K77L06o8o7o09K17R04r41n34O65j00j96l95K93P21l02
2664Aj040J446J35o69L87J50K0r2p58J086oj088M74Ol50N1l4J75J7m67M74K93
$$ y = [296, -62, -32, 153, -848, 215, 296, -958, -361, -27, -354, 140, -869, -464, 702, -223, -83, 744, 293, 390, 123, -15, 746, -35, -188, 517, -144, -354, -402, -424, -160, -103, -595, -163, -173, -229, 459, 20, -7, 649, 357, 225, 387, -249, 550, 199, -534, -65, 413, -453, -215, -341, -194, 60, -667, -210, 701, -564, -366, 403, 373, 452, -397, 186, 1091, 172, 181, 727, 125, 38, -367, -345, 515, -139, -953, 221, -73, -854, -197, -332, 151, 86, -393, 598, 434, -152, 590, 541, 143, 167, 119, 71, 171, -581, 30, 135, -723, -194, 27, -467, -155, -599, 35, 624, -436, 256, 982, -170, 107, 413, 345, 278, -331, -114, 790, -151, -685, -20, -120, -316, -711, -418, 303, 1, -1039, 407, 542, -127, 260, 410, 430, 338, -420, 666, 660, -428, 46, 52, -298, -247, -281, -106, -89, -556, -82, 211]
$$ [...]
8191B05
##END NTUPLES=NMR FID
##END=
