##TITLE=1H_Pr IG-BrOCH3
 200.13MHz, CDCl3,
 8 sc
 
 20.10.2025
##JCAMPDX= 6.0         $$ Bruker NMR JCAMP-DX V2.0
##DATA TYPE= NMR FID
##DATA CLASS= NTUPLES
##ORIGIN= UXNMR, Bruker Analytische Messtechnik GmbH
##OWNER= pz
$$ XWIN-NMR		Version 3.5
$$ Mon Oct 20 14:27:36 2025 Russian Standard Time (UT+4h)  she@DPX200
##.OBSERVE FREQUENCY= 200.1308
##.OBSERVE NUCLEUS= ^1H
##.DELAY= (6, 6)
##.ACQUISITION MODE= SIMULTANEOUS
##.ACQUISITION SCHEME= undefined
##.AVERAGES= 8
##.DIGITISER RES= 18
##SPECTROMETER/DATA SYSTEM= spect
##.PULSE SEQUENCE= zg30
##.SOLVENT NAME= CDCl3
##.SHIFT REFERENCE= (INTERNAL, CDCl3, 0, 14.3821)
##AUDIT TRAIL= $$ (NUMBER, WHEN, WHO, WHERE, WHAT)
$$ ##TITLE= Audit trail, XWIN-NMR		Version 3.5
$$ ##JCAMPDX= 5.01
$$ ##ORIGIN= Bruker BioSpin GmbH
$$ ##OWNER= she
$$ F:/spectra/data/she/nmr/H-C/1/audita.txt
$$ ##AUDIT TRAIL=  $$ (NUMBER, WHEN, WHO, WHERE, WHAT)
(   1,<2025-10-20 14:26:07.46 +0400>,<she>,<DPX200>,
      <created by zg, POWCHK disabled, PULCHK disabled
       configuration hash MD5:
       00 E9 B6 7A A2 85 ED C7 34 08 36 98 17 FE 4E 26
       data hash MD5: 16K
       20 EC 09 BB CB EE 86 82 95 C2 B1 C6 D8 7A C7 F8>)
$$ ##END=
$$ 
$$ hash MD5
$$ AF 76 32 3D DB 8D 6A C8 2F A8 AA 5B 03 4C 82 D3
##$RELAX= 
##$RELAX= 
##$RELAX= 
##$RELAX= 
##$RELAX= 
##$RELAX= 
$$ Bruker specific parameters
$$ --------------------------
##$DU= <F:/spectra>
##$EXPNO= 1
##$NAME= <H-C>
##$PROCNO= 1
##$TYPE= <nmr>
##$USER= <she>
##$AMP= (0..31)
100 100 100 100 100 100 100 100 100 100 100 100 100 100 100 100 100 100 
100 100 100 100 100 100 100 100 100 100 100 100 100 100 
##$AQSEQ= 0
##$AQ_mod= 1
##$AUNM= <au_zg>
##$AUTOPOS= <>
##$BF1= 200.13
##$BF2= 200.13
##$BF3= 200.13
##$BF4= 200.13
##$BF5= 200.13
##$BF6= 200.13
##$BF7= 200.13
##$BF8= 200.13
##$BYTORDA= 1
##$CFDGTYP= 0
##$CFRGTYP= 5
##$CHEMSTR= <none>
##$CNST= (0..31)
1 1 145 1 1 1 1 1 1 1 1 1 1 1 1 1 1 1 1 1 1 1 1 1 1 1 1 1 1 1 1 1 
##$CPDPRG= <>
##$CPDPRG1= <>
##$CPDPRG2= <>
##$CPDPRG3= <>
##$CPDPRG4= <mlev>
##$CPDPRG5= <mlev>
##$CPDPRG6= <mlev>
##$CPDPRG7= <mlev>
##$CPDPRG8= <mlev>
##$CPDPRGB= <>
##$CPDPRGT= <>
##$D= (0..31)
0 0.7 0 0 0 0 0 0 0 0 0 0.03 0 0 0 0 0 0 0 0 0 0 0 0 0 0 0 0 0 0 0 0 
##$DATE= 1760955967
##$DBL= (0..7)
120 120 120 120 120 120 120 120 
##$DBP= (0..7)
150 150 150 150 150 150 150 150 
##$DBP07= 0
##$DBPNAM0= <>
##$DBPNAM1= <>
##$DBPNAM2= <>
##$DBPNAM3= <>
##$DBPNAM4= <>
##$DBPNAM5= <>
##$DBPNAM6= <>
##$DBPNAM7= <>
##$DBPOAL= (0..7)
0.5 0.5 0.5 0.5 0.5 0.5 0.5 0.5 
##$DBPOFFS= (0..7)
0 0 0 0 0 0 0 0 
##$DE= 6
##$DECBNUC= <off>
##$DECIM= 32
##$DECNUC= <off>
##$DECSTAT= 4
##$DIGMOD= 1
##$DIGTYP= 9
##$DL= (0..7)
0 120 120 120 120 120 120 120 
##$DP= (0..7)
150 150 150 150 150 150 150 150 
##$DP07= 0
##$DPNAME0= <>
##$DPNAME1= <>
##$DPNAME2= <>
##$DPNAME3= <>
##$DPNAME4= <>
##$DPNAME5= <>
##$DPNAME6= <>
##$DPNAME7= <>
##$DPOAL= (0..7)
0.5 0.5 0.5 0.5 0.5 0.5 0.5 0.5 
##$DPOFFS= (0..7)
0 0 0 0 0 0 0 0 
##$DQDMODE= 0
##$DR= 18
##$DS= 0
##$DSLIST= <SSSSSSSSSSSSSSS>
$$ [...]
##$SUBNAM0= <"">
##$SUBNAM1= <"">
##$SUBNAM2= <"">
##$SUBNAM3= <"">
##$SUBNAM4= <"">
##$SUBNAM5= <"">
##$SUBNAM6= <"">
##$SUBNAM7= <"">
##$SUBNAM8= <"">
##$SUBNAM9= <"">
##$SW= 18.0517779522481
##$SWIBOX= (0..15)
0 0 2 0 0 0 0 0 0 0 0 0 0 0 0 0 
##$SW_h= 3612.71676300578
##$TD= 16384
##$TD0= 1
##$TE= 0
##$TE2= 300
##$TE3= 300
##$TEG= 300
##$TL= (0..7)
0 120 120 120 120 120 120 120 
##$TP= (0..7)
150 150 150 150 150 150 150 150 
##$TP07= 0
##$TPNAME0= <>
##$TPNAME1= <>
##$TPNAME2= <>
##$TPNAME3= <>
##$TPNAME4= <>
##$TPNAME5= <>
##$TPNAME6= <>
##$TPNAME7= <>
##$TPOAL= (0..7)
0.5 0.5 0.5 0.5 0.5 0.5 0.5 0.5 
##$TPOFFS= (0..7)
0 0 0 0 0 0 0 0 
##$TUNHIN= 0
##$TUNHOUT= 0
##$TUNXOUT= 0
##$USERA1= <user>
##$USERA2= <user>
##$USERA3= <user>
##$USERA4= <user>
##$USERA5= <user>
##$V9= 5
##$VALIST= <valist>
##$VCLIST= <CCCCCCCCCCCCCCC>
##$VD= 0
##$VDLIST= <DDDDDDDDDDDDDDD>
##$VPLIST= <PPPPPPPPPPPPPPP>
##$VTLIST= <TTTTTTTTTTTTTTT>
##$WBST= 1024
##$WBSW= 4
##$XGAIN= (0..3)
0 0 0 0 
##$XL= 0
##$YL= 0
##$YMAX_a= 75364
##$YMIN_a= -76860
##$ZGOPTNS= <>
##$ZL1= 120
##$ZL2= 120
##$ZL3= 120
##$ZL4= 120
##$ABSF1= 10
##$ABSF2= 0
##$ABSG= 5
##$ABSL= 3
##$ALPHA= 0
##$AQORDER= 0
##$ASSFAC= 0
##$ASSFACI= 0
##$ASSFACX= 0
##$ASSWID= 0
##$AUNMP= <proc_1d>
##$AZFE= 0.1
##$AZFW= 0.1
##$BCFW= 1
##$BC_mod= 2
##$BYTORDP= 1
##$COROFFS= 0
##$CY= -3
##$DATMOD= 1
##$DC= 2
##$DFILT= <>
##$DTYPP= 0
##$F1P= 0
##$F2P= 0
##$FCOR= 0.5
##$FTSIZE= 0
##$FT_mod= 4
##$GAMMA= 1
##$GB= 0.15
##$INTBC= 1
##$INTSCL= 1
##$ISEN= 128
##$LB= 0.25
##$LEV0= 0
##$LPBIN= 0
##$MAXI= 10000
##$MC2= 0
##$MEAN= 0
##$ME_mod= 0
##$MI= 1.114404
##$NCOEF= 0
##$NC_proc= 0
##$NLEV= 6
##$NOISF1= 3.799351
##$NOISF2= 2.8
##$NSP= 1
##$NTH_PI= 0
##$NZP= 0
##$OFFSET= 14.38212
##$PC= 1
##$PHC0= -2278.843
##$PHC1= 9.39225
##$PH_mod= 1
##$PKNL= yes
##$PPARMOD= 0
##$PSCAL= 0
##$PSIGN= 0
##$REVERSE= no
##$SF= 200.129724274929
##$SI= 16384
##$SIGF1= 3
##$SIGF2= 2
##$SINO= 400
##$SIOLD= 16384
##$SREGLST= <1H.CDCl3>
##$SSB= 0
##$STSI= 0
##$STSR= 0
##$SW_p= 3205.1282051282
##$SYMM= 0
##$S_DEV= 0
##$TDeff= 0
##$TDoff= 0
##$TI= <>
##$TILT= no
##$TM1= 0
##$TM2= 0
##$TOPLEV= 0
##$USERP1= <user>
##$USERP2= <user>
##$USERP3= <user>
##$USERP4= <user>
##$USERP5= <user>
##$WDW= 1
##$XDIM= 8192
##$YMAX_p= 0
##$YMIN_p= 0
$$ End of Bruker specific parameters
$$ ---------------------------------
##NTUPLES= NMR FID
##VAR_NAME=  TIME,          FID/REAL,        FID/IMAG
##SYMBOL=    X,             R,               I
##VAR_TYPE=  INDEPENDENT,   DEPENDENT,       DEPENDENT
##VAR_FORM=  AFFN,          ASDF,            ASDF
##VAR_DIM=   8192,          8192,            8192
##UNITS=     SECONDS,       ARBITRARY UNITS, ARBITRARY UNITS
##FACTOR=    0.0002768,     1,               1
##FIRST=     0,             0,               0
##LAST=      2.2672688,     0,               0
##MIN=       0,             -76860,          0
##MAX=       2.2672688,     75364,           0
$$ Real data points
##PAGE= N=1
##DATA TABLE= (X++(R..R)), XYDATA
$$ [...]
2010I40n19o59n90R0K16P02M86K55m42o44o29L86M72P28j00o66n75o46N0R02J060
$$ 940 421 -238 -828 -738 -522 180 666 921 479 -165 -794 -408 64 792 692 26 -549 -1195 -1145 -243 817
2031H17P06m12n17j071k53O49Q24j49m37p46n55j61P98Q61P05j50o00n46o55O54
$$ 817 1523 1111 594 -477 -730 -81 743 594 157 -589 -1144 -1305 -507 354 1059 909 309 -237 -892 -238
2051b38L14Q26j59j033J14p47O49L31N81J77n92l32j050M20J97P00R07k08p72
$$ -238 76 902 743 -290 -176 -923 -274 57 638 815 223 -109 -1159 -739 -542 158 1065 857 85
2070H5q12o7L91N79O63l71p55m39j49O67R96N53l45p96r75k18J2O70M96j10l98
$$ 85 -727 -794 -403 176 839 468 -287 -726 -875 -208 788 1341 996 200 -775 -993 -981 -311 185 75 -323
2091c23j28m21Q57P29O19l0n68o83r78J01J00P59L5J28j52k47m05L03P86J46J2
$$ -323 -451 -872 -15 714 1333 1303 735 52 -926 -825 -725 34 69 197 45 -202 -607 -304 482 628 640
2112F40o68o43m43L83Q24M93L49m96q03o88L98Q43N60L30q57q40K24k43Q62N52
$$ 640 -28 -671 -1114 -731 93 586 935 439 -364 -1052 -654 189 749 1079 222 -618 -394 -637 225 777
2132G77k17m79q44k79N34K73N79M91k61j98k63j81J93N20l09j14n49p18j28K43
$$ 777 560 81 -763 -1042 -508 -235 344 835 574 376 113 -68 125 645 336 222 -327 -1045 -1173 -930
2152i30N44Q02Q25k69o36o87K33N14j25L91q86m10j51j60R18O83M10l66p87p31
$$ -930 -386 416 1241 972 336 -351 -118 396 271 662 -224 -634 -785 -945 -27 656 1066 700 -87 -818
2172h18J74L82P08L58o00l63j55l12M95L90L00l04k71l27k75M40L99M49J29k20
$$ -818 -644 -262 446 804 204 -159 -314 -626 -131 259 559 255 -16 -343 -618 -178 221 670 799 579
2192E79l30p15n14L69O53K42j83m00l37K16M30Q60N09o1j117p55n88M87N36L91
$$ 579 249 -466 -980 -611 42 284 101 -299 -636 -420 10 870 1379 1318 201 -554 -1142 -655 -119 272
2212B72n2l18n58j57N66O95O09k40o25p33k42J91Q52K53Qq9o50p8L0Q1M20L56
$$ 272 220 -98 -656 -813 -247 448 1057 817 192 -541 -783 -592 260 513 521 432 -218 -296 -266 -185 235 591
2234E91k07n86n11j11O66N77J70J2m10q20NL18J95P96J38m29k56m29j10O10M82
$$ 591 384 -202 -713 -824 -158 419 589 601 191 -629 -624 -306 -111 685 823 394 138 -291 -401 209 691
2255F91J2r85q10q4M49O26O12m2K40m36n32K70J42K69M33r32l15l42o7K38O03
$$ 691 703 -282 -1092 -1176 -727 -101 511 469 709 273 -259 11 153 422 855 -77 -392 -734 -801 -563 40
2276D0O22Q3j33q62j05R3N89k4K67q0q07k46L6M42P66K42n13o82m95J44Q73L38
$$ 40 662 745 612 -250 -355 -262 327 303 570 490 -317 -563 -527 -85 681 923 410 -272 -767 -623 250 588
2298E88J97l32q53k13Q8K44O68rj31o25o2q8N06O62J31p3m71l02k05j20P4L16
$$ 588 785 453 -400 -613 -525 -281 387 378 247 -378 -440 -528 -22 640 771 698 227 -75 -280 -400 -326 -10
2320a0K54l4o80M8P2M31N10o7k1p6j287J48M41N64K49l12m10l39J28J34Q78J76
$$ -10 244 210 -470 -422 -350 81 591 524 503 427 -860 -712 -271 293 542 230 -180 -519 -391 -257 621 797
2342G97q3p86o26k97P73O16K42j65l63n57q1K12M48K08L6j57k63k15k16M85L34
$$ 797 714 -72 -698 -995 -222 394 636 471 108 -449 -530 -318 130 338 374 217 -46 -261 -477 8 342
2363C42L32k75n52n00k37N52O48M93j38l72o67j47K51M05P75k51q24l87l67J62
$$ 342 674 399 -153 -653 -890 -338 310 803 665 293 -374 -521 -270 135 910 659 -165 -552 -919 -757
2383g57J010M11j83m52k91k39oN11P03j19m28k84m40J74J16P46J24j49n15k32
$$ -757 253 664 481 29 -262 -501 -507 4 707 588 160 -124 -564 -390 -274 472 596 447 -68 -300
2403c00k47L20P1M64Q5m82j68m78M48M59M28j97j3p95l32M64K97N96M11r33n47
$$ -300 -547 -227 -156 308 393 -89 -257 -735 -287 172 600 403 390 -405 -737 -273 24 620 1031 98 -449
2424d49k52K79N86J80K8l85l13k47K45J94N91O7o6m17j70m16L89L99L30K2l98
$$ -449 -701 -422 164 344 372 -13 -326 -573 -328 -134 457 524 458 41 -129 -545 -156 243 573 595 197
2445A97j86l06j13L61L62K12m93j67l75j03M87M92J65j50l80n07l7M22M23K55
$$ 197 11 -295 -408 -47 315 527 34 -133 -508 -611 -124 368 533 383 3 -504 -541 -119 304 559
2465E59j84m81n51j21P54L41J81k3k83o02r1P07J02K76k30j50o30O9J34M28N3
$$ 559 375 -106 -657 -778 -24 317 498 475 192 -410 -501 206 308 584 354 204 -426 -357 -223 205 258
2486B58J94j29n60l34O62l73M06L37J41o35n08j30M67N35L14j03k90n22k16M84
$$ 258 452 323 -237 -571 91 -282 124 461 602 -33 -541 -671 -204 331 645 542 252 -270 -486 -2
2506bL46J88J64o13m95l76N03J05N57M09o22n58M5j6K65N15M52n24n04n8k19J20
$$ -2 344 532 696 83 -412 -788 -285 -180 377 786 164 -394 -349 -365 -100 415 867 343 -161 -219 -438 -318
2528c18M04L12k22k87l35k24K12O28L52R5l50m79n04K82N85K55K71l23n94k09
$$ -318 86 398 176 -111 -446 -670 -458 170 522 617 267 -212 -716 -434 151 406 677 354 -240 -449
2548d49R9L22M92M59l85p15m08r6J41Q57j67J92l96n00K62M65K90P1m1m04k17
$$ -449 -350 -28 464 923 538 -177 -585 -681 -540 317 150 342 -54 -554 -292 173 463 534 493 89 -128
2569a28k37K9L03L09L38m02m04j95l01L14P97j70K33k03p38l6M04P03j14o6n60
$$ -128 -365 -336 -33 276 614 212 -192 -387 -688 -374 423 253 486 283 -455 -491 -87 616 502 436 -124
2590a24k53n36M02O18N69k96j03o66O2N5N26J92k22m23l02q5K06N52M09J4j87
$$ -124 -377 -913 -511 107 676 380 277 -389 -327 -272 254 446 224 -199 -501 -586 -380 172 581 595 408
2611D08m51k55j45M79j0N42n31j05l52m25M23M73O37j77q54n7k22K75N63J68Q2
$$ 408 -43 -298 -443 36 26 568 37 -68 -420 -845 -422 51 688 511 -343 -400 -622 -347 216 384 466
2632D66m37l86o7J53M43J86j23j13o35l87M83P70M69m9m07l26l29l91M50P48o9
$$ 466 29 -357 -424 -271 172 358 235 122 -513 -900 -417 353 822 773 366 40 -289 -680 -230 518 449
2653D49l44l20l42K48K52M89J87n1m71n62k51k0Q14R2J82n9m76n45N29M18M33
$$ 449 105 -215 -557 -309 -57 432 619 568 97 -465 -716 -736 78 170 352 293 -183 -728 -199 219 652
2674F52M38q50n26m32j39P60L26N51o08k99m47j98N53O25J85k17q6n83rK72N41
$$ 652 1090 240 -286 -718 -857 -97 229 780 172 -127 -574 -772 -219 406 591 374 288 -295 -304 -32 509
2695E09n7P1n78j84m00J59M14J15P0J25k69l21p4M17M98J90k64m74l14l28J76
$$ 509 452 523 -55 -239 -639 -480 -66 49 119 244 -25 -346 -420 -3 495 685 421 -53 -367 -695 -519
2716e19J017M6J17n02m68l05P28J72L67l88l97o58OK07Q83K90n4m25l23j20L6
$$ -519 498 544 661 159 -309 -614 114 286 653 265 -132 -790 -784 -577 306 596 542 117 -206 -326 -290
2737b90N96J67k17M3o63q5o5K00M70L32k33n17j03k95N28O10M52n09l50n15n6
$$ -290 306 473 256 299 -364 -449 -514 -314 156 488 255 -262 -365 -660 -132 478 930 421 71 -444 -500
2758e00q8R27M00k3o45p62q2M39L69O58j49n59l87j83J8M08P58k26j54n47j10
$$ -500 -588 339 739 716 71 -691 -773 -334 35 693 544 -15 -402 -585 -567 -159 599 373 219 -328 -438
2779d38L83M07K98k31J7n54k45k32kN70J52R0k54l41k45J11J002%K22j79n26n16
$$ -438 -55 352 650 419 436 -118 -363 -595 -597 -27 125 215 -39 -380 -625 -514 488 488 710 531 5 -511
2801e11J15N32N74j19k46n54l65M8M13P39j62j09p98m66K37Q31K25L52n47k09
$$ -511 -396 136 710 591 345 -209 -574 -526 -113 626 464 355 -443 -909 -672 159 384 736 189 -20
2821b0l13K11j75M11N01o3m96o00P1J87m0M97P0mk63m93k34N34N78K64j79n42
$$ -20 -333 -122 -297 114 615 552 56 -544 -473 -286 -326 171 241 237 -26 -519 -753 -219 359 623 444 -98
2843i8m10K6N90K56N59l76j055m9q9K97N72N12l25n65l30q9L74P88j15K06q96
$$ -98 -508 -482 108 364 923 547 -508 -557 -646 -349 223 735 410 -155 -485 -574 -200 588 473 679 -217
2864b17Pk46j5Q29K0O8k46o06j96K57k2N91M3p9k49n92K3O60N93K89m21m18n02
$$ -217 -210 -456 -471 358 378 446 200 -406 -602 -345 -367 224 267 188 -61 -653 -630 30 623 912 491 73 -429
2887d29k52L01P22K62P1j115j02k02M41P71J89l34k94n36LJ99P41L48m74j95l22
$$ -429 -681 -380 342 604 675 -440 -542 -744 -303 468 657 323 29 -507 -504 -305 436 784 310 115 -207
2908b07l09j4O75O7N4j11j43n73J62L71M59L42o2p43l22l24M48M17L82qp57j06
$$ -207 -516 -530 145 212 266 155 12 -561 -399 -28 431 773 711 -32 -354 -678 -230 187 569 561 -196 -302
2930c02k07L78O02L43j64p16l21k68O0L28O44K62n41m04r7K6P34L13j24l83m95
$$ -302 -509 -131 471 814 650 -66 -387 -655 -595 -267 377 639 98 -306 -403 -377 357 670 546 163 -332
2951c32j23J08K21L12K13l0m16k88j54M7N66P0J31r2n22q6n9M79M92K53q02j97
$$ -332 -455 -347 -126 186 399 369 -47 -335 -489 -442 124 194 325 233 -289 -375 -434 45 537 790 -12 -209
2973b09m27J89M52N68J45m41l09n38P7N79L23j63J6n78m44L86K20M13M77j35k04
$$ -209 -636 -447 5 573 718 277 -32 -570 -493 86 409 246 262 -316 -760 -374 -154 259 736 601 397
2994C97n64r4R1K00J03rl47m89J08K27N54J22L23l27m56k03J42pQ11k13k88l54
$$ 397 -167 -261 -170 30 133 124 -223 -712 -604 -377 177 299 622 295 -161 -364 -222 -229 582 369 81 -273
3016b73k02j49K96N34L30l80m11m74L44K16K92J22M5j47p24PK56N94Q6J08j50
$$ -273 -475 -624 -328 206 536 156 -255 -729 -385 -169 123 245 290 143 -581 -574 -318 276 362 470 320
3037C20n31k49N82j46J45L94k72m37m56J1O07K16K9O7o5n53j37J99O62J21j23
$$ 320 -211 -460 122 -24 121 515 243 -194 -650 -639 -32 184 213 280 215 -338 -475 -276 386 507 384
3058C84l25p36j45M48K54M39n2k07n72m5K93L64K04K58n53m26J80L2M19J46N4
$$ 384 59 -677 -822 -374 -120 319 267 60 -512 -557 -264 100 304 562 9 -417 -237 -205 214 360 414
3079D14j93l71l97O7L15K45K54k31k04j2m60M23K94jP8r2n92j33L75L28N00j59
$$ 414 221 -150 -547 -480 -165 80 334 103 -101 -113 -573 -150 144 143 221 129 -463 -596 -221 107 607 448
3101D48k51k39l46k4O02K77j37m17k76j61Q7L77M77P2k61j83l84J59J21M26J57
$$ 448 197 -42 -388 -412 190 467 330 -87 -363 -524 -437 -60 417 489 228 45 -339 -180 -59 367 524
3122E24l42l13l01p2L61P4L96l50K80m33k68J34K59L66j41r4k27k3l24K65N22
$$ 524 182 -131 -432 -504 -143 -69 327 -23 257 -176 -444 -310 -51 315 174 80 -147 -170 -494 -229 293
3143B93O1j34k09m91j53N05M46r7P1n70q2J79Q1N06R8q1n63l11L36j29M31K23
$$ 293 354 220 11 -480 -633 -128 318 221 292 -278 -360 -181 -100 406 504 423 -140 -451 -115 -244 187 410
3165D10J2m96n4j30l13O92K1K91l02m60k29oO79K63r5p4k11l04N8k5L60N4J62
$$ 410 422 -74 -128 -258 -571 121 142 433 131 -329 -558 -564 115 378 283 209 -2 -306 -248 -273 87 141 303
3188C03m51l84J14L19L02L5J5j6n75k46J25O59N7j12J6l12j50j90O19K24q0m41
$$ 303 -148 -532 -418 -99 203 238 253 237 -338 -584 -459 200 257 145 161 -151 -301 -491 128 352 272 -169
3210a69k25K33K6L3M3M01l73L62k77l52L5K03J94L15l36m11p9J52K12M29J70l92
$$ -169 -394 -161 -135 -102 -59 342 -31 331 54 -298 -263 -60 134 449 113 -298 -377 -225 -13 416 586 194
3232A94m31k80K10J34L71M9l40ll85K57L08L14J51j97o87r4R0M72M53j55k7l17
$$ 194 -237 -517 -307 -173 198 247 -93 -96 -481 -224 84 398 549 352 -335 -429 -339 133 586 431 404 87
3254H7l95jj41K63K98J15k68k86j53N03l1N76k08k63l3l67N2K9L96J72O7q31K55
$$ 87 -308 -309 -450 -187 111 226 -42 -328 -481 22 -9 567 359 96 63 -304 -252 -223 173 345 412 -419 -164
3277a64j25M36K94K13o89M1l02l28N30K37P6J34n32K9q9P3M79j9M9k96l58j48
$$ -164 -289 147 441 654 -35 6 -296 -624 -94 143 219 353 -179 -150 -239 -166 313 294 343 47 -311 -459
3299d59K10K29K46M6j35l99Kk79J47R24j71J86n99j59j23L39L72k6n4j53n45j11
$$ -459 -249 -20 226 272 137 -262 -260 -539 -392 532 361 547 -52 -211 -334 5 377 351 297 144 -401 -512
3321e12QO43L72k35q9o12L51K48J85P3l12j51k81k29L29J81J02J67M7k68k32L03
$$ -512 -504 139 511 276 187 -425 -74 174 359 432 120 -31 -312 -541 -212 -31 71 238 285 17 -215 88
3343H8L6k93K12L62l32r8j37OK80N53j76j34n08l23M90L0J67K4n4l48m12L90P1
$$ 88 124 -169 43 405 73 -25 -162 -156 124 677 501 367 -141 -464 26 56 223 247 193 -155 -567 -177 -106
3366a06M57J00m26m1l2j90K31N87j14j69n04Q4n06N46K60j41K50m12O5j30K83
$$ -106 351 451 25 -16 -48 -238 -7 580 466 297 -207 -123 -629 -83 177 36 286 -126 -61 -191 92
3387I2J77J30K74n47k04j97M7J20L96k11L09k00m77LL68L75%k01k53l57Q8M46
$$ 92 269 399 673 126 -78 -275 -228 -108 288 77 386 186 -291 -288 80 455 455 254 1 -356 -268 178
3409A78J55j54M0o3n78J70R7O73j41m6m35k5J19j38L30J71j45j41k72r5O8m2K95
$$ 178 333 179 219 156 -422 -252 -155 518 377 331 -104 -129 -10 -148 182 353 208 67 -205 -300 -232 -274 21
3432B1L62k41j60k16Q5K56j12K54j52j30k47m20N04L80q2J77j39j09m15L32K46
$$ 21 383 142 -18 -234 -149 107 -5 249 97 -33 -280 -700 -196 184 102 279 140 31 -384 -52 194
3453A94j8o7m61L17l38J33L72L03M6l52k84J35j67M56M6k63j42j66L4K38l78L92
$$ 194 176 109 -352 -35 -373 -240 132 435 481 129 -155 -20 -187 269 315 52 -90 -256 -222 16 -362 30
3475C0J09K41j33n40P7o3M49MJ51j68l78J15n7J42J03K33k53k43r2J56M17L03
$$ 30 139 380 247 -293 -216 -279 170 174 325 157 -221 -106 -163 -21 82 315 62 -181 -273 -117 300 603
3497F03k25j07k77k72M1M41k67J46j29j57j06L6L50KJ05J30k71l59K46m31L31
$$ 603 378 271 -6 -278 -237 204 -63 83 -46 -203 -309 -273 77 79 184 314 43 -316 -70 -501 -170
3518a70L57J7j09j79l6QK45N2J92l06l9l49J57j51M06R1R4j20n90K34j94Q57k75
$$ -170 187 204 95 -84 -120 -112 133 185 377 71 32 -317 -160 -311 95 186 280 160 -430 -196 -390 467 192
3541A92J02J9l93N01l34j60M29j72l94R8k9J73n5R7J24K56n00R1l03L25M2m1L82
$$ 192 294 313 -80 421 87 -73 356 184 -210 -112 -141 32 -23 74 198 454 -46 45 -258 67 109 68 450
3564D50k92k89l43N21j16J99R4j8m97p6O50l96L91l57K03n18J16K33J97K76l01
$$ 450 158 -131 -474 47 -69 130 224 206 -291 -367 283 -113 278 -79 124 -394 -278 -45 152 428 127
3585A27O6n87j85N69m4N60l69j22j44n2lL09K29j90Q9l42j31j34J04N90l33K34
$$ 127 193 -394 -579 -10 -54 506 137 15 -129 -181 -184 125 354 164 253 -89 -220 -354 -250 340 7 241
3607B41j11k37m3j38K78L79q0r8j88n17J65J16L15K94j14n77J63K58r6O1M0K15
$$ 241 130 -107 -150 -288 -10 369 289 191 3 -514 -349 -233 82 376 262 -315 -152 106 10 71 111 326
3629C26m01j19m8N5K62J56L7q5l18n0J16p2N02m43K59j04k78M02k33J91J12j47
$$ 326 -75 -194 -242 -187 75 231 268 183 -135 -185 -69 -141 361 -82 177 73 -205 197 -36 155 267 120
3651A20p7j75PN6L73J3j26m8m11J50J09n3J03M4J8n00L35j27K74L80k34k63n6
$$ 120 43 -132 -125 -69 304 317 191 143 -268 -118 -9 -62 41 85 103 -397 -62 -189 85 465 231 -32 -88
3674h8L6j22L21k2P5k93l18j24K33N90J67j15l3k31k26k63L24J16M11l11j26l82
$$ -88 -52 -174 147 125 200 -93 -411 -535 -302 288 455 340 307 76 -150 -413 -89 27 438 127 1 -381
3696c81L34J19J63pl0o7l98p7J75M28j83J65j26k84np9J89J22J85l86r7j97L05
$$ -381 -47 72 235 228 198 131 -267 -344 -169 259 76 241 115 -169 -174 -253 -64 58 243 -143 -240 -437 -132
3719a32L78K49l93K16n68m4L09j41J72j2J57k78N2j06J6J82J22O9k62k83J01J39
$$ -132 246 495 102 318 -250 -294 15 -126 46 34 191 -87 -35 -141 -125 57 179 248 -14 -297 -196 -57
3741e7q3K98M9j82j10k54O6K16L66j06j57o9l45J45M12j25J87j23r4kj13k1K21
$$ -57 -140 158 207 25 -85 -339 -273 -57 309 203 46 -23 -368 -223 189 64 251 128 34 32 -81 -102 119
3764A19kk64L63k28J7j12K88j36Q9l4l63M2QJ30L08k6J41k71mm52N04j4L03nn82
$$ 119 117 -147 216 -12 5 -107 181 45 134 100 -263 -221 -213 -83 225 199 340 69 65 -387 117 103 406 401 -181
3789a81j89j1J4O83k09R3j64j49K83M9m07M18j23l6m05K11k4M91P1k28j37r2j09
$$ -181 -370 -381 -367 316 107 200 36 -113 170 219 -188 230 107 71 -334 -123 -147 344 415 187 50 -42 -151
3812a51k43J57K70M27l71J02k63L2J22Mk39J94j8m26p1M94K94R8n7k43j23n0k88
$$ -151 -394 -237 33 460 89 191 -72 -40 82 86 -153 41 23 -403 -474 20 314 412 355 112 -11 -61 -349
3835c49L00J22j42N5j67p3J45M09l1j04k02J78o09J15N67J24k87j60J5m4q8K33
$$ -349 -49 73 -69 -14 -181 -254 -109 300 269 165 -37 141 -468 -353 214 338 51 -109 -94 -138 -226 7
3857GL52j17k57r3l9j3m4L88O7j81M5Mn19K37K38J52n1j40k31O7K42N6j17K27
$$ 7 359 242 -15 -108 -147 -160 -204 184 251 70 115 119 -400 -163 75 227 176 36 -195 -128 114 170 53 280
3881B80j56m65qL33K95k24K39j58j11j96J69KL83k71N1k18r6j38P2L73q5J30J25
$$ 280 124 -341 -349 -16 279 55 294 136 25 -171 -2 0 383 112 163 -55 -151 -289 -217 156 71 201 326
3904C26l10j58N0J90J70k15l80K09j31K05Q3k28K77r8o5l55J13L12R7K51n36m2
$$ 326 16 -142 -92 98 268 53 -327 -118 -249 -44 39 -189 88 -10 -75 -430 -317 -5 92 343 -193 -235
3926b35K34k20K54J73k27J31n6j67l8J66J2K36k54QL6k21j73L35j35L24j14k59
$$ -235 -1 -221 33 206 -21 110 54 -113 -151 15 27 263 9 17 53 -168 -341 -6 -141 183 69 -190
3948a90K31k07L48k39L55j32j6l50j00n9L93k16K18l29J35l8L10K14k13N1r8K
$$ -190 41 -166 182 -57 298 166 150 -200 -300 -359 34 -182 36 -293 -158 -196 114 328 115 166 68 70
3970G0o5q9M46j95Q9j66j50M0q0N7K19r8p2o2j51K02j75N54k49j06j20J22j59
$$ 70 5 -84 362 167 256 90 -60 -20 -100 -43 176 78 6 -56 -207 -5 -180 374 125 19 -101 21 -138
3993a38N6M1K30j84K52l41j41L53O6K11m76J18j76k45J73K81J23j04j25J14l50
$$ -138 -82 -41 189 5 257 -84 -225 128 194 405 -71 47 -129 -374 -201 80 203 99 -26 88 -262
4014b62M66mj01J64m36P7p7r3R3K64o3N7l07K02J9N2N3J16j12k55j53J43K29N3
$$ -262 204 200 99 263 -173 -96 -173 -266 -173 91 28 85 -222 -20 -1 51 104 220 108 -147 -300 -157 72 125
4038A25j76J59r8j43q0o1L64q1P8q3k77L37k56J20L33J26n00L4m9q6J06J27J32
$$ 125 -51 108 10 -133 -213 -274 90 9 87 4 -273 64 -192 -72 261 387 -113 -79 -128 -214 -108 19 151
4061A51k7j34j52L3j22M28m13L24j62j40p1K90L06l7m6j82j19m3Q1j03K21K46
$$ 151 124 -10 -162 -129 -251 177 -236 88 -74 -214 -285 5 311 274 228 46 -73 -116 -35 -138 83 329
4083C29p3l53j07pK15N1J62j96K56k35k88J87O7K00l54O5k43M57r3J13l09K84
$$ 329 256 -97 -204 -211 4 55 217 21 277 42 -246 -59 8 208 -146 -81 -324 133 40 153 -156 128
4105A28P1l34L4K06J56j16j75L9j31L33k39j37M42o4M0o1o26K03J21P1M52k81
$$ 128 199 -135 -101 105 261 145 -30 9 -122 211 -28 -165 277 213 253 192 -434 -231 -110 -39 413 132
4127A32k49j29R6k6M59j93j15N4l48J81O1J95l8J8k44j08Q6O1K40P2j12o8K8m09
$$ 132 -117 -246 -150 -176 283 90 -25 29 -319 -138 -77 118 80 98 -146 -254 -168 -107 133 205 93 25 53 -356
4151c56L25r2L98m31K32O1l53J48l8R6K97l3l34o1j85L67L3n3n8l30L22j47M6
$$ -356 -31 -123 275 -156 76 137 -216 -68 -106 -10 287 254 -80 -141 -326 41 74 21 -37 -367 -45 -192 -146
4174a46L19J09J06o33L6K12j84k6L61j3k79L7o2n6L53j77J22j06k93K09K47j82
$$ -146 173 282 388 -245 -209 3 -181 -207 154 141 -138 -101 -163 -219 134 -43 79 -27 -320 -111 136 -46
4196d6P5k54J56N9p3q2K33k1K77k28j91J77k35N2M2N18l00R1l76J60j04j4L94
$$ -46 29 -225 -69 -10 -83 -165 68 47 324 96 -95 82 -153 -101 -59 459 159 250 -126 34 -70 -84 310
4219C10j99j22j4j55J04k5j1N57j82k71J84k19l7N5K08l78R3k76K78N4k57K83
$$ 310 111 -11 -25 -180 -76 -101 -112 445 263 -8 176 -43 -80 -25 183 -195 -102 -378 -100 -46 -303 -20
4241b0Q5M5j95J97k13N7K42N0k44k74Q2J65K08p7J76j59p9j88K01M6j45L85m30
$$ -20 65 110 -85 112 -101 -44 198 248 4 -270 -188 -23 185 108 284 125 46 -142 59 105 -40 345 -85
4264h5K08q4j01k7k2M89k03k43j40J86J09J82p6l7Jm74K33r2J01J99R4j17j39
$$ -85 123 39 -62 -89 -111 378 175 -68 -208 -22 87 269 193 156 157 -317 -84 -176 -75 124 218 101 -38
4287c8j30N4o3L15m3j48m4PK7l2Q1L4k25Q6j86j19K40M80l32rK26k45R2J31N6
$$ -38 -168 -114 -177 138 95 -53 -97 -90 -63 -95 -14 20 -205 -119 -305 -424 -184 296 -36 -45 181 -64 28 159 215
4312B15k9J79k68m42K32J33r1J88K7Q5l47n1J20o7j1j08K80J09m27O4J97j9J9
$$ 215 186 365 97 -345 -113 20 -71 117 144 229 -118 -169 -49 -116 -127 -235 45 154 -273 -209 -12 -31 -12
4335a2J75q0j60k35K67K59j7m38J26k89L16K34m91O64j99j55K5m09L16K73Mk26
$$ -12 163 83 -77 -312 -45 214 197 -241 -115 -404 -88 146 -345 319 120 -35 -10 -419 -103 170 174 -52
4357e2J33j97O8j09k16K73M3Q8o7k55J97J17K07pj5m6o5l1J69j13k99K08j05Q5
$$ -52 81 -116 -48 -157 -373 -100 -57 31 -36 -291 -94 23 230 223 208 162 97 66 235 122 -177 31 -74 11
4381A1j58j11K15J44j07J12O1j17k95Q2L84o6k70O1k8K39k27J37K36l40P0L3k10
$$ 11 -147 -258 -43 101 -6 106 167 50 -245 -163 221 155 -115 -54 -82 157 -70 67 303 -37 33 66 -144
4404a44K08J25k19j67L17k91lM5K64jm0J66n08J23qJ70j20M96m19J39r3k41R9
$$ -144 64 189 -30 -197 120 -171 -174 -129 135 134 94 260 -248 -125 -133 37 -83 413 -6 133 40 -201 -102
4427a02K15O5J62l37K86m60RL13p5p9K3l1j22J15J4J42k43n5R9Pn1J91k28K68
$$ -102 113 178 340 3 289 -171 -162 151 76 -3 20 -11 -133 -18 -4 138 -105 -160 -61 -54 -105 86 -142 126
4451A26l06O5M1n3J3K84m4M4k75J14Q6k88K80J83o5m11J68J47k07J50k3j9J71
$$ 126 -180 -115 -74 -127 -114 170 126 170 -105 9 95 -193 87 270 205 -206 -38 109 -98 52 29 10 181
4474A81k02Q4q5L72k60k8j07j16J27j8J57n9OR1j76j78P0J90q0j42K81j87J6q3
$$ 181 -21 63 -22 350 90 62 -45 -161 -34 -52 105 46 52 143 -33 -211 -141 49 -31 -173 108 -79 -63 -146
4498a46J17J33J59k42k08J24M18k79m8O1kqk15K26l91L31K1K8o6P8j38o5j27L16
$$ -146 -29 104 263 21 -187 -63 355 76 28 89 87 79 -136 90 -301 30 51 79 13 91 -47 -112 -239 77
4522G7Q9O1l42J89l60K23Q4J98m7k47ok81L37Q4j80J77k60K2K17N4j29K20j96
$$ 77 166 227 -115 74 -286 -63 21 219 172 -75 -81 -362 -25 59 -121 56 -204 -182 35 89 -40 180 -16
4545a6L01j68P1m10L55k92j45K79K6j01P9J95m01J35J78j37l5R0K9J01o6P0n9
$$ -16 285 117 188 -222 133 -159 -304 -25 1 -100 -21 174 -227 -92 86 -51 -86 4 33 134 68 138 79
4568G9l2j45j23J33M27m75K13l82K98K9k26J06K63k72j80L22k33L66Rj57J72L4
$$ 79 47 -98 -221 -88 339 -136 77 -305 -7 22 -204 -98 165 -107 -287 35 -198 168 177 20 192 226
4590B26m22J70r3M11l03l0K22r4j02k9j93L77m0j19j16J57j5j35L85j64j80J95
$$ 226 -196 -26 -119 292 -11 -41 181 87 -15 -44 -237 140 100 -19 -135 22 7 -128 257 93 -87 108
4612A08j36qk1J61J40J11k50j50L0J42J52k29j2r8m1p9L10q7K23l61r9N9L67j76
$$ 108 -28 -36 -57 104 244 355 105 -45 -15 127 279 50 38 -60 -101 -180 130 43 266 -95 -194 -135 232 56
4636E6q0P1j2n3r7r9J35J06J08p6j15J63j34p0M1J36k4l2k4o8q6K84k45J62M7
$$ 56 -24 47 35 -18 -115 -214 -79 27 135 59 -56 107 -27 -97 -56 80 56 24 0 -68 -154 130 -115 47 94
4661I4k29J53L1l69N87k21k4n4K06j93J49j58nj65O0K35j97L08k91J97J6J06k20
$$ 94 -135 18 49 -320 267 46 22 -32 174 -19 130 -28 -33 -198 -138 97 -100 208 -83 114 130 236 16
4684A6j53j48K90m3J31O3O6k65k9P7K78j1l14O7L2k31J10J60O6j7k27J99j65J85
$$ 16 -137 -285 5 -38 93 156 222 -43 -72 5 283 272 -42 25 57 -174 -64 96 162 145 -82 117 -48 137
4708A37l58L04J58o15M06j48J3n6K09j36J81N8j57j65j99L44K97l24j19N5j80
$$ 137 -221 83 241 -374 32 -116 -103 -159 50 -86 95 153 -4 -169 -368 -24 273 -51 -170 -115 -295
4729b95J49J11K06j1Nj21k38J02K63j58k06O8n9J48k85K59K46j59M0Jj89K74Q1
$$ -295 -146 -35 171 160 165 44 -194 -92 171 13 -193 -125 -184 -36 -321 -62 184 25 65 66 -123 151 232
4752B32k42j38j50K00j50N5J49J75k39L91k47k44P0J00j08K27j72L19j94J7k16
$$ 232 -10 -148 -298 -98 -248 -193 -44 131 -108 283 36 -208 -138 -38 -146 81 -91 228 34 51 -165
4773a65J93J65K0k04j53j23L23J04k64K6J21k10k2O4N6L52k14r4j74jJ83J20j22
$$ -165 28 193 213 9 -144 -267 56 160 -104 -78 43 -167 -189 -125 -69 283 69 -25 -199 -200 -17 103 -19
4796a9r0K55J46j45P1l00J59ool17j34J96K98j28L41J09j81o01Q0Q1Q7M34l81
$$ -19 -109 146 292 147 218 -82 77 71 65 -252 -386 -190 108 -20 321 430 249 -352 -272 -191 -104 330 -51
4819e1J68j40p7j42K64r9K46j10k68L8L32j51J07p0%k35R1N9L1j64L24J45j24
$$ -51 117 -23 -100 -242 22 -77 169 59 -209 -171 161 10 117 47 47 -188 -97 -38 -7 -171 153 298 174
4842A74j39j33J98j28K59R9l56k23MM0M1K24l54K67J25j43q4K05nj23J23j59P5
$$ 174 35 -98 100 -28 231 330 -26 -249 -245 -205 -164 60 -294 -27 98 -45 -129 76 71 -52 71 -88 -13
4865a3j58J90j59J67o6J19k46j27K95j1J96q0r4M8l72K12l8J31K8nL9l48J57M22
$$ -13 -171 19 -140 27 -39 80 -166 -293 2 -9 187 107 13 61 -311 -99 -137 -6 22 17 56 -292 -135 287
4889B87m19K43L5l54K17k03K32m8J41j30l39N5l8Q5K34L29l05Qk74J27r4J75k0
$$ 287 -132 111 146 -208 9 -194 38 -10 131 1 -338 -283 -321 -236 -2 327 22 30 -244 -117 -211 -36 -56
4912e6L22k42Qj58K07R2l42O0L56r4k34j95K26o3Q3OK5j08L3L6o4M67l60J13N
$$ -56 266 24 32 -126 81 173 -169 -109 247 153 -81 -276 -50 -113 -30 -24 1 -107 -74 -38 -102 365 5 118 123
4937A23l39M83k87K56k64K62j9k61q5J06J42j67p0K56m92J48K64K46k19n2j74
$$ 123 -216 267 -20 236 -28 234 215 -46 -131 -25 117 -50 -120 136 -356 -208 56 302 83 31 -143
4958a43q5K45nk34L02K2j59q6r5L28l87L80k93L47j08j5k18K54j52J83K3k26p8
$$ -143 -228 17 12 -222 80 102 -57 -143 -238 90 -297 83 -210 137 29 14 -204 50 -102 81 104 -122 -200
4981b00K4K01L6r5J05k29J06j95Q7NK99j22k48K4o9K29Q2k69L30j75r6M2J5K90
$$ -200 -176 25 61 -34 71 -158 -52 -247 -160 -155 144 22 -226 -202 -271 -42 40 -229 101 -74 -170 -128 -113 177
5005A77j91M8j8j01j65R6L60l11K25j3pl94J52L57k05K2k69L49l12M2J16K02m5
$$ 177 -14 34 16 -85 -250 -154 206 -105 120 107 100 -294 -142 215 10 32 -237 112 -200 -158 -42 160 115
5028A15k48K50j65J70k4rl2j37j04J69k18J83J99J12l04q0N2k99Q4L7L24p3M0
$$ 115 -133 117 -48 122 98 89 57 -80 -184 -15 -233 -50 149 261 -43 -123 -71 -370 -286 -249 75 2 42
5051D2j36j4L14j24n1Q1%J4r4j77J56K1m0r3k8j52O1M6J23K86m5j25k67k87M84
$$ 42 -94 -108 206 82 31 112 112 126 32 -145 11 32 -8 -101 -129 -281 -220 -174 -51 235 190 65 -202 -489 -5
5076ek3J35J21j20J03l05rJ1K3j69L68l06O5R0o3PK28N0j72j73J24j00K44J79
$$ -5 -28 107 228 108 211 -94 -103 -92 -69 -238 130 -176 -111 -21 -84 -77 151 201 29 -144 -20 -120 124 303
5100C03j91m9j59Q4j31J25j68L62K6l5j59k53L12k87K45rJ88k93l0K5J28j23J82
$$ 303 112 63 -96 -12 -143 -18 -186 176 202 167 8 -245 67 -220 25 16 204 -89 -119 -94 34 -89 93
5123I3K7j44j08l3K96J7j20P2k1m50K80L50k41M7j86M8o9R9J00k2m9l7j29J87
$$ 93 120 -24 -132 -165 131 148 28 100 79 -371 -91 259 18 65 -121 -73 -142 -43 57 35 -14 -51 -180 7
5147GJ0J05k01L14j20n9l30M59j38o1L44l30q9j87K89mJ41j82N5l5l36N77k99
$$ 7 17 122 -79 235 115 56 -274 185 47 -14 330 0 -89 -276 13 9 150 -32 23 -12 -348 229 -70
5170g0K79J19k90l14Q5K51L34k17m8j60P7Pl4rj26K75k96M1M46k26j84RR3r2O
$$ -70 209 328 38 -276 -191 60 394 177 129 -31 46 53 19 10 -116 159 -137 -96 350 124 -60 -51 42 -50 -44
5195d4R0j04J58J09m0k31J60k94p0L02m13O44j7k27L8qk85J38J34p9J02j63k06
$$ -44 46 -58 100 209 169 -62 98 -196 -266 36 -377 267 250 23 61 53 -232 -94 40 -39 63 -100 -306
5218c06J62qJ99L1k0K62j74m09L57j5L4J9O7j68n5J31j01j14J07L1L0j2k75J95
$$ -306 -144 -152 47 78 58 320 146 -263 94 79 113 132 199 31 -24 107 6 -108 -1 30 60 48 -227 -32
5242c2J00l2K58k58o3k67J76J47j7J23N3j94j45J25M3lj3K33j94j49J84j15Jj41
$$ -32 68 36 294 36 -27 -294 -118 29 12 135 188 -6 -151 -26 17 14 1 234 40 -109 75 -40 -39 -180
5266a80K30j97K54j37K23l11K53j64p7r1J18J12J70j0l00K94k07L2k70L43o8L52
$$ -180 50 -147 107 -30 193 -118 135 -29 -106 -197 -79 33 203 193 -107 187 -20 12 -258 85 17 369
5288C69k95k3q4M4l4O7M8K17l62k4K85l80J97J26k47q4k23J36O1L53l64L76k2
$$ 369 74 51 -33 11 -23 44 92 309 -53 -77 208 -172 25 151 -96 -180 -403 -267 -206 147 -217 159 137
5311A37k57r8J67K41j10o1j31L59k09k05M1K35j32J15l12L08j55L2J64m00J70
$$ 137 -120 -218 -51 190 80 19 -112 247 38 -167 -126 109 -23 92 -220 88 -67 -35 129 -271 -101
5332a01J78%k7j29j1K57j39J39j96n5K63l86K81o2j46K11r9K49j56J71l38J17
$$ -101 77 77 50 -79 -90 167 28 167 -29 -84 179 -207 74 12 -134 77 -22 227 71 242 -96 21
5354B1p6j92L34q7l08K70N2K28K63o84M02Pk03L7k27Q9j07J67j15J72l6on3J05
$$ 21 -55 -247 87 0 -308 -38 14 242 505 -179 223 230 27 64 -163 -74 -181 -14 -129 43 7 1 -52 53
5378E3J29ok51J98j36m0Q0K36q8jr9kk52M5Q9P5J49n8k14P7n7J29J77n7j41Q1
$$ 53 182 176 -75 123 -13 -53 27 263 175 174 75 73 -179 -134 -45 30 179 121 -93 -16 -73 56 233 176 35 116
5404A16k95M11j44P1k7N2k51oN2J62j00l5p0L24l53J4n9J79K32k54o6m6N0n7N0
$$ 116 -179 232 88 159 132 184 -67 -73 -21 141 41 6 -64 260 -93 -79 -138 41 273 19 -47 -93 -43 -100 -50
5429e0j3o2K45k53L4o2j57K97j54J05K84p9M1k04L2j20K39J02j8j71m40M16q5
$$ -50 -63 -125 120 -133 -99 -161 -318 -21 -175 -70 214 135 176 -28 4 -116 123 225 207 36 -404 12 -73
5452g3K05j60j33J24l9j74K70k5p2O5j70J73r4OM74l27Qj38J70p2J73l21J91j45
$$ -73 132 -28 -161 -37 -76 -250 20 -5 -77 -12 -182 -9 -103 -97 377 50 58 -80 90 18 191 -130 61 -84
5476h4q4K42r9p5K76O7k34J08l22J52J09k01J37K7Q6J33m48Q7J29K68k88J36q4
$$ -84 -168 74 -25 -100 176 243 9 117 -205 -53 56 -145 -8 19 105 238 -210 -123 6 274 -14 122 38
5499C8j1P8J92j53j77J23n8J7r0k1J48l68L57j65r1K95L7j88J45J11l97N3K24
$$ 38 27 105 297 144 -33 90 32 49 -41 -62 86 -282 75 -90 -181 114 151 -37 108 219 -178 -125 99
5522I9k33J57j47J55%j24K32q7j54j30O21l47k08J98K9k80J97O7k7L53k33m49
$$ 99 -134 23 -124 31 31 -93 139 52 -102 -232 389 42 -166 32 61 -219 -22 45 18 371 138 -311
5544c11K07J02j36K16J34j4NL8j66k15M96m57K90l97R6K95k99l5O0K97k05R9J96
$$ -311 -104 -2 -138 78 212 198 203 241 75 -140 356 -101 189 -208 -112 183 -116 -151 -91 206 1 100 296
5567B96k46m4m6J62M2k19j88K62k65K58j75l0O2K2L25k35J5N5j77K3O6J51j75
$$ 296 50 6 -40 122 164 -55 -243 19 -246 12 -163 -193 -131 -109 216 -19 -4 51 -126 -103 -37 114 -61
5590f1J16j76J04M3Q9J25k81P1RQ5qn47K05K62n8K5j96K51P0k09O7J03p2j30K20
$$ -61 55 -121 -17 26 115 240 -41 30 39 124 116 -431 -226 36 -22 3 -193 58 128 -81 -14 89 17 -113 107
5615A07J26k73o9J50j59r8Q4j13M07j64J16j28R5l04N3k38K75l0L08J59l60J46
$$ 107 233 -40 -109 41 -118 -216 -132 -245 162 -2 114 -14 81 -223 -170 -408 -133 -163 145 304 -56 90
5637I0q1J4k5j17K32L34o30L09j19K22k15JM9k18L52k54J69m5p1J61k33j13K52
$$ 90 9 23 -2 -119 113 447 -183 126 7 229 14 15 64 -154 198 -56 113 68 -3 158 -75 -188 64
5660F4q7k47K79N8l07N7J21o3M6J3J08k78M07j81k76L82j77K42k09J88j3m37L37
$$ 64 -23 -270 9 67 -240 -183 -62 -125 -79 -66 42 -236 171 -10 -286 96 -81 161 -48 140 127 -310 27
5683B7M2j5K14k70l09L62n61J31L08nK44pj81n4L10k56L5J59l50K33j95%R2J61
$$ 27 69 54 268 -2 -311 51 -510 -379 -71 -76 168 161 -20 -74 236 -20 15 174 -176 57 -138 -138 -46 115
5707A15l1j65jL6Q4j78J62j08K17j1l30K10M8K28l43L23k99J60j67J3K1o6J55
$$ 115 84 -81 -82 -46 38 -140 22 -86 131 120 -210 0 48 276 -67 256 -43 117 -50 -37 -16 -82 73
5730G3J3N8Np6P8k04oO4J52j03k16K9J22J93l27L00k31q6j74K34J68j30j53LM11
$$ 73 86 144 149 73 151 -53 -59 5 157 54 -162 -133 -11 182 -145 155 -76 -162 -336 -102 66 -64 -217 -214 197
5755A97k33Q9j34r9L22k38M55j98n2k21O6J36j04j32J07L79k81j46J07J26l83
$$ 197 -36 53 -81 -180 142 -96 359 161 109 -112 -46 90 -14 -146 -39 340 59 -87 20 146 -237
5776b37K10P5K12j62Q8k76j15J78K67j07r0N1j95oO8O3j69J04j32N02m24P4mr1
$$ -237 -27 48 260 98 186 -90 -205 -27 240 133 43 94 -101 -107 -39 24 -145 -41 -173 329 -95 -21 -25 -116
5800a16M77m72p5J74k6j19lK27pk27J54k88L96q5n0K6o5n6J99j05J89j58R4MJ07
$$ -116 361 -111 -186 -12 -38 -157 -160 67 60 -167 -13 -301 95 10 -40 -14 -79 -135 64 -41 148 -10 84 88 195
5825A95m44M13k84J02K11j20n4o2J74m06M00j82K51M3n7j28q5K2kQo4j05l9N56
$$ 195 -249 164 -120 -18 193 73 19 -43 131 -275 125 -57 194 237 180 52 -33 -11 -13 -5 -69 -174 -213 343
5849C43m23M43m21j11P2M38k63j77k2L1L7R4K20j11l7j47K65L5q3k33j6jM2j7
$$ 343 -80 363 -58 -169 -97 341 78 -99 -121 -90 -53 41 261 150 113 -34 231 266 183 -50 -66 -67 -25 -42
5873d2p0K92k63N4k75L79J78k70N4k02J74l6J12k49J04RJ5J76L9k16J25n8J19
$$ -42 -112 180 -83 -29 -304 75 253 -17 37 -165 9 -27 85 -164 -60 -51 -36 140 179 -37 88 30 149
5896A49j14k87L70J9j18K22M7j00j70j71K07p5J54O9n8j33j78L30j71LL02l16
$$ 149 35 -252 118 137 19 241 288 188 18 -153 54 -21 133 202 144 11 -167 163 -8 -5 297 -19
5918a9j08j53K11P3L24k68Q3k57j14Q8R2J57K40k27k84K34N0k90L32j28J79j76
$$ -19 -127 -280 -69 4 328 60 143 -114 -228 -140 -48 109 349 122 -162 72 122 -168 164 36 215 39
5940C9k53L02j5J34l44Q6K26k41rJ86Qk02R0p5M8k39K73J52o3K9o3M1l38L57k60
$$ 39 -214 88 73 207 -137 -51 175 -66 -75 111 119 -83 7 -68 -20 -259 14 166 103 132 69 110 -228 129 -131
5965a31J22J13j05K94l88K4J2m0J22k77K04j77L45J70m7k81L03j45k17K70l73
$$ -131 -9 104 -1 293 -95 -71 -59 -99 23 -254 -50 -227 118 288 241 -40 263 118 -99 171 -202
5986b02L03j19q6J58k6j55P9L59l44j45L25j64rJ67n2j36j17J28k85M42k95K49
$$ -202 101 -18 -104 54 28 -127 -48 311 -33 -178 147 -17 -26 141 89 -47 -164 -36 -321 121 -174 75
6008G5O9J45j33j34K04n79K95R0J73o1k20K81j97m2j10K81N3j78L6n6J49J53k92
$$ 75 144 289 156 22 226 -353 -58 32 205 144 -76 205 8 -34 -144 137 190 12 48 -8 141 294 2
6031BJ90k39K23k72J54K81l87qO4n5k50L88j76n3m1L60N2j85J07K4l83L48j74
$$ 2 192 -47 176 -96 58 339 -48 -56 8 -47 -297 91 -85 -138 -179 181 233 48 155 179 -204 144 -30
6054c0N0R7k24K44l05Q6L13k04r5j48L09j21J2o5J01p0r5K46j43K02n72L56K32
$$ -30 20 117 -107 137 -168 -82 231 27 -68 -216 93 -28 -16 -81 20 -50 -145 101 -42 160 -412 -56 176
6077A76l93M24m9k25r5L36q2k3o6j9j26M66m24J69j10k14M90k91j12J85m30M23
$$ 176 -217 207 158 -67 -162 174 92 69 3 -16 -142 324 -100 69 -41 -255 235 -56 -168 17 -413 10
6099A0l0rR1q0o0J0J85P7p5k59L13k42j03k94J59K73J40k6M6j04Q0k6k48M84j4
$$ 10 -20 -29 62 -18 -78 -68 117 194 119 -140 173 -69 -172 -466 -307 -34 106 80 126 22 102 76 -172 312 298
6124B98l70M9m9j11J41P3N3l1j80J32k3J22k44P0L97n19J35P4Q5k47L75j38J7
$$ 298 -72 -23 -72 -183 -42 31 84 53 -127 5 -18 104 -140 -70 327 -192 -57 17 102 -145 230 92 109
6147A09j00j50O7l1RK68k10K9J55r4P9q0l5J31j90L20r7l72j0M39k24p5N0L8n
$$ 109 9 -141 -74 -105 -96 172 -38 -9 146 52 131 51 16 147 -43 277 180 -192 -202 237 13 -62 -12 26 21
6172B1R9l94L12k42J22J39j35P0J79r2k8P6N9p1k64K17j09J24Oo7j15J28M9m26
$$ 21 120 -274 38 -204 -82 57 -78 -8 171 79 51 127 186 115 -149 68 -41 83 89 22 -93 35 84 -342
6196c42N66k00j34K09J62l22P5J59j64R0j45J45n2k17K44M9q0Ql24O1oJ08K41
$$ -342 224 24 -110 99 261 -61 14 173 9 99 -46 99 47 -170 74 123 43 51 -273 -212 -218 -110 131
6219A31j26Rl96J63J49K6J68p4k1k58K87j11Q9j16K74k62K72l67J95K99l36R4
$$ 131 5 14 -382 -219 -70 -44 124 50 29 -229 58 -53 36 -80 194 -68 204 -163 32 331 -5 89
6241H9k58q9K91l5k17N64l93J5J53j13j71J78K19j84n1Q7l49l4M7J59l5L7L61
$$ 89 -169 -258 33 -2 -219 345 -48 -33 120 7 -164 14 233 49 -2 85 -264 -298 -251 -92 -127 -90 271
6264B71n04L81m62K78L01k44K04j23n9j38J31p0K01k0k52N5L9J13k49L64j97k98
$$ 271 -233 148 -314 -36 265 21 225 102 43 -95 36 -34 167 147 -105 -50 -11 102 -147 217 20 -278
6286b78K35K00j08jo0K11j37k43K23l50O17l18kK6r2P6j97M85l02j58R0J44L0
$$ -278 -43 157 49 48 -12 199 62 -181 42 -308 309 -9 -11 15 -77 -1 -198 287 -15 -173 -83 61 91
6309I1j41L90l11J53k97RK52j15k4j05K9K95j30l53L33J13k55JL41k47j00K7K90
$$ 91 -50 340 29 182 -115 -106 146 31 7 -98 -69 226 96 -257 76 189 -66 -65 276 29 -71 -44 246
6332B46p4k77J22j19Pnn1M2M4J38j87L39k58J3M8k8j4J09j72K50k16l6Q6N3J76
$$ 246 172 -105 17 -102 -95 -100 -151 -109 -65 73 -114 225 -33 -20 28 0 -14 95 -77 173 -43 -79 7 60 236
6357B36l12J81k14L47k84K1K58k23J80J58n31L31k16K6K6%K14J18o8j59O0M0k41
$$ 236 -76 105 -109 238 -46 -25 233 10 190 348 -183 148 -68 -42 -16 -16 198 316 248 89 149 189 -52
6380e2J2K8l0N9m40M00j53K29j66K58k89K1J43m4j16J91k91J53j33J21J45k18
$$ -52 -40 -12 -42 17 -423 -23 -176 53 -113 145 -144 -123 20 -24 -140 51 -240 -87 -220 -99 46 -172
6402a72Q5L44j95N5jK25l32J57j43J6J23m07K99k33L40k34J11J13l5k%p7L0r0
$$ -172 -87 257 62 117 116 341 9 166 23 39 162 -245 54 -179 161 -73 38 151 116 114 114 37 67 -23
6426b3MJ46L8j08j90r9J95k8n2J63J49k07j07L13j75j7P1j26L35q1j72L5j2r7
$$ -23 -19 127 165 57 -133 -232 -37 -65 -117 46 195 -12 -119 194 19 2 73 -53 282 201 29 64 52 -45
6450d5N6M7j53L35k08p4k17L67J3p1l0jk05J80l01M46k47J22q5K7P3k8k12J89
$$ -45 11 58 -95 240 32 -42 -259 108 121 50 20 19 -186 -6 -307 139 -108 14 -71 -44 29 1 -211 -22
6474b2q0K37L1k79p5M42j01j38N2Q9j90K13j40j02k6m0J60O6O0j52k81R8J35p
$$ -22 -102 135 166 -113 -188 254 153 15 67 156 -34 179 39 -63 -89 -129 31 97 157 5 -276 -178 -43 -50
6498e0r8K63p3j74J41P7q2K46k03O0n0j11K15j62L30l63KK26m12J52o1J33k2j70
$$ -50 -148 115 42 -132 9 86 4 250 47 107 57 -54 161 -1 329 -34 -32 194 -218 -66 -127 6 -16 -186
6522a86K14J46j00j30r5J26k24j42M28J78k32m4J15j10j45K51l8L4j20J69j73
$$ -186 28 174 74 -56 -151 -25 -249 -391 37 215 -17 -61 54 -56 -201 50 12 46 -74 95 -78
6543g8P3j79Q5k45K64j5R0j34k6M19m93L61j32J22Q5p5j0l52L49o8l24M34m90
$$ -78 -5 -184 -99 -344 -80 -95 -5 -139 -165 254 -239 122 -10 112 197 122 112 -240 109 41 -283 151 -339
6566c39M96J81m53k64M60j2j20o6L05j21k34NN9J42Q0o7m6r2J51k30N7K33j90
$$ -339 157 338 -115 -379 81 69 -51 -117 188 67 -167 -162 -103 39 119 52 6 -86 65 -165 -108 125 -65
6589f5R7K34p4k30J39l25M7K21k2j06j58J85R4k96L73j50j94R8J31r6R7M3j49
$$ -65 32 266 192 -38 101 -224 -177 44 22 -84 -242 -57 37 -259 114 -36 -230 -132 -1 -97 0 43 -106
6612a06n0J08L5j43L5j1J66K46P7j55j20K02m66j37L81j68K12j73P5n3k82L24
$$ -106 -156 -48 -13 -156 -121 -132 34 280 357 202 82 284 -182 -319 62 -106 106 -67 8 -45 -327 -3
6634ck29L07n5O9j2J55r7k54K27j78L03M1j1n53K73K52j70n7k36K96K2P6l12K06
$$ -3 -232 75 20 89 77 232 135 -119 108 -70 233 274 263 -290 -17 235 65 8 -228 68 90 166 -146 60
6658F0Q7j83Q3J32j8j97j68L62l42J87j53J41J40m20L82jj08J05k08L06k54K18
$$ 60 147 -36 47 179 161 -36 -204 158 -184 3 -150 -9 131 -289 93 92 -16 89 -119 187 -67 151
6680A51K2l49L81l71K5J79j67L34k5k14J15n2J47j80j50Q3m9j28j0L41k7o6L3
$$ 151 173 -176 205 -166 -141 38 -129 205 180 -34 81 29 176 -4 -154 -71 -120 -248 -258 83 56 -10 23
6703B3P1P2j26K99n64l9M50J93m09r2K13o4K17k62J08N7k38Q1m4J38j51K83J3
$$ 23 94 166 40 339 -225 -264 186 379 -30 -122 91 27 244 -18 90 147 -91 -10 -54 84 -67 216 229
6726B29j73q3O9k8K17m46j07K94M21l90J94l4k16J69j46jK01j23Q6K45n54M27
$$ 229 56 -27 42 14 231 -215 -322 -28 393 3 197 163 -53 116 -30 -31 170 47 133 378 -176 251
6748B51l59J62p6J17m4j30K15J55m7m17J98K7j81K06m9k30k8o5M99m51K76j19
$$ 251 -108 54 -22 95 51 -79 136 291 244 -173 25 52 -129 77 28 -202 -230 -295 204 -247 29 -90
6770i0L4r8N9O1j24J70j87J52R6R7J51l63N3k14MOq0M64j64J6K95j66l2j41J02
$$ -90 -56 -154 -95 -34 -158 12 -175 -23 73 170 321 -42 11 -203 -199 -193 -273 191 27 43 338 172 140 -1 101
6795A01O2j68l9L27k94j22L33r9j29O5l85R4L55j6k55K31k12K35J85l56J23L2
$$ 101 163 -5 -44 283 -11 -133 200 101 -28 37 -348 -254 101 85 -170 61 -151 84 269 -87 36 68
6817F8J27J34m77L31p1k75L90m02K61l3k2j01j0L0j52L09j39K14j47l43M15j59
$$ 68 195 329 -148 183 112 -163 227 -175 86 53 31 -70 -80 -50 -202 107 -32 182 35 -308 107 -52
6839e2Q9l4l3P9j31M6J22k83K60L4%J32l51J63J11l08O7J42k58L41J75q3k66R2
$$ -52 37 3 -30 49 -82 -36 86 -197 63 97 97 229 -122 41 152 -156 -89 53 -205 136 311 228 -38 54
6863E4J2O2j32j21o2M71k00j19K21j08j19J95j43J8j50j46K63O8j08k66O04j13
$$ 54 66 128 -4 -125 -187 284 84 -35 186 78 -41 154 11 29 -121 -267 -4 64 -44 -310 294 181
6885A81j81l4o3n9J67K43q8j74L57l57L7l9q9J69J59l53N46m59l5K27l1l07L80
$$ 181 0 -34 -97 -156 11 254 166 -8 349 -8 29 -10 -99 70 229 -124 422 -37 -72 155 124 -183 197
6908A97k11m6j4qJ23k30J28J92Qk62K44k15J43N4j95L20l41L02j59l9J03j59Q0
$$ 197 -14 -60 -74 -82 41 -189 -61 131 139 -123 121 -94 49 103 -92 228 -113 189 30 -9 94 -65 15
6931A5p5J41k02NJ03m30N09q3K5k05L83j65j71K79j78K01L6mk31k09L54P6j76
$$ 15 -60 81 -121 -116 -13 -443 66 -17 8 -197 186 21 -150 129 -49 152 188 184 -47 -256 98 174 -2
6954bn4L49j94k30L52k31pM44l35j41L46l83P4K37j40J08k60K11k42K9p9j52M23
$$ -2 -56 293 99 -131 221 -10 -17 427 92 -49 297 -86 -12 225 85 193 -67 144 -98 -69 -148 -300 123
6977A23J27l33l0J73j9m7k52J04K55pk23K25q8R4R3ql19J94j56l9J93n0k0R7j10
$$ 123 250 -83 -113 60 41 -6 -258 -154 101 94 -129 96 8 102 195 187 -132 62 -94 -133 60 10 -10 87 -23
7002b3M5j67J1j18K7K41M4q8L9j49J80m7k52K56o0J28m69O21j78k47J38O7m0r
$$ -23 22 -145 -134 -252 -225 16 60 -28 11 -138 42 -5 -257 -1 -61 67 -402 219 41 -206 -68 -1 -41 -50
7026e0K24k49L5J17k23k3J71Q4k10K57j40J58l9j42J81j92j51K00k95M79k31k2
$$ -50 174 -75 -40 77 -146 -169 2 86 -124 133 -7 151 112 -30 151 -41 -192 8 -287 192 -39 -61
7048f1O3J10K70m34K2q5l39N29j54O2J9j27N6J07r3m9n3M0J33K56q1l40J15J18
$$ -61 2 112 382 -52 -30 -115 -454 75 -79 -17 2 -125 -69 38 -55 -104 -157 -117 16 272 191 -149 -34 84
7072H4Pk15J27q5k8j20j69L52n1j63J14L16k29r7K33l00N0Q5J45k91K96J1o1K74
$$ 84 91 -124 3 -82 -110 -230 -399 -47 -98 -261 -147 169 -60 -157 76 -224 -174 -89 56 -235 61 72 11 285
7096B85n85K05j8O0j31Q8R5J99k39p1J03K3j53K03o8j08K68j01J49l44K21L2j47
$$ 285 -300 -95 -113 -53 -184 -96 -1 198 -41 -112 -9 14 -139 64 -4 -112 156 55 204 -140 81 113 -34
7119c4J92R0j36j16j70k20M13r4Q4R3k95M03j61l4rL3j43J65P3l9k5m3L22l22
$$ -34 158 248 112 -4 -174 -394 19 -75 9 102 -193 210 49 15 6 39 -104 61 134 95 70 27 349 27
7143B7p8j05J61j39l0K06j5J30N2n47K72O2n5j29K39Ok66J7K29j44K01j78K8J12
$$ 27 -51 -156 5 -134 -164 42 27 157 209 -338 -66 -4 -59 -188 51 57 -209 -192 37 -107 94 -84 -56 56
7167E6l27K50P3k00M9J12J6j42j18N73l90J0R1J09k60M6L5j23J47O0j11o0K50
$$ 56 -271 -21 52 -148 -99 13 29 -113 -231 342 -48 -38 53 162 -98 -52 -17 -140 7 67 -44 -104 146
7190A46l94L64k00K9N5k27L01m2M42o35K51J8J7j63J5j50J71rJ35j96j0lJ52m93
$$ 146 -248 116 -84 -55 0 -227 74 32 474 -161 90 108 125 -38 -23 -173 -2 -11 124 -72 -82 -85 67 -426
7214d26M45K14j57l40k8M78n3l16K1J23J09J21m26J01L30k19K22q6J31k91k13
$$ -426 19 233 76 -264 -292 186 133 -183 -162 -39 70 191 -235 -134 196 -23 199 113 244 -47 -260
7235b60J43J35l5J56K3m0j70J40J1m22K60K9k84K55J88k75K13j14j48L9M06j64
$$ -260 -117 18 -17 139 162 122 -48 92 103 -319 -59 -30 -314 -59 129 -146 67 -47 -195 -156 250 86
7257H6K10l08J03j31N7l0L73l52J75j15k71L25O9k26O8j4nj62J51j8p3q0K69j15
$$ 86 296 -12 91 -40 17 -13 360 8 183 68 -203 122 191 -35 33 19 14 -148 3 -15 -88 -168 101 -14
7281a4J68j74j53J46K20k87J43j59J24J98m60K75l36L16n2P5n0J90k93R1j4O2
$$ -14 154 -20 -173 -27 193 -94 49 -110 14 212 -248 27 -309 7 -45 30 -20 170 -123 -32 -46 16
7303A6k08J80K1N5q8r8J47K47k69Q5K8k25L43k30q7L92j71J88m11K64j29lJ84
$$ 16 -192 -12 9 64 -24 -122 25 272 3 88 116 -109 234 4 -83 309 138 326 -85 179 50 47 231
7326B31m22K04P3o1J63k03O0j81J44K62l19J32j08K4j69K04k9R1J65k82j6L0K23
$$ 231 -191 13 86 25 188 -15 45 -136 8 270 -49 83 -25 -1 -170 34 5 96 261 -21 -37 -7 216
7349B16o3k56J31N2K50j01l01p7O3l81M03oq7M4K89n0k75L01k64Q2%J10j8O8J0
$$ 216 153 -103 28 80 330 229 -72 -149 -86 -467 -64 -70 -157 -113 176 126 -149 152 -112 -30 -30 80 62 130 140
7374A40J48l02K1m8L60Mm08J22n7j4J11j98J87r7K09j50L71n00J8J54p1L9k47
$$ 140 288 -14 7 -41 319 323 -85 37 -20 -34 77 -121 66 -31 178 28 399 -101 -83 71 0 39 -208
7397b08K51K36k30q4j10J64K10k96k4k8O8L41L9l19K82k32L2m15J64J84J04j74
$$ -208 43 279 49 -35 -145 19 229 -67 -91 -119 -51 290 329 10 292 60 92 -323 -159 25 129 -45
7419d5K80k82K39l24J27J76m19J75n4L53l91o9N8J50j02L26q0j46O2j54m1l1M12
$$ -45 235 -47 192 -132 -5 171 -248 -73 -127 226 -165 -234 -176 -26 -128 198 118 -28 34 -120 -161 -192 220
7442B20k63N04j81k69j49r3M66k87P8LK33k73J8J89M0l37m5j99M32M6j40J9on0
$$ 220 -43 461 280 11 -138 -231 235 -52 26 29 262 -11 7 196 236 -101 -146 -345 87 133 -7 12 6 -44
7466d4J29J51j65j06m0M4k72M38m9o0M2j66R7j9M4m5N3k29K60r3N6j47K68j06
$$ -44 85 236 71 -35 -75 -31 -303 135 86 26 68 -98 -1 -20 24 -21 32 -197 63 -30 26 -121 147 41
7490D1M2Ll04L55l86J84j10J22K4K35r5l3k60J98lN7l89L16j3o0J52l5M73l75
$$ 41 83 86 -218 137 -249 -65 -175 -53 -29 206 111 78 -182 16 13 70 -319 -3 -16 -76 76 41 514 139
7514A39j28m6j31k5L22j14n4J51k83o7K44j28L04j59j07N5QJ35J98k48q3K5k0
$$ 139 11 -35 -166 -191 131 17 -37 114 -169 -236 8 -120 184 25 -82 -27 -19 116 314 66 -17 8 -12
7537a2K07k56L21k28p3nk5j44K35j18L22j70j3K83k43k25L42o3n0j18Q9K8j26
$$ -12 195 -61 260 32 -41 -46 -71 -215 20 -98 224 54 41 324 81 -144 198 135 85 -33 56 84 -42
7560d2K01ln9j79L47m36J8L83k42p7m9J87Lk6L46o3l27J84l45K00O9k89J67j34
$$ -42 159 156 97 -82 265 -171 -153 230 -12 -89 -138 49 52 26 372 309 -18 166 -179 21 90 -199 -32 -166
7584a66L01j10M8j58m8l8k2j16M90l33M6K2J25p9l6M2p7N5p2L12j96N7K1j26J10
$$ -166 135 25 73 -85 -133 -171 -193 -309 181 -152 -106 -84 41 -38 -74 -32 -109 -54 -126 186 -10 47 68 -58 52
7609E2j51K45K1j2k13K11m9R3r9j72JJ02J81l77L69l08M4J10j25o7j12L29j81
$$ 52 -99 146 167 155 -58 153 104 197 98 -74 -73 29 210 -167 202 -106 -62 48 -77 -144 -256 73 -108
7632a08lK71o1q4n3L3L62j64k56J0M4J69l10K50j84J16P5l3j77k88L62RJ06k99
$$ -108 -111 160 99 15 -38 -5 357 193 -63 -53 -9 160 -150 100 -84 32 107 74 -103 -391 -29 -20 86 -213
7656b13K0P5K37Jk91K65k08lL50k40J44k34J1K29l26K9K60j20P3j45J46R3k75
$$ -213 -193 -118 119 120 -171 94 -114 -117 233 -7 137 -97 -86 143 -183 -154 106 -14 59 -86 60 153 -122
7679a22J84k1j29J89J50j87r6L77l94J02K59k94L9j43J1J57r5q2L02l58l1K32
$$ -122 62 41 -88 101 251 64 -32 345 -49 53 312 18 57 -86 -75 82 -13 -95 207 -151 -182 50
7701E0K56k16j88J00J98q6J70j81j16P9k60P3p7K65qJ33l27K6J53N3oo1M5L9j58
$$ 50 306 90 -98 2 200 114 284 103 -13 66 -194 -121 -198 67 59 192 -135 -109 44 97 91 30 75 114 -44
7726d4Q1j04J99j59j01k98N79j29K29l6k20J26k40oK30l99K59J52q4K25m3l22
$$ -44 37 -67 132 -27 -128 -426 153 24 253 217 -3 123 -117 -123 107 -292 -33 119 35 260 217 -105
7748a05N1J86j40J62j59k1J86J44l06j05K4J43j97P4QL8K8J79j56k8N3j26r1k9
$$ -105 -54 132 -8 154 -5 -26 160 304 -2 -107 -83 60 -137 -63 -55 -17 11 190 34 6 59 -67 -158 -187
7772a87Q5m3K73M7m40L28J32k08J51j76n2L27J07n03J87Pm5n5LJ14K65j35j87
$$ -187 -102 -145 128 175 -265 63 195 -13 138 -38 -90 237 344 -159 28 35 -10 -65 -62 52 317 182 -5
7795ej67M90j18k65L8P8p2J96k2M1l13K15J34k14j87o1J26P7K70k63J5Nj9j44
$$ -5 -172 318 200 -65 -27 51 -21 175 153 194 -119 96 230 16 -171 -232 -106 -29 241 -22 -7 -2 -21 -165
7819a65K8J36j29Q6O1m1O9M0k0m39K45Q0J40j02K91k97k4lK2J64j78K98l18o8
$$ -165 -137 -1 -130 -44 17 -24 45 85 65 -374 -129 -49 91 -11 280 -17 -41 -44 -22 142 -36 262 -56 -124
7843a24K14J6p2N7j79nO4QQ0q5m22N23q8J1J00j9k86K47r9L0J23j2J00l12J74
$$ -124 90 106 34 91 -88 -93 -29 -21 59 -26 -448 75 -13 -2 98 79 -207 40 -59 -29 94 82 182 -130 44
7868D4j02L45k34Kk34R1L22j75k6K08o6k15J05R4p9J77l45l1J33O0o5m2l6L6k15
$$ 44 -58 287 53 55 -179 -88 234 59 33 241 175 -40 65 159 80 257 -88 -119 14 74 9 -33 -69 -33 -248
7893b48M36m05L84K94o66K42l72N41j40N3ll50JJ92J08j12j0K5m7kj69K05o1K26
$$ -248 188 -217 167 461 -205 37 -335 206 66 119 116 -234 -233 -41 67 -45 -55 -30 -77 -79 -248 -43 -104 122
7917A22Mo7l3m3PQ3j44n0K27R3m55M02k40J53j08K34k81K23k16k8L33p7k43oJ58
$$ 122 126 59 26 -17 -10 73 -71 -121 106 199 -256 146 -94 59 -49 185 -96 127 -89 -117 216 139 -104 -110 48
7942D8j99L56k79M99n39N2J9Q2j08J3k4K85j88j22m1J71j63M31j56k76J73j00
$$ 48 -151 205 -74 425 -114 -62 -43 39 -69 -56 -80 205 17 -105 -146 25 -138 293 137 -139 34 -66
7964f6Q9M3q3k72N18l76J44r4j92M59l60K63J00n43M74j31m1j14K21k28L66l07
$$ -66 23 66 -17 -289 229 -147 -3 -97 -289 170 -190 73 173 -370 104 -27 -68 -182 39 -189 177 -130
7986a30L47n20M89k77n0J4LJ22R2j54P8N2J04r8J44Mj05J4k13K3j23K20Kj28K53
$$ -130 217 -303 186 -91 -141 -127 -124 -2 90 -64 14 66 170 72 216 220 115 129 -84 -61 -184 36 38 -90 163
8011A63K85n22o0J17k61K69m3j66J51m5L27k22k6k43J69K3K7m5Q6j3r9K88j77
$$ 163 448 -74 -134 -17 -278 -9 -52 -218 -67 -112 215 -7 -33 -276 -107 -84 -57 -102 -16 -29 -128 160 -17
8034a7m0J63J06P0k20l04M72k52J48q9j05Mj14LK59j59M81m82k99N19l25O1L31
$$ -17 -57 106 212 282 62 -242 230 -22 126 37 -68 -64 -178 -175 84 -75 406 -76 -375 144 -181 -120 211
8057B11j48K44m52J37K47m90N0OJ91j35p8K07j18R2J0l51L12nQ8j07J95j72M2
$$ 211 63 307 -145 -8 239 -251 -201 -195 -4 -139 -217 -10 -128 -36 -26 -377 -65 -70 18 -89 106 -66 -24
8080b4l1J43l64K09M3l1J68m2n4J86j24k47K66k08J76j66L69m60J71k29J35J9
$$ -24 -55 88 -276 -67 -24 -55 113 71 17 203 79 -168 98 -110 66 -100 269 -191 -20 -249 -114 -95
8102i5J09p4j85L70k02L35l82J80kJ40n07M76k29k50L30M9r7J79l94K99N1j9o3
$$ -95 14 -60 -245 125 -77 258 -124 56 54 194 -313 163 -66 -316 14 63 -34 145 -249 50 101 82 19
8125A9j36J59P0M9k63K23l11m7K21j20J28j88K10M1k52J69K23k50K29n7m7J6j34
$$ 19 -117 42 112 161 -102 121 -190 -237 -16 -136 -8 -196 14 55 -197 -28 195 -55 174 117 70 86 -48
8148d8M9j39lO4P2n1R3j7k75R1M91j77j44J17n04K97O4J4j37l1J12L72k15o6J29
$$ -48 1 -138 -141 -77 -5 -56 37 20 -255 -164 327 150 6 123 -381 -84 -20 -6 -143 -174 -62 310 95 29 158
8173A58j47n3k10J35m8p2J53q7K49k40J02K09m8l79J60J7k9J7
$$ 158 11 -42 -252 -117 -165 -237 -84 -171 78 -162 -60 149 101 -278 -118 -101 -130 -113
8191a13
$$ Imaginary data points
##PAGE= N=2
##DATA TABLE= (X++(I..I)), XYDATA
0@%%%%%%%%%%%%%%%qJ6j6J6j6J6k4L2l2M0m8N6o5P3q8J03j16J30j49J68j87K11
$$ 0 0 0 0 0 0 0 0 0 0 0 0 0 0 0 0 -8 8 -8 8 -8 8 -16 16 -16 24 -24 32 -33 40 -48 55 -61 69 -80 88 -99 112
37A12k36K63k94L27l66M06m47M95n50O09o72P40q13Q95r86J088j199J324j466
$$ 112 -124 139 -155 172 -194 212 -235 260 -290 319 -353 387 -426 469 -517 571 -628 696 -770
56g70J624j808K019k265K561k919L367l943M714n815P524j0551J7573o9182j8989
$$ -770 854 -954 1065 -1200 1361 -1558 1809 -2134 2580 -3235 4289 -6262 11311 -57871 -76860
71g6860P4713N512J3544K35r664j6079L1208L7246K332l9629l5579k7855j4221
$$ -76860 -2147 3365 16909 17144 7480 -8599 22609 59855 62187 22558 -13021 -40876 -55097
84e5097O329L7377L3396N998j9233j1874k578o03L882K0901J2574j7556l1334
$$ -55097 -48768 -11391 22005 28003 8770 -3104 -5682 -6285 -2403 18498 31072 13516 -17818
97a7818p914R173R136J7123K5885m065m2714l4056O566K1908K0842K8333J6163
$$ -17818 -25732 -16559 -7423 9700 35585 31520 -11194 -45250 -38684 -16776 4066 32399 48562
110D8562k4583l7747l454K2111J2315j561j1053k7984l4091o558L2672M5241K7022
$$ 48562 23979 -13768 -17222 4889 17204 15643 4590 -23394 -57485 -64043 -31371 13870 40892
123D0892M799q352j5353j8225o831J0555O278j7241k4780r579r21L080K2605L9113
$$ 40892 45691 37339 21986 3761 -3070 7485 13763 -3478 -28258 -37837 -38758 -35678 -13073 26040
137B6040J9461j2279j9252j1525j4135o712J7495K0831p334k4858j2715K607Q789
$$ 26040 45501 33222 13970 2445 -11690 -18402 -907 19924 12590 -12268 -24983 -22376 -13587
150a3587K1057K5508O19k9090k9080n269J4367K1277J8757M460j6189k7200j3932
$$ -13587 7470 32978 33597 4507 -24573 -29842 -15475 5802 24559 29019 12830 -14370 -28302
163b8302J1240K0159P585m021p233j1551j0255J0666K9111J6900m448r592j3360
$$ -28302 -17062 3097 10682 6661 -572 -12123 -22378 -11712 17399 34299 29851 20259 6899
176F899k2894j6617P803J7222N452k134L18k597m719J0566K4763J5656p310k0895
$$ 6899 -15995 -32612 -24809 -7587 -2135 -4269 -3951 -6548 -11267 -701 24062 39718 32408 11513
190A1513k2109j6601k996J6232K2499O834j2083j6396l499R524J4427J4350M798
$$ 11513 -10596 -27197 -30193 -13961 8538 15372 3289 -13107 -16606 -7082 7345 21695 26493
203B6493j5080k6389j1940J0897J5430J0453P370l055j7303j4538N013J3666O846
$$ 26493 11413 -14976 -26916 -16019 -589 9864 17234 14179 -3124 -17662 -12649 1017 7863
216G863K640Q57q710j4600k710J0009J0938M966m94p064j4772j0892L060J6579
$$ 7863 10503 11360 2650 -11950 -14660 -4651 6287 11253 10759 3695 -11077 -21969 -18909 -2330
230b330J6122N378n331j0466j0919k330J0054J5287J836j5159j6560q334N98J1096
$$ -2330 13792 19170 13839 3373 -7546 -9876 178 15465 17301 2142 -14418 -22752 -22154 -11058
244a1058K0294J2393p796j5626o297K273M743Q951P239n531j5340r243K518P149
$$ -11058 9236 21629 13833 -1793 -8090 -5817 -1074 7877 15116 9585 -5755 -14998 -12480 -5331
258e331Q483P934K064q074j1100n484K841P086O617L718k072r491r686m3J0948
$$ -5331 3152 11086 13150 5076 -6024 -11508 -8667 -1581 5036 8754 6682 -2809 -12495 -12538 -1590
273a590J1620M167k361q756j3157n609R152J4685M902n171q835j0200n507P816
$$ -1590 10030 14197 11836 3080 -10077 -15686 -6534 8151 13053 7882 -953 -11153 -16660 -8844
287h844J5217P877m821r721p651k743M351J0956Q461k204q709q091k665K383O035
$$ -8844 6373 14250 9429 -292 -7943 -10686 -6335 4621 13082 10878 2169 -5922 -8587 -6204 -169
302a69O479K930m786q722n399J307M690O198O100R98q067r999j581N590P149O500
$$ -169 6310 9240 4454 -4268 -9667 -8360 -3670 2528 8628 9626 1559 -8440 -10021 -4431 2718 9218
318I218K558o778j1829m858N759R338N972R23o464j1798p668M240J1012P861J357
$$ 9218 11776 4998 -6831 -11689 -5930 3408 9380 10303 3839 -7959 -15627 -11387 -375 7486 8843
333H843m473o535l908K021P715P096j78p237q321m734j050L867Q187N929o94m527
$$ 8843 4370 -2165 -6073 -4052 3663 10759 10581 3344 -4977 -9711 -10761 -6894 1293 7222 6528 2001
349B001l924j191J10L955O021K87o900p446l274J611O578R628N588m003r385o590
$$ 2001 -1923 -3114 -3004 951 6972 7259 359 -7087 -10361 -8750 -2172 7456 13044 9041 -344 -6934
365f934j65M798O906L526l878q691o564Q16P858Q362K878k924o697o400r66N941
$$ -6934 -7099 -2301 4605 8131 4253 -4438 -11002 -10186 -2328 6034 8912 5988 -709 -7109 -8075 -2134
381b134P852L754k161m258n158m028P14M714K805j441k984k650k268R48P225Q050
$$ -2134 5718 9472 7311 3053 -2105 -6133 -5419 -705 2100 659 -2325 -4975 -7243 -6295 930 8980
397H980L465k407o463p447m489J240N499M815n65n087m061L15N473P960N276j037
$$ 8980 12445 10038 3575 -3872 -8361 -7121 -1622 3193 2628 -2459 -6520 -6205 -732 7228 12504 11467
413A1467q616j0196m017K830O225N231J938l181n160j815M668N652K379L01m132
$$ 11467 2851 -7345 -11362 -8532 -2307 2924 4862 1681 -3479 -5294 -626 5026 7405 7706 3574
428C574o559m780J312M276M127K273m16l920n068k172K446N125M585J347k032
$$ 3574 -2985 -7765 -6453 -2177 1950 4223 3807 -113 -5181 -7353 -4907 218 4803 6150 4118
443D118m404k654J466M779M534o35o708q116m772N19O724R078M694k368m827k521
$$ 4118 -286 -2940 -1474 3305 7839 7204 496 -7620 -12392 -11873 -5149 3929 8623 6255 1428 -1093
459a093M59L231L738K6o013p868l778J901N597P019M905M4l688m346k172N57J709
$$ -1093 -634 2597 6335 6361 348 -7520 -11298 -9397 -3800 3219 8124 8168 4480 134 -2038 -1481 228
476B28J258p07k908l125j984K029N678M927K596j807m602n802j171L490N796K549
$$ 228 1486 779 -2129 -5254 -7238 -5209 469 5396 7992 6185 1583 -4219 -5390 -1900 3896 6445
492F445j453m623n671k453L634N747K651k378m533l682k88N146P853M268j514
$$ 6445 4992 369 -5302 -7755 -4121 1626 4277 1899 -2634 -6316 -6604 -1458 6395 10663 9149
507I149n220n824l705L81K286K501M09k174k015K43L073M385L838J126j981o460
$$ 9149 3929 -1895 -5600 -5219 -2933 -432 -23 -2197 -4212 -3969 -896 3489 7327 8453 6472 12
523A2n644k073J354L309M348K362j951l532q14L155L817L255q69n127p187l595
$$ 12 -5632 -7705 -6351 -3042 1306 3668 1717 -1815 -2629 526 4343 7598 6729 1602 -5585 -9180
539i180J732N858N214J609k784n009k607J600M741M152Q07l121l965k479Q82L034
$$ -9180 -7448 -1590 3624 5233 2449 -2560 -5167 -3567 1174 5326 6133 3012 -953 -3432 -2550 484
555D84L446P23l135m856l083p07J980M813M492J472j732k706j676l3J883K290
$$ 484 3930 4653 1518 -3338 -6421 -7128 -5148 -335 4157 5629 3897 1191 -485 -518 1365 3655
571C655k13l704n114l086J003M993O827M026j318m981n030j031K574L623J087
$$ 3655 3442 -262 -5376 -8462 -7459 -2466 4361 8387 7069 2088 -2942 -3973 -1399 2224 3311
586C311k464m832l176P45N380O066K479j291l637m336k153J079L739J852p34k237
$$ 3311 847 -3985 -7161 -6416 -1036 5030 7509 6218 2581 -1755 -3908 -2829 910 2762 2028 -209
602b09k628j776P28L486L121J146j327l207k779k11L298M489K622q85m153n207
$$ -209 -2837 -4613 -3885 -399 2722 3868 2541 -666 -3445 -3656 -358 4131 6753 5868 1715 -3492
618c492k939J723M150L383Q3l739l763l11L884N035L877o47n032n955k865J918
$$ -3492 -6431 -4708 -558 2825 2908 -831 -4594 -4905 -1021 4014 7891 7244 2212 -3743 -6608 -4690
634d690L465L595Q41j927l168j266J809L580K212Nk146m349l361k48K288L678
$$ -4690 -1225 2370 3211 1284 -1884 -3150 -1341 2239 4451 4456 2310 -2039 -5400 -5648 -3360 318
650C18L036M31k254l078j560J441L148L545J89l480m711k789J087L925M716J246
$$ 318 3354 3785 1531 -1547 -3107 -1666 1482 5027 5216 1736 -2975 -5764 -4677 -752 3964 5210
666E210l604m657k825O85M428N294J844l048m536k352O02L205L641R55k745m460
$$ 5210 1606 -3051 -5876 -5191 -763 4531 6375 3327 -1209 -3561 -2959 246 3887 4842 2097 -2363
682b363k798K76K607L772K326k13k644k839j225R42K626K261O07j875l250k549
$$ -2363 -5161 -4885 -2278 1494 3820 3607 963 -1876 -3101 -2159 467 2728 3335 1460 -1790 -4339
698d339L67L784M307J877j898m257m301j193L311M867J908j752m151l795p45M017
$$ -4339 -3972 -188 4119 5996 4098 -159 -4460 -5653 -2342 2525 4433 2681 -1470 -5265 -6010 -1993
714a993N532K612j507m353l923p30K469M230K298j091l613l498j047J914L393
$$ -1993 3539 6151 4644 291 -3632 -4362 -1893 2337 4635 3544 -69 -3567 -4614 -2700 693
729F93K181N69j897l460k074N36K300L333J592m71l169l117p20K195L984K408
$$ 693 2874 3443 1546 -1914 -3988 -3452 -1152 2181 3773 3302 133 -2984 -3704 -1509 2475 4883
745D883l12l939m945j692K318M446L512j31l563m504j611K822M469L750l25l691
$$ 4883 4571 632 -4313 -6005 -3687 759 4271 4140 577 -3927 -5538 -2716 1753 5503 5178 1487
761A487m335j593J865M077K992o6l489l341k095M56K778L214J402j352k748j997
$$ 1487 -2848 -4441 -2576 1501 4493 4427 938 -2403 -4498 -4042 -1264 1950 3352 2000 -748 -2745
777b745j74J755L081K408l45l559l678j605J022L798L775J589k890m182k407O99
$$ -2745 -2919 -1164 1917 4325 3980 421 -3257 -4862 -3840 -42 3733 5322 2432 -1750 -4157 -3458
793c458L594L844J37l570m659k870K065M849N108J593k846l669k711j67L174L069
$$ -3458 136 3980 4117 547 -4112 -6982 -4917 -68 5040 6633 3787 118 -2593 -2760 414 3483
809C483l87k369l648k025J2K771L964K003k20k686k622j527J146K731K672N30
$$ 3483 3096 727 -2921 -4946 -4934 -2163 1801 3804 3584 898 -1724 -3251 -2105 626 3298 3828
825C828j513l680k443J80K850L546J690k087m405l433N33L927M691K334j692m629
$$ 3828 2315 -1365 -3808 -3628 -778 2768 4458 2371 -2034 -5467 -4934 -1007 3684 6018 4326 -303
841c03l899m13K928L570J840j910l526k625J087L661L925J949j513l764m268j617
$$ -303 -4202 -4615 -1687 1883 3723 1813 -1713 -4338 -3251 410 4335 6284 4771 1007 -3261 -4878
857d878R11K231K001R70j132k005k68Q50L108L046R45j822m135l693j351K137
$$ -4878 -3967 -1736 265 1235 103 -1902 -2170 -1320 1788 4834 5779 3957 -178 -3871 -5222 -3085
873c085L888K725o15l571l171p11K514M277K151p13l827l681n89K984L837L044
$$ -3085 803 3528 2913 -658 -3829 -4540 -2026 2251 4402 3689 -138 -3819 -4408 -1424 2413 5457
889E457j094l869m100j288J838K985L035J31k134k478o44P81K616J928j31k296
$$ 5457 4363 494 -3606 -4894 -3056 -71 2964 3095 961 -1517 -2161 -1380 1236 3164 3033 737
905G37k933k852j25K191M249K886L89j815k506j656Q93K250J988j325l925l565
$$ 737 -2196 -5048 -5173 -2982 1267 4153 4542 2727 221 -1435 -542 1708 3696 2371 -1554 -5119
921e119k022K522M889M422L88k423l637j819Q75L285K616n46k903l290j499J113
$$ -5119 -7141 -4619 270 4692 5080 2657 -980 -2799 -1924 1361 3977 3431 528 -2762 -4261 -3148
937c148L649K595O4j468l056k395M89K464K368K073r99j610k524j037J340J592
$$ -3148 501 3096 3160 1692 -1364 -3759 -3270 -806 1562 3635 2636 1026 -1498 -2535 -1195 397
953C97J694L15k053k860j607J842L270L438J183k158m650k860j22K301K955R75
$$ 397 2091 2406 353 -2507 -4114 -2272 998 4436 5619 3461 -1189 -4049 -4171 -1870 1085 2060
969B060j775l041r15J532L805L521Q63k280l683l043o33J541K478R83p45k135
$$ 2060 285 -2756 -3671 -2139 1666 5187 6050 3770 87 -2956 -3589 -2048 430 1413 668 -1467
985a467j181K87J783K060J658J06k119k411j597M50K302K372J342j574k664k640
$$ -1467 -2648 -2361 -578 1482 3140 3246 1127 -1284 -2881 -2431 -129 2243 3585 2011 -653 -3293
1001c293J36J987K876J339j059k667k535K22K504L463J387j429l704k650q09J978
$$ -3293 -3157 -1170 1706 3045 1986 -681 -3216 -2994 -490 2973 4360 2931 -773 -3423 -4232 -2254
1017b254L548J973p14j812k110m13J606J848J182j148k497k120j112Q66K127K517
$$ -2254 1294 3267 2553 741 -1369 -1782 -176 1672 2854 1706 -791 -2911 -4023 -3157 -1030 1487
1033A487J275n45j440j793O8Q00K027Q27q64k439k670p62J886L244J951k11k406
$$ 1487 2762 2217 777 -1016 -948 -148 1879 2706 1842 -597 -3267 -4029 -2143 1101 3052 2841 435
1050D35k682j191J787K580J991j19k082k744j116J900K446J738n68j825k657j143
$$ 435 -2247 -3438 -1651 929 2920 2801 719 -2025 -3141 -1241 1205 2943 2375 550 -2107 -3250
1066c250J224K140J665M98j070j860j298r1J516R77J318n93j537j474j98R12K343
$$ -3250 -2026 114 1779 2277 1207 -653 -1951 -2042 -526 451 1769 1176 -361 -1835 -2033 -1121 1222
1083A222J900J20j986k656j621N98J951K251K81j599k201j070J014K177K704J99
$$ 1222 3122 3242 1256 -1400 -3021 -2423 -472 1779 2060 461 -1740 -2810 -1796 381 3085 3284
1099C284j965k258j865P85J984J971L14j122k057j316K58J624J832M17p92j501
$$ 3284 1319 -939 -2804 -2019 -35 1936 2250 1128 -929 -2245 -1987 -363 1469 1886 1094 -407
1115d07j659P8R03J589J093J41r49j464j097K24J837J428O56j050j938j896M4
$$ -407 -2066 -1988 -1085 504 1597 1738 789 -675 -1772 -1548 289 1717 2373 1323 -615 -2511 -2467
1132b467J626J934J415j188k069j557k46J782K533J109q79k040j873l70J739K232
$$ -2467 -841 1093 2508 1320 -749 -2306 -2552 -770 1763 2872 1993 -47 -1920 -2290 -551 1681
1148A681O99q72j730j434n42J110J519R86p5j221j229p36M33J531J029R87q42
$$ 1681 2380 1508 -222 -1656 -2198 -1088 431 1417 1342 121 -1108 -1844 -1411 120 1149 2136 1294
1165A294j377j428l17P93J862J679l60j872j688q56P18J984J244k56j807j797
$$ 1294 -83 -1511 -1828 -1035 827 2506 2146 274 -1414 -2270 -1552 432 1676 1420 -387 -2184
1181b184l79J193K435J773L19j787k342q91N52J515J277j20j434j608l25P61J556
$$ -2184 -2563 -1370 1065 2838 3157 1370 -972 -1863 -1311 204 1481 1361 -73 -1681 -2006 -1245 311
1198C11J359M92p80j395j156n96N29J251J265O4q75j404p10P71J574J392k1j323
$$ 311 1670 2162 1382 -13 -1169 -1765 -1236 15 1280 1344 469 -935 -1645 -874 700 2092 2071 748
1216G48k079j345M72J930J987P00j553j791j405J17J960J705P46j112j592p97
$$ 748 -1331 -2676 -2204 -274 1713 2413 860 -931 -2336 -2219 -259 1446 2192 1080 -512 -1309
1232a309K05J613J567L35j249k090j531j94P19J641J395J41n01q41j44N11P66
$$ -1309 -1104 509 2076 2411 1162 -928 -2459 -2653 -1934 -293 1102 1243 742 -99 -243 268 1034
1249A034Q01m25p48k010j418OJ998J689J157m24j311j369n15J226J480L90j67
$$ 1034 1835 1410 662 -1348 -2766 -2760 -762 927 2084 1660 349 -1020 -1535 -309 1171 1561 1394
1266A394j938j795k08J683K110J192l66j620j680m69Q57J586Q55j65j440j062
$$ 1394 -544 -2339 -2547 -864 1246 2438 2072 452 -1228 -1697 -840 746 1601 1436 -4 -1066
1282a066o53R77Q21O06J72j005q43r91P92J354J650J103n31j149j845q72J72J114
$$ -1066 -1719 -742 79 685 857 -148 -991 -1982 -1190 164 1814 2917 2386 1237 -608 -1480 -1308 -194
1300a94M41l08r41j372l37J810K256J949j55j659k274j403L98J230J706q5j236
$$ -194 247 -61 -1002 -2374 -2711 -901 1355 3304 3149 1490 -784 -2187 -1789 -559 1147 1062 -174
1317a74j340l58R65K094J088N27k041j692j102J25P86J637P78o32o34j218j54
$$ -174 -1514 -1872 -907 1187 2275 2802 761 -931 -2033 -1908 -1122 515 1293 661 27 -1191 -1345
1334a345Q90J211R01j54q50j389p13N32J649J272P3j274k425j445J85J656K105
$$ -1345 -455 756 1657 1503 653 -736 -1449 -917 732 2004 2077 803 -1622 -3067 -2882 -1226 879
1351H79P85n44j496l59O63J237J679j1k013k468j472K7J493J828J022q5q27q58
$$ 879 1664 1120 -376 -735 -72 1165 2844 2833 820 -1648 -3120 -3093 -1600 228 1250 1165 338 -520
1369e20L10Q10N44L21l49j631j072m95O15J371J513P46m42j325j739p9J239J272
$$ -520 -210 600 1144 1465 1116 -515 -1587 -2082 -1467 -96 1417 2163 1721 396 -1343 -1422 -183 1089
1387A089O05q40j622j348Q5J397J992Q00r60j751j718K21J531J929Q59m35j419
$$ 1089 1694 854 -768 -2116 -2031 -634 1358 2158 1198 -553 -2271 -2050 -519 1410 2269 1834 415
1404D15j167n49O59J232L85o90j578q06k96J108J782J451P04r99j231j054k17
$$ 415 -752 -1301 -642 590 975 285 -1293 -2099 -2395 -1287 495 1946 2650 1651 420 -634 -851
1421h51K35Q49N39k70j373p58l75J774J664J218n70k028j522o56P27J734J251
$$ -851 -616 233 772 502 -871 -1629 -2004 -230 1434 2652 2082 54 -1468 -2124 -1397 337 1588
1438A588m62j285j542p5J311J752J077l37j578j934k40O00J530Q99r6j009q92
$$ 1588 1126 -159 -1701 -1776 -465 1287 2364 2027 449 -1485 -1725 -1125 405 1304 1208 199 -693
1455f93p25J25Q46J471J63m21r16o38N1Q46J141L56P2j371j616j010N34J526J217
$$ -693 -1418 -1293 -447 1024 1187 766 -150 -788 -737 109 1250 1606 1678 307 -1309 -2319 -1785 -259 958
1474I58N89j107j220n50M72J450J170J41j200k028j027O93J751J499j42q43j444
$$ 958 1547 440 -780 -1330 -858 592 1762 1903 703 -1325 -2352 -1659 92 1591 1449 606 -838
1491h38m08L19J053O98J72q35j197o38K18P95J101Q74k35l54j340l84Q07N34P42
$$ -838 -1246 -927 126 824 996 161 -1036 -1674 -1456 -661 440 1314 1079 725 -615 -999 -192 342 1084
1510A084K52r42j315o82o7J699J108L36r71j206j072L07J187J541M06o56j611
$$ 1084 1336 394 -921 -1603 -1670 29 1137 1473 502 -704 -1776 -1469 -282 1259 1665 1009 -602
1527f02j055K93J507J168O57j074j139j004jP80R45N48m53q40o22j87M68J429
$$ -602 -1657 -1364 143 1311 1968 894 -245 -1249 -1250 -470 475 1023 570 -270 -892 -1079 -611 818
1545H18J85K05o80q32q67M13Q09R19L87m27j336p97l15O42J173J028n26j237p97
$$ 818 1003 1208 528 -304 -1171 -758 51 970 1357 930 -406 -1203 -1518 -876 297 1325 799 -438 -1235
1564a235k84J202J424J192q51j209j476l95R93Q70P06l69p49j025l8J017N94J116
$$ -1235 -1519 -317 1107 2299 1448 239 -1237 -1632 -639 231 937 568 -181 -1206 -1244 -227 367 1483
1582A483j50j302j004n61L21O46P47P44k61m84o36k17Q61Q93N04n28r84j489m30
$$ 1483 1333 31 -973 -1534 -1213 -567 180 924 663 179 -457 -674 187 1080 1584 1056 72 -1417 -1847
1601a847N28J481Q51J46j072j201j16O22J043J104p5p55j550q20J003J282P45
$$ -1847 -1319 162 1013 1159 87 -1114 -1230 -608 435 1539 1464 709 -841 -1661 -658 624 1369
1618A369n55o02j541m49M28J022P61N19K3p01o03L84J0N07K05k92j043q91m12
$$ 1369 814 212 -1329 -1778 -1350 -328 433 952 975 274 -329 55 65 572 777 485 -558 -1449 -1861
1637a861Q48J135J382L98p86q96r59J2O61O69r8j116r61k92L25J988J181O80p38
$$ -1861 -1013 122 1504 1902 1116 220 -739 -727 -66 603 505 -611 -1572 -1864 -1539 449 1630 2310 1572
1656A572j665o47%O86O87L3o50q74o83M83Q02P64N00m44o40q70l4O45P50Q90j88
$$ 1572 -93 -740 -740 -54 633 666 16 -858 -1541 -1058 -256 508 1008 564 -76 -946 -980 -335 415 1305 1117
1677A117k91r36q68q6M33O22K10J70j221m80N40J328P44J013r74j514j142l83
$$ 1117 826 -110 -978 -1064 -631 -9 201 371 -850 -1330 -790 538 1282 2295 1321 -193 -1335 -1718
1695a718N62R56O46m53l35n63M00J024J076M41q31j298j233m98L94R18P75J19
$$ -1718 -1156 -200 446 -7 -342 -905 -505 519 1595 2036 1205 -93 -1326 -1824 -1430 -512 263 382
1713C82k19m34o0J78P77N03R4n95q43j045O0O29J002O21n63p29q19l54M76J131
$$ 382 163 -271 -331 -153 624 1127 1221 626 -217 -1262 -1202 -573 429 1050 487 -242 -1061 -1415 -939 192
1733A92Q23Q4j013n94j24P20O59O46o57j083j165l18L50J248J188K69l30o98p4
$$ 192 1015 1099 86 -508 -632 88 747 1393 736 -347 -1512 -1830 -1480 -232 956 1225 895 197 123
1752A23k2L33k1J01j034o11m38K64Q13J221L64O72q60q21o09K01M43J88K7j167
$$ 123 101 434 413 514 -520 -1131 -1569 -1305 -492 729 1093 1765 905 84 -525 -324 119 307 334 -833
1772h33m78l59O26J031J253Ol53j266o77N64N57J032N4p65r84n12K85P66M79j31
$$ -833 -1311 -1670 -1044 -13 1240 1246 893 -373 -1050 -486 71 1103 1157 392 -592 -1104 -819 -53 426 295
1792B95k00j063j80M09P73R32N02m34q09n80k91j66M09M00o5L6p95J82O93N40
$$ 295 95 -968 -1148 -739 34 966 1468 1034 225 -355 -646 -812 -403 -3 -68 -32 -827 -645 48 588
1812E88P50K23o68j302q56n59R65Q63M86k76o51j62N15R56P61j3o75j342n87l06
$$ 588 1338 1561 893 -409 -1265 -1824 -859 4 490 214 -437 -599 -84 872 1633 1620 945 -397 -984 -1290
1832a290Q07O39O82m33o73o61K28N87M76L01p8m13o49P4rP59K40M71p97n06q36
$$ -1290 -483 156 838 405 -268 -929 -701 -114 362 663 585 172 -477 -403 -412 347 587 1058 261 -245 -1081
1853a081J03N51M98P17j74l24p22k70P99P61K61o53o43r59k56O34J289R34k96
$$ -1081 -978 -427 71 788 614 290 -432 -702 97 858 1119 466 -177 -1136 -1392 -758 531 1465 1169
1872A169r36m57l39M50L92L20l84o33q64J18N56Q55O60J55m72j47o81l41M90O79
$$ 1169 233 -224 -563 -113 279 599 215 -418 -1282 -1164 -608 247 907 1062 590 443 -238 -579 -89 590
1892E90J84n4q91l74m10L09R53O04l88o51o70l50O14Q04R94j04o86p82o23L22
$$ 590 774 720 -171 -545 -955 -646 307 911 523 -128 -798 -1148 -534 270 1264 1160 474 -308 -931 -609
1912f09P32N54K17n83q51m53J77P10Q04K71m88r25m55J63P64M10Rj2m65m72n4
$$ -609 123 677 894 311 -540 -993 -816 -106 698 969 481 -444 -899 -736 28 438 447 435 -30 -502 -556
1933e56M97P85P2q6n17n75m95J12P52M91J51k67j015l79M22R09O43N0n28q00n52
$$ -556 -59 726 798 712 195 -380 -875 -763 -11 480 631 364 -651 -1030 -608 301 944 994 466 -334 -886
1954h86K99O57L36M21l17r48k34l57Q21R65K74p43n92m29k74P92P77J67o6m50
$$ -886 -587 70 406 827 510 -438 -672 -1029 -208 757 1031 288 -304 -733 -1007 -215 562 729 663 213
1974B13n90K6J51M17N41J5n09p07n84j41J047M18M98n7q46o15j75O87N59P47k96
$$ 213 -377 -351 -200 217 758 773 264 -443 -1027 -1168 -121 297 795 738 -108 -723 -898 -211 348 1095 799
1995G99j078n45P6N35R64K87m87n67q11n4O35M42N38k29l86q24K21J66O03J59
$$ 799 -279 -824 -748 -213 751 1038 551 -16 -827 -881 -246 196 734 505 119 -705 -484 -318 285 444
2015D44L60o88n57m67R2O12Q08M24k32p48m95k59O9P34M84m84n48l82k65R58J177
$$ 444 804 116 -441 -908 -816 -204 604 1028 796 48 -447 -706 -637 97 581 97 -451 -833 -1098 -140 1037
2036A037K91j39o33r10l80K90O79L01M4q08n00o2L82O78N85J52p65o94m44K44
$$ 1037 1328 1189 556 -354 -734 -444 235 536 580 -228 -728 -790 -408 270 855 1007 242 -452 -896 -652
2056f52L68P99J74r5o61o83K44L66O27m6J36o43p60j74K47R19O76m3m27j130n70
$$ -652 -284 515 689 594 -67 -750 -506 -140 487 441 577 -66 -826 -1000 -753 166 842 799 372 -758 -1328
2077a328N07R18N35J69l47q92k66N50J007K20k33p55p95o34O2N57Q41M93j63l25
$$ -1328 -821 97 632 801 454 -438 -704 -154 853 1073 840 85 -710 -1344 -1282 -725 116 609 446 121
2097A21j28j11O88J20L66n66l98o35p10L94O63P74R6k23n99n81j38J032P63l48
$$ 121 -7 -118 570 690 1056 490 92 -543 -1253 -859 -196 578 674 451 -148 -729 -867 165 928 580
2117E80p2j050l19K85M47J060lk53q52p83J72Q35O59J35k96p02j81r3K38N69J06
$$ 580 508 -542 -861 -576 -129 931 928 675 -177 -960 -788 47 706 841 545 -157 -338 -431 -193 376 482
2138D82k37n70m70n1N32R35J21M44k99o22q02R4J93L01k02n8k47q06M39N33J010
$$ 482 245 -325 -795 -846 -314 621 742 1186 887 265 -537 -443 -250 51 -151 -209 -456 -1262 -823 -290 720
2159G20O24n51o07p76j58M32M36M76m6o33n44k55R53N21L47l16m82n19n11M63
$$ 720 1344 793 186 -590 -748 -316 120 596 550 -83 -627 -882 71 592 939 623 141 -378 -889 -426
2179d26M82O85j44n16l39l32k1O08L40J04k4j96o76L27J89O99L38l58o38p73k80
$$ -426 56 741 597 81 -258 -590 -611 -3 337 441 417 221 -455 -128 61 760 1098 740 102 -671 -951
2200i51j26R04J002k97n1o84k45M60P22K63J73r30j143k55J66O80P96J67m84k88
$$ -951 -1077 -173 829 532 481 -203 -448 12 734 997 1170 240 -903 -1158 -992 -312 484 651 167 -121
2220a21m80M11L78J22K15k81p05m62N06L01N78P0o5j89k93n57K32O10K05J17m23
$$ -121 -601 -190 188 310 525 244 -461 -923 -417 -116 462 532 467 278 -15 -572 -340 270 475 592 169
2241A69n24k87M57J38L83O2j50q91l57P5Q82J017R1l60n69n99k7L60N06j88l94
$$ 169 -355 -642 -185 -47 336 398 248 -643 -1000 -925 -43 974 1065 705 136 -463 -490 -130 376 188 -206
2262b06n53m42M05P08M70O14l07l30n81l15N26p0K96L0m30k77j43K71M44M72K50
$$ -206 -759 -1201 -796 -88 382 996 689 359 -222 -537 -11 -81 215 245 -185 -462 -605 -334 110 582 832
2283H32l86o18o32j15O63O22L07m01n61k19o3M89L17M01P4n29p80J4L04Q51J46
$$ 832 446 -172 -804 -919 -256 366 673 272 -289 -508 -571 -82 235 636 710 181 -599 -585 -281 570 716
2304G16k21m99l98k18L56J22K97J69n64J45j13P0L04M77Q3l44o09m54k93M11P20
$$ 716 495 -4 -402 -620 -264 -142 155 324 -240 -95 -208 -138 166 643 726 382 -227 -681 -974 -563 157
2325A57L19k67q3q00L01K90L54N78j91n93o40j87L75P50N11j98m04p42l99M50
$$ 157 476 209 126 -674 -373 -83 271 849 658 65 -575 -762 -387 363 874 676 272 -470 -869 -419
2345d19P10M33O9o09q38K47N0M19K2M40k90j72m98M9J82M50M54q4m96m72k88L32
$$ -419 291 724 793 184 -654 -407 -357 62 84 524 234 62 -436 -387 -205 245 699 615 119 -353 -641 -309
2367c09Q6O30J57l54p63n63L29R68P62k40J5q75k84M8O67M97j78n30m96k24K78
$$ -309 -223 407 564 210 -553 -1116 -787 181 943 703 718 -157 -441 -393 274 771 593 63 -433 -657 -379
2388c79M57N32K83n59l30m85K07K73J75M98k58o43l78K69K46J27N37j22k64n80
$$ -379 78 610 893 334 4 -481 -274 -1 174 672 414 -229 -607 -338 -92 35 572 450 186 -394
2408c94k28o4N24L36K93j43l78m79N2M87L96K60j10o35p96N92J46L89K92m18j69
$$ -394 -622 -686 -162 174 467 324 -54 -533 -481 6 402 662 552 -83 -879 -287 -141 248 540 122 -47
2429d7m05k07N51M15K32j51n07l32j55L48Q1P63k41j54k62k22n1L89J25K49l41
$$ -47 -452 -659 -108 307 539 388 -119 -451 -606 -258 -177 586 345 191 -71 -293 -344 45 170 419 78
2450G8j36l67p7K68K60L87k4n95l50JJ92P57K42Q8n45m71l36N50L67L95k78n82
$$ 78 -58 -425 -502 -234 26 413 389 -206 -556 -555 -363 394 636 724 179 -292 -628 -78 289 684 406 -176
2472a76k97l29M91N71L21k12k64o57K79K55K71J79k21J47n03l15PM08K20L89j83
$$ -176 -473 -802 -311 260 581 369 105 -552 -273 -18 253 432 211 358 -145 -460 -453 -45 175 564 381
2493C81L4m79n05J13M24J58o8l8j90n00L40M13L37K29m54n43%K17J37O34k57M
$$ 381 415 -64 -569 -456 -32 126 58 20 -170 -670 -330 83 420 649 195 -348 -348 -131 6 640 383 387
2515C87o67m90K31L78M74j73Q9l15l20J57n6O68R5k88J62m87k95k5K88L4M26K8
$$ 387 -280 -770 -539 -161 313 140 229 -86 -406 -249 -305 363 458 170 332 -155 -450 -475 -187 -153 273 301
2537C01l80n73O21j87M15K91M8o86n68n0N30L17O29R5q35n68L3N47M94Kr4n87
$$ 301 -79 -652 -31 -218 197 488 536 -150 -718 -768 -238 79 708 803 -32 -600 -567 -20 474 476 382 -205
2559b05j64m13N29M40L1J18k76k86k06J94K85k1M40m10j21m05J27J13L51L81j95
$$ -205 -369 -782 -253 187 218 336 60 -226 -432 -238 47 26 466 56 -65 -470 -343 -230 121 502 307
2580C07l23n29r5J39O41L60J1m24qo52L05M18M16Q0n76p09j08K87N97M69K78o01
$$ 307 -16 -545 -640 -501 140 500 511 87 79 -573 -268 150 566 646 70 -639 -747 -460 137 606 884 283
2602B83n12L4j07L33L18j6k27n60o3K99M01K37L44j67l63n35p6k7L18K64Q1k44
$$ 283 -229 -195 -302 31 349 333 106 -454 -517 -218 183 420 764 597 234 -301 -377 -404 -86 178 259 15
2624A5k96j71k5M18N08mk79k57n70P4R02L69K43o38o35k68k7M78L40L38n87l11
$$ 15 -281 -452 -477 -59 449 445 166 -91 -661 -587 315 684 927 289 -346 -614 -641 -163 177 515 -72 -383
2646c83j85J50M29N40N9l34l29n63j57M93M31K4L07k08m23j80J77M92L06j30l27
$$ -383 -568 -418 11 551 610 276 -53 -616 -773 -280 151 175 482 274 -149 -329 -152 340 646 516 189
2667A89l05q52K52L04N73M16N7l59r05J35O56m3P93J2q49n43j91L75P01K39k29
$$ 189 -116 -968 -716 -412 161 577 634 275 -630 -495 161 118 911 923 74 -469 -660 -285 416 655 426
2688D26n82m97QL99L78K57Q4k15l54k91J26L59K58r5l18j34l90k62M12O19M85
$$ 426 -156 -653 -645 -246 132 389 473 258 -96 -387 -261 98 356 261 -57 -191 -581 -843 -431 188 673
2709F73j56n76k33k08J22M53N48j04l58p44k50M49Q66K12Qn36o91k43M24N29K40
$$ 673 517 -59 -292 -500 -378 75 623 519 161 -583 -833 -384 482 694 702 166 -525 -768 -344 185 425
2730D25k09j94m12n37K23N97P99j09j97n84k20Q0K19M00J16j44k13l66m71N26
$$ 425 216 22 -390 -927 -704 -107 692 583 386 -198 -418 -338 -119 281 397 253 40 -326 -797 -271
2750b71K30L85J06j78p96N1KO20M63L01m26j015l14L76N29P13J98r70n20k08O39
$$ -271 -41 344 450 272 -524 -473 -471 149 612 913 487 -528 -842 -466 63 776 974 4 -516 -724 -85
2771h5Q4N89O6l90n88k68j39O77K21N70l48m93k40p4L71K97M55k03l44m32n77
$$ -85 -1 588 654 264 -324 -592 -731 -54 167 737 389 -104 -344 -418 -47 250 705 502 158 -274 -851
2792h51J07R47K02L42k32q74l82L03K58R29J39l05o54n65J07K08Q53M7j34m71
$$ -851 -744 203 405 747 515 -359 -741 -438 -180 749 888 583 -71 -636 -529 -321 532 579 445 -26
2812b6q38J84O11L63J68j83l99n09K76P6P63J8j57j79k01l09j06K36N46J99j53
$$ -26 -864 -680 -69 294 462 279 -120 -629 -353 -277 486 504 347 168 -33 -342 -448 -212 334 533 380
2833C80n38l75K42l22R16K00kk56r50k80Q12K96O10J07n77p59q7K83N88M76l37
$$ 380 -158 -533 -291 -613 303 503 501 245 -705 -985 -173 123 733 840 263 -496 -583 -300 288 764 427
2854D27k24r20j45O08M89O7K13n01n95K9O6O28Q7p3oj40m33N8M26L46L81n67m04
$$ 427 203 -717 -862 -254 235 302 515 14 -581 -552 -486 142 229 156 150 10 -423 -365 61 407 788 221 -183
2877a83m88p6K21L04P17j29m89j16n25L88Q60L12n4k10r66j76K73L79O95Jp12
$$ -183 -671 -747 -526 -222 495 366 -123 -239 -764 -376 484 796 742 532 -434 -610 -337 42 737 738 26
2898B6n62M1r7O01N55K3p57J21n24M68L26L30J9k04m56l28k71K81P08qL66p98
$$ 26 -536 -495 -592 9 564 587 -170 -49 -573 -105 221 551 570 366 -90 -418 -689 -408 300 292 658 -140
2920a40k50j78L0L88N01rj66o73j05p4N05P53K62l78n30k28p2O69J24K71l93o98
$$ -140 -390 -568 -538 -150 351 342 176 -497 -602 -676 -171 582 844 466 -64 -292 -364 305 429 700 307 -391
2942c91l90J51N76K10K48rn61l55L14K80L91n6Om12n52K81L6L77L08n3j47o12
$$ -391 -781 -630 -54 156 404 395 -166 -521 -207 73 464 408 414 2 -550 -269 -233 144 452 399 252 -360
2964c60J01k25Q9O86J90j35k95m55k05M21K21L90J25o67n19k6O71N81K34j41q33
$$ -360 -259 -484 -395 291 481 346 51 -404 -609 -188 33 423 548 -119 -638 -664 7 588 822 681 -152
2985a52N0n85K61N96J01o6k96m77J72M28L85M77l48l59j16m22k3J20L46R6J95
$$ -152 -102 -687 -426 170 271 205 -91 -568 -396 32 417 894 546 187 71 -351 -374 -254 92 188 383
3006C83n93k97J41K98K74N07q3o54l70l58O13J87P71l01l27p98K61J26L85M02
$$ 383 -210 -507 -366 -68 206 713 630 -24 -394 -752 -139 48 819 518 191 -607 -346 -220 165 567
3026E67l48m62j92J0J48L69K76J20o13k81j10J36L41K94J75l17J51k60l03J87
$$ 567 219 -243 -435 -425 -277 92 368 488 -125 -406 -516 -380 -39 255 430 113 264 4 -299 -112
3046a12P02m63nj51n36j40L02N34M17J1j96m68k30L71R6N57j27l95o94j93L92
$$ -112 590 127 122 -29 -565 -705 -403 131 548 559 363 -105 -335 36 132 689 562 167 -527 -720 -328
3067c28K20R33m31n8n72j3P1J55K85R1j42m00r4J74Q4L18K52o9k76o87J10J54
$$ -328 -108 825 394 336 -236 -249 -178 -23 262 353 211 -189 -283 -109 -25 293 545 476 200 -487 -377 -223
3089b23K14J42n2M07o55k56l2K49M41J25j67l47l33K65J93L65K49q1m57p43M92
$$ -223 -9 133 81 488 -167 -423 -455 -206 235 360 193 -154 -487 -222 -29 336 585 504 47 -696 -204
3110b04jQ5L21M6q03o3L28M14J82J22L7l25k51J8k2O2J11K1Ok03m05J26L10M83
$$ -204 -205 -120 201 247 -556 -619 -291 123 305 427 464 139 -112 -94 -116 -54 57 78 84 -119 -524 -398 -88 395
3134C95J03j55m44k34M8K33J42L55j20l01l10r3M26J57L65o6n96k95n5K50L99
$$ 395 498 343 -101 -335 -287 -54 88 443 323 22 -288 -381 45 202 567 501 -95 -390 -445 -195 204
3155B04Q8J20m27n39K60J7O73k76N3k3k39o7M6L42k91J44Q4L4k57l06N11n0j1
$$ 204 292 412 -15 -554 -294 -277 396 120 173 150 -89 -156 -110 232 -59 85 169 203 -54 -360 151 101 90
3178I0L66m61j65j53J81J42N34k24k76l53m3JN32O6L03k41l79n04L54L01J78k12
$$ 90 456 -5 -170 -323 -142 0 534 310 34 -319 -362 -361 171 237 540 299 -80 -584 -230 71 249 37
3200C7n7m73J32K13J14L42j44K00l27j6k99M01J27m8n0j0k39m20K99J46K29L71
$$ 37 -20 -493 -361 -148 -34 308 164 364 37 21 -278 123 250 202 152 142 -97 -517 -218 -72 157 528
3222E28l36l02l76J01L58L25N7j73m83M8m3L65L08M9J15o18n84J33P70j15J89
$$ 528 192 -110 -486 -385 -27 298 355 182 -301 -253 -296 69 377 426 541 -77 -661 -528 242 127 316
3243C16j53j94k28j67K26K78Q5J16m69J70r0J27J12K96j81l3k85k29j23J14L55
$$ 316 163 -31 -259 -426 -200 78 163 279 -190 -20 -110 17 129 425 244 211 -74 -303 -426 -312 43
3264D3L87l94j13N7k33K34N44r8j88k27l12k17L25M16O5J51m27l22k06L58M64
$$ 43 430 36 -77 -20 -253 -19 525 427 239 12 -300 -517 -192 224 289 440 13 -309 -515 -157 307
3285C07J95k69m71l58K24K81J12L02k42p9l39K77q5K6L97l7Oj87l99K9K75j46
$$ 307 502 233 -238 -596 -372 -91 21 323 81 2 -337 -60 -145 -119 278 241 247 60 -339 -310 -35 -181
3307a81N07l99J41j84k37K38l8P02K2j2o65j44K01K00K78k71j70l10p3l1M09L85
$$ -181 326 -73 68 -116 -353 -115 -153 549 571 559 -106 -250 -49 151 429 158 -12 -322 -395 -426 -17 368
3329C68k4p4m03j68J49J13J22j78J76o4k48j16K85J99JJ39j77k97j29P3J00K22
$$ 368 344 270 -133 -301 -152 -39 83 -95 81 17 -231 -347 -62 137 138 277 100 -197 -326 -253 -153 69
3351F9L6j37n5n6j33K17L44J57j68k29m44K69l3K40K99k21k41k66j67K69L45j61
$$ 69 105 -32 -87 -143 -276 -59 285 442 274 45 -399 -130 -163 77 376 155 -86 -352 -519 -250 95 -66
3373f6J92K5l71K62K35J1O5j2k02k50l84J01K33K39J4P0j17l34l8K97R7J97K1
$$ -66 126 151 -220 42 277 288 353 341 139 -111 -495 -394 -161 78 92 162 45 -289 -327 -30 67 264 285
3396B85k34m48K5K49N38Km32Q1r2p2o8R4K72J18m07l36M0K82J96J08j73j9j70
$$ 285 51 -397 -372 -123 415 417 -15 66 -26 -98 -166 -72 200 318 -89 -425 -385 -103 93 201 28 9 -161
3419a61p3K22r9N59j27o3l88K0r5K77k51J84j22j00r9N4O5L97J48Q2j04l52l29
$$ -161 -234 -12 -111 448 321 258 -130 -110 -205 72 -179 5 -117 -217 -316 -262 -197 200 348 430 326 -26 -355
3442c55n7M23R6P3j14j98m19L44L15M2K16l31l28j0P0L73k15K21m6k43l2m31N02
$$ -355 -412 11 107 180 66 -132 -551 -207 108 150 366 35 -293 -303 -233 140 -75 146 100 -143 -175 -606 -104
3465a04K56J27j27j31k14J30k15N84l20M02l67k84J18j28M6L95l2P8k17k81q4
$$ -104 152 279 152 21 -193 -63 -278 306 -14 388 21 -263 -145 -273 -227 168 136 214 -3 -284 -368
3486c68p3Q75k1j41n97K6j30N25l65N64o2r4l56J25K72J87j45k54J96n05R0J53
$$ -368 -441 434 413 272 -325 -299 -429 96 -269 295 233 139 -217 -92 180 367 222 -32 164 -341 -251 -98
3508i8K39k21K59j23k0r3j23R8M23r0j50k29l63j6M89J05K04L8k88p8l14L11K17
$$ -98 141 -80 179 56 36 -57 -180 -82 341 251 101 -128 -491 -507 -18 87 291 329 41 -37 -351 -40 177
3531A77J82k89j8j23k25pM84k02J8K21p15J51K67L7J86P5j10m15N1RK54K66K3
$$ 177 359 70 52 -71 -296 -303 181 -21 -3 218 -497 -346 -79 -42 144 219 109 -306 -255 -246 8 274 297
3554B97l12L2j20j21J94J69J96k16j71k28L9KK84j15J56j50oj79L8L71k3K55o9
$$ 297 -15 17 -103 -224 -30 139 335 119 -52 -280 -241 -239 45 -70 86 -64 -70 -249 -211 160 137 392 323
3577C23m88l10L72M6L65q0k2l56l4l4M72J96l13K90m68j43m8J33J62k8N3Rj12
$$ 323 -165 -475 -103 -57 308 228 206 -150 -184 -218 254 450 137 427 -41 -184 -232 -99 63 35 88 97 -15
3600a5j94K14L11q0K20m55M9j27k98K78P67n31J25m79L9J60m8K66J03l36J53m00
$$ -15 -209 5 316 236 456 1 50 -77 -375 -97 670 139 264 -215 -176 -16 -64 202 305 -31 122 -278
3622b78l68N83K23J74l33l64J25K27n8K16M8j5j84m1l81N65j35J01Lj28M7k37
$$ -278 -646 -63 160 334 1 -363 -238 -11 -69 147 195 180 -4 -45 -426 139 4 105 108 -20 27 -210
3644b10K59j09J18L03l60L8k99J65j60M25n1Q1o6k65j83J13K66M56l67k97j01
$$ -210 49 -60 58 361 1 39 -260 -95 -255 170 119 200 134 -131 -314 -201 65 521 154 -143 -244
3665b44j75K53K47p3O4j88K3p7R8N08n0K1l14j38l20J19K24J97k0j46n8O2k20
$$ -244 -419 -166 81 8 72 -116 -93 -170 -72 436 386 407 93 -45 -365 -246 -22 175 155 9 -49 13 -207
3688b07M48j42J1K44l61k17J22k67N18p0J70j74k60k31J80J08K74P7J3l50k36
$$ -207 241 99 110 354 -7 -224 -102 -369 149 79 249 75 -185 -416 -236 -128 146 223 236 -114 -350
3709c50K77QK59j51J01l64L0L5J36K14o7j77j46J30M9O8K20j21J03j93j25j80
$$ -350 -73 -65 194 43 144 -220 -190 -155 -19 195 128 -49 -195 -65 -16 52 272 151 254 61 -64 -244
3731b44L03m1J34L0j89j69k1L52Nj2J38p8k02j40j90K21L09N0j24n30Q6J09N8
$$ -244 59 18 152 182 -7 -176 -197 155 160 148 286 208 6 -134 -324 -103 206 256 132 -398 -312 -203 -145
3754a45L48J9N5m27j1j64J71N0M47k04j16l6l43J41K03K24M4k72J4r2l25K55J36
$$ -145 203 222 277 -150 -161 -325 -154 -104 343 139 23 -13 -356 -215 -12 212 256 -16 -2 -94 -419 -164 -28
3777b8J78Jm88J63j54J89K71j9K15l21q5k35J89J27J49k29k55K34k36M91r2K76
$$ -28 150 151 -337 -174 -328 -139 132 113 328 7 -78 -313 -124 3 152 -77 -332 -98 -334 157 65 341
3799C41r1k35o1j63p8L83m4J17k22Q2j98Q8R8j7J46j25j41N8l6k3L59k70J99J19
$$ 341 250 15 -46 -209 -287 96 52 169 -53 29 -169 -81 17 0 146 21 -120 -62 -98 -121 238 -32 167 286
3823B86k43j52j82M21j10K81m81j53n0K81J87L10k48j7l68J7m6K99J88qJ34k37
$$ 286 43 -109 -291 130 20 301 -180 -333 -383 -102 85 395 147 130 -238 -221 -267 32 220 212 346 109
3845A09l7j55J66L97l62j45k25j06L6K4J40J99Q8j11l76K26M1n7K7oj13L26j81
$$ 109 72 -83 83 480 118 -27 -252 -358 -322 -298 -158 41 129 18 -358 -132 -91 -148 -121 -127 -240 86 -95
3868i5j00K54K13k00Rm76K62j70M70k8K33j29j99l36j7M09k1k2M7j38O7j11L30
$$ -95 -195 59 272 72 81 -395 -133 -303 167 139 372 243 44 -292 -309 100 79 57 104 -34 33 -78 252
3891B52J49J04m74J5j98O7r0K80l3j94L6l13K67k80N38l05O14n3j92l86q0O8M59
$$ 252 401 505 31 46 -152 -85 -175 105 72 -122 -86 -399 -132 -412 126 -179 435 382 190 -196 -276 -208 251
3914B51K7l05j95j34K01K67j33K31r3l3j29k00M06J14k01J80k90j67L14k14J24
$$ 251 278 -27 -222 -356 -155 112 -21 210 117 84 -45 -245 161 275 74 254 -36 -203 111 -103 21
3935B1K33J44o22p9P1L13O7o6j72M35l03l61K32J23J85pj49k18J76j56J14m2N72
$$ 21 254 398 -224 -303 -232 81 148 82 -90 345 42 -319 -87 36 221 214 65 -153 23 -133 -19 -61 511
3958E11l76l42N1k31L96J50k22L52l07l45J04j45P29j87J0j01m1Q1k49M20k25
$$ 511 135 -207 -156 -387 9 159 -63 289 -18 -363 -259 -404 325 138 148 47 6 87 -162 258 33
3979C3R3m1l30J1M3Q2K41J9j99o5m2J4J84p3J47O4o5Jl37p1K97L43Rl93k3j91
$$ 33 126 85 -245 -234 -191 -109 132 151 -48 -113 -155 -141 43 -30 117 181 116 117 -220 -291 6 349 358 -35 -58 -249
4005b49K48o4J60J97j84m18K0K44J40m5J53pn76M16k06J37J00J97n51K75J23q8
$$ -249 -1 -65 95 292 108 -310 -290 -46 94 49 202 195 -381 35 -171 -34 66 263 -288 -13 110 22
4027B2k13K07L69k80Ln17L15r4N49j27j46J0j52k50L20q1J82M7M53n39p2k57N6
$$ 22 -191 16 385 105 108 -409 -94 -188 361 234 88 98 -54 -304 16 -65 117 164 617 78 6 -251 -195
4050a95L87j05O4k27k37L57k19L43J3o8M9k70p1j23M39L3j46J14l96q6J60K25
$$ -195 192 87 151 -76 -313 44 -175 168 181 113 162 -108 -179 -302 137 170 24 138 -258 -344 -184 41
4072D1j75J22L4j20J8l54J16Q47l05J4j97O5k10Q3L2K23J20l51l38J74J59n9L18
$$ 41 -134 -12 22 -98 -80 -434 -318 529 224 238 41 106 -104 -21 11 234 354 3 -335 -161 -2 -61 257
4095B57n9k58j75K08Q9j6J19J14l01r7k4J27n5K34l16L01k11j3K48n47N28m1j23
$$ 257 198 -60 -235 -27 62 46 165 279 -22 -119 -143 -16 -71 163 -153 148 -63 -76 172 -375 153 112 -11
4118a1Q3q6j54q1K21l6J43p8k69J29k89N07P7J18m56j0R8q2K32J81R7m00m6O1
$$ -11 72 -14 -168 -249 -28 -64 79 1 -268 -139 -428 79 156 274 -182 -192 -94 -176 56 237 334 -66 -112 -51
4142e1J12j41N22l00k38j69J68J0J79J12j68J5o2j99j15P4L3K58r8k52K62p2K26
$$ -51 61 -80 442 142 -96 -265 -97 -87 92 204 36 51 -11 -210 -325 -251 -218 40 -58 -310 -48 -120 106
4165A06j47M8K10k42K3K37m49M18k18L5J41k28j14l7K03L6J60J54m91o4J86Mp1
$$ 106 -41 7 217 -25 -2 235 -214 204 -14 21 162 -66 -180 -217 -14 22 182 336 -155 -219 -33 -29 -100
4188a00K53J70k38j33j09K72j4J35j18J37m61L7k4L31Q7J24qn65K54l02K48K21
$$ -100 153 323 85 -48 -157 115 101 236 118 255 -206 -169 -193 138 225 349 341 -224 30 -272 -24 197
4210A97n2q8m04N75l29K21k03N35k81j36r5j42L09l4k8q5p7J02k15K91J40k37
$$ 197 145 57 -347 228 -101 120 -83 452 171 35 -60 -202 107 73 45 -40 -117 -15 -230 61 201 -36
4232c6K45n8k30j10j61L82L88m88mK13k26mJ28J0l86M28K0r3J9k6M56o15J00k0
$$ -36 209 151 -79 -189 -350 32 420 -68 -72 141 -85 -89 39 49 -337 91 111 18 37 11 467 -148 -48 -68
4256f8j65P8K5R8Q1J65k15p8N8J33r8K87p5k90n0k58J78M09o9J29k04j68J92j83
$$ -68 -233 -155 -130 -32 49 214 -1 -79 -21 112 14 301 226 -64 -114 -372 -194 215 146 275 71 -97 95 -88
4280h8J38m2n8k5K49j39o7J82oJ99k77j69o4PK2M12j13m1p4k53J14m0K68K03j76
$$ -88 50 8 -50 -75 174 35 -32 150 144 343 66 -103 -167 -160 -138 274 161 120 46 -207 -93 -133 135 338 162
4305A62k89J71q3J45k81J69j15N9M8j73K06o2J62J9K23m50J11j55L23j03j12n4
$$ 162 -127 44 -39 106 -175 -6 -121 -62 -14 -187 19 -43 119 138 361 -89 22 -133 190 87 -25 -79
4327g9J32k09J45J3m7N4o2K9k90O6J07N3K40N3k57o5k10K11q1K31J92kK8l28l
$$ -79 53 -156 -11 2 -45 9 -53 -24 -314 -248 -141 -88 152 205 -52 -117 -327 -116 -197 34 226 224 252 -76 -79
4352g9J10J17j23O6j64k8k55M61J4j96K73m27k12L36j20J80J00k43J35k9j91Q0
$$ -79 31 148 25 91 -73 -101 -356 105 119 -77 196 -231 -443 -107 -227 -47 53 -190 -55 -84 -275 -195
4374a95L67J5k93J43k15J50r1Q4N1N5j13J52J02m03j4J33P2L22m34N9j5Q1K85
$$ -195 172 187 -106 37 -178 -28 -119 -35 16 71 -42 110 212 -191 -205 -72 0 322 -112 -53 -68 13 298
4397B98R6m76q0m2L62m1r9j88K58K09k38j78J40oj10j42L28j15j05M5N9K64k6
$$ 298 394 -82 -162 -204 158 117 18 -170 88 297 59 -119 21 15 -95 -237 91 -24 -129 -84 -25 239 213
4420B13j72j6j74m6M0J43N0K66k31k92J62J6L20k2k65n6M9o9K1K47k93M44l64
$$ 213 41 25 -149 -195 -155 -12 38 304 73 -219 -57 -41 279 257 -8 -64 -15 -84 -63 184 -109 335 -29
4443b9o1N5P0J42M3k60J08k70J27J33j52N8L0M9J9N7j53J14j99L48j60O3Mj92
$$ -29 -90 -35 35 177 220 -40 68 -202 -75 58 -94 -36 -6 43 62 119 -34 80 -119 229 69 132 136 -56
4467e6Q1M3j73J23j01J58j89j76M86j88K68l33K77l86P9k21L56L48m23N1P2N7
$$ -56 25 68 -105 18 -83 75 -114 -290 196 8 276 -57 220 -166 -87 -308 48 396 -27 24 96 153
4489A53j01L1O3j42j5j20l10L29J01L64k6m46j98L32l8K94j76J45k86o6p4M06
$$ 153 52 83 146 4 -11 -131 -441 -112 -11 353 327 -119 -317 15 -23 271 95 240 -46 -112 -186 220
4511B20m22K72q5L30r7l77K08j72J80J21l36OQ8m10L41R9K55j22l8k50j00M14
$$ 220 -202 70 -15 315 218 -159 49 -123 57 178 -158 -152 -64 -474 -133 -34 221 99 61 -189 -289 125
4533A25l72L66J3l11L32j33m0K3k90O56l08j92n5J02K51j36J49l5ok43J05K09
$$ 125 -247 119 132 -179 153 20 -20 3 -287 369 61 -131 -186 -84 167 31 180 145 139 -104 1 210
4555B10k57J52Q3j48j11%J67k92M00j54k24K44k33m7J98J90O0k55j00l4J75K4
$$ 210 -47 105 188 40 -71 -71 96 -196 204 50 -174 70 -163 -210 -12 178 238 -17 -117 -151 24 48
4577D8K36l40j81M7jJ7K71m21L14L12l69LL5K62l85K77j08l4J96k97q9K47m1J91
$$ 48 284 -56 -237 -190 -191 -174 97 -324 -10 302 -67 -64 -29 233 -152 125 17 -17 179 -118 -207 40 -1 190
4601A90l9m95P2j3L77o6L74q3l76p4M6R8Q0L09j81k22M7k07Q4K1j40J16J2J61
$$ 190 151 -344 -272 -285 92 26 400 317 -59 -133 -87 11 91 400 219 -3 44 -163 -79 -58 -198 -82 -70 91
4625I1m92J89oO3J52j02r8L33K7P3j22jj14k39M1PJ0L34pk71J75o1n3L5j37O16
$$ 91 -401 -212 -218 -155 -3 -105 -203 130 157 230 108 107 -7 -246 -205 -198 -188 146 139 -132 43 -18 -71 -36 -173 443
4651D43k73l74K68q8k00K70L23m30k7J17L4j39JJ15j01M6l35L49J94j65l6J89
$$ 443 170 -204 64 -24 -224 46 369 -61 -88 29 63 -76 -75 40 -61 -15 -350 -1 193 28 -8 181
4673A81l19J91j48j62P6RL25J37j22k78P4j46N8J57K02n08K84k80M23Lj79K07
$$ 181 -138 53 -95 -257 -181 -172 153 290 168 -110 -36 -182 -124 33 235 -273 11 -269 154 157 -22 185
4695A85j04l2j44J82k0M7j23J23k38k69J39J45K74k07j6L08l83J31j43J91K20
$$ 185 81 49 -95 87 67 114 -9 114 -124 -393 -254 -109 165 -42 -58 250 -133 -2 -145 46 266
4716B66m6k11Q7j17J91L7k77K85l33m4L10m91M88k28M1J41n3j69K31m7l11M86
$$ 266 220 9 96 -21 170 207 -70 215 -118 -162 148 -343 145 -83 -42 99 46 -123 108 61 -250 236
4738B36m10K9j40M21O2P8j79j34K63k76K0j61M69l53J79j2q8l63L99J07j08J16
$$ 236 -174 -145 -285 136 198 276 97 -37 226 -50 -30 -191 278 -75 104 92 4 -359 40 147 39 155
4760A55j6j59L75l01p4J06K42j83k3R2l89M6J81J98j82j07N9k45K9K31K31l02
$$ 155 139 -20 355 54 -20 86 328 145 122 214 -175 -129 52 250 68 -39 20 -225 -196 35 266 -36
4782c6M6k17R2J58J39J03k17q0l0q0R8J64L0j3k55R6m34N34k21K32k11M49l45
$$ -36 10 -207 -115 43 182 285 68 -12 -42 -122 -24 140 170 157 -98 -2 -436 98 -123 109 -102 347 2
4805Bl81L68q0J21k59N32k41k4j93K00R7J85k45m5n8k51L10k10J75k8r7R6K62
$$ 2 -379 -11 -91 30 -229 303 62 38 -155 45 142 327 82 37 -21 -272 38 -172 3 -25 -122 -26 236
4828B36o38N66Q8k64K14j77J28j70lJ89k08K95j59j11k38m1K42k9J89j21k72J35
$$ 236 -402 164 252 -12 202 25 153 -17 -20 169 -39 256 97 -14 -252 -293 -51 -80 109 -12 -284 -149
4850a49P8K3K23k05P6j91j22R6L97k38J2j20o4K83q2K11k79N4P8k20P4M8K17j24
$$ -149 -71 -48 175 -30 46 -145 -267 -171 226 -12 0 -120 -184 99 17 228 -51 3 81 -139 -65 -17 200 76
4874G6J57l41j19L36j83j29L62k28R1O8mn7j55kr0J42k76K24K5P2J24J34j57K96
$$ 76 233 -108 -227 109 -74 -203 159 -69 22 90 86 29 -126 -128 -218 -76 -352 -128 -103 -31 93 227 70 366
4898C66m39k29K37k6K12J1r2n5J39p4k4K34l02J2k03m8L52j17m7Q2r3J06k60J71
$$ 366 -73 -302 -65 -91 121 132 40 -15 124 50 26 260 -42 -30 -233 -281 71 -46 -93 -11 -104 2 -258 -87
4922h7RJ0N1j4r5K63j38q5K22k51J7K89p2l71K0L18j4k31M65k95j09PL08j64r9
$$ -87 -78 -68 -17 -31 -126 137 -1 -86 136 -115 -98 191 119 -252 -232 86 72 -159 306 11 -98 -91 217 53 -46
4947d6N2p2q8OK14q5K89l34J88r3n0J11n4k41L36n5j40l47L86k30L38N5l52O3
$$ -46 6 -66 -154 -148 66 -19 270 -64 124 31 -19 92 38 -203 133 78 -62 -409 -23 -253 85 140 -212 -149
4971a49L42j80j%j07J79J55l45j58N0J59JJ78m63K74q5M32j21P5j01k38k45J79
$$ -149 193 13 12 12 -95 84 239 -106 -264 -214 -55 -54 124 -339 -65 -150 282 161 236 135 -103 -348 -169
4994a69K30N8m9k17J95j44l4N3J80j57J05J26N3k96J01n72N77j14L68m36J96l18
$$ -169 61 119 70 -147 48 -96 -130 -77 103 -54 51 177 230 -66 35 -537 40 -74 294 -142 54 -264
5016b64L35K67j41o5L9l48j35L58k93P8J4J81j54K21k53J58J23L9j87j1j86K44
$$ -264 71 338 197 132 171 -177 -312 46 -247 -169 -155 26 -128 93 -160 -2 121 160 -27 -38 -224 20
5038B0P6q8J75l15n4K55Q8k05J32r9J40k41pkJ53l02J33L07k04K31k53O1K9o0
$$ 20 96 8 183 -132 -186 69 157 -48 84 -15 125 -116 -123 -125 28 -274 -141 166 -38 193 -60 1 30 -30
5062c0l4P7%k00j06J46K40k18J7J04J60n36M58l7n4L4nO2k0p0J24j63M1O1j99
$$ -30 -64 13 13 -187 -293 -147 93 -125 -108 -4 156 -380 78 41 -13 21 16 78 58 -12 112 -51 -10 51 -148
5087a48M7J00P5j41L31n01L14l60R9k5K69j21K96J63m05O3j36N4K40j84o6l52
$$ -148 -101 -1 74 -67 264 -237 77 -283 -184 -209 60 -61 235 398 -7 56 -80 -26 214 30 -36 -388
5109c88J34K8M10Lk61k67J96j36L10J77m6K3j37q5K9M1J10k50K88N1l72p7L63
$$ -388 -254 -226 184 187 -74 -341 -145 -281 29 206 160 183 46 -39 -10 31 141 -109 179 230 -142 -219 144
5132A44J98k34l8l29K36j44J53k67M96k46K4Q8k53L28p6LJ26j98r2R9p9K95k12
$$ 144 342 108 70 -259 -23 -167 -14 -281 215 -31 -7 81 -172 156 80 83 209 11 -81 18 -61 234 22
5155B2n9M47m00l1P4l33J2M69m13K32M3k89R3J68R3j27M4J3K37m36O8l4L52k58
$$ 22 -37 410 10 -21 53 -280 -268 201 -212 20 63 -226 -133 35 128 1 45 58 295 -141 -73 -107 245 -13
5179a3k53MK83p5l4L81l41K3j55K3J65J49j49k1j37J88m1R2j41PJ22j01j45J14
$$ -13 -266 -262 21 -54 -88 293 -48 -25 -180 -157 8 157 8 -13 -150 38 -3 89 -52 -45 77 -24 -169 -55
5203e5m9K4M3MN9Pk94J51N4L90m58M13k05k41J58K46m21P7k8J22l06K57j29M05
$$ -55 -104 -80 -37 -33 26 33 -261 -110 -56 334 -124 289 84 -157 1 247 -174 -97 -125 -3 -309 -52 -181 224
5227B24r0j76l2K18k95L36l05M94m40J88J11k86n8r2L47J13j23k20P8p4M4j70
$$ 224 134 -42 -74 144 -151 185 -120 374 -66 122 233 -53 -111 -203 144 257 134 -86 -8 -82 -38 -208
5249b08K86J63j85l34Q6J55o7J13j42K60j45l30L96j09p1p9J32L1R9r5j25K65
$$ -208 78 241 56 -278 -192 -37 -104 9 -133 127 -18 -348 48 -61 -132 -211 -79 -48 51 -44 -169 96
5271I6j70n2J18j85K49p2K00r1J01k41M0j45L08l12K86l39J59l6L9r0K61m09K11
$$ 96 -74 -126 -8 -193 56 -16 184 93 194 -47 -7 -152 156 -156 130 -209 -50 -86 -47 -137 124 -285 -74
5294g4qK15j94R9K6P4k08j70L15L8m3j13K11j73j80J04N4k24K72k66L79m5k04
$$ -74 -82 133 -61 38 64 138 -70 -240 75 113 70 -43 168 -5 -185 -81 -27 -251 21 -245 134 89 -115
5317a15J16k52J09P1PP2J10k78J12O3j54M13m39K15k64O1J52J27j17L4J10l4Q2
$$ -115 1 -251 -142 -71 -64 8 118 -160 -48 15 -139 274 -165 50 -214 -153 -1 126 9 43 153 119 201
5340B01l46J45J23l93K14j1K29j98R5K71l28j04K48j99P6j01J51P7Rk90J24J39
$$ 201 -145 0 123 -270 -56 -67 162 -36 59 330 2 -102 146 -53 23 -78 73 150 159 -131 -7 132
5362A32K6r3J59j37nj42N7j36K6J50n5J25k81K09m30M15k36L24k26k8J49p2l5
$$ 132 158 65 224 87 82 -60 -3 -139 -113 37 -18 107 -174 35 -395 20 -216 108 -118 -146 3 -69 -104
5385a04j20K85j78K10l00Q5J46k4M1J17k62J58J03k90M21k80m4oj10J02N5j10
$$ -104 -224 61 -117 93 -207 -122 24 0 41 158 -104 54 157 -133 288 8 -36 -42 -152 -50 5 -105
5407a05m9J25J06j72K15r3j27L21j26p0o2J6r3K31l12J30Q0j19m0K05N9j72L67
$$ -105 -154 -29 77 -95 120 27 -100 221 95 25 -37 -21 -114 117 -195 -65 15 -104 -144 61 120 -52 315
5430C15l39K17Om24P2P7K57o3j0r3j25m3j01M99j84j9pl3n4K12n9J33k90r0%K18
$$ 315 -24 193 199 -225 -153 -76 181 118 108 15 -110 -153 -254 245 61 42 35 2 -52 160 101 234 -56 -146 -146 72
5456G2l25M96l48L5M29l91Q6k26K2L75k35j12J59j10J8n4R7K83K3n33L96j60O7
$$ 72 -253 243 -105 -70 359 -32 54 -172 -150 225 -10 -122 37 -73 -55 -109 -12 271 294 -239 157 -3 64
5479F4n5j45L55k24p3l19L90J6j63M06q3k00r0J11L6p3L89l21l%n7J69k7J1k79
$$ 64 9 -136 219 -5 -78 -397 -7 9 -154 252 169 -31 -121 -10 26 -47 342 21 18 18 -39 130 103 114 -165
5504a65M3K77k95J37P8L0j10R5j93J48o0K9Q1P2j75l7N5J98J56k89p1k26K43q5
$$ -165 -122 155 -140 -3 75 105 -5 90 -103 45 -15 14 95 167 -8 -45 10 208 364 75 4 -222 21 -64
5528f4j53L13J39j94l6j72R9L06j80n6L93n49K06Q5r2mo0K13m18J73j60K61m3
$$ -64 -217 96 235 41 5 -167 -68 238 58 2 395 -154 52 137 45 41 -19 194 -224 -51 -211 50 7
5551Gj8p5pK34j21j67k2M93m08j8J51k1m5k59K29o0J44k16K07j64J32J0N9q3j4
$$ 7 -11 -86 -93 141 20 -147 -169 324 -84 -102 49 28 -17 -276 -47 -107 37 -179 28 -136 -4 6 65 -18 -32
5576c2j3L1l8K40p5%O2j68Mk97L20k97M26l50J70j07J47R2P7q3k42J80l79K22
$$ -32 -45 -14 -52 188 113 113 175 7 11 -286 34 -263 163 -187 -17 -124 23 115 192 109 -133 47 -332 -110
5600a10P9j5oK10k63l1k6K84j95N1J75k06J01L7j13L1L3l6k10L61l43K52P9l7
$$ -110 -31 -46 -52 158 -105 -136 -162 122 -73 -22 153 -53 48 85 -28 3 36 0 -210 151 -192 60 139 102
5624A02J37M5m14J07L2J29k93J64M7j94M13m12J81k5J9k56N1N28l94k50L42K00
$$ 102 239 284 -130 -23 9 138 -155 9 56 -138 275 -137 44 19 38 -218 -167 361 -33 -283 59 259
5646B59m09q6R3L63k1k32j28J73Q4J55k46J80m4j92J96j51j22n9P1nJ97J29p9
$$ 259 -150 -236 -143 220 199 -33 -161 12 96 251 5 185 141 -51 145 -6 -128 -187 -116 -121 76 205 126
5669A26j31n1J14q9K9O3J57l70j30K98k3O1J29l22N5M1J10k56K26j92K28q2k53
$$ 126 -5 -56 58 -31 -2 61 218 -152 -282 16 -7 54 183 -139 -84 -43 67 -189 37 -155 73 -9 -262
$$ [...]
8191B36
##END NTUPLES=NMR FID
##END=
