##TITLE=1H_Pr Hex-DepBn
 200.13MHz, CDCl3,
 8 sc
 
 7.8.2025
##JCAMPDX= 6.0         $$ Bruker NMR JCAMP-DX V2.0
##DATA TYPE= NMR FID
##DATA CLASS= NTUPLES
##ORIGIN= UXNMR, Bruker Analytische Messtechnik GmbH
##OWNER= pz
$$ XWIN-NMR		Version 3.5
$$ Thu Aug  7 13:50:42 2025 Russian Standard Time (UT+4h)  she@DPX200
##.OBSERVE FREQUENCY= 200.1313
##.OBSERVE NUCLEUS= ^1H
##.DELAY= (6, 6)
##.ACQUISITION MODE= SIMULTANEOUS
##.ACQUISITION SCHEME= undefined
##.AVERAGES= 8
##.DIGITISER RES= 18
##SPECTROMETER/DATA SYSTEM= spect
##.PULSE SEQUENCE= zg30
##.SOLVENT NAME= CDCl3
##.SHIFT REFERENCE= (INTERNAL, CDCl3, 0, 14.3821)
##AUDIT TRAIL= $$ (NUMBER, WHEN, WHO, WHERE, WHAT)
$$ ##TITLE= Audit trail, XWIN-NMR		Version 3.5
$$ ##JCAMPDX= 5.01
$$ ##ORIGIN= Bruker BioSpin GmbH
$$ ##OWNER= she
$$ F:/spectra/data/she/nmr/H-C/1/audita.txt
$$ ##AUDIT TRAIL=  $$ (NUMBER, WHEN, WHO, WHERE, WHAT)
(   1,<2025-08-07 13:49:09.43 +0400>,<she>,<DPX200>,
      <created by zg, POWCHK disabled, PULCHK disabled
       configuration hash MD5:
       00 E9 B6 7A A2 85 ED C7 34 08 36 98 17 FE 4E 26
       data hash MD5: 16K
       5A EE E0 5F BA 44 3A B2 85 2F E0 7B 12 94 1D 36>)
$$ ##END=
$$ 
$$ hash MD5
$$ A0 9C 4B AC 6A 39 F7 95 A0 AC B3 A2 42 2B BF 91
##$RELAX= 
##$RELAX= 
##$RELAX= 
##$RELAX= 
##$RELAX= 
##$RELAX= 
$$ Bruker specific parameters
$$ --------------------------
##$DU= <F:/spectra>
##$EXPNO= 1
##$NAME= <H-C>
##$PROCNO= 1
##$TYPE= <nmr>
##$USER= <she>
##$AMP= (0..31)
100 100 100 100 100 100 100 100 100 100 100 100 100 100 100 100 100 100 
100 100 100 100 100 100 100 100 100 100 100 100 100 100 
##$AQSEQ= 0
##$AQ_mod= 1
##$AUNM= <au_zg>
##$AUTOPOS= <>
##$BF1= 200.13
##$BF2= 200.13
##$BF3= 200.13
##$BF4= 200.13
##$BF5= 200.13
##$BF6= 200.13
##$BF7= 200.13
##$BF8= 200.13
##$BYTORDA= 1
##$CFDGTYP= 0
##$CFRGTYP= 5
##$CHEMSTR= <none>
##$CNST= (0..31)
1 1 145 1 1 1 1 1 1 1 1 1 1 1 1 1 1 1 1 1 1 1 1 1 1 1 1 1 1 1 1 1 
##$CPDPRG= <>
##$CPDPRG1= <>
##$CPDPRG2= <>
##$CPDPRG3= <>
##$CPDPRG4= <mlev>
##$CPDPRG5= <mlev>
##$CPDPRG6= <mlev>
##$CPDPRG7= <mlev>
##$CPDPRG8= <mlev>
##$CPDPRGB= <>
##$CPDPRGT= <>
##$D= (0..31)
0 0.7 0 0 0 0 0 0 0 0 0 0.03 0 0 0 0 0 0 0 0 0 0 0 0 0 0 0 0 0 0 0 0 
##$DATE= 1754560148
##$DBL= (0..7)
120 120 120 120 120 120 120 120 
##$DBP= (0..7)
150 150 150 150 150 150 150 150 
##$DBP07= 0
##$DBPNAM0= <>
##$DBPNAM1= <>
##$DBPNAM2= <>
##$DBPNAM3= <>
##$DBPNAM4= <>
##$DBPNAM5= <>
##$DBPNAM6= <>
##$DBPNAM7= <>
##$DBPOAL= (0..7)
0.5 0.5 0.5 0.5 0.5 0.5 0.5 0.5 
##$DBPOFFS= (0..7)
0 0 0 0 0 0 0 0 
##$DE= 6
##$DECBNUC= <off>
##$DECIM= 32
##$DECNUC= <off>
##$DECSTAT= 4
##$DIGMOD= 1
##$DIGTYP= 9
##$DL= (0..7)
0 120 120 120 120 120 120 120 
##$DP= (0..7)
150 150 150 150 150 150 150 150 
##$DP07= 0
##$DPNAME0= <>
##$DPNAME1= <>
##$DPNAME2= <>
##$DPNAME3= <>
##$DPNAME4= <>
##$DPNAME5= <>
##$DPNAME6= <>
##$DPNAME7= <>
##$DPOAL= (0..7)
0.5 0.5 0.5 0.5 0.5 0.5 0.5 0.5 
##$DPOFFS= (0..7)
0 0 0 0 0 0 0 0 
##$DQDMODE= 0
##$DR= 18
##$DS= 0
##$DSLIST= <SSSSSSSSSSSSSSS>
$$ [...]
##$SUBNAM0= <"">
##$SUBNAM1= <"">
##$SUBNAM2= <"">
##$SUBNAM3= <"">
##$SUBNAM4= <"">
##$SUBNAM5= <"">
##$SUBNAM6= <"">
##$SUBNAM7= <"">
##$SUBNAM8= <"">
##$SUBNAM9= <"">
##$SW= 18.0517328524113
##$SWIBOX= (0..15)
0 0 2 0 0 0 0 0 0 0 0 0 0 0 0 0 
##$SW_h= 3612.71676300578
##$TD= 16384
##$TD0= 1
##$TE= 0
##$TE2= 300
##$TE3= 300
##$TEG= 300
##$TL= (0..7)
0 120 120 120 120 120 120 120 
##$TP= (0..7)
150 150 150 150 150 150 150 150 
##$TP07= 0
##$TPNAME0= <>
##$TPNAME1= <>
##$TPNAME2= <>
##$TPNAME3= <>
##$TPNAME4= <>
##$TPNAME5= <>
##$TPNAME6= <>
##$TPNAME7= <>
##$TPOAL= (0..7)
0.5 0.5 0.5 0.5 0.5 0.5 0.5 0.5 
##$TPOFFS= (0..7)
0 0 0 0 0 0 0 0 
##$TUNHIN= 0
##$TUNHOUT= 0
##$TUNXOUT= 0
##$USERA1= <user>
##$USERA2= <user>
##$USERA3= <user>
##$USERA4= <user>
##$USERA5= <user>
##$V9= 5
##$VALIST= <valist>
##$VCLIST= <CCCCCCCCCCCCCCC>
##$VD= 0
##$VDLIST= <DDDDDDDDDDDDDDD>
##$VPLIST= <PPPPPPPPPPPPPPP>
##$VTLIST= <TTTTTTTTTTTTTTT>
##$WBST= 1024
##$WBSW= 4
##$XGAIN= (0..3)
0 0 0 0 
##$XL= 0
##$YL= 0
##$YMAX_a= 1058338
##$YMIN_a= -1147308
##$ZGOPTNS= <>
##$ZL1= 120
##$ZL2= 120
##$ZL3= 120
##$ZL4= 120
##$ABSF1= 10
##$ABSF2= 0
##$ABSG= 5
##$ABSL= 3
##$ALPHA= 0
##$AQORDER= 0
##$ASSFAC= 0
##$ASSFACI= 0
##$ASSFACX= 0
##$ASSWID= 0
##$AUNMP= <proc_1d>
##$AZFE= 0.1
##$AZFW= 0.1
##$BCFW= 1
##$BC_mod= 2
##$BYTORDP= 1
##$COROFFS= 0
##$CY= -3
##$DATMOD= 1
##$DC= 2
##$DFILT= <>
##$DTYPP= 0
##$F1P= 0
##$F2P= 0
##$FCOR= 0.5
##$FTSIZE= 0
##$FT_mod= 4
##$GAMMA= 1
##$GB= 0.15
##$INTBC= 1
##$INTSCL= 1
##$ISEN= 128
##$LB= 0.25
##$LEV0= 0
##$LPBIN= 0
##$MAXI= 10000
##$MC2= 0
##$MEAN= 0
##$ME_mod= 0
##$MI= 1.114404
##$NCOEF= 0
##$NC_proc= 0
##$NLEV= 6
##$NOISF1= 3.799351
##$NOISF2= 2.8
##$NSP= 1
##$NTH_PI= 0
##$NZP= 0
##$OFFSET= 14.38212
##$PC= 1
##$PHC0= -1188.991
##$PHC1= -0.4077005
##$PH_mod= 1
##$PKNL= yes
##$PPARMOD= 0
##$PSCAL= 0
##$PSIGN= 0
##$REVERSE= no
##$SF= 200.129724274929
##$SI= 16384
##$SIGF1= 3
##$SIGF2= 2
##$SINO= 400
##$SIOLD= 16384
##$SREGLST= <1H.CDCl3>
##$SSB= 0
##$STSI= 0
##$STSR= 0
##$SW_p= 3205.1282051282
##$SYMM= 0
##$S_DEV= 0
##$TDeff= 0
##$TDoff= 0
##$TI= <>
##$TILT= no
##$TM1= 0
##$TM2= 0
##$TOPLEV= 0
##$USERP1= <user>
##$USERP2= <user>
##$USERP3= <user>
##$USERP4= <user>
##$USERP5= <user>
##$WDW= 1
##$XDIM= 8192
##$YMAX_p= 0
##$YMIN_p= 0
$$ End of Bruker specific parameters
$$ ---------------------------------
##NTUPLES= NMR FID
##VAR_NAME=  TIME,          FID/REAL,        FID/IMAG
##SYMBOL=    X,             R,               I
##VAR_TYPE=  INDEPENDENT,   DEPENDENT,       DEPENDENT
##VAR_FORM=  AFFN,          ASDF,            ASDF
##VAR_DIM=   8192,          8192,            8192
##UNITS=     SECONDS,       ARBITRARY UNITS, ARBITRARY UNITS
##FACTOR=    0.0002768,     1,               1
##FIRST=     0,             0,               0
##LAST=      2.2672688,     0,               0
##MIN=       0,             -1147308,        0
##MAX=       2.2672688,     1058338,         0
$$ Real data points
##PAGE= N=1
##DATA TABLE= (X++(R..R)), XYDATA
$$ [...]
1920c43k5J68j78L58M47m64J06L93l77L11j49j02j52r3J08R0k20j73M76l70J72
1941a7l49j81Q21j08k61M02m49N81m34m0J23j23P3R1M7m43L63k19L9P3l04K56
1963e9ll40N95j5k17M05j81k73K51m41K68L33n33L78p5m12K63j82K98m4l03K5
1985b62O67m89j73N41m81K27J82q2M31o62j5J25l46M36Mk90L01k92k09K92l73
2006d68J02N09m63K07M12n57M92R0m77O97k07l47J94l97P4L67j71q9l47l11M44
2027b46l2O3K31k04j4L21j93k3K89k42K28K89k14K17k99rk9j3k32K71p43K79P0
2050b35j57O79n57MJ62r4J01K23l60K63L67m62J81L12m26M97m29q6J62m18L98
2071A25j93k71N05l77jL32n88J21N11l55j6K68k74K79j07k74N40k02pN7j33pN65
$$ plain form
1920 -343 -368 -200 -378 -20 427 -37 69 462 85 396 247 145 -7 -100 8 98 -122 -295 181 -189 -17
1941 -17 -366 -547 274 166 -95 307 -142 439 5 -35 88 -35 38 129 176 -267 96 -123 -84 -11 -315 -59
1963 -59 -62 -402 193 178 -39 366 185 -88 163 -278 -10 323 -210 168 93 -319 -56 -238 60 16 -287 -262
1985 -262 405 -84 -257 284 -197 30 212 130 561 -101 -116 9 -337 99 103 -187 114 -178 -387 -95 -468
2006 -468 -366 143 -320 -113 299 -258 234 324 -153 544 337 -10 184 -213 -139 228 57 -32 -379 -690 -246
2027 -246 -278 -215 16 -188 -202 119 -74 -97 192 -50 178 467 253 470 171 162 133 120 -112 159 -584 -305 -235
2050 -235 -392 287 -270 -266 -104 -198 -97 126 -234 29 396 -66 115 427 1 498 69 -17 145 -273 125
2071 125 -68 -339 166 -211 -212 120 -468 -347 164 -191 -207 61 -213 66 -41 -315 225 23 16 73 -60 -67 498
2094D98n49L93k24j38K05J0o36M48k87j62O22m12j43M87m05L54j97m6M10k54O1
2115C5M1l14O29j92k17K96M7m09L73l36l6K29l81j73K19q0K99j65j04K40O7l34
2137b66P47k87k12K48m44K97K12n53O11j58k95L25k03k06L35l48J2J33k04L7j2
2158b31J10L03j03l16Q31p19M90m3m08L59j24j41K37m59o3O61r22J12M00k75J54
2179a47L21l51K79Q9m25P25n04j69O91o72L65J5j56lj15k92N10k79j70K32m9l72
2201d77L98k18K72qk34N40n53K61N31m30O2J81k60K67m1m39L88n90J29M12o66
2222d75K60L89n04L91J00N9r4Q1l43N41k12l15L34l34K79L52o89L11k5j89J74
2243I1k68l44M93q4J21K83n84O77J40p35O71J1q09Q91m55j30L3O8j01J36m66M61
$$ plain form
2094 498 -51 342 118 -20 185 195 -441 7 -280 -442 180 -232 -375 112 -293 61 -136 -182 228 -26 35
2115 35 76 -238 391 199 -18 278 325 -84 289 -47 -83 146 -235 -408 -189 -269 30 -135 -239 1 68 -266
2137 -266 481 194 -18 230 -214 83 295 -258 353 195 -100 225 22 -184 151 -197 -185 -52 -256 -219 -231
2158 -231 -121 182 79 -237 594 -125 365 322 -86 273 149 8 245 -214 -277 384 -538 -426 -26 -301 -147
2179 -147 174 -177 102 191 -234 491 -13 -182 509 -163 202 217 61 58 -57 -349 161 -118 -288 -56 -105 -477
2201 -477 -79 -297 -25 -33 -267 273 -280 -19 512 82 144 325 65 332 291 -148 240 -350 -221 191 -475
2222 -475 -215 174 -330 61 161 220 126 207 -136 405 193 -122 212 -122 157 509 -180 131 106 -83 91
2243 91 -177 -521 -28 -112 9 292 -292 385 525 -210 461 472 -337 554 99 -31 2 70 -31 105 -361 100
2265A00k69j04P95o51J20L16q06L64L48k20N31l22k71N88l99k52L72m05r8L56
2285I3o15L68K58n54M43m36Q4N23m79L34M37m59K20J98n41L60k9k04J78n75O6
2306c30N10p82L24L08l88L68l33K90K60o10L6K29J97j84M28n45M48k54j92P26
2326E06l47j80R1k17j68L36m50O86l15l76M53k65R4M91l33k07P29p78K96J41k37
2347e0M34l47j82M80l38l36N06n92O06j99l10K24J98n16P03l64j26R31p52Q9K17
2368B76n64M18j59j72N74o70Q5M42l42k83N91p46O13l7k34J91K61k38J13k06L05
2389B18L44p97N56Q8l44M9M0m88O38o50Q1J36k04K75K23n46N23j07n00O42k77
2410a00J5M45m9j51M37n34L29o7m90L21j63K9J2j49k59K15l37K01K69m71O34q3
$$ plain form
2265 100 -169 -273 522 -129 -9 307 -499 -135 213 -7 524 202 -69 519 120 -132 240 -165 -263 93
2285 93 -522 -154 104 -450 -7 -443 -359 164 -315 19 456 -3 217 415 -126 234 205 1 179 -396 -330
2306 -330 180 -602 -278 30 -358 10 -323 -33 227 -383 -347 -118 79 -105 323 -222 226 -28 -220 506
2326 506 159 -21 70 -147 -315 21 -429 257 -58 -434 19 -246 -152 339 6 -201 528 -250 46 187 -50
2347 -50 384 37 -145 335 -3 -339 167 -425 181 -18 -328 -104 94 -422 281 -83 -209 722 -30 59 276
2368 276 -288 130 -29 -201 373 -297 -212 230 -112 -395 196 -550 63 26 -208 -17 244 6 119 -87 218
2389 218 562 -235 321 409 65 114 154 -334 304 -346 -265 -129 -333 -58 165 -381 142 35 -465 177 -100
2410 -100 -85 360 311 160 597 63 392 325 -165 156 -7 22 34 -115 -374 -159 -496 -295 -26 -497 137 54
2432E4l80Q93p94J99N32l14j4L76j83k47Q0m55N15j83j09N3l04j58K94m12K13
2453c44J20l10O35j74k03N22l40N67l8k64L55Lk14j6n9k09R8k15n3Q2n35L45j0
2476b57m89M15J14m56O75q1q1N80n55K54N00l26Q2M00o35N26l45l87J91l50j03
2497c28K5m16M00Rn21P27j97j65M03j37K98K10R4j65M32l99J56j33k28O33o28
2518G0l60L42k88q3K76m00j3J54j36N14k18l97P72k64N50l34j65M23J52n02J83
2539B76Ll63K37l07N4M48o68K78l18k45L97k60j8N26J06k65Q2J15O9P5J39j49
2561B12L92m51Rl46l4N20n97K88N9l59K67k5k94M22j59n42P44k28J65K19l97k11
2583c46N08l36M90l46N4Q3j30p0J26k53R8L14l22K38j08n32J077m07m71N51l48
$$ plain form
2432 54 -326 567 -227 -28 504 190 176 552 369 122 202 -253 262 79 -30 23 -281 -439 -145 -557 -344
2453 -344 -224 -534 101 -73 -276 246 -94 473 435 171 526 529 315 299 240 31 129 -86 -139 -57 -592 -247 -257
2476 -257 -746 -331 -217 -673 2 -79 -160 420 -135 119 619 293 375 775 140 666 321 -66 125 -225 -328
2497 -328 -303 -719 -319 -310 -831 -104 -301 -466 -63 -200 98 308 402 237 669 270 426 293 65 698 70
2518 70 -290 52 -236 -319 -43 -443 -456 -302 -438 76 -142 -539 233 -31 519 185 20 443 595 93 276
2539 276 279 -84 153 -154 -100 348 -320 -42 -360 -605 -208 -468 -486 40 146 -119 -37 78 147 222 361 212
2561 212 604 153 162 -184 -218 302 -295 -7 52 -307 -40 -65 -359 63 -96 -638 106 -122 43 262 -135 -346
2583 -346 162 -174 316 -30 24 107 -23 -93 33 -220 -122 192 -130 108 0 -532 545 138 -333 218 -130
2604a30k05L64l58M44l23J11J42k20j75O48k90j67M37m17L69J61j38j45K16p07
2624c83O83p38M46J4k40J54M7o15L87N6l30P43k11j01Q6N9J77K10l80J39P6k97
2646a8L7K51l29K46m14j99P39o36q9K14k06L39q9m7M34j05p5J58l88J25L10m3
2668B15J09N9n73J96k0kN37o79J86J48l09l3J34m16L55J06l45O06k78j54N21n79
2690b16N67k27jM1j08k33K70k20J16Jl37J64Ll87M40J53R5r2q3Q8M38l09lN8l24
2715a06K61R6o04O71l54k55L54l71J39o9J04J55L3l67N17l52K3K87k06J32K00
2736B88l06k3L41l65K46l03j41L17l05J12K9k4J58M78q22M83N5l09L71n23L16
2757G3k0K8j13J61n3j17J73k79K18m04J71L99k57j6M2M1k02L61j51K82j73q3K94
$$ plain form
2604 -130 -335 29 -329 115 -208 -97 45 -175 -350 298 8 -159 278 -139 230 391 253 108 324 -383
2624 -383 300 -438 8 22 -218 -64 -17 -632 -245 -189 -519 224 13 -88 -2 57 234 444 64 203 279 -18
2646 -18 19 270 -59 187 -227 -426 313 -323 -412 -198 -404 -65 -154 -201 233 128 53 211 -177 -52 258 215
2668 215 324 383 -190 6 -14 -16 521 -158 28 176 -133 -166 -32 -448 -93 13 -332 274 -4 -158 363 -216
2690 -216 351 124 123 164 56 -177 93 -127 -11 -10 -347 -183 -180 -567 -127 26 121 29 -54 34 472 163 160 218 -106
2715 -106 155 251 -353 318 -36 -291 63 -308 -169 -238 -134 21 54 -313 204 -148 -125 162 -44 88 288
2736 288 -18 -41 300 -65 181 -122 -263 54 -251 -139 -110 -134 24 502 -320 163 218 -91 280 -243 73
2757 73 53 81 -32 129 76 -41 132 -147 71 -333 -162 237 -20 -36 6 47 -155 206 55 337 164 81 375
2780C75k72l58J49j63p3N92n03M61j21l96O52l11l1L49k75r1J13Ll20L39j75M08
2802C52l03j57K75l12m6J96j95o0J62N8K30j02Q0M1j14K23j02k24J19O2j95K59
2824B47j01j76K39k32k99L35l14J14J34l22M39J29j38N4J18k85J03J04N5K24l60
2845F8M09k56m59M04l05j70L06r2k49M85l49J69L04o33K96K63l00N72o69J92M19
2866D05m04K0J62k73L28o0n82L56n69M55J43k26J21r3K6J97J35j77K42M1k87K0
2888b0r5M6K46k14R1n4j74J04J52k88K23m4n7Q3L9k30J25jO13j93j95N8J51j32
2912B34r2Kk71L20n53K15P1j14O2j96R7R0j62J77K93l41K16J62J48k26K62m76
2934h2L40n3l8l0m62L86K1n79J78K30j09l1j8M8J78L8q7P6k13M93K1k07J09j57
$$ plain form
2780 375 103 -255 -106 -269 -342 250 -253 208 87 -309 343 32 1 350 75 -16 97 100 -220 119 -56 352
2802 352 49 -108 167 -145 -191 5 -190 -250 -88 -30 200 98 178 219 105 328 226 2 121 183 -12 247
2824 247 146 -30 209 -23 -322 13 -301 -187 -53 -375 64 193 55 109 227 -58 45 149 204 428 68
2845 68 477 221 -238 166 -139 -309 -3 -95 -344 141 -208 -39 265 -368 -72 191 -109 463 -206 -14 405
2866 405 1 21 183 -90 238 178 -404 -48 -617 -162 -19 -245 -124 -217 -191 6 141 -36 206 247 -40 -20
2888 -20 -115 -69 177 -37 54 0 -174 -70 82 -206 17 -27 -84 -1 38 -192 -67 -68 545 352 157 215 366 234
2912 234 142 144 -127 193 -360 -145 -74 -188 -126 -322 -225 -135 -297 -120 173 -168 48 210 358 132 394 -82
2934 -82 258 205 167 137 -325 61 82 -497 -319 -89 -198 -229 -247 -199 -21 17 -70 6 -207 286 307 100 209 52
2958E2Q9J05m67L25m3o83M39J82k30M5q7J53P4k20K22J32j9n0J67m72M98O0k66
2981FJ32l9J76k11k15J08Q4l38j05K62j11J72j40p0L63k79L51R8l8Q6p7J33l02
3004D6j66M8K66m40K35L0l62Q4L10n62N48j3m99N38l10K41J14k31L16j36j85J94
3026F6P5q5L93l04n89P32k32jj52j35J88r9K4j35k26N69L1k28L08m24K23J99n4
3049A44k64K33O7l7J43k10q2J90n6j17l5l1K8K3l08J96j98P7K00k03n0K42j01
3072a49L53j25l7K60k42M7J55l13K55J09m11J11OJ2k42J55Q1m5j14M7rj79K38
3095c7j9k6N53o03P6M07j95l6m8j01J8K74k62J53K10n01N3J14j86K16q8J4k14
3118b28J53P2J0O8n24M51j05J40L76l56J87k71J11J81n65M06N9l05m8j94J63J98
$$ plain form
2958 52 141 246 -221 104 61 -622 -183 -1 -231 -186 -273 -120 -46 -266 -44 88 69 19 186 -286 212 272 6
2981 6 138 99 275 64 -151 -43 41 -297 -402 -140 -251 -79 -219 -289 74 -205 146 244 206 292 215 348 46
3004 46 -120 -72 194 -246 -11 19 -343 -259 51 -511 37 24 -475 63 -247 -6 108 -123 193 57 -128 66
3026 66 141 56 449 145 -444 288 56 55 -97 -232 -44 -143 -119 -254 -480 89 120 -108 200 -224 -1 198 144
3049 144 -120 113 180 143 286 76 -6 184 128 11 -24 -55 -27 -4 -312 -116 -314 -237 -37 -240 -290 -48 -149
3072 -149 204 79 42 302 60 107 262 -51 204 313 -98 13 19 31 -211 -56 25 -20 -134 -87 -96 -275 -37
3095 -37 -56 -82 471 -132 -56 351 156 120 72 -29 -11 263 1 154 364 -137 -84 30 -156 60 -28 -14 -228
3118 -228 -75 -3 7 75 -449 2 -103 37 413 57 244 -27 84 265 -300 106 165 -140 -188 -382 -219 -21
3140b1l14J00M19o70M84J08k81M07k27k5J75J40k57J13L5L2k6j91k6j9L1N7O7
3163A11k61P3k43K79J39j00o7K05n9K11l03j65L35J78j54K48n00J32j20j65K77
3184E1j45jj27J02k03J91J9J55r2m7Q6J26j77J37j28N2N3o3J6K46r1J86l02j12
3208f8m0J26p3K10m10L53p5k87L11M7N8j94K4l58N22k52K0J66q5p8K83j86J0l94
3232c70J60K81j74L6L67l42o2J61k24L75q3m34M37k20O6L33m78L34p6O8m0J14
3254B29k23K96k75mL4j92m7J44l56P38m43R8O9j26L8q6K18j72M25o23J38m1M40
3277B79j93J14l16L25j33J4J0j38j58R7J66j62K42l71L54j72j66k0K66k6J18L7
3299A67k6q6k38K31j30q3J99J96j48L23p07L04N2m23M54k45J52k71J79j03K11
$$ plain form
3140 -21 -335 -235 184 -486 -2 106 -175 232 5 -20 155 295 38 151 186 218 192 1 -25 -44 -13 44 111
3163 111 -150 -77 -320 -41 98 -2 -69 136 77 288 -15 -180 155 333 179 427 -73 59 -61 -226 51
3184 51 -94 -95 -222 -120 -323 -132 -113 42 -50 -97 -11 115 -62 75 -53 -1 52 -11 5 251 160 346 44 -68
3208 -68 -108 18 -55 155 -255 98 23 -264 47 94 152 -42 -18 -376 146 -106 -86 80 -5 -83 200 14 24 -370
3232 -370 -210 71 -103 -67 300 -42 -104 57 -167 208 125 -309 128 -92 -26 307 -171 163 87 155 115 229
3254 229 6 302 27 23 57 -135 -182 -38 -394 344 -99 -1 68 -58 -20 -106 112 -60 365 -258 -120 -161 279
3277 279 86 200 -116 209 76 90 100 -38 -196 -99 67 -95 147 -224 130 -42 -208 -228 38 12 130 167
3299 167 141 55 -183 48 -82 -165 34 230 82 405 -302 2 54 -369 85 -160 -8 -279 -100 -203 8
3320Hj03K47J99m31J71nk13K84k68K78R6m63K17J55J05m02J69r0J85j68LJ90p3
3343I1l1J3j17R1j88J33J78q5j08mp5J51J03l35L99q0l33L66k47j2K1Q6l1J1r
3368a2J69j6k25J41n8j81K74j1j33j6r7M4M47j23j52j42l7J35L9N8n2J42l66J24
3392d8Oj80K36k3J97j42n7Q6m6l5J24k13M48J2n05J26j63l2K22j31L7J82k18J7
3416a00L03l12P0LO6K0j17j0J80p2J15j46J50mJ1j62K80k21l73N67k91J01K19
3439B77j75JN3k15K19j02j47J17k92J62P2R2r0L2k15K01O4j19K16j61k16L01r1
3462a6j35K78j27r4J26p5L98l86J62J66l79j41M37l20N16k36k70n2J92ko6p0j
3485i5L77m06J13J19n8p6K71k63K47j68J20j31j39l8L03j32K6K74l64J71j92P4
$$ plain form
3320 8 -95 152 351 -80 91 86 -127 157 -111 167 263 -200 17 172 277 -125 44 -46 139 -29 -26 164 91
3343 91 60 73 -44 47 -141 -8 170 85 -23 -27 -102 49 152 -183 216 136 -197 169 -78 -90 -69 17 -14 -3 -12
3368 -12 157 141 -84 57 -1 -182 92 81 -52 -68 -165 -121 326 203 51 -91 -128 7 46 104 52 194 -172 -48
3392 -48 -42 -222 14 -9 188 46 -11 75 29 -6 118 -95 353 365 -140 -14 -177 -209 13 -118 -81 101 -117 -100
3416 -100 203 -109 -39 -36 30 50 -67 -77 103 31 146 0 150 146 157 -5 275 54 -319 248 -43 58 277
3439 277 102 103 156 -59 160 58 -89 28 -264 -102 -30 62 -28 4 -211 -10 54 -65 151 -10 -226 75 -16
3462 -16 -151 127 0 -94 32 -43 355 -31 131 297 -82 -223 214 -106 410 174 -96 -148 44 42 -24 -94 -95
3485 -95 282 -124 -11 108 50 -26 245 -18 229 61 181 50 -89 -127 176 44 70 344 -20 151 -41 33
3507C3j34n4L41l55m9K46j08K6M91m60K14m4m68L79p1k8N0j37M4J21j1j39K43
3530A30j29j13J16Pj85j27M32k7k7j49K9j22J40L67l78J53j48j58L34k92j33K33
3552d7r4k0j12L41k01J15j29RJ24n8L3M12m24m9n4K13r2J16j92J46j45l2j95L76
3576D1K8L3k03J49r9n4R4o7K96Lj73m9j13L66k41j97J38K40j30q8j35L33M3r1
3600A24j98o8M33l39J17J51j79j49J79K8r8k18k16M39k20M69k09J35K2l13K17
3621A07j74j19J18L38l80jm8%J53j03L44p1j26K6k22J63J81l98L18k75k3L61L
3644A72j51j45N7J07N3k95J02O1L13m51J72M9n8mj49J40l4K62j29j62j82K33J54
3667A15k47K78j12o0P3K38k82p2l5J91j18j51r2K45M4j38n8Q8K00k16J28o4J71
$$ plain form
3507 33 -101 -155 186 -169 -218 28 -80 -54 437 -23 191 147 -321 58 -13 -41 9 -128 -84 37 26 -113 130
3530 130 1 -112 4 11 -174 -301 131 104 77 -72 -43 -165 -25 342 -36 117 -31 -189 145 -147 -280 -47
3552 -47 -141 -161 -273 68 -133 -18 -147 -138 -14 -72 -39 373 -51 -100 -154 59 -33 83 -109 37 -108 -140 -335 41
3576 41 69 102 -101 48 -51 -105 -11 -78 218 221 48 -1 -114 252 11 -186 -48 192 62 -26 -161 172 215 124
3600 124 -74 -142 291 -48 69 220 41 -108 71 99 1 -217 -433 6 -214 255 46 181 203 -110 107
3621 107 -67 -186 -68 270 -110 -111 -159 -159 -6 -109 235 164 38 64 -158 5 186 -212 106 -169 -192 169 172
3644 172 21 -124 -67 40 93 -202 -100 -39 274 -177 -5 44 -14 -18 -167 -27 -61 201 72 -90 -272 -39 115
3667 115 -132 146 34 -26 47 285 3 -69 -104 87 -31 -182 -274 -29 15 -123 -181 -93 107 -109 19 -45 126
3690A26N4p0K24j33m53M09j35J22j05O9k63l6J73K40j51k17l8J47j38P4K40m1
3712I8k54N6K53k22K4K8J72j29j56K31q4K61k93l2J33j69k5L0N9J58k74mk9J46
3736b2J98r8J37j80N9L45k44j14j11K08n8j84K06k68j5L97on1o04N58p6K8l91
3759b86L45J51m9k03Q8J12j86r4p4K02J86p6q4m6j85K30j27J57j44P4Q8j51m5
3782a17K13M7k59k80M50R%p7rj15K28p3j11l0o4L03O6l42K74k04R9L5J21k37K10
3807A37j98j65M09k95J52k6qk6J88k05K24ol17K74k39P3K56k67k48J22J98j24
3829i1Q6l04J07J82P6K60l24J83j77J56j07q5j9N1K09k77K32j33O6K80k26J90
3851C35n48L75j40j94J39L8k54K72j99J79L6j09J34Q5l62M43k73K20j11j41J16
$$ plain form
3690 126 180 110 334 201 -252 157 22 144 39 108 -155 -191 -18 222 71 -146 -184 -37 -175 -101 139 98
3712 98 -156 -100 153 -69 -45 -17 155 26 -130 101 17 278 -15 -47 86 -83 -108 -78 -19 139 -135 -139 -168 -22
3736 -22 176 78 215 35 94 439 195 81 -30 178 120 -64 142 -126 -141 256 250 199 -405 153 77 105 -286
3759 -286 59 210 161 -42 46 158 -28 -122 -196 6 192 116 32 -14 -199 31 -96 61 -83 -9 79 -72 -117
3782 -117 96 143 -116 -396 54 63 63 -14 -23 -138 90 17 -94 -124 -188 115 181 -161 113 -91 8 43 164 -73 137
3807 137 -61 -226 183 -112 40 14 6 -20 168 -37 187 181 -136 138 -101 -28 228 -39 -287 -165 33 -91
3829 -91 -5 -309 -202 -20 56 316 -8 175 -2 154 47 -38 -57 -6 203 -74 158 25 91 371 145 335
3851 335 -213 162 22 -172 -33 5 -249 23 -176 3 39 -70 64 149 -213 230 -43 177 66 -75 41
3872D1Rk89MJ56J89j52N7l7J63l46m4K65J43J06j33n1l37N10m72N01j45Rk24O5
3896a2j46Q9M17m60M1k0N4K51q5m7O4j96j62K22j18j08M77l31R8m42M83j37J16
3919D8j9J1l35P1rK82r8k58K53J53l85P9K11K4L44l10j94J8PJ53J22P8l08L60
3943B98k72n25M87M37n28Q1ll21L00K1J36N2q2k32M3J28l04M82j75J47m4j13N8
3966G1j99K46j45K54l8l03J71k54L30j12l15L30j42P2N2j95J89J65j09mJ48m82
3988b70K62J07j69k0q9J76K5K95j66j37j01K13k44k3J67j31J71M6j80J43j38o1
4010a24K63j22O6j18O7kk01L02j11n8L5J51k75J65J36l96R6K21j48J86k21J04
4032A6j33K88r4l11K86r0q2pO2J34J79j78R7l73j0L32j96K24j15P9l50M14k68
$$ plain form
3872 41 50 -239 -235 -79 110 -42 15 -22 141 -205 -249 16 159 265 132 81 -256 254 -218 283 138 147 -77 -12
3896 -12 -158 -69 348 -112 -71 -91 -37 214 129 82 146 -50 -212 10 -108 -216 261 -70 28 -414 69 -68 48
3919 48 29 40 -295 -224 -233 49 -49 -307 -54 99 -286 -207 4 28 372 62 -132 -114 -107 46 168 246 -62 298
3943 298 26 -499 -12 425 -103 -22 -25 -346 -46 -25 111 163 81 -151 -108 20 -284 198 23 170 126 13 71
3966 71 -128 118 -27 227 189 -114 57 -197 133 21 -294 36 -106 -34 18 -177 12 177 68 64 212 -270
3988 -270 -8 99 -70 -90 -179 -3 22 317 151 14 -87 126 -118 -141 26 -105 66 112 -68 75 -63 -124
4010 -124 139 17 83 -35 32 30 -171 131 20 -38 -3 148 -127 38 174 -222 -126 95 -53 133 -88 16
4032 16 -117 171 77 -234 52 -38 -120 -127 -65 69 248 70 167 -206 -216 116 -80 144 29 108 -242 172 -96
4055i6j32O4P5K15N1k20R3k81J65M08l01nR9J24l26k4r9K10J37j3l3o9o0J29j40
4080b9l6K22j49j70L6Q4K42L2k94K62N9j73J16j89N5k14j3K02n5K01m80J36J39
4103a6n3J20k44n5M73J10k76j58R0j56k1J81P2Om10N24j17k76K65L7J85k40j30
4126h9p0O3N25m26k27J49Pj04l1L24P2q8j04Q1m5k43PK66j22Q6P6k57K58k32J58
4151C4q3J27j43O4l4J44o7Q8j68j56M25J31m11K66j6j39q3P2mK3m7l03K17P2k8
4176a9Q2M4j87K07l23O3K33o6O5Q6Q0l35k48L26j83L72r1Ok61K49Lr0J05j53J87
4201A52j45l5K07q9j76J59J37j69rM6m18K45n3K16r9j08n8K64j00K0K85j38k84
4224a50R7L01k39L36n34m8R1K13Nm3k17L06m90J72J94q1J97m5Q0p5k6j80k4J92
$$ plain form
4055 -96 -228 -164 -89 126 177 -43 50 -231 -66 342 41 36 135 259 -67 -91 -190 20 157 144 111 42 -18 111 -29
4080 -29 -65 157 8 -162 -126 -42 200 232 -62 200 259 86 202 13 68 -146 -159 43 -12 189 -291 -155 -16
4103 -16 -69 51 -193 -248 225 335 59 -99 -9 -165 -186 -5 67 73 -337 187 70 -206 59 96 281 41 -89
4126 -89 -159 -96 429 3 -224 -75 -68 -172 -203 121 193 105 1 82 37 -206 -199 67 -55 31 107 -150 108 -124 34
4151 34 -49 78 -65 -1 -35 109 42 130 -38 -194 231 362 -49 217 201 62 -21 51 47 70 23 -280 -63 9 -19
4176 -19 63 107 -80 127 -196 -133 100 34 99 185 265 -70 -318 8 -175 197 106 112 -149 100 103 13 118 -35 152
4201 152 7 -28 179 90 -86 73 210 41 32 78 -340 -95 -148 68 -31 -139 -197 67 -33 -13 272 134 -150
4224 -150 -53 248 9 345 -189 -237 -146 67 72 29 -188 118 -372 -200 -6 -87 110 65 145 70 44 -136 -160 32
4248C2R4r4p8K46k20J79o4k17J43k05K04j69L40p6J05k15p4L7R1o3LJ19j84K23
4272A57j38j18L0r6L6P3J68k89K01j39J69r7J26j5K0k89L99j26j31n9L54k58j41
4295a63K55r4j46J79q0p3R3J67k93O3J62j89R2j0K73k36J77j82j97M52p1k39M3
4318a7j01o1l4K06j31j29N7L20l6k17m2M8J68J14l22J49k20K26J52m5q6J17k54
4341a38Q9J70k06Q0Q1K5Q8k43j0K42j36j45m0P5P9r4J22N6k22K09j23r0J71L7
4365G7J53n7rj80P7Q6l94K17Q8j7K09j33j77K00n0m4k0K23k70k4l1R4N4L0j82
4390h0J1k8r6J97J33j61PK16r3j67j28L53l2j76k2J11k74J90K58l81L77k30R0
4413G5J58o2j95k11J99j65L67J2j56j58j5K57j93j36M32m32%M76l59M2K42j40
$$ plain form
4248 32 126 32 -46 200 -20 159 95 -122 21 -184 20 -149 191 115 220 5 -69 -32 59 -4 -1 118 -66 157
4272 157 19 -99 -69 -165 -129 -56 112 -177 24 -115 54 -43 83 68 88 -201 198 72 -59 -118 236 -22 -163
4295 -163 92 -2 -148 31 -49 -122 -29 138 -155 -92 70 -119 -27 -37 236 0 177 -5 -202 250 179 -60 -17
4318 -17 -118 -179 -213 -7 -138 -267 -210 110 74 -143 -185 -137 31 145 -177 -28 -248 -22 130 85 -1 116 -138
4341 -138 -49 121 -85 -5 76 101 189 -54 -64 178 42 -103 -143 -68 11 -83 39 95 -127 82 -41 -131 40 77
4365 77 230 173 164 -16 61 147 -247 -30 58 41 250 117 -60 140 90 46 26 249 -21 -45 -76 18 72 102 -80
4390 -80 -69 -97 -193 4 137 -24 -17 199 106 -61 -189 164 132 -44 -66 45 -229 -39 219 -162 215 -15 75
4413 75 233 171 -24 -235 -36 -201 166 178 22 -136 -151 106 -87 -223 209 -223 -223 253 -106 -64 178 38
4435C8j26R4K20l43L23pl55L05J6J52l78n1L36k13j2q6J36p3p1J39k95L91k19
4458g9K56j46r6L6J37j03j9J8M1j49k72N05J8k23K6j3k04J20J79k4j74m7J11j08
4482b10O02k35l61L30k87R2n1J58r0K72k59J21J70l82J03J24j57J46j71K85p7
4503A23rQ2k61m8J6L56m44J95j98M46L1k69J47q1K03j74k09J66P4J31k61n6K10
4526A70l59J56J60j08j28L8N6n4K87k08K90j80K7j23l56M56j97J70r1J20j36j10
4548a20R2J05p8J9J82k61o5J89j01L39l34Lj34J57j64K27n2J89m0k91L01r8O6
4571A31l76L17r7KM3j62L76j87k0j61J83K77m50J26l58K10K83k10M3J0j31K65
4593A14LJ6l39K38J38k46K70j70j23K80l72JL25N1j84K44j92j4J2N4j19K69j71
$$ plain form
4435 38 -88 6 226 -117 206 199 -156 149 165 317 -61 -112 224 11 -1 -87 49 -24 -95 44 -251 140 -79
4458 -79 177 31 -65 -29 108 5 -14 4 45 -104 -376 129 147 -76 -50 -63 -267 -147 32 8 -166 -213 -102 -210
4482 -210 392 157 -204 126 -161 -69 -120 38 -52 220 -39 82 252 -130 -27 97 -60 86 -85 200 123
4503 123 114 196 -65 -113 -97 259 -185 10 -188 258 289 20 167 86 289 115 -94 72 146 277 16 -40 170
4526 170 -189 -33 127 19 -109 -71 -15 -69 218 10 300 120 147 24 -332 124 -73 97 6 126 -10 -120
4548 -120 -28 77 -1 18 200 -61 -126 63 -38 301 -33 -30 -164 -7 -171 56 4 193 153 -138 163 65 131
4571 131 -245 72 -25 -23 20 -142 234 47 27 -134 49 326 -124 2 -356 -146 137 -73 -30 -20 -151 114
4593 114 117 133 -206 32 170 -76 194 24 -99 181 -191 -190 135 186 2 246 54 40 52 106 -13 256 85
4616H5k18J23m7j7L6k43L88k07J88j74J4j09K40K10l37J21j10J62q7J69r3j15
4638b1J80l01o5L41O7j43n2J98k50j60L71l12Q3M89j20j89j3j05R0k09j34N04
4660B49l80K61l6K6l30P0K79q4k4M5N4l32K16k46J52J6k99K33Q3Q4j58L79l50
4683i2p6K13K71k05k76K7J57j1N5J39P8l44L25m28q6M33j26l91M95r0J27k10Q6
4706G1J60q9O6N5j54L5j94J81j70l0l0K17o2k0K68l08J2M4k04M74l09L02l47m6
4730g8R8M4Q6k25J10Q2j50j49R7N4R4j44J29nj26L14j65k36L83m36L22j58K9L3
4754CM9N9l9J3J22p3k63L86k86j7M8K1r5n0k38M37P6n0p1k64P9R0J31p1q6j32
4780b21L66m13K37K39l22k3K91j06l16J22L46k20j53K19k37j69M68J02k02j23
$$ plain form
4616 85 -133 -10 -57 -74 -38 -281 107 -100 88 -86 -72 -181 59 269 -68 53 -57 105 18 187 94 -21
4638 -21 159 -142 -207 134 201 58 6 204 -46 -206 165 -147 -64 425 305 116 103 -2 88 -121 -255 249
4660 249 -131 130 94 120 -210 -140 139 55 31 76 130 -202 14 -232 -80 -64 -363 -130 -47 37 -121 258 -92
4683 -92 -168 45 316 111 -165 -138 19 8 63 202 280 -64 261 -167 -253 180 54 -337 158 68 195 -15 71
4706 71 231 142 208 263 109 144 -50 131 -39 -69 -99 118 56 36 304 -4 8 52 -152 322 13 315 -32 -78
4730 -78 20 64 150 -75 35 117 -33 -182 -85 -31 63 -81 48 43 -83 231 66 -170 213 -223 99 -59 -30 3
4754 3 52 111 72 85 207 134 -129 257 -29 -46 2 23 -72 -122 -360 77 153 103 32 -232 -153 -63 68 -3 -89 -221
4780 -221 145 -268 -31 208 -114 -137 154 48 -268 -146 200 -20 -173 46 -191 -360 108 210 8 -115
4800a15r0K77j71J54M0O5k58J43K9k06Q1Q6j28J64k47L77r6P2k23j03p8K56J66
4823A95j6k66J53n4J06j23n5J40p3o7J57k76J13J33j76j23M90l16J60k2mL6m62
4846c50L16q8P5L4j69o2L74l17m3J03O6o9P9k47K76R9k96M2M18j67l26K89L2j33
4870f4L9l3J8j69K16R9q1J12o1j70L10m42L14j0R0j87J29l9r0J48J3j13J03l40
4894b08J31k12K39O8j57K97r3k06o9L33J68o58N27k54K06p2j09K18M4r8J03l66
4916a68K78M1J4j27j59K28J2n7j47K27j42J43o3r9r5L5r9R4R2J43q5k31m5K60
4940E0P2j11J3Q4R0m67J56J82k35J25J92k98J18J21j82m9K08J49l8q6k1o1J9J00
4964A31l4q8l0j52p6K78J80j02k48K10J21k7Q3k65j66J52K81m30K17l7j64R3K86
$$ plain form
4800 -115 -205 72 -99 55 95 160 -98 45 74 -132 -51 35 -93 71 -176 201 105 177 -46 -149 -227 29 195
4823 195 179 -87 66 12 118 -5 -60 80 7 -60 97 -179 -66 67 -109 -232 258 -58 102 80 76 112 -350
4846 -350 -34 -122 -47 -13 -182 -244 130 -187 -230 -127 -61 -130 -51 -298 -22 77 -219 -177 241 74 -252 37 69 -64
4870 -64 -25 -58 -40 -209 7 106 25 137 76 -94 216 -226 88 78 168 -19 110 71 -19 129 142 29 132 -208
4894 -208 -77 -289 -50 18 -139 158 65 -141 -210 123 291 -367 160 -94 112 40 -69 149 193 95 198 -168
4916 -168 110 151 165 38 -121 107 119 62 -85 142 0 143 80 -19 -114 -79 -178 -84 8 151 66 -165 -210 50
4940 50 122 11 24 108 198 -269 -113 69 -166 -41 151 -147 -29 92 -90 -139 69 218 180 94 73 12 31 131
4964 131 97 9 -21 -173 -249 29 209 107 -141 69 190 163 246 -19 -185 -33 248 -182 35 -2 -166 -73 213
4987B13k78rj87J89J91jl84K21nK51j19j11p9K05k83J40K11j32L4K35m77N51j48
5010B28k91m9J8K81j69m1J13l13K98J19L0k62K3R3k54L05q7n5J78j5O8m06L50
5033A62L1m37L18k8j57K1K45l50K54k71K40L1J8o3J17k02N9M7p1K60o4j99j94
5056b33J99r1K22l54M03jj16J34o8j26k8m0j2K02k23j19L46J09j84J1j5P4j47
5079e7j14K77j23j61K79k1j50nK91j4m18K27J42j19j21O8Q2k09J83j22p2L42k12
5102b7N5k6r5J71M7l26L47J94m04J00j81K29J15k74L5N0l07L13P4j69K64j85K12
5125B12o1J9p0J01m38R8K02k32q3P7J12P9k29J23K4Q4N2J40k75M47j33m52J83
5148b0J35k56K73q3j35Q6P6j32R8l0N6J83j46k84Mk0J84q5j18K75J77j57l3L0
$$ plain form
4987 213 -65 -74 -261 -72 119 118 -266 -45 -50 201 82 -29 -108 97 -186 -46 165 33 67 302 -175 376 228
5010 228 -63 -112 -94 187 18 -23 90 -223 75 194 224 -38 -15 78 -176 129 42 -13 165 150 218 -188 162
5033 162 193 -244 74 46 -111 -90 155 -195 59 -212 28 59 77 14 131 -71 -12 35 -36 224 160 -39 -233
5056 -233 -34 -125 97 -257 146 145 29 163 95 -31 -59 -99 -111 91 -132 -251 95 204 20 31 16 90 -57
5079 -57 -171 106 -17 -178 101 80 -70 -75 216 202 -216 11 153 34 -87 -19 63 -146 37 -85 -157 185 -27
5102 -27 28 2 -93 78 125 -201 146 340 -64 36 -145 84 199 -75 -40 10 -297 16 90 -79 185 0 212
5125 212 151 170 100 201 -237 -139 63 -169 -252 -175 -63 16 -213 -90 -66 18 70 210 -65 382 249 -203 -20
5148 -20 115 -141 132 49 -86 0 76 -56 42 12 68 251 105 -179 -175 -195 -11 -96 -214 61 238 81 48 78
5172G8J57m04L36m6j50k1Jp7N5R6q4N6K4j42k18K92J96m4J46k79j98L76j39m5
5196c4J01n8j08K2J70j59QJ56k27L04m86P06m13r4K02J98k99K7r2K74j56j61L31
5219B12j41J25m80M69N0j41k01J22l02J67K37Q7p4j29J51r8J12l84L83n7k52J18
5241b6K92k49M7m02M50J4Q0l06k45M55lk17J90j9j5k97L11j72J58j61j23L96j59
5264aP5j99K48j3m5L8j66k4N9Q8L1K2k5k33L13k04N9J29m56M45j14l0j51R8K26
5289A70J2j98j09K25l58l0K50P3mJ80j58J57j16l0n5P6k77M75m85J05q1J85j41
5312a34K28j1P3k28K05l9nN0k27J67r4N2j12K16j72J85q8k6j63J80N5J19j14l29
5336b12J57l1P7p2K80j43%k79K40J61l81K90m20L62O7j61j09K96k61j2N8J14o5
$$ plain form
5172 78 235 -169 167 121 -29 -50 -49 -126 -71 25 -59 -3 21 -121 -339 -47 149 105 251 -28 -226 150 11 -34
5196 -34 67 9 -99 -77 93 -66 -58 98 -129 175 -311 395 -18 -112 90 288 -11 16 -76 198 42 -119 212
5219 212 71 196 -284 185 235 94 -107 15 -287 -120 117 204 130 1 152 54 166 -218 165 108 -144 -26
5241 -26 266 17 64 -338 112 126 206 -100 -345 110 107 -110 80 61 46 -251 60 -112 46 -115 -238 158 -1
5264 -1 74 -125 123 110 65 103 -63 -87 -28 60 91 113 88 -145 168 -36 23 152 -304 141 27 -3 -154 -56 170
5289 170 182 -16 -125 100 -258 -288 -38 35 31 211 53 210 94 64 9 85 -192 283 -202 -97 -178 7 -134
5312 -134 94 83 156 -72 133 94 89 139 -88 79 -15 37 -75 141 -31 154 66 40 -123 57 112 231 117 -212
5336 -212 -55 -86 -9 -81 199 56 56 -223 17 178 -203 87 -333 29 96 -65 -174 122 -139 -151 -93 21 -44
5359d4j04L55l88Lp2K61j28K94j21l97O09k58Q6k38M14l60k51L31K67l71K15j03
5381@N8K75l03j23J98l0j73K7N5L0l29O23n00J94qL0j69K04o2R4r7J4M3j13k2
5406h4J34l9j2J79k48J09R7j63o4J34p6K3O5l0j45M74l53lO2l92K48o9K34R1p9
5431I3k49J91j67J61N1q4j47J66j1q1K32ol99M4L32l17JK35Jk7k16o8M03j35P3
5456G6m8Kj15M7J5j6j06R0k2J23j88N79n69KK21M8j18J25k06J15k47L3M38j84
5480I5k00J32J09j13j97m0K90j13J63p8j60L58n01L86q4R0L2l63K61K5L8p3j7
5503D0L7K75k33l22J87J4N1j12K85l08K27j53k22J46m4J58R4p1J54j22J08l17
5525a28J31N6n4K15k98J15J22r6o4j31J51M0O7j71J17j53K8o8qJ51j24K41j47
$$ plain form
5359 -44 -148 207 -181 -178 -250 11 -117 177 56 -341 268 10 96 -142 272 -88 -339 -8 259 -112 103 0
5381 0 58 333 30 -93 105 75 -98 -71 -16 14 -315 308 -192 2 -6 24 -145 59 -3 91 -6 8 51 -62 -84
5406 -84 50 11 -1 178 -70 39 136 -27 -91 43 -33 -10 55 25 -120 354 1 -2 60 -332 -84 -153 81 172 93
5431 93 -156 35 -132 29 80 -4 -151 15 4 -77 155 149 -250 -206 126 -191 -190 45 46 19 -197 -265 138 3 76
5456 76 28 30 -85 -38 -23 -39 -145 -55 -77 46 -142 437 -132 -130 91 139 21 146 -60 55 -192 -159 279 95
5480 95 -105 27 136 23 -174 -214 76 -37 126 48 -112 246 -255 131 47 137 169 -194 67 92 130 57 40
5503 40 77 352 119 -203 -16 -2 49 -63 222 -86 141 -12 -234 -88 -132 26 120 49 203 81 189 -128
5525 -128 3 59 5 220 -78 37 159 63 -1 -132 19 59 126 -45 72 -81 -53 -121 -129 22 -102 139 -8
5548hJ80K17n53J28K46k85q5N7M18j54r6Ll33J91L18j15k17J10l1j16K19k24j96
5571c26N80l03r6J79K40m16J92j5o3K13k51O2K39j95L7n2J62l67L47j71J73J5
5593A84n33K45O2R5J89l02J18K48m02L0K0J32j48j63K41j5j47K55k19M6K80k28
5615a2K16j09k76J4N7p7J21J66k77L29k01r5K05k60N5K01j11j77K8K29j32K23
5637A17J60l26p3K12P8m13L19J47k91J30p2j43K3L39l14K75k80O7OJ13l3j93J73
5660B1Q2j06m0M5k10J73M0L4l12M39j41M1pr3K01j11l3N1l1k70J91J06l0l55K77
5685c8l3J16j77pN4N2K54R5j82k00n7J0J62p0K33j91l4K10k07J24l12N55k61j47
5709e1j44N03l06K1K78k49k45j5K08mJ14J13k41O2k91L96k50J14j40J97j80J53
$$ plain form
5548 -8 172 389 -164 -36 210 -75 -160 -103 315 161 65 68 -265 -74 244 129 -88 22 -9 -125 94 -130 -326
5571 -326 254 -49 -145 34 274 -142 50 35 -28 185 -66 -4 235 40 77 25 187 -180 167 -4 169 184
5593 184 -349 -104 -42 53 242 -60 58 306 -96 -66 -46 86 -62 -225 16 1 -146 109 -110 -64 216 -12
5615 -12 204 95 -181 -167 -110 -187 -66 100 -177 152 -49 -144 61 -199 -144 57 -54 -231 -203 26 -106 117
5637 117 277 -49 -122 90 168 -245 74 221 -70 60 -12 -155 -132 207 -107 168 -112 -45 -39 74 41 -152 21
5660 21 103 -3 -43 2 -208 -35 5 39 -273 166 25 66 59 -34 167 56 23 74 43 -227 -36 70 40 -315 -38
5685 -38 -71 45 -132 -139 -85 -33 221 316 134 -66 -123 -113 49 -21 212 21 -13 197 -10 114 -198 357 96 -51
5709 -51 -195 308 2 23 301 52 -193 -208 0 -4 110 223 -18 44 -247 149 -101 13 -127 70 -110 43
5731D3Q6j02L5M9KJ49k70Q4J7M4j15l22L93k33J5L59o2j86L3J89l7j7R4k36J21
5756A33m7k64K7J28J08K12o76M70k6r1J39q3m4J30k06J63R9j10M2l46K70j41J9
5779i4K70j68j64K16j50p4K44l48J48m0K60k62J09j1O1J52n04N23j39n0J79k8
5801A30j27o2j56M6M25l31N6l5Q1K56k21lk44kK80l05M58l50J18j8K44j19j87
5824f6J00K1j07N2K05j95J11l24R0L21j80R2p3k55J41K35k03j44J11K72l96P6
5846a16nkK8O6J92k57L16j23J22n1o4j53j9K70j81q1J26l12L01j70O1J28J68k78
5870c4p7N2K4Kj75K31j38Q1k37K87J63m8N8j15r1N4J15M2r7k6L2P8J43m93J76
5895GK48k33k89L25Rj71K37k0j18L16j96j97K71m11J25J00j28K15J43j38J21n40
$$ plain form
5731 43 129 27 62 111 113 262 -8 76 93 137 22 -300 93 -140 -125 234 172 -14 19 208 171 154 248 12 133
5756 133 86 -178 -151 -23 85 297 -379 91 65 -26 113 30 -14 116 -90 73 172 62 104 -242 28 -113 -94
5779 -94 176 8 -156 60 -90 -164 80 -268 -120 -160 100 -162 -53 -64 -3 149 -355 168 29 -21 158 130
5801 130 3 -59 -215 -169 256 -75 -19 -54 27 283 62 59 -185 -187 93 -212 246 -104 14 -4 240 121 -66
5824 -66 34 55 -52 0 205 10 121 -203 -113 208 28 120 47 -208 -67 168 -35 -179 -68 204 -192 -116
5846 -116 -121 -123 -95 -29 163 -94 222 99 221 170 106 -47 -66 204 23 -58 68 -244 57 -113 -52 76 244 -34
5870 -34 -111 -59 -35 -33 -208 23 -115 -34 -271 16 179 131 189 74 -17 37 152 194 97 71 103 181 324 -169 7
5895 7 255 22 -267 58 67 -104 133 113 -5 311 115 -82 189 -222 -97 3 -125 90 233 95 216 -324
5917c24M21j09K55K6l32k15L14L4j00r8K34l5Q2k09Q4o5J02k9k36M45l07j07N4
5940a15R0k03K08J5j29P3J38q1l6L1J55k00RO2N6l45L19R9j85K26k59k52L90j33
5964f7M4M1k22L97K07m23L2J75j61J12l65K25n1J0l4K59k78k7J80l07K61j71L37
5987A74j47J0j82j56K76m1j40j15M41k18K30J14o6k49L54j77j73L1j34K69o4K06
6009B43q3K86l78k75J71O2J77j51r6m1j67L00k53J94o2j53J58n4N0P6N2M7j56
6032e3p6M3M7Q7NN4j98J72n2ol9R7j86o1J75j84J38m2pK4J84J37j81j04Kp8P8
6059b4J6MK56j97On4M21n21o3J62K07m54J93K6R2j11L50m31O5L52o03N02l78K06
6083B2J25rr4K0M2L2j72J1M06l50P3k4k80J70k01L74m91L18J00l49K69L4M2J00
$$ plain form
5917 -324 97 -12 243 269 -63 -278 36 70 -30 -128 106 71 153 -56 28 -37 65 36 -200 245 -62 -169 -115
5940 -115 -25 -228 -20 -5 -134 -61 77 -4 -40 -9 146 -54 -45 17 73 -272 47 146 -39 187 -72 -324 66 -67
5964 -67 -23 18 -204 193 400 -23 9 184 23 135 -230 -5 -56 -46 -80 179 -99 -126 54 -253 8 -163 174
5987 174 27 37 -145 -301 -25 -66 -206 -321 120 -98 132 246 180 -69 285 108 -65 -34 -168 101 37 243
6009 243 160 446 68 -207 -36 26 203 52 -44 -85 -252 48 -205 -11 -73 -226 -68 -122 -72 4 56 103 -53
6032 -53 -129 -86 -39 48 53 107 -91 81 29 23 -16 81 -105 -166 9 -175 -37 -79 -86 -62 122 259 78 -26 -24 -102 -24
6059 -24 -8 -4 252 55 61 7 428 -93 -156 6 213 -241 -48 -22 70 -41 309 -122 -57 295 -308 194 -184 22
6083 22 147 138 44 64 106 138 -34 -23 383 33 106 82 -198 -28 -229 145 -346 -28 72 -277 -8 26 68 168
6107A68P7m35R3Q6n9L12o7k1m58L43q8K97k59k40nM80j61J26lj36j13p7n9J71
6131b8K92l35L89k99J61k48J51o3J35j61k41K06M9rj84nK08K2K9j61J11j48m9
6154a78L03O9P0k73rj79L16j38r5O8Q1l82L11kj84M09J55m55K45j54J78k6L8k66
6178i8o5J03J02j83K37j87kK37j86Q1J5m35M55j9k00K81o8J3k45J32K1k4K13n0
6202A28Q6j04p0Q5l58L8K32m3j56n9L12J57j85pJ01k85Q7k07L45k10L37k54K83
6225B53k62N1J07j05p2N4K33j52J69j59l2Q5l44L17J84l76J52m17J89L02l15K32
6247I4k8j18m1M5K54m0j3k80L06l79M71k75j15P2j72K31R9k83KL46k70RK2j46
6271b09K13k41K13L12m27j27N38l38J48q2Pq4K18j24J68J3l50P6J14K27l40K26
$$ plain form
6107 168 245 -190 -97 -11 -70 242 175 154 -304 39 -49 248 -11 -251 -256 224 63 189 186 50 -63 -140 -199 -28
6131 -28 264 -71 318 19 180 -68 83 20 155 -6 -247 -41 8 -1 -185 -190 18 40 69 -92 19 -129 -178
6154 -178 125 194 264 -9 -18 -197 119 -19 -114 -46 35 -347 -36 -38 -222 187 342 -113 132 -22 156 130 168 -98
6178 -98 -163 -60 42 -141 96 -91 -93 144 -42 39 54 -381 74 55 -145 136 68 81 -164 -32 -11 -35 178 128
6202 128 214 110 40 125 -233 -195 37 -6 -162 -221 91 248 63 56 157 -128 -41 -248 97 -113 224 -30 253
6225 253 -9 42 149 44 -28 26 259 107 276 117 85 170 -174 143 327 -49 103 -314 -125 177 -138 94
6247 94 66 -52 -93 -48 206 166 153 -127 179 -200 271 -4 -119 -47 -219 12 111 -172 -170 176 -94 -85 -63 -209
6271 -209 4 -237 -24 288 -139 -266 272 -66 82 0 7 -77 141 17 185 198 -152 -76 38 265 -75 151
6293A51N6k10j76K80k4j76J36J04l19P3Nj19L21O7j36j10J08nj92O20q63L67K44
6316B02o2K1j09O0P7k13K33j99k3N0r6j83K80K5p0J82m9k26K33k54K14P6j4o4
6340I1P1p1k96K60o1j06kL44l94K59mr2M4j29R7J19k57J05m3l27L23J84j79Q6
6364B2O1l56K17J74j00K55k83J74j10j9j58J13K1L2r7oJ59j28J59M3k53P2J1k2
6388a9Q4J12k36J00J07k03K10n47M57oq6N9K6l9J80M1k89K14j45o1M4l07N23q2
6412A37j49L2k5L45l37lj14O1P9O8j14J25j00Q3k01J43p2J07k20N84k39k72J42
6435F0j69J81l5k8J6o20Q40k86K63M5l79Q3k29J56J18j59K44o5n9J11l19K2J92
6458a7L5l61K50L04j20j72K27k31J51o2K3j85K37o1k3Q3l9j53J54N9j55O8l00
$$ plain form
6293 151 207 -3 -179 101 77 -99 37 141 -178 -105 -100 -219 102 169 33 -77 31 26 -166 454 -409 -42 202
6316 202 140 161 52 112 189 -24 209 10 -13 37 -59 -242 38 63 -7 175 126 -100 133 -121 93 169 155 91
6340 91 162 91 -205 55 -6 -112 -114 230 -164 95 91 -1 43 -86 11 130 -127 -22 -65 -392 -69 115 -64 22
6364 22 83 -273 -56 118 18 273 -10 164 54 35 -123 -10 11 43 -54 -60 99 -29 130 173 -80 -8 3 -19
6388 -19 65 177 -59 41 148 -55 155 -392 65 59 -27 32 58 19 199 240 -49 165 20 -41 3 -304 219 137
6412 137 -12 20 -5 340 3 0 -114 -53 26 94 -20 105 5 88 -113 30 -42 65 -155 429 190 -82 60
6435 60 -109 72 37 9 25 -595 245 -41 222 267 -112 -29 -258 -102 16 -143 101 36 -23 88 -231 -209 -17
6458 -17 18 -343 -93 211 91 -81 146 -85 66 4 27 -158 79 18 -5 78 39 -114 40 99 -56 12 -288
6481b88M03j02k70J0O67n35K17o2o1Q1j55J0p5R2j69K67p3L7J22M0l81L3J41j99
6505b50M47k19L7r6j20L3L27J98n62L38k58N8q9L79j83m0J98k72m80N63n8k2J59
6528H8J81k03O7j08Q7m5j49J66k15K4J27j41J28J59l2k26K81j5m38M01j12l4P2
6551F3k11J50j18K57J6l01J37PJ81Mm37J77j16K66k01J97j64K82m13L17o5n7m9
6574g8R1m24L87J40j92L36k94K4k56K67m3L33l35Q9j16k89K64l0K0Q8J3n4J64
6597A05j44L23l74j17R7L37k96Q5j04J37M9K7k71K67l33J71q1J73J3j63J48k75
6619b26j2K83j50K07j47J66j46R0j36Q3j20O1L02l63l9K20Q8r6j34K15q5J90k17
6642C4q1K23o6j54L01l01L27k11P9j11j93L43j18j3k00M9o5R8K14q0j38J23r9
$$ plain form
6481 -288 115 13 -257 -247 420 -115 102 40 -21 60 -95 -85 -160 -68 -237 30 -43 -6 116 156 -225 -192 -51 -250
6505 -250 197 -22 15 -81 -201 -168 159 357 -205 133 -125 -67 -156 223 40 0 198 -74 -554 9 -49 -71 88
6528 88 269 66 133 25 112 67 -82 84 -131 -107 20 -121 7 166 134 -92 189 174 -264 137 25 -9 63
6551 63 -148 2 -116 141 157 -144 -7 0 181 185 -252 -75 -191 75 -126 71 -93 189 -224 93 28 -29 -78
6574 -78 13 -411 -24 116 -76 260 -34 -10 -266 1 -42 291 -44 45 -71 -360 -96 -126 -106 -18 -5 -59 105
6597 105 -39 284 -90 -207 -110 227 -69 16 -88 49 98 125 -146 121 -212 -41 -122 51 64 -99 49 -226
6619 -226 -238 45 -105 102 -45 121 -25 65 -71 12 -108 -47 255 -108 -147 73 161 65 -69 146 61 251 34
6642 34 -47 176 110 -44 257 -44 283 72 151 40 -153 190 72 59 -141 -92 -157 -59 155 75 -63 60 -39
6665c9j58K45O0j76m8O1j37J53J34l13K85p1O7j77o4K15k48L10L0k12J8K68j38
6688F5N8m7j76M5J30J88m16K07j39M5l7J34J22k83K30L0k46OK63j1l0j55K75k53
6712EL42m55L33L6j1k08j08J77k67K21q5N9L4j15p2J77j01K53k33k80K54J00L8
6735I4L9Kj44mK09l45J85j89L1K52j17k10LK30l50L90m9q3Lj34K07M5k38K91K3
6760A41k78n0J7J23KK04n9j50J09k27J05L3j5J2r8O7k39K73M6N9n6p5M1q6J85
6785H4n9n2l16NL72K3Nn6j35M3J24J19k01J84j36l7M15n94L38l2k55L83j46k3
6809E3k20m3P1R0r8K20K68n83K18k8J7o9LM2J22k28J20M2nk32O06l23k12J18J11
6834F0L2O7Q6o8k19O3K0j93K04q7q1M5L23m52J10J79l92K91k40J85K07k83l0M36
$$ plain form
6665 -39 -197 48 108 -68 -116 -55 -192 -39 95 -218 67 -4 63 -114 -178 37 -211 99 129 -83 -65 203 65
6688 65 123 76 -100 -55 75 263 -153 54 -85 -40 -77 57 179 -104 126 156 -90 -84 179 168 138 -17 258 5
6712 5 347 -108 225 261 250 42 -66 111 -156 65 -20 39 73 -42 -114 63 -38 215 -18 -298 -44 56 94
6735 94 133 135 -9 -13 196 -149 36 -153 -122 130 13 -197 -194 36 -314 76 27 -56 -53 -187 20 65 -173 118 141
6760 141 -137 -187 -170 -47 -45 159 100 -50 59 -168 -63 -30 -45 -33 -131 -64 -303 -30 16 75 19 -56 -15 -101 84
6785 84 25 -27 -343 -338 34 57 62 6 -129 -86 38 157 -44 140 4 -33 382 -212 126 94 -161 222 76 53
6809 53 -167 -210 -139 -49 -147 73 341 -242 -24 -52 -35 -104 -101 -59 63 -165 -45 -3 -8 -240 366 43 -169 -51 60
6834 60 92 159 245 177 -42 21 41 -152 52 -35 -116 -71 252 -200 -90 89 -303 -12 -252 -67 140 -143 -173 263
6858B63k82K77k61k33L56j88J99K05l85J38p6L17l93K9K31k81J88R0k63n6Q0R2
6880D7r9j28L57k08J0J20K2k75J69oj01P1Q9J41j97L38l23m9j28K00k38J93K62
6903B67m78P8J62L60k81L6k85M67k53o9j1J07KM1m78O08k01J28k38L8k64J33L15
6926A84j89k4q8Q6J11K1j52J37K2j46K0J04j63L4j58K06q1K68k51R1o6n9J29j02
6950f6j17o3M91j40j74n2J44j52oJ01j15O6N0J52k0Q7k68j08L70j42K1j18J14
6973E5k9k41L65o3j72M05k43O3q8k06K28j71O6J47k76K18L9m88L68N2j87J63L0
6996C5l01J88j53m3J96J02j80K93k59Q8R6j44K18j88M4J5M3o3j25L8M4k0J60j73
7020h9J23K66j67k68n0J12J95l13M38k30O7m9M0j9l5o5M94k89M2j58j59J77k36
$$ plain form
6858 263 -19 258 -3 -236 120 -68 131 336 -49 89 13 330 -63 -34 197 -84 104 194 -69 -125 -45 47
6880 47 -52 -180 177 -31 -21 99 121 -154 15 9 -92 -21 68 209 12 350 27 -22 -150 50 -188 5 267
6903 267 -211 -133 29 389 108 144 -141 326 73 4 -7 100 102 143 -335 273 72 200 -38 0 -264 -131 184
6926 184 -5 -29 -117 -31 80 101 -51 86 108 -38 -18 86 -77 -43 -201 5 -76 192 -59 32 -34 -93 36 -66
6950 -66 -183 -246 245 105 -69 -121 23 -129 -135 -34 -149 -83 -33 119 99 186 -82 -190 180 38 59 -59 55
6973 55 26 -215 150 87 -85 320 77 140 52 -154 74 -97 -31 116 -160 58 97 -391 -23 29 -158 5 35
6996 35 -266 -78 -231 -274 -78 24 -156 137 -122 -34 62 -82 136 -52 -8 7 50 -13 -138 -100 -56 -76 84 -89
7020 -89 34 300 133 -135 -185 -73 122 -191 247 17 84 35 75 56 21 -44 450 161 203 45 -114 63 -173
7043a73J89N2K33j45l48P5R5J12j9J8j83J01j3k20K22J1J96Pl13K0J59J8k34K6
7067a14k3K55j19m9N4k47K11K14k40J3N0J41j43K17k71m5K7J92m4K67q3l70O0
7090d7K28Nk81J59K22k80J76p3l49N61l07l32L97J6k1k32J25j20J59j97K10J43
7112A62q6m03N88k73l18J86L03k15kk08L98K05l18J18k09L6K4m8L01n0j03L8k0
7135A06l96K25r7k65L37P4N1L1j65J8J50O5o6j29N3J72j40K1rj20L31k47Q9O6
7159A55r8j12J13j44J64j80k8L2J71m9J5J5l1j20R9K7k22L62j49k48L11R7j06
7182G4J5j96K59j8m4m7Q9l33J11J94j61K86l92L1L55k20l77M51l07L18p1Q2Q0
7205A79J11l27M5J82l80K23j75L8J44l18K20Q8j98K5K87l1l08K23K23k32j12o9
$$ plain form
7043 -173 16 68 301 156 -192 -117 -22 90 71 89 -94 7 -6 -226 -4 7 203 210 -103 -83 76 94 -140 -114
7067 -114 -137 118 -1 -50 4 -243 -32 182 -58 -45 5 146 3 220 -51 -96 -69 123 79 346 263 -107 -47
7090 -47 181 186 -95 64 286 6 182 109 -240 321 14 -318 79 95 74 -158 -33 -153 6 -191 19 162
7112 162 76 -327 261 -12 -330 -144 159 -56 -58 -266 132 337 19 137 -72 -36 -12 -60 241 191 88 126 106
7135 106 -290 -65 -162 -427 -90 -16 35 66 -99 -81 69 134 68 -61 -8 164 24 45 36 -84 247 0 89 155
7159 155 57 -55 58 -86 78 -102 -130 -98 73 24 39 54 23 -97 2 29 -193 169 20 -228 83 180 74
7182 74 89 -107 152 134 90 43 132 -201 -90 104 -57 229 -163 -132 223 3 -374 77 -230 88 17 99 179
7205 179 290 -37 8 190 -190 33 -142 -104 40 -278 -58 30 -168 -143 144 113 -195 28 251 19 -93 -162
7227a62K24K53K6j71P2l16j38J15Q4j04M22j52j48j05L3j42J38L15o16N98k85
7248e9J22r5q2J32k25Q6J29n2k72M09J40j64q5R3L4q5k18K64J14l67K09J90n42
7271c24L45M5l2j21j6K5O2k66O01l19K05k50M7O7j9j18Km2k1N1q8K3J73k34j5
7296b19J78j28J14J32j3j38M6J67j91K74j33k16Lm2Q1Q4J17p7R6j5q1l09K12j53
7320b11M17l21L25J28k87J40j89k97L01k9K7O9Q2q9J29k27j40L54%m0j02j45O7
7343c8K43l03NK08j38O1k09J94J05J04J6k52qKj55J85Q3j93J52L05n03K01J12
7366A77r6j21j25q8K59Jm8O3J66r9j47j8J56j42j07J32q4M22k70K15l41K31l05
7389a69J98J01K1p4k86M6J2K18j83L29k18J23R4J07l87j23M18k41q0P7p9L13k28
$$ plain form
7227 -162 62 315 341 170 242 -74 -212 -97 -13 -117 305 153 5 -100 -67 -209 -71 244 -372 226 -59
7248 -59 63 -32 -114 18 -207 -121 8 -44 -316 93 233 69 -16 77 111 26 -192 72 186 -181 28 218 -324
7271 -324 21 66 34 -87 -103 -78 -16 -282 319 0 205 -45 2 69 50 -68 -66 -108 -129 -78 -166 -143 30 -204 -219
7296 -219 -41 -169 -55 77 64 -74 -28 139 -52 222 89 -127 -124 -166 -85 -1 116 39 135 120 39 -270 -58 -211
7320 -211 206 -115 210 338 51 191 2 -295 6 -23 4 73 155 66 195 -32 -172 182 182 142 40 -105 -38
7343 -38 205 -98 -93 115 -23 38 -171 23 128 232 248 -4 -12 -10 -165 20 103 -90 62 367 -136 65 177
7366 177 81 -40 -165 -253 6 7 -41 22 188 89 -58 -76 80 -62 -169 -37 -121 301 31 246 -95 136 -169
7389 -169 29 130 151 77 -209 -163 -151 67 -116 213 -5 118 212 319 -68 -191 227 -14 -94 -17 -96 217 -11
7412a1k6N0q3R6R9J14k44K5R6j88N2K16j02N6k92K60j29K95k46K65j58j28j68
7435a51K16p6j84R0M28k91j61K18j96J92j52L89l76j47l7K90j39k20M38nk58L7
7457i5K90r1j31j17Q7M9O3lj99K04p5K7J4N9l0j16o4P2J20l2j57K1J14J3J03j38
7483a2%l6J66l23M46k03j01j44K95K17k38m6j20j99K37O4o1J27p9J7j43KJ48j64
7507a50L9j78J24K52M9j61K06L9k19k93M57Lk47J18Rj61K85l61J48K21k89K01
7529I2o6j81J13L2k60P2J75R9J2j68j10l1K27J78j51j27K53j05j39J26J82j92
7551C1l08M46J0j91l8j79K38q2r1J01J18R3j75m5P1K6j76L23j37M5k90L69j09
7574E0k44K83K2l7j23J05j37p0Q0R3n2j52K43j10j11P5J14q8K35k3j09j4k35L7
$$ plain form
7412 -11 -37 13 -70 26 125 239 -5 20 116 -72 -20 196 94 150 -142 118 -11 284 38 303 145 17 -151
7435 -151 65 -11 -195 -105 323 32 -129 89 -107 85 -67 322 -54 -201 -238 52 -87 -307 131 126 -132 -95
7457 -95 195 104 -27 -144 -57 -8 55 52 -147 57 -18 9 23 82 52 -64 -128 -56 64 32 -125 -104 10 23 126 -12
7483 -12 -12 -48 118 -205 241 38 -63 -207 88 305 67 21 -99 -298 -61 3 -58 69 -10 7 -136 -134 14 -150
7507 -150 -111 -289 -165 87 136 -25 181 220 1 -292 165 168 -79 39 48 -113 172 -189 -41 180 -109 92
7529 92 26 -155 -42 -10 -270 -198 -23 76 88 -80 -190 -221 6 184 33 -94 159 54 -85 41 223 31
7551 31 -277 169 179 -12 -50 -229 9 -73 -164 -63 55 148 -27 -72 -1 25 -151 172 35 80 -210 159 50
7574 50 -194 89 111 74 -49 56 -81 -151 -71 22 -30 -182 61 -49 -160 -85 29 -59 176 153 44 30 -205 -168
7598a68J80J85m20M34k31L03m23L7J48J26j31j22P4J9r2o2J83L8m5M9j59J06j20
7621i1K42k80PJ48k42J31j23K97K47l09k2L8K4k42R8L7K22k56R6M5k25P6j4k1
7645a17K2j82L27j63J61P2J47k14j9k2l1l9M1pp0K49q0M6J26j00k10j04L99r4
7669A38k58P1R7J26j77R9k84L63l35K58j54j21J95K5N0k30K35j37l6J63n3L04
7691C39l81k46K78M7O2k49K88j13J00j77J47q7m5J96J7l99K43k7P6O3j57j73Q2
7714a16q2K56n7m1J09q7Q9j42K26j84N3j27n4j52J92N8J54Kl0j79J82j39J35L6
7738A02j48L19j59l51M47j91rJ0J04p7q1l5l64M82p6lO5J91o0k89m2m6M2o3L40
7763A08l83J81J53j85L57k09k17L5K76k94O5L96l04K06j48j17J56k31J93p5k10
$$ plain form
7598 -168 12 197 -223 211 -20 283 -140 -103 45 171 40 -82 -8 11 -81 -143 40 78 33 82 -77 29 -91
7621 -91 151 -129 -122 26 -216 -85 -208 89 336 27 5 43 67 -175 -77 -40 182 -74 22 67 -158 -82 -96 -117
7645 -117 -95 -277 50 -113 48 120 267 53 34 12 -19 -58 -17 -24 -94 155 75 121 247 147 -63 -167 232 138
7669 138 -120 -49 48 174 -3 96 -188 175 -160 98 -56 -177 18 43 93 -137 98 -39 -75 88 35 339
7691 339 -42 -288 -10 37 99 -150 138 25 125 -52 95 8 -37 159 176 -223 20 -7 69 132 -25 -198 -116
7714 -116 -198 58 1 -40 69 -18 71 -71 155 -29 24 -103 -157 -309 -117 -59 95 97 67 -112 70 -69 66 102
7738 102 -46 273 114 -237 210 19 10 20 124 47 -34 -69 -433 49 -27 -30 35 226 166 -123 -165 -211 -169 -232 108
7763 108 -275 -94 59 -126 231 22 -195 -160 116 -178 -113 283 -21 185 37 -80 76 -155 38 -37 -247
7784b47L92p8k00LM3K40k94K51n8j43K33j73J34m1M5k28J03k8J44m5k19n6M97
7807B75m48k0L18q0J2j1k74K44j75K18p0j43J7K20r7k58K55J35m2l98L88j93J07
7830b0n4N4K33j06k33l4K34J03%j80M4r5j7P8j51K23k93L85k23M2J76j04r4K2
7854a0l3J07Q4Q2j67J44m08NK79j39K00q0L7j38r8j80J2J38L68j91M7r2M8j04
7878h9K9J54j76m0J29j59l4m5M20k69J5j00p7L10J19m5j1q8j47j5K84j72K66l61
7902a02J47j01J52j06N9Kjk22J31R8j44N8k87Q4K45r0J08%p4R0j71K50nj94M1
7927c2m9J48l9J19o4l06j04K69k03J03P2J17M18m41o1L15l77j24L22K09k51k3
7949A8j98J87N3l69M11n5l14M28L7p2j09J08m4p8m6j5J35j26N7Qr6L06k11J38
$$ plain form
7784 -247 145 67 -133 -130 -87 153 -141 110 52 -91 142 -31 103 62 107 -121 -18 -46 98 53 -166 -222 275
7807 275 -173 -193 125 45 57 46 -228 16 -159 59 -11 -154 -137 83 -14 -272 -17 118 76 -322 66 -127 -20
7830 -20 -74 -20 213 107 -126 -160 74 177 177 -3 41 -54 -71 7 -144 79 -214 171 -52 -10 166 62 -32 -10
7854 -10 -43 64 148 230 63 207 -201 -196 83 -56 144 64 101 -37 -135 -315 -303 -165 203 12 59 -33 15 -89
7878 -89 -60 94 -82 -122 7 -152 -186 -231 189 -80 -65 -165 -242 68 187 142 131 43 -104 -119 165 -7 259 -102
7902 -102 45 -56 96 -10 49 51 50 -172 -41 57 -87 -29 -316 -232 13 -77 31 31 -43 47 -124 126 121 -73 -32
7927 -32 -81 67 28 147 83 -223 -327 -58 -261 -158 -86 31 449 8 -53 262 -115 -239 83 292 41 18
7949 18 -180 7 60 -309 102 47 -267 161 198 126 17 125 81 3 -43 -58 77 -49 8 16 -80 226 15 153
7973A53l25K13P8K9M0k52L99m65M6j0J52K86l56J98Rl33Q7j38K11Q4j34J55j66
7996c9L3j38qj86L16J06k73K53J83m06p3O8N1r4K07M6Q5k91O2m8L31j03j34K52
8020B00p1j66l5J8qJ75l4k82j0K46k7L3j1r0J94p8J07j97J30j81J6K46q1p2k60
8045b38L19k51p4M61j09j99J00q8LK53l77K05jK10j59J37k07l4p2J47J7q0o9M12
8069C06n21K47j00J8J4o3KJ77N2l17K03j50J03N2L1p4K04j50r7J00j75J00j02
8092a40K59l15K69k31J92K17m05n1N2J20p3N1J09k8j35J90j28J48j02K90k13j07
8114c1L51m97J08K61k64K08k53m9J87j27K16j48J58m7L3j51j02L42q3k52K6J05
8136iN3l81Q7K94p6K98j35j76K75k95J32j0j9J00j2r7k34K74K31m87K53q5R9R3
$$ plain form
7973 153 -172 41 119 148 188 -64 335 -130 -84 -94 58 344 -12 186 195 -138 -51 -189 22 106 -28 127 -39
7996 -39 -6 -144 -152 -338 -22 84 -189 64 247 -159 -232 -164 -113 -207 0 46 131 -160 -98 -146 185 82 -52 200
8020 200 129 -37 -72 -54 -62 113 79 -203 -213 33 6 39 28 -62 132 54 161 -36 94 -87 -71 175 94 22 -238
8045 -238 81 -170 -244 217 108 -91 9 -79 -76 177 -200 5 4 214 55 192 -15 -49 -121 26 43 -37 -106 306
8069 306 -215 32 -68 -50 -36 -99 -97 80 132 -185 18 -132 -29 23 54 -20 184 34 -63 37 -138 -38 -140
8092 -140 119 -196 73 -158 34 251 -154 -205 -153 -33 -106 -55 54 26 -109 81 -47 101 -1 289 76 -31
8114 -31 320 -177 -69 192 -72 136 -117 -166 21 -106 110 -38 120 73 106 -45 -147 195 112 -140 -114 -9
8136 -9 44 -337 -250 44 -32 266 131 -45 230 -65 67 57 38 138 126 29 -205 69 300 -187 66 -19 80 173
8160A73j75j82J35j70L52j60j83J29j06J15J15N0lj0n1k64K3J92K6j11J1Q7o4
8183g1K60m18L34N8j2j64j88j04
$$ plain form
8160 173 -2 -184 -49 -219 133 -27 -210 -81 -187 -72 43 93 90 80 29 -235 -212 -20 6 -105 -94 -7 -71
8183 -71 189 -229 105 163 151 -13 -201 -305
8191c05
$$ Imaginary data points
##PAGE= N=2
##DATA TABLE= (X++(I..I)), XYDATA
0@%%%%%%Qj6J6j6K4l2M0n6P2q8J12j44J68k00K48k96L46m10M88n68O59p67Q87
29D75j018J167j332J513j716J942k190K462k763L090l448L842m273M743n258N819
45C055o431P100p832Q634r513J0481j1545J2721j4030J5495j7141J9004k1135
58a1137K3600k6490K9931l4114L9326m6026N5003o7731Q7305j21552J98348o60236
70e33773m3187J231970q42983o75754N50577Q56115k11447l81505m5192K4048
80g1131L2472N11903J99448n44817l56751O37357N12094n74158q06682J66542
90b93723M87343q4950l69481j06480N7912J71071K12856o2620m22262q1187N47836
101E6315L06155m05329k18260M15107L07791k10944j81798R2939n5549j73699
$$ plain form
0 0 0 0 0 0 0 0 8 -8 8 -8 16 -16 24 -32 40 -48 64 -80 88 -112 136 -160 186 -224 264 -304 355 -412 475
29 475 -543 624 -708 805 -911 1031 -1159 1303 -1460 1630 -1818 2024 -2249 2494 -2764 3055
45 3055 -3376 3724 -4108 4526 -4987 5494 -6051 6670 -7360 8135 -9006 9998 -11137
58 -11137 12463 -14027 15904 -18210 21116 -24910 30093 -37638 49667 -71885 126463 -533773
70 -533773 -576960 655010 -187973 -863727 -313150 542965 331518 -49987 -95179 -71131
80 -71131 -38659 473244 672692 127875 -228876 408481 920575 346417 -460265 -293723
90 -293723 193620 108670 -260811 -367291 -309379 -138308 74548 11928 -410334 -491521 56315
101 56315 362470 -42859 -261119 153988 461779 250835 69037 161976 106427 -67272
111f7272J49511J22181l23592j79935L44564J61925l98025k49403K86592J29820
121b3634k99761J4934M14086K7260k91740J56902M38008j05502m75185N9705M29110
132C44183p1319l65884O7067K79419m4468j77243L5417O80k51051r2185K12779
143f2605J2343k42355J3345K95140J19620j52443q2402Q5920L3589m683L3289
154D8758p9939r0310J66555K24512q4358k47514J6000K10006n3610k60239m1304
165a91443J39518M0374k6523L4885K4462n8809R473J26071k4530j74421J9675
176h1268J80448K4813j06259K004R3300k2055q7285K6339K225j28396k1666J38027
188B0227L5457j27600m9637J23783M9821j25502m7176Q4647K2232k5946L9861
$$ plain form
111 -67272 82239 204420 -119172 -299107 45457 207382 -190643 -440046 -153454 -23634
121 -23634 -323395 -308461 105625 132885 -158855 -1953 436055 330553 -144632 -84927 344183
132 344183 272864 -93020 -25953 253466 208998 31755 67172 67852 -183199 -275384 -62605
143 -62605 -50262 -292617 -279272 15868 135488 -16955 -99357 -13437 20152 15469 48758
154 48758 -31181 -121491 45064 269576 185218 -62296 -46296 163710 110100 -150139 -191443
165 -191443 -51925 -11551 -38074 -3189 21273 -37536 -28063 98008 73478 -100943 -81268
176 -81268 99180 123993 17734 19738 113038 90983 3698 30037 32262 -96134 -117800 20227
188 20227 55684 -71916 -121553 2230 52051 -73451 -120627 -35980 -13748 -39694 167
199A67N6613j9778m3475M5033M6944q1619p7061M1762N5065J745j0882P898P383
212B9795q968J7959l974r2859l4524J02446O0374o1447m3716O8177P2400m8629
224E7034p5152j601o867k2164J8869J6242j4934l282M7574M4265n4547p7149J8017
237e3695L8824p793r113J0130K6081K6214K0402N720m8143m3043M2561K8377n4189
250a7667m0736M3180O9385o559n4416M796K1177k5746j2474Q059m266O464K8290
263A9487L1067j2711m0432J1509K4150k8399k8886K211J1033J0174J015L109n730
276b403k5072M853J2801l2759k0587L0273L9099N335k2380J1045L3572j3532k3981
289c736R340N324r91N617J0532Q374j1396j067J2325k5382l0904M422K704n419
$$ plain form
199 167 56780 37002 -6473 38560 85504 3885 -73176 -31414 23651 25396 14514 22412 29795
212 29795 20827 38786 34812 -58047 -92571 9875 70249 8802 -34914 33263 105663 57034
224 57034 -18118 -19719 -26586 -48750 -29881 -13639 -28573 -31855 15719 59984 5437 -71712 -53695
237 -53695 -14871 -22664 -31777 -21647 4434 30648 51050 56770 8627 -34416 8145 36522 -17667
250 -17667 -58403 -15223 54162 47603 -6813 -2017 19160 -6586 -19060 -11001 -15267 -8803 19487
263 19487 50554 37843 -2589 8920 33070 4671 -24215 -22004 -10971 -797 218 3327 -2403
276 -2403 -27475 -22622 -9821 -42580 -63167 -32894 6205 11540 -10840 205 33777 20245 -3736
289 -3736 5604 10928 9937 15554 26086 34460 23064 21997 34322 8940 -21964 -17542 -14838 -20257
303b0257K421J0491J2708p645p403J3170j0204j7393J2689J4362K126m121L420
316D364K3012Q02k1783k88q09j4812o449q70M605K461k737J2009l23j9523L899
331a6442Q178m886K645P172J1214P694j854J1542O012j4136N65L643j0236o075
345E036k307M716L253j2649l659L252j2498o240j03n80O358k28J561J1397o18
360c309K570P705n565M29N571r69r72m016M707J2092r533j1395K778k468j593
375c968j192o318N098M513K037N527o441k457J1479K219l145m242m248J0171M621
390A3654p819k084l703m42M280r565q700J154K345R035r61j1585M269Q174L564
405A616K447p208j115R618L679qo645o471J1255M893j0081n971n346L402Q734
$$ plain form
303 -20257 -17836 -7345 5363 -2282 -9685 3485 -6719 -24112 -11423 2939 5065 944 4364
316 4364 27376 28178 6395 6107 5298 -9514 -15963 -16833 -12228 -9767 -12504 -495 -818 -20341 -16442
331 -16442 -8264 -13150 -10505 -3333 7881 15575 13721 25263 31275 17139 17704 21347 11111 5036
345 5036 2729 7445 10698 -1951 -5610 -2358 -14856 -21096 -21199 -21779 -15421 -15649 -14088 -2691 -3309
360 -3309 -739 6966 1401 1830 7401 6432 5460 1444 6151 18243 8710 -2685 93 -2375 -3968
375 -3968 -5160 -11478 -6380 -1867 170 5697 -744 -3201 8278 10497 7352 3110 -1138 9033 13654
390 13654 5835 3751 48 -394 3886 -5679 -14379 -13225 -10880 -1845 -2806 -14391 -10122 -1948 1616
405 1616 4063 -3145 -4260 5358 9037 9029 2384 -4087 7168 12061 1980 -3991 -9337 -5935 2799
420B799l376n471k584O87J4902M151j3178k270J0015J3627J01k0196m743J6129
434A0593N360o991j3588o731J0329K425q981o098q732N674J4150l451r235k073
448a7349J1680K1317j573j6868R66J2886J0372m385j6593L146J3652k651p572
461G028j0281o532M819R85m365m596q347P597J5123j119o425n54Q020J2245m886
476H712p820P148N436L016N96p431m239n504m073N556o348j6905M51J0723O736
491c946o783j2574Q900J6402j569n174o59P901J4901L391k249j123o409L337P129
506B1475j1037j5111n269Q798R742j5431j8239P228J2841p34j2148r461J2888
519a4458J5532J587J186J115N101J1730n24q604o254j969R018K137j3794p778
$$ plain form
420 2799 -577 -6048 -8632 -7945 6957 11108 -2070 -4340 5675 19302 19403 -793 -5536 10593
434 10593 15953 8962 -4626 -11357 -1028 1397 -7584 -13682 -22414 -16740 -2590 -6041 -15276 -17349
448 -17349 -5669 15648 14075 -2793 -1827 11059 21431 17046 453 3599 17251 14600 7028
461 7028 -3253 -9785 -4966 -3981 -8346 -12942 -21289 -13692 1431 312 -6113 -6667 1353 13598 8712
476 8712 892 8040 13476 16492 17088 9657 5418 -86 -4159 1397 -4951 -21856 -21405 -10682 -3946
491 -3946 -10729 -23303 -14403 1999 430 -4744 -5403 2498 17399 20790 18541 17418 11009 14346 21475
506 21475 10438 -4673 -9942 -1144 8598 -6833 -25072 -17844 -5003 -5737 -17885 -27346 -14458
519 -14458 1074 2661 3847 4962 10063 21793 21269 12665 6411 4442 13460 15597 1803 -5975
533e975K796K385l199j4489n631O456J004N63L483J918Q918P864K615M061k031
548A0738k602P588K870j372k871k811M114l373j1983m368l886p505k708K8K066
563a6075r45m056J0107J0691n306m518N598J0911P764m348r68J0026L409j411
577B0879n051r764k927j33k417n149j0475j458J1623r11r305l512L031Q072J987
592e510l965M406Q608R280O512n161m036L744J062q87o335q379K658L414l100
607B311n642q769o07O107n375q116l49P107J0648P47k391P916N254j282Q30m38
623G951M45n04R89O274k502j0648R31L959n898r515n930L771L333l667R29L680
639f402J269M013J133k202K18N90N926N258l714K66N378l18k370n016n128M0k058
$$ plain form
533 -5975 -3179 -794 -3993 -18482 -24113 -17657 -16653 -16090 -12607 -10689 -1771 6093 8708 12769 10738
548 10738 8136 15724 18594 17222 14351 11540 15654 12281 298 -4070 -7956 -15461 -18169 -18141 -16075
563 -16075 -17020 -21076 -10969 -278 -5584 -10102 -4504 6407 14171 9823 8855 18881 22290 20879
577 20879 15828 6064 3137 3004 587 -4562 -15037 -16495 -4872 -5783 -15088 -18600 -15569 -7497 -5510
592 -5510 -9475 -5069 3539 12819 19331 14170 10134 13878 14940 14053 7718 -661 1997 5411 2311
607 2311 -3331 -12100 -12707 -6600 -11975 -20091 -20440 -13333 -2685 -1938 -4329 3587 8841 7559 8389 7951
623 7951 8396 7892 8881 15155 12653 2005 2936 6895 997 -8518 -14448 -10677 -7344 -11011 -10082 -6402
639 -6402 -5133 -1120 13 -2189 -1971 -1381 4545 9803 6089 6355 11733 11415 9045 4029 -1099 -1059 -3117
656c117j471r7l759K357N196k736l551m80J476L564k25P71N069J319K944L826
672A1086m439k943J656l55k616n169l4O949k430m523J178k27j544l320k141M012
688d860R57l34O180J982k422J267R63L62k558k770L427J350l174K059O91j901
704A219l93k322k150j302j418K915J748j889L605L611k211p93o72J388N25k478
720f17J767K939j794J064M77k344j106k534n93O10k902J056M258j279o9J785p19
737aj64j382k6K645k016J105M469j243j314O89r01l02l216k062L087l69j032J837
755a96p5L0J9j673K91n96n93L631j27n88K630L37j91l39k365R76n16k277K164
774E42r2j275J409Mr74j339j802J251P28k300K004K000j23J620n40k79O20j122
$$ plain form
656 -3117 -4588 -4685 -8444 -6087 -891 -3627 -7178 -7658 -6182 -2618 -2843 -2072 2997 4316 7260 11086
672 11086 6647 3704 5360 5005 2389 -2780 -2814 4135 1705 -2818 -1640 -1867 -3411 -6731 -8872 -4860
688 -4860 -3903 -4237 1943 3925 1503 2770 3733 4095 1537 -1233 2194 3544 370 2429 3120 1219
704 1219 826 -1496 -3646 -4948 -6366 -3451 -1703 -3592 13 3624 1413 620 -52 1336 1861 -617
720 -617 1150 4089 2295 3359 3836 1492 386 -2148 -2741 -2131 -5033 -3977 281 -998 -1067 718 -1
737 -1 -165 -1547 -1573 1072 -944 161 4630 3387 2073 2762 1861 1559 -1657 -3719 -632 -1001 -2033 -196
755 -196 -271 -241 -222 -1895 -1604 -2200 -2793 838 711 123 2753 3090 2899 2560 195 1171 655 -1622 542
774 542 450 -825 584 588 -386 -1725 -3527 -2276 -1548 -3848 -1844 156 33 1653 1113 834 1454 332
792C32M85Q76j666J636J133j244L68j121p97r6k431k36J033j066Q42J455l62N99
810b60l25k36J602j576K40K244o78O65R24k88M80j475j500Q37k248n58J722j166
828a596J11N99j136R28l04p63J435o96J22K167J90M24J134l84O91o05k073M47
846F91n02o13J130p82q08R97j633J56p6j984J963L39o87J406M68M34J192j042
864F49O94Q9j252Q03O29j191J288o36m46M30k232j71M67j202J62R53p52J536K0
883a62k15J171r60j86J267j205N59J317o45P64Q7r74M08j375n51Q78j105j48Q01
902b74m62N77j94j098J436o63m31Q76o39L65J432p31O98J07q58Q81p31r50J077
921D18j18j71M85q09O74l50j135R94j3j236Q61r2k83J217p86M34M17j281M37L94
$$ plain form
792 332 817 1693 27 1663 2796 1552 1920 799 2 -94 -2525 -2761 -1728 -2794 -1952 -497 -859 -260
810 -260 -585 -821 781 -795 -555 1689 1011 1676 2600 2312 2792 1317 -183 654 -1594 -2152 -430 -1596
828 -1596 -1485 -886 -2022 -1094 -1398 -2161 -726 -1422 -1300 867 1057 1481 2615 2231 2922 2317 244 691
846 691 189 -424 706 -76 -884 113 -1520 -1364 -1440 -3424 -1461 -1122 -1809 -403 65 499 1691 649
864 649 1343 1432 180 983 1612 421 1709 1073 627 1057 -1175 -1346 -879 -2081 -1919 -966 -1718 -182 -162
883 -162 -377 794 -166 -352 915 -290 269 1586 941 1705 1792 818 1226 -149 -700 178 -927 -1075 -274
902 -274 -736 -159 -353 -1451 -15 -678 -1109 -233 -872 -507 925 194 892 999 141 1022 291 -659 418
921 418 300 129 614 -195 479 129 -1006 -12 -25 -1261 -400 -492 -775 442 -344 90 507 -774 -337 57
941E7m84R87k14k1R58j079Q4N88n34j84p2q05J209l25p59O26m56l85Q02j282P36
962e53L87r96J336L51o56Q57J05l6L17j054P05J074j326k96J93l23J89m20j099
981a245R28q89j03N58k94K78M71o50J414k08p23J515q4p1J93m08O24K59j604M57
1001D18k12o19M9p55l51J016r55j59J297n72L22L04P2J230o16j52J769q58j05
1020A123M61q73L12n26p91M67m47j135K67J06j05P0m99Q63N96p99K48R98k1O93
1040A008l07K21R03o46j10K91o74k84l81o57P00j139p27J022m51m71N01k31J080
1059c52M68o88R77O71r3N99n33K6R28j397J60K09j085J50m63n61K97q86j16P76
1079i13n85l9O89MO92L10K46Q23l57N7P09m88J76P3q11J15j60j211L33l39p07
$$ plain form
941 57 -427 560 346 325 1283 204 288 876 342 158 86 -719 490 165 -594 32 -424 -809 -7 -1289 -553
962 -553 -166 -1162 174 525 -131 726 831 795 1112 58 763 1837 511 215 408 85 274 -146 -1245
981 -1245 -317 -1206 -1309 -751 -1045 -767 -296 -946 468 260 -463 1052 968 897 1090 682 1306 1565 -39 418
1001 418 206 -413 -364 -1119 -1470 -454 -1409 -1568 -271 -843 -521 -217 -145 1085 469 317 2086 1228 1123
1020 1123 1584 711 1023 497 -294 173 -274 -1409 -1142 -1036 -1141 -1071 -1570 -707 -111 -910 -662 336 315 1008
1040 1008 701 922 1825 1179 1069 1360 686 402 21 -636 64 -1075 -1802 -780 -1231 -1702 -1201 -1432 -352
1059 -352 116 -572 405 1076 983 1582 1049 1075 2003 606 766 975 -110 40 -423 -984 -687 -1573 -1689 -913
1079 -913 -1498 -1537 -848 -844 -152 158 404 1227 870 927 1636 1148 1324 1397 586 701 541 -670 -337 -676 -1383
1100a383O69q42Q2N28n11O48N02j46N34J32J6Q38J0l68J045n91l07l61k59L67
1120F03l19r11M83m05p34O33n19m2P13m21L69M04m57J104N1k25P22m40k63Q22
1140A168o33L55J67q47L36m61o06N26o91k06R54j182M51N86o60M44J18k42P59
1159C36j68j50R94o55j3O60o57R7K3q14P35P1o34L61l98o42Q43m75j6K31m28P26
1181B7l5n56J038j14l67O92k85M9k6m89O86m5p15N20j11p80N77o04J76K91o46
1202g17J48O96p96L95K95l49N52l83J51O18p59L53P07r09N94j30k95n6j33m10
1222d28P41q37K87N12r34L64K78m83O81k89j15P52l41K00L48m58j00M2m05K87
1242A02k17n09P12n40q2M70k72K56r9n4K61Kj57N59m4k15M84j92k10L34p50K80
$$ plain form
1100 -1383 -714 -1556 -1474 -946 -1457 -809 -307 -453 81 213 229 1067 1077 709 1754 1163 856 495 236 603
1120 603 284 -627 -144 -549 -1283 -650 -1169 -1211 -498 -919 -550 -146 -603 501 552 327 1049 609 346 1168
1140 1168 535 890 1057 210 546 85 -521 5 -686 -892 62 -1120 -669 -83 -743 -299 -181 -423 336
1159 336 168 18 1012 357 344 1004 347 444 467 -347 388 459 -175 186 -212 -854 -11 -486 -502 -271 -699 27
1181 27 -8 -564 474 360 -7 685 400 449 423 -66 620 575 -140 380 269 -511 66 -538 -362 -71 -717
1202 -717 -569 127 -669 -274 21 -328 224 -159 -8 610 -149 204 911 2 596 466 171 115 -18 -428
1222 -428 313 -524 -237 275 -659 -295 -17 -500 181 -108 -223 529 188 388 736 278 178 220 -185 102
1242 102 -115 -624 88 -452 -534 -64 -336 -80 -179 -233 28 30 -127 432 388 173 657 465 255 589 -161 119
1264A19R2o47M86k09o07P35k81p4K19k89K2L02l35P23L15l38K31P9l35O64n19
1285C53j52K84o16J47J72m78J46l12m38M91l10p5K97r8M94J12m03Q17m3j59N14
1306G43m17K19K4k76j6K99q22M05m38n93N45o43J12M27l97K30M08k01O24Km79
1327b44M94L55l78Q63q13L81K23n79k83R0n35K18m88j25N18j88Q2J37j86K53K15
1348A0k44K52N24l26M85rm53O18m77J93M5q47J98L5n83K10j62k79N35n22O9K89
1370d39m20O20J94m5L14N05l16K66l15J4L69m07j46K66o28K56k16m93N32m40n12
1391a041O73o5l13M93j80J53M46p0n7K44K33J45j80QJ26n06O06j99r66M49R5o72
1413e78L38l82J6M11n15R5O29n33M70J04k5L40K07k99L64o5J06J46o35J06K85
$$ plain form
1264 119 211 -436 50 -159 -766 -31 -312 -386 -167 -456 -434 -132 -467 256 571 233 464 543 208 872 353
1285 353 201 485 -131 16 188 -290 -144 -456 -894 -403 -713 -788 -491 -589 -95 17 -386 431 388 229 743
1306 743 326 545 569 293 277 576 -246 159 -279 -872 -327 -970 -858 -431 -828 -598 -190 -391 233 235 -244
1327 -244 250 605 227 1090 277 658 881 302 19 109 -426 -208 -696 -821 -303 -491 -409 -272 -458 -205 10
1348 10 -234 18 542 216 701 692 239 857 380 573 618 -229 -31 4 -579 -369 -531 -810 -275 -797 -728 -439
1370 -439 -859 -239 -45 -90 224 729 413 679 364 378 747 340 194 460 -168 88 -128 -621 -89 -529 -1041
1391 -1041 -368 -433 -746 -253 -433 -280 166 96 39 283 516 661 481 489 615 109 715 516 -450 -1 94 -578
1413 -578 -240 -622 -606 -195 -710 -615 14 -519 -49 55 30 370 577 278 642 577 683 829 194 300 585
1434E85m49j70j26j75j71j69n5P31n56K6M09k74K03k9K73K50r3p4M42m2o4J25
1456E97l19p1J37m54J50N6n32K34j19l50M07j44L5P1P0J40O0j88J97J01J31L50
1478E59l32J62p0k31L75k8l49Q7m41J07N2l64J79J5l85O75l35j06L16q0J12J59
1500G7n6M34l9j72R1l8k65J37J36l88P87n98l90L86k05n07Q80o95J46L15m15Q3
1522b96O9M9K40q8J66L74m12M07j61j77J91j06k09J55l18Q2J34o99K62K88l93
1543d42L65m3j71J96r6K0K64k03Q1N35o65M38K38k01R5j85j28O9k80oo7j09J86
1566a09l1m06J67J98m54M81j5O4M12m15M87J23n54J20L69l84L20l8j36M8k13j82
1588a48J41m05K05K9k23K84N3m28L81M07m81K52O9q0K93O2l43K56m64N74k19k70
$$ plain form
1434 585 136 -34 -160 -335 -506 -675 -730 1 -555 -529 -120 -394 -191 -220 53 303 210 136 578 536 472 597
1456 597 278 207 344 -110 40 96 -436 -202 -321 -671 -264 -408 -373 -302 -232 -92 -32 -220 -23 78 209 559
1478 559 227 389 319 88 463 435 86 173 -268 -161 -109 -473 -294 -279 -664 11 -324 -430 -114 -194 -82 77
1500 77 21 455 416 244 335 297 32 169 305 -83 704 106 -284 102 -103 -610 270 -425 -279 36 -379 -296
1522 -296 -227 -178 62 -26 140 514 102 509 348 171 362 256 47 202 -116 -34 100 -599 -337 -49 -442
1543 -442 -77 -120 -291 -95 -191 -171 93 -110 -29 506 -159 279 517 316 411 226 98 167 -113 -119 -186 -295 -109
1566 -109 -140 -546 -379 -181 -635 -154 -169 -105 307 -108 379 502 -52 68 437 53 373 335 199 247 34 -148
1588 -148 -7 -412 -207 -178 -401 -117 -64 -492 -111 296 -185 67 136 56 349 411 68 324 -140 434 215 -55
1610e5K62m31p6l4k0j35M28m69M37q7J64q3j6J17J76j22K23M6J2j32j26mmJ11
1634A82p1J02l48r1o2J65L7o0m6J25l92L22j57L52l04L56P9J83j46k70K63N1q5
1657A85Q9m05Q9L81n08k9M23m56J59j35o0J81l8j26J01j13J7K42j03J98L23l98
1679A7K76j65j69O04m90L41r8k4l93M05m71j1J62m09L60n4k56J54j04K1N34k66
1701c6J73j97J85L22j66%K51n60L53j07j58K8O3l42K28k47k63OK14k07N5K81q0
1724b04L58j27R2N67l10J00k10k19M31n42K80Ok79P2J55m80J36R8n59L77j25Q9
1746b94M49k50M24j60j18N86l43J92r2m34J32k3Q1j44R9j18j37j0R4k8j27K34
1768A3N6l28L53k05L66l18L79j28L60n71J45L01m36k43J40k1k90L28p2k72M49
$$ plain form
1610 -55 207 -224 -300 -334 -354 -489 -61 -530 -93 -180 -16 -99 -115 2 178 56 279 325 337 205 79 75 71 182
1634 182 111 213 -135 -226 -288 -123 -86 -146 -192 -67 -459 -137 -294 58 -246 110 189 372 226 -44 219 270 185
1657 185 274 -131 -42 339 -169 -198 225 -231 -72 -207 -267 -86 -124 -250 -149 -262 -245 -3 -106 92 415 17
1679 17 293 128 -41 563 73 414 316 292 -101 304 -167 -178 -16 -425 -65 -119 -375 -221 -325 -304 230 -36
1701 -36 137 -60 125 447 281 281 532 -28 325 218 60 88 151 -191 37 -210 -473 -467 -253 -460 -405 -124 -204
1724 -204 154 27 119 686 376 476 266 47 478 -64 216 222 -57 15 170 -310 -174 -76 -635 -258 -383 -294
1746 -294 155 -95 329 169 51 637 294 486 394 -40 92 69 150 6 105 -13 -150 -160 -66 -94 -221 13
1768 13 69 -259 94 -111 255 -63 316 188 548 -23 122 423 -13 -256 -116 -137 -427 -99 -171 -443 6
1789FK8K43j11k91L17l5Q8M7l13J72k6j77J48m64J15Q5n4n04L74J13r5J64k01
1812c71M26j33j2M47k08r5N39k25J35l5k82n1q0k79K83k80j66j21o7J09K97m62
1834f31M36K53l8M64j87N4L36k69K53r9n37J80K17m79O2J9n48K24j70k43L65q5
1856d23K31J07m24L43J71j71O21J80n49P66j95l0r5l03k6n01l1J03O9l14n7Q7
1878d41J0R3j87M43K02k63K86K35q6L84l00J34j00J5j65kl37n6j9k52K06Pm49
1901f42N67n35K72K55k96K49N09m08N00j4j99L69m80J47j07k41N0j03m94M27j67
1922c41J00k8l26K69L88m25L11K79l03K83J32o7j02Q7k62K18k56K64m3j76l2J56
1944A26l45K81k02J14J09l90J64L32m72L94K79n66L73J11m07K78n05J56L63m02
$$ plain form
1789 6 34 277 166 -125 192 157 245 292 -21 151 125 -52 96 -368 -253 -168 -222 -726 -352 -239 -334 -170 -371
1812 -371 55 -78 -90 357 149 54 593 368 503 468 186 135 55 -224 59 -221 -387 -508 -575 -466 -169 -631
1834 -631 -195 58 20 484 297 351 687 418 671 572 35 215 432 -47 15 34 -514 -290 -460 -703 -338 -423
1856 -423 -192 -85 -509 -166 5 -166 455 635 86 852 657 627 532 229 203 -298 -329 -226 -157 -471 -528 -441
1878 -441 -431 -338 -525 -82 120 -143 143 378 292 676 376 510 410 425 260 258 -79 -135 -154 -406 -200 -193 -642
1901 -642 -75 -610 -338 -83 -379 -130 379 -29 471 457 258 627 147 294 187 -54 -4 -107 -601 -174 -341
1922 -341 -241 -269 -595 -326 62 -363 -52 227 -76 207 339 272 170 257 -5 213 -43 221 178 2 -30 126
1944 126 -219 62 -140 -26 83 -307 -143 189 -283 111 390 -176 197 308 -99 179 -326 -170 193 -209
1964b09K7l5Mn3L02j93L32j37m57Q09n59R6N49j74j78n9k40M03n11oL08m18J93
1987b06M0J71k33K01N0L45j31j04L72l72k94P41o24M26q4l95o0K52n85M56j64
2008a98j98M87n38K10K95o27M11J43l91P16J43j25K22j96n5J87o30O2L65n73K27
2029f3j44m65O21l34K31K39o13J90L07j5j47J06L3L27j79P7K70m25J00M68o81
2050i7K63k30k26N10n47j8Q2j27J35J21k19K86J95m99M55J87l18J58J38j17J89
2071C21n00J44K72m37K41j1j14J80r7n36N93l30pK72l01L97l87J24K31k7k82O67
2093D13n77RL83j53J53j33J11K32m50n6O11n89J00K53l66p0J09k95J01J41j92
2114b65J13Q3j47M02n12K94O70o87K84J60l39K54J54m50J15k51J19N3n27M41K22
$$ plain form
1964 -209 -182 -217 -213 -266 36 -157 175 38 -419 390 -169 -73 476 302 124 65 -175 228 -283 -289 19 -399 -206
1987 -206 -166 5 -228 -27 23 368 237 133 505 133 -161 580 -44 382 298 -97 -157 95 -490 -34 -198
2008 -198 -396 91 -447 -237 58 -569 -158 -15 -406 310 453 328 550 354 299 486 -144 -82 283 -290 -63
2029 -63 -207 -672 -51 -385 -154 85 -528 -338 -31 -46 -193 -87 -54 273 94 171 441 16 116 584 -97
2050 -97 166 -64 -290 220 -327 -345 -263 -390 -255 -134 -353 -67 128 -371 84 271 -47 111 249 132 321
2071 321 -179 -35 237 -200 41 30 -84 96 -1 -537 56 -274 -281 -9 -310 87 -300 -176 55 28 -254 413
2093 413 -164 -155 228 75 228 95 206 438 -12 -68 543 -46 54 307 -59 -129 -20 -315 -214 -73 -265
2114 -265 -152 -69 -216 186 -326 -32 638 -49 235 395 56 310 464 14 129 -122 -3 50 -477 -36 186
2135A86k80kk1k18O54r04L85J16k05O54p6m23R6M75m08N50l06j12K66l46pj68
2157i4k62R9o3k69O62l61l31P94m29J51O76r09M62K67k72M82l66l23O41n52m4
2178d1J84m85M29j00k44m2J84M3K39l55J06K55m20L86P4j61N35k12m29K75r8N9
2200A82no09K08K56k33J8K23j68J64Q3m99N26m03L49K81o88N06l3k58L87r6l35
2222a44L68m06j58L78n74K38J98j61J43L46n32P97l29j34N10m92R8J27l01J88
2242A60O3k09l7r8k07M65l78n1K48k92J23K99j0K60Ql45L99k13m9J00k70J68J62
2265B96n90O33j43m54J95j6l09O90n31l1M98m33L99K00m74L50k63L1J30j4k19
2286e5N94o86K6K47n48K82n7l37O13l1m99O40m62K01J68m5m1K39m49Q66o86q2
$$ plain form
2135 186 -94 -96 -117 -335 319 -585 -200 -84 -289 365 289 -134 -38 437 29 579 273 161 427 81 74 -94
2157 -94 -356 -257 -320 -589 73 -288 -619 175 -254 -103 573 -336 126 393 121 603 237 -86 555 3 -41
2178 -41 143 -342 87 -13 -257 -299 -115 -72 167 -188 -82 173 -247 139 213 52 587 375 -54 221 123 182
2200 182 177 -432 -224 32 -201 -183 40 -128 36 119 -380 146 -257 92 373 -315 191 158 -100 287 191 -144
2222 -144 224 -182 -340 38 -536 -298 -100 -261 -118 228 -304 493 164 30 540 48 146 273 -28 160
2242 160 223 14 -23 -121 -328 137 -241 -292 -44 -336 -213 86 76 336 344 -1 398 185 136 236 -34 134 296
2265 296 -294 339 196 -258 -63 -79 -388 302 -229 -260 238 -195 204 404 -70 280 17 48 178 164 -55
2286 -55 539 -147 -121 126 -422 -140 -197 -534 79 48 -451 189 -273 -72 96 51 10 249 -200 666 -20 -102
2308a02N45m72p4J73l00L28M6p29O51k87n5L26l75L72M6J7j68M86o24N74k29k25
2330g6M05l75Q6l1m48K34L27k97M30l52M2N9k99L51L30p88O93J53n73L73j12m61
2352c29O10l59k0K70l08J05L13m59J94J24m27K32J11k20N02m50M9P39n07K04k4
2373C50m62L42r6l49N54k34j89K51m51O6K46l01K71J26k70L51j91k16M61l20J68
2394A07K74o06N76O4m97K67j95J78m4k34o3J93l45P9L78o42N03j20j15P9m0K84
2416H1L71k75j58M45l57K17J75p32P90m60j22J7l95K01J30k59J70l3k85L10K61
2437I2n55L57o9J70L82m22L88M3O3J01m30Q2K64n14J6K2m06Q5J19m09M13j69k40
2460f17M87j11j57N62j01K72oJ25J89j36m69N58j69l20J60n09K68J45n39P6K87
$$ plain form
2308 -102 443 -29 -103 70 -230 98 144 -585 66 -221 -276 50 -325 47 93 110 -58 428 -196 378 149 -76
2330 -76 329 -46 40 9 -439 -205 122 -175 255 -97 -55 4 -295 56 386 -402 291 444 -129 244 132 -329
2352 -329 281 -78 -98 172 -136 -31 282 -177 17 141 -286 -54 57 -163 339 -111 -62 677 170 374 350
2373 350 -112 230 134 -215 339 105 -84 167 -284 -218 28 -273 -2 124 -146 205 14 -202 259 -61 107
2394 107 381 -225 351 415 -82 185 -10 168 124 -110 -173 20 -325 -246 132 -510 -7 -127 -242 -163 -203 81
2416 81 452 177 19 464 107 324 499 -233 557 97 -25 -8 -403 -202 -72 -331 -161 -194 -479 -169 92
2437 92 -463 -106 -175 -5 377 -45 343 386 449 550 120 202 466 -48 -32 -10 -416 -331 -212 -621 -208 -377 -617
2460 -617 -130 -241 -398 164 63 335 329 454 643 507 38 596 427 107 267 -242 26 171 -368 -292 -5
2481eo67J88K06l04O28k95L03P2q6J53L77m27K97J47m84O79o77p5L36o75K31M0
2503c8l64J25k11k59J16n0J64O22m72N00J94j38N37j02m71M08m38K74J10k81K6
2524B52k94l48PL59n96J75R9m66Q37k26L4J90j69L41m2q2L03K15l16L84l88k50
2546A9L14l45L6M4p75N30q1l48L67M1k19L39l01L87Q3J3JM18l66K02j37m6J16
2569B92j73l26O43n57l6L93m67L53k51K8J48k34J56O3k49J10L04k60L94j93l33
2590a95M49k03N9N4m43J55M30m47rN8K56j06K3l24P65m40k42M41l88K28k57l05
2612d41L67k29J51J66qj93L86k46L41j52j38L17j91j79K99k91n4O48p20j71M22
2633H4l32K90M0n70L58P5k38O13m98J10K88m96L03J24k82N59k06l56N51l38K0
$$ plain form
2481 -5 -672 -484 -278 -582 46 -249 54 126 40 193 570 143 440 587 103 782 105 30 366 -309 -78 -38
2503 -38 -402 -277 -488 -747 -631 -681 -517 105 -367 133 327 189 726 624 153 561 123 397 507 226 252
2524 252 -42 -390 -383 -24 -620 -445 -346 -812 25 -201 -167 23 -146 195 153 71 374 589 273 657 269 19
2546 19 333 -12 24 68 -707 -177 -258 -606 -239 -198 -417 -78 -379 8 91 104 105 523 157 359 222 176 292
2569 292 119 -207 436 -121 -157 236 -231 122 -129 -101 47 -187 -31 32 -217 -107 197 -63 331 138 -195
2590 -195 254 51 110 164 -279 -124 306 -141 -150 -92 164 58 81 -243 522 82 -160 281 -107 121 -136 -441
2612 -441 -74 -303 -152 14 6 -187 199 -47 294 142 4 321 130 -49 250 -41 -95 553 -167 -338 84
2633 84 -248 42 82 -488 -130 -55 -293 320 -178 -68 220 -276 27 151 -131 428 222 -134 417 79 99
2654I9K01n65R2pk54K88R2m74N96j26p5K93j67P6K74k07J08m5j13L41k48L24n02
2677AJ99k18K00m30J47l78p7L14K40j44k32L17J04j71J74k05K78j53M55j88k79
2698d6N27n64K19m08K32N3o0j99J30j47r6N86k80k60L20j35l4K89K8J16l2j93
2720D6L13k02k02P9N9j60J61o02K52L16n1M8q1r2K39m3k3No9MJ26j25O3J1k10
2745a38L75k91n2J79m82M74N8m56L65J30l28L62l22M5M58n57K83J13m63M53K5
2766B31j83P6J08p06O34q1j78K14m86N56m3j36J37q3k82M63j7%m0r7o6p1k34J66
2790a18J14k70N10m30J4L14j59j61K11j36J47N8n29P67p6j21J03m13J65J15k51
2811a46n4J41o6K00j16l44L57k99J69J78J56k03L09k53K98l61j65L08M9k98M76
$$ plain form
2654 99 300 -265 -173 -180 -434 -146 -54 -528 68 -58 -133 160 -7 69 343 136 244 199 86 427 179 503 1
2677 1 200 -18 182 -248 -101 -479 -556 -242 -2 -146 -378 -61 43 -128 46 -159 119 -34 421 233 -46
2698 -46 481 -83 136 -272 -40 13 -47 -246 -116 -263 -359 227 -53 -313 7 -128 -162 127 155 271 239 46
2720 46 359 157 -45 34 93 -67 94 -508 -256 60 9 57 -24 -116 123 80 57 62 -7 -3 123 -2 61 72 -138
2745 -138 237 -54 -106 73 -409 65 123 -333 32 162 -166 196 -126 -81 377 -180 103 216 -247 206 231
2766 231 48 124 232 -474 160 79 -99 115 -371 185 142 6 143 60 -222 241 224 224 184 87 21 -50 -284 -118
2790 -118 -4 -274 236 -194 -180 134 -25 -186 25 -111 36 94 -435 332 256 135 238 -175 -10 105 -146
2811 -146 -200 -59 -125 75 -41 -385 -28 -327 -158 20 176 -27 282 29 327 -34 -199 109 158 -140 336
2832C36n95L8M01n69M06l94O5J95j44k60Q30n83K31L17j15M8n4J71J18m3n92M41
2854B48l93K28j51j56J53P3l86M40j69k83O30j38n3L34l49J75J3m34J56J84l64
2875b42M17j21k55N06n78R2J95m71M11J32j87qJ61J51M4k01J29K9m21L28L31l29
2897A13M9k49l26M31j15j64K72j69j81K47J82p6l45L80J59o8l5J54R7k97J82m78
2919b37K50N8j48K41k29n4P6j78J58m9m2K46L9N3l78J64k09P34j93j87J84m55
2941a56M49o3n79M75k36j11m6r7K02o0K2r8L05j10K55j08j87L97j76j90L99l18
2963c1K83N0m44l9J91k34J88K8l30M05l10j3L06l67K81K01k93M08J23l28J80l22
2985f7J25J4k7J14K62p95L92k09j55L05j73j64L00j67M83k35l62M01N1k47L85
$$ plain form
2832 336 -259 -221 180 -389 17 -377 -312 -117 -261 -521 309 -274 -43 274 159 207 153 324 442 399 -193 248
2854 248 -145 83 -68 -224 -71 2 -384 56 -113 -396 234 96 43 377 28 203 216 -218 -62 122 -242
2875 -242 175 54 -201 305 -273 -181 14 -457 -46 86 -101 -109 52 203 247 46 175 204 -217 111 442 113
2897 113 162 -87 -413 18 -97 -261 11 -158 -339 -92 90 14 -331 49 208 140 105 259 356 59 241 -237
2919 -237 13 71 -77 164 -65 -119 -43 -221 -63 -112 -154 92 131 184 -194 -30 -239 495 302 115 299 -156
2941 -156 293 230 -349 126 -110 -221 -267 -364 -162 -222 -200 -298 7 -103 152 44 -143 254 78 -112 287 -31
2963 -31 252 302 -142 -181 10 -224 -36 -8 -338 67 -243 -256 50 -317 -36 165 -128 280 403 75 255 -67
2985 -67 58 72 45 159 421 -374 18 -191 -346 -41 -214 -378 -78 -245 238 3 -359 42 93 -154 231
3006B31Lj61M51l76n7J94m43K44j41j28M1J89K7n2l39Q3J72j48J72O3j95K02o6
3029c4j80M44l01J35K19j26L33l57J6j1l28j9K79m89K09K97l45J95j68J37J61
3050F7L6j20K87q3l84L77j53J19J47m49K74K3l49M22j79P1M1l08o4M54n02n0M18
3073I5k32oJ11k22J46m6J34o9O6N68l67N3k45K74j72O2j54M4L3j35P3J85l12k94
3097d10L42k12J27RK6K76n9j45J57l9k15K78k87K50J01j75J25k35P5j47j06J11
3119a53K43k27k91L05nQ9R4k27M8j14J64K93p7J41p4j61j61J49l0J93k60J66%
3142A05k33q7J88k00K83k66J62J12j42P5J97k55L59j15k36j4L46l79M49k80mO8
3164A33m34J17J31J5q8K30m89M41j18k00L0L46r5M8l3K13r4m6j05j32N7L66j69
$$ plain form
3006 231 234 73 524 148 91 285 -158 86 -55 -183 -142 47 74 22 -317 -234 -62 -210 -38 25 -170 32 -34
3029 -34 -214 230 -71 64 283 157 490 133 149 138 -190 -209 70 -419 -210 87 -258 -63 -231 -94 67
3050 67 103 -17 270 187 -197 180 27 146 293 -156 118 141 -208 214 35 106 147 -161 -225 229 -273 -323 95
3073 95 -137 -143 -32 -254 -108 -154 -20 -89 -23 545 178 231 -14 260 88 150 -4 40 73 -62 11 196 -116 -410
3097 -410 -68 -280 -153 -144 -118 158 99 -46 111 72 -143 135 -152 98 199 24 149 -86 -11 -158 -264 -153
3119 -153 90 -137 -428 -123 -128 -39 55 -172 -124 -238 -74 219 142 283 209 48 -113 36 6 199 -61 105 105
3142 105 -128 -215 -27 -227 56 -210 -48 64 -78 -3 194 -61 298 183 -53 -67 279 -100 349 69 65 133
3164 133 -301 -184 -53 -38 -126 104 -385 56 -62 -262 -232 114 19 67 34 247 153 107 2 -130 -73 293 124
3187A24l56L33l95L40j7o7L5J28k11l0N5P4O5J10j28J81k15r7l8J20q9K82l30
3210a26L71k20J33k13j33L16k09j72L58r3j89K96k24j22J38M9k1J54k92L90k26
3231c5K05M4j56j64K14k16JJ26K19k09j00k4K0j5N1mn8K35k71RK73j94P4j17j19
3256b11O79l3l50j91L04j71o6M7p9O3J59j92n5l0j85N68l64J90P8j00J5K21m63
3279a66J14L10j84k7Q6R1j83OJ37K85l04j39J04j28k2j60L80j05m3j88J02k24
3301b58M0L11l05M24l68K44j04n6q4L66j93J02j70r9K86k87J35M3j80R0K89l92
3323a66J34K81l9o5r0l99N19l27M2P8J41n2j8j47LK19j42K32l03j44L41j43J0
3346c5l6O6j37o4K39o3J31m55N26q8l46O26m54j3J26K1l44O64m91L69k73J16j68
$$ plain form
3187 124 -232 101 -294 46 29 -38 -3 125 -86 -116 -61 13 78 188 60 241 26 -71 -109 11 -78 204 -126
3210 -126 245 25 158 -55 -188 128 -81 -253 105 12 -177 119 -105 -227 -89 -40 -61 93 -199 191 -35
3231 -35 170 214 58 -106 108 -108 -107 19 238 29 -71 -95 -75 -90 -39 -43 -101 134 -137 -128 145 -49 25 -92 -211
3256 -211 468 435 85 -106 198 27 -39 8 -71 -8 151 -41 -96 -126 -311 257 -107 83 161 61 76 297 -166
3279 -166 -52 258 74 47 133 224 41 47 184 469 165 26 130 2 -20 -180 200 95 52 -136 -34 -258
3301 -258 -218 93 -212 212 -156 88 -16 -72 -156 210 17 119 -51 -150 136 -151 -16 27 -153 -63 226 -166
3323 -166 -32 249 210 145 55 -344 175 -152 -110 -32 109 57 39 -108 -105 114 -28 204 -99 -243 98 -45 -35
3346 -35 -71 -5 -142 -206 33 -30 101 -354 172 84 -262 364 -90 -103 23 44 -300 364 -127 242 -31 85 -83
3369h3J03K36j9l28O5L19p79L90J21J6k22J23pL93k72o4K61j36k28N1l7O6J95
3392A64J9j38r0K72j59k30L2J49j84N6N3lL59m24J7M01l76L69l78J01q1J41l16
3415b46L44j32J40k57P8O8R3r7k06P2J44pj05K88K2j94K7J63L7k70J12j59J80
3438I5l36j16M11j67j31M26j53J56l8k72L08m90K53p5M0J34O0J1M4j26k3j14n4
3461a57j4M61l37J39j32j68J96J2k50Q1J32J95j06j58L49l24M2j64L01j04K28
3482B22k66Qm8k71J98O5l06L86Lk67J06K74k30O9RN8K33r6j84K76j73K6l2k66
3506b06L00p8o9j02p5N08m34K30ok95k49L04M15n9LR3l26M9K67p9q4j66M98l36
3530A03m8p1j07j39M26k86N0j87J9L65k01k8j93J99L1J41J99k67K17nq0o7m4J4
$$ plain form
3369 -83 20 256 237 -91 -26 293 -486 -96 25 41 -181 -58 -65 328 56 -8 253 117 -111 -60 -97 -31 164
3392 164 183 45 -45 227 68 -162 -130 19 -165 -109 -56 -59 300 -124 -107 294 -82 287 -91 10 -71 70 -246
3415 -246 98 -34 106 -151 -73 -5 88 -9 -215 -143 1 -6 -111 177 199 5 32 195 232 -38 74 -85 95
3438 95 -241 -357 54 -113 -244 182 29 185 147 -125 183 -307 -54 -129 -89 45 105 116 160 34 11 -103 -157
3461 -157 -171 290 -47 92 -40 -208 -12 0 -250 -169 -37 158 52 -106 243 -81 -39 -203 98 -6 222
3482 222 -44 -36 -84 -355 -157 -92 -398 -12 -9 -276 -170 104 -126 -57 -48 10 243 147 -37 239 66 92 60 -206
3506 -206 94 16 -53 -155 -230 278 -156 74 68 -227 -476 -172 243 184 187 280 -46 3 270 191 107 -59 439 103
3530 103 55 -16 -123 -262 164 -122 -72 -259 -240 125 -76 -104 -297 -98 -67 74 273 6 223 218 138 71 27 41
3554D1j98J05j60J73r0kJ33K1O8n14K51M13j89j64Mm6K61k62j27M71m91L37pq6
3578e8K44j46k97M34k24j33K69q3o6R9Jj62J53j30j26k1L15j34n8J64j33L35n00
3601b57L84k29L3J29l10M90n13K69J08q2j5R4o3j13k89L19O5n9j21J95j23k2K27
3624A17J08j84L7l0k1p6p6K70m4j53J0R3l48R5K52L34n24Q7l0k7P6j63Q8K52O4
3649B07k16k9j38M77l66J46J4r6L2j11j10M2L67l54R1j4q0J34j22K2j03K03j42
3672a46M43k84m4J7J84j29n1L3L5m2O3q1j13n0J35J5k01R6K66r8k7L60o16K49
3696A4Q4j1Q9k17L11l96NK60j95K59k06l4l9P5j16M04j63m23K00N9J14J01j91
3719a6L55k26l79L45J35o4k6k49O5J01J77k29q0o5K18j78j35J61k20M33k7j01
$$ plain form
3554 41 -157 -52 -212 -39 -129 -131 2 23 91 -423 -172 241 52 -112 -108 -154 107 -155 -282 189 -302 35 28 -58
3578 -58 186 40 -257 177 -47 -180 89 6 -60 39 40 -122 31 -99 -225 -246 69 -65 -123 41 -92 243 -257
3601 -257 127 -102 -69 60 -250 240 -273 -4 104 22 7 101 38 -75 -364 -45 20 -39 -160 35 -88 -110 117
3624 117 225 41 78 48 27 -49 -125 145 101 -52 -42 51 -297 -202 50 384 -140 -53 -83 -110 -34 -197 -109 143 207
3649 207 -9 -38 -176 301 -65 81 95 -1 31 -80 -190 -148 219 -135 -44 -58 -138 -4 -126 -104 -207 -4 -146
3672 -146 297 13 -31 -14 170 41 -10 23 58 16 79 -2 -115 -165 -30 -15 -216 -120 146 48 21 381 -235 14
3696 14 98 87 176 -41 270 -126 -121 139 -56 203 -3 -37 -76 -1 -117 287 124 -299 -99 -40 74 175 -16
3719 -16 339 113 -266 79 214 150 124 -125 -60 41 218 -11 -91 -156 62 -116 -251 -90 -310 123 96 -5
3741ep3ol7K43k04J33k22M05k49K92k83k27N13k73k1J97j63n0%K3k9J52j7L9k2
3766A16O8l31L05j69m07K77L73j81j55K54l32L03j77M5K1j50j52J81J26j17L88
3787B86k64j24K86m74L81J36j52J36M2l83L18m07N10j66j58n4K95r7k1n59N36
3808F7k17No8K77J2p0j16J09m21M34K05m49L26J1k12KK68k08P9j15R2L1J56l19
3832a21R5j12M88j99m10J91K15m6j07L27k48k55M49j88q6j3k1nN1Rj9j13N5J47
3856H4l43M44M5l75RJ24j14J37j7P5mkl05N4K59j85K35l38M87j12O4m18L14n5
3880F3l7J40Kk91J39J34L5r5j94K59k59j62J30q4J43K82k27q1Q9j53L3R3kn6M8
3905e1J16k57L35k38lJ56k31L20j74l0J97l6J60K6j76q4K37l39K24k36M7J59k90
$$ plain form
3741 -5 -78 -84 -121 122 -82 51 -171 234 -15 277 -6 -233 280 7 -14 183 20 -30 -30 -7 -36 116 99 138 116
3766 116 184 -147 158 -11 -418 -141 232 51 -104 150 -182 121 -56 -11 10 -140 -292 -111 15 -102 286
3787 286 22 -102 184 -290 91 227 75 211 253 -130 188 -219 291 125 -33 -87 208 111 90 -469 67
3808 67 -150 -145 -213 64 76 6 -110 -1 -422 12 217 -232 94 105 -107 -105 163 -45 34 -81 11 42 198 -121
3832 -121 -26 -138 350 151 -259 -68 147 101 -6 321 73 -182 267 79 -7 -20 -41 -46 5 14 -5 -118 -63 84
3856 84 -259 185 230 -145 -136 -12 -126 11 -6 69 65 63 -242 -188 71 -114 121 -217 270 158 222 -196 118 63
3880 63 26 166 168 -123 16 150 185 90 -104 155 -104 -266 -136 -220 -77 205 -22 -103 -14 -167 -134 -41 -43 -99 -51
3905 -51 65 -192 143 -95 -98 58 -173 147 -27 -57 140 104 264 290 114 30 267 -72 152 -84 -37 122 -168
3928a68R9J58O8m11J72K89l68J42NJ27j45O9j01j97J05R8J81k55L38m32o2N01
3950B13K9j46k10k59K46K42J35j69k0J80o1q6k24L05k87K15K2l81K27K81l53J99
3972I8r1J06m9k25J5K85j75Q7j63J28l1n8j61M48k76J11o4K22J8k59K2O7j13m2
3996a00o5J10K9oJ45k44J70j97R3m4J61J34q8n2J09l10L2K52j35j65K59l9l49
4019c00L37j8K73j06j23M2m36M95l81oJ5K46j6j53K90j69j47Q2K10l8k83K96k53
4042a43R1o7P5J83l26L61k55J41j35O4Q5k3j35n2P7J38J34k32J2J42o4n6o1j84
4066b30J53O8M0J13p8j36N1Q8OPj03j0r6K20k28J57L8k6q0K9J83p9L2N8j76J74
4092A75j12K03m77K0L51k66L38j85K2J38k54L1P6n8O7l14K10m4j28N24j86j42
$$ plain form
3928 -168 -69 89 157 -254 -82 207 -161 -19 -14 113 -32 37 -64 -261 -156 -58 123 -132 206 -226 -288 213
3950 213 242 96 -114 -373 -127 115 250 81 61 241 180 94 -130 175 -112 103 125 -256 -29 252 -101 98
3972 98 7 113 64 -161 -146 139 -36 51 -112 16 -15 -73 -234 214 -62 49 -15 207 225 -34 -12 55 -58 -100
3996 -100 -165 -55 -26 -32 113 -131 39 -158 -65 -109 52 186 98 46 155 -155 -123 129 -6 -171 88 49 -300
4019 -300 37 19 292 186 63 105 -331 164 -217 -223 -208 38 22 -131 159 -10 -157 -75 135 97 -186 110 -143
4042 -143 -52 -119 -44 139 -187 174 -81 60 -75 -11 74 51 -84 -136 -59 79 213 -19 -7 135 71 15 -46 -230
4066 -230 -77 -9 31 144 66 -70 -19 69 75 82 -21 -31 -127 93 -135 22 60 34 -46 -17 166 87 119 177 1 175
4092 175 63 266 -211 -191 160 -106 232 47 69 207 -47 -16 60 2 69 -245 -35 -79 -207 317 131 -11
4114a1kp3L1J14k00o2k5J46j70J86j0o8K53l35J97L13l87j25L70k42K32o8j53
4137h9J89l36K79Q1r7j59K00jk21J06J43L2j47k40k4K30p9L25j12P4o8k77K77
4160H6j09K12J7j50J5KK36j86L2m6j84k8oL08l99K40l6K0P4K9k78kJ80l5j2M6
4186B6O0k14K4J48P9j78K20j1p8r1N4Q3r3l3j61J45J44m3K07j24j24K1j78L32
4210B15o5q1j56mj29K90j79J70jJ59j63J48j43r3J95q2J00N2j66J78k05J63J86
4233C89l26k08J04L3j58J16O6J06j67o9J52j1j30K55j90l4L8L41k75j66q3K71
4255E4p1L6k6N2j62j18K78K1q0J97j60l6k03L39j2j11N3k23L51j9K13l67j61K32
4279G7k01Q1K3j11J85J77l80k1k26L57j50K57J76r7l80J70K42m2j18L2R1L1k87
$$ plain form
4114 -11 -13 -86 -55 59 -141 -203 -228 -82 -252 -66 -76 -144 109 -226 -29 284 -103 -228 142 -100 132 64 -89
4137 -89 100 -236 43 124 27 -132 68 67 -154 -48 95 127 -20 -260 -284 -54 -133 192 80 154 86 -191 86
4160 86 -23 189 206 56 71 73 309 123 155 109 -75 -103 -109 199 -200 40 4 24 98 127 -151 -153 27 -8 -20 26
4186 26 86 -128 -104 44 123 -55 165 154 76 -15 39 122 29 -4 -165 -20 124 81 288 164 40 61 -117 215
4210 215 150 69 -87 -91 -220 70 -109 61 60 219 56 204 61 -32 163 81 181 233 67 245 40 203 389
4233 389 63 -145 -41 -8 -166 -50 16 122 -45 -114 38 27 -103 152 -38 -72 -34 307 32 -134 -217 54
4255 54 -17 19 -7 45 -117 -235 43 64 -16 181 21 -15 -218 121 109 -2 51 -172 179 160 373 6 -155 77
4279 77 -124 -43 -20 -131 54 231 -149 -170 -396 -39 -189 68 244 147 -233 -63 179 137 19 51 142 173 -114
4302a14J65j71L66m1m10J39J89N2j18K40k93K53k88r2l8j16J14K26p8R9n6j02
4324g4r4K34K54m05L1L3q6J45r7R9q8K90OJ6k99J04m70N02j23q6O4J05J73k25
4348IL7q9P5k40N96n13N1l5j28J92R4p3K17k33K02k9K5k7k72L60j43q0j17J70
4372D9k9j63K79j73J9k4J67K7J7j63J86K8k19J58j17j08L12j66L6k23J79J4Ll43
4396b54L02k11n3L19j67O0J00j24j00kJ79l7p1J17l37K01qPM5K00k68k8K54j35
4420a1l4P9j90L1J06j9O3J87j44j73J65j16L04l02j26J37Rl2J66l57K34j27J41
4443iL03j92R7k5j31P0o8p8J4J86k71J67l72K80K50p2l64k7L80l7k01K0MJ51j48
4468g3J65Q1m3l5K6m9j96K2K5K5j29J41J56M6j14L1j52L2K8k6j67rJ83K1L82m13
$$ plain form
4302 -114 51 -120 246 205 -205 -66 123 175 57 297 4 257 -31 -123 -161 -277 -163 63 -15 84 28 -74
4324 -74 -168 66 320 -85 -54 -21 -107 38 -59 40 -48 242 248 264 -35 69 -401 101 -22 -108 -44 61 234 9
4348 9 46 -43 32 -208 388 -125 -74 -109 -237 -45 49 -24 193 -40 162 133 158 131 -141 219 76 -4 -121 49
4372 49 20 -143 136 -37 -18 -42 125 152 169 6 192 220 1 159 42 -66 246 80 116 -107 72 86 89 -254
4396 -254 48 -163 -216 103 -64 -4 96 -28 -128 -130 49 12 -59 58 -279 -78 -86 -79 -34 166 -102 -130 124 -11
4420 -11 -45 34 -156 -125 -19 -38 25 212 68 -105 60 -56 248 -54 -180 -43 -34 -66 100 -257 -23 -150 -9
4443 -9 294 102 199 174 43 113 45 -33 -19 167 -104 63 -309 -29 221 149 -215 -242 138 101 -100 -80 -76 75 -73
4468 -73 92 173 130 95 121 72 -124 -102 -77 -52 -181 -40 116 162 48 79 -73 -41 -13 -39 -206 -215 -32 -11 371 -42
4494d2L0j25J27p6q6L58nJ3j81k01L22O0l24J21Pjk36K05O2r7j91P4L16k03K71
4519A98j49l1J30m7J61m22L45k00P1n9Q7j94J51L0j17P3K29l92J79M8J6l54P5
4542a72M30k30M7j59R5R4Q9k14j02L46j84j86K8N6J5K37m39O52n48J0J8J83K13
4565B79J6k38j26K18m4k2N2j81K9K14k92J25p8l5Q0j36j18M01j31j35M7K1K44
4588A90m9k94J39L4J76j83J30j7J46k81m8J34k23L08o5k60qK4J81l3N0n4rK8J88
4613B04l70J73k3m2L9K59l54J52m4L4K82l89M35j80l42J49J65l37P3J18j3K55
4635B44l69k3J0K03j79L46L2J5L7k21q9J3J33j21o0k6J1J60j79J89k96L06j30
4658FLq4J3L80n87J49j9q3K03l00J62K78r5K50k36k02K42K1q7L5k03O9Q5K26m22
$$ plain form
4494 -42 -12 -137 -10 -86 -172 186 181 194 13 -188 134 194 -130 -9 -2 -3 -239 -34 28 -69 -260 -186 130 -73 198
4519 198 49 18 148 101 262 -160 185 -15 56 -3 84 -110 41 71 -46 27 256 -136 43 91 107 -247 -172
4542 -172 258 28 75 -84 11 105 194 -20 -122 224 40 -146 -118 -62 -47 190 -249 403 -145 -135 -117 66 279
4565 279 295 57 -69 149 105 83 135 -46 -17 197 -95 30 -48 -83 -3 -139 -257 144 13 -122 -75 -54 190
4588 190 141 -153 -14 20 196 13 143 126 272 -9 -57 77 -146 162 97 -163 -171 -147 34 1 51 -3 -12 16 204
4613 204 -166 7 -16 -58 -19 240 -114 38 -6 28 310 -79 356 176 -166 -17 148 -189 -116 2 -11 244
4635 244 -125 -148 -138 65 -114 232 264 279 316 95 6 19 152 31 -29 -55 -44 116 -63 126 -170 136 6
4658 6 9 -75 -62 318 -269 -120 -139 -222 -19 -319 -157 121 26 276 40 -162 80 101 14 49 -154 -85 0 226 -196
4683a96J36J64n3j2j17J10p2m4K59r7l40p1P30k98K66l70o3k09N38j00j87J05
4705G9P4j70o4N4k4n9J42m1j20R6K10m1R1j48J39k64O8k16j18K63K10l24N2J08
4729cJ62p8j50k4J72p6q5n6J05%J05j41K78p0k6K6N9j69pK03l03M4K3l3J74j35
4755eL9m7J39k4j00K85k95j3%Q6l4K88J3m05K76j13j15J35q0j09J79J34l91L03
4779A46k50Q0M2q8M8N6j02N7J90j57j25K52l42K55l8N2Kj16j06K46l4o7p4K33
4803A60m15K66O2L03k15o9l67R9K7K72j80o4K15j60J22j61K63k15j64O6q9J14
4825a30K20M9j80P2j48M4j5n1K84k0k72k6K35k53L73l25J46m9j98K97op0P5k62
4849b10J11J00J8kl4M0l4K7k7l8j34O5L43j75k34Q4J28l2K9p8j00K70j37J26J94
$$ plain form
4683 -196 -60 104 51 39 -78 32 -40 -84 175 78 -262 -333 397 99 365 -5 -68 -277 261 161 -26 79
4705 79 153 -17 -81 -27 -51 -110 32 -9 -129 -33 177 136 227 79 218 -46 22 -194 -312 -49 161 -163 -111 -3
4729 -3 159 81 -69 -93 79 3 -82 -138 -33 -33 72 -69 209 139 113 139 198 29 22 225 -78 -34 -11 -44 130 -5
4755 -5 34 -13 126 102 2 287 -8 -21 -21 65 31 319 332 -73 203 90 -25 110 30 -79 100 234 -157 146
4779 146 -104 -24 18 -70 -22 34 -68 -11 179 22 -103 149 -193 62 24 76 78 -38 -144 102 68 1 -73 160
4803 160 -255 11 73 376 161 92 -275 -176 -149 123 -57 -121 94 -66 56 -105 158 -57 -221 -155 -244 -130
4825 -130 90 139 -41 31 -117 -73 -88 -139 145 125 -147 -173 62 -191 182 -143 3 -46 -244 53 47 -23 52 -210
4849 -210 -99 1 19 17 -17 23 -11 16 -11 -49 -183 -118 225 50 -184 -100 28 -4 25 -53 -153 117 -20 106 300
4874C00k82j11l5M9K03J23j85P4j88O4M1r2lJ35l18K5J11J59k37J96L90l46p5
4897bj29j4J33l6J38N1m5k29j8K4N6m4R6Qk44L70P7j85J00o1J52m7j83N0j8K72
4923B72m57J59j3m7k6L53j12l5k28q2J80r5R1n9m2J32R3L9m20L02kQ6J39l02j09
4948a83J24L7M33l80j68L19l84j68N77k59R4j23L35N7l61N6n7R6j06M19m65M0
4970f7k8o6M15k48P1r6M7N4r8l5k60L48N7j03n9m1m4M03j15M9l77J77J93k38n6
4995a17K7j4M24j46l60R8K95K01k92q2m0j28r6K0J47J97L4j43m8j74J81J06j37
5018d7N8k29M86n69J6J82L35p2k07J26k88K05j01L95k81j07L82m28J51MJ17k67
5040a39K2J19n6j09J41K20l12Q5pk02J88K17j16q9J06j24K7J55j67j36J69J21
$$ plain form
4874 300 18 -93 -128 -79 124 247 62 136 -52 12 53 -39 -42 93 -225 -200 -89 70 -167 29 419 73 -2
4897 -2 -131 -145 -12 -48 90 141 96 -133 -151 -127 -71 -115 -19 -11 -255 115 192 7 107 46 198 151 -32 18 0 272
4923 272 -185 -26 -39 -86 -112 241 129 94 -134 -216 -36 -131 -40 -99 -141 -9 84 123 -297 5 3 89 228 -74 -183
4948 -183 -59 -22 411 31 -137 182 -202 -370 207 -52 42 -81 254 311 -50 6 -51 45 -61 358 -107 -67
4970 -67 -95 -161 254 6 77 -19 28 82 -16 -51 -311 37 94 -9 -68 -109 -153 250 135 184 -193 -16 177 -61 -117
4995 -117 -90 -104 320 174 -186 -88 207 408 116 34 -6 -134 -230 -210 -63 134 168 25 -23 -197 -16 90 -47
5018 -47 11 -218 268 -301 -285 -103 232 160 -47 79 -209 -4 -105 290 9 -98 284 -144 7 11 128 -139
5040 -139 -117 2 -54 -163 -22 198 -114 -29 -36 -238 -50 167 51 -38 68 -56 -29 126 -41 -177 -8 113
5062A13j43P6K3k77J63n1P1J2K1K16j60L9k17K8Q7j71J69j75J33M1J05P3k14K40
5086B02j53OO2m1Q0M5k91pK16L5k43q6P9p5R1J16R8j30R0L2k28P3J02k36L16l7
5112A16K1M3k09K02N2k10n8K18n2k65M58m24L30k72l8P6o4J25K34M2l87j03L32
5135A67l1p4j63L83l40j9l9M6J83l8j34q8L33k84K54k44J86j37J86j38pO9ol07
5159b42L23j60j85L68j80J42l82L69j73J20Q5m9OK3J94j41k7j34r5Q4J63q0j04
5182g5L33j26mk28M1J85k06KM1Nr8J47k5N3J8j12j9J93j51n1L22k83J38N6m49
5207b93M71k07R4p3j20K13j63m2L57M6q2l04J36JN5k20J03J6m1j76M90k00j36
5230g5j55J5J38n8L89j32l2Jp1j9k0k1K62k91J80K48l44k08L14l66K4L57n53M54
$$ plain form
5062 113 -30 46 69 -208 -45 -96 -25 -13 8 224 64 103 -114 -86 1 -170 -1 -176 -43 -2 103 176 -38 202
5086 202 49 55 117 76 156 201 -90 -97 119 154 -89 -175 -96 -171 -80 36 134 4 94 126 -102 -29 73 -163 153 116
5112 116 137 180 -29 173 225 15 -43 175 123 -142 316 -108 222 -50 -88 -12 -76 49 283 325 -62 -165 167
5135 167 136 62 -101 282 -58 -77 -116 -70 113 75 -59 -147 186 -98 156 -88 98 -39 147 9 2 71 65 -242
5159 -242 81 -79 -264 104 -76 66 -316 53 -120 0 85 36 42 65 259 118 91 -43 -138 -54 109 29 -75
5182 -75 258 132 128 -100 -59 126 -80 -78 -37 -32 -130 17 -8 45 63 -49 -68 125 -26 -77 245 -38 100 156 -293
5207 -293 178 -29 65 -8 -128 85 -78 -120 237 283 201 -103 33 34 89 -131 -28 -12 -53 -229 261 61 -75
5230 -75 -230 -215 -77 -135 254 122 90 91 20 1 -19 -40 222 -69 111 359 15 -193 121 -245 -221 136 -417 37
5254C7k74M24m9k29J12K03l25J24J61k74Qoj01N13k06p8oK01k97j26P2lP1J52
5278A04o6o2j43L28k71K16nn0m9P5k8J52j75r8K00m28J31L49J3k10J70j05j48
5301a00j26O5L82l57L76k90K21n24K96J06L3j7j96K72j20k02J54K43k84q4L2P
5323a13J66J9l20L33j45j38J73j1L7MJ94l10L86l86M4L60m7l85J02j03K02j26
5345f4RL5Q3k96k5K90l97K60r4L77l49M44l16K35j68N3k40K07Q4k32K34j39q9
5368i8K6K72n1l3m5q9r6J91p1J58J41n60K88l%p7J53k25J69O4j77R4J24m38J34
5393a49j6J46K92l74L05l47K10j35O4J36k46j82J99j45L39J09k2j63J63l95L25
5414A14rk93J63j10L56k30K4l4K28k36O4j17J6L06l16J13j56Q4J24m8k62j70M40
$$ plain form
5254 37 -237 187 138 -91 21 224 -101 23 184 -90 -82 -88 -189 324 118 40 34 235 -62 -188 -116 -119 -48 104
5278 104 38 -24 -167 161 -110 106 101 51 2 77 49 201 26 -72 128 -300 -169 180 193 -17 153 48 -100
5301 -100 -226 -161 221 -136 240 -50 171 -353 -57 49 82 65 -131 141 21 -181 -27 216 -68 -152 -120 -113
5323 -113 53 72 -248 85 -60 -198 -25 -36 1 5 199 -111 275 -111 -67 293 246 -139 -37 -140 62 -64
5345 -64 -55 -20 63 -233 -258 32 -365 -105 -199 178 -171 273 -43 192 24 77 -163 44 128 -104 130 -9 -98
5368 -98 -72 200 149 116 71 -18 -114 77 6 164 305 -255 33 30 30 -47 106 -119 50 114 -63 31 155 -283 -149
5393 -149 -165 -19 273 -101 204 -143 67 -68 -4 132 -114 -296 -97 -242 97 206 184 21 184 -211 114
5414 114 105 -188 -25 -135 221 -9 15 -19 209 -27 37 -80 -64 242 -74 39 -117 -33 91 43 -219 -389 51
5437E1l05K19k4R6k09J55K85k64j42K09J52j60o7J5N3J41k35j31J6K11J6q9j3
5460b0J93k90J17L5j63L06j38r5K77j47j34pJ13j62P6j95M14j00k00L3O5l34J37
5483b19K81r9K70o2k14K97m64Q9OL9L18j90L5M3M2q8L2k52L11j18p6J40O8k44
5507e5j64K39j30N2m2oN1J9j47L72r2k89J00L86k21J46j80O1J57l03J27q7j37
5530a43J33o6J80O1p3j28k09K58r9K23m16J20p0J25K39j96K81o3J78j66n9Q4l51
5553a57L91k23Qj79j34J09M39j40j95L5O4j2K0l4k16Q8m7J43l41L00M7K16l11
5576a29K4kO7J73j11p4J29l7j09K55j35L7k9k61K94j09J67m7j52o9j38K74j47
5599a29j66K42j72L98j23j3l38K88J63r9j82J30N3j19k06R5K21l3J79q6j85j3
$$ plain form
5437 51 -254 -35 -59 37 -172 -17 268 4 -138 71 223 63 -4 11 64 205 -30 -161 -145 66 82 -7 -20
5460 -20 173 -117 0 35 -128 178 40 -55 222 75 -59 -66 47 -115 -39 -234 180 80 -120 -87 -22 -356 -219
5483 -219 62 -37 233 171 -43 254 -210 -121 -115 -76 242 52 87 130 172 84 116 -136 175 57 -19 121 189 -55
5507 -55 -219 20 -110 -58 -100 -106 -55 -36 -183 189 97 -192 -92 294 73 219 39 100 257 -46 81 -6 -143
5530 -143 -10 -76 104 165 92 -36 -245 13 -86 137 -279 -159 -229 -104 135 -61 220 157 335 169 110 194 -157
5553 -157 234 11 19 -160 -294 -185 254 114 -81 -46 18 6 26 -8 -224 -136 -183 -40 -381 -81 -34 182 -129
5576 -129 -105 -107 -40 133 22 -52 77 40 -69 186 51 88 59 -202 92 -17 150 103 -49 -118 -256 18 -129
5599 -129 -295 -53 -225 173 50 37 -301 -13 150 51 -131 -1 52 -67 -273 -178 43 10 189 103 -82 -95
5621i5K77m5n2N4J3q1j28r2K85k77J59j99M8M53n84N1J71q9K00oL9q3M3lRJ3r4
5648a3r4J0Mj97K67J60j64O0o6L07j13j92K4k14J88J60m17N21j99N3n6j11J81
5671I9K9J07k55m2J43j21K10j56k74K91j03j8J80j00P5K7k89L1RL50j74k35L18
5694A02o8P1j78J16n5k3J46Nj15q2r9Q3j55K76N5j22j04j24M03j73k66K01r6M18
5718B16k16j37J88q7n1l9K24k46Q3q1J46R0j74N0J6o1J14q8J33O0J59m59j70M42
5742A12k56J46K29j95P0k74P3J73j33Q4r3K39j03n8K43k94j19J47R3j32k17M59
5764A94J7Q7k38m5r7J45k39J41J5j9lQ4J9O7j27K59k11r5j80J10L40n17K29N5
5788iO0J9K31k01K7j82J74k29K71r6Kj86J8pJ34j94K79j34J5r2mR4l0l4J28j86
$$ plain form
5621 -95 182 137 85 139 152 71 -57 -149 136 -141 18 -181 -133 320 -264 -213 -42 -131 69 63 102 19 62 59 68 81 -13
5648 -13 -107 -97 -93 -290 -23 137 -27 33 -33 274 161 -31 -7 -221 -33 127 -290 231 32 85 29 -82 99
5671 99 128 235 -20 -62 81 -40 170 14 -260 31 -72 -90 90 -10 65 92 -197 -166 -157 193 19 -216 102
5694 102 34 105 -73 43 -12 -35 111 116 1 -81 -180 -97 -252 24 79 -43 -147 -271 132 -41 -307 -106 -202 216
5718 216 0 -137 51 -36 -87 -126 98 -148 -65 -146 0 90 -84 -34 -18 -79 35 -53 80 140 299 -160 -330 112
5742 112 -144 2 231 36 106 -168 -95 78 -55 29 -64 175 72 14 257 -37 -156 -9 84 -48 -265 194
5764 194 211 298 60 15 -82 63 -176 -35 -20 -39 -42 42 61 128 1 260 49 -46 -226 -116 224 -293 -64 -9
5788 -9 51 70 301 100 127 -55 119 -110 161 65 67 -119 -101 -108 26 -168 111 -23 -8 -100 -104 -10 -40 -74 54 -132
5814a32q8L65J43l35K29P0n00L2J77J79p9k44K04J52l42L14M2R6k54r5K4Q0j54
5837a16J50j55J82J03l40K62J20k19o4K52l76N9K44k89m8K2M92l60J00l52K91
5858d2l9j01m1K95j35K11l1J21j75J15j86J28j27q2L34o16O2L64p1J16Q5j81o
5881bM3J01j30M9o2j95K29J00j2r8J9j5J17j78N4m0j71L10o9j59R0j29K11j66
5905a03l06K26K55j7J56m73L06O8k02L24j03j40J20l20L66j22k37L06p8j29N6
5926d7r8K82K8k67j97K73N6j23j12L01N6M4o8j00O0j35P8j87L85m95K35L19k55
5949C3j99L26m40J40J71K6J1n8R9l04M79j82J7k28K06j65J28m7q2K8K6R4j54M0
$$ plain form
5814 -132 -220 145 288 -47 182 252 -248 -216 -39 140 61 -183 21 173 -169 145 187 283 29 -66 -42 38 -116
5837 -116 34 -121 61 164 -176 86 206 -13 -77 175 -201 -142 102 -187 -235 -213 279 -81 19 -333 -42
5858 -42 -81 -182 -223 72 -63 148 117 238 63 178 -8 120 -7 -89 245 -371 -309 55 -16 100 185 4 -2
5881 -2 41 142 12 61 -1 -196 33 133 121 23 42 27 144 -34 20 -20 -191 119 50 -109 -19 -148 63 -103
5905 -103 -409 -183 72 55 211 -262 44 112 -90 234 131 -9 111 -209 157 35 -202 104 26 -103 -47
5926 -47 -145 137 165 -102 -299 -26 30 -93 -205 96 152 196 128 28 88 -47 31 -156 229 -266 -31 288 33
5949 33 -166 160 -280 -140 31 57 68 10 109 -195 284 102 119 -109 97 -68 60 13 -69 -41 -15 79 -75 -35
$$ [...]
8191a79
##END NTUPLES=NMR FID
##END=
