##TITLE=1H_Pr Hex-Dep
 200.13MHz, CDCl3,
 8 sc
 
 14.8.2025
##JCAMPDX= 6.0         $$ Bruker NMR JCAMP-DX V2.0
##DATA TYPE= NMR FID
##DATA CLASS= NTUPLES
##ORIGIN= UXNMR, Bruker Analytische Messtechnik GmbH
##OWNER= pz
$$ XWIN-NMR		Version 3.5
$$ Thu Aug 14 14:17:41 2025 Russian Standard Time (UT+4h)  she@DPX200
##.OBSERVE FREQUENCY= 200.1313
##.OBSERVE NUCLEUS= ^1H
##.DELAY= (6, 6)
##.ACQUISITION MODE= SIMULTANEOUS
##.ACQUISITION SCHEME= undefined
##.AVERAGES= 8
##.DIGITISER RES= 18
##SPECTROMETER/DATA SYSTEM= spect
##.PULSE SEQUENCE= zg30
##.SOLVENT NAME= CDCl3
##.SHIFT REFERENCE= (INTERNAL, CDCl3, 0, 14.3821)
##AUDIT TRAIL= $$ (NUMBER, WHEN, WHO, WHERE, WHAT)
$$ ##TITLE= Audit trail, XWIN-NMR		Version 3.5
$$ ##JCAMPDX= 5.01
$$ ##ORIGIN= Bruker BioSpin GmbH
$$ ##OWNER= she
$$ F:/spectra/data/she/nmr/H-C/1/audita.txt
$$ ##AUDIT TRAIL=  $$ (NUMBER, WHEN, WHO, WHERE, WHAT)
(   1,<2025-08-14 14:16:30.53 +0400>,<she>,<DPX200>,
      <created by zg, POWCHK disabled, PULCHK disabled
       configuration hash MD5:
       00 E9 B6 7A A2 85 ED C7 34 08 36 98 17 FE 4E 26
       data hash MD5: 16K
       E2 6A 70 7D BD 56 15 75 59 EC 15 B5 E9 4A CD F3>)
$$ ##END=
$$ 
$$ hash MD5
$$ 3F 97 4A 5E 86 6E 04 5A 14 74 71 46 60 87 DA 0F
##$RELAX= 
##$RELAX= 
##$RELAX= 
##$RELAX= 
##$RELAX= 
##$RELAX= 
$$ Bruker specific parameters
$$ --------------------------
##$DU= <F:/spectra>
##$EXPNO= 1
##$NAME= <H-C>
##$PROCNO= 1
##$TYPE= <nmr>
##$USER= <she>
##$AMP= (0..31)
100 100 100 100 100 100 100 100 100 100 100 100 100 100 100 100 100 100 
100 100 100 100 100 100 100 100 100 100 100 100 100 100 
##$AQSEQ= 0
##$AQ_mod= 1
##$AUNM= <au_zg>
##$AUTOPOS= <>
##$BF1= 200.13
##$BF2= 200.13
##$BF3= 200.13
##$BF4= 200.13
##$BF5= 200.13
##$BF6= 200.13
##$BF7= 200.13
##$BF8= 200.13
##$BYTORDA= 1
##$CFDGTYP= 0
##$CFRGTYP= 5
##$CHEMSTR= <none>
##$CNST= (0..31)
1 1 145 1 1 1 1 1 1 1 1 1 1 1 1 1 1 1 1 1 1 1 1 1 1 1 1 1 1 1 1 1 
##$CPDPRG= <>
##$CPDPRG1= <>
##$CPDPRG2= <>
##$CPDPRG3= <>
##$CPDPRG4= <mlev>
##$CPDPRG5= <mlev>
##$CPDPRG6= <mlev>
##$CPDPRG7= <mlev>
##$CPDPRG8= <mlev>
##$CPDPRGB= <>
##$CPDPRGT= <>
##$D= (0..31)
0 0.7 0 0 0 0 0 0 0 0 0 0.03 0 0 0 0 0 0 0 0 0 0 0 0 0 0 0 0 0 0 0 0 
##$DATE= 1755166589
##$DBL= (0..7)
120 120 120 120 120 120 120 120 
##$DBP= (0..7)
150 150 150 150 150 150 150 150 
##$DBP07= 0
##$DBPNAM0= <>
##$DBPNAM1= <>
##$DBPNAM2= <>
##$DBPNAM3= <>
##$DBPNAM4= <>
##$DBPNAM5= <>
##$DBPNAM6= <>
##$DBPNAM7= <>
##$DBPOAL= (0..7)
0.5 0.5 0.5 0.5 0.5 0.5 0.5 0.5 
##$DBPOFFS= (0..7)
0 0 0 0 0 0 0 0 
##$DE= 6
##$DECBNUC= <off>
##$DECIM= 32
##$DECNUC= <off>
##$DECSTAT= 4
##$DIGMOD= 1
##$DIGTYP= 9
##$DL= (0..7)
0 120 120 120 120 120 120 120 
##$DP= (0..7)
150 150 150 150 150 150 150 150 
##$DP07= 0
##$DPNAME0= <>
##$DPNAME1= <>
##$DPNAME2= <>
##$DPNAME3= <>
##$DPNAME4= <>
##$DPNAME5= <>
##$DPNAME6= <>
##$DPNAME7= <>
##$DPOAL= (0..7)
0.5 0.5 0.5 0.5 0.5 0.5 0.5 0.5 
##$DPOFFS= (0..7)
0 0 0 0 0 0 0 0 
##$DQDMODE= 0
##$DR= 18
##$DS= 0
##$DSLIST= <SSSSSSSSSSSSSSS>
$$ [...]
##$SUBNAM0= <"">
##$SUBNAM1= <"">
##$SUBNAM2= <"">
##$SUBNAM3= <"">
##$SUBNAM4= <"">
##$SUBNAM5= <"">
##$SUBNAM6= <"">
##$SUBNAM7= <"">
##$SUBNAM8= <"">
##$SUBNAM9= <"">
##$SW= 18.0517328524113
##$SWIBOX= (0..15)
0 0 2 0 0 0 0 0 0 0 0 0 0 0 0 0 
##$SW_h= 3612.71676300578
##$TD= 16384
##$TD0= 1
##$TE= 0
##$TE2= 300
##$TE3= 300
##$TEG= 300
##$TL= (0..7)
0 120 120 120 120 120 120 120 
##$TP= (0..7)
150 150 150 150 150 150 150 150 
##$TP07= 0
##$TPNAME0= <>
##$TPNAME1= <>
##$TPNAME2= <>
##$TPNAME3= <>
##$TPNAME4= <>
##$TPNAME5= <>
##$TPNAME6= <>
##$TPNAME7= <>
##$TPOAL= (0..7)
0.5 0.5 0.5 0.5 0.5 0.5 0.5 0.5 
##$TPOFFS= (0..7)
0 0 0 0 0 0 0 0 
##$TUNHIN= 0
##$TUNHOUT= 0
##$TUNXOUT= 0
##$USERA1= <user>
##$USERA2= <user>
##$USERA3= <user>
##$USERA4= <user>
##$USERA5= <user>
##$V9= 5
##$VALIST= <valist>
##$VCLIST= <CCCCCCCCCCCCCCC>
##$VD= 0
##$VDLIST= <DDDDDDDDDDDDDDD>
##$VPLIST= <PPPPPPPPPPPPPPP>
##$VTLIST= <TTTTTTTTTTTTTTT>
##$WBST= 1024
##$WBSW= 4
##$XGAIN= (0..3)
0 0 0 0 
##$XL= 0
##$YL= 0
##$YMAX_a= 157460
##$YMIN_a= -194628
##$ZGOPTNS= <>
##$ZL1= 120
##$ZL2= 120
##$ZL3= 120
##$ZL4= 120
##$ABSF1= 10
##$ABSF2= 0
##$ABSG= 5
##$ABSL= 3
##$ALPHA= 0
##$AQORDER= 0
##$ASSFAC= 0
##$ASSFACI= 0
##$ASSFACX= 0
##$ASSWID= 0
##$AUNMP= <proc_1d>
##$AZFE= 0.1
##$AZFW= 0.1
##$BCFW= 1
##$BC_mod= 2
##$BYTORDP= 1
##$COROFFS= 0
##$CY= -3
##$DATMOD= 1
##$DC= 2
##$DFILT= <>
##$DTYPP= 0
##$F1P= 0
##$F2P= 0
##$FCOR= 0.5
##$FTSIZE= 0
##$FT_mod= 4
##$GAMMA= 1
##$GB= 0.15
##$INTBC= 1
##$INTSCL= 1
##$ISEN= 128
##$LB= 0.25
##$LEV0= 0
##$LPBIN= 0
##$MAXI= 10000
##$MC2= 0
##$MEAN= 0
##$ME_mod= 0
##$MI= 1.114404
##$NCOEF= 0
##$NC_proc= 0
##$NLEV= 6
##$NOISF1= 3.799351
##$NOISF2= 2.8
##$NSP= 1
##$NTH_PI= 0
##$NZP= 0
##$OFFSET= 14.38212
##$PC= 1
##$PHC0= -1558.905
##$PHC1= 11.19228
##$PH_mod= 1
##$PKNL= yes
##$PPARMOD= 0
##$PSCAL= 0
##$PSIGN= 0
##$REVERSE= no
##$SF= 200.129724274929
##$SI= 16384
##$SIGF1= 3
##$SIGF2= 2
##$SINO= 400
##$SIOLD= 16384
##$SREGLST= <1H.CDCl3>
##$SSB= 0
##$STSI= 0
##$STSR= 0
##$SW_p= 3205.1282051282
##$SYMM= 0
##$S_DEV= 0
##$TDeff= 0
##$TDoff= 0
##$TI= <>
##$TILT= no
##$TM1= 0
##$TM2= 0
##$TOPLEV= 0
##$USERP1= <user>
##$USERP2= <user>
##$USERP3= <user>
##$USERP4= <user>
##$USERP5= <user>
##$WDW= 1
##$XDIM= 8192
##$YMAX_p= 0
##$YMIN_p= 0
$$ End of Bruker specific parameters
$$ ---------------------------------
##NTUPLES= NMR FID
##VAR_NAME=  TIME,          FID/REAL,        FID/IMAG
##SYMBOL=    X,             R,               I
##VAR_TYPE=  INDEPENDENT,   DEPENDENT,       DEPENDENT
##VAR_FORM=  AFFN,          ASDF,            ASDF
##VAR_DIM=   8192,          8192,            8192
##UNITS=     SECONDS,       ARBITRARY UNITS, ARBITRARY UNITS
##FACTOR=    0.0002768,     1,               1
##FIRST=     0,             0,               0
##LAST=      2.2672688,     0,               0
##MIN=       0,             -194628,         0
##MAX=       2.2672688,     157460,          0
$$ Real data points
##PAGE= N=1
##DATA TABLE= (X++(R..R)), XYDATA
0@%%%%%%%%%%%%%%%%Qj6J6j6J6j8K6l2L3m1M8n6O5p3Q5r7J10j24J40j58J77j99
38a06K23k49K76l04L39l78M19m63N10n60O17o81P51q28R10j003J111j230J364
57G18j518J699j915K173k489K887l409M128n180O877j0059J8032p7649j28923
71a94628J69550J39964p9890r9292K7460M8736N11j4501K4442m8536m1343M5050
83b2477O2540k425o7079k7778M6761L6873k5883k7875J3818P871P417P504J3016
96B2283j8482l5488L4805L5669l9530k8937M4151K8374m4980k4899M4191K1736
108C8893n4976j2883N2475k455l4706J2921L2806j6286m1414J7723M4894j9373
120A7619m7026J8044M4809m015m4759j4157M3392J0816m5799p225L8277R455l1712
$$ plain form
0 0 0 0 0 0 0 0 0 0 0 0 0 0 0 0 0 0 8 -8 8 -8 8 -10 16 -16 17 -24 24 -32 33 -40 45 -52 58 -66 74 -84 93 -106
38 -106 117 -132 144 -160 179 -199 220 -243 267 -293 324 -357 394 -434 476 -527 584 -646 718
57 718 -800 899 -1016 1157 -1332 1555 -1854 2274 -2906 3971 -6088 11944 -65705 -194628
71 -194628 -25078 114886 34996 -64296 -36836 11900 12411 -2090 22352 -26184 -67527 -22477
83 -22477 40063 37638 -29441 -57219 -10458 26415 532 -27343 -13525 -5654 1763 9267 22283
96 22283 3801 -31687 3118 38787 -743 -29680 14471 42845 -2135 -27034 17157 38893
108 38893 -16083 -28966 23509 21054 -13652 -731 32075 15789 -25625 -7902 36992 17619
120 17619 -29407 -11363 33446 29431 -15328 -29485 13907 24723 -21076 -28301 9976 19431 -12281
133a2281j2303K8930P322l1298l24K7163o104j0407J1664K125j4930l874K1678
146G361L409l0345M02L2550r79k2943R9J1152n32j0624P465J8220j3424k0739
160a8928J6867K5526m031k9841j1679K8901J9637j7665j4063L540L705M385N559
173A1913j49j8438j6712K5263K8772k1203k8762Q322K1591K623j4856l684N153
186a67m229M379J3318p825j4549j38Q781P246o236r456L151L333J459K466n370
201c837m678J867L792O983l225j0963O443J1084n090r672J614J1983J1j3518K749
216d457J2067n404o505L658K130j831j930L991L478o964j161P915r22l194N68
231A439k46K813p4k627L224j038n099J697L232n0m475m648O942M541p886k030
$$ plain form
133 -12281 -24584 4346 11668 -19630 -19954 7209 1105 -9302 2362 4487 -10443 -14317 7361
146 7361 10770 -19575 -19173 13377 12398 -10545 -10446 706 174 -10450 -2985 15235 1811 -18928
160 -18928 -2061 23465 19434 -10407 -22086 6815 26452 8787 -5276 -1736 1969 6354 11913
173 11913 11764 -6674 -23386 1877 30649 9446 -19316 -10994 10597 13220 -1636 -5320 -167
186 -167 -4396 -17 13301 5476 -9073 -9211 -430 6816 580 -8876 -5725 -2392 -933 1533 -3837
201 -3837 -8515 -6648 -2856 4127 902 -10061 -3618 7466 2376 -7296 -5682 6301 6312 -7206 -4457
216 -4457 7610 2206 -4299 -641 1489 -342 -2272 1719 5197 -1767 -2928 4987 4065 871 1439
231 1439 1193 4006 3932 1305 4529 3491 -1608 89 3321 3271 -1204 -5852 1090 5631 -2255 -4285
247d285M315N55r70r84J383J021l609K550L811n254j086K760n30n71j017J60J431
264c20k626r59M232r66j940m93P96M085n10m059K590K388j366L79l17k08K89j112
282a17K089m3m106J872K570k601J0M90O04O26k184J482K159k114p15J623K09L44
300B198j777r90L439j719k511J889l27o36n4j440J529mj955K340j92k130J896
317d44Q22o47J54j317J514J456k603L47R46r48P28q02k95J191j443m63K076q47
335e75m50M28R6J467j36j020J396n47l87J866j386p29Q44m72L41K43j642J236
353E73J42j205O19o02P2J567j238O2J035j550J028O89r31l7L23n14O33j226j32
372f92J437j650N4Q61r80j5K04k39J158o52l80Q73l95K28Q45j182M96O69j119
$$ plain form
247 -4285 30 585 -385 -1369 14 1035 -2574 -24 3787 -1467 -2553 207 -323 -894 -1911 -1751 -320
264 -320 -2946 -3905 327 -639 -2579 -3072 -2276 1809 1299 -2760 -170 2218 852 1231 914 706 995 -117
282 -117 1972 1929 -2177 -305 2265 -336 -326 164 768 1394 -790 692 2851 737 22 1645 1854 2198
300 2198 421 -569 2870 1151 -1360 529 202 -434 -488 -1928 -399 -403 -2358 -18 -210 -2340 -444
317 -444 378 -269 -115 -1432 82 1538 -1065 -718 228 -720 8 -794 -1089 102 -1341 -1804 272 -575
335 -575 -1025 -597 -501 966 830 -190 1206 659 272 2138 752 23 867 395 736 979 -663 573
353 573 715 -490 129 -473 -401 1166 -72 -10 1025 -525 503 1192 261 224 547 33 666 -560 -692
372 -692 745 -905 -851 10 -970 -985 -781 -1020 138 -514 -894 -21 -416 -188 657 -525 -29 640 -479
391d79Q56L00j270K77q1N36O86j502M1P56j048J269Q21j873N32Q15J44N08j166
410A22k05Q75n63O78K21j698Q16P59j191K31j22n73K84j50M10N60p29J74N39j146
430g08R36P01j229O6J3R67M01j230m24q3n70J388N4j612L21P94q2K19l98l62J76
451f62J49J253O21j652L09R86n74K03r26n71J233k4L1l78n22O42J5j189Q56O00
471D00q01K40O48M10q7j053L00O23p27K20L95q30N83L67j063J77l03l37K51L57
491b30Q97n00j749J803O99j172m28L73J39J185l57k34n92q35J194M57j301j32
509g83O70k65Q17P8j098n46J19J906k48j410P61J341j277J2N48q94r9O10qp4q2
530G8N66m70j353J068M67r98L67N35m36K57M11M25j137n86R40N04m00K79l00p44
$$ plain form
391 -479 377 677 -593 -316 -397 139 825 -677 -636 120 -928 341 1162 -711 -179 636 780 1288 122
410 122 -83 792 229 907 1128 -570 246 1005 -186 45 -77 -650 -366 -516 -106 454 -275 -101 438 -708
430 -708 228 929 -300 -234 -221 746 1147 -83 -507 -590 -1160 228 282 -1330 -1009 -215 -297 -78 -476 -838 -662
451 -662 -513 740 1361 -291 18 1004 430 633 -293 -864 369 345 376 -2 -524 118 133 -1056 -200 400
471 400 -401 -161 487 897 810 -243 57 680 -47 173 568 -262 321 688 -375 -198 -501 -838 -587 -230
491 -230 667 167 -1582 221 920 -252 -680 -307 -168 1017 660 426 -166 -1001 193 650 -651 -783
509 -783 -113 -378 439 517 -581 -1127 -1008 898 650 -760 1 1342 65 77 625 -269 -368 242 234 160 78
530 78 644 174 -1179 -111 356 -642 -275 260 -176 81 492 917 -220 -806 134 638 238 517 217 -527
550e27P80L79m67j240K30P15L72p82P94l43q55J068L04j020l7J018o3J1j84L37
570D90n30n78Q36K29j233Q53M22q12J78L06O5o80k82J217K5n64N53N2j018O98
590B27J58o72K47J15J96j75k33L66p7o89O46Q8q15N43P49k31m61j27j1Q5oN62
612D85n53k77P66M06j174j06M31J57l12J03L79l47l81O93K21j124M20M15l22L36
632B16j62K78k67j01K61l56k37M99J58l92J07K7m75K19K70j66j61J32O88k78m88
653b28N63m7m02L62k61N3j48N93p4o04k82L86j46M8J29l12o2N32j00M6L1j28K12
676A61k07L6J07Q1j45J54Om55L06j32J04L2j03P1j09K18l65M30o84K07M09j47
698b5j8J73l0j38k05K98J38j15j55K36k22J84j05j63J6l6J61k18L10j42J78l03
$$ plain form
550 -527 253 632 165 -1075 -845 -130 242 -540 254 -89 -944 124 428 -592 -629 389 326 337 153 490
570 490 -40 -618 218 447 -786 67 489 -323 -145 161 226 -454 -736 481 506 -58 495 547 -471 227
590 227 385 -287 -40 75 271 96 -137 229 152 -537 109 197 -618 -75 674 443 -18 -145 -156 -71 -77 485
612 485 -68 -345 421 827 -347 -453 -22 135 -177 -74 305 -42 -423 270 491 -633 -213 202 -120 216
632 216 54 332 65 -36 225 -131 -368 131 289 -103 4 31 -444 -225 45 -121 -282 -150 538 260 -228
653 -228 335 288 -114 248 -13 40 -108 485 411 -193 -475 -89 -235 -187 -58 -370 -432 100 0 46 77 -51 161
676 161 -46 -10 97 178 33 187 193 -262 44 -88 16 48 -55 16 -93 125 -240 190 -494 -287 122 -25
698 -25 -43 130 100 -38 -243 55 193 78 -77 159 -63 121 16 -147 -131 -167 -6 -224 86 -56 122 -181
720a81J89m3j60L40P5K6n12K78J57p1k22N42m30k02k3K30k84J38N9o8L27k15j20
743a70K44M2J03Ol60L50k00k37K86j62J51k50K53L1k16L6O3K44m52L69jL4k08
766d4M1J29j5Q4J44k43l47K03n6J11oj9M9m6j69J64j5j69K12l4j23R1O4l29K77
791d6r3J80m7P7j5k33nL27k38j16J13J14k4J41k01O7j33J86M2J44k13J23j66n1
815f7K33k18R4K63k63j25j8N5j04K53r3L7l3J06J70k61M0j03J15p5J50j2k9j99
839h4j39L47j17L4P1j64Q3q0J8k26K31j82M22n17L94N0l14J06o8J61K0o1j03P0
863d8J20o3J30k27J7J73k82K9j3OJ33L4j37L11j05j02J89N7j81M1J6p8J10p2k96
888b38M61l36J27k8p2Q2j13n0L89k98j77J63M3L6n7J00k58K65j45J35J64j02p9
$$ plain form
720 -181 8 -35 -195 145 220 246 -266 12 169 98 -124 418 -12 -214 -237 -7 -291 -153 -94 -162 165 -50 -170
743 -170 74 116 219 225 -135 215 15 -222 64 -98 53 -197 56 87 -129 -93 -30 214 -238 131 130 164 -44
766 -44 -3 126 111 195 339 96 -251 -48 -104 7 1 -18 31 -15 -184 -20 -35 -204 8 -26 -149 -58 6 -323 -46
791 -46 -139 41 -6 71 56 -177 -182 145 -93 -209 -96 18 -6 135 -66 1 -132 54 96 240 27 150 -16 -67
815 -67 166 -52 42 305 42 -83 -101 -46 -150 103 10 47 14 120 290 29 69 -34 81 6 156 144 115 -84
839 -84 -223 124 7 41 112 -52 31 -49 -31 -257 -26 -208 214 -303 91 141 -173 -67 -135 26 46 -15 -118 -48
863 -48 72 9 139 -88 -71 102 -180 -151 -164 -158 -25 9 -128 183 78 -24 165 222 41 82 98 20 130 58 -238
888 -238 223 -113 14 -14 -86 -4 -117 -167 222 -76 -253 -90 -47 -11 -68 32 -226 39 -106 29 193 91 12
911A2j61J08R2j48J96l35K64n5j43M34k64l0R8J09m18J04j90L70J45k15j58K09
933B4j66o2L7J2R2M02l36J19j00n4L1RJ76r4j4m4n6J75j28J55r4p3P4%k00J80
959F5J08l23K90j76K66k41k8O7k22J43K8j18K66j16K89j78n3M6j02J9j85K54k28
982a29O3r7J08J85p3O9k89K73m3q7j22J67O9n5M2l9o5L5j02J65j82j6J66j62o8
1007a87J47N50p44K36j85K73k02J84R1l88K71l0j3l19J31K47p0n5J72k44M28j00
1029A93j86J26m12k0K12rK21mk54p8K0MN61k99k6M3j23L28o54K74L6K82o3j45
1053B7k1j84J48l2n3K22L8l3O8j65K05k49N8K9p9R6J14j07j54j19R5J16rn0m4
1078h3K90k72k9J58j40J24r1K39j74J2J26j45k0K04j74j04J25k07K1L37l07K15
$$ plain form
911 12 -149 -41 51 -97 99 -236 28 -27 -170 264 0 -30 68 177 -241 -137 -327 43 188 -27 -185 24
933 24 -142 -204 -167 -155 -63 339 3 122 22 -32 -1 8 184 90 76 32 -24 151 23 178 84 11 85 85 -115 65
959 65 173 -150 140 -36 230 -11 -39 28 -194 -51 -23 -141 125 9 298 120 67 113 11 30 -155 99 -129
982 -129 -66 -163 -55 130 57 126 -163 110 67 -20 -142 25 94 39 81 42 -23 12 -90 75 -107 -123 43 -119 -187
1007 -187 -40 510 -234 2 -183 90 -112 72 163 -225 46 16 3 -316 -185 62 -8 -63 109 -135 293 193
1029 193 7 133 -279 -299 -87 -96 125 121 -133 -211 -191 -187 374 75 49 92 -31 297 -357 -83 -47 235 172 27
1053 27 6 -178 -30 -62 -115 107 145 112 180 15 220 -29 29 58 -21 75 189 82 -72 -191 -96 20 11 -39 -83
1078 -83 207 -65 -94 64 -76 48 -43 196 22 34 160 15 -5 199 25 -79 46 -161 -140 197 -110 105
1100A05N0j69K48l7p9k05L01l22n2K25k54Q7L02j77K83j44k21Pmk4K18k49J65
1123E4j79J22J76k43J53r3J62J9j13o2k95M72P1l0l41k03M17j54J02J40kk22P2
1146B3Np7o8J28k05J61K05k18q7K21q1o9l5n7J9J54n0K2K80j84o3j56M6K02L3
1171A49l8j52j8J1K7J66R1l52J31J42n9j84K95j57M4J25l61K35K7q6k29L39l34
1194a88J05J16k1m3kJ52j63l6M0l1O5r6K70j98K3K25j70n2J9Q0k23L43L2j26m5
1219G6O5j75j34O3j82J94J10P4p9J47j88L21j93n29K52L25q8k31L75r6l5j20J87
1242A39j05j63K3J77R1O9r3l24L99k26j4p2K18j47j38L38k64r0N9J29j47N6L45
1265B60l11J18k72K13pl6L4J05J19k96L74k46k50J00j36O4K82j02j04R8j32M2
$$ plain form
1100 105 155 -14 234 197 118 -87 214 -108 -160 65 -189 -102 200 23 306 162 -59 -52 -56 -80 138 -111 54
1123 54 -125 -3 173 -70 83 -10 152 171 58 -4 -299 173 244 214 -127 -330 87 -67 35 175 173 -49 23
1146 23 28 -49 -117 11 -194 -33 172 -46 -133 88 7 -62 -97 -154 -135 19 -31 -9 271 87 24 -132 -86 116 149
1171 149 111 -41 -59 -48 -21 145 236 -116 15 157 98 -86 209 52 96 221 -140 95 122 36 -193 146 -188
1194 -188 -83 33 12 -31 -33 119 -44 -80 -40 -71 -6 -102 168 -30 -7 218 48 -4 15 95 -128 215 247 121 76
1219 76 141 -34 -168 -105 -287 -93 17 91 12 159 -29 292 99 -430 -178 147 59 -172 203 107 72 -48 139
1242 139 34 -129 -106 71 162 231 138 -186 213 -13 -27 -99 119 -28 -166 172 -92 -182 -123 6 -141 -85 260
1265 260 -51 67 -205 8 1 -35 -1 104 223 -73 301 55 -195 -95 -231 -167 115 13 -91 7 -125 -83
1287h3O7J09l04J05P7JK0j3J84k34J81p8J14r7p1J71k67J47M4j01O3J08J5m5j
1312A12m6p3J05j53J88K32n45J43m2R6KJ4l3J2q3K04j66k32J27K79j01Mol3j30
1337a25K69k05J67j15J77m82L40K8O7P5k42O2o6R7j37J99j58j5M6L75k51m5J16
1360A77m5k42K85l00oQ9j49Lj83M71J62k69pj90J62q9P8k66M29k05L6M7m6j30
1384a88K70j76o1q4L13k67N9K73k1O4l76Q3J74p1R3l53L81j26P8J04j89O3K05
1407B48k80j46L18n4M4j33K33p9k23Q1rj9J50m0M8j35k04L60j17L6J9M9m3k04
1431a00N7J09r8n7O7O0l8p0J65o1j60K0J18J55O3j10j77K6J58k61R5J59j48K7
1455an0J93p0j17K44j92m5p2q2K51j64J21p4n1J5M4k71N78l73Q5J22Q6j46Q0k2
$$ plain form
1287 -83 -16 93 -211 -106 -29 -28 -8 -21 163 -71 110 32 146 49 -22 149 -118 29 73 -28 35 143 158 113 112
1312 112 66 -7 98 -55 133 365 -180 -37 -79 17 19 33 0 12 -71 133 -33 -265 -138 141 40 44 38 5 -125
1337 -125 144 -61 106 -9 168 -314 26 54 121 196 -46 16 -50 47 -90 109 -49 -64 -18 357 106 61 177
1360 177 132 -110 175 -125 -131 -42 -191 -188 -371 100 262 -7 -14 -204 -42 -131 -53 -319 110 -95 -59 -12 -58 -188
1384 -188 82 -94 -155 -239 74 -193 -134 139 118 182 -194 -111 63 -8 85 -268 113 -13 65 169 -20 43 248
1407 248 -32 -178 140 86 130 -3 230 151 -72 9 0 -19 131 91 139 4 -200 160 43 79 98 147 104 -100
1431 -100 -43 66 -32 -89 -22 38 0 -70 95 34 -126 -106 12 167 230 120 -57 -31 127 -134 -39 120 -28 -1
1455 -1 -51 142 72 -45 199 7 -38 -110 -192 59 -105 16 -58 -109 -94 -50 -321 257 -116 -31 91 177 31 111 89
1480H9q2K3o2L3j93J47N1J86k13J4m8r3k28L25R6l1n3n7Q2J64k00J60Q0m00J81
1505b9j46J93J94m21r2kK35J65k0n5l17K37k66O5J19O4J22k60J71P9nK21k64O4
1529E2J39l45K34j57J43N0o0o7l07Q1O4J62J8j10L02j70J66m75J43K85n1j89Q3
1552ij17k26M79p4j19J89j18R4l56L04o4m7J10m32L50L19m38n6J1kL94k30m8Q2
1576dJ25k98K96l38L37o3j59K25l68L07o5K6P0j59L39Rk37l9O6j97K92m66j14
1599d15M63J48j92o3p6K75j21j35J44r9J93k41Q8j99K98J2k25M06k90kk3o3J06
1622a1lJ65mj19j79L67l99K69j64J73j09M8n1J74j19R2j45l0K04j25K55j21j62
1645Fk44R9J60r3j8J60O6M6J00j78l06K34k4k09Q9N32m21l1rK55l68N4M57k22
$$ plain form
1480 89 7 30 -32 1 -192 -45 6 192 -21 -7 -55 -148 -376 -51 45 14 -39 -96 -14 150 -50 110 190 -210 -29
1505 -29 -175 18 212 -209 -301 -303 -68 97 77 22 -295 -58 -324 -259 -140 -76 46 -214 -43 36 31 252 -12 52
1529 52 191 -154 80 -77 66 116 56 -11 -318 -237 -173 -11 7 -103 199 29 195 -280 -137 148 97 -92 -9
1552 -9 -126 -352 127 53 -66 123 5 99 -257 47 -17 -64 46 -386 -36 283 -155 -211 -200 -202 192 -38 -86 -4
1576 -4 121 -177 119 -219 118 55 -104 121 -247 60 -5 21 91 -68 271 280 43 4 70 -127 165 -301 -415
1599 -415 48 196 4 -59 -135 140 19 -116 28 -71 122 -119 -31 -230 68 80 -145 261 -29 -31 -54 -117 -11
1622 -11 -14 151 147 28 -151 216 -183 86 -78 95 -14 34 -17 157 38 130 -15 -45 159 34 289 168 6
1645 6 -238 -139 21 -72 -90 70 136 182 282 104 -202 32 8 -201 -112 420 -1 -32 -41 214 -154 -100 357 135
1669A35k64K06j04J47l72M04M5j01j55j53L22l0p8Q9k16L34l08J04J06k27L58
1690B42m40K88K8l79P1K15K67o3k03K4L6J25l45J29P5k40J50k03J86J78Kk29j84
1713b70L87o0r0JJ70L1l5j28JJ6k20K86j15p8j11K9L32m53M59k65P8K45l10K06
1737A06j06j96K04O0r7r1J89p8K75r1k94M31m19J48J10j40k87L21J35K80l17k6
1759A17J25k43K36m00L00Oj66O6k55P8L25q0k52L34l27K24O6k86K83j22j83L44
1781A90k01n1PK34l51L90r3r7L1p2qJ26j11Kj34K08j10K3K51j25Lq1j80%J30J55
1807A36J1j19j2p2m4M4n6K48l44K89L4l19K75j01J44l08M27r2j14p5J54N9l77
1830b12K75M0l83N19k25j38K69Qk81N0n1K70q8r8p2j38K50j79N31k47Q5l02Q7
$$ plain form
1669 135 -129 77 -27 120 -252 152 197 96 -59 -212 110 80 2 91 -125 209 -99 5 111 -116 242
1690 242 -198 90 118 -261 -190 25 292 229 26 50 86 211 -134 -5 70 -170 -20 -223 -37 141 143 -86 -270
1713 -270 117 57 -33 -32 138 169 134 6 7 23 -197 89 -26 -104 -215 -186 146 -307 152 -113 -35 210 -100 106
1737 106 0 -196 8 68 -29 -120 69 -9 266 175 -119 312 -107 41 151 11 -276 45 180 460 143 117
1759 117 242 -1 235 -165 135 141 -25 41 -214 -136 189 109 -143 191 -136 88 154 -132 151 29 -154 190
1781 190 -11 -62 -55 179 -172 218 125 28 59 -13 -21 105 -6 -4 -138 70 -40 -17 234 109 112 31 -149 -149 -19 136
1807 136 147 28 16 -56 -100 -56 -112 136 -208 81 115 -204 71 -30 114 -194 233 141 27 -48 106 165 -212
1830 -212 63 103 -280 239 14 -124 145 153 -128 -78 -129 141 53 -45 -117 -255 -5 -184 347 100 185 -117 -30
1853c0K56j31j33K5K5n3n9N3K5j1j86M1K85k34L28L6q2R4j55n4Q0q2J13Q8q9q7
1879F3m70J87L63q3n5j42J9j45K12k4j14M25n06L33LK87k27j03n9Q7L04l05R4
1902A44j9n5k54O2j33K98J8R0j85p7k33K23K28m10L80O8j47j10M15j48j72k7m6
1925i0L93k77K16k68qJ04l47K74P3j13K15L8l81K14o6j85R3Q6q3J20j89K31j29
1948g9nj25J75J67m3M2l06J18j26J67k00O2Q9J35m55M64k39L92l6k10QJ75P2k01
1972D1j28J03k21J35l21M41J35n13J52K2K09k17O1m1J18l7J47q1j15j17J18L19
1994B10l80J65k19P4OJ54k6L8J84k85j40N28j12k02J38l27K28p9L9j3J66k50m8
2017a51P9L3L03k96K37l20L16q0r8Qk00L13r0N0j19L42j56p3p0K3J5PM7k56M65
$$ plain form
1853 -30 226 95 -38 -13 12 -41 -100 -47 -22 -33 -219 -178 107 -127 201 237 155 249 94 40 120 38 151 239 150 63
1879 63 -407 -220 143 60 5 -137 -118 -263 -51 -75 -189 236 -270 63 66 353 126 23 -36 51 355 50 144
1902 144 125 70 -184 -122 -255 43 61 151 -34 -111 -344 -121 107 -303 77 145 -2 -112 303 155 -17 -44 -90
1925 -90 303 26 242 -26 -34 70 -277 -3 70 -43 172 210 -171 43 -23 -208 -115 -29 -112 8 -181 50 -79
1948 -79 -84 -209 -34 133 90 132 -174 -56 -182 -15 -215 -153 -64 71 -384 80 -159 233 197 -13 -5 170 242 41
1972 41 -87 16 -205 -70 -391 50 185 -328 -176 -154 55 -162 -101 -142 -24 -61 86 5 -110 -227 -109 210
1994 210 -170 -5 -224 -150 -144 10 -16 22 206 -79 -219 309 197 -5 133 -194 34 -45 -6 -19 147 -103 -151
2017 -151 -72 -39 264 -32 205 -115 201 121 23 31 -169 144 54 104 -15 327 171 98 28 51 66 73 120 -136 329
2042C29j59j66J68J52m12K46j70j26J20M2m1R1N2K5j41k3p8J15L3m9j91J50R4
2065F1Lk34L51j07L3l10J36K93k79N0K49j74j97J08K0j48J47m7n5R5K00K4j50
2088F9J40j35L1j52P9o4J61k8p7j39J89R5j51j03M9j01K10n0p1K85l34K55l12
2111a54J49J5o9O4n9q1O3K08k89R5J77l03J51rk03J00K76j0k53J57j19K35ML1
2135A76j68mo5L14j80k28Q6M4J3J83k6k50L9O6k50J71J06j38J89R3N8j80k0r5
2159f6J17p1j09K20R2J0p7O8l55J05O7L1j4L0j0j87K42k76K23K3J0l96J80K02
2183E9K25k48P0m11K10L7p7QOj8R9K07k85o8L81k06l6j88J09j55L10n3J53j34
2207ek8J08j24J54k15Pk42J62j8K17j0J08j12p1p6L7R5lJ44kk12L51k28p5Q1j61
$$ plain form
2042 329 170 4 172 324 -88 158 -12 -138 -18 24 -17 74 126 151 10 -13 -91 24 57 8 -183 -33 61
2065 61 64 -170 181 74 107 -203 -67 226 -53 -3 246 72 -125 -17 3 -145 2 -45 -100 -5 195 219 69
2088 69 209 74 105 -47 32 -32 129 101 24 -115 74 169 18 -85 -36 -137 73 23 -48 237 -97 158 -154
2111 -154 -5 10 -59 5 -54 -135 -72 136 -153 -58 119 -184 -33 -42 -245 -145 131 121 -132 25 -94 141 145 176
2135 176 8 4 -61 253 73 -155 -69 -25 -12 171 145 -105 -66 0 -250 -79 27 -111 78 171 229 49 29 -66
2159 -66 51 -20 -129 91 183 193 116 184 -171 -66 1 32 18 48 38 -149 93 -183 40 63 73 -323 -143 59
2183 59 284 36 106 -305 -95 -58 -135 -127 -121 -139 -40 167 -118 -186 195 -11 -47 -235 -126 -281 29 -24 129 -5
2207 -5 -33 75 -49 105 -110 -103 -345 -183 -201 16 6 114 2 -69 -145 -108 -13 -16 128 126 -86 265 37 -38 43 -118
2233a18K00O6k83K91j85Q6K87l95Pj41J69J14q4n6K5LO2l3J08lj11J15nj39J39
2258A19k59L31l02j13M03k36K08j39p7o5r8O1R3m5P0Q9Q0m4K27l99O1J45j31r4
2282a15J64k14K64k02mP8J48l69J50n3N1R3R3j47J25j6J8k08L38j53p5Qq7r4L38
2307A31j19J21k9j60K04j54r1K3Q1j69N8K56Om20L98k06l2J04j3p1O5j47j10K54
2331b0l2J55P0l91K53j63K35k13rl6P2J43r4j52J80J84l74K61o0M1k48K32k49
2354b15K37j41J33J12k85M9j03K41l3o5P0J65l15L51Mj79l9j22K13pP5j93J95
2377A48l05J07K46o8j12j37K9k4M1K9J56m1QM6k4j10j21Q3K0J85k3r1q4K34j53
2402C9j62L65r7P2l80p6N20k73J2J94k53N6J94l89L02k96J34R6lj11J33P9k62
$$ plain form
2233 -118 82 148 -135 156 -29 57 344 -51 -44 -185 -16 98 14 -42 -17 -14 48 15 123 120 9 124 119 -20 119
2258 119 -140 191 -111 -224 179 -57 151 12 -65 -130 -228 -167 -74 -119 -49 40 120 76 303 -96 -35 110 -21 -115
2282 -115 49 -165 99 -103 -107 -29 119 -250 -100 -153 -102 -9 84 -63 62 46 64 -144 194 41 -34 -26 -113 -207 131
2307 131 12 133 104 -56 148 -6 -97 -74 7 -162 -104 152 158 -262 136 -70 -102 2 -11 -82 -17 -164 -274 -20
2331 -20 -52 103 173 -218 35 -128 107 -106 -115 -151 -79 64 -30 -182 -2 182 -192 69 9 50 -198 34 -215
2354 -215 22 -119 14 126 -159 -110 -213 28 -5 -70 0 165 -150 201 205 26 -13 -135 78 71 146 -47 148
2377 148 -157 -50 196 128 16 -121 -92 -116 -75 -46 110 69 77 123 99 -11 -132 -49 -29 156 133 42 -42 192 39
2402 39 -123 242 145 217 -163 -239 281 8 20 214 -39 17 211 -178 124 -172 -38 58 55 -56 77 156 -106
2425a06j84L12n9p3K63l08k04Q9L05l3j09Q3k47K78N6O8p4k5o1l90N05j14r4J24
2449BJ3J89j31o1j58K18k85K85R2j87K91k63l4l2k56L47j38l2K01j41K61j61O6
2472H6Oj83R9J06p5j78K44k06K70l95M59n7L4k65j8q7M1J52n3l4L49l43r0N4r
2497i3R0K2O0k97M66r9l15J72J54o6r6j31p8J26J76J08j72J6r9m32M07J34K00
2520B53m17J54q3R5k34L12j93r7J89J67j43K9rJ32m7l2j88K34N1k00Q7j27L41
2543B74q8J14k29n1j6J62j66p7R4O0k52j3J34P0P5N9k57l5K5L1j94M85j84m2J16
2568I5j4r0L2k08O7q2j68N03j91O0N0l76L50J36jj72Q4j57O4L6k45J64m9j09K41
2593B0J20q7K81k37q1j7q0K72l58J73j83L26k93%q8K06J49k07L27m03N8J15m7
$$ plain form
2425 -106 -290 22 -37 -110 153 -155 -359 -270 35 2 -107 -24 -271 7 63 131 57 32 -29 -419 86 -28 -122 2
2449 2 15 204 73 12 -146 72 -213 72 164 -23 268 5 -29 -61 -317 30 -108 -140 61 -80 181 20 86
2472 86 92 -91 8 114 39 -139 105 -101 169 -226 233 176 210 -55 -73 -160 -119 33 -20 -54 295 -48 -138 -84 -93
2497 -93 -3 19 79 -218 248 149 -166 6 160 94 -2 -133 -211 -85 91 199 27 43 -56 -488 -81 53 253
2520 253 -164 -10 -93 2 -232 80 -113 -210 -21 146 3 32 23 155 108 76 -112 122 173 -27 60 -67 274
2543 274 186 300 71 20 4 166 0 -77 17 77 -175 -188 -54 16 91 150 -107 -142 -117 -86 -280 205 21 -21 95
2568 95 81 -9 23 -185 -118 -200 -368 135 -56 4 54 -322 28 164 163 -9 75 -82 -18 18 -227 -63 -112 -221 20
2593 20 140 53 334 97 16 -1 -81 191 -167 6 -177 149 -144 -144 -232 -26 123 -84 243 -160 -102 13 -34
2616c4P7K62m86K51j31K1Rj72L99k42J51j54p0M49k21l4j22K63j14M7Q0m8k27
2639d6J9q8J56l7m6jM3j5P6L7j46J63j10J76m72K78J1m8K94k96k14L55k45M0J35
2664A9J32l02M72l67P7M8l08L02k58PK31j54K72j82K61k14Jp2K7J09j01j98M08
2687B10k73p0J92J46j25j19o1P6r6j03L02j90J37M4q5Pk28J20J37N3K41m35K28
2710A08k1j27J88l10P2L8J77l32O6J19l75M49r6J19J16j47j87M06m14pL89k58
2732b7j67L20k55K30J28j86j09j6R6J18m7j29nk9K51o3n3j93k89M15Ml7J0Q6j00
2757d7jN4M8J24l06J95J34j11Q1l39J75j23Q1K23j35P1j73J17j56K82l26l6K28
2780F0k23L12n3Ok43J40J5p4q8J24R3J47k86l2j48O9L30l68L1J12K33K0k95J67
$$ plain form
2616 -34 43 305 -181 70 -61 -40 -31 -203 196 -46 105 -49 -119 330 109 75 -47 216 102 149 229 181 -46
2639 -46 -27 -115 41 4 -42 -43 0 -15 61 98 -48 115 5 181 -291 -13 -2 -50 244 -52 -266 89 -156 -116 19
2664 19 151 -151 321 -46 31 79 -229 73 -185 -178 53 -101 171 -11 250 36 37 -35 -8 101 0 -198 210
2687 210 -63 -133 59 205 80 -39 -100 -24 -120 -223 79 -111 26 70 -15 -8 -236 -116 21 74 315 -120 108
2710 108 87 -40 148 -162 -90 -52 125 -207 -141 -22 -397 52 -44 75 191 44 -143 263 -151 -158 231 -27
2732 -27 -194 126 -129 101 229 43 -66 -82 14 132 85 -44 -49 -78 173 110 57 -136 -425 -10 -6 -43 -33 53 -47
2757 -47 -48 6 54 178 -128 67 201 90 171 -168 7 -116 -35 188 53 124 -49 68 -88 194 -132 -168 60
2780 60 -163 149 96 102 -141 -1 14 -60 -148 -24 69 216 -70 -102 -250 -181 149 -219 -188 -76 157 177 -118 49
2804D9r3l23L51P6O4J8p4r1P8r2o4R5L7PJ11l96N3J19R0r6J40k31O2Q7J06j7o2
2831Dj31K19k45R5J95j95J8n6k16L53J09j36o0Q1j56k2P9l4L9J55J0j03J41O0
2855B04q7k14L76r1k88J45k78O1L6J48j96L92m14J68k01L30M5j53nL3l16K22k9
2878a12jL62l82L02l03J93k3qk54K23j31K92m62L23K21l09L2J22k26K85j93k14
2900b63L56N0l36K52K68m54LK57R8k32p5J88k01L00L2q7n0j46j03k79N86j91J71
2923A44r1m7K8j18J33J30k99K58k44J76J52k22k07J74j19L16j91K10r1j98K02
2944I6m2J7j73K63j28j9P0Q7l75L09J49k63J9J43j62J01k4l4k60M37j73o5J4j1
2968b4K82k58j27J90K01j11L2mm76M69k20P1k08K69l77L51k03J19K64m22L03o8
$$ plain form
2804 49 -44 -367 -16 60 124 142 68 -23 55 -37 -101 -6 31 38 149 -247 -194 -75 15 -81 59 -172 -110 -23 83 66 4
2831 4 -127 92 -153 -58 137 -58 -40 -96 -312 41 150 14 -46 35 -121 -143 -64 -98 -59 96 106 3 144 204
2855 204 117 -97 279 188 -100 45 -233 -172 -136 12 -184 208 -206 -38 -239 91 136 -17 -22 11 -305 -83 -112
2878 -112 -113 249 -133 169 -134 59 36 28 -226 -3 -134 158 -304 19 240 -69 -37 85 -141 144 -49 -263
2900 -263 93 143 -193 59 327 -127 -124 133 231 -1 -76 112 -89 211 243 156 106 -40 -143 -422 164 -27 144
2923 144 53 6 34 -84 49 179 -120 138 -106 70 222 0 -207 -33 -152 164 -27 183 92 -106 96
2944 96 54 71 -102 161 33 14 84 171 -204 105 254 -9 10 153 -9 92 68 34 -226 211 38 -27 -13 -24
2968 -24 258 0 -127 63 264 153 185 181 -295 174 -46 25 -183 86 -291 60 -143 -24 240 -182 121 53
2990E3L8J44k25J04k63QL31m97K18J98q2n9m5j10l4O8j4J82N5m5J04j93K2q8J76
3015D6Lp0J07J24n34L05L7K25j15r5P5p9k6j39J49j74J14O0j73N20l11j02P1m20
3039d02L27O1J16%l08L01j98M2j68J98%J53j30L60l77K80n26r6M98k65R1K32k75
3062h6L93j89l86K98p1K24k6JMl39J52K59J21l36n2N9K1J92l00K88m21J32L36
3085B74o26L61K6l39J86J19P4MJ37j36m5k39O50n49K01k26O8K48k29N5K31j27
3107A18k54j59M31k6l02L02J86m82J32R2j70j3K21j2o4l00J74J31o4K86m84K79
3129B2M4j53J64k1k42L89p4r8k18J81j08J29j99K55j42L8J31o1K07j84M9k31O0
3152f2J32j96q3J92l30J83K24j12p1J53J16j39M2k85R1J38r3J14j42K40q3P6r3
$$ plain form
2990 53 91 235 10 114 -149 -141 190 -307 -89 109 27 -32 -77 -187 -221 -153 -167 15 70 25 129 -64 -42 -130 46
3015 46 49 -21 86 210 -324 -19 18 243 128 33 108 29 3 -136 13 -161 -47 13 -160 360 49 -53 18 -402
3039 -402 -75 -14 102 102 -206 95 -103 -61 -229 -31 -31 122 -8 352 -25 255 -271 -367 131 -134 -43 189 -86
3062 -86 307 118 -268 30 -41 183 157 158 162 -177 -25 234 355 19 -33 26 47 239 -61 227 -194 -62 274
3085 274 -352 9 35 -304 -118 1 75 79 216 80 35 -204 446 -103 98 -128 -60 188 -41 14 245 118
3107 118 -136 -295 136 110 -192 110 296 -186 -54 38 -132 -145 76 64 0 -300 -126 5 -59 227 -257 22
3129 22 66 -87 77 56 -186 203 129 31 -187 -6 -114 15 -184 71 -71 -33 98 37 244 60 109 -122 -62
3152 -62 70 -126 -209 -17 -347 -164 60 -52 -123 30 146 7 49 -236 -145 -7 -100 14 -128 112 29 105 12
3175A2n9J24k07k2J39K5J11k50J04j01J49r4J50R3M1k87O1J9R8j03P5j2Q1j48
3199ap2p8J18K47q2k15J19n4l20L06j14P1O1Rj97L16L7j53q4P8J51L4o0Q3k00
3224@k08L51k42Q5rMlJ81k18q2L24k30J2J82k64K54jk8p1Q5j06Q3j62J85j82j68
3250b28M86k06Kj07l7M1O1m17M10k18L77o9j1p6J89q9l00J21NN4J08j99L6pJ84
3275A10p7o5l1n4Q8J7n0K24J4j19J50l52J04j0OJ09j61J65q9Nm4J11K02j12o3
3300G8M3k60K39j56J9J00j43M7p4K42k58kJ5K78r9K59l57j42J85k04J60N2q1k6
3324h5k17J89m9N7mJ30j5j99L0M05l53J74q8K63j68N6P3k49O5r8J37m9P7m3o8
3349b9J55l45N5L02k32j60J19K43J10l79K37N1J74n91M07j63Q7p4q2K72k99J13
$$ plain form
3175 12 -47 77 -130 -152 -13 12 123 -127 -23 -124 25 -69 81 174 215 -72 -11 8 106 3 78 66 147 -1
3199 -1 -73 -151 -33 214 132 -83 36 -18 -338 -32 -146 -75 -14 -5 -202 114 151 -2 -86 -8 143 177 117 200 0
3224 0 -208 143 -99 -14 -23 -19 -22 159 -59 -141 183 -47 -35 147 -117 137 136 108 37 122 16 99 -63 122 -60 -228
3250 -228 258 52 54 -53 -90 -49 12 -405 5 -213 164 95 84 8 197 108 -192 -71 -66 -12 96 -103 -67 -74 110
3275 110 33 -32 -63 -117 -29 -12 -62 162 176 57 207 -145 -41 -51 -45 64 -97 68 -21 -16 -60 51 253 141 78
3300 78 121 -139 100 -56 -37 63 -80 -33 -107 135 -123 -125 -110 168 69 328 -29 -171 14 -190 -30 22 -59 -85
3324 -85 -302 -113 -162 -105 -109 21 6 -193 -163 242 -111 63 -25 238 70 126 199 -50 15 -83 54 5 82 39 -29
3349 -29 126 -219 -164 138 -94 -254 -135 108 218 -161 76 127 301 -290 117 -46 41 -33 -115 157 -142 -29
3371b9n9P4q8K51m04L64m5m2Q9R2n4k93J28Q3j6j48N0J30J4K9k78k68K65L88J2
3396B45k51%o0J41j44j43J53J4k24M55l26P5J25mp7p8J90k63K46J19l11L20k16
3419a4J27p3r5J45J36j28J22j37j32O5q4J6Q8R8q1l22L31J1k44k4N1J74k31K26
3443B5p7j64L41m45L79j99m3L71k22p2J06n2j04L32j20k06N9L44l50J69Q8k05
3465d5P1l7R4l23M54j80k31J83L97k41J95m78O1m6L5J06Jk7N3K9J18m06J61L21
3489B65n80Q6K20j23L30l93L1K80m09K40R6j28J04j12K98k67J21j63Q7J3Q8rj9
3512E6P0j59k95Q4J53r0J86J08j37j21L10j06j15O4n4P0J68k74JJ26QK42j05k26
3536c6P7j1j71N9J6K19k14K24j79J61j67n3J79p2J19r0j18j86M03q8o6l49N91
$$ plain form
3371 -29 -88 -14 -102 149 -255 109 64 22 111 203 149 -144 -16 67 51 -97 -47 83 97 126 -152 -420 -155 233 245
3396 245 -6 -6 -66 75 -69 -212 -59 -45 -269 186 -140 -65 60 56 -21 -99 91 -172 74 193 -118 202 -14
3419 -14 113 40 -55 90 226 98 220 83 -49 16 -68 -52 36 134 53 -269 62 73 -171 -195 -144 30 -201 25
3443 25 -52 -216 125 -320 59 -140 -183 188 -34 -106 0 -52 -156 176 56 -150 -91 253 -97 72 160 -45
3465 -45 26 -11 83 -240 214 34 -197 -14 383 142 337 -141 -80 -126 -91 15 16 -11 42 71 189 -217 -56 265
3489 265 -315 -229 -9 -132 198 -195 -164 116 -293 -53 43 -85 19 -93 205 -62 59 -104 -17 -4 84 75 56
3512 56 126 -33 -328 -244 -91 -181 5 113 -24 -145 165 59 -56 8 -46 24 192 -82 -81 45 53 295 190 -36
3536 -36 41 30 -141 -82 -66 153 -61 163 -16 145 -22 -75 104 32 151 61 -57 -243 160 72 6 -343 248
3559B48m88L27q2j41K04k67K26J2K8N9k11j63J90J38j65J25n8l26J32L69j06J02
3581A53j0j67P1Mj31r2L01p9J09l63J61l3j60K86k78L49l2j42OJ59m5Pj21J27
3605H0N3j47J15o9n5o7Rkr5MJ79J32j34K8P4K3k93L36j36j53J13J20l00K12k65
3630b38L47j71k9M4L4m2k4M9J61k22L20l59PJ67l31K58LJ23k65L1J12Q6q5N2J32
3655A60M0p6P4k84P9j16l8K27j11jj93Q4jL08k34NK31R1%m16K24L3m13J92K7N4
3681e4O0k38K19L59m14k04K71NrK7L62l70K3j0l26K55m0j40L75j41J09q3k43p1
3705b78L7J76L7j5J74j27k46L33j3j6N0j31j46j35L42M5k37J03Mk01M45P9k57
3728B3J95o9j84m1K68k46Q9mj63j8K9J20J3j51J62k75J71J45Mp0j9j4L28k46K71
$$ plain form
3559 248 -240 87 5 -136 68 -199 27 39 67 126 -85 -248 -58 80 -85 40 -18 -344 -212 157 51 153
3581 153 143 -24 47 51 -80 -172 129 50 159 -204 -43 -76 -236 50 -228 121 89 -53 -47 112 67 74 -47 80
3605 80 133 -14 101 32 -23 -90 -81 -83 -178 -174 5 137 3 31 105 128 -165 171 35 -118 -5 115 -185 27 -238
3630 -238 109 -62 -91 -47 -13 -55 -79 -30 131 -91 229 -130 -123 44 -287 -29 -26 97 -168 -137 -25 61 -24 28 160
3655 160 200 124 198 -86 -7 -123 -161 66 -45 -46 -239 -155 -156 152 -82 -77 154 245 245 -171 53 86 -327 -135 -108 -54
3681 -54 6 -232 -13 346 -68 -272 -1 4 -5 22 384 14 37 27 -299 -44 -84 -224 151 10 119 36 -207 -278
3705 -278 -241 -65 -28 -43 131 4 -242 91 78 62 112 -19 -165 -300 42 87 -150 -47 -43 -244 201 280 23
3728 23 218 149 -35 -76 192 -54 35 31 -132 -150 -121 -1 12 -139 23 -252 -81 64 68 -2 -21 -35 293 47 318
3753C18o54N01l10K13k69J31l4P2Q5J73l30L50l69K44Qj62K96m22J53k50M08k39
3775h7j53j14K93N8N0m01L30k30L4K80r7J79k06J0lR0J40k53Q8O6K96k49k01J41
3799F1j97L05j69K9J17k60J67q3M1j88K74k44K79n4O7n9j69L32r5l9j59p1jJ80
3823F4l07P1J14J56j54R5j76n1K58nK1J72k68RR0L4j99L58m89K00j40R9K68j89
3847C1m7J89m61K40m1J66L8m66M63j65J52j59L7K55k03o1J2l26L21R4nR5j04J61
3871B16j27K97m56J53K32n22J76j36L35j20j00J7J28M5j05%J05j60j12k09M12
3892F9l1J1J17m32J07K94p4q5J87l06K48o9o7j01j45J39J08J05j04M5%q1K30m04
3916b39O00o14J42j28L23l54J01J97J00P8k89J76M7J50l06J19m4j4n04L88L9O4
$$ plain form
3753 318 -336 165 -145 68 -201 -70 -104 -32 53 226 -104 246 -123 121 129 -33 263 -159 -6 -256 152 -87
3775 -87 -240 -354 -61 -3 47 -354 -24 -254 -220 60 -37 142 -64 -54 -57 33 173 -80 8 74 370 121 -80 61
3799 61 -136 169 0 29 146 -114 53 -30 11 -177 97 -147 132 78 145 86 -83 249 154 115 -44 -115 -116 64
3823 64 -243 -172 -58 98 -56 39 -137 -188 70 65 86 258 -10 -1 89 123 -76 282 -207 -7 -147 -48 220 31
3847 31 -16 173 -288 -48 -89 77 115 -351 112 -53 99 -60 -23 232 29 -32 -20 -346 -25 69 64 159 55 216
3871 216 89 386 -70 83 315 -207 -31 -167 168 48 -52 -35 93 138 33 33 138 -22 -134 -343 69
3892 69 38 49 166 -266 -159 135 61 -24 163 -143 105 36 -31 -132 -277 -138 -30 75 -29 16 16 -65 165 -239
3916 -239 361 -253 -111 -239 84 -270 -169 28 128 206 -83 93 140 290 -16 103 59 45 -459 -71 -32 32
3938C2L1k21L56j04j57J53p0O7j54R4j15J81j41R9J23k89M31k53R8o2k8Qk17R8
3962d0Q7j80K81l53J93n1l8J21Mkp0J42k28N5r9K46m08J05L18j07J70k78mJ89
3986E3j74J45o2N6n8k43K24J13n8M0J92j88j62L41l99J61m1M6oK0l82L35k20J77
4010i0J60k59J85J5J63k60MK04k85j50K95J27p1l8j31P3K8K09m48L32n9J89k63
4033g0J20L4j44j68K4L85o7j19K39k86k18M74j92j04o4K24N6k48k32M10M7J1k54
4056a42J51j44O4J09j57J42J01k16J17r0K04q9j1p7L27j55q3j30M8J43m9j59J15
4079A9R7q6n3J03J16m31N03j01k94J96j1Q5j06j79P8J32j69Q4Q4o9M6J51j23j60
4103h8K93k71L17k97%J44k72J25pO3j14q4J84j05J9J27m09O82j90j46K38l21j10
$$ plain form
3938 32 63 -158 198 94 -63 90 20 87 -67 27 -88 93 -48 51 174 -115 316 63 161 99 71 79 -138 -40
3962 -40 47 -133 148 -205 -12 -63 -101 20 24 22 -48 94 -134 -79 -178 68 -340 -235 83 -24 146 -132 -136 53
3986 53 -121 24 -38 18 -40 -283 -59 54 -4 36 228 40 -122 219 -180 -19 -60 -14 -20 0 -382 -47 -267 -90
4010 -90 70 -189 -4 11 174 -86 -82 122 -163 -313 -18 109 38 0 -131 -58 -30 179 -269 63 4 193 -70
4033 -70 50 84 -60 -228 -204 181 114 -5 234 -52 -270 204 12 -92 -156 68 124 -124 -356 54 101 112 -142
4056 -142 9 -135 -71 38 -119 23 124 -92 25 -65 139 50 39 -38 289 134 51 -79 -31 112 63 -96 19
4079 19 116 30 -23 80 196 -235 268 167 -127 69 58 143 37 -142 -64 68 -101 -17 67 -2 44 195 72 -88
4103 -88 205 -66 251 -46 -46 98 -174 -49 -56 7 -107 -191 -7 -112 -93 34 -375 307 117 -29 209 -112 -222
4126b22Q9q9K54l08M09K6k42q0L8J22j86K22q8M4L9J49n9k21L29k13O9J67m9l86
4150a86J77k0j29L11j28K9j41L03j22q9j34K78k52J75j66o7l9M61k39k77M04k47
4172i8J20J6j17O7k29J28J0J51j45p8R3M84k57n9l82L86j97L30p2j24r8m6J01
4195a6o8J73q0q9O0r9R2J43k22Mo8M0K87k17M7L31j20o4O9l66J28k42K98k36L84
4220A69k08k17J04L10m5k38L46k81O6j25Q1J43lj88J73j79j2J06j71K36L6k45
4242a42O4M9K80n69K25R6j43qK70L35m20j78J2J72j44L0l0J38J49m3O9k66R3l91
4266c52L55R6j90J87m64J53J83K64k27J11j3L18l67r6K70k45J2l7J16k63J78k0
4288c1j8J65l53L38k8m6K62j93l01K59j3K07p34M98j25L67j04p1j18L4k08J75
$$ plain form
4126 -222 -133 -222 32 -276 133 159 -83 -163 -125 -3 -189 33 -55 -11 28 177 118 -103 226 13 82 249 200 -186
4150 -186 -9 -29 -158 153 25 54 -87 216 94 5 -129 149 -103 72 -94 -161 -200 261 22 -255 149 -98
4172 -98 22 38 -79 -12 -241 -113 -103 48 -97 -175 -82 402 145 86 -296 90 -107 223 151 27 -71 -117 -16
4195 -16 -84 89 9 -80 -20 -119 -27 116 -106 -102 -170 -130 157 -60 -13 318 198 134 203 -163 -35 -277 21 -215 169
4220 169 -39 -256 -152 158 113 -125 221 -60 6 -119 -38 105 102 -86 87 -92 -104 2 -169 67 103 -142
4242 -142 -78 -29 251 -318 -93 3 -140 -148 122 457 37 -141 -129 43 -101 -71 -101 37 186 143 212 -54 39 -352
4266 -352 3 99 -91 96 -368 -215 -32 232 5 116 103 421 54 -42 228 -17 -5 -42 74 -189 -11 -31
4288 -31 -49 116 -237 101 73 27 289 96 -205 54 41 248 -486 12 -113 254 150 79 -39 -5 -213 -38
4310c8k4j0J97k3j19K54k78j0K2l0o4L4J59k4J01R9j32K51m43J8j49P8M9L7J73
4335A28j19Q2j71j08J14l6m9J92O0l6q4Q3j79J00RJ6j76J82n5J5oN2O5j53J95
4360A21j49r3N8q2K49k28J26j62L72m1l02J02o1K42l69L19k47J63j21J09J53j95
4382c6J62j17J27m07J27J95j37N2r4J53J8J77j93m7J88l09O6J3qk04K10R9j28
4405i3J2J8k52K79n4KJ60j87J29J81l30J10J71l22K76j19m7O1J17r0M1K39l24
4428b2R7j37J35j25j1k25K09j05O2J15j37J11j62J21j8q2K92k69K03j01J60P8
4450A89l06PL22j85N5p3qL3M1k9K32k26k26K68Q7J01p0j48J8j14n8N7K38j92J55
4475A68p4k32rL61j24k38j3p4J81k3L50m14K11j79J68M3l1O5J6oq2q4L71k63j74
$$ plain form
4310 -38 -62 -72 125 102 -17 237 -41 -51 -29 -59 -123 -89 70 46 147 246 114 365 -78 -60 -209 -131 -82 -45 128
4335 128 9 91 -80 -188 -74 -110 -159 33 93 57 -27 56 -123 -23 -14 2 -174 8 -47 -32 -38 14 79 -74 121
4360 121 -28 -121 -63 -145 104 -124 2 -160 212 171 -131 -29 -90 152 -217 102 -145 18 -103 6 159 -36
4382 -36 126 9 136 -271 -144 51 -86 -34 -128 25 43 220 27 -20 168 -141 -75 -62 -70 -274 -64 35 -93
4405 -93 -81 -63 -315 -36 -90 -88 72 -115 14 195 -135 -25 146 -176 100 -19 -66 -5 112 22 63 302 -22
4428 -22 75 -62 73 -52 -63 -288 -79 -184 -122 -7 -144 -33 -195 -74 -92 -174 118 -151 52 -49 111 189
4450 189 -117 -110 212 27 82 9 1 34 75 46 278 52 -174 94 181 282 212 64 82 -32 -90 -33 205 13 168
4475 168 94 -138 -147 214 90 -148 -161 -235 -54 -77 273 -141 70 -109 59 102 71 136 152 146 64 -20 351 88 -86
4500h6N7j44J89Np6m3Q4N2J59m22L58l6J15k29j5k00l7L61o9J88m10K02j92K07
4524A8P9l66o6L48j25P2L04l05J53m73L69k7j72L37j12K06j67J46r7j66L1J25
4546A12JJ53o2l50M25l85J27M6j80Ok6L85l03O1j72J47J15j68j7j35J19K99m19
4569b21J63K95k33p9j28L03q5k96M27k38k2L50k67j32M32k60J89k94LJ49P2j16
4591A2k8J05k98m7K24q6Q4J7j19L79l56J34L9Q3k2j66P6l4j88L65k91L4J44O4
4615A25o2Nj76J6K67k78J11p2K21l29J30m9K05j39Q9k21k1J39J17j49nK73l73
4638a76L86k63J08j06L00k79L44k49k23Q8n8j77L69O7j12R6m47J55m1L41K5k08
4660f0J93j60J06J29r3J9j50j3J35J9j18p8p5O6M3n2K23j24p5p1J25j81J69K13
$$ plain form
4500 -86 -29 -173 16 21 -55 -98 -14 38 197 -225 133 97 212 -17 -32 -232 -269 92 23 211 -199 3 -189 18
4524 18 97 -269 -335 13 -112 -40 264 -41 112 -361 8 -19 -191 146 34 240 73 219 122 -44 -13 112
4546 112 113 266 204 -146 279 -106 21 67 -113 -107 -133 252 -51 10 -162 -15 100 -68 -85 -220 -101 198 -221
4569 -221 -58 237 4 -75 -203 100 15 -281 146 -92 -114 236 -31 -163 269 9 198 -96 -93 56 128 12
4591 12 -16 89 -209 -256 -32 -118 -34 -17 -136 243 -113 21 60 143 121 -45 31 -3 -191 174 -117 -83 61 125
4615 125 63 68 -108 -92 175 -103 8 -64 157 -172 -42 -91 114 -25 64 -157 -178 -39 78 -71 -76 197 -176
4638 -176 210 -53 55 -51 249 -30 314 65 -158 -70 -128 -305 64 131 19 115 -332 -177 -218 123 148 -60
4660 -60 133 -27 79 208 115 134 -16 -29 106 125 7 -71 -146 -80 -37 -89 134 10 -65 -136 -11 -192 -23 190
4684A90k32o6J11k07J60J10n3k7k04K54J5N4o0Q9n4qqJ2j61J4j96K13J51m5r3
4709d1n1K90j05K73k60j22n6qJ35j54R3Qj5K63k57k25K56P8j25K46o7q9k13J94
4733D8j66K97ol38J21K8r9l0J83L3j77J83Q1Pj60K87j78M1m6j35N4N2J39j88j36
4758a05q7J74K95l97J25J22r2l30L54k13J66J89k96k33J68J30L8N4j19L6r3j1
4780a25J73J83l6j18rm9l5l68N28m29K36J63j66r0J35j50L14l9j06J32J3j38j08
4803h9K44k48J97j68j42K13K0r4L89l07j01J29l7j28L45k91N2O0n2k06L19j7%
4826H8k28M8r4K88p6k9j74K16K8k65K48k73KJ78K9K15j34J23m45J44N15l28k05
4849a29J33k0j7L1o8m7J91j20Q3p1j60K01QK36j44k51J53j16J38k96K73r0n3j45
$$ plain form
4684 190 -42 -108 3 -204 -44 66 13 -14 -218 36 51 105 45 134 80 72 64 76 -85 -71 -267 -54 97 52 -41
4709 -41 -92 198 93 366 106 -16 -72 -80 55 -99 -6 2 -13 250 -7 -232 24 102 -23 223 156 67 -146 48
4733 48 -118 179 173 -165 -44 -16 -115 -145 38 71 -106 77 158 165 5 292 114 155 109 -26 28 80 219 31 -105
4758 -105 -192 -18 277 -120 5 127 35 -295 59 -154 12 201 -95 -328 -160 -30 8 62 -57 -21 -114 -125
4780 -125 48 231 195 77 68 19 -16 -384 144 -285 -49 114 -52 -142 -7 -157 157 118 12 144 157 19 -89
4803 -89 155 -93 104 -64 -206 7 27 -67 322 15 -86 43 6 -122 223 -68 -16 44 -8 -214 105 88 88
4826 88 -140 -92 -186 102 26 -3 -177 39 67 -198 50 -223 -221 -43 -14 201 67 190 -255 -111 404 76 -129
4849 -129 4 -16 -33 -2 -70 -117 74 -46 37 -34 -194 7 15 251 107 -144 9 -107 31 -265 8 -82 -135 -280
4873b80J71O7L81k84J75j17P8k32k23K70J47m35L24q0J33j84N4M32n59P7L5J67
4895A17o3j19J20j17J66j15r9J65m3j42K19l64K11r7M4NJ8P0j44J55J12p9N5l55
4919b80K50J59q0l08o7L39J5R6k45K64m5k33K57m97K09J08M10o28K96J48p3j25
4941c0j80M53k22k93K59j85J38j06K16kj97J97Mj67p5K65k50j17L34J63k70M37
4963C72o0k15p3M5O8o6j08J43J7r2J16q8j34k4J20Kj3k17R4k65J94K60J23m33
4987b34K70J35j92J10J20l16R8j8J13k56K93k96r2J60R5J51Q9M7l22J26J2JJ62
5010B56k54j99L96j31O7k18K74j85M6j21j52K81J06n14K81K28l26Q8O9P6K51k48
5032G1J02j96p0J85k32N5J72l6N9k68J28Q9p4j6j90L06r2J0J60j23L39l03n3k0
$$ plain form
4873 -280 -109 -42 339 55 230 113 191 -41 -264 6 153 -282 42 -38 95 -89 -35 397 -162 -85 -50 117
4895 117 54 -65 55 -62 104 -11 -110 55 12 -130 89 -275 -64 -161 -117 -112 -94 -24 -168 -13 99 20 75 -280
4919 -280 -30 129 49 -259 -326 13 28 124 -121 143 98 -135 122 -375 -166 -58 352 -276 20 168 95 -30
4941 -30 -210 243 21 -272 -13 -198 -60 -166 50 48 -149 48 52 -115 -190 75 -175 -292 42 205 -65 372
4963 372 312 97 24 69 137 71 -37 106 123 31 147 59 -75 -99 21 23 10 -207 -113 -378 -184 76 199 -234
4987 -234 36 171 -21 89 209 -107 -9 -27 86 -170 123 -173 -265 -105 -10 141 230 277 -45 81 93 94 256
5010 256 2 -197 199 68 135 -83 191 6 52 -69 -221 60 166 -348 -67 161 -165 -77 -8 68 319 71
5032 71 173 -23 -93 92 -140 -85 87 51 110 -158 -30 59 -15 -31 -221 85 -7 3 163 40 379 76 23 3
5056CQ9k63N16l37m9K49r4q4K02k43n4J04m92M71l51L78k81M05k02K3pj18J28
5079gQ0J0Q0j94J72j2j92J99K65m61J31r3nk4j38J33p5P5j6J07J5k72J62k5K7
5104e8J60k71J56j2l8L3KN7m0J04l27L60M8k31k7p6L74j53J5k91L68j69j50P9
5128h7J30j33J93kQ0o8n7J3m2L9m5j23J68M0j57Q3J07J72l61P6q8J65j95J79J3
5153A00p6p5J69k81l7J66j5P2l7Kk75M33J11m57n0J37o3P5K94j65J57r4j49q1
5177a39p3K67j70K84j01o2PM3j63j19L36m01J17P4K98l62J88J53l81J35L5L3l3
5200c4J82k33r0J43R2j18r4m05L99R3M6m3l1K21l6o1QN6j01o0L3m2J02r9J46q3
5226im7L3O4r7j1J87LK8k19K01k88J72n3J81p2L5q6L4L29k28j22j30pJ72k1n8
$$ plain form
5056 3 92 -171 345 8 -41 208 114 30 232 -11 -65 39 -453 18 -333 45 -236 169 -33 -10 -17 -135 -7
5079 -7 73 83 163 -31 141 129 -63 136 401 -60 71 -22 -27 -51 -189 -56 -131 -56 -72 35 50 -222 -60 -85 -58
5104 -58 102 -169 -13 -25 -63 -30 -28 29 -11 93 -234 126 174 -57 -84 -160 214 61 76 -215 153 -16 -166 -87
5128 -87 43 -90 103 101 181 113 56 69 27 66 21 -102 66 106 -51 32 139 311 -50 26 -62 103 -92 87 100
5153 100 24 -51 118 -163 -200 -34 -49 23 -14 -12 -287 146 257 -200 -250 -113 -176 -101 193 28 185 91 -58 -139
5177 -139 -212 55 -115 169 68 6 13 56 -107 -226 110 -291 -174 -100 198 -164 24 177 -204 -69 -34 -1 -34
5200 -34 148 -85 -175 -32 60 -58 -152 -557 -158 -65 -19 -62 -93 128 92 31 39 95 -6 -66 -33 -75 27 -72 74 -9
5226 -9 -56 -23 41 -56 -67 120 123 151 -68 133 -155 17 -36 145 73 108 22 56 385 157 35 -95 -102 70 49 -9
5252iJ65j57pJ69J21j96m0J66k78M0jm8K94k36K8K13r0p8O0J56pl52J25m6l3J26
5278H5m12Q6M34k04L0j13K63p2j77M76l70J5K1R2j46%l03L81j44K03n4p5%L5J04
5303A55j34j14o1J32N4J56j59K23l10K72k37J82l97J68l0j26K22m8j19J67k4P7
5325D9k15K54K5j27q3K04M6n9r2o6R3m7jK07j98K99l68l8m7K49J88m2m9j69J35
5350A48k37J2j9J10Q7j31J96k00J25l8k32K02k01N13k17j82j49N5j8Q3J7Qj11
5373a79L68l08J8J19k59K09K8L82m65K76k49K19Q2k78N9K94n3j96j73K49k84l0
5395a71L41l9j55O7l27J42K29j54R6n2L5k29O2K49J8j63j94J35M1K45m10J09K46
5418A21j45K76m32K15j23J43j8J19p7j78L03j49K85n29J30N6k08Q7J75M7K2J01
$$ plain form
5252 -9 156 -1 -8 161 282 86 46 212 -66 -26 -27 -75 219 -17 11 224 134 56 116 272 265 -87 38 -8 -41 85
5278 85 -327 -241 193 -11 19 -94 169 97 -80 396 26 41 62 154 8 8 -295 86 -58 145 91 16 16 51 155
5303 155 21 -93 -154 -22 32 188 29 252 -58 214 -23 159 -238 -70 -100 -226 -4 -52 -171 -4 -28 49
5325 49 -166 88 113 -14 -97 107 153 94 2 -64 29 -18 -19 188 -10 289 -79 -117 -164 85 273 231 182 13 148
5350 148 -89 -77 -96 14 101 -30 166 -34 91 53 -179 23 -178 335 118 -64 -213 -158 -176 -93 -76 -68 -179
5373 -179 189 -119 -101 18 -241 -32 -4 378 -87 189 -60 159 241 -37 22 316 263 67 -106 143 -141 -171
5395 -171 170 131 -24 43 -284 -142 87 -67 29 -23 12 -217 -155 94 112 -51 -245 -110 -69 176 -234 -125 121
5418 121 -24 252 -180 35 -88 55 37 156 79 -99 204 55 340 -189 -59 -3 -211 -124 51 98 120 221
5440B21j91Q6k2P7K7k57K28r9n5j47J16q4L1m0J41qJ56j20jR8j21J8RP9J20l74
5466a12J91k05L8J72j44L34o3n72J71P4K16k16o9K20Q0J07k0k68k25L30j53M60
5488C46l42n8o7N8Jm7rJJ15J02l45P3M9j22M09l26L44l8P9l30J14m5L1lJ52k2
5514A20j54o9l8K35k03K03L0k13J57K0n8O4k81K5P5l3J32j37l9K22K62m74J93
5537C9J03j83R3R2m45P21l24N7p4q6K10k51J0K14j41L0j26J01j12K18k64k94O63
5560B51l87P2l3j06J98O8J04P9j14q6K55j53l25M34k12nNl1K15j19p8K2M3k57
5584a60O9M1l9O7j7K2JJ59J19j38k48J18j91K71m15K40K42l8j07o8j71K01j77
5607b19L07N5k08O3L28k41k0k29n7J53K70j59k51K64p7Q9J05j58j09L69l60J16
$$ plain form
5440 221 30 116 94 171 198 -59 169 70 15 -132 -16 -100 -69 -109 32 24 180 60 59 157 36 54 63 142 262 -112
5466 -112 79 -126 -88 84 -60 274 211 -361 -190 -116 100 -116 -185 35 115 222 202 -66 -291 39 -114 346
5488 346 4 -54 -121 -63 -62 -109 -118 -117 -2 100 -245 -172 -123 -245 164 -162 182 144 223 -107 7 -38 -7 -10 142 120
5514 120 -34 -103 -141 94 -109 94 124 -89 68 88 30 94 -187 -162 -87 -120 12 -125 -164 58 320 -154 39
5537 39 142 -41 52 144 -301 420 96 153 79 -7 203 -48 -38 176 35 65 -61 40 -72 146 -118 -412 251
5560 251 -136 -64 -97 -203 -5 63 167 246 132 46 301 148 -177 257 45 40 45 14 229 110 32 54 97 -160
5584 -160 -91 -50 -89 -22 -39 -17 -16 143 262 124 -124 -6 -197 74 -341 -101 141 103 -4 -72 -243 -42 -219
5607 -219 88 143 -65 -2 326 85 65 -164 -221 -68 202 43 -208 56 -21 68 173 15 -94 275 -85 31
5629C1Q9k16J91k42K4J3L26N0p1k14j56K93k20K37l50K55Q8p4p5l6K2l9J89j64
5653d9J5j5O2p2J64qJ16k78j12j00L00j72K39O8P1m05M01l13n3L01l86L38J04
5676B16k40Q2j43R1p3J9O4k3j12J24N2l57K68K53j91J83k01k52O0J05J06k3J59
5699A67j46J38k60J33o3L53k35k20N4J13J32l12K20R0l7j31k27N40j02j32M5l70
5721b50N18k0m02J5J14j81K11j82K80j37j46NJ96k86M88n05R7L35k32J22l49M1
5743b68M04j79J09j70R2K53j96J8OJ42J37k56K3l4j99k28M51j58J20k65K57Q0
5765A39J29l66J17n0r5L98j91J03O6j38k28J31K56m68J53l03K80J73P0j42k97
5786b63K28n5J8J22k69K36n8L3j35L35m18L2L23K54n74P5J95n1j47j50L07j96
$$ plain form
5629 31 120 -96 95 -147 -123 -110 216 266 195 -19 -175 118 -102 135 -215 40 128 54 -21 -57 -35 -74 115 -49
5653 -49 -34 -49 13 -59 105 97 213 -65 -177 -277 23 -149 90 158 229 -176 225 -88 -141 160 -226 112 216
5676 216 -24 58 -85 6 -67 -48 16 -7 -119 5 57 -300 -32 221 30 213 12 -240 -180 -75 31 8 167
5699 167 21 159 -101 32 -31 322 87 -133 -79 34 166 -146 74 164 127 -4 -231 309 207 75 120 -250
5721 -250 268 248 -154 -139 -25 -206 5 -177 103 -34 -180 -175 21 -265 223 -282 -185 150 -82 40 -309 -268
5743 -268 136 -43 66 -104 -12 241 45 63 69 211 348 92 115 81 -118 -346 105 -53 67 -198 59 139
5765 139 268 -98 19 -31 -126 272 81 184 250 112 -116 15 271 -197 -44 -347 -67 106 176 34 -263
5786 -263 -35 -90 -72 50 -219 17 -41 -8 -143 192 -226 -194 129 383 -191 -116 79 28 -119 -269 38 -158
5808a58K37J00k30O3n3n9L40l44J90l87O50l11k84Q3L63k11MJ09J45j41q2k0J76
5831A80k73j29R1L34J7k71q6J37J60k00j4J9J68k16j13R1J42j23K24o9J25j99
5853ej45L5K1K9L5q2J89j47QJ09k12L30Q0O0m49J55k5J07n9k06M97m02J70j51
5877e8J36p6J0j16N1J10J72j78L5J55l79O1J8J84j55r6O3M2J26k55J80j50M3J30
5901E3J3m3j28j53K73J36r4m37L50Q1MK7r6J52j71k18k5L51j41K88l95K11p9n0
5925i1K33k31N5j74J99M6K35k81j73J37j45L61k26K78p9k26j09L07l33J75n2j15
5947b09J44n4J57O9k51M5M2k12K09J24l04L79j61n7K64P3k12J43j98Nrk74L95
5970A08M7Q6j48n2k70K77J62j22j40N1l49N65l76r9M32l34K74j21J79j31Q8k8
$$ plain form
5808 -158 79 179 -51 12 -41 -100 240 -104 86 -301 349 38 -246 -163 200 -11 -7 102 247 106 24 4 180
5831 180 -93 -222 -131 203 220 -51 -137 0 160 -40 -54 -35 133 -83 -196 -105 37 -86 138 69 194 -5
5853 -5 -150 -115 -94 -65 -30 -112 77 -70 -62 47 -165 165 245 305 -144 11 -14 93 34 -172 325 -77 93 -58
5877 -58 78 2 12 -104 -53 57 229 51 86 241 -138 -77 -59 125 -30 -126 -63 -21 105 -150 30 -120 -77 53
5901 53 66 23 -105 -258 15 151 57 -380 -30 51 55 82 -14 138 -33 -251 -276 75 -66 222 -173 38 -41 -91
5925 -91 142 -89 -34 -208 -9 37 272 -9 -182 -45 -190 171 -55 223 144 -82 -191 116 -217 -42 -94 -209
5947 -209 -65 -119 38 107 -144 -99 -57 -269 -60 64 -240 139 -22 -79 185 258 46 189 -9 -4 -13 -287 108
5970 108 155 241 93 41 -229 48 210 88 -52 -1 -350 215 -161 -260 172 -162 112 -9 170 39 127 99
5992I9l21J81K00l14O1K28Q4l09M90n85L49n6K8l58L70P1k08k53J48m9l8J08o8
6015a42J03r9L04m03J03J29J29k97K74r9j46J18M0o8L30k04j32J59k69m0M29j59
6037F0jj25J44j29M5j20j28K35OL7M1k84M88l08J13NL9J8k55j03L05K1O7l29P7
6062h1J1k8L80l35q8K12k93Q2R6k0O7J78l77J30N9j9j14M72k15k17J87r7m0J03
6086E3k6Q3k1k3J00k35K84k88J71J61k16J22p6K73l05k02j15J90O6l1Q1k89J68
6109g5K15n4r0k34L07k05L5K46n0j32j82L87P5j79m2j24J11K6K82j64Lj08mp4
6133c0j24l4K88k07K43o2j16K74M8q3k38J27j61L3j28K25j23r3K46r7k5L1J48
6156A42p6K7k40J43J1K33m53J5M4K13j15n9R2N3J5k44L50j14j37J52M2k0j42N3
$$ plain form
5992 99 -222 -41 159 -155 -94 134 218 -91 399 -186 163 107 135 -223 147 218 10 -243 -95 -144 -182 -74 -142
6015 -142 -39 -138 166 -237 -134 -5 124 -173 101 2 -144 -26 14 -54 276 72 -60 99 -170 -210 219 60
6037 60 59 -66 78 -51 -6 -126 -254 -19 -13 24 65 -219 269 -39 74 79 118 136 -119 -222 83 104 171 -158 -81
6062 -81 -70 -98 282 -53 -141 71 -222 -140 -44 -64 3 181 -196 -66 -7 -26 -140 332 117 -100 87 -10 -50 53
6086 53 27 110 89 66 166 -69 215 -73 98 259 43 165 89 362 57 -145 -260 -70 -4 -35 46 -243 -75
6109 -75 140 86 -4 -238 69 -136 -101 145 95 -37 -219 168 243 64 22 -102 9 35 317 153 156 48 44 -30
6133 -30 -154 -188 100 -107 136 74 -42 232 280 197 -41 86 -75 -42 -170 55 -68 -161 85 -12 -37 -6 142
6156 142 66 93 -147 -4 7 240 -213 -198 -154 59 -56 -115 -23 30 45 -199 151 37 -100 52 94 74 -68 -15
6180a5k9J57k39R2K1N3J78k52L1k59K50O4j13o6L9J13l0j51K28k6L08l53Mj28
6204a23K71k27J95j01N3n7k2J05k25K4n0qJ40J12l10K27Q1j49O8j72J42J17j3
6227G8k61j47L88j25K43J6p9j3l57J30K16K21m47J99J48J63j76k62K42k07K8J56
6249A54j11k84L87n8k82J0J11M3M6j69l6L04j75R6J15j36J31p0r0J6q2J8L08l95
6273a49K8K36k33j01J65l8J61j87L98m07L5j79J81J52J63k83J16J09l59M39n97
6294c50N19j91J38J48j77K3k77L07k05r5l8K86K7j72K69j65L82l32j40m5k10J87
6316a11K02o4k1j09J43j7o2K00j67J30o0k90J47r5K46k0k11P3K81q4P3J05j71
6339A18K42k45j22L2P8j68L14l78M8J90M4m69M03R8k76P2m02K74K10j26R5q4L
$$ plain form
6180 -15 -44 113 -126 -34 -13 40 218 -34 -3 -262 -12 52 -61 -127 -88 25 -5 -156 72 46 354 1 5 -123
6204 -123 148 -79 116 15 68 11 -11 94 -131 -107 -157 -165 -25 87 -223 4 85 -64 4 -168 -26 91 78
6227 78 -183 -330 58 -67 176 192 113 100 -257 -127 89 310 -137 62 210 373 197 -65 177 -30 -2 154
6249 154 43 -241 146 88 -194 -184 -73 -30 16 -153 -189 115 -60 36 151 15 146 76 -14 2 -80 -62 246 -149
6273 -149 -121 115 -118 -219 -54 -92 69 -118 280 -127 -92 -271 -90 62 225 -58 58 167 -192 247 -350
6294 -350 169 -22 116 264 87 110 -167 140 -65 -160 -198 88 115 -57 212 47 429 97 -43 -88 -298 -111
6316 -111 91 27 6 -103 40 23 -39 161 -6 124 64 -226 -79 -174 72 52 -159 -86 195 111 184 289 118
6339 118 360 115 -7 25 103 -65 249 -129 -81 109 153 -316 87 185 -91 -19 -421 -147 63 -63 32 -52 -49
6362d9R4k34J19K63j27j3j0j4n2K48l59JJ54k9k2oq5K89k7nk18n3J31J47j05l4
6388DLJ15n6j51o7J69J56j61M4q6r2k8L5l4K85l0j89p3K83k74J71l0p6L41l06
6413d7P3R7J72p4k51K70l08j01P0R6K06l37K37l78L29k57J43J59J7j61J38j65
6435g2K64l58j31K96K23m30L27j09l8R5m0M34l91j92L52K36p65L16k63L8M58l5
6457B15j95J5l7QnJ54N8k33j24J03k71J37J75J42r0P3M3k75J18j81Q6J42p7j63
6481a82N0K23m3k11j16L11j2k1O9o7j65J93k3n5o1l1K02Ql16K88l48J27J59L1
6505A0J54m12L63l12M13l33L2q5O2k11N27j08j37J28j90J51k84N9L15j28L04j62
6527A56l1j64OK67m96L05k01J10P5J15N2k19j98J80r3O6q7K72J34j45J7q1m2M1
$$ plain form
6362 -49 45 -189 -70 193 66 53 43 29 -23 225 -134 -133 21 -8 -30 -36 -121 168 141 136 -82 -135 -4 143 38 4
6388 4 7 122 66 -85 -152 17 173 12 56 -30 -122 -150 -115 -149 136 106 -83 -156 127 -147 24 -6 -82 259 -47
6413 -47 26 123 295 221 -30 240 -68 -169 -99 -3 203 -134 103 -275 54 -203 -60 99 116 -45 93 -72
6435 -72 192 -166 -297 -1 222 -208 119 10 -28 67 27 461 70 -122 230 466 -299 17 -246 -208 250 215
6457 215 20 35 -2 6 1 155 213 -20 -144 -41 -312 -175 0 142 52 125 168 -107 11 -170 -84 58 -19 -182
6481 -182 -132 91 48 -163 -279 32 20 -1 68 1 -164 29 6 -49 -110 -141 61 69 -247 41 -307 -180 -21 10
6505 10 164 -248 115 -197 216 -117 -85 -170 -108 -319 208 100 -37 91 -99 52 -232 -173 142 14 318 156
6527 156 125 -39 -33 234 -262 43 -158 -48 27 142 194 -25 -223 -43 -136 -70 -157 115 249 104 121 40 -2 39
6551C9L6N6j40K3p1J16N6m0j07P4n6K2j41Q8L4l1K40k70R1j29O6j05J92L2M1K07
6577C23m42K13l1r7R9jK33l82J2p7L35k64L51l96j91N81k93K41j08P7j0M9J44
6600C66k24j72j10l0K18j90o6L59o9J61k85K35j07l34J72q1L91k08K26l33O1p9
6622i9NK96l70J91q9J9J60j33l1Q7k8l9N2N0r4j45J99P0k20J51n3L20k55Nj28
6647g9J83j84Qk31K40j5Q7O6k04L39l82K98j15j42jJ11K82r8j65K45r6l72M21
6670A96j11J59k63J64Nk42L14k03NN9j02P1o8j35P6J46r7N4J4j12m9J81k53K56
6694F5J08j60n9k84L45K10l32J11p7o1K56j54l6j93M77k26p3j03J48J72m2l16
6716b24L72P8n23M14j1j6l40K52L9J37k10J79J9k79K57n8m1j89Jlp5k5J37K53
$$ plain form
6551 39 75 131 -9 14 -57 59 115 75 -32 42 -14 8 -133 -45 -11 -42 198 -72 19 -110 -44 -149 43 75 116 323
6577 323 -119 94 63 -34 65 64 297 -85 -73 -150 185 -79 272 -124 -315 266 -27 214 106 183 173 222 366
6600 366 142 -30 -140 -170 48 -142 -208 151 82 243 -42 193 86 -248 -76 -157 234 26 252 -81 -20 -99
6622 -99 -94 202 -168 23 -66 -47 113 -20 -51 36 8 -31 21 71 -23 -168 31 101 -119 32 -21 299 44 49 -79
6647 -79 104 -80 -72 -303 -63 -78 9 75 -129 210 -172 126 11 -131 -132 -21 261 163 -2 243 147 -225 196
6670 196 85 244 -19 145 150 -92 222 19 24 83 -19 52 -16 -151 -75 71 -26 28 42 -70 -119 62 -191 65
6694 65 173 13 -46 -330 15 225 -107 4 -73 -134 122 -32 -68 -261 216 -10 -83 -186 -38 134 92 -224
6716 -224 148 226 -297 117 106 90 -250 2 41 178 -32 147 166 -113 144 86 45 -144 -143 -146 -221 -246 -109 144
6740A44j39k67Q7L42j1k2o6J21j50j58J72n2j00J69l60L56k93L64m49J63K07j17
6762e9K97nm08J71l04M81lk17L43n25j05L50J22n66L89J38L4p5p3mj19L63j76
6785D9k11J72K7M95n81J45J91n70K64M7l52K57m3J18j73L39k40%J35k42J78J35
6807A40k17J26%o6J73j46j47P0P8j00J7J15j06Q4r9k9k6J10k0P9J58n52M52j44
6831e0L26l18J41j9J31l69q3Q6Q4P2n6P3N8o4K5J02p4J28l34K81p4m9j61L22k12
6856c4J88r4J2k37N1K5N7j16J59L50n00J59j06J97j52j62J27l2LkL03k84J36j84
6880a36m3Q7K57q7k77M41l18r2J03J38k43j2J70KL2o1n2K99k14j50J62J40M8k42
6904d8Lmj40M32j32k03p5K46P2n32N3J99J24Mm6L50j96P7Pj52J36l32K08k64K02
$$ plain form
6740 144 5 -262 -175 167 156 134 68 189 39 -119 53 1 -99 70 -290 66 -227 137 -312 -149 58 -59
6762 -59 238 233 -175 -4 -308 173 170 -47 296 -229 -334 16 138 -428 -39 99 133 58 -15 -19 -138 225 49
6785 49 -162 10 37 532 -49 96 287 -283 -19 28 -324 -67 -110 8 -165 174 -66 -66 69 -173 5 140
6807 140 -77 49 49 -17 156 10 -137 -67 11 -89 -72 43 -63 21 -78 -107 -133 -23 -43 36 194 -358 94 -50
6831 -50 276 -42 99 80 211 -158 -241 -155 -71 1 -55 18 76 12 37 139 65 193 -141 140 66 17 -144 178 -34
6856 -34 154 60 72 -165 -114 -89 -32 -148 11 361 -139 20 -86 111 -41 -203 -76 -108 -105 -107 196 -88 48 -136
6880 -136 -179 -92 165 78 -199 242 -76 -168 -65 73 -170 -182 -12 -10 22 -39 -91 208 -6 -156 6 146 194 -48
6904 -48 -45 -49 -189 243 111 -92 -167 79 151 -381 -328 -129 -5 -1 -47 303 107 184 191 39 175 -157 51 -213 -11
6929a1j19k61N62k43Q1M4j26K68m0j83j56k0L82r2j91J81j82O3M5o1M89m10j25
6952a05J98k05Q8l9L1K57K6l67K72j24j06K0K22k6L2p6k23K22q5N3q4j77J33k62
6976c25k9O87k67J25k57J44p3m8K5l5J69j54j03L38j17Nj51o4K76r1P6l1N2k61
7000a09Q0n0j26J56J11l85N24j43l8Q9l17N11m36P3O0k3j35j0K8K98j62Q3p7j95
7024a93K88n6k89J31L6J10j67L03j71O2j18J84j24m8O0J58l73J78M0J16L8j97
7046c2J28j77J71k65K59l06L03l3q9J64K87m29L2R4j64r9N10m61N3J80j93J00
7068C3jp7J42o7n3L5m68N09j49K46m2j7j64R3J19k11N5L4J39m5j05J30l02j3L15
7093A36r1m1J7o7K8o1J9L3J28j68k24L21m8JK5j64J84l13M34j51K33m73P5J73
$$ plain form
6929 -11 -130 -391 171 -72 9 53 -73 195 155 -28 -184 -204 178 86 -105 76 -106 -43 2 -59 430 20 -105
6952 -105 93 -112 -24 -63 -32 225 251 -116 156 32 -74 -54 168 142 174 98 -125 97 12 65 -19 -196 -63 -325
6976 -325 -354 333 66 191 -66 78 5 -43 -18 -53 116 -38 -141 197 80 85 -66 -130 146 55 131 100 152 -109
7000 -109 -29 -79 -205 -49 62 -323 201 58 20 109 -208 303 -133 -60 0 -23 -158 -168 -140 158 -4 79 2 -193
7024 -193 95 39 -250 -119 -83 27 -140 163 -8 54 -64 120 -4 -52 8 166 -207 -29 11 127 165 -32
7046 -32 96 -81 90 -175 84 -222 81 48 -41 123 410 -19 13 107 -57 -156 354 -107 -54 126 -67 33
7068 33 32 -45 97 30 -23 12 -456 53 -96 150 108 91 -73 20 139 -72 -17 17 156 111 6 136 -166 -179 136
7093 136 45 4 21 -46 -18 -79 -60 -27 101 -67 -291 30 -18 -17 8 -156 28 -285 149 -2 231 -242 -167 6
7117Fk16K98N5l47J84O4j57NL79l95J7K11j33j0j62L58l54j2L13J68k36p0P3P1
7141A10j84M4k54J46k0J66l05J10J30Q3L3j81J01R3K0N9j51P2n5K00k98j02K08
7164B5n7q0j56M1K67n2J03k2j13J38l5j71Rj79L25j32J10J1j51J72J35j52k2K12
7188B26k8k32J95q5j20J67l00J96L2j17j54O9NK43j06j47J8J87j02J48j68J40
7210F7P4r6M0j38J33j6j27K80o5j54O8p3J18N8p6q6j68K13R5l6j13J86k71K1k33
7235b99L16q9K53l89J95J2j42K59j6j38M7L1j7ml7L91n83M67k10R7j93K0j10L24
7259A85l42J35l8j00K46o0o0J90l55J56n6P4J80m18L23j77L5k7J65O5j06L6J27
7282A78j35K28m16k4Q3J68M8p8pJ98l47k0p2P4K05N7k1k45J26k5M4J32j31j69
$$ plain form
7117 6 -210 88 143 -204 -20 44 -113 -108 271 -124 -107 104 -29 -39 -201 157 -197 -209 104 272 36 -34 39 110
7141 110 -74 -30 -284 -138 -158 8 -297 -187 -57 26 59 -122 -21 72 92 151 0 72 17 217 -81 -183 25
7164 25 -32 -112 -268 -227 40 -12 91 69 -44 94 59 -112 -103 -282 43 -89 21 32 -119 53 188 36 14 226
7188 226 198 -34 161 76 -44 123 -177 19 51 -66 -220 -151 -146 97 -9 -156 -138 49 -53 95 -73 67
7210 67 141 45 85 -53 80 64 -63 217 152 -2 66 -7 111 169 93 7 -161 52 147 111 -2 184 -87 -66 -299
7235 -299 17 -72 181 -208 -13 -1 -143 116 100 -38 9 40 23 19 -18 373 -210 257 47 144 -49 -29 -139 185
7259 185 -157 -22 -60 -160 86 26 -34 156 -199 -43 -99 -25 155 -263 60 -117 -82 -109 56 121 15 51 178
7282 178 43 271 -145 -169 -86 82 130 52 45 243 -104 -124 -196 -122 83 140 119 -126 0 -25 19 151 20 -149
7306a49j97L00K1J69l19j15K99j43J68l00L70K0m6j19j62J17k7P8j54M22j00l10
7328a77M41l15R4n8L4O3j34L01l97K52k59K70j82J48Q8O3k33j92j23L30M7l05
7350b44L44m51N61m75M41p6J62k59R6k34o1K21j8R0m5L02l11J62j61J2K11k5l13
7373g1Q3j20l2K83J19l67K39j13k64K55N2j64M9r0lK49r3l5K09l54J24J12o7K73
7397B74k00j72M0l8Q1J10l42L98m4J06p9l38J59J76q0j9k03J38j54M9M4K30k27
7420i1K55l15L91m02M22n1k66L1J0J8qP1j61J12k2l1p4L67l78N7J52J38k66J73
7444A32j48r0J0K5m6J92q5n6J66j96j1L36j14r8k35N7n6m5J77k12L6L45j22R9
7468F1k0p3L11l80K19R1j23k70L72k13m0J7o9J44j81L64j48K1j7j57p5Q0jl8L12
$$ plain form
7306 -149 -346 -46 -25 144 -175 -290 9 -134 34 -266 104 124 78 -41 -203 -86 -113 -35 -189 233 133 -177
7328 -177 264 -51 43 -15 19 82 -52 249 -148 104 -155 115 -67 81 169 232 -1 -193 -316 14 61 -244
7350 -244 100 -351 210 -265 176 100 262 3 99 -135 -196 25 7 97 52 354 43 205 44 56 267 242 -71
7373 -71 12 -108 -140 143 262 -105 134 21 -243 12 64 -100 -51 -141 -144 105 12 -23 186 -168 -44 68 1 274
7397 274 74 -98 -58 -96 -15 95 -247 151 107 213 134 -204 -45 131 51 32 -171 -33 -187 -138 -94 136 -91
7420 -91 164 -151 240 -162 260 209 -57 -26 -16 2 -6 65 -96 16 -6 -37 -111 256 -122 -65 87 225 -41 132
7444 132 -16 -106 -96 -71 -117 75 -10 -66 100 -96 -107 229 115 17 -218 -161 -217 -262 -85 -297 -261 84 -38 61
7468 61 41 -32 279 -101 118 209 86 -184 188 -25 -65 -48 -117 27 -154 210 62 83 66 -91 -166 -86 -87 -125 187
7493A87J92k14k45j0j19J2P7K83Lr7j9j7M9j42J09L8j66l65L57P4j36P8m9K80
7517A60j00Q8n1k1j64PJ81J21J01l72J74n1p0r7n8J90K91j21O3n18K76J25k38
7540h4k16K86K83m44L01Lj82R8J8J74k91L4J49j89J1J05O9j52j41L73k30p7Q1
7563b1R4j39K77r2o6j74J53j97J85K0l7K8p4K76p7m4l98K05O4r4M0Q1p5K19r7
7588E7j1O5j47Q5J30k98L38k35l8K14m15J91J67j36m6K18l95M71l08K91k25J01
7610G4n1k75L52k60R5K37j80K5m8J97M8l11Q6n4P5k8Q3j12P0j28O3K54k58j20
7634a66J38J40j16K9j16N5K98k85j37K21p3j53J6K00M1j93K74n8j32J24j86K62
7656A83j94K19k52N1M8J46k34o6J96l5k71m4L16j43J96k4q2Q5j90P9Q9j02J46
$$ plain form
7493 187 379 165 -80 -90 -209 -197 -120 163 166 69 50 33 82 -60 49 87 -79 -444 -87 -13 -149 -71 -120 160
7517 160 60 148 97 76 -88 -81 100 221 322 -50 124 73 3 -94 -152 38 329 208 271 -247 29 154 -84
7540 -84 -300 -14 269 -175 126 129 -53 45 63 237 -54 -20 129 -60 -49 56 125 -27 -168 205 -25 -102 -21
7563 -21 73 -66 211 119 53 -121 32 -165 20 40 3 31 -43 233 156 112 -286 -81 -17 -111 -71 10 -65 154 57
7588 57 46 111 -36 49 179 -119 219 -16 -54 160 -255 -64 103 -33 -79 139 -256 215 -93 198 -27 74
7610 74 23 -252 100 -160 -65 172 -8 17 -31 166 214 -97 -11 -65 10 -18 65 -47 23 -105 -42 212 -46 -166
7634 -166 -28 112 -4 25 -91 -36 262 -23 -160 61 -12 -165 -149 51 92 -101 173 115 -17 107 -79 183
7656 183 -11 208 -44 7 55 201 -33 -99 97 62 -209 -253 63 -80 116 92 10 95 -95 -16 73 -29 117
7679A17l06Q9J96j62L6q7J56j87K8P2L66Ll90k28K50K28k34M1m0p2M6j4J73l48
7703b67K22j44J89J60j71k81J53L01pl8o4J7k20K29K23k13j18j32L66l38j8K47
7725I6j43J4N4nJ50k93J84o1R4kk35K52l10L75k07J53p2l01K42j73J15L74k89
7748A2m8l3K83k36jQ1O2k94J64l5k09J36m7K35j97J67q6k33N70l61J13J12k98
7771a43J64o4K0j52J68O1J55Ml79K66k38R9O2N3l47K74j33J86j51JL8J42k29K09
7795F6j4j23J92j91LJ2N9m1p0Q4K31r9j07j40P0J58k2R8O8l51J98j8j95J33J01
7820A02l8o6J47k23K5M67l97r9K57j34l08L33j25qJ76k06Q9m2j12K87K8k05l6
7843h8k9j48L86k53L47n5r5k83J24j4R0j89J35J54J1k1m9q8M7l99L84p2J39p3
$$ plain form
7679 117 -189 -100 96 -66 -30 -117 39 -148 -120 -48 318 321 -69 -297 -47 181 -53 -12 -52 -124 -78 -92 81 -267
7703 -267 -45 -189 0 160 -11 -292 -139 162 155 117 53 70 -150 79 302 89 -29 -161 205 -133 -151 96
7725 96 -47 -33 21 16 166 -127 57 -4 90 88 -147 105 -205 170 -37 116 44 -257 -15 -188 -73 301 12
7748 12 -36 -69 214 -22 -23 58 120 -174 -10 -45 -254 -118 -165 70 -127 40 -46 -279 291 -70 43 155 -143
7771 -143 21 -43 -23 -175 -7 54 209 213 -166 100 -138 -39 23 76 -271 3 -130 56 -95 -94 -56 86 -143 66
7795 66 52 -71 121 -70 -67 -55 4 -37 -107 -23 208 109 2 -138 -68 90 68 166 234 -117 81 63 -132 1 102
7820 102 64 -2 145 -78 -53 414 17 -82 175 41 -267 66 -59 -67 109 -97 -8 -50 -162 125 153 -52 -88
7843 -88 -117 -265 121 -132 215 160 65 -218 -94 -108 -18 -207 -72 82 93 72 23 -65 -18 -417 -33 -105 34 -39
7867c9j57K74m4j44J11J79M7k78J76l3J12k06O5m2l0J9j7Qk5n1j43O6J89R3P8
7892B08j47j7j42J5k7L02J46l81q5J61n8P0k14L54j96K08n2j94k50M02K8o8j3
7915E0j30O1J14N3p6n1J44K4l57L98n7k76K65k40J85k61J14O2k10K30j77J23j70
7938a82J37j44J77j69J45L7r5R7N8k38K94j71r2K19l5k46K35N2O4Lo7j3Q2j33
7962A5j49O6J55j49m2J63k1N8l31K67J7k34L87l25J38q1j12M29k96J01r9j11q7
7985b41o3L39j61K85l3K15l89j17K88p0M5L9L0j14m1O9l9j25j46J61Q9J2L0O1
8009A24j2k52l1K7J14j58K18Ol50L51o9j52J83O2j6q9K14r1j23O4k28L11k69P2
8033i4J68k0k72L08k32K48K01m80J88N9J21k58J31o0k55J73K23n2k55J65K56l61
$$ plain form
7867 -39 -196 78 34 -110 1 180 227 -51 125 92 204 -2 63 21 -9 10 -7 1 -24 -75 -218 -152 37 130 208
7892 208 61 44 -98 -83 -110 192 338 -43 -128 33 -25 45 -169 185 -11 197 145 -49 -299 103 131 63 50
7915 50 -80 -19 95 148 72 21 165 189 -168 230 173 -103 162 -78 107 -154 -40 22 -188 42 -135 -12 -182
7938 -182 -45 -189 -12 -181 -36 1 -94 3 61 -177 117 -54 -146 73 38 -208 27 79 143 146 79 66 148 15
7962 15 -134 -68 87 -62 -104 59 38 96 -235 32 49 -185 202 -123 15 -66 -178 251 -45 56 -43 -154 -241
7985 -241 -304 35 -126 159 126 341 -48 -165 123 53 98 137 167 53 12 81 42 -83 -229 -68 21 33 63 124
8009 124 112 -140 -171 -144 -30 -188 30 36 -314 37 -32 -184 -1 61 45 -44 170 79 -44 20 -208 103 -166 -94
8033 -94 74 54 -218 90 -142 106 307 -173 15 74 195 -63 68 8 -247 -74 149 97 -158 7 263 -98
8055i8J36O7K6j74L24j96k6j17n9M4J1j36K27k12K08J08m5nJ73l04k1L09k61j59
8079a80K75k47j85L15L0J07M6k16N2L6L1k64M84l55N3N1m8p8J27m1k37K79l01
8102b66M6K90J71l66K66o3q0J69k13o5J33OK91l55K82l63O4M9l50K38K29j62j11
8125a60m5K72J45k46j6J30M7r1J64Q7l35p8J47l4J3r1K25l14O8Nj37N96j66oq
8150A72J08l19p2J01j07n3Q7O1r0J05K99n14M03j83K1O1J56m22J16Q6OL3r9P5
8174C1J08j14K3M2j20O7J05n88M02J40k5k27N7J89q7N9J66
$$ plain form
8055 -98 38 105 131 -43 281 85 59 -58 -117 -73 -62 -198 29 -183 25 133 88 83 256 -48 -69 240 -21 -180
8079 -180 95 -152 -337 -22 8 115 161 -55 -3 33 64 -200 284 -71 -18 33 -15 -93 34 -7 -244 35 -266
8102 -266 -220 70 241 -125 141 78 -2 167 -46 -111 22 28 319 -36 246 -117 -53 -4 -354 -116 113 -49 -160
8125 -160 -205 67 212 -34 -50 80 127 36 200 287 -48 -126 21 -13 0 -91 134 -180 -112 -107 -244 352 186 180 172
8150 172 280 -39 -111 -10 -117 -170 -83 -22 -112 -7 292 -222 181 -2 19 80 236 -186 -70 16 22 55 -44 31
8174 31 139 25 48 90 -30 37 142 -446 -44 96 71 -156 -99 90 3 62 228
8191B28
$$ Imaginary data points
##PAGE= N=2
##DATA TABLE= (X++(I..I)), XYDATA
0@%%%%%%%%%%%%Qj6J6j6J6k4L2m0M8n6O4p2Q8j04J20j42J66j90K18k50K84l20
34a70L62m08M60n15N75o45P20q00Q87r82J087j205J332j467J617j782J962k161
52a133K382k627K901l207L554l951M408m943N578o349P304q527J0157j2446J5931
67I032k1946L5200j20012P3705J81481j41994r8198K6136R8632k6443j7823L109
79H79j6801k8574N1003N9615k8797o7414j2095N0797M3646m5973k6784J3810K0556
92A3868O7k296M195j6437k2192K6704L7739l4146l6143M6610K4465m2279k8464
105b8309M1877K5213n3630j6660N3040M231m5197N879L2363j8438l4333J4969
117a8995M4900j7080m7562K1876M4740j0657m5557n664M4740J3360m3597r093
$$ plain form
0 0 0 0 0 0 0 0 0 0 0 0 0 0 8 -8 8 -8 8 -16 16 -24 24 -32 32 -40 48 -56 64 -78 88 -102 116 -134 150 -170
34 -170 192 -216 244 -271 304 -341 379 -421 466 -516 571 -634 698 -769 848 -934 1028 -1133
52 -1133 1249 -1378 1523 -1684 1870 -2081 2327 -2616 2962 -3387 3917 -4610 5547 -6899 9032
67 9032 -12914 22286 -97726 -24021 157460 15466 -82732 -56596 42036 15593 -2230 879
79 879 -15922 -44496 6507 66122 37325 -30089 -42184 8613 52259 6286 -20498 -6688 13868
92 13868 13935 11639 15834 -603 -22795 3909 41648 7502 -28641 17969 42434 155 -28309
105 -28309 13568 38781 -14849 -31509 21531 25762 -19435 -13556 18807 369 -33964 -18995
117 -18995 25905 8825 -38737 -16861 27879 17222 -28335 -33999 10741 24101 -19496 -28589
129b8589M3224O794l5545j1242K7502J0787l0549l304L1811k572j7708R311N961
142E881j2574j903J8633M695k4542j078L3773j183k8454P0J5067K03j0361L334
156A561J3437j0554k0049J6621K2997j2245k8253l782K9975J8059k4527j7514
168a4274J0562Q603K118L20m359j2752q134K2026K3607k5717l0731J4768K5179
181A1216k449j8132m598J0435O00K44R854p360j4224M959J2433M806o544r476
195h236M965O701j044k87m613m188M541M876K334k820r707N065J1525o276r760
210f924M605J0581M90j2462J068J3906m500r719M532L132k383k059K012K310n867
225a278k981P539j02o165O72J463J605K55k637K050O86m165K199L472j124l529
$$ plain form
129 -28589 14635 21429 -14116 -25358 2144 12931 -17618 -20922 10889 8317 -9391 -80 5881
142 5881 -6693 -8596 10037 14732 -9810 -10888 22885 21702 -6752 -6682 8385 8588 -1773 1561
156 1561 14998 4444 -15605 1016 24013 11768 -16485 -20267 9708 27767 3240 -14274
168 -14274 -3712 4891 7009 7329 2970 -9782 -17916 4110 27717 2000 -28731 -13963 11216
181 11216 8767 -9365 -13963 -3528 -2928 -2684 7170 -190 -14414 -9455 2978 7784 1240 -8236
195 -8236 -3271 3430 2386 2099 -2514 -6702 -2161 2715 5049 2229 -7478 -2413 9112 2836 -6924
210 -6924 -2319 8262 8752 -3710 -2642 11264 6764 -2955 1577 4709 2326 267 2279 4589 -1278
225 -1278 -4259 3280 3178 -2987 -2315 -852 753 1008 -1629 421 1107 -3058 -859 2613 1489 -2040
241b040l140N513M891q330l683N742P85k218r24P01J766k377Q61M637l610k545
257c971M958Q18j487L14l51J608j336j538L722q12l385O99J056J930p02m748K203
274a022L731k095n11R18k30R47p5M84R81l692Q44L295k719j261J158o36Q0j446
292a249j55K413k243j514K461jm15m33p24L119m28k776J718J283j681M03m94M85
310b31J24j931J450O53k860J210J880j536L31n51J232J858j767n33K057o24K32
327I94J44q91J013n07j095J954n84j527J004n18L00L68j900J523M03r07J432m02
345H04j220J498J15l64P5j081P83O77j495q3j5o66J196j077n21J262j061J31J155
364A13j333J24J117m17P30l43r83J766j096p28J582o42n67R08n91N04l47j088
$$ plain form
241 -2040 -5180 333 5224 -3106 -6789 -1047 -262 -2480 -3404 -2703 -937 -3314 -2453 2184 -1426 -3971
257 -3971 987 1805 318 632 281 1889 553 -985 2737 1925 -1460 -761 295 2225 1523 -3225 -1022
274 -1022 2709 614 103 1021 791 1738 1663 2147 3128 -564 280 3575 856 -405 753 117 197 -1249
292 -1249 -1404 1009 -1234 -2748 -287 -288 -703 -1136 -1860 1259 831 -1945 -227 1056 -625 -222 -716 -231
310 -231 -107 -2038 -588 65 -2795 -1585 295 -1241 -910 -1461 -229 1629 -138 -671 1386 762 994
327 994 1138 247 1260 753 -342 1612 1028 -499 505 -13 287 655 -1245 278 681 -226 1206 804
345 804 -416 1082 1197 833 908 -173 610 1287 -208 -291 -306 -972 224 -853 -1374 -112 -1173 -1042 113
364 113 -1220 -1096 21 -396 334 -9 -992 774 -322 -1050 532 -110 -677 231 -360 144 -203 -1291
382a291P10P66n86R05q50j42J606j211L59J080j378M36M83N4N32j522j07J382
400A226j120l55J193j645j19J306j82k06p58OJ142k42n3M85r82J02J337r77j51
419GK03p89J55L53o8J88q63m32J211j073M39Q70j196j29J444j31N27j023j55P42
439B80q8N54M82j898M01J256n89m61m33m6M07K0J68R47j813J78J538m68m90l1
459h6k62J123K09l43p15k06M15N29j430L30R79r55k77P84p7j84r76O56P20l53
479a19K41P54j160M48N18q36j51j26J38M52K91j4m08j358O26J545j444p74R41
498d36M96N47j03l78m83j08Q01Q43j238k44J124l14j32K89j692j85P30J129K5
517F71j363J68J096q60k66O89o18O01M42l32R2l1L70m39q10O00R56j180l47R28
$$ plain form
382 -1291 -581 185 -401 504 -346 -488 1118 -93 266 1346 -32 404 887 941 1473 -49 -156 1226
400 1226 106 -249 944 -701 -820 486 304 98 -660 -654 488 246 193 678 -304 -202 1135 158 7
419 7 210 -579 -424 -71 -139 49 -814 -1246 -35 -1108 -669 201 -995 -1124 320 189 716 -307 -462 280
439 280 192 746 1228 -670 -269 987 398 -63 -496 -542 -135 -115 53 1000 -813 -635 903 435 -55 -86
459 -86 -348 775 984 641 -74 -280 135 664 -766 -436 543 -412 -689 95 18 -166 -1142 -486 234 -119
479 -119 122 876 -284 164 682 -154 -305 -431 -293 159 450 436 28 -1330 -704 841 -603 -1377 -436
498 -436 60 607 504 126 -357 -465 336 1179 -59 -303 821 507 375 664 -1028 -1213 -483 646 671
517 671 -692 -524 572 -288 -554 135 -483 118 560 228 320 289 659 220 -590 10 966 -214 -561 367
537C67r06J51P74m05o68l52R67J087j034j15O37m74N9Q86j137p90N01J174N3r73
557a98J10p1q79Q37O50j195M1J110J0j92j30k05j18l62J026M65j180M81P48j056
577a08l42O49J2n03k90P89K55p13J53K52o59J49N83n84L26M83Q4l41m60L46J71
598B52r06P33L42r89J47Q77l30m08jl39M87J7J66l0m33O94N14q82o49Q80K03j38
620B07q1Lp1l23N29n5o91J91M60n6jp2n40M08K77k70K49m57M72K41m02J58Q0k00
644E6j60R4j21KJ92m0L28m67J46j11q1J59K51k58K86J6j80j04k15M01K70k79k96
667a11K56m51K80J85j38k86K94ok25L08PK13p75N58L44n93R4L92k32J10j61nJ26
690A84m39K25K95o90N17L11m77P0k75L79j8j72J87M30o73K60J46j37k45J31j63
$$ plain form
537 367 -539 -388 386 -19 -687 -1039 -72 1015 -19 -134 503 29 88 974 -163 -953 -452 722 775 -198
557 -198 -88 -159 -1038 -201 449 -746 -705 405 415 223 93 -112 -230 -592 434 899 -281 200 948 -108
577 -108 -450 199 211 -292 -582 207 462 -251 -98 154 -505 -356 227 -357 -31 452 536 195 -265 81 252
598 252 -654 79 421 -568 -421 456 126 -282 -283 -622 -135 -118 48 18 -415 279 793 -89 -738 142 345 207
620 207 126 129 58 -265 264 209 -482 -291 169 113 112 40 -500 -92 185 -85 164 -293 179 420 18 176 256 56
644 56 -104 -10 -131 -129 63 23 351 -116 30 -81 -162 -3 248 -10 276 292 112 8 -207 194 464 185 -111
667 -111 145 -306 -26 159 21 -265 29 23 -202 106 113 326 -449 109 453 -140 -46 346 114 224 63 58 184
690 184 -255 -30 265 -425 92 403 -74 -4 -279 100 82 -90 97 527 -146 114 260 123 -122 9 -154
711a54Q8J81l39L56k84m1J4K61K1L4n95N10n2k31J63k14L69oJ4k15L11o9k66J09
735c5j30j59L11l5o0N3K64l29L0J53j22j57M67l40k5L22k24o9J03K0R6j12k46
758b24N9J52n5R0o5j33K01q2Jl0k4K62M2Q7j58l8j43j62J64J30j62Q9j44r4L37
783A00l04j9K09J45j69j40K32p0J93j55j62K80j30l6J56k12K02P1k13m2p7J12
805b9j47P7Q3J37k71K10K0p1j45K8L0P3l2K82j53jk17K25j54n4J78P1p7j78O3
830e2j05M02m43N1%K12J13k20M7j12K63M8o2j26k25K28J62k9j82J9J68j17j57
853a17M4K30k38J09k6j31N6L2N7J77j49o0K00l16L51k02k53L10J31j94m4j52j06
876b91L46r8J76l8j89nK63j72J06j02%Rq2P8J98j46k42J18J22J00q4l5K18n00
$$ plain form
711 -154 -66 115 -224 132 -152 -193 -179 82 103 137 -458 52 0 -231 -68 -282 87 81 95 -120 191 122 -144 -35
735 -35 -165 -324 -13 -48 -108 -55 209 -120 -90 63 -59 -216 251 -89 -114 208 -16 -85 18 38 134 22 -224
758 -224 -165 -13 -68 22 -43 -176 25 -57 -56 -86 -110 152 194 281 123 85 -58 -220 -56 74 -88 1 -143 -237 100
783 100 -204 -223 -14 131 -38 -178 54 -16 177 22 -140 140 10 -26 130 -82 120 191 -22 -64 -141 -29
805 -29 -176 -99 -16 121 -150 60 80 9 -136 -108 -78 -5 -37 245 92 91 -126 99 -55 -109 69 140 63 -115 -52
830 -52 -157 245 -198 -147 -147 65 178 -42 5 -107 156 204 142 16 -209 19 181 152 -30 -11 157 40 -117
853 -117 -73 157 -81 28 2 -129 -73 -41 16 193 44 -16 184 -132 219 17 -236 74 205 11 -33 -185 -291
876 -291 55 -43 133 95 -94 -99 164 -8 98 -4 -4 5 -77 1 199 53 -189 -71 51 151 67 32 250 -250
900b50R5J13n9P1J06p3l5j39L80k22n4J36J3N6K71k70j67oP0j39K12j41j36J92
924B4l2M1K6l37K98P8k09PJ88m45K71j43Q1K07O3O4k38m0P2j72K28k7j8k2J01
949F6J42l25K32k04o9J59r3M72k37j04j90J90o5q9J22r6m4J33N4J4k36J89j06
972h5m8JK39kJ02m41K38p4m6L74k97M0j25j8K92O8j64J48p8k63j2K08L4l28J03
997a34J82l00K48l9K11j54l8k19K85K8j23r9J15J0N6O7k1k81M2N09m35K97k80
1020g3j10K68N4Lp0j48K33q2j07j95K73j58j2L7k70N04J69l80j48K36K40k65k3
1043b4J98j6k64J38J60N2l07l4P3on2m0J88l12K60lJ03N4j84k07K60N1j26L23
1067B85j68Q6k34R3m1J34j73j87M29l24J86l40J64J14j32N66k02k31j50K51k78
$$ plain form
900 -250 -155 -42 -101 -30 76 3 -32 -171 209 -13 -67 69 82 138 409 139 -28 -34 36 -103 109 -32 -168 24
924 24 -8 33 59 -278 20 98 -111 -104 84 -361 -90 -233 -152 55 118 182 -56 -96 -24 -196 32 5 -13 -35 66
949 66 208 -117 115 -89 -158 1 -92 380 143 39 -151 39 -26 -115 7 -89 -133 0 54 68 -168 21 -85
972 -85 -133 -132 107 105 207 -234 4 -70 -116 258 -39 1 -124 -142 150 218 54 202 124 -139 -151 57 91 -237 -134
997 -134 48 -252 -4 -43 168 14 -24 -243 42 70 -53 -152 -37 -27 29 96 75 -206 -164 345 -90 207 -73
1020 -73 -183 85 139 142 72 -76 157 75 -32 -227 46 -112 -124 -87 -357 147 316 -64 -212 24 264 -1 -24
1043 -24 174 158 -106 32 192 244 -63 -97 -24 -30 -82 -122 66 -246 14 11 114 168 -16 -223 37 88 -38 285
1067 285 117 203 -31 62 21 155 -18 -205 224 -100 86 -254 -90 24 -108 458 256 25 -125 126 -152
1088a52j06oK84j67J09K09N7k16J03n2p3P2J33j94j8k66M33k66O3r0j6n0K94K2
1112A07n5M5k52L35k59K18J83l75J38j51K42k31k0J28j26M21k01j11r2r8L75k26
1134ePO2j08L1M1j31n7Q6K64%q8j79J90j16J07m6r8J8N2pJ6Q8l44K82j73L3j12
1161a87K90J19m99J62Q1k7J3J04j38J9N7L3ml8L1j47K52j2j90J40qj4L3k40P2
1186i8N1J71l17Q5j76L03J02l41L94k61p8J23P0k09L6J85j00K47k19J14k97J94
1208b1L8j85J96q5k4k07J71K59j12j33K25K6j31j27j6L49j72PJ39l2k47q8K42
1231G2l0J28j34j23R4L1k69L20p3k10p6L68m4jJ99j44p2j97K26j16p2K86k50L5
1255e2j85j3L01l6N0o2R3j16k4m5J68k19L16l5l94M16j72j66K17k14K63R7j41
$$ plain form
1088 -152 -258 -264 20 -147 -38 171 228 12 115 63 -10 62 195 1 -17 -283 150 -116 -53 -143 -159 -209 85 107
1112 107 52 97 -155 180 -79 139 322 -53 85 -66 176 -55 -75 53 -73 348 147 36 -56 -154 221 -5
1134 -5 2 64 -44 -13 28 -103 -160 -74 190 190 102 -77 113 -3 104 58 -40 -22 30 23 39 127 -217 65 -108 -75 -187
1161 -187 103 222 -277 -115 -34 -61 -48 56 -82 -63 -6 27 23 -15 16 -131 121 109 -81 59 51 37 70 -170 -98
1186 -98 -47 124 -193 -108 -284 19 121 -220 174 -87 -165 -42 28 -181 -145 40 -60 187 -32 82 -215 -21
1208 -21 17 -168 28 -57 -81 -288 -117 142 30 -103 122 148 17 -110 -126 223 51 58 197 165 -82 -170 72
1231 72 42 170 36 -87 7 38 -231 89 16 -194 -270 98 54 53 252 108 36 -161 65 -51 -123 163 -87 -52
1255 -52 -237 -250 51 15 65 3 96 -20 -44 -89 79 -140 176 141 -253 163 -9 -175 42 -172 91 188 47
1278D7Q8k14K29jk03kO1L5J44j83N9j56j14L00J55k45P7j18j55Q5J96j0k96K31
1302A0qk05K0K65j82L2L9L0J58lK5j80p2J13j63J4J5q0L89j22j04K73l78J49R8
1327A33L4l4M9j73J37K36k05l10J02j4J90j81j36J61k28L13j71OM5j35J99M9j77
1350a10L16m06K20J6o3M4j56K60j20J48k9q2k42M10k01m5j87M9L37p5L7p7p0N9
1374C3k00K73j23K56o45L84j40K1oO5K73l81K05j3j60j93P6K56J56k13J87j52
1396d1oj13R3K29j0l13j11J35K7Q6j12RK96nl9o07M99J71p8o7j2j82L32n78L49
1421d8N0J27j14j95J87J42n1j72M8J43J00j85j62Mk6L43o6k24R3R3R2m23L83k31
1445i2K93k54J18k9j26j06O0L32q0m3K0o9K6j07K54k63J45J4l37L9M93l40J22
$$ plain form
1278 47 135 -79 150 149 -54 -56 5 40 184 1 60 -96 -210 90 245 0 77 -41 -196 -111 85 75 -221 10
1302 10 2 -203 -183 82 -100 -68 -29 1 159 156 181 1 -71 42 -121 -107 -92 -172 217 95 -9 264 -114 35 133
1327 133 167 133 182 9 146 382 177 -133 -31 -45 145 -36 -172 -11 -239 74 -97 -91 -46 -181 18 67 -110
1350 -110 206 -200 20 36 -27 17 -139 121 1 149 120 38 -204 206 5 -40 -227 -178 159 84 121 44 -26 33
1374 33 -167 106 -17 239 -406 -22 -162 -141 -147 -82 191 -190 15 2 -158 -351 -275 -19 137 -76 111 -41
1396 -41 -47 -160 -67 162 152 -161 -272 -137 -110 -24 -136 -127 169 164 125 -482 17 188 110 43 31 -151 181 -397 -48
1421 -48 2 129 15 -180 7 149 98 -74 -26 117 217 32 -130 -126 -152 191 125 -99 -6 87 179 -244 139 -92
1445 -92 201 -53 65 36 -90 -196 -136 196 116 73 93 24 50 -57 197 -66 79 93 -244 -205 288 -52 70
1468G0j54O8J8l7j5lK59m26N5J56j39R7K58q9j75k6j81L52M8l37L75m4j68%k1
1493e9l8M1K70j74L28q7j03l59l9KJ16N4k1p5J07qJ90j06L3j87j00K27M7o1j43
1518a45K17k06L25m4o3l06K76p0l5m28M23l2J20Q1p2O9J8R2k14j62J08K19k95
1541a24J60J06j08n3r2O3M0qj02K6J35k8j46j38K08K31l29K31J32j79J17q4j70
1564a12R5K95j68j66O6J12J36l15Kr7J05l1J9K14k57L55j23j60M6J00j93O5k30
1587b42k7J86M5rk8N4R7j89K01K62k07k80K95k50N5R9m1M8k52j84N27k4r1L1k10
1612a34K05j33o6K30N9k44q6N6J12R3m4J16M7k14K41K9k38j57L07r0k60q0L61
1635A10j58K5J08j47N8N1q9k84J73J67r6O3N2l74N01j27n4J81j37K44j14q3r7
$$ plain form
1468 70 -84 -16 2 -35 -50 -53 206 -220 -165 -9 -148 -51 207 118 -57 -83 -264 88 136 -201 174 130 -38 -38 -59
1493 -59 -97 -56 214 40 368 281 178 -181 -220 -218 -102 -48 -69 -144 -37 -45 145 39 72 -115 -215 12 59 -2 -145
1518 -145 72 -134 191 147 84 -222 54 -16 -51 -479 -56 -88 32 113 41 110 128 220 6 -156 -48 171 -124
1541 -124 36 142 34 -19 -111 -48 -8 -16 -118 -92 43 15 -131 -269 -61 170 -159 72 204 25 142 58 -112
1564 -112 -17 278 110 -56 10 122 258 -57 -55 -152 -47 -78 -59 155 -102 253 130 -30 16 116 -77 -12 -242
1587 -242 -269 -83 -38 -47 -75 -21 76 -113 88 350 143 -137 158 -92 -37 62 21 69 -183 -367 160 136 45 76 -134
1612 -134 71 -62 -128 102 161 -83 -169 -113 -1 92 48 164 211 -3 238 267 29 -128 179 89 -171 -251 110
1635 110 -48 -23 85 -62 -4 47 -42 -326 -153 14 -82 -19 33 -341 160 33 -21 160 23 267 153 70 -27
1658b7J17j55J59J07n2j10m2j03J21k04mJ27K0k02K86p5p5J64k28L14J06j92p9
1681b7r4J42J02n7o7j83J53l8J4p8J2K59k23L21m22K18p4K68k57J10J69n31J49
1704a34K13q2K14k22J35j08J7N0O6P4j73j99R4n9j22K85J63l99J27J6R0j84J54
1727A6j22J15p5J26q2k24J13r2k0K45l7J69l82K14K22j85q6k13M72q3K06n46L97
1750A48j27q9N5o4J68l52L97m5j97J99m97M28m0Q9pj51L7J46k2m3J64j17j80J40
1774D0Q1J5j88J70q1l6k5l1L07j92k34L67r7j33r2O8j9p9J17N6k36R6K38n9n6
1799cOj67J57J12Pk76L53j7j18K10k00j99K74j6k08N9j29J87j43J94Rm6o1J93
1823A78J07j21j28l27N13k69k24K90J15p6P5Q6m79K76k46J19L37m18K33Q4l45
$$ plain form
1658 -27 90 -65 94 201 149 39 -3 -106 15 -189 -193 -66 -46 -248 38 -37 -112 52 -176 138 244 52 -27
1681 -27 -121 21 123 66 -1 -184 -31 -69 -55 -133 -121 138 -85 236 -186 32 -42 226 -31 79 248 -283 -134
1704 -134 79 -3 211 -11 124 16 33 83 149 223 50 -149 -55 -114 -236 49 212 -187 -60 -44 46 -138 16
1727 16 -106 9 -66 60 -22 -246 -133 -225 -245 0 -37 132 -250 -36 186 1 -85 -298 174 91 297 -249 148
1750 148 21 -68 -13 -77 91 -261 136 91 -106 93 -404 24 -16 73 66 -85 -48 98 76 33 197 80 -100 40
1774 40 121 136 -52 118 37 1 -24 -55 252 60 -174 193 96 -37 -129 -61 -80 -159 -42 14 -222 -126 112 53 -3
1799 -3 3 -164 -7 105 112 -164 189 172 54 264 64 -135 139 123 -85 -26 -155 32 -111 83 92 46 -15 178
1823 178 285 164 36 -291 222 -47 -271 19 134 58 133 219 -260 16 -230 -111 226 -192 41 125 -220
1844b20R7L51j15j56J89j60j54K02n9o0J72k26j0L17Jj70L04k24J93j02j77k17
1866b24K27q1J69j66k1l5J24j43M7L98j52K2J62l03j41J84k11R9R8L03n71J96
1888a9P0j99R0J50p0K29l88O5Q5p5Q6jP4J30k94O3k32R1K51o7Mm5o6M55l31k9
1914B7j05K39j59J1J49p3l09K39k9K8k59j7J62J44o3J48l0j34J8m8J0j03O8M8
1938c8J37m4j17L21l74k4O2n9o1m8K18j21M2l2M30l06j03j3K67k56K89q9l7J79
1962B23m36oO0L8L4K77K7k41q0J2K52j84J6k19L88j13k9k73J98k71K38K05O1k40
1986f3j38P1J51j14J34K19k17j87K99j40j13j06L73l89K94P8j05r0r7K35l0j1
2008E4r3l4L86m44J90j44o8j22M45m0p1j23K6mM6j26L7K74j97N0q3j4K93k33j41
$$ plain form
1844 -220 -123 228 113 -43 146 -14 -168 34 -25 -85 87 -139 -149 168 169 -1 303 79 272 170 -7 -224
1866 -224 3 -78 91 -75 -96 -131 -7 -150 -103 295 143 165 327 24 -117 67 -144 -45 53 356 -215 -19
1888 -19 51 -148 -58 92 22 251 -137 -72 13 -62 24 23 97 227 -67 -4 -236 -145 106 39 43 -2 -68 387 56 27
1914 27 -78 161 2 13 162 89 -220 19 -10 18 -241 -258 -96 48 -15 133 103 -31 -13 -61 -51 -154 -86 -38
1938 -38 99 55 -62 259 -115 -139 -77 -136 -197 -245 -27 -148 -106 -138 292 -14 -117 -130 137 -119 170 81 44 223
1962 223 -213 -219 -159 -121 -87 190 217 -24 -104 -92 160 -24 -8 -227 161 48 19 -254 -56 -327 -89 116 177 -63
1986 -63 -201 -130 21 -93 41 260 43 -144 155 15 -98 -204 169 -220 74 152 47 -43 -140 95 65 54
2008 54 -39 -73 313 -131 59 -85 -153 -275 170 130 59 -64 -38 -42 4 -122 -85 189 -8 42 -41 -55 238 5 -136
2033a36r4L00k49J03j34K41j43k84L95l5O7k14L79j17j50J48j05k9j84L60j66
2054d7P1j68L04k0j64K1k63K63M4K23k66O3K48l28j54L26k9j6Qj3j70J49j69j22
2078b09M72l43Q3R2l10J04J31j39O5O5J41k45O7r6L50k76j46M61k93L6R6k28q1
2101b03J91L08l40J1J45j52j86K16j6q9N4jJ9j82K35m3J35j0k59p5N32o72M18
2124C6Ro5j58K4J20o9J71p7P6K3j37L5k09L63j6k53k8q9K47O7L8L0k30L23j5j08
2150A08j58K18k93PL21j75m9J4q0k6J17J55l41J30p8K66j03l93L36q7J25j9J16
2173A11k68K82j03J99k81Q5kOj97J76r9O7K18kk05M9o3R5K42m2l64K5O4J80l32
2198a59Q6q4P7Q0k4J17K4J88j35k66L31p7k60k2j4M96m73J07J42k82J26j00J89
$$ plain form
2033 -136 -230 70 -179 -76 -210 31 -112 -396 -1 -36 31 -183 196 79 -71 77 -28 -57 -241 119 -47
2054 -47 24 -144 160 140 -24 -3 -266 -3 41 264 -2 61 309 -19 -173 153 124 108 116 103 -67 82 -87 -209
2078 -209 263 -80 3 95 -215 -111 20 -119 -54 11 152 -93 -26 -122 228 -48 -194 267 -26 10 106 -122 -203
2101 -203 -12 296 -44 -33 112 -40 -226 -10 -26 -115 -61 -62 -43 -225 10 -33 102 92 -167 -242 290 -382 36
2124 36 45 -20 -178 -154 -34 -103 68 -9 67 90 -47 -12 -221 142 126 -127 -155 -244 3 70 108 138 -92 231 216 108
2150 108 -50 168 -125 -118 203 28 -21 -7 -87 -113 4 159 -182 -52 -130 136 33 -360 -24 -111 14 -5 111
2173 111 -157 125 22 221 -60 25 23 29 -168 8 -91 -24 194 192 -13 36 -27 68 310 268 -96 -71 -7 173 -159
2198 -159 -73 -157 -80 0 -24 93 117 305 170 -96 235 158 -102 -124 -138 358 -115 -8 134 -148 -22 -122 67
2221F7J01k61L5j8k00L33K21k23o4q4K45k90L25r1K2j20j04Q8M8J0P8q5j54J48
2245B7P0j44R7N7P7k70p5J95J59j55J5q1l9M9P1J2l10M11j27o1n4Oj56K97j57
2270h6K50Q8m77J84J72J05k7l01J51j8j44Q0k72L10j00K45m42L47J10j14R4m26
2292b71N77k77k65L19RPk5k28J46J24k67j66P55m25J93k06K86m30K59O7p2J27
2314B37l38K37k84J9L29l22p4L20k77n0J57J26m1j44O3J10n2j32R8J90r8L0k16
2337a12P1K4J4p4j91K38k43K53q8K18j79L29m08K05r9J19L9J31k35J15N6j69J1
2360B5N1k33Q9j7N1J56m57K42j37K63Q9J02%j20l4K2j14k23K95j52J34O3l9o0
2384dLk36K54n1K64n2k07J32K0j50j14L67k61k89K62M9K97l11j62J8r8J10J10
$$ plain form
2221 67 168 -93 -58 -76 -276 57 278 55 -9 -93 152 -138 187 96 118 -2 -106 -18 30 40 118 33 -121 27
2245 27 97 -47 50 107 184 -86 -161 34 193 38 53 -28 -67 -18 53 65 -245 166 39 -22 -76 -70 -226 71 -86
2270 -86 164 252 -225 -41 131 236 209 -92 59 41 -103 -23 -295 15 -85 160 -282 65 175 61 155 -271
2292 -271 306 29 -236 83 92 99 74 -154 -8 116 -151 -317 438 13 206 0 286 -144 115 182 110 237
2314 237 -101 136 -148 -129 200 -122 -196 124 -153 -203 -46 80 39 -105 -42 68 16 -116 -18 172 74 104 -112
2337 -112 -41 -17 -3 -77 -268 -30 -273 -20 -108 110 -69 260 -148 57 -42 77 116 247 12 127 183 14 25
2360 25 76 -157 -68 -85 -34 122 -335 -93 -230 33 122 224 224 104 70 92 -22 -245 50 -102 32 95 56 -4
2384 -4 -1 -237 17 -34 230 178 -29 103 123 -27 -141 226 -35 -324 -62 -13 284 -27 -189 -171 -269 -159 -49
2407d9K09j92n5J40o3j30L61l68P7K2m8J43k38K91r5l7K14O4m6j04J87j51k15
2430h3j30K04J72j29P9j22J52l06m3M41l18J6p2J59J20J02l61J82r8n1J27mN1
2453H8M0j90L48m47K00O7l50L21j01J01j66J2m1K25Q4k92K28j36p8K33M4M8j81
2476E7K11k72K61j15l8m5j66k9L02k16l1Q8J37j43r0J55n5K09m33%L12k12J51
2499C8r0J72p5j88J99q7l4L70m28O4k4K01j28n4K15P8j59J23N3k27Q5j59j42J20
2523g7J60ok2l11J73M6j53K41j66N7J10R9J95j72J0j61k91K98J27l09J82K33r1
2546A72j87O0K18l24R1j7o0J10j25K69m71J51J01O7j22K23k56Q9J22j1k60J88
2568B8J54n9k24J04K03l81L51j45k07j8L63k39n2K27n2l4K32K7q8j52L5J08j55
$$ plain form
2407 -49 160 -32 -87 53 -10 -140 221 -147 -70 -48 -96 47 -191 100 5 -32 182 246 200 96 283 132 -83
2430 -83 -213 -9 163 34 113 -9 143 -163 -206 235 -83 -67 -139 20 140 242 -119 63 -35 -86 41 37 88
2453 88 128 -62 286 -161 39 106 -244 77 -24 77 -89 -77 -118 107 191 -101 127 -9 -87 146 190 238 57
2476 57 268 -4 257 142 104 59 -107 -136 166 -50 -81 7 144 1 -89 66 11 220 -213 -213 99 -113 38
2499 38 -52 120 45 -143 56 -31 -65 305 -123 -59 -83 118 -10 -64 151 229 70 193 246 19 104 -55 -197 -77
2523 -77 83 77 55 -256 -83 -37 -190 51 -115 -58 52 151 346 174 184 23 -268 30 157 -152 30 263 172
2546 172 -15 45 263 -61 30 13 -47 63 -62 207 -264 -113 -12 55 -67 156 -100 -11 111 100 -160 28
2568 28 182 123 -101 3 206 -175 176 31 -176 -194 169 -70 -122 105 53 19 251 278 190 38 73 181 26
2591B6J27l9k16L16n70K10R6K21l61K82n9J93l56j22K29m1N3n5K86l5j51l7r5
2614i8n0L87r9K42k41l5J4j26j25M09n07K93l1J9k71L3J45n3K17k60L4K80l18
2637a41K67j70J31p4K12l41K65L3k89K13k3J49l38k2J02L32k40m3r5J11M0j83
2659a04N25k39J9l23M4J75j94M0N1J25p1J32l91L09j57K6j45J49k64L09l3J9r2
2682i0nP3j99K94k20K72j0J3J50k90j90K62j85J49k92M09j30J3l48O06j26M1J85
2705C82m90q1K22q0n4K15k12j0N00m96j50M92n59L07M4j32J99q5m5J51J9J10k58
2728a1N8j12O9l5K11q6M6j47P9j71N8j01L61m14K48L84m74J81N5J4j80JN2l53
2752b67L94k88J2j35L77j57J37J70l28K12mk01J03J9j50N5PpMK97k99R3k08J81
$$ plain form
2591 26 153 114 -102 214 -356 -146 -50 171 -190 92 33 226 -130 -252 -23 -64 -11 -66 220 185 34 -3 -98
2614 -98 -148 239 140 382 141 106 120 -6 -131 278 -229 64 33 52 -219 -186 -41 -94 123 -137 -103 177 -141
2637 -141 126 -44 87 13 225 -116 149 182 -107 106 83 232 -106 -128 -26 306 66 23 -72 39 79 -104
2659 -104 421 182 201 -122 -78 97 -97 -57 -6 119 48 180 -211 98 -59 -33 -178 -29 -293 16 -17 2 -90
2682 -90 -95 -22 -221 73 -147 125 115 128 278 -12 -202 60 -125 24 -268 141 11 24 -324 282 156 197 382
2705 382 -108 -189 33 -47 -101 114 -98 -108 392 -104 -254 238 -321 -14 30 -102 97 12 -33 118 137 247 -11
2728 -11 47 -65 4 -31 180 94 140 -7 72 -99 -41 -142 219 -195 53 437 -37 144 199 213 33 34 86 -267
2752 -267 127 -161 -149 -284 93 -64 73 243 -85 127 123 -78 25 44 -106 -51 -44 -51 -47 250 -49 44 -164 17
2776A7l1k03j6J69J19j01J93K2l00J16l04J49q0J10p3K27l5l2rj28K67j44l51
2799d18N69l07j06M04jo1n9j45K82j99n1O4J24l21K96Q0j24ol2J94l92J94o6n9
2823a40L05R5j50l07K49k01m0K03RJ31L80p04n6L21l18L3P5P3J73m5R1K45n63
2846a41n7J71n8K95j08l44K40o8J1k16N25P8l94nK72j27Q3o9l3N1R5l4n6P4l83
2871a98K36k12J96l38K43J1j6j5J62j64L76P3l12j17j46L98m08K06l0J04N3p3
2893B9k98K65J25j12j10N5O6N1n8O7j25J61o5j98J07J21j83K11R6j63K35r7q4
2916I6M2r3J0o6J63k60P4l1L9P2R3j44k53J77L32P5l83l8K02j20L5K24j79j28
2940f1r7J99oj5J34j96J74o7k44K20o0J84j94m68M66J47k34r8J90K75m48M47k57
$$ plain form
2776 17 -14 -217 -233 -64 55 -46 147 169 -131 -15 -319 -170 -250 -140 -213 14 -21 -53 -62 -190 77 -67 -418
2799 -418 151 -156 -262 142 141 80 21 -124 158 -41 -92 -28 96 -225 71 151 27 21 -11 183 -209 -15 -81 -140
2823 -140 165 260 110 -197 52 -149 -189 14 23 154 534 -170 -226 95 -223 -190 -115 -42 131 86 177 422 -141
2846 -141 -198 -27 -85 210 102 -242 -2 -70 -59 -275 250 328 -66 -71 201 74 157 88 55 106 201 167 111 185 -198
2871 -198 38 -174 22 -316 -73 -62 -78 -93 69 -95 281 354 42 -75 -221 177 -231 -25 -55 49 102 29
2893 29 -269 -4 121 9 -101 -46 20 71 13 80 -45 116 51 -147 -40 81 -102 109 205 42 277 180 96
2916 96 138 45 55 -11 152 -108 -34 -65 -26 46 139 -5 -258 -81 251 326 -57 -95 107 -13 22 246 67 -61
2940 -61 -158 41 35 20 154 -42 132 65 -179 41 -19 165 -29 -497 -31 116 -118 -216 -26 249 -199 248 -9
2963ij03K44k48n7K28j41L12l58k30K81K02k08K69j94m2J37k69M1L34k61k15L49
2985F2qJ59l74Q0J60j21NK4n7N0n6J23n3N3k53J34J19m4P3o0rL8J27q2k89J74
3011b5j01L78k53K3l19J50L19j26j3L1J88k41K0Q4j39K03L0k29R0j89J73J75k88
3034e9K6N1j41J74q4L9J41l1k56J42J04k27l57O53m2j98l3k20L20R0j0l3k07n1
3058b09K52q2k66J20K18N6n00L48J00J72J35m30K31R9l32J42n9J59J17j82j55
3079f6k00K65p1k34J84O9K4M9J76l2j77k19P7K70j65k0K21j51Q4j93J43j14M38
3102C58l55K38k64P4l7N5j80k9Rr1L27l20N77n29j90L20O3k37K95j12n9P7k56
3125b66M52l42Q4J83j78K40j34j7l9l2k11J42l2J66o2J56p1Q5j84J75m5k07L28
$$ plain form
2963 -9 -112 132 -116 -173 55 -86 226 -132 -362 -81 121 -87 182 -12 -54 83 -186 -145 189 -72 -287 62
2985 62 54 213 -161 -81 79 -42 -37 -13 -70 -20 -76 47 -6 47 -206 -72 47 3 76 16 7 45 172 90 -199 -25
3011 -25 -126 252 -1 22 -297 -147 172 46 33 64 252 11 31 115 -24 179 209 -20 70 -119 54 229 -59
3034 -59 -33 18 -123 51 -33 6 147 116 -140 2 106 -121 -478 175 133 -65 -98 -318 2 92 82 49 -158 -209
3058 -209 43 -39 -305 -185 33 89 -411 -63 37 209 344 -86 145 244 -88 54 -5 154 271 89 -66
3079 -66 -266 -1 -72 -306 -122 -53 -29 20 196 164 -13 -232 -155 115 -50 -70 151 0 84 -109 34 -80 358
3102 358 3 241 -23 51 14 69 -111 -140 -131 -222 105 -215 362 -167 -357 -37 26 -211 84 -28 -87 -10 -266
3125 -266 186 -156 -72 111 -67 173 39 22 -17 -49 -260 -118 -150 16 -46 110 39 124 -60 115 70 -137 191
3148A91j85r3R2L7P1j23L1K09j36K3k51K93L3j15k54J64J41J88k04l53L21l0j61
3171a11J75l79L62j09J86j47K27l1m9J4J26j67l33K96l08oL22Pk23J02j5j6O4
3194a3Q9O2q3J01j13q4l5J88j73N2j66M12k51J57n76J65L28m8J50r1l65K54R5
3217E5l3J68j37R7k99L9K51j57P2m0J24Q2k15K27k15l13O09r2o0j09j99J07R1
3240E3k50M26l32K60j26l45M60j65q8J84Q3J49l29J23j1p0J1J47k11j25J99r2
3262d9K71l12K18j04j25K36J03k94J38j67J02Ol0N0j56j40MK22M4k62K94N0j91
3285i2j3lK59n6k02J61k47J66R8j03Q4K60j81o0J60Q3j88Jj63M0Q1MP1o3k13R9
3311a7j44J53rkJ63o1j25J03j25L7N3o4j92L17p0j87K84j08j08j87K08K51l77
$$ plain form
3148 191 6 -87 5 42 113 -10 21 230 94 117 -134 159 192 77 -177 -13 128 316 112 -241 80 50 -111
3171 -111 64 -315 47 -62 124 -23 204 173 124 138 264 97 -236 60 -248 -254 68 75 -148 -46 -61 -77 -13
3194 -13 76 138 55 156 43 -41 -76 112 -61 -9 -175 237 -14 143 -433 -268 60 12 162 71 -294 -40 55
3217 55 22 190 53 150 -149 -110 141 -16 56 16 140 222 7 234 19 -294 315 223 163 54 -145 -38 53
3240 53 -197 229 -103 157 31 -314 146 -19 -107 77 160 309 -20 103 92 22 33 180 -31 -156 43 -49
3262 -49 222 -90 128 24 -101 135 238 -56 82 -85 17 23 -7 43 -113 -253 -249 -27 17 -245 49 99 -92
3285 -92 -105 -108 151 95 -107 54 -193 -27 71 -32 52 312 131 71 231 314 126 127 -36 4 85 89 160 97 -116 -17
3311 -17 -161 -8 -17 -19 144 83 -42 61 -64 -27 26 -38 -230 87 17 -170 114 6 -102 -289 -81 170 -207
3334b07J74k99K87nR1l15M74j24q9M46m31%J21k21OL20k13j9K1j34K72l81L82
3357A56r8j42K55j71q3M9kkQN5l8J11J4j14R2j23pR2j07Q2j52J52pj79J67k50
3383b42J34k2j32J1qL64j37l0K29j79k8Rm5K03k67J30j84L57j29j51K05k63m0
3406b15K65l7j30J68k12O8K78J11m17J2K96j83q3K94k93J91j32qMJ94l3q0j96
3429a38J37p6j32K44Q5l51J10J85j01j31J32j58J73M8R4j2j35n5K04n9j98K56
3451A22k48L82j50K4K3k9l46J29L07r7j59k6m2O4K06l05o3L23j26K02O7k45J48
3474A61J3n8k37K6P7J82j23j92L66l92j4K40j89J73K3K05l78K25k09n3K83L2l29
3497a68J59l0K40k13j59K66j41n6kp7K54%p5k04L97k24j21O3M8p2k0J93k65L68
$$ plain form
3334 -207 -33 -332 -45 -50 41 -274 200 76 -13 433 2 2 123 -98 -92 228 15 -4 17 -117 155 -226 156
3357 156 58 -84 171 0 -83 -34 -36 -38 -30 25 -13 98 112 -2 90 -33 -40 52 -55 27 -125 27 20 -159 8 -242
3383 -242 -108 -130 -262 -251 -259 105 -32 -62 167 -12 -40 -31 -76 127 -140 -10 -194 163 34 -117 88 -175 -215
3406 -215 50 13 -117 51 -161 -93 185 296 -121 -109 187 4 -79 215 -78 113 -19 -27 -23 171 138 58 -138
3429 -138 -1 -77 -209 35 120 -231 -121 64 -37 -168 -36 -194 -21 27 121 109 -26 -81 123 64 -134 122
3451 122 -126 256 106 130 153 124 -222 -93 214 117 -42 -68 -110 -46 160 -145 -208 115 -11 191 258 13 161
3474 161 174 116 -121 -95 -18 164 41 -151 215 -177 -191 49 -140 33 56 261 -117 108 -101 -154 129 161 -168
3497 -168 -9 -39 201 -12 -171 95 -46 -102 -104 -181 73 73 -2 -206 191 -33 -154 -91 -43 -115 -135 58 -207 161
3521A61k88J83j90Q1L14l07j20l0M41l28J66l25K23Q7K8j04j5n3o5J29R2J9r1
3544HJ2M9K6j54j81J05K24l15J73J00r6r6M7N0N8l08o1J46L54j45J0J89j99q7
3568i1K59j93L1P6n26L95p0l3M60m35M5m5p8J3J70K4L4K12m22k17L44j78J16K4
3592h5j13M9L35j59M1j55j7MN5J85j20q3K42j11j90L1K25p9q7k6oL04r0j96J60
3617A14L9q1q3m7l2K34j83K00l94J38j3R7R8J80j62l49J70K72j75q7l6N1k5P1
3641cKm4J34P4K9j02p5mJ52j69R4j3j25N1L81m95j24K54k32K26K09k54oL38l52
3666e4J61m26J89J25j16P6K24k34J08m36L52p4J17J49k31N1M13k72q3o8q4L72
3688B59l16J27j17J22J42m22K27J34J51l53n2K40j94O7m0j53L00j55j25M95k30
$$ plain form
3521 161 -127 56 -134 -53 261 -46 -166 -196 245 -83 83 -242 -19 68 96 -8 -23 -76 -141 -12 80 99 8
3544 8 20 69 95 -59 -240 -135 89 -226 -53 47 -49 -145 -98 -48 10 -298 -359 -213 141 -4 6 195 -4 -91
3568 -91 168 -25 6 82 -444 -49 -119 -152 308 -127 -82 -127 -205 -192 -22 2 36 248 -174 -391 -47 -225 -109 -85
3592 -85 -198 -149 186 27 68 -87 -104 -100 -45 140 20 -63 179 68 -122 -91 134 55 -32 -58 -64 240 150 -46 114
3617 114 153 72 -11 -58 -90 144 -39 161 -233 -95 -108 -11 87 267 105 -244 -74 198 23 -64 -100 -49 -74 -3
3641 -3 -1 -45 89 163 192 90 15 11 163 -6 88 75 -50 1 382 -113 -237 17 -215 11 220 -34 -40 298 -54
3666 -54 107 -319 -130 -5 -121 -45 179 -55 53 -383 -31 -105 12 161 -70 -19 394 122 39 -29 -113 259
3688 259 -57 70 -47 75 217 -205 22 156 307 -46 -98 142 -52 15 -25 -178 122 -33 -158 337 107
3709A07k01J29K39m59J63Q7j09J11o1r6q6K86k42J48q2J32L6r3j08J64o0M7J42
3732A94j85q3J99k14J42j49P7K87k18m7N1L8l02J22Q8K7k1j79J72j8j13l3O4J2
3756h9J45n3n1J29k03J31R6q3l25L63j27J42Q0j37j41p3L7J29J8j75O7K71j28
3779B3k60J91p6j06K69k21J13j38L44l31K41k28K7o5K76j65k27J60J8L54l46L29
3801A82j93m7l5J90n6K3j54J22m7p2o1O5K02J38j64K59r8j78k15j03K90kk58K68
3825E6j5P9j60R7j30P9j19K77k56J69L4k25K76q2j8n5k05L07l29K26J70j49o6
3848c9J27j58J66r7Q1k68Q6L63m04Q3k12K51L18k30j73R5j04K5j32M51m28K39
3870D0M9m23K06L03m09PL99n65M83j54J59l60M8l9K62l72N93m71K48Ll8J0N9j1
$$ plain form
3709 107 -94 35 274 -185 -22 65 -44 67 6 -90 -176 110 -132 16 -66 66 102 9 -99 65 5 52 194
3732 194 9 -74 125 -89 53 -96 -19 268 50 3 54 92 -210 -88 0 27 6 -173 -1 -19 -132 -165 -101 -89
3756 -89 56 3 -48 81 -122 9 105 22 -303 60 -67 75 155 18 -123 -196 -159 -30 -12 -187 -120 151 23
3779 23 -237 -46 -122 -228 41 -180 -67 -205 139 -192 49 -179 -152 -217 59 -106 -333 -173 -155 199 -147 182
3801 182 -11 -58 -93 97 41 64 -90 32 -15 -87 -148 -83 119 257 93 352 254 76 -139 -242 48 46 -212 56
3825 56 41 120 -40 57 -73 6 -113 164 -92 77 111 -114 162 80 62 7 -198 109 -220 6 176 27 -39
3848 -39 88 -70 96 -1 80 -188 -102 261 -143 -60 -272 -21 297 67 -106 -11 -115 -90 -222 229 -199 40
3870 40 89 -334 -128 175 -234 -227 172 -393 90 -64 95 -265 -217 -256 6 -366 227 -244 4 7 -31 -21 38 27
3894B7j18J19j56L12l01J06k63K63J30j99N8K10m1l6r4RL2k23J51j18J22m2j88
3917b40K23M8MK25o9k79o9J30J97k21J79J29k88m0K08k7K30n22Q2K9N9k9R0p3
3941b4qm2N3J60p1N7Q3l04K01l40L14j05L4j92R8j0J05l02K35J05J11P3l05nL20
3966B41k26R1j51K75k16J7Q6j50Qj05LJ73K35m29J83r8o6r3K52j00qJ09j67J59
3990B3j97n1J97J7l0k31K89Q5j18J12j98K08p2K8j0k4J68j33mj78K28j3k78K45
4014F3n4j28K04l34J75J55r4Kj29K5J87o6l2M1J81k12r4K6J2j9J59p7J23l58M30
4039A86nk00M9k12J97L2k96L73m3J84q5M9r3l82J36L39j55m7J87k26L0q3q1J53
4063GJ69l79M4Q9J48om7lJ24K25k09K2j32k79K59j11J42j19L2L29m00rL25m48
$$ plain form
3894 27 -91 28 -128 184 -117 -11 -274 -11 119 -80 -22 188 147 111 17 26 58 -165 -14 -132 -10 -52 -240
3917 -240 -17 31 35 260 191 -88 -157 -27 170 -51 128 257 -31 -71 137 110 340 -182 -100 -71 -12 -41 49 -24
3941 -24 -32 -74 -21 139 68 125 208 -96 105 -235 79 -26 8 -184 -86 -96 9 -293 -58 47 158 231 -74 -79 241
3966 241 15 106 -45 230 14 31 117 -33 -25 -130 -127 46 281 -148 35 -63 -129 -222 30 -70 -78 31 -136 23
3990 23 -174 -225 -28 -11 -41 -272 17 102 -16 96 -102 106 34 62 52 28 196 63 59 -119 109 96 -182 63
4014 63 9 -119 85 -249 -74 81 -13 -11 -140 -115 72 6 -26 15 196 -16 -110 -84 -72 -91 68 -9 114 -244 186
4039 186 181 -19 30 -182 15 47 -249 124 81 265 180 229 136 -246 -110 229 74 27 214 -12 18 -65 -146 7
4063 7 176 -203 -159 -70 78 72 25 22 146 371 162 184 52 -227 32 -79 63 -56 -24 305 -95 -104 221 -227
4087b27K51K24p7p8nj19j91l6K01j01j6K29j3j69P1m3K01k37l3K02r4J52o1Mj1
4112B4L8P9l14K87J65n04K51k1k32M69P6l36j42K41o1K90m99K97J77l92l1Q5k6
4135g9K36l91M40k20q8R4m34O53k85K26l28K63k31K09k49J47P0J25r2P7j86N6
4157A3J90k06p1J21j61J09o4j03J75j73M29l69q8J7M98l05r2L9O6N6l34J3L42
4180A02j71lK1J13J45j88k09M53k96J38J40l13n2J39J81k54J47N5j08j6L9J32
4202A95j11j19k0o0J62R8j67k4J26l20N52n98J47J35k34M52m23K72j07J03j13
4223e4K20m24L43j15J03J0j06J76n08L10m2N7M1J8j17K50l55N7J66k0M4j85l3
4246a64J14M25o73L23j23Kq6j56K35N2K29j66q5m9r5K29L3n9r2J69m39L67J15
$$ plain form
4087 -227 24 248 171 93 88 -31 -222 -258 -57 -158 -174 55 42 -127 -56 -99 102 -135 -168 34 -60 92 31 35 24
4112 24 62 141 -173 114 279 -225 26 5 -227 242 318 -18 -160 81 20 310 -189 108 285 -107 -138 -53 -79
4135 -79 157 -234 206 -14 -102 -8 -442 211 -74 152 -176 87 -144 65 -184 -37 33 158 66 143 -43 13
4157 13 203 -3 -74 47 -114 -5 -69 -172 3 -170 259 -110 -198 -181 317 12 -80 -41 25 81 -253 -240 102
4180 102 -69 -72 -51 62 207 19 -190 263 -33 105 245 -68 -120 19 200 -54 93 148 40 24 63 195
4202 195 84 -35 -55 -115 47 145 -22 -46 80 -240 312 -286 -139 -4 -238 214 -209 63 -44 59 -54
4223 -54 166 -258 85 -30 73 83 -23 153 -355 -45 -87 -30 11 29 -88 162 -193 -136 30 10 54 -131 -164
4246 -164 -50 375 -298 25 -98 -96 -182 -338 -103 -51 178 12 -73 -122 -217 12 45 -14 -106 63 -376 -9 106
4269A06L9l11P4j81K85Q6r7j07K33j93J94p7j25j8m9J11j70K1K19m0m02K67j7
4292a52J29l5l5n6Mj20K27j15K4J55l1J72j45J90j55j38K33k24L4R6l7L3k45J16
4316g5J68j51L5P3r3p4OK26j12p8K54k3l57J08O4R0J12l16J4M0K03k5J16j98j66
4341a59M28n13N15k80j44P4J45Jj08jM1n4m2L5L43j73k0p5Rj34O0k85L26N1j60
4366a20k5J38P1j01r9L48l09J44K8r7L14l91j47K11j4p4K13q4K38j56j75K8j1
4389g0j25J77J44j1k25OK75n5j20j49Q2M00l75J16L9n2o8q8M47j94k63n1Q6K22
4413A48o7k27p4J60L06n4k20mj35J88jk49L26j57K33j96j41L19j97q9J64l5R0
4436H8k24J58n8q9R9J1k10K00Q8l46J39L10j05j83Qj91J57K01Q8p4j16l2K06j60
$$ plain form
4269 106 145 -166 -92 -273 12 98 1 -106 127 -66 128 51 -74 -92 -141 -30 -200 -179 40 0 -402 -135 -152
4292 -152 -23 -58 -93 -149 -145 -265 -38 -153 -129 26 -5 167 22 212 57 -81 152 -72 -38 58 21 54 -191 -75
4316 -75 93 -58 -23 50 -43 -117 -111 115 3 -75 179 156 -201 -93 -29 61 173 -143 -129 -89 114 89 205 7 -159
4341 -159 269 -244 271 -9 -153 -79 66 67 -41 -42 -1 -55 -97 -62 281 108 88 13 22 -112 -52 -337 -11 40 -120
4366 -120 -145 -7 64 -37 -136 212 -97 47 75 -22 292 -99 -246 -35 -49 -123 90 6 244 88 -87 -59 -70
4389 -70 -195 -18 126 115 -110 -104 171 116 -4 -153 -71 329 -46 70 109 57 -11 -99 348 154 -109 -160 -74 148
4413 148 81 -146 -220 -60 246 192 -28 -32 -167 21 20 -229 97 -60 173 -23 -164 155 -42 -131 33 -2 88
4436 88 -136 22 -36 -125 -26 -15 -225 -25 63 -283 -144 166 61 -122 -114 -305 -148 53 141 67 -49 -81 125 -35
4460c5K05j89j66J08Q2n2K01M3r5j62k91K99j20J48J04k62K35N7J56l31J84k77
4482a58n2L39j05O8j28k3K24o2K7k28J44J94l44N8K92l32J59r6J49J9l82L27k04
$$ plain form
4460 -35 170 -19 -185 -77 5 -47 154 197 102 -60 -351 -52 -172 -24 80 -182 53 110 266 -65 119 -158
4482 -158 -210 129 24 92 -36 -59 165 103 130 -98 46 240 -104 -46 246 -86 73 -23 126 145 -237 90 -114
$$ [...]
8191a
##END NTUPLES=NMR FID
##END=
