##TITLE=1H_Pr H2O
 200.13MHz, ,
 8 sc
 
 29.4.2025
##JCAMPDX= 6.0         $$ Bruker NMR JCAMP-DX V2.0
##DATA TYPE= NMR FID
##DATA CLASS= NTUPLES
##ORIGIN= UXNMR, Bruker Analytische Messtechnik GmbH
##OWNER= pz
$$ XWIN-NMR		Version 3.5
$$ Tue Apr 29 15:34:33 2025 Russian Standard Time (UT+4h)  she@DPX200
##.OBSERVE FREQUENCY= 200.1313
##.OBSERVE NUCLEUS= ^1H
##.DELAY= (6, 6)
##.ACQUISITION MODE= SIMULTANEOUS
##.ACQUISITION SCHEME= undefined
##.AVERAGES= 8
##.DIGITISER RES= 18
##SPECTROMETER/DATA SYSTEM= spect
##.PULSE SEQUENCE= zg30
##.SOLVENT NAME= CDCl3
##.SHIFT REFERENCE= (INTERNAL, CDCl3, 0, 14.3821)
##AUDIT TRAIL= $$ (NUMBER, WHEN, WHO, WHERE, WHAT)
$$ ##TITLE= Audit trail, XWIN-NMR		Version 3.5
$$ ##JCAMPDX= 5.01
$$ ##ORIGIN= Bruker BioSpin GmbH
$$ ##OWNER= she
$$ F:/spectra/data/she/nmr/H-C/1/audita.txt
$$ ##AUDIT TRAIL=  $$ (NUMBER, WHEN, WHO, WHERE, WHAT)
(   1,<2025-04-29 15:33:02.51 +0400>,<she>,<DPX200>,
      <created by zg, POWCHK disabled, PULCHK disabled
       configuration hash MD5:
       00 E9 B6 7A A2 85 ED C7 34 08 36 98 17 FE 4E 26
       data hash MD5: 16K
       72 25 1B 5B A3 AF 72 8D 07 8E 50 BA B3 3C 7F 1E>)
$$ ##END=
$$ 
$$ hash MD5
$$ 75 F6 61 D9 52 40 B4 EE 24 61 F4 83 00 78 C6 E5
##$RELAX= 
##$RELAX= 
##$RELAX= 
##$RELAX= 
##$RELAX= 
##$RELAX= 
$$ Bruker specific parameters
$$ --------------------------
##$DU= <F:/spectra>
##$EXPNO= 1
##$NAME= <H-C>
##$PROCNO= 1
##$TYPE= <nmr>
##$USER= <she>
##$AMP= (0..31)
100 100 100 100 100 100 100 100 100 100 100 100 100 100 100 100 100 100 
100 100 100 100 100 100 100 100 100 100 100 100 100 100 
##$AQSEQ= 0
##$AQ_mod= 1
##$AUNM= <au_zg>
##$AUTOPOS= <>
##$BF1= 200.13
##$BF2= 200.13
##$BF3= 200.13
##$BF4= 200.13
##$BF5= 200.13
##$BF6= 200.13
##$BF7= 200.13
##$BF8= 200.13
##$BYTORDA= 1
##$CFDGTYP= 0
##$CFRGTYP= 5
##$CHEMSTR= <none>
##$CNST= (0..31)
1 1 145 1 1 1 1 1 1 1 1 1 1 1 1 1 1 1 1 1 1 1 1 1 1 1 1 1 1 1 1 1 
##$CPDPRG= <>
##$CPDPRG1= <>
##$CPDPRG2= <>
##$CPDPRG3= <>
##$CPDPRG4= <mlev>
##$CPDPRG5= <mlev>
##$CPDPRG6= <mlev>
##$CPDPRG7= <mlev>
##$CPDPRG8= <mlev>
##$CPDPRGB= <>
##$CPDPRGT= <>
##$D= (0..31)
0 0.7 0 0 0 0 0 0 0 0 0 0.03 0 0 0 0 0 0 0 0 0 0 0 0 0 0 0 0 0 0 0 0 
##$DATE= 1745926382
##$DBL= (0..7)
120 120 120 120 120 120 120 120 
##$DBP= (0..7)
150 150 150 150 150 150 150 150 
##$DBP07= 0
##$DBPNAM0= <>
##$DBPNAM1= <>
##$DBPNAM2= <>
##$DBPNAM3= <>
##$DBPNAM4= <>
##$DBPNAM5= <>
##$DBPNAM6= <>
##$DBPNAM7= <>
##$DBPOAL= (0..7)
0.5 0.5 0.5 0.5 0.5 0.5 0.5 0.5 
##$DBPOFFS= (0..7)
0 0 0 0 0 0 0 0 
##$DE= 6
##$DECBNUC= <off>
##$DECIM= 32
##$DECNUC= <off>
##$DECSTAT= 4
##$DIGMOD= 1
##$DIGTYP= 9
##$DL= (0..7)
0 120 120 120 120 120 120 120 
##$DP= (0..7)
150 150 150 150 150 150 150 150 
##$DP07= 0
##$DPNAME0= <>
##$DPNAME1= <>
##$DPNAME2= <>
##$DPNAME3= <>
##$DPNAME4= <>
##$DPNAME5= <>
##$DPNAME6= <>
##$DPNAME7= <>
##$DPOAL= (0..7)
0.5 0.5 0.5 0.5 0.5 0.5 0.5 0.5 
##$DPOFFS= (0..7)
0 0 0 0 0 0 0 0 
##$DQDMODE= 0
##$DR= 18
##$DS= 0
##$DSLIST= <SSSSSSSSSSSSSSS>
##$DSPFIRM= 0
$$ [...]
##$SUBNAM0= <"">
##$SUBNAM1= <"">
##$SUBNAM2= <"">
##$SUBNAM3= <"">
##$SUBNAM4= <"">
##$SUBNAM5= <"">
##$SUBNAM6= <"">
##$SUBNAM7= <"">
##$SUBNAM8= <"">
##$SUBNAM9= <"">
##$SW= 18.0517328524113
##$SWIBOX= (0..15)
0 0 2 0 0 0 0 0 0 0 0 0 0 0 0 0 
##$SW_h= 3612.71676300578
##$TD= 16384
##$TD0= 1
##$TE= 0
##$TE2= 300
##$TE3= 300
##$TEG= 300
##$TL= (0..7)
0 120 120 120 120 120 120 120 
##$TP= (0..7)
150 150 150 150 150 150 150 150 
##$TP07= 0
##$TPNAME0= <>
##$TPNAME1= <>
##$TPNAME2= <>
##$TPNAME3= <>
##$TPNAME4= <>
##$TPNAME5= <>
##$TPNAME6= <>
##$TPNAME7= <>
##$TPOAL= (0..7)
0.5 0.5 0.5 0.5 0.5 0.5 0.5 0.5 
##$TPOFFS= (0..7)
0 0 0 0 0 0 0 0 
##$TUNHIN= 0
##$TUNHOUT= 0
##$TUNXOUT= 0
##$USERA1= <user>
##$USERA2= <user>
##$USERA3= <user>
##$USERA4= <user>
##$USERA5= <user>
##$V9= 5
##$VALIST= <valist>
##$VCLIST= <CCCCCCCCCCCCCCC>
##$VD= 0
##$VDLIST= <DDDDDDDDDDDDDDD>
##$VPLIST= <PPPPPPPPPPPPPPP>
##$VTLIST= <TTTTTTTTTTTTTTT>
##$WBST= 1024
##$WBSW= 4
##$XGAIN= (0..3)
0 0 0 0 
##$XL= 0
##$YL= 0
##$YMAX_a= 443346
##$YMIN_a= -408870
##$ZGOPTNS= <>
##$ZL1= 120
##$ZL2= 120
##$ZL3= 120
##$ZL4= 120
##$ABSF1= 10
##$ABSF2= 0
##$ABSG= 5
##$ABSL= 3
##$ALPHA= 0
##$AQORDER= 0
##$ASSFAC= 0
##$ASSFACI= 0
##$ASSFACX= 0
##$ASSWID= 0
##$AUNMP= <proc_1d>
##$AZFE= 0.1
##$AZFW= 0.1
##$BCFW= 1
##$BC_mod= 2
##$BYTORDP= 1
##$COROFFS= 0
##$CY= -3
##$DATMOD= 1
##$DC= 2
##$DFILT= <>
##$DTYPP= 0
##$F1P= 0
##$F2P= 0
##$FCOR= 0.5
##$FTSIZE= 0
##$FT_mod= 4
##$GAMMA= 1
##$GB= 0.15
##$INTBC= 1
##$INTSCL= 1
##$ISEN= 128
##$LB= 0.25
##$LEV0= 0
##$LPBIN= 0
##$MAXI= 10000
##$MC2= 0
##$MEAN= 0
##$ME_mod= 0
##$MI= 1.114404
##$NCOEF= 0
##$NC_proc= 0
##$NLEV= 6
##$NOISF1= 3.799351
##$NOISF2= 2.8
##$NSP= 1
##$NTH_PI= 0
##$NZP= 0
##$OFFSET= 14.38212
##$PC= 1
##$PHC0= -1267.288
##$PHC1= 5.59221
##$PH_mod= 1
##$PKNL= yes
##$PPARMOD= 0
##$PSCAL= 0
##$PSIGN= 0
##$REVERSE= no
##$SF= 200.129724274929
##$SI= 16384
##$SIGF1= 3
##$SIGF2= 2
##$SINO= 400
##$SIOLD= 16384
##$SREGLST= <1H.CDCl3>
##$SSB= 0
##$STSI= 0
##$STSR= 0
##$SW_p= 3205.1282051282
##$SYMM= 0
##$S_DEV= 0
##$TDeff= 0
##$TDoff= 0
##$TI= <>
##$TILT= no
##$TM1= 0
##$TM2= 0
##$TOPLEV= 0
##$USERP1= <user>
##$USERP2= <user>
##$USERP3= <user>
##$USERP4= <user>
##$USERP5= <user>
##$WDW= 1
##$XDIM= 8192
##$YMAX_p= 0
##$YMIN_p= 0
$$ End of Bruker specific parameters
$$ ---------------------------------
##NTUPLES= NMR FID
##VAR_NAME=  TIME,          FID/REAL,        FID/IMAG
##SYMBOL=    X,             R,               I
##VAR_TYPE=  INDEPENDENT,   DEPENDENT,       DEPENDENT
##VAR_FORM=  AFFN,          ASDF,            ASDF
##VAR_DIM=   8192,          8192,            8192
##UNITS=     SECONDS,       ARBITRARY UNITS, ARBITRARY UNITS
##FACTOR=    0.0002768,     1,               1
##FIRST=     0,             0,               0
##LAST=      2.2672688,     0,               0
##MIN=       0,             -408870,         0
##MAX=       2.2672688,     443346,          0
$$ Real data points
##PAGE= N=1
##DATA TABLE= (X++(R..R)), XYDATA
$$ [...]
1987E00k468J090K755p92k736K73K827J28k762n59K600J070k520j386K209J828
2003B057j982k110J663K317j251k560R27K582m20k672l4K705M23k583r14K538
2019F86J206k285j597K067J886j754k106J316K394r94k476N15K642j37k664k38
2035a539K575O84k514r86K260J395k033j716J746J988j376k317J142K384p06k532
2051a545L38K556K8k452n15K427Q43k218j274K051J616j853j844J503K144j268
2067E37k206Q31K352m32k435P8K352M40k427p23K270J100k099j430J938J585j514
2084B17j950J297K070q82k231M65K421k22k347k38K401N01k242q44K016J263j917
2101b22j440J517J845j337k022J037K133o41k328M38K206M9k253l78K179O97j953
$$ plain form
1987 500 -1968 -878 1877 1085 -1651 -1378 1449 1577 -1185 -1744 856 1926 -594 -1980 229 2057
2003 2057 75 -2035 -372 1945 694 -1866 -939 1643 1223 -1449 -1483 1222 1645 -938 -1852 686
2019 686 1892 -393 -1990 77 1963 209 -1897 -581 1813 819 -1657 -1142 1500 1363 -1301 -1539
2035 -1539 1036 1720 -794 -1780 480 1875 -158 -1874 -128 1860 484 -1833 -691 1693 987 -1545
2051 -1545 -1207 1349 1377 -1075 -1590 837 1680 -538 -1812 239 1855 2 -1842 -339 1805 537
2067 537 -1669 -838 1514 1082 -1353 -1275 1077 1517 -910 -1633 637 1737 -362 -1792 146 1731 217
2084 217 -1733 -436 1634 752 -1479 -1014 1407 1185 -1162 -1400 1001 1502 -740 -1584 432 1695 -222
2101 -222 -1662 -145 1700 363 -1659 -622 1511 870 -1458 -1020 1186 1235 -1018 -1396 783 1480 -473
2118d73j179J943J335j621j672J428J868j184j900P18K148m99k095M5K161L29
2134A352k217n31J977R80j980j126J679J404j390j712J218J759p58k064N60K076
2150A227k15k085j61K156L34j900p86J873J002j642j266J359J641j291j658Q67
2166e45J936o74j983M07J897O2k041k22J825O69j804r61J729J111j403j495J361
2183a31J500r85j699O90J869m95j778%J978J37j833n02J782Q14j765q98J395J309
2201A388j330j378J032J543p07j793N95J697j36j890k2J798K99j659o82J697P68
2218A220j371j170J304J322j092j433P54J700o95j596K73J733l4j745j63J558
2234E65O13j666p01J412J014j285j220J177J253p80j571P19J494l35j615Q3J685
$$ plain form
2118 -473 -1652 291 1626 5 -1667 -239 1629 445 -1455 -737 1411 912 -1183 -1138 1023 1352
2134 1352 -865 -1396 581 1561 -419 -1545 134 1538 148 -1564 -346 1413 655 -1409 -849 1227
2150 1227 1012 -1073 -1234 922 1256 -644 -1430 443 1445 -197 -1463 -104 1537 246 -1412 -545
2166 -545 1391 717 -1266 -859 1038 1100 -941 -1163 662 1331 -473 -1434 295 1406 3 -1492 -131
2183 -131 1369 384 -1315 -625 1244 749 -1029 -1029 949 1086 -747 -1249 533 1347 -418 -1316 79 1388
2201 1388 58 -1320 -288 1255 548 -1245 -650 1047 911 -979 -1001 797 1096 -563 -1245 452 1220
2218 1220 -151 -1321 -17 1305 213 -1220 -466 1234 539 -1057 -784 949 915 -830 -993 565
2234 565 1178 -488 -1189 223 1237 -48 -1268 -91 1162 382 -1189 -470 1024 689 -926 -843 842
2251H42P2j516m86J627N76j414q42J229J137j205j120P96J453p36j447M45J493
2268I04j17j650K9J454L86j545n13J400O94j166j040J188J038q41j320P20J402
2285A023n42j360J69J566j12j393k50J428M70j404n72J142R56j201r47Q88J173
2302A034p06j345O36J241k20j477J53J358J32j343m20J403M62j106q54J151Q96
2319I95r42j018O77J284o78j151K65J382j81j323k8J236L75j368l69J082P39j098
2337a21q47R72R10o68j216O90J110l45j262J79J312q0j137l19J302L25j076o10
2355h81R95Q31j004p98O48J145o94j076M24J127j57j285J56J069K45j214l11J086
2373C06N04r38p81R92P34o74j004O37J034m71j033J69J240j75j061j71J139L08
$$ plain form
2251 842 914 -602 -1088 539 1115 -299 -1141 88 1225 20 -1100 -304 1149 413 -1034 -589 904
2268 904 787 -863 -834 620 1006 -539 -1052 348 1042 -124 -1164 24 1062 221 -1099 -379 1023
2285 1023 481 -879 -710 856 744 -649 -899 529 999 -405 -977 165 1121 -80 -1027 -139 1034
2302 1034 328 -1017 -381 860 640 -837 -684 674 806 -537 -957 446 908 -198 -1052 99 995
2319 995 53 -965 -288 996 318 -833 -568 814 633 -690 -718 518 893 -475 -844 238 977 -121
2337 -121 -968 4 914 246 -970 -280 830 485 -777 -598 714 634 -503 -822 480 805 -271 -881
2355 -881 114 945 -59 -857 -209 936 242 -834 -410 717 560 -725 -569 500 745 -469 -780 306
2373 306 810 -128 -909 83 817 143 -861 -224 810 339 -694 -525 715 540 -521 -692 447 755
2391G55j110l76Q76P19r72o72O88Q71n55j036N21R45j77j169J84J036O9j025k99
2410g27J090K99q33o26Q90O64p16p56N00R96n36q83K10J071j63j026K3R27K75
2429F79j059k57Q23N41q11o57P51O59m80r41N41Q18k60r27J03J016o4q59k62J003
2449C57K55q42m40P58O21p65n70M66Q33m68q09K83Q48p8r81Q5Q24K02r12k45Q29
2470B51L42o72n92P29N47m81p48M16Q12l39p56P3R38j11p91j25P99K69q03l06
2490e48O18N51o66n53N07O62l84p69L58P03j00q43N9P72J01p22k92P95K83o24
2510i2m93O34N33n32n69L35P19l05o70J09P42%p68q5O86K64p43k73N99M22n28
2531a5n29M86N33k92o85K59O85j38p02OP51K9o15k33O29L12n72l91M57N61m69
$$ plain form
2391 755 -355 -731 145 864 -108 -780 -92 779 224 -812 -291 654 477 -692 -508 528 597 -428 -727
2410 -727 363 662 -171 -797 93 757 41 -715 -215 781 245 -638 -428 643 480 -546 -523 404 679
2429 679 -380 -637 186 727 -84 -741 10 669 189 -752 -211 607 347 -580 -477 539 475 -384 -646 357
2449 357 612 -230 -670 88 709 -56 -626 -160 673 205 -604 -321 527 449 -532 -447 377 579 -333 -578 251
2470 251 593 -79 -671 58 605 124 -624 -208 604 265 -491 -418 520 409 -382 -507 292 561 -242 -548
2490 -548 70 621 -45 -598 -91 571 187 -582 -224 479 379 -464 -405 367 468 -254 -546 249 532 -92
2510 -92 -585 49 582 50 -519 -184 535 230 -440 -331 411 411 -357 -442 244 508 -235 -508 91 513 -15
2531 -15 -544 -58 475 183 -502 -243 442 304 -398 -392 359 388 -227 -460 169 481 -91 -482 -25 536 67
2552F7n33L07O25k44o48J48O12K3o66p4N91K39n85l46N64L73m56m89M32M93k97
2573A36n43J64O04q4n85o5O37J39o13k06N31L40n35l46M15M36l29n03K51N33j08
2594B69o18N8O15L4o08j35N88J87m95l02M33L78l61m47K75N31k40n41J36N66m8
2615B75n70k8N19J56n13k20M44L28l90m29L75M46k64n23K14N15j09n02j8N47P9
2636C32m96k04M96K84m73l24L71M27l46m33K26M81j40n29P6N01O5n61r2N00J96
2657C57m64l08M68L03l18m37K99M68k02m91P6N61n0n21o8N35J50n05k10M23L48
2678D14m25l71L16M61k61n02K14M83o9n66J8N22R6m99k11N14K35m09l87M27L98
2699C98l35m43K16N37k01m90M5N50L5n53j09N06K50n29k74M38L74l78m40L19M61
$$ plain form
2552 67 -466 -159 466 222 -426 -278 334 357 -309 -383 208 447 -138 -484 80 453 -3 -492 -60 433 136
2573 136 -407 -243 361 277 -308 -373 264 403 -210 -416 115 455 -80 -426 -11 425 96 -407 -156 377 269
2594 269 -349 -291 324 358 -250 -385 203 390 -105 -407 26 404 43 -404 -129 402 162 -379 -243 323 275
2615 275 -295 -323 196 352 -161 -381 63 391 1 -428 -53 393 129 -394 -180 335 226 -276 -294 253 332
2636 332 -164 -368 128 412 -61 -385 -14 413 67 -366 -140 341 201 -328 -252 249 314 -247 -339 161 357
2657 357 -107 -415 53 356 38 -399 -100 368 166 -325 -249 312 262 -259 -327 208 358 -147 -357 66 414
2678 414 -11 -382 -66 395 134 -368 -154 329 260 -306 -288 234 330 -169 -380 134 369 -40 -427 0 398
2699 398 63 -380 -164 373 172 -318 -273 277 312 -241 -350 156 406 -123 -397 41 415 37 -403 -84 377
2720C77j82n61J53N32j6n71q5N98J16n00k83N33K90m25l81L33N01l16m94J54O04
2741C77j43n81L7N61J17o20j29N05K84m81l69M57L94l24n33L25N14j77n81J03
2761b64O02l6n40j43O05J67n24k86M87L95m78m22L34N62l38n29K00N68p0o35L3
2782c12N63J45o24j85N56K88n07m23N23M04l47n51L17N75k14n70M9O79k8o09j25
2803c96O29K16o01k77M97M23m92m43L60N39k84o16K33O00o2p03K5O52Q9o21k24
2824d56O30K57m91m41N07M62l96n43K82O64k80o09J00O94l0o59r4O28K39o48k77
2845d61N29M52n25m99M52N34l00o52K62O31j10o87OP01O9o39k46O76K89n79m24
2866e21N26N15m83n09K93O55k66o48J25O85kp33m3O58K19o79k77N96L89n09n28
$$ plain form
2720 377 195 -366 -213 319 303 -268 -353 245 361 -139 -422 111 401 -24 -405 -72 429 113 -381 -227 377
2741 377 234 -347 -310 251 368 -252 -381 124 408 -73 -442 15 409 85 -448 -123 391 214 -367 -264
2761 -264 338 302 -238 -381 224 391 -133 -419 68 463 -15 -437 -103 459 121 -408 -208 360 290 -345 -312
2782 -312 251 396 -228 -413 143 431 -76 -499 24 428 81 -470 -153 422 208 -362 -313 366 338 -271 -396
2803 -396 233 449 -152 -429 68 491 -1 -444 -84 455 171 -445 -212 388 326 -377 -352 300 389 -232 -456
2824 -456 174 431 -60 -501 6 468 72 -471 -189 475 195 -414 -314 380 350 -309 -403 225 464 -184 -461
2845 -461 68 520 -5 -504 -52 482 182 -470 -208 423 313 -374 -368 333 402 -237 -483 193 482 -97 -521
2866 -521 5 520 37 -472 -179 476 210 -438 -313 372 370 -363 -406 252 471 -208 -485 111 500 -9 -537
2887e37N00N21l19o48K72O60j67o77J1P64J6o57j94O64K92o42l55N20N19n30n15
2908e02L66O28k80p01K27O55k1p76PO77J65o78k75O72L27n39n02N40N21m04n86
2929d79K75P11k57o52N2P48J1p28j13O59K81p04k96N65M57n42n32M81N44k97o95
2950e11K82O55j12p10nP39O0o45k73P26K92o14m26N39N46n23n29L32O98l09o68
2971d56J71O92j4p65k3O62K43p38k76O59L62n52n33N64N10l74o51L09O94k27o74
2992d17M1P69j9o90j56P08K63p04l01N66M96n86n02M31O04l19p15K99O62r4p62
3013d26N3P16Q9o84k52P13K94n87m72N86N15m99n62L57P09l40o65J49P26n9p46
3034c85k9O84K33p57k50O25M10o10m83N50N18l82o61L52O48j97p02P8P67k0p05
$$ plain form
2887 -537 -37 484 165 -483 -211 449 282 -395 -384 380 396 -261 -455 209 501 -141 -496 24 543 13 -502
2908 -502 -136 492 212 -489 -262 393 372 -404 -397 280 445 -233 -508 164 491 -48 -550 -10 511 107 -479
2929 -479 -204 507 250 -402 -350 398 409 -319 -432 227 508 -196 -492 73 530 -12 -544 -63 481 184 -511
2950 -511 -229 426 314 -396 -401 338 398 -247 -520 206 498 -116 -542 -3 543 20 -509 -177 521 212 -456
2971 -456 -285 407 393 -372 -395 267 510 -228 -504 155 517 -35 -568 -4 506 132 -519 -210 484 257 -417
2992 -417 -376 393 374 -316 -472 236 499 -205 -506 60 556 -30 -532 -101 503 184 -531 -232 430 336 -426
3013 -426 -373 343 432 -252 -504 209 503 -84 -556 30 545 46 -516 -159 550 210 -455 -306 420 361 -385
3034 -385 -414 270 503 -254 -504 121 531 -79 -562 -12 506 124 -537 -185 463 266 -436 -358 409 389 -316
3055c16j57P42K23o75l30O05M74o02m76M22O42l80o73K84O84j38p78R6P00R3p36
3076b96j79O99K76o23m53O31M74n00n97M35O67l69o51J80P54j21p22k2P25J72
3096D80p57k16O55M10o74m41N68N19m66o38M21O35k36p40J66P39m9p32j19Q02
3116C27J50o97l15O77L99o20m53M74O12m43o56L13P25k15p68J42P35M6p88j11
3136d66P21K50o75l88O61M41n36n78N00O23l86o84K74P49j96p28K0P71R3p73j92
3157d99P06L47p07m00O03N17n35o03M40O50k98p58K47P30p5p70m8Q05J15p32k66
3178e31P20L54o37m68N60N90n05o26L53P37k87p59J80P56j8q06o4P55K16p48l22
3199e50O88M26o14n51N60O06m43o79L30P27k24p39O4P98L0p80j57P73K68p39l61
$$ plain form
3055 -316 -473 269 492 -183 -513 92 566 -36 -512 -90 552 172 -501 -217 467 329 -449 -353 347 440 -296
3076 -296 -475 224 500 -123 -576 55 529 29 -568 -133 534 165 -486 -306 448 327 -395 -417 308 480
3096 480 -277 -493 162 572 -102 -543 25 544 78 -560 -139 496 260 -480 -314 425 376 -356 -475 327
3116 327 477 -220 -535 142 541 -79 -532 -58 554 111 -545 -232 493 278 -490 -348 387 433 -355 -466
3136 -466 255 505 -170 -558 103 544 8 -570 -70 553 167 -517 -243 506 310 -418 -398 373 466 -307 -499
3157 -499 207 554 -153 -553 50 567 32 -571 -131 519 221 -537 -290 440 365 -405 -453 352 467 -265 -531
3178 -531 189 543 -94 -562 -2 588 83 -543 -190 547 260 -499 -319 437 419 -387 -451 304 520 -228 -550
3199 -550 138 564 -50 -601 -41 565 122 -557 -227 500 276 -463 -399 399 429 -351 -508 265 533 -206 -567
3220e67O52N01n99n68M93O58l79p43K99P54j51p98L9Q09P0p73k21P59L16o85m49
3241e83O19N64n63o18M32P18l46p62K26P82j07p99j4P83J68p81k70P39L93o73
3261i2n09N94N98m94o83M01P31k64p82J48Q16l8q10r0P88K28p61l36O93M50o18
3282c0n63N38O53m43p19L26P75k13p99P5Q16L9q12j67P72K96p36l95O63N16n77
3303A5o11M87O91l89p41K76P84j56q00J7Q12J21q01k45P64L75p09m86O30N72n37
3324F9o43M29P03l16p65J90Q08o3q19o1P89J95p79k97P21M22o62n22N76O14m69
3345A20p10L86P39k37q05J35Q16j0p91j41P80K65p37l75O80M97o24n66N05O71
3365E98m24p19K85P73j70q10N5P99J00q17k02P61L30p21m41O53N27n49o19M53
$$ plain form
3220 -567 85 586 -13 -581 -88 570 191 -552 -253 501 350 -448 -409 400 470 -303 -524 235 551 -134 -583
3241 -583 36 600 37 -581 -149 569 223 -539 -313 469 362 -437 -451 332 500 -281 -551 188 581 -92
3261 -92 -601 -7 591 97 -586 -185 546 282 -500 -352 464 426 -384 -474 314 542 -219 -555 138 588 -30
3282 -30 -593 -55 598 155 -564 -238 537 324 -475 -400 416 455 -357 -524 248 544 -192 -587 76 592 15
3303 15 -596 -109 582 193 -548 -272 512 356 -444 -427 385 506 -295 -540 224 599 -110 -596 34 606 69
3324 69 -574 -145 558 242 -523 -333 475 412 -407 -468 321 516 -263 -560 161 583 -79 -601 -25 589 120
3345 120 -590 -204 535 298 -507 -372 444 434 -357 -498 282 547 -190 -565 115 612 -12 -578 -73 598
3365 598 174 -545 -260 513 343 -467 -412 387 487 -330 -532 229 559 -162 -603 50 577 28 -591 -138
3385a38O87l41p33K05Q04j04p98l1Q07J52p93k50P15L91o75m90N84O05n02o69
3405e74L92P26k58p98J64P92j2q11j12P90K22p32l74P03M60o22n56N30O41m44
3425A27o85L10P67k00p97P7Q02P2q21j59P53L14p30m14O70N07n74o14M89O77l62
3446B09p45K55P71j35p67k6Q05J21p65k55P17L82o83m63N77N83n26o29M00O96
3466E22k72p66J81P68l7p99o4P73J93p19l29O98M15o09n30N34O23m48o69L19P53
3487E37k36p65J07P63M1p91j29P17L00p23l69O28M87n63n77M68O39l46p31K77
3507b66P37j41p64MP83Q7p26k39P23L41o72m32N84N56n26o03M07O89l12p31K02
3528b99P47o3p80l8P49J83p24l03O88L80n96n16N71N40m29o44L06P39k57p09P7
$$ plain form
3385 -138 549 208 -525 -320 484 380 -418 -449 358 510 -283 -533 182 573 -102 -592 -8 597 95 -574
3405 -574 -182 544 286 -512 -348 444 432 -379 -491 299 521 -211 -585 118 578 -44 -600 -70 571 127
3425 127 -558 -248 519 319 -478 -401 401 473 -348 -507 246 560 -170 -584 86 593 19 -595 -106 571 209
3446 209 -536 -281 490 355 -412 -438 367 488 -277 -532 185 567 -116 -579 -2 581 55 -574 -174 522
3466 522 250 -516 -335 433 396 -403 -467 306 499 -220 -549 149 564 -45 -575 -41 582 134 -535 -216 537
3487 537 301 -464 -357 406 447 -344 -473 244 544 -179 -548 80 567 4 -573 -105 534 188 -543 -266
3507 -266 471 330 -434 -430 353 440 -286 -525 198 539 -133 -565 19 575 49 -554 -147 542 230 -501 -299
3528 -299 448 385 -395 -433 316 499 -225 -528 160 540 -56 -572 -1 539 110 -534 -228 511 254 -455 -378
3549c78P88pp49j31P27K53p04l33O12M75n70n31M67O12l52p05K88P03j47p48L9
3570c91P59P3p08k26P31K77o36m17N84N07n17n60L79O64l13o76J79P17o8p48j7
3591d07O86J76p05k45O50L46n75m81N49N21m12o33L56O51k19o90R9P44m5o84j18
3612d36P04K10o58l10N79M43n63m70M35N79l69o42K99O29j25p27O8O89O7o80j85
3633d63O65K59o01l79N65M49m83n18L76O11l18n97J72O87j11o81KO58J46o79k08
3654d48O09L30n75m11N08M70l99n76L53N88k15o55J32O67n3o36j04O62J70o01
3674a84k77N63L65n29m10M08N43l84n53K63O03j66o40R7O10M6o41j14O13K23n69
3695a33l31N52L70m44m72L91N13l06n44J84O16j29o09KO23Q9o09j65N49K84n39
$$ plain form
3549 -378 410 403 -346 -477 250 503 -201 -534 78 553 -17 -548 -81 531 179 -526 -238 465 318 -430 -391
3570 -391 368 441 -267 -493 238 515 -121 -538 46 553 36 -524 -145 519 206 -470 -291 426 358 -390 -407
3591 -407 279 455 -250 -495 155 501 -74 -555 -6 515 103 -530 -174 477 258 -432 -333 411 366 -318 -436
3612 -436 268 478 -180 -490 89 532 -31 -501 -66 513 144 -498 -199 430 305 -422 -354 335 402 -278 -463
3633 -463 202 461 -140 -519 46 495 12 -506 -130 481 163 -434 -262 425 314 -367 -365 293 439 -240 -448
3654 -448 161 491 -84 -495 13 483 84 -492 -139 449 234 -421 -289 378 325 -311 -415 247 417 -184
3674 -184 -461 102 467 -62 -472 -64 479 95 -458 -195 408 242 -398 -301 309 355 -286 -400 213 436 -133
3695 -133 -464 88 458 14 -458 -67 446 140 -404 -220 396 267 -342 -340 283 372 -237 -402 147 431 -108
3716a08l38M74M05l97m99L35N38k28n84J53N94n6o01m9O00J32n50k41N42L11m89
3737e6l71M03M70l63m86K56N45j83n64R5N68J2n87p9N46J79n30k59M84L25m20
3758a5m11L77M43k89m99K08N40j33n45K9N67L8n42j44N34K29n05k74M24L67l83
3779A6m24L20M74k47n12J67N29q3n23j4N36Q9n11j83N02K37m35l16L84L90l52
3800D4m30K61M83j98n13J24N24l9n19m4N07J27m90k07M62K69m02l41L65L85k85
3821H3m47K24M74j46m91O2N15pm90q8M87J65m70k32M18L10l80l67L25L97k46m38
3843c42J65M77j07m83K4M89N9m88j36M76K08m40k66L83L32l28l84K77M20k09m35
3864c08J21M84o2m88rM73R1m60j60M33K27l92k98L35L64k92m03K25M33j55m61
$$ plain form
3716 -108 -446 28 433 36 -463 -128 410 182 -402 -249 345 289 -312 -361 239 371 -179 -420 122 433 -56
3737 -56 -427 -24 446 83 -403 -147 398 215 -349 -254 314 326 -261 -340 206 385 -145 -404 80 405 -15
3758 -15 -426 -49 394 105 -394 -186 354 221 -324 -295 272 310 -232 -376 158 387 -118 -392 32 399 16
3779 16 -408 -88 386 139 -373 -206 323 240 -283 -297 239 328 -183 -366 136 373 -62 -378 6 396 44
3800 44 -386 -125 358 160 -353 -229 295 256 -263 -307 200 327 -163 -370 92 361 -41 -382 -17 368 83
3821 83 -364 -140 334 188 -303 -241 274 267 -223 -311 176 341 -129 -361 57 367 -13 -380 -55 342 96 -342
3843 -342 -177 300 193 -290 -266 223 282 -206 -342 134 342 -98 -364 19 351 23 -361 -84 336 127 -308
3864 -308 -187 297 235 -253 -262 211 302 -158 -318 115 342 -50 -348 -13 351 59 -344 -119 314 159 -302
3885c02R2M65j8m68o8M59J33m24k09M13K60l58l25L10L53k25m07J78M45j31m38
3906b65L3M63M4m55r9M26J75l99k39L56K89l09l48K60L97k07m21J34M21m8m57
3927b49j0M42R7m45j57M13K23l79k75L27L21k51l83K18L98j54m11O8M48j5m25
3948a99p5M36J35m25j75L69K60l40l02K83L45k23l94J64M20r6m33L8M20L7m13
3969a68j16M14J67l78k44L46K92l11l19K31L83j80l99J19M11m5m23j1M12J04m29
3990a44j39L74K30l64k67L18K99k37l67J94L93j36m03N4M32j1m01q6L97J42l79
4011a01k02L43K71l14l06K58L42k05l70J32L93o4m10RM12N9l98j29L92J81l38
4032d5k64L27K85k51l39K11L64j47l93P3M09rm15l7L90J07l80j66L32K39l13k91
$$ plain form
3885 -302 -210 255 237 -231 -299 160 293 -131 -340 73 333 -25 -350 -40 313 88 -319 -141 304 173 -265
3906 -265 -232 231 275 -180 -279 147 322 -77 -316 40 329 20 -328 -68 329 122 -299 -165 256 208 -249
3927 -249 -259 183 280 -165 -322 91 314 -65 -340 -13 308 57 -326 -108 290 136 -275 -207 241 226 -199
3948 -199 -274 162 297 -128 -303 66 326 -14 -316 -33 312 89 -305 -141 279 183 -250 -212 208 245 -168
3969 -168 -284 130 297 -81 -325 21 313 2 -317 -86 297 117 -282 -163 248 203 -220 -231 181 285 -144
3990 -144 -283 91 321 -43 -310 8 307 70 -297 -103 290 154 -249 -195 237 226 -175 -261 136 278 -101
4011 -101 -303 40 311 -3 -309 -51 291 86 -284 -152 241 177 -233 -224 188 247 -151 -280 112 293 -45
4032 -45 -309 18 303 52 -287 -76 288 141 -252 -179 230 221 -194 -231 159 266 -114 -280 52 291 -22 -313
4054c13K88L09k05l70J61L62o9m09M1L94L9l92j07L90J60l43k32L18K68k70l08
4075b88K07L46j62l45R6L85m1l99j3L83R5l90j37L41K07l23k51K84K81k13l38
4096b75J70L39j03l68M9L81J6l74r9L78J33l50j74L01K64k79k86K18L24j75l38
4117b48J21L57m2l93J1L43R3l61j31L35J86k95k56K84K62k13l12J65L38j09l52
4138b17L0L85rl53o7L40J27l33j68K81K47k81k53K12L08j67l35J16L48m0l76K3
4160a82L41O1l37j30L40J57k82k28K68K54k26k76J40L38j17l29M8L45kl48m6L13
4182A02J36l25j61K82K05k50k51K21K92j71l26J27L24n8l31qL48M3l03j33L19
4203H2J62k86j99K46K52k20k66J50L04j03l27M8L35J3l39m9K97J24l12j42K64
$$ plain form
4054 -313 -25 284 79 -291 -130 232 163 -246 -205 189 228 -164 -271 119 279 -64 -296 22 290 20 -288
4075 -288 -81 265 103 -242 -146 239 198 -201 -214 169 264 -126 -263 78 285 -38 -289 -5 276 63 -275
4096 -275 -105 234 131 -237 -188 193 209 -165 -264 114 247 -103 -277 24 288 9 -277 -59 265 90 -248
4117 -248 -127 230 188 -205 -194 149 242 -119 -250 85 271 -24 -280 4 266 53 -259 -94 244 135 -217
4138 -217 -187 198 189 -164 -231 109 236 -97 -265 16 263 -18 -271 -59 249 82 -253 -137 211 171 -205 -182
4160 -182 159 220 -117 -247 93 250 -32 -260 8 262 36 -240 -100 238 121 -208 -160 185 183 -165 -211 102
4182 102 238 -87 -248 34 239 -11 -262 -41 251 80 -246 -119 205 147 -184 -192 156 199 -104 -237 82
4203 82 244 -42 -241 5 257 37 -229 -79 225 122 -205 -157 178 191 -148 -197 100 224 -88 -230 34
4224C4J90k23k53K13K65j51l08J13L23o3l16k1L42M8l13j05K88J69k69j99K33
4245cK47k10k57J52K94j02l20O7K98K1l26n2K96J05k81j53K58J89k15k47K00K62
4267B23j49k84Q7L18n6l12rL21N9l13j16K91J65k63j95K26K37j90k66J55K73q9
4289A13l10N1L14kk96o8L21R4k83j53K60J94k30k34J79K79j48k91Q6L22n3l16
4311a71pL02O5l05j04K74J71k66k00K24K35j76k74J39L01r5k92L2L18Ql00p2L09
4334A16J10k82j56K39K10k15k56J75K90j42k99Q8L14m2l18k1L20O8l03j23K84
4355E7J62k45k17K25K39j76k84J42K89p6l14L2L39Ml17o1K93J29k72j80K68K14
4377B51k42k30J86K72j43k96Q4L21m2l37lL24O7l24j19K89J74k69k18K41K45j88
$$ plain form
4224 34 224 1 -252 -39 226 75 -233 -120 203 140 -176 -197 145 193 -120 -225 63 232 -37 -236 -3
4245 -3 244 34 -223 -71 223 121 -199 -132 166 187 -139 -191 105 210 -71 -224 34 223 8 -239 -39 223
4267 223 74 -210 -123 195 139 -173 -182 139 198 -115 -231 60 225 -38 -233 -7 230 40 -226 -71 202 113
4289 113 -197 -146 168 166 -130 -198 123 217 -66 -219 41 235 5 -229 -50 229 81 -210 -124 198 145 -171
4311 -171 -178 124 189 -116 -220 54 225 -41 -241 -17 218 42 -232 -93 208 113 -179 -147 171 179 -121 -193 116
4334 116 226 -56 -212 27 237 22 -234 -59 231 89 -210 -122 192 150 -168 -189 131 199 -104 -227 57
4355 57 219 -26 -243 -18 221 45 -239 -97 192 116 -198 -166 173 177 -140 -201 92 221 -51 -231 37 251
4377 251 9 -221 -35 237 94 -202 -118 203 161 -176 -179 145 212 -112 -231 58 232 -37 -255 -14 231 43
4399D3k95J46L14q4l33L4L40J3l30o6L31J21l22j61K81K13k41k53K02K91j57l19
4421b32J13L32m2l47j3L39P2l39j19L09J74k96k08K50K52k01k96J53L22r3l63
4442b33N8L50Ml50o1L50J10l24j72K91K31k50k71K28K92j57l31J04L51o1l67J0
4464a98L63O3l56j08L23J70l03k19K74K65k37l05J78L35j23l62P4L49J2l77o8
4485b50L75J09l34j77L28K15k78k69K34L21j95l43J37L65p1l81J0L92M5l81j12
4506b60L64J72l26k32K93K70k37l22K01L49j55l54O6L91k3m03l4L84R8l67j62
4527b87L50K19l13k72K66L16k02l58J64L61q3m14M9M03K8l90r6L84J47l48k23
4548b99L38K68k90l16K32L49j60m02J10M19n4m19j6M18P6l92j50L75K00l34k68
$$ plain form
4399 43 -252 -106 208 124 -209 -175 165 178 -152 -218 113 234 -88 -249 32 245 4 -249 -47 244 87 -232
4421 -232 -119 213 171 -176 -189 150 222 -117 -236 73 247 -49 -257 -7 245 44 -252 -99 223 130 -233
4442 -233 -175 175 179 -171 -232 118 228 -96 -268 23 254 4 -267 -39 253 96 -235 -131 220 159 -208 -198
4464 -198 165 228 -128 -236 87 257 -46 -265 9 274 37 -268 -90 245 122 -240 -166 183 195 -182 -250
4485 -250 125 234 -100 -277 51 266 -12 -281 -47 274 79 -264 -127 238 167 -214 -204 188 233 -148 -260
4506 -260 104 276 -50 -282 11 281 44 -278 -77 272 117 -237 -171 220 197 -206 -240 144 242 -125 -287
4527 -287 63 282 -31 -303 -37 279 77 -281 -117 244 161 -253 -204 199 227 -163 -259 125 272 -76 -299
4548 -299 39 307 17 -299 -67 282 122 -280 -170 249 195 -224 -240 178 254 -138 -288 87 287 -47 -315
4569c15K90L23k49l57J93L84j33m11P9M12Mm22o6M16J35l81k02L47K69l12l18
4590c14K77L46j99m02J56M11q1m40J6M28N9m24j22L98J87l77k41L29L06k82l55
4611c24K14M01j67m22J07M33k8m49l2M46R6m10j84L98K43l48l10L01L66k53l82
4632c04J83M28j26m44N2M45K2m43j07M41J60m00k30L62K91l24l43K61L90k00m31
4653c17J30M52o9m42k1M69Q2m48j52M19K22l87k81L48L37k91l79K20M31j57m62
4674b96R3M75j9m70n9M54J43m37k17M07K76l61l44L04L97k58m21J95M36j19m61
4695b82L2M90K9m67j26M59J96m21k67L88L26l46l71K74M20k06m57J51M76o6m89
4716b57j2M73R3m57j78M53K31l98l15L73L57k97m15K34M49j58n04R5M89Rm99o9
$$ plain form
4569 -315 -25 298 49 -308 -115 269 136 -275 -196 216 220 -202 -268 148 283 -98 -300 47 316 4 -314
4590 -314 -37 309 110 -292 -136 275 194 -246 -230 198 257 -167 -289 109 296 -81 -322 7 313 31 -324
4611 -324 -110 291 124 -298 -191 242 214 -235 -267 179 275 -135 -319 79 322 -26 -336 -35 331 78 -304
4632 -304 -121 307 181 -263 -211 234 256 -187 -294 147 307 -93 -323 39 330 6 -337 -76 314 114 -317
4653 -317 -187 265 196 -246 -267 202 284 -164 -316 103 325 -62 -343 5 342 51 -328 -108 323 166 -296
4674 -296 -203 272 253 -217 -276 178 321 -116 -333 74 350 -11 -355 -51 346 88 -333 -138 298 179 -282
4695 -282 -250 240 269 -198 -324 135 331 -90 -357 31 357 11 -360 -86 334 128 -329 -178 298 232 -257
4716 -257 -269 204 297 -160 -338 115 346 -52 -367 6 363 66 -349 -115 334 176 -328 -233 256 265 -234 -303
4738c03M81J50m64k24M24L00l87l50L26M10k62m57J95M93j32m96M2N07N2n11j23
4759c29M77K22m49k89M11L38l56l87K79M51k27m81J38N07n2n17l8N12J10m95j96
4780c71M76K66m30l32L72L95l16m38K44M80j71m99Q1N22Rn33p6N11J52m70k36
4801c64M47L12m03l77L37M27k71m68J87N08j09n16J3N29N2n13j47M99K06m63k78
4822c92M09L60l57m34L11M68k20m99J33N28n3n39k8N39J03n14j88M89K68m49l32
4843c97L90M00l20m59K53N06j80n27R1N37j0n27q9N29J68n15k37M53L32m22l92
4864d16L57M43k75n07K11N30j23n47M3N48N1n41j39N17K26m81l03M46L68l91m15
4885c98L11M80k41n19J59N40o3n64k9N61J12n40k00N06K77m61l56M07M12l39m65
$$ plain form
4738 -303 178 328 -136 -360 64 364 -23 -373 -47 363 101 -356 -161 332 200 -296 -254 253 305 -206 -329
4759 -329 148 370 -79 -368 43 381 25 -362 -83 368 141 -340 -202 305 253 -264 -302 210 320 -175 -371
4780 -371 105 371 -59 -391 -19 376 60 -378 -134 346 175 -324 -243 279 288 -245 -321 190 342 -128 -364
4801 -364 83 395 -8 -385 -48 379 108 -360 -173 335 226 -290 -277 252 304 -209 -356 143 349 -114 -392
4822 -392 17 377 20 -414 -103 365 145 -354 -221 307 254 -285 -313 226 329 -185 -373 116 384 -65 -397
4843 -397 -7 393 73 -386 -133 373 193 -334 -243 294 284 -243 -332 197 365 -150 -387 66 398 -24 -416
4864 -416 -59 384 109 -398 -187 343 220 -327 -284 264 315 -226 -365 152 378 -103 -406 40 408 17 -398
4885 -398 -87 393 152 -367 -208 332 269 -295 -324 237 349 -191 -391 115 392 -69 -425 -18 394 55 -410
4906d10K60N13j77n47J03N52mn66p3N38J70n18k54M90L29m25l96L55M59k91m94
4927c86K08N37j19n60M0N59N7n55j49N33K33n16k92M35L75l85m43L24M92k39n29
4948c80J42N53n9n58k8N59J19n53k02N24K77m73l52M13M30l36m84K57N25j75n56
4969c57R4N68On70j00N74J71n35k60M97L30m36m07L65M59k84n19K22N49j33n65
4990c31K9N65O5n75j36N39K34n11l12M62L91m02m45L27N00k42n45J64N61o6n79
5011c07j7N67J24n53k13N28K86m68l66M10M41l56m80K69N15j72n67R3N72Mn88
5032b78p4N52J79n41k60M85L42m33m12L83M66k98n18K14N60j35n63M7N74M2n51
5053b19j55N39K41n08l03M40M03m12m32L03N08k43n43J60N67o5n87l1N75J21n54
$$ plain form
4906 -410 -150 363 186 -361 -258 294 290 -276 -349 189 359 -159 -413 77 406 -19 -415 -60 399 108 -386
4927 -386 -178 359 240 -320 -280 279 336 -219 -368 165 398 -118 -410 25 400 15 -428 -104 388 149 -380
4948 -380 -238 315 256 -302 -330 229 348 -205 -407 117 394 -79 -431 -18 412 76 -408 -151 374 199 -357
4969 -357 -263 305 311 -259 -359 215 386 -149 -409 88 418 -18 -425 -60 399 115 -404 -182 367 234 -331
4990 -331 -302 263 328 -247 -383 156 390 -121 -433 29 420 18 -427 -100 400 158 -387 -223 338 272 -307
5011 -307 -324 243 367 -186 -399 129 415 -53 -419 -9 432 76 -404 -135 380 208 -359 -266 306 310 -278
5032 -278 -352 200 379 -162 -422 63 405 -28 -440 -57 409 111 -407 -193 367 232 -331 -284 290 332 -219
5053 -219 -374 165 406 -102 -405 35 438 26 -406 -103 405 162 -381 -221 346 281 -306 -337 238 359 -195
5074a95k02N10K88m74l60M05M38l44m95K86N21j89n62J08N69j9n62o5N45J80n51
5095a68k29M77L41m40l99L65M64k84n27K24N36j19n74M1N69N8n62j42N37K10m99
5116a21k92M54L54l76m46L36M88k49n22J47N71p9n71j1N55J01n46j81N18K60m64
5137g4l46M18M27l43m92K84N13j92n44R9N70k0n56p9N43J65n23k47M67L44m44
5158c0m06L81M62l17m93K36N22j39n55M5N60O8n75j41N54K19n10k89M55L65l99
5179A3m27L48M75k63n12J62N43q4n48pN65Q9n49j84N08K76m80l18L86M13l57m62
5201d13K82N01j98n40J20N40j6n58n4N50J44n16k36M72L20m26l85L66M51l15m64
5222c75K17N24j36n48N4N52L8n65j06N21J96m94k64M42L38l87m23L37M54k37n13
$$ plain form
5074 -195 -397 113 401 -73 -433 -28 410 66 -429 -143 378 189 -373 -265 304 285 -277 -342 203 383 -168
5095 -168 -397 80 421 -19 -418 -53 411 127 -400 -176 360 241 -333 -292 277 335 -227 -369 168 378 -121
5116 -121 -413 41 395 19 -427 -91 397 148 -374 -227 344 265 -306 -317 238 339 -207 -388 130 390 -74
5137 -74 -420 -2 425 82 -410 -126 387 195 -349 -250 320 300 -256 -335 208 373 -150 -397 70 414 -30
5158 -30 -436 -55 407 90 -403 -167 355 216 -339 -294 266 334 -241 -382 172 391 -119 -408 47 412 13
5179 13 -414 -66 409 146 -366 -204 339 255 -293 -300 265 354 -195 -379 129 405 -75 -393 -7 406 49 -413
5201 -413 -131 370 172 -368 -248 292 276 -282 -336 214 358 -158 -394 78 398 -28 -413 -47 404 89 -375
5222 -375 -158 366 230 -318 -264 288 326 -239 -345 176 372 -122 -386 56 394 7 -416 -79 375 138 -375
5243c75J78N19q3n43j2N55P6n19j71N03K46m49l21M00L88l62m17K77M73j91n30
5264c58J33N28k6n35n4N32J28m99k16M63K99m19l75L85L91k94m58K23N01j61n09
5285c21N4N32K8n31j07M98K04m92k45M25L32l81l80L15M31k31m97J88N00q6n25
5306b89QN33O7n08j55M80K30m33l12M03L61l51m10K69M58j90m95J11N11l2n21
5327b65k7M89J19m79k03M43K82m09l29L55L89k97m41K43M63j44n01O1N20J3n02
5348b20q7M85J57m57k41M34L06l74l62L15M08k47m54J80M76r2n05L2M75O7m94
5369a98j33M62K10m31k72L83L26l18l94K65M39k08m56J17M88m8m85j6M75J15m81
5390a60j74M34K49m00l01L54L52k81m12K26M24j32m73P6M67Nm64r6M77J46m41
$$ plain form
5243 -375 -197 322 239 -304 -316 239 315 -204 -375 128 374 -75 -396 4 392 30 -387 -110 363 172 -358
5264 -358 -225 303 277 -258 -312 220 348 -151 -367 96 395 -24 -399 -14 377 83 -375 -152 349 188 -321
5285 -321 -267 265 293 -238 -345 153 357 -135 -380 45 377 -4 -384 -69 362 131 -366 -178 322 236 -289
5306 -289 -281 252 319 -189 -344 136 366 -67 -379 24 385 34 -376 -107 351 161 -334 -223 288 256 -265
5327 -265 -292 197 316 -163 -366 77 359 -50 -379 -24 365 68 -373 -130 333 189 -312 -251 269 282 -220
5348 -220 -307 178 335 -122 -363 71 377 3 -359 -44 364 117 -337 -157 319 227 -278 -246 229 296 -198
5369 -198 -331 131 341 -90 -362 21 347 29 -365 -100 339 131 -325 -208 280 232 -253 -269 206 321 -160
5390 -160 -334 100 349 -51 -352 2 354 73 -339 -113 311 179 -294 -218 249 254 -210 -306 171 317 -124
5411a24k07L97K72l63l22K76M07k43m24J78M37r5m72L6M55O1m62j14M33J87l97
5432h4k49L62L05l00l68K69L92j92m28J19M49n5m51j8M43Q1m33j51L97K43l84
5453e3k72L20L21k57l80K12M04j38m31P1M16J1m47o6M52J18l98k00L82K43l20
5474a2l08K74L55k24l89J71M18j04m27L4M30L9m30r7L85J80l75k24L44K69k83
5495B6l30K28L61j80l95J23M16n4m17k0M13P3m02j29L78K12l66k46L09L04k50
5516E4l48J94L85j45l97Q0M09rm09m7L94J20l91j78L66K26l20k78K77L05k26l51
5538b89J67L69j02l84M1L91J4l90q1L73J52l56k02L24K53k82k81K29L26j76l63
5559b67J24L79n3m01ML94P2l91j15L54J66l18k29K96K68k50l10J93L39j43l59
$$ plain form
5411 -124 -331 66 338 -25 -347 -71 336 93 -331 -153 284 189 -283 -247 208 269 -193 -307 126 313 -84
5432 -84 -333 29 334 34 -334 -65 327 135 -293 -174 275 220 -231 -249 194 275 -158 -309 88 331 -53
5453 -53 -325 -5 316 59 -321 -109 295 157 -274 -203 213 224 -223 -289 163 281 -117 -317 65 308 -12
5474 -12 -320 -46 309 85 -304 -133 285 181 -246 -212 218 257 -173 -270 115 295 -80 -304 40 309 26
5495 26 -304 -76 285 105 -290 -167 249 195 -222 -242 171 244 -158 -287 91 303 -63 -309 0 304 54
5516 54 -294 -100 285 140 -257 -177 232 223 -186 -233 161 281 -110 -288 78 304 -16 -294 -17 288 62 -289
5538 -289 -122 247 145 -239 -198 193 207 -183 -264 109 261 -95 -297 27 280 -2 -283 -54 272 96 -267
5559 -267 -143 236 183 -218 -214 180 252 -139 -254 100 266 -52 -281 15 283 33 -277 -84 255 112 -247
5580b47Q4L76l7l66m2L67R9l69j21L14K00l00k47K66K84k08l19J75L25r5l70O1
5602a70L69Nl66o7L54J26l27j78L03K10k62k56K18L01j88l10J12L55p8l59J3L58
5624A63M7l51r3L11J70l19j87K78K29k37k85K02L09j42l40J02L38m3l34j7L36
5645A37Q4l31j35L16J88l02k07K50K62k22k79J57L09j04l39O2L37J3l56m9L33
5666A24R7l12j52K97J86k53k45K23K61j56l03J21L27r7l22K8L42J2l18p1L05J34
5688B28l01j65K51K32k19k62J98K67j37k97R8L04l5l37kL27M7l09j17L08J42k59
5710c8k01K38K22j89k50J32L03j14l09N5L27k2l25j2L04P4k91j22K76J58k19k23
5732b26K04K55j69k81J29K85p9l00L1L18J2k94p5K85J15k65j63K36K06k23k18
$$ plain form
5580 -247 -163 213 176 -190 -232 135 234 -135 -256 58 258 -42 -289 -23 261 53 -266 -91 234 139 -231 -170
5602 -170 199 204 -162 -229 125 251 -76 -254 49 259 -3 -259 -41 260 72 -238 -126 229 151 -208 -195 163
5624 163 210 -141 -234 77 247 -72 -259 19 248 11 -274 -72 237 95 -245 -143 195 152 -182 -199 137
5645 137 221 -110 -245 71 259 -43 -250 0 262 40 -239 -82 227 123 -216 -154 183 196 -160 -209 124
5666 124 221 -91 -243 54 240 -13 -258 -35 226 70 -233 -112 215 118 -204 -176 166 178 -140 -211 94 228
5688 228 -73 -238 13 245 26 -236 -38 229 92 -205 -107 197 162 -175 -177 150 197 -112 -229 79 221 -38
5710 -38 -239 -1 221 32 -218 -86 217 103 -206 -151 176 154 -171 -183 121 195 -96 -218 58 216 -3 -226
5732 -226 -22 233 64 -217 -88 197 118 -182 -151 167 179 -115 -190 95 210 -55 -218 18 224 1 -217
5753b17J66K57j40k81J06K74l7l08J1K95N1k98q7K66J34k34j82K42J94j78k32
5774a98J41K64j12k72O2K86j2k97j6K74P1k77j06K34J69k26k08K16K00j45k64
5795b16J43K48p3k85M1K75Qk71o7K85Q9k46j45K36J76k02j92J52K36j37k24P0
5817i9K69l9k77LK72N2k92o1K44J16k20j65K10J76j65k15J30K44r8k66N7K69k4
5840A21k57l4K66O3k42r8K19J47k17j74J80K00j41k11R9K43p2k52M6K48Pk51m5
5863a55K42P8k11j36K16J46j79j77J47K13j26k20P2K42m7k36LK34L7k47o8K21
5885D9J20k20j39J82J74j47k15J51K06o8k51O2K27rk34m2K56N2k18r3K14J10j78
5908a1j55J54J89j38j96R0K25o1k32L2K27J5k37n3K21Q5k14j24K03J31j60j82
$$ plain form
5753 -217 -51 206 66 -215 -109 165 128 -180 -169 126 177 -121 -208 58 192 -42 -224 18 212 34 -198
5774 -198 -57 207 95 -177 -115 171 159 -138 -154 120 191 -86 -192 42 211 -15 -223 -7 193 48 -216
5795 -216 -73 175 102 -183 -142 133 141 -130 -197 88 177 -69 -214 22 198 -4 -196 -44 192 55 -169 -99
5817 -99 170 131 -146 -143 129 181 -111 -172 72 188 -32 -197 13 189 24 -191 -61 183 85 -181 -124 145 121
5840 121 -136 -170 96 159 -83 -181 38 185 -32 -206 -26 174 33 -178 -79 164 92 -160 -114 134 141 -110 -155
5863 -155 87 165 -46 -182 34 180 1 -176 -29 184 58 -162 -90 152 105 -131 -128 106 143 -104 -172 49
5885 49 169 -51 -190 -8 166 19 -196 -45 161 93 -158 -96 131 122 -112 -154 102 154 -64 -157 57 167 -11
5908 -11 -166 -12 177 39 -157 -67 158 97 -135 -103 124 139 -98 -151 70 155 -59 -183 20 151 -9 -191
5930a91J61J76r5k05O9K22m6k04j4K25L6k11o7K00J22k01j25J56J54j40j81J12
5952d7J99p1k32O3K09Mk26j9K06N8k00j12K14J00j62j47J46J68j21j82P6K03n7
5975G0k00J5K15K7k34j9J85Q9j96j10J74J43j44j63J35J64q5k03O6J99k0k10p
5998a09K05L6j91q6K01R4j77j22J35J69j35j78J09J82p2j94M7J89Ok19j7J99N1
6021A23j80q4J74J01j43j49J46J54r6j77P5J81m2j83MJ97K8j88n3J73P7j69j14
6044a45J61J23j30j45J05J61q0j84N4J79j5j91jJ76M7j77p0J70Q7j42j19J36J38
6067A38j12j61Q8J80n7j90L4J73Qj72l9J75N5j41j08J59J04j25j30R6J58r3j59
6090a19N7J59k6j66KJ76K4j79m5J55Q1j51r5J19J32j15j33Q8J54n8j66M0J71j0
$$ plain form
5930 -191 -30 146 51 -154 -85 137 91 -113 -127 98 134 -77 -144 56 178 -23 -148 8 162 22 -159 -47
5952 -47 152 81 -151 -88 121 125 -101 -120 86 144 -56 -168 46 146 -16 -163 -17 151 30 -152 -76 127 70
5975 70 -130 -115 100 127 -107 -126 59 148 -48 -158 16 159 15 -148 -13 151 66 -137 -71 128 108 -102 -109
5998 -109 96 132 -59 -145 56 150 -27 -149 -14 155 20 -158 -49 133 61 -133 -86 103 109 -110 -127 72 123
6021 123 -57 -141 33 134 -9 -158 -12 142 46 -131 -56 125 83 -100 -96 101 129 -59 -112 61 138 -31 -145
6044 -145 16 139 9 -136 -31 130 50 -134 -80 99 84 -107 -108 68 115 -62 -132 38 125 -17 -136 0 138
6067 138 26 -135 -47 133 76 -114 -80 93 101 -71 -110 65 120 -21 -129 30 134 9 -121 -25 133 40 -119
6090 -119 -62 97 71 -95 -93 83 107 -72 -117 38 119 -32 -127 -8 124 9 -124 -36 118 60 -106 -66 105 95
6114I5j85rJ75L4j48p9J53J05j48r7R7J40j05j41O5J58l7j67J6J53J6j58m5J64
6138E2N8j43r6J42J04j18j15Q6J32o0j57N1J71k1j68lJ54L5j55l2J21Q2j30q1
6162i1Q6J14p4j34O9J34l7j66J7J52J9j65j2J34O6j46p5J36Q3j07j12R1J19p6
6186B5j26L5J62m1j38PJ45K4j47l5J22P7j27p8J11R0q7j16P6J16n2j29K4J41m
6211G5j36k2J42L7j41n1J13Q8j19q9R1J07p3j15M1J14j5j40K1J23J9j23l9J31
6235C9N9j13q0J00J01q4j17P1J30p8r9K3J42j7j30j4J27L4j43l8J08P6j06q6Q7
6260hR9p3j16O6J03j9j37RJ33Oj18l4J31M0j09o9J09P0q9q4P0J14o1j11K5J33
6286H0pj34J2R8L4j21l8J15N6j05p5J05O3o3j12O3J13m1j18J0J21Rj18l6J36L8
$$ plain form
6114 95 -90 -99 76 110 -38 -117 36 141 -7 -104 -7 133 28 -113 -48 110 73 -94 -78 75 91 -67 -112 52
6138 52 110 -33 -129 13 117 -1 -116 -30 102 42 -115 -64 107 86 -82 -85 69 104 -51 -83 38 120 -10 -91
6162 -91 -5 109 35 -99 -30 104 67 -99 -82 70 89 -76 -88 46 112 -34 -109 27 110 3 -109 -18 101 25
6186 25 -101 -66 96 55 -83 -76 69 93 -54 -89 33 110 -17 -95 16 106 19 -97 -21 95 43 -86 -62 79 75
6211 75 -61 -83 59 96 -45 -96 17 105 -14 -103 -12 95 22 -93 -52 62 47 -93 -72 51 70 -53 -92 39
6235 39 98 -15 -95 5 106 22 -95 -24 106 28 -71 -48 94 77 -53 -67 60 94 -49 -87 21 97 -9 -95 -8
6260 -8 91 18 -98 -32 71 52 -85 -76 57 63 -55 -89 42 82 -27 -96 13 83 -6 -90 -20 94 33 -78 -53 80
6286 80 73 -61 -49 49 83 -38 -76 39 95 -10 -85 20 83 20 -92 -29 84 43 -75 -65 56 65 -53 -89 47 85
6312H5j21o1J04P3j02p0P9R6m8j21L2J36k9j19J2J20J7j34j2J07L9r6p7J08P2
6337I0o6j10O4R8l5j14K1J28k3j11k2J21K7j14m6J05O9r8p5P1Q6n1j16O6R7k3
6363C9j22J9J22J1j20k0J08M3r9o0R0Q3q9p8N5J06m6j17L5J25l1j25oJ17L3j18
6389d5m1R9O1r4p2Q5Q6o6j14P0J02l8j06MJ26j1r4l0J22L3j02n3R3P9r6p2O5J04
6417I5n4j20M6J15l0j03oJ14K3j20l7J15M6j05p6R8P7p2j01N4J19n5j01K4J11
6442E7j0j14nJ11L8j17m5J07P4j12q2J06P9n9j12N6J10l3j09JJ29J0j19m4J24
6467D1M9j15o2J06P0p8r6N6J09m5j28L8J24nj35oJ22L1j24l8J11O0r3p6R0Q7o4
6494B9j28P3J07l1j06PJ35oj19l5J19M5j12n9R5Q6j02p1N7J14n3j30M0J21l1j24
$$ plain form
6312 85 -36 -97 7 80 -22 -92 -13 83 35 -86 -54 82 53 -66 -54 66 83 -51 -63 44 83 -13 -90 18 90
6337 90 24 -86 -22 76 41 -73 -52 76 53 -58 -80 41 68 -46 -92 13 82 -16 -91 -20 66 15 -101 -35 62 39
6363 39 -83 -64 58 69 -51 -71 37 80 -19 -79 11 94 5 -73 -18 88 42 -75 -40 85 54 -71 -77 40 73 -45
6389 -45 -86 13 74 -20 -92 -7 79 13 -101 -31 71 33 -73 -69 57 46 -48 -78 44 77 -25 -78 15 94 -2 -74 -9 95
6417 95 41 -79 -33 82 52 -51 -57 57 80 -40 -77 38 84 -21 -97 1 78 6 -95 -41 78 23 -78 -54 57
6442 57 47 -67 -72 39 77 -40 -85 22 96 -16 -98 8 87 28 -84 -28 82 49 -60 -59 70 80 -39 -83 41
6467 41 90 -25 -87 19 89 11 -85 -29 80 35 -93 -55 69 64 -71 -77 45 76 -48 -86 25 85 -8 -84 6 93 29
6494 29 -99 -26 81 50 -56 -49 86 80 -39 -74 45 90 -22 -81 14 100 -2 -73 -16 98 45 -85 -45 76 45 -79
6520g9KJ26J9j06m9J16M4r0p5R0R8q7j09O6J21n0j15J3J48j2j34%J21L4j31l9
6546g8R6Q5j03q7Q1R9o2j06L7J11qj40oJ36K0j17n3J29M5j04p3J02P9q0r5O1J21
6573I0m5j29K6J27Lj36j1J26L6j27m5J26P2j13r7R5R6o6j15N3J29l9j28J4J29
6598G1j0j15l4J25O1j25q5J16Q9j07q4P6J19o2j31M5J30k0j27j9J47J6j27m0J16
6623B5P9j08q7R5R4q0r3M9J24n0j24J0J43%j41k7J38M3j21o9J18Q8j11j03R6J08
6649I6o9j36N0J35k0j40mJ41K4j31m6J38N3j00r0J08J04r6j05P2J21m8j22K4J28
6674H7j9j33j8J43M3j32o0J14P5r4j03Q4J03n1j46O2J23k5j37MJ51oj27l0J36
6699D4N3j32o7J06R7r8r5P2J22n7j26M2J30j5j41qJ48L2j38n7J23P3j09j03J05
$$ plain form
6520 -79 -77 49 68 -38 -87 29 73 -17 -92 -2 96 9 -100 -34 87 37 -78 -65 83 71 -63 -63 58 92 -39 -78
6546 -78 18 103 0 -87 -6 93 31 -75 -38 73 65 -75 -81 55 75 -42 -95 34 79 -25 -98 4 83 3 -92 -31 90
6573 90 45 -84 -58 69 72 -64 -75 51 87 -40 -85 41 113 0 -97 -2 94 28 -87 -34 95 56 -72 -58 71
6598 71 61 -54 -88 37 98 -27 -112 4 93 -14 -98 -22 97 35 -96 -51 79 59 -68 -87 60 76 -51 -91 25
6623 25 104 -4 -91 4 98 18 -75 -26 98 48 -76 -66 77 77 -64 -91 47 90 -31 -100 18 106 -5 -108 -12 96
6649 96 27 -109 -59 76 56 -84 -88 53 77 -54 -100 38 91 -9 -99 9 113 17 -88 -16 105 57 -65 -41 87
6674 87 68 -65 -83 60 103 -29 -89 25 100 6 -97 -13 90 39 -107 -45 78 53 -84 -80 71 65 -62 -92 44
6699 44 97 -35 -102 4 101 3 -92 -20 102 45 -81 -39 91 76 -65 -73 75 107 -31 -88 35 108 -1 -104 1
6724AR6q0j12O5J21m6j41J5J58kj50k1J34N7j44o8J24R3j07r6R0J13o5j32N2J37
6750I2m0j36J7J42K8j43l6J21P3j33r4J20J11r3j31P2J35n1j47L5J31lj42l1J51
6775D8N0j53n3J26R4j28r7J02J22q9j25N2J51l6j43J6J42Rj47k1J37O1j43p6J18
6800A7J02j11j16R7J22o4j43M2J53k6j50j0J47K6j41n0J40O5j28q4J12R9r2j27
6824a20R1J26m8j40M1J34mj42l0J52L8j33o4J34P9j22j07J13J24q6j32O4J24k6
6848F6j54J4J53Kj43k7J37O0j44p6J30Q5j05j10Q9J26p3j29M0J38k5j29j3J63
6872G5J6j42n0J37P4j26r1J13J19r9j22O8J38m0j53J6J51oj48j5J49K6j28p7J44
6897B9P9j09j19J12J08p0j41O1J51m3j43%J58Mj36l7J39O1j43o5J08J03j08j14
$$ plain form
6724 1 97 17 -95 -30 91 45 -96 -81 77 75 -75 -96 38 95 -49 -117 7 100 -7 -103 -13 100 35 -97 -45 92
6750 92 52 -84 -67 75 103 -40 -76 45 118 -15 -109 11 122 29 -102 -30 105 54 -93 -58 73 70 -72 -103 48
6775 48 98 -55 -108 18 112 -16 -113 -11 111 22 -103 -51 100 64 -79 -63 79 88 -59 -80 57 118 -25 -101 17
6800 17 119 8 -108 -11 111 47 -96 -54 99 73 -77 -87 60 86 -55 -105 35 100 -28 -112 0 99 7 -120
6824 -120 -29 97 49 -91 -50 84 80 -62 -92 60 98 -35 -99 35 114 -8 -115 -2 122 36 -96 -32 92 66
6848 66 -88 -74 79 81 -62 -89 48 108 -36 -112 18 103 -2 -112 -23 103 30 -99 -59 79 54 -75 -88 75
6872 75 91 -51 -101 36 110 -16 -107 6 125 26 -96 -28 110 70 -83 -67 84 78 -70 -85 64 90 -38 -115 29
6897 29 108 -1 -120 -8 100 30 -111 -50 101 58 -85 -85 73 77 -59 -96 43 104 -39 -104 4 107 -1 -115
6921a15R0J40n7j42L0J57k7j42lJ52K4j41p8J51Q7j38r5J01J14r0j25N3J45m0
6945E1j49K4J48lj39l8J56M4j34o6J25Q8j10j20J07J32q3j31N2J49m3j46KJ65
6969H1Pj49k8J48N7j42p3J19J05j17j17Q2J26n8j44M5J50k1j52LJ43K3j41n8J40
6994B9P6j28r3J10J16q8j21O4J42m9j37K3J34J4j55j4J36O6j55o1J22Q5j04j19
7018a07J05J20q1j43O6J44m4j50PJ65kj47l1J33O1j38p3J13J10j01j29Q5J41o7
7042C7j42N7J41rj59JJ54J6j35n4J32P9j29r4J11J20j04j21O8J38n4j39J2J59
7066H5Kj58j5J34N4j43p0J29R2j18j16J06J16o3j48P0J31k3j65K6J40J5j34n7
7090a10J55O3j45o4J18J02j10j11R1J36p2j52M0J50k1j49JJ49K3j41o3J31P0j12
$$ plain form
6921 -115 -25 115 58 -84 -54 103 76 -66 -69 83 107 -34 -112 39 126 -12 -107 -6 108 18 -107 -54 91 51
6945 51 -98 -74 74 71 -68 -106 50 94 -40 -106 19 107 -3 -123 -16 116 33 -98 -46 103 60 -86 -84 81
6969 81 88 -61 -89 59 116 -26 -99 20 125 8 -109 -27 99 41 -103 -58 92 71 -81 -78 65 88 -53 -111 29
6994 29 105 -23 -116 -6 110 22 -99 -35 107 58 -79 -56 78 92 -63 -77 59 125 -30 -91 31 116 12 -107
7018 -107 -2 118 37 -106 -40 104 60 -90 -83 82 80 -67 -98 35 96 -42 -115 -2 108 7 -122 -37 104 37
7042 37 -105 -48 93 84 -75 -74 80 96 -39 -93 39 118 -11 -105 6 126 22 -99 -31 107 53 -86 -74 85
7066 85 87 -71 -86 48 102 -41 -111 18 110 -8 -124 -18 98 35 -113 -43 88 65 -100 -74 66 81 -53 -110
7090 -110 45 108 -37 -101 17 119 9 -102 -11 125 53 -99 -59 91 70 -79 -78 71 94 -47 -110 21 91 -21
7114b1j03J19J08q6j42P3J51m6j50J2J65j2j45j7J56M4j43o1J17R4j10j12J00
7137iJ21p5j35N7J39k4j55J2J48K1j50n1J39O6j31r5J30J01j09j11P0J33o1j34
7161a03M1J46j7j54mJ50L2j47m2J31P0j21j03J23J12q2j36P4J42n5j40LJ66lj38
7186e5l5J52M1j42o3J18R2j12r7Q1J18p1j46P3J36l5j42J7J27L0j54k0J32M5j19
7211b9q6J17R9q8j07P7J17n9j22K6J48k0j41qJ36M9j40o5J30Q1j29r6J02J14q6
7236B0j18N2J38l8j44K8J27nj26k5J38L4j14q0J33Q8j17j06R4J20p2j23N3J32
7260H9k8j49K1J44J9j42l8J28N9j31o6J05Q4q2j08Q0J12o2j25L1J28qj45nJ42
7285E3L1j43l5J10Q0j11r3J00J04q6j24P7J18l5j19J1J35pj20j6J24M1j18n9J03
$$ plain form
7114 -21 -124 -5 103 17 -125 -52 99 53 -97 -85 80 68 -77 -94 62 106 -37 -98 19 113 3 -109 -9
7137 -9 112 37 -98 -41 98 74 -81 -69 79 100 -50 -101 38 104 -27 -122 8 109 0 -111 -41 92 31 -103
7161 -103 -62 84 67 -87 -91 59 91 -56 -98 33 103 -18 -121 2 114 32 -104 -30 112 57 -83 -80 86 83 -55
7186 -55 -90 62 103 -39 -102 16 108 -4 -101 -20 98 27 -119 -46 90 55 -87 -70 57 87 -67 -87 45 90 -29
7211 -29 -115 2 101 13 -94 -17 100 41 -81 -55 93 73 -68 -76 60 109 -31 -96 34 115 -14 -110 -8 106 20
7236 20 -98 -46 92 54 -90 -62 65 60 -66 -91 47 81 -33 -113 20 108 -9 -115 -21 99 27 -96 -43 89
7260 89 61 -88 -67 77 96 -46 -84 44 103 -28 -94 11 95 13 -95 -15 97 35 -90 -59 69 61 -84 -89 53
7285 53 84 -59 -94 16 96 -15 -108 -8 96 10 -114 -37 81 46 -73 -62 73 66 -54 -70 54 95 -23 -82 21
7310B1R8j16r7R3J16q4j26N4J29l8j20NJ36Qj45k5J25L9j09o7J06P9p5j11P7J20
7336I3o7j10M0J22j5j33lJ32K4j17n0J16P6j01r3Q0J03p3j08N9J12k5j33K2J18
7361F9jj21l3J28M3j29n8J12Q0r9r0Q1R7o6j00L7J28k5j32J2J27Nj11m1J20M8
7387H1r7p1J01P7p7j05P2J14o1j02K1J19j8j17JJ17K6j08n1J02O1j04p4Q6Q5o8
7413A0j02M8J07k7j20J6J27kj22qJ10L8j15l5Q9O6q4p1O5R5o4r0M0J10l0j14J
7440f2J26Oj08l5J08N4j07m9O9P0p0r6O9R3m0j05K5J03j6j00qJ05L0j04l5Q8O2
7467G3q1p1Q2Q4o7r2M6J07l2j11K3J08nj01j5J06J5r3m2Q0N0n6q8O3R1m9j01L1
7495d5J07j1j11lJ02J0q9l6R3N4q4n9O5P0m9q5N5Q2m0p9J1R5mq7j6J01K6r5l3
$$ plain form
7310 21 119 3 -94 -1 115 31 -95 -41 88 50 -70 -65 71 79 -66 -91 34 73 -36 -103 3 82 7 -104 -27 93
7336 93 26 -84 -44 78 63 -70 -73 59 83 -34 -84 32 108 7 -86 -6 97 24 -84 -25 87 62 -71 -49 69
7361 69 68 -53 -86 42 85 -44 -102 10 90 -9 -99 -18 79 13 -87 -50 78 53 -79 -67 60 65 -46 -87 33 81
7387 81 -16 -87 14 91 14 -91 -19 95 34 -68 -47 72 54 -63 -62 55 81 -27 -78 24 85 -19 -93 -7 78 10
7413 10 -92 -44 63 36 -84 -68 59 57 -65 -73 37 75 -40 -75 14 80 -4 -75 -10 85 21 -69 -29 81 51 -63 -62
7440 -62 64 70 -38 -73 35 89 -18 -67 2 72 2 -94 -25 68 28 -77 -52 51 35 -65 -73 32 62 -42 -77 11 73
7467 73 -8 -79 3 87 20 -72 -26 81 49 -62 -39 69 64 -37 -52 54 69 -24 -66 14 64 8 -80 -17 74 25 -76 -45
7495 -45 62 51 -60 -63 39 49 -40 -76 17 71 -13 -72 -7 63 14 -71 -16 66 26 -53 -42 53 49 -38 -54 47 73 -22 -55
7524e5P2N8o7n8M7P6n2q3L3Q7j6j01J2R4j5q0j7Q6L1r0l4Q1N3o2o8N2O6l0p6K2
7554c4J01l1p8nQ3K6q9k2P2M0o3n9O7N8o3n5M2P0l0q7K0Q4j5q0oQ4K0p7l6P7M1
7585E5o9n3N0P0l7p0L1Q0l3p2K2Q1no9j8O8L1p3m7Q1M2o0n4N4N3k9o7J2P7j8p7
7616d4MP7Po9k2O0L2n8m1M8N5m5o7M4N9k6o7J7P7Kp9MN2K7o8k8O1L9m7n3N0N4
7648E5m8m5K4O8k6n8OO5J1p7k1P1K8o5l7M0O4o4o0N4N2j9p1K9O0rp2%P1J2n9k2
7680d3O6K4o6k0K8N2l9n2L3O2k8n6J8N9Mp2kN8J0n2l2N8L0m8m3L4M8l5m3K0N0
7711B3j1n7LN6jm7j2N4L2n9k6M8M9m8l7K6M3j1n5J5N0jo2RL8J4n3j0N7J2m0l9
7743d0L7M2m2m1K5N2k4m5MN2nl7j1M5J8n9oL1L5m3l5M2L2k8l6J2N0jm2j0N5Mm6
$$ plain form
7524 -55 17 75 8 -50 -3 73 21 -62 -29 58 42 -59 -47 47 32 -48 -65 21 52 -38 -72 9 62 0 -68 -16 50 20 -56 -34
7554 -34 67 36 -42 -47 36 62 -27 -49 23 63 0 -59 8 66 3 -52 -10 60 30 -57 -37 47 32 -48 -54 30 50 -27 -63 14 55
7585 55 -14 -67 -17 53 16 -54 -23 57 24 -48 -26 55 50 -19 -37 31 62 -11 -58 23 65 5 -49 5 58 29 -38 -26 51 33 -44
7616 -44 -40 37 44 -25 -47 13 45 -13 -54 -6 49 4 -63 -19 40 14 -53 -36 41 43 -36 -32 20 47 -21 -49 12 51 4 -49 1 55
7648 55 7 -38 -14 54 28 -30 -24 41 52 -25 -46 25 53 -12 -49 -9 55 -9 -69 -15 37 18 -53 -24 36 27 -45 -45 26 38 -21 -43
7680 -43 23 47 -19 -39 -11 41 2 -50 -17 45 17 -39 -21 38 42 -30 -32 26 36 -16 -48 10 40 -8 -51 -17 31 -4 -47 -27 23
7711 23 12 -45 -42 14 13 -34 -46 8 40 -19 -45 3 52 4 -33 -7 36 25 -30 -15 35 34 -28 -19 19 33 -20 -30 27 39 -1 -40
7743 -40 -3 39 -3 -44 -19 33 9 -36 -32 20 15 -22 -33 12 30 -29 -35 -4 31 -12 -47 -5 27 -1 -37 -25 25 24 -18 -28 27 31 -15
7776a5j5M9J2k8l9L6M6n4l0K3M8l0l8J2M2ln2ML6J5m7k0N1K5m9k4K8M3j9n5J7
7807c1N6j0m8NN5mm4kL5K0k9k3K7K7k6m4L0M7j6o0K0M1Nm9j1L8Ol3k7M4J6l5k0
7840d0K7K5k0l2J6L3ml0LL3Kk9j4L0K8l8j7L6L4l5l1J5M2k2m5K5K5Kl8kM6jl7
7873a3j4K8J5k9k4K8K3k2l2J7L0kl9QM6Km4oK5L7l6k3L1K4k0m0L0L0j7l3J5L5
7905C0pl4oK0K4l9j0K7K2l5k4L1J6j1m1J4L8j4l3JL6Pl7j0M6Nl7j6M7Rj9k8J1
7938a7M1qm1NM9ll1j2L6Ll0j7M5Kk9j7J5K7j8j7NL5j9l5%K5J2k8rL6J2l1j5K1
7972hK7j9l4K6K7k0j5pM2rk6ML0J2l0j6L6Rk9j7J3L6k2k5kL8nm0RJ7Ok6lL0Lk6
8008a4j7K4K0j2k3J0K4nl4J3K4J0m1LL3Jl4pL7J2j8j6J9K3k6l1J8L1Qm2lK0Nm0
$$ plain form
7776 -15 -30 19 31 3 -36 0 46 -8 -38 -15 33 3 -35 -23 19 16 -36 -32 4 19 -28 -48 3 28 -21 -45 -17 26 7 -48 -31
7807 -31 25 15 -33 -28 27 23 -21 -23 12 32 3 -20 7 34 8 -36 -6 41 25 -35 -15 26 31 -18 -29 9 15 -18 -45 -1 15 -20 -40
7840 -40 -13 12 -8 -40 -24 9 5 -25 -22 11 13 -16 -30 0 28 -10 -27 9 43 8 -23 -8 34 12 -33 -8 17 19 -19 -21 25 24 -13
7873 -13 -27 1 16 -13 -37 -9 14 -8 -40 -23 7 5 -34 -26 20 22 -22 -28 -3 34 -2 -25 6 30 10 -30 0 30 13 -20 -5 30
7905 30 23 -11 -17 3 27 -12 -22 5 27 -8 -32 -1 15 4 -37 -23 15 1 -32 -31 5 12 -25 -35 11 16 -21 -37 10 19 0 -28 -17
7938 -17 24 16 -25 -20 29 26 -5 -17 19 22 -8 -25 20 22 -7 -24 -9 18 0 -17 -12 23 4 -31 -31 -6 6 -22 -31 5 17 -14 -29 -8
7972 -8 19 0 -34 -8 19 -1 -16 -23 19 10 -16 -12 18 30 0 -16 20 29 0 -17 -4 32 10 -15 -17 21 16 -24 -15 2 8 -18 -21 9 12 -14
8008 -14 -31 -7 13 1 -22 -12 12 7 -27 -14 10 20 -21 -18 15 16 -18 -25 12 24 6 -10 9 32 6 -25 -7 24 32 -10 -13 7 12 -28
8042b8QK6J5l5k3K7K6l2k5K2L1j4k8OL5j0k9KL5J1l2nJ5J8k3kQL3mm8J3M0rl3
8076imL6rl7lL4Rl1j4K6Rj2k1J7K4j2m4K3J6Ql4nL5J3l1nK2K1k6j6J7K8k2k4J1
8111a0L4jl0nL7jm2rL5K4n0pL0K2k3l2K3L9k5l9J0L5Km7MK9Rl9k3N5K1m3k6M7
8145DK7l2l7K6L3j0l1nM9j3k6NK6J7l6j3J8K3k3l1K2L8k8k9PL4Mm6LL1J4m9mK5
8179gK0l6rL0K5l1j0jL2ml4J1
$$ plain form
8042 -28 -20 6 21 -14 -37 -10 16 -16 -41 -19 12 -2 -30 -24 11 1 -28 -26 9 20 -12 -17 -2 16 -7 -9 -1 32 28 -20 -7 33 24 -9
8076 -9 -13 23 14 -23 -26 8 17 -14 -28 -2 7 -5 -26 -9 15 3 -41 -18 -2 6 -28 -33 2 15 -16 -21 1 22 -4 -20 -3 25 3 -21 -10
8111 -10 24 23 -7 -12 25 24 -18 -27 8 32 -18 -25 5 27 4 -28 -5 34 9 -30 -20 15 17 -30 -26 3 12 -27 -50 5 26 -17 -43 4
8145 4 31 -1 -38 -12 21 11 -20 -25 24 11 -15 -10 16 33 -3 -16 2 25 2 -29 -7 31 3 -26 -19 15 19 -27 -24 7 21 -28 -32 -7
8179 -7 13 -23 -32 -2 23 -8 -18 -19 13 9 -25 -14
8191a4
$$ Imaginary data points
##PAGE= N=2
##DATA TABLE= (X++(I..I)), XYDATA
0@%%%%%%%%%%%%%%%%%%%%%Qj3Rj2J6j6J6j6K0k4K4k5K7k8L3l9M1m5M9n5O2o4O9
44C7p7Q3q8R6j07J18j30J43j59J75j97K26k59K98l44M09m96O13p79J026j412K062
66A238l289O017j4246Q0220L48407l42100m85117K69510N21744j88095n34949
77c40660R1506N44820L98n44780p8536N15508J71552m96722k33594M44989L02045
88C76526l89683l61424L32391L97674k50266m44045J84086M62621j05498m73189
98b70807K4807M80187L8537m54758j19395M36200J80618l96799k39911L45103
108B3782L02298l02147l37180K34957L78982j77773m00943J16405M05601m2004
118B01978m14632j4344L94670Q5598l77731j46759L52684J95733l08378k53055
$$ plain form
0 0 0 0 0 0 0 0 0 0 0 0 0 0 0 0 0 0 0 0 0 0 0 8 -5 4 -8 8 -8 8 -8 12 -12 12 -13 14 -14 19 -20 21 -24 25 -30 32 -32 37
44 37 -40 43 -45 51 -56 62 -68 75 -84 91 -106 120 -139 159 -185 224 -272 341 -438 588 -824 1238
66 1238 -2051 3966 -10280 69940 418347 76247 -408870 -139360 382384 194289 -340660
77 -340660 -249154 295666 296064 -248716 -327252 188256 359808 -136914 -370508 74481 376526
88 376526 -13157 -374581 -42190 355484 105218 -338827 -154741 307880 202382 -270807
98 -270807 -246000 234187 272724 -182034 -301429 134771 315389 -81410 -321321 23782
108 23782 326080 23933 -313247 -78290 300692 122919 -278024 -161619 243982 201978
118 201978 -212654 -226998 167672 253270 -124461 -271220 81464 277197 -31181 -284236
128b84236K75178K84232k21157l16597J66908L41151j16462l44524M8788L56089
138A89370K525l45995o0270L30718J16789l15198j56021K76938K05285k46328
148b187k36864K03212K63473j52521k91315J11663K97082n5300l07714R121L04521
159A43171L6227k88765q8179K77614J23335k46504j66050K18463J99350j86561
169B2101k21433J42224K48402j08241k55732O2138K63070j8404k64946j9156K51218
180A01241O6340k43579r9258K21158J34146j95566j66559J71502J84759j32862
190D1322k08771J01750K19176o4267k24849K3629K30793P657k20776m7490K13922
201G2096P8270j97917j06390J73885J37230j54088j54921J22187J75931r3812
$$ plain form
128 -284236 -9058 275174 54017 -262580 -95672 245479 129017 -215507 -166719 189370
138 189370 191895 -154100 -214370 116348 233137 -82061 -238082 38856 244141 -2187
148 -2187 -239051 -35839 227634 75113 -216202 -104539 192543 137243 -170471 -161350 143171
159 143171 179398 -109367 -197546 80068 203403 -43101 -209151 9312 208662 22101
169 22101 -199332 -57108 191294 83053 -172679 -110541 152529 134125 -130821 -149977 101241
180 101241 167581 -75998 -175256 45902 180048 -15518 -182077 -10575 174184 41322
190 41322 -167449 -65699 153477 89210 -135639 -112010 118783 126440 -94336 -141826 72096
201 72096 150366 -47551 -153941 19944 157174 3086 -151835 -29648 146283 52471
211E2471j89251O4737J93610k9092k00103J965J93053L1212j85533o1192J74617
222D6494Q5330j54064j13781J38091J31264j13643j48096Q8123J61777o4699j65119
233a08323L3352J70996p969j67737j9845J61182M7987j54762o8501J38555R2491
244A17426j24616j09109J05474J22497q2018j36117O1794J40692l5232j46472
254h5681J2069J46875J0257j41599l4792J37110N2710j24361p2673J11267Q9259
265A00441r6081j01439P5834J14848n8696j21051L7611J26070j7179j28138j154
276f8934J23754K2578j19914l9625J10491N7052r9192p3366Q7701Q4720p1425
287A3840r6672N6796J03423l9811j07483K1418J10319n169j07685j3574J04946
$$ plain form
211 52471 -136780 -72043 121567 92475 -107628 -105663 87390 118602 -66931 -128123 46494
222 46494 131824 -22240 -136021 2070 133334 19691 -128405 -40282 121495 56796 -108323
233 -108323 -74971 96025 88056 -79681 -99526 61656 109643 -45119 -113620 24935 117426
244 117426 -7190 -116299 -10825 111672 29654 -106463 -44669 96023 60791 -85681
254 -85681 -73612 73263 83520 -58079 -92871 44239 96949 -27412 -100085 11182 100441
265 100441 4360 -97079 -21245 93603 34907 -86144 -48533 77537 60358 -67780 -68934
276 -68934 54820 77398 -42516 -82141 28350 85402 -13790 -87156 545 85265 13840
287 13840 -82832 -26036 77387 37576 -69907 -48489 61830 56661 -51024 -64598 40348
298D0348K9704r8863m4633Q9779N9423q0775o9865O7674Q0116n4522q7367M0306
310b8675R1538k4058r5158R543R4649O209r2848k0803Q8905L3690q1667m6731
322f5406P3988N6874o3434o6166N1849P3849l9935p8643K6340Q2513j3584q3404
334d5159M15Q2234J2632p9501k4344P3982L6052o7518m6118N9329N4816m9722
346G098o2342L9752O7517k8564p1230J7188P2963n703p2609n988P0837J6962o7167
359b1286k7394O2023L6943n5692m5083M7979N1983l9283n7467K9943O1174j9802
371B4038o3536R535O4304O10o3311j0772O1190J9990n7287k8659N2073L6532m5997
384a290m2828L8278M8597l0356n2677K1696N5365j2464n7164L896N6693N338n5522
$$ plain form
298 40348 70052 -28811 -73444 16335 75758 -5017 -74882 -7208 72908 18386 -68981 -28675
310 -28675 62863 38805 -56353 -46810 47839 54048 -38800 -59603 29302 62992 -18675 -65406
322 -65406 8582 65456 2022 -64144 -12295 61554 21619 -57024 -30684 51829 38245 -45159
334 -45159 -44744 37490 50122 -29379 -53723 20259 56311 -11207 -57325 2004 56820 7098
346 7098 -55244 -15492 52025 23461 -47769 -30581 42382 36679 -35930 -41918 28919 45881 -21286
359 -21286 -48680 13343 50286 -5406 -50489 -2510 49473 10190 -47277 -17334 43840 24038
371 24038 -39498 -29963 34341 34951 -28360 -39132 22058 42048 -15239 -43898 8175 44707 -1290
384 -1290 -44118 -5840 42757 12401 -40276 -18580 36785 24321 -32843 -28947 27746 33084 -22438
397b2438j3681N2736K1420m8238k9249M3624L5177l7027m1016L0328M5521k3325
409A3832m8137J4948N0681p703n0652n87M9976Q586m8450j5426M4577K3247m1308
422f416k8914L6083L4321l0171l9244K4683M1586j7002m4552J0534M5221l254
434B2875m4804m658M4670J0549m1570j7932L9217K3453l5360k8078K9805L3392
446C1559k5467l5698J8469L8918j2343m0739O411M0503J211m1455o240L9092J2799
459B7020l6941j8544L4313K2510k8892k8358K5457L1066j9598l4220J3767L7112
471B4692r343l6696K095L8084K581l6481q325L4135J4764l2854j8288K7999K4240
484B6603k5242k7499K0969K9851j5099l3400J1639L2922m793l4275l17L4018N099
$$ plain form
397 -22438 -36119 16617 38037 -10201 -39450 4174 39351 2324 -38692 -8364 37157 13832
409 13832 -34305 -19357 31324 23621 -27031 -27618 22358 30944 -17506 -32932 11645 34892 -6416
422 -6416 -35330 753 35074 4903 -34341 -9658 31928 14926 -29626 -19092 26129 22875
434 22875 -21929 -26587 18083 28632 -12938 -30870 8347 31800 -3560 -31638 -1833 31559
446 31559 6092 -29606 -11137 27781 15438 -25301 -18890 21613 22824 -18631 -24871 14221 27020
459 27020 -9921 -28465 5848 28358 -534 -28892 -3435 27631 8033 -26187 -12420 24692
471 24692 15349 -21347 -19252 18832 21413 -15068 -23393 10742 25506 -7348 -25636 2363 26603
484 26603 1361 -26138 -5169 24682 9583 -23817 -12178 20744 15951 -18324 -18641 15377 20476
497B0476l1690j1914L1639J4998k7740k0111K4890K3915k1885k5414J5680K9538
509B2382j2534k9812O619L1026j149l2330k184K9889Q744l0215j1684K7123J5849
522B1724k3547k0743K1703K2016j5784k6483J2972K7763q703k8196K995L0301
534A6018o20k7707n612K7680R426k5956j2715K2062J8460k1426j9630J6555K3294
547A9829j3452k5405J0593K4846m357k7423J958K5694L411k5295q110K5316J0144
560A7749k1430j5665K1005J7040j7178j9525J3032K2858j1147k2154N009K5070
572A4664k540k4701j138K3478O290k4435p428K0437J2551j9410j5012J6941J6669
585A6366j2255k1067J1420K0530o383k2659L404K3369j171k1146m543K2483N928
$$ plain form
497 20476 -11214 -23128 8511 23509 -4231 -24342 548 24463 2578 -22836 -7156 22382
509 22382 9848 -19964 -13345 17681 16532 -15798 -17982 11907 20651 -9564 -21248 5875 21724
522 21724 -1823 -22566 -863 21153 5369 -21114 -8142 19621 10918 -17278 -14283 16018
534 16018 15398 -12309 -17921 9759 19185 -6771 -19486 2576 21036 -390 -20020 -3465 19829
547 19829 6377 -19028 -8435 16411 12054 -15369 -13411 12283 15694 -9601 -17711 7605 17749
560 17749 -3681 -19346 1659 18699 1521 -18004 -4972 17886 6739 -15415 -10406 14664
572 14664 12124 -12577 -13715 9763 16053 -8382 -15810 4627 17178 -2232 -17244 -303 16366
585 16366 4111 -16956 -5536 14994 8611 -14048 -10644 12725 11554 -9592 -14135 8348 14276
598A4276j9438j0222J7855J3838j7098j4466J2435J8737j1680j8674P808J9586
610A2957l674k1522K226J9310L339k0772n218J9281P932j6916j2110J7049J2113
623A3995j2512j5824J0914J7054q342j7203L583K0180k854j8436j633J9133M152
636A2207j8785n554J5537J0269j5907j0695J2280J3671j0040j6143Q988J5532
648A1360m300j8370L478J7230q9j6791l600J7616M381j4442q970J4779J0101j2705
662c22j1630R724J4663r383j3676M939J5903l177j6056R15J5023L315j6669l742
676a0173J4173P234j3733r073J2745R506r065j2890Q705J2514n185j4044K714
689f572J5435j771j3884k291J5347K919j3526n369J2073Q222j1969q363Q498J1645
$$ plain form
598 14276 -5162 -15384 2471 16309 -789 -15255 -2820 15917 4237 -14437 -6629 12957
610 12957 9283 -12239 -10013 9297 12636 -8136 -13354 5927 13859 -3057 -15167 1882 13995
623 13995 1483 -14341 -3427 13627 5285 -11918 -8335 11845 8991 -9445 -11078 8055 12207
636 12207 -6578 -12132 3405 13674 -2233 -12928 -648 13023 2983 -13160 -4172 11360
648 11360 7060 -11310 -7832 9398 9309 -7482 -11082 6534 10915 -3527 -12497 2282 12383 -322
662 -322 -11952 -2228 12435 3052 -10624 -5685 10218 7041 -9015 -8100 6923 10238 -6431 -10173
676 -10173 4000 11234 -2499 -11572 1173 10679 1614 -11276 -2571 9943 4758 -9286 -6572
689 -6572 8863 7092 -6792 -9083 6264 9183 -4343 -9712 2361 10583 -1386 -9749 -1251 10394
703A0394q071j2023N940J2468k978j4279K555J2527J214j3390k755J2709M361
716H672j0850p731J1429P751q716j0078P675J1107o480j0677L024J2647k377j1597
730f201o21J1923K840j2322l559J0331O640j0740o923Q732Q338o836j0125O167
744b356R644k919j1539K045J1310j58j0917k378J1696K692r653n400R473O432
758G972q270p294O026R570n834r196L269J0454j984j0782Q77R781J902j0549k481
773f539R014M668q401o337Q025O687n828q754N542Q667l621r181J747R983r62
788D710q946j698R616K585q792m031P762N922p686o060N661P727m926q162L566
803b752Q277j452r365Q48Q537J310q798k499Q456L390p115n384P051N677n391
$$ plain form
703 10394 2323 -9700 -3760 8708 5730 -8549 -5994 6533 7747 -5643 -8398 4311 8672
716 8672 -2178 -9909 1520 9271 555 -9523 -1848 9259 2779 -7898 -4874 7773 5396 -6201
730 -6201 -6822 5101 7941 -4381 -7940 2391 9031 -1709 -8632 100 8438 1602 -8523 -2356
744 -2356 7288 4369 -7170 -5125 6185 6027 -4890 -7268 4428 7120 -2533 -7933 1540 7972
758 7972 -298 -7592 -1566 8004 2170 -7026 -3757 6697 4713 -6069 -5192 4589 6491 -4058 -6539
773 -6539 2475 7143 -1258 -7595 430 7117 1289 -7465 -1923 6744 3123 -6058 -4311 5672 4710
788 4710 -4236 -5934 3682 6267 -2525 -6556 1206 7128 -558 -6618 -957 6770 1844 -6318 -2752
803 -2752 5525 4073 -5292 -4444 4093 5403 -3395 -5894 2562 5952 -1163 -6547 504 6181 790
818G90o945M324P811l484p673J463Q624p63q096r17P941K439p921l124O647M930
834F046o450n462N265O285l983p285L316P077j427p831M86P704P60p314k394P471
850B264K934o352m380N878N141n004n653L547O768k925o750J371P266l06p396
865c597n40O809K096o861k730N922L946n235m965M648N379l302o412K734O484
880D376j540o676L32O892M22o248j956O230K774n609l753M860M828m480n114L305
896a357N864k544o057J510O064j66o358o29N936J925n852k801N484L466m659m427
912d601M218M714l088n338K159N737j285n754L5O097O66n791j690N517K581n155
928i78l191M296M136l747m619K845N133j914n606J193N589j09n736o62N468J565
$$ plain form
818 790 -6155 -1831 5980 2496 -5177 -3714 4910 4147 -3949 -4866 3075 5514 -2407 -5531 1116 6046
834 6046 -404 -5866 -601 5684 1701 -5584 -2268 4809 3382 -4449 -3963 3741 4501 -2813 -5207 2264
850 2264 5198 -1154 -5534 344 5485 481 -5172 -1625 5143 2218 -4532 -3161 4105 3799 -3597
865 -3597 -4137 2672 4768 -2093 -4823 1099 5045 -190 -5155 -507 4872 1570 -4842 -2108 4376
880 4376 2836 -3840 -3508 3384 3806 -2442 -4398 1832 4606 -1003 -4756 104 4932 452 -4662 -1357
896 -1357 4507 1963 -4094 -2584 3480 3314 -3044 -3673 2263 4188 -1664 -4465 1019 4485 -174 -4601
912 -4601 -383 4331 1243 -4095 -1936 3801 2516 -3238 -3203 2894 3560 -2231 -3921 1596 4177 -978
928 -978 -4169 127 4263 516 -4103 -1258 3875 1961 -3645 -2452 3137 3028 -2708 -3370 2098 3663
944C663n055k583M776L195m016m050L461M578k759m895J796N325j087n273O2N317
960B455Q47n215j636M798K597m535l178L885L838l203m405K535M682j587n081
975c203Q36N143L9n112r29N040J612m592k466M197L133l637l730K924M353k334
991A274m631J508M914p42m990l2M843R58m714j707M362K499l959l222L526L710
1007C597k869m205K225M478j468m597N78M736K02m660j068M543J841m349k431
1022c447L881L081l420l535K760L938j973m342J270M505m16m708k91M711R56m462
1038a492j721M235K263l674k932L109L545k567l934J799M437j258m565N48M576
1053B369K41m581q24M175J721l951k404L564K994l015l671K665L904j938m227
$$ plain form
944 3663 -1392 -3975 801 3996 -20 -4070 -609 3969 1210 -3685 -1889 3436 2349 -2924 -2862 2455
960 2455 3302 -1913 -3549 1249 3846 -689 -3867 18 3856 653 -3752 -1217 3465 1878 -3203
975 -3203 -2367 2776 2815 -2297 -3226 1814 3426 -1166 -3632 565 3698 61 -3669 -745 3608 1274
991 1274 -3357 -1849 3065 2323 -2667 -2699 2144 3102 -1612 -3319 1043 3542 -417 -3639 -113 3597
1007 3597 728 -3477 -1252 3226 1758 -2839 -2261 2475 2677 -1983 -3051 1492 3333 -1016 -3447
1022 -3447 434 3515 95 -3440 -680 3258 1285 -3057 -1787 2718 2302 -2406 -2697 2014 2970 -1492
1038 -1492 -3213 1022 3285 -389 -3321 -212 3333 766 -3168 -1369 3068 1810 -2755 -2207 2369
1053 2369 2610 -1971 -2795 1380 3101 -850 -3254 310 3304 289 -3382 -717 3187 1249 -2978
1068b978J263M391o04m253l93M417R89m146j798L926K498l726k831L042L489k631
1084F55l714J874M004j021m411M97M284M52m485r81M308J531l856k353L678K639
1100C101k869l374K389L837j869m010R84M513o41m338j74M313R05m249j363L629
1116G84K380l558k759K962L352k420l933K154L849j170m301P02M212O6m050j058
1132b788M276J388l713k328L640K757l275l019K438L747k190l671J175M117n26
1147B028m351L9M072J014m427j223L892J977l559k616L326K759k342l654K120
1162i45L761j345m049N67M504l52m034p42M283J127l923j718L373K685l427k729
1178b964K495L561k209l841J746L783p04m380N04L977N15m091j198M106J523l431
$$ plain form
1068 -2978 -1715 2676 2072 -2181 -2574 1843 2832 -1314 -3112 814 3312 -414 -3245 -203 3286 655
1084 655 -3059 -1185 2819 1798 -2613 -2116 2168 2620 -1865 -2846 1462 2993 -863 -3216 462 3101
1100 3101 232 -3142 -753 3084 1215 -2795 -1811 2702 2061 -2277 -2451 1862 2767 -1482 -2845 784
1116 784 3164 -394 -3153 -191 3161 741 -3192 -1038 2811 1641 -2660 -1958 2254 2320 -1730 -2788
1132 -2788 1488 2876 -837 -3165 475 3232 -43 -3062 -624 3123 933 -2738 -1563 2554 2028
1147 2028 -2323 -2284 1788 2802 -1625 -2848 1044 3021 -538 -3154 172 2931 589 -3065 -945
1162 -945 2816 1471 -2578 -2011 2493 2141 -1893 -2635 1648 2775 -1148 -2866 507 3192 -235 -2964
1178 -2964 -469 3092 883 -2958 -1212 2571 1867 -2513 -2009 1968 2483 -1608 -2806 1300 2823 -608
1194f08k603L579K678k832l228K237L812k019l592Q43M265n41m107k22L993J162
1210B817m302j262L528K343l590k638L108K967k276l807K221L585j123m145O49
1225a925M241j58l896j002M348J126l709k054L554K666l422k728K416L681k364
1240G74l590J484L914p10m352M48L900P64m342j041L981J660l512k584L612K560
1256B966k610l476K405L692j833l771Q34M440p29l980l69M218R19m134j323L473
1272G22K442l666k534K888L266k473l782K228L625j144m309R47M028l1m026q53
1288b672M280J086l590k227L762K476l264k912K596L677k516l476J405M124r97
1303A752m188L84M007O74m441q32L841J797l797k314L532K573k681l498K623L473
$$ plain form
1194 -608 -3211 368 3046 214 -3014 -777 3035 1016 -2576 -1733 2532 1991 -2116 -2338 1655 2817
1210 2817 -1485 -2747 781 3124 -466 -3104 4 2971 695 -3112 -891 2694 1571 -2574 -1925
1225 -1925 2316 2158 -1738 -2740 1608 2734 -975 -3029 525 3191 -231 -2959 -543 3138 774
1240 774 -2816 -1332 2582 1872 -2480 -2032 1868 2632 -1710 -2751 1230 2890 -622 -3206 406 2966
1256 2966 356 -3120 -715 2977 1144 -2627 -1793 2647 1918 -2062 -2431 1787 2706 -1428 -2751 722
1272 722 3164 -502 -3036 -148 3118 645 -3137 -909 2716 1572 -2737 -1790 2238 2207 -1819 -2672
1288 -2672 1608 2694 -896 -3123 639 3115 -149 -3061 -465 3212 696 -2780 -1375 2749 1752
1303 1752 -2436 -2052 1955 2629 -1812 -2644 1197 2994 -803 -3117 415 2988 307 -3191 -568 2905
1319B905j711l983J117M338p78m042l15M464N72m010j377L742K191l728k367K876
1335a06L334k782l521K147L801j355m336J121M012l9m348m51M202J052l796k055
1351c120L938K233l205l054K938L458k513l582J577M225j304m059L55M305L14
1366B506m400p76L958J782m085k065L513K725l038l363K769L459j829m143J501
1381a486M169p34m285o8M525M54m087j444M132J905l741k469L188L243l005l388
1397c091K156M006j715m210J114M206j75m556k20M211J140m186j767L971K254
1412C138l400l075L225L289k468l828J905M192j378m200M44M556J9m370q13M269
1428A505J565m173k005L573K853l349l218K741L697k103m188J654M203p49m551
$$ plain form
1319 2905 1194 -2789 -1672 2666 1888 -2154 -2469 1995 2567 -1443 -2820 922 3113 -615 -2982 -106
1335 -106 3228 446 -3075 -928 2873 1518 -2818 -1697 2315 2276 -2072 -2523 1679 2731 -1065 -3120
1351 -3120 818 3051 -154 -3208 -270 3188 675 -2907 -1330 2895 1591 -2468 -2113 2192 2506
1366 2506 -1894 -2670 1288 3070 -1015 -3080 433 3158 120 -3243 -474 2985 1156 -2987 -1486
1381 -1486 2683 1949 -2336 -2404 2121 2575 -1512 -2956 1176 3081 -660 -3129 59 3302 297 -3091
1397 -3091 -935 3071 1356 -2854 -1740 2466 2291 -2265 -2485 1726 2866 -1320 -3087 884 3138
1412 3138 -262 -3337 -112 3177 709 -3119 -1214 2978 1600 -2600 -2156 2400 2419 -1951 -2764 1505
1428 1505 3070 -1103 -3108 465 3318 -31 -3249 -508 3189 1086 -3102 -1448 2755 2006 -2545
1443b545K08M454N37m293j391M289J854l759k688L512L153l021l560K334M095
1458C179j883m165J016M470l56m522l38M398J199m423j688L983K439l692k979
1473c362L256L376k511l996K066M158j239m509N78M652L3m500r10M543J408m119
1489a076k185L786K840l403l285K707L948k296m184J574M469q79m653K80M493
1504B136O49m542j270M244K043l919k789L675L186l014l817K571M083j860m326
1519b950J038M632m47m507n25M654J144m466j821M130K566l879k974L206L601
1534C402k678l986J997M281j161m695O05M669K37m738r07M606J510m160k348L910
1550E44K844l281l519K752M055k247m284J428M701r13m647O5M661P23m589j374
$$ plain form
1443 -2545 -2337 2117 2654 -1639 -3030 1259 3113 -646 -3334 178 3331 310 -3250 -916 3179
1458 3179 1296 -2869 -1853 2617 2261 -2261 -2599 1799 2998 -1425 -3113 870 3309 -383 -3362
1473 -3362 -106 3270 759 -3237 -1171 2987 1748 -2761 -2183 2469 2502 -1998 -2908 1635 3043 -1076
1489 -1076 -3261 525 3365 -38 -3323 -616 3332 1036 -3148 -1574 2895 2016 -2637 -2357 2136
1504 2136 2785 -1757 -3027 1217 3260 -659 -3448 227 3413 399 -3418 -847 3236 1376 -2950
1519 -2950 -1912 2720 2273 -2234 -2759 1895 3039 -1427 -3248 882 3448 -431 -3405 -199 3402
1534 3402 724 -3262 -1265 3016 1855 -2840 -2235 2434 2671 -2067 -2974 1632 3142 -1018 -3366 544
1550 544 3388 107 -3412 -660 3395 1148 -3136 -1708 2993 2080 -2567 -2502 2159 2882 -1707 -3081
1566c081M172K311m044k820L540L415l016l951K552M123j679m521J057M586k48
1581B396m621o17M693J217m380k060M226K580l754l103L135L736k650m011J815
1596a398M466j177m663M67M691L69m802r12M444J749m208k394L820K937l198l658
1612c467K788L978k039m422J433M631p95m585j11M703P32m425j573M221K292l942
1628e81k828L382L525l012l822K304M186j588m480R38M493j1m687o09M502J379
1644C091m304k097M090K565l491l259L083L644k407m032J645M452j117m478K43
1659b372M681L62m538j058M264J873m102k343L495L109l146l548K565L933j847
1674A328m373J367M363n01m551j37M455Q60m216j709M136K182l614k919L269L383
$$ plain form
1566 -3081 1091 3402 -642 -3462 78 3493 477 -3474 -922 3201 1522 -2999 -1942 2644 2396
1581 2396 -2225 -2842 1851 3068 -1312 -3372 854 3434 -320 -3423 -288 3448 798 -3213 -1398
1596 -1398 3068 1891 -2772 -2305 2386 2755 -2047 -2959 1485 3234 -974 -3368 452 3389 191 -3467
1612 -3467 -679 3299 1260 -3162 -1729 2902 2107 -2478 -2589 2114 2846 -1579 -3152 1069 3361 -581
1628 -581 -3409 -27 3498 486 -3336 -1032 3154 1566 -2914 -1976 2517 2506 -2181 -2790 1712 3091
1644 3091 -1213 -3310 780 3345 -146 -3405 -322 3322 915 -3117 -1472 2980 1863 -2615 -2372
1659 -2372 2309 2671 -1867 -2925 1339 3212 -890 -3233 262 3371 225 -3323 -758 3175 1328
1674 1328 -3045 -1678 2685 2184 -2367 -2504 1951 2811 -1405 -3114 1022 3204 -410 -3329 -60 3323
1690C323k779l670J990M192j536m212O61M433K1m469o45M206J511m204j922L689
1706E89K618l275l196K875L470k067m049J640M137q78m300J35M471L42m130j239
1722b857M130J731l717k363L243L059k987l265K179L887j780m043J136M093k91
1737B155m369j30M041J035m052j587L788K082l243k876L083L058k336l599J841
1752a109L905j339l890M29M277o2m010p65L966J415l861j780L248K632l126k861
1768b931K487L325j888l803J538L722o01m140K29L988M43l818j261L905J515l272
1784e62k370L123K705k650l009J924L643j716l536Q08L932l27l965j79L702J073
1800B596l892j308L342K051l093k563K809K749k009l440J811L425j052l669M03
$$ plain form
1690 3323 544 -3126 -1136 3056 1520 -2692 -2031 2402 2423 -2046 -2691 1515 3026 -1178 -3100 589
1706 589 3207 -68 -3264 -389 3081 1014 -3035 -1395 2742 1864 -2436 -2301 2170 2512 -1618 -2857
1722 -2857 1273 3004 -713 -3076 167 3226 239 -3026 -847 3040 1260 -2783 -1647 2446 2155
1737 2155 -2214 -2344 1697 2732 -1320 -2907 881 2963 -280 -3156 -73 2985 649 -2950 -1109
1752 -1109 2796 1457 -2433 -2004 2273 2211 -1799 -2564 1402 2817 -1044 -2824 424 3056 -70 -2931
1768 -2931 -444 2881 993 -2810 -1272 2450 1849 -2291 -2062 1926 2369 -1449 -2710 1195 2710 -562
1784 -562 -2932 191 2896 246 -2763 -839 2804 1088 -2448 -1640 2292 1965 -2000 -2179 1523 2596
1800 2596 -1296 -2604 738 2789 -304 -2867 -58 2691 682 -2758 -947 2478 1426 -2243 -1840
1815a840L929p4l587q55L784J155l400j745L033K414k919k512K118L203j883l331
1831b510J304L429n26l826K83L491O15l649j052L481J459k992k236K977K329k269
1847C08k912J908L231j535l188O64L665m29l440l11L473R07l499j190K973J990
1863B615k972k187K440K618j932l115J715L018q50l480N52L392K9l293p67L468
1879A251R72k966j729K913K058k575k339J969K931j829k870J078L234o42l348
1894a892K30L164N59l373q05K993J456k846j916K672K084k042k700J883K765j288
1910I44l009P40L276m37l077l33L272O30l033j131K779J715k688j902K127K458
1926B331j909k661J483K800q62l144O10K988O1l099m95L044Q79k728j533K702
$$ plain form
1815 -1840 2089 2015 -1572 -2427 1357 2512 -888 -2633 400 2814 -105 -2617 -499 2704 821 -2510
1831 -2510 -1206 2223 1697 -2129 -1846 1645 2260 -1389 -2441 1040 2499 -493 -2729 248 2577 308
1847 308 -2604 -696 2535 1000 -2188 -1524 2141 1712 -1728 -2039 1434 2341 -1158 -2348 625 2615
1863 2615 -357 -2544 -104 2514 582 -2533 -818 2200 1350 -2130 -1578 1814 1843 -1450 -2217 1251
1879 1251 2223 -743 -2472 441 2499 -76 -2415 -446 2485 656 -2214 -1136 2098 1456 -1892
1894 -1892 -1662 1502 2061 -1312 -2117 876 2332 -514 -2430 242 2326 284 -2416 -533 2232 944
1910 944 -2065 -1325 1951 1514 -1563 -1896 1376 2006 -1027 -2158 621 2336 -352 -2254 -127 2331
1926 2331 422 -2239 -756 2044 1182 -1962 -1352 1636 1697 -1402 -1897 1147 2026 -702 -2235 467
1942D67J737k239k222J960K520j643k608J021K968p43k899J45K977L47k999o94
1958a905K717J308k693j566K335J970k010k345J746K447j154k790Q38K833l43
1973A388k878j83K970M81k725j028K650J370k363j738K007K165j783k324J288
1988g03K641r56k762N40K782l7k843l19K673Q27k565j244K384J592k086j995J869
2005b02K190j451k460J101K595o95k623J71K727K03k629o84K585J063k430j397
2021a936K158J779j933j988J525K265j158k441P53K545k96k691k8K606M80k563
2037i23q47K426J160k128j598J941J835j561k162J258K374r42k450M79K604k01
2053A265k471k88K456O85k343j053K129J489k004j702J661K018j398k196J082
$$ plain form
1942 467 2204 -35 -2257 -297 2223 580 -2028 -1007 1961 1218 -1681 -1536 1441 1788 -1211 -1905
1958 -1905 812 2120 -573 -2139 196 2166 156 -2189 -443 2004 850 -1940 -1102 1731 1388
1973 1388 -1490 -1673 1297 1778 -947 -1975 675 2045 -318 -2056 -49 2116 333 -1991 -703
1988 -703 1938 982 -1780 -1240 1542 1505 -1338 -1657 1016 1843 -722 -1966 418 2010 -76 -2071 -202
2005 -202 1988 537 -1923 -822 1773 1078 -1545 -1374 1353 1556 -1073 -1757 828 1891 -539 -1936
2021 -1936 222 2001 68 -1920 -395 1870 712 -1729 -976 1569 1273 -1418 -1446 1160 1640 -923
2037 -923 -1770 656 1816 -312 -1910 31 1866 305 -1857 -599 1775 833 -1617 -1138 1466 1265
2053 1265 -1206 -1494 962 1647 -696 -1749 380 1869 -135 -1837 -176 1842 444 -1752 -670
2068f70K249n91k432K68K402J94k413n98K393Q68k162j299K070J488j739j766
2084a738J401K033j123k119O27K388l86k377jK366L99k376o13K102J083k001j338
2101a673J718J621j391j974J231K044q12k261N48K292k19k200k72K276N04k040
2117f08r77J968J269j819j465J487J824j367j847R21K053n94k171L25K073K10
2133A282k246m11K086P72j963j107J888J223j489j620J363J701r61j919O25K134
2149A358m49k034l5K193K11k050n27J866R48j835j075J464J484j346j666J103
2165c90J775p32k021O03J900j33k018j40J971M08j776q75J838R95j545j328J400
2182f8J528j224j555P84J842o36j799K38J874J08j976k69J767P07j798q49J579
$$ plain form
2068 -670 1579 988 -1444 -1176 1226 1420 -993 -1591 802 1670 -492 -1791 279 1767 28 -1738
2084 -1738 -337 1696 573 -1546 -919 1469 1083 -1294 -1295 1071 1470 -906 -1519 583 1666 -335 -1673
2101 -1673 45 1666 275 -1699 -468 1576 764 -1497 -949 1343 1124 -1076 -1348 928 1432 -608
2117 -608 -1585 383 1652 -167 -1632 -145 1679 312 -1535 -614 1439 845 -1326 -1001 1072 1282
2133 1282 -964 -1375 711 1483 -480 -1587 301 1524 35 -1585 -222 1479 518 -1401 -776 1358
2149 1358 909 -1125 -1160 1033 1244 -806 -1333 533 1481 -354 -1429 35 1519 173 -1493 -390
2165 -390 1385 653 -1368 -765 1135 1002 -1016 -1156 815 1223 -553 -1428 410 1405 -140 -1468 -68
2182 -68 1460 236 -1319 -535 1307 671 -1128 -890 984 1092 -884 -1153 614 1321 -477 -1326 253
2199B53J102j346j384J233J407q05j741O67J760l65j781OJ922J00j706n27J721
2216E16P16j551r40J291J302j260j314Q88J599p36j668N04J635r2j806l1J636
2233F89M20j630o72J567Q21j285j199J298J200r53j425P34J570n82j501J40J718
2250I10m2j593k87J562N75j568o61J267J041j276j091J000J265p29j498O49J405
2267I29k16j617R6J554J52j450n02J538N52j257r15J216J056j054j135P23J434
2284A104p06j321L01J503j36j526j9J352M33j480m77J232P95j166r93J100J016
2301A012p58j320P32J257m14j354J51J471o7j273l49J424M23j262o47J100R34
2318A060j125q84P52J208p05j216M83J232j64j441J57J234K50j343l80J253N18
$$ plain form
2199 253 1355 9 -1375 -142 1265 460 -1281 -614 1146 781 -1000 -994 928 1028 -678 -1205 516
2216 516 1232 -319 -1259 32 1334 74 -1240 -352 1247 511 -1157 -653 982 890 -916 -947 689
2233 689 1109 -521 -1193 374 1195 -90 -1289 9 1209 256 -1169 -435 1135 553 -948 -808 910
2250 910 868 -725 -1012 550 1125 -443 -1104 163 1204 -72 -1163 -163 1102 373 -1125 -476 929
2267 929 713 -904 -808 746 898 -552 -1054 484 1036 -221 -1136 80 1136 82 -1053 -330 1104
2284 1104 398 -923 -622 881 745 -781 -800 552 985 -495 -972 260 1055 -111 -1104 -4 1012
2301 1012 254 -1066 -334 923 509 -845 -694 777 710 -563 -912 512 935 -327 -974 126 1060
2318 1060 -65 -949 -197 1011 306 -910 -427 805 641 -800 -643 591 841 -502 -882 371 889
2335H89j041q63J109Q09p64j091O83J204n82j128J83J382j97j202j38J228L53
2352H34j246m01R64P97j051p89Q12R77o41j165O19J049k38j266K02J167M8j134
2370d62l22J222L18r38p00R99P55q49q54O08J099o33r69K65J177j65j177L6J033
2389D43L21j198k95R61N71r21p09Q57P28n55j036O00R59l30j049J38J168j24r73
2408d44k42J115K63r55m37Q11O95q71o48N54R42n61r36L91R40j26j140J68R14
2427D33J77j005k84R75L55p57o56Q32O18n85q19N04R20m54q25J33J032j27r02
2446d35j30R18K95r52l03P36N93q01n68N98O98m44q71M39P64j24r70R8R14M3q42
2467c44k79R34K44p02m97P01N84o12o23L98Q38m36p46J90Q51p6q91L4P47K55q52
$$ plain form
2335 889 -152 -1015 94 903 139 -952 -269 935 353 -775 -592 790 593 -609 -747 481 834
2352 834 -412 -813 151 948 -103 -892 -80 897 256 -909 -290 759 521 -745 -543 624 672 -462
2370 -462 -784 438 756 -182 -882 117 872 23 -831 -223 876 243 -726 -461 716 551 -626 -590 443
2389 443 764 -434 -729 232 803 -118 -827 30 758 203 -833 -233 726 396 -653 -515 653 529 -444
2408 -444 -686 429 692 -263 -700 111 806 -65 -713 -159 783 222 -714 -323 617 491 -649 -481 433
2427 433 610 -395 -679 296 651 -106 -762 70 688 103 -716 -212 708 254 -571 -438 594 467 -435
2446 -435 -565 353 648 -304 -607 129 722 -79 -647 -49 649 205 -666 -227 537 413 -557 -459 455 498 -344
2467 -344 -623 311 555 -147 -644 57 641 29 -594 -196 642 206 -540 -350 501 425 -466 -432 315 570 -282
2488b82k62P06M29o26n96O39N71m09p60L84P37k37p46M0Q44j5p23k16P77K87p19
2509a77l79N92N55o04n17L83O82l29p19K37O89j0q17qP24J75p24k75O97L30n41
2530c6n17N44N17l74o21K61P24k29o67M3P40Ko85j16O11L10o51l22M92M84m69
2551D1n61L93N88k62o71K23O12m9o35p2O52J47n61l34O04L65n20m39M34N24l75
2572A04n13K19N81j21o13K6O00J18o31j71N68K84n50l40M68L93l49n06L08N19
2592C94j82n85R0O23l7n81j03O03J48n30k34M51L57m07m14L16M89k50n46J94N49
2613C45o3o06L0N35R6n05k15N07K63m12m02M12M29l26m88K37N31j79m89K8N39
2634B67N1n30j47M93K63n04l11M39L79l68m33L03M45j68n22J17N18rn19j15N68
$$ plain form
2488 -282 -544 162 591 -35 -631 8 579 170 -590 -206 531 294 -452 -412 432 417 -306 -522 255 542 -177
2509 -177 -556 36 591 -13 -530 -147 535 206 -513 -276 413 403 -414 -422 302 477 -247 -522 175 505 -36
2530 -36 -553 -9 508 134 -487 -226 498 269 -398 -355 385 387 -298 -414 197 507 -144 -466 26 510 41
2551 41 -520 -127 461 199 -472 -249 363 314 -321 -393 259 406 -155 -489 115 480 -40 -479 -45 479 104
2572 104 -409 -190 391 270 -343 -317 283 401 -230 -401 167 451 -99 -439 29 422 73 -433 -125 394
2592 394 212 -373 -283 340 303 -278 -381 222 370 -160 -394 57 414 7 -407 -91 398 148 -398 -204 345
2613 345 282 -324 -294 241 337 -168 -383 124 387 -25 -427 -15 414 88 -400 -163 368 189 -300 -272 267
2634 267 318 -212 -359 134 397 -107 -418 21 400 32 -401 -98 347 179 -343 -226 292 283 -236 -351 217
2655B17J35m77k67M72L04l89l70K99M80k79m67J41N33p8n44OM98J37n39j65M51
2676I8K96m29l72L85M00k66n16K49M94j30n24L9N43K4m92j71N25K32m75l06M09
2697A3M18l95m18K69M90k01n09J18N01K8n81n6N20J94n32k74M96L08l79m30L67
2718e3M32k36n13J49N78j12n50m4O10Q1n39j97N13K93m91l26L68M66l34m93K40
2739a58N28j30o09J08N49O2n93j26N63K12m85l54M98L58l75m90L40N26k64n42
2759c82J12O39j00n67n7N85J62n82k20M87L78n08l97M04M75l06n71K87N36j15
2779B60o16N5O03N1n77k04O31K10n13l65N12M23m39m70L15N75k90n49J16O43m3
2800C28o60j8N87J95o49k28N61L49n05m47M67M61k97o19K93N94j38o56L5O98J8
$$ plain form
2655 217 352 -125 -392 80 384 -5 -375 -76 404 125 -342 -201 332 254 -290 -284 214 351 -188 -353 98
2676 98 394 -35 -407 -22 378 112 -404 -155 339 209 -315 -276 267 291 -201 -372 153 385 -90 -396 13
2697 13 431 36 -382 -113 377 176 -333 -215 286 314 -267 -323 197 391 -141 -415 81 389 10 -420 -53
2718 -53 379 143 -370 -221 357 245 -305 -349 261 342 -197 -394 119 412 -79 -405 -37 429 95 -398 -158
2739 -158 370 240 -369 -261 288 350 -243 -369 194 406 -79 -433 65 423 48 -442 -102 424 160 -382
2759 -382 -270 369 269 -298 -355 230 392 -190 -410 77 455 -53 -450 -46 429 123 -448 -161 375 260
2779 260 -356 -301 302 353 -224 -428 203 413 -100 -465 47 470 31 -439 -124 451 161 -388 -272 371 328
2800 328 -332 -350 237 432 -217 -445 116 465 -40 -487 -20 441 144 -475 -182 412 274 -382 -347 351 369
2821C69o14j97O64K26n66l55N07M78m73n00L26O35l02o34J83O63n5p05%O13J90
2842D53o53k67O02L44n05n00N09N10l54o31K97O61k13o40K8P23J5o34j94O57K85
2863D93o36l40N31M89n32m98L91N87k76o78K39O36l0p53lP02J35o65k92O86K93
2884D79n24m84N26N17m12n76K58P10k48o54O8P31pp06r6O39K78p01k90N59M64
2905E31n17n55M75N49k79o97K69O60j07p08rP44O2o50k55P10K83n97m12N18N38
2926E53n17n29L15O85k95o63J57O89kp74j7O69K22p08k91O45L55n14n41N36N26
2947E01l60o49K88P11k11o82L7P63po66j86O96K86o82l42N57N18n57n27M21O12
2968E21l18p05K72O45n9p56J0P10J13o64k87P23K93n67m73N57N13m66n62L14P10
$$ plain form
2821 369 -245 -442 222 448 -118 -473 34 512 39 -461 -135 500 198 -436 -253 410 355 -350 -350 263 453
2842 453 -200 -467 135 479 -26 -526 -17 493 139 -492 -195 466 253 -387 -359 364 379 -255 -449 208 493
2863 493 -143 -483 48 537 5 -493 -102 485 209 -469 -230 406 376 -377 -380 322 457 -208 -500 186 479
2884 479 -45 -529 -3 514 102 -474 -216 494 246 -408 -340 391 384 -322 -418 221 499 -202 -492 67 531
2905 531 14 -541 -66 483 204 -493 -224 436 329 -379 -388 356 418 -232 -487 223 506 -91 -503 15 553
2926 553 36 -493 -178 507 212 -451 -294 395 393 -381 -398 271 493 -215 -506 139 494 -20 -561 -25 501
2947 501 141 -508 -220 491 280 -402 -365 398 391 -275 -461 235 521 -161 -503 54 572 15 -512 -91 521
2968 521 203 -502 -230 415 356 -400 -390 320 433 -231 -518 205 498 -69 -542 15 528 62 -500 -186 524
2989E24l10o53J13P49k5p57n5O85K44p35k56N95M20n66n28N33N39l56o97L37O84
3010D85j90p15N4P59lo73k03P30K64o71l62N67N28n73n17M15O50l66o87K57O69
3031D18n2p77L3O89J49p12k51P08L19o01m85O08M89m45o13L69O78l04o57J11P77
3052D51p2p34r0P35K13p38k60O24M17o15m67N02N58l88o80L66O60j82p62J26P59
3073D23l1o98j62P42K12o32l83O27M76n86n10M41O64m36o47K83O96j59p54Q0P01
3094C47J19p65j76O94L11o50m51O54M59m99n98M49O44l39o77J74P70j24p37l5
3114d30P75J40p63k21O75L77o56m28N28N69m68o39L96O69k46p77J90P57n2p65
3134c69p9P71J69o85l42O80M21o06n21N18O25m76o40L09P38k34p39R4P45O7q00
$$ plain form
2989 524 214 -439 -326 423 398 -359 -414 271 515 -220 -476 119 539 -27 -555 -22 517 161 -536 -199 485
3010 485 295 -420 -366 393 390 -283 -486 244 508 -163 -525 42 570 -3 -520 -105 545 179 -508 -251 418
3031 418 366 -411 -378 311 460 -252 -503 205 524 -77 -562 46 535 90 -523 -154 524 220 -437 -326 451
3052 451 379 -355 -445 290 503 -235 -495 129 546 -69 -536 -34 524 136 -544 -178 482 300 -462 -336 423
3073 423 392 -306 -468 274 486 -146 -529 98 574 -12 -522 -81 583 147 -500 -217 479 320 -434 -354 347
3094 347 466 -299 -475 219 530 -120 -571 83 542 43 -555 -106 538 199 -478 -304 466 342 -395 -430
3114 -430 345 485 -278 -499 176 553 -103 -531 -3 566 98 -541 -145 524 278 -499 -309 448 396 -369
3134 -369 -448 323 492 -193 -535 145 566 -40 -561 -43 582 106 -534 -225 513 279 -460 -366 379 446 -354
3155c54j28P27K82p13l81O67M51n53n67M93O17l59o96K48P81j81p58kQ20O5p53
3176b94k19P34L43p06m03N89N37n34o17M30O86l08p69K35P57q1p99k6P90J35p41
3197b61k89P35L64o32n06N90N83n08o44L85P33k87p60J56P87k1p98q8P61K23p58
3218b35l22O98M39o22n47N51O10m35p09L50P40k23p83R1Q18J8p90j52P60K81p22
3239a84l91O58N05n96n88M96O75l97p32K84P80j52q08L7Q09Q5p88k10P54L35p01
3260a29m57O37N61n68o23M42P02l35p59K09P97o9q30m1Q05J60p76k76P32L97o77
3281i8n04N88O10n01o73L79P51k65p93J36Q25k9q06j01P96K34p68l48O91M85o45
3302c6n61N37O55m25p31L26P60j96q15Q7Q16M7p92k06P93K98p37m22O84N17n79
$$ plain form
3155 -354 -482 245 527 -186 -567 100 551 -2 -569 -76 541 182 -514 -266 515 334 -424 -426 394 459 -294
3176 -294 -513 221 564 -142 -545 44 581 47 -570 -140 546 238 -531 -296 461 380 -419 -445 345 480 -261
3197 -261 -550 185 549 -83 -589 1 584 76 -568 -183 550 263 -497 -341 446 425 -373 -461 300 523 -235
3218 -235 -557 141 580 -42 -589 -38 572 137 -572 -222 518 295 -488 -397 421 439 -351 -503 257 538 -184
3239 -184 -575 83 588 -8 -596 -100 575 178 -554 -270 510 358 -450 -413 396 481 -307 -517 237 572 -129
3260 -129 -586 51 612 44 -579 -137 565 230 -529 -320 477 408 -422 -463 342 502 -274 -550 182 579 -98
3281 -98 -602 -14 596 95 -578 -199 552 287 -506 -370 455 426 -380 -481 315 549 -219 -567 124 609 -36
3302 -36 -597 -60 595 170 -561 -235 525 329 -486 -399 417 464 -328 -534 259 557 -180 -602 82 599 20
3323B0o12M75P02l87p45K53P87j18q19OQ05J53q16k46P53L66o80m83O18N67n20
3344G9o61M21P32l20p59J71Q17p2q05p7Q08K02p92l07P03M50o59n35N65O28m74
3365A15p02L76P41k18q07J08Q07L2q20j43Q04K46p17m03O84M98o07n88N02O87
3385E95m17p14K70P83j63p92L1Q03R8q02k04P37L49p07m52O44N33n33o48M49P01
3406E61l41p49K09Q05r8p88p2Q19J62p78k80P17M31o93m93N61O31m95o83L80P33
3427E39k50p74J51P71Mq12j27P89K33p28l77P13M51o04n81N30O49m24o97K96P65
3448E17j94p78N0P92R2q16j68P31L32p17m03O34N23n52o36M88O64l20p65K36P80
3469D90j13p73l7P97J27p59k59P23L82o69m68N67N86n20o27L69P23k76p52J60
$$ plain form
3323 20 -592 -117 585 198 -547 -294 493 375 -444 -438 367 520 -296 -542 211 577 -103 -586 32 599 79
3344 79 -582 -161 571 251 -508 -337 480 408 -397 -474 334 536 -256 -563 140 590 -69 -604 -39 589 115
3365 115 -587 -211 530 312 -495 -387 420 452 -368 -511 293 539 -178 -581 103 601 -6 -594 -92 595
3385 595 178 -536 -266 517 354 -438 -407 396 494 -308 -512 225 574 -133 -585 59 592 59 -589 -140 561
3406 561 220 -529 -320 485 387 -401 -473 346 508 -270 -550 167 598 -95 -588 -27 604 109 -574 -194 539
3427 539 289 -485 -334 437 441 -371 -498 291 524 -204 -581 132 583 -21 -602 -72 577 153 -544 -248 517
3448 517 323 -455 -405 387 479 -337 -505 226 558 -159 -562 72 595 43 -593 -105 559 239 -526 -290 490
3469 490 377 -396 -433 364 491 -268 -527 196 578 -91 -559 8 594 74 -553 -184 539 263 -489 -329
3489c29P50Kq07p9P53K23p29l37O88M15n77n47N37O04m16o86L05P49k24p38N3
3510c90Q07K9p66j64P32K98p16l81O28N09n77n79M78O31l35p33K67P34j21p69
3530d18lP84R8p29k60P30L20o25m63N77N56n05o11L72P21l12p16J59P56k1p90
3551c80l8P17K10p37k86O61M04n83n28N38N69m05o67L19P12k28p22Q5P61Op18
3572c10j60P16K66p01l28N80M99n73n31M40O19l38o92K73O84j08p54M2P15J05
3592D44p08k29P03K87n96m39N86M92m77n74L68O69l15o73J66P29q2p14l9O79J89
3613D66p06k34O05L85n74m75N14N23l78o32L31O31k12o68R9P20j4o76j45P03K01
3634D64o27l10N65M29n45m65M08N93l61o07K44O44j23o93N5O59Q7o82j74O33K75
$$ plain form
3489 -329 421 423 -384 -463 290 513 -216 -553 135 550 -27 -574 -37 567 151 -535 -230 519 295 -443 -390
3510 -390 417 446 -320 -484 248 546 -170 -551 77 586 9 -570 -92 539 204 -529 -262 472 351 -418
3530 -418 -421 363 461 -268 -528 202 522 -103 -566 11 567 62 -549 -177 544 232 -484 -325 431 410 -380
3551 -380 -418 299 509 -228 -514 147 551 -32 -560 -22 547 142 -525 -206 506 278 -444 -359 402 408 -310
3572 -310 -470 246 512 -189 -517 63 562 -11 -542 -102 517 179 -513 -240 444 336 -418 -376 339 444
3592 444 -264 -493 210 497 -99 -538 48 540 63 -511 -143 526 211 -462 -296 433 351 -363 -402 277 466
3613 466 -240 -474 131 516 -58 -533 -19 504 126 -506 -175 456 244 -424 -325 395 381 -295 -440 263 464
3634 464 -163 -473 92 521 -24 -489 -81 512 151 -456 -212 432 309 -384 -329 330 417 -265 -439 194 469
3655D69n73l99N57M25m36n24L73N81k96n96J58O58r4o46j8O40J47o44k20N86L49
3676D97n72m03M84M79l98n50L45N58k02o49J43O34k8o33r0O34J66n82k89N63L63
3697D70n10m29M15N13l55n28K30N98j52o17N9O16N2o33j19N78K32n43l14N04L74
3718D41l96m87L62N21k75n66J81O04j03n99j3O19P8n78j82N39K95n24l43M38M33
3739D45l86m90L17N06k00n71J40N61k9n87m5N75J26n33k32N14L02m50l85M05M38
3760D21l32m80K37N43j76n38P0N52J8n66q7N25J96n14k56M60L30m00m09L56M46
3781C96k84m82J84N25j14n40L3N40M9n23j40N02K21m74k82M26L58l78m02K99M64
3802C78k37m99J69N04o4n26MN08R7n24j58M78K47m40l13M01L60l18m44K77M56
$$ plain form
3655 469 -104 -503 54 479 43 -481 -108 473 177 -419 -261 397 303 -343 -361 279 426 -218 -438 148 497
3676 497 -75 -478 6 485 87 -463 -118 440 238 -411 -268 366 338 -295 -385 249 415 -167 -456 107 470
3697 470 -40 -469 -54 459 104 -424 -194 404 252 -365 -306 310 362 -271 -390 188 420 -123 -437 67 441
3718 441 45 -442 -80 441 166 -400 -219 385 282 -317 -330 289 367 -211 -393 146 441 -83 -426 12 445
3739 445 59 -431 -114 392 192 -379 -239 322 293 -294 -339 236 362 -171 -403 111 413 -37 -422 -17 421
3760 421 89 -391 -154 389 213 -325 -255 297 315 -251 -338 187 383 -131 -387 73 403 3 -406 -50 396
3781 396 112 -370 -186 339 225 -315 -282 258 307 -216 -356 146 367 -107 -389 37 395 17 -385 -86 378
3802 378 141 -358 -189 315 251 -275 -271 237 334 -190 -348 130 377 -63 -376 25 385 67 -377 -100 356
3823C56j87m92J07N07l1n13m6M98J37m82k05M44K74m00l39L52L94k81m37K05M70
3844C31j34m97N9N06K1m92j00M80J76m62k36M21L00l61l51K79M05k14m53J55M83
3865C16r9m79PM80P5m88j38M56K02m12k63L64L17k94m00K60M33k02m36J16M64
3886B79m4m65l5M77J05m61j67M24K26l64l08L32L36k55m02K12M20j39m37M4M74
3907B52Km65p0M38J50m16k21L85K78l47l17K86L63k21m01J50M39q7m40J0M52L8
3929B58m20j25M15J91l80k55L55K94k97l42K31L95j78m20J05M40l8m50j8M16R5
3950B72m17j60L93K26l52k87L12L35k61l91K14M02j31m14N0M50j5m32n9M14J45
3971B94m01j94L47K83l35k93K52L61k11l98J57L97o4m34K2M17O0m20j21M02J77
$$ plain form
3823 356 169 -323 -216 291 260 -253 -299 199 336 -146 -351 93 367 -33 -372 -20 374 93 -344 -139 331
3844 331 197 -300 -241 265 286 -206 -306 174 350 -112 -348 73 373 12 -339 -60 345 131 -322 -167 316
3865 316 217 -262 -255 225 300 -188 -326 130 332 -80 -343 21 338 44 -356 -96 337 135 -301 -185 279
3886 279 235 -230 -265 212 317 -144 -311 113 339 -25 -333 -1 335 80 -322 -110 310 171 -266 -222 252
3907 252 254 -211 -281 157 307 -109 -330 55 333 -14 -331 -45 318 97 -304 -154 285 198 -242 -232 220 258
3929 258 -162 -287 128 319 -61 -316 39 333 36 -306 -75 320 142 -278 -173 267 229 -221 -239 177 272
3950 272 -145 -305 88 314 -38 -325 -13 322 61 -330 -116 286 155 -259 -209 241 226 -206 -265 149 294
3971 294 -107 -301 46 329 -6 -299 -47 314 103 -295 -138 259 195 -239 -217 200 260 -160 -281 121 298
3992B98l65k55L40K91k78l51K27L80j60m01R5M17j8m25m6M14J09l93j73L64K24
4013B94l26k80K79L47k36l71J73L90r2m15L6M21K3m12r6L99J41l53k28L43K71
4034C08k88l11K16L68j94l65J06L90l5m19LL90R6m08j41L71K15l42k59K99K93
4055B93k21l55J81L61j15l87N9M06Kl89q9M02J31l64j91L22K46l06k65K40L25
4076B86j93l48J26L67n5m12J3L90O0l83j26L69J76l22k39L00K70k30l25J84L54
4097B62j42l51N5L90j1l85n4L70J33l71j51L10K36l01k72K61L03k03l48J47L42
4118B20n4l80J4L73M8l64j08L49J52l15k17K94K58k54k91J90L46j60l36P3L68
4139B06j1l86k1L39J28l65j46L17K10k80k58K62K68j82l34J45L29p1l55LL87J3
$$ plain form
3992 298 -67 -322 18 309 31 -320 -93 287 127 -274 -179 238 220 -205 -251 163 272 -121 -294 70 294
4013 294 -32 -312 -33 314 78 -293 -120 270 178 -237 -201 220 243 -169 -265 134 275 -78 -306 37 308
4034 308 20 -291 -75 293 99 -266 -160 230 195 -224 -221 169 265 -143 -284 87 302 -40 -299 0 293
4055 293 72 -283 -102 259 144 -243 -184 222 224 -165 -254 148 279 -85 -276 46 292 -14 -279 -39 286
4076 286 93 -255 -129 238 183 -229 -216 174 234 -149 -275 94 270 -52 -291 9 279 49 -276 -92 262
4097 262 120 -231 -176 214 203 -182 -236 134 267 -104 -255 55 291 -10 -282 -21 282 79 -269 -122 220
4118 220 166 -214 -200 173 221 -143 -251 98 250 -65 -282 12 270 16 -275 -85 261 101 -235 -162 206
4139 206 195 -191 -212 127 255 -110 -256 61 271 -9 -267 -5 263 81 -253 -108 221 150 -205 -202 185 198
4161A98l38j00L50J36l09k03K69K68k52k81J79L27j49l31R2L34kl68j8L28J01
4182B31l23j51L05J91k58k62K53K63j80l02J31L29q5l32J5L43L8l36r0L12J54
4203B46l21j67K56K29k28k59J81K84j21l20Q1L14ml39m4L36Q8l07j45K97J75k38
4225fk35K12K69j77k82J18L20q4l17K0L17N0l32p2K93J45k83j91K56K18k09k64
4247b34J70K79j21k95P0L13j8l18k9L19O0k81j50K90J78k55k15K08K71j74k83
4268b15J21L11q0l15K9L02N0l37o6K97J37k76j84K52K08j95k75J77K74j18l05
4289b08O5L37l9l03m2L13P6k83j43K71J83k41k19J95K64j61k83J17L03n3l30J4
4311a67L09O5l28q4K90J48k77j98K47K31k04k54J69K78j15l10O5L12j3l20l5L04
$$ plain form
4161 198 -140 -240 110 246 -63 -266 3 271 19 -262 -83 244 95 -236 -144 190 188 -180 -198 130 231
4182 231 -92 -243 62 253 -5 -267 -14 249 69 -233 -102 227 142 -190 -175 168 206 -130 -220 92 246
4203 246 -75 -242 14 243 15 -244 -63 221 100 -220 -139 175 171 -168 -212 124 212 -95 -240 57 232 -6
4225 -6 -241 -29 240 63 -219 -101 219 135 -182 -162 155 205 -127 -199 94 239 -44 -235 21 239 30 -234
4247 -234 -64 215 94 -201 -131 182 164 -154 -183 136 196 -85 -235 55 233 -22 -237 -29 242 68 -215
4268 -215 -94 217 137 -178 -149 153 203 -134 -200 97 234 -42 -226 26 234 39 -236 -59 215 97 -208
4289 -208 -143 194 155 -148 -190 123 199 -84 -227 44 227 -14 -233 -38 226 65 -218 -101 202 149 -181 -167
4311 -167 142 207 -121 -205 85 233 -44 -242 5 236 32 -222 -53 225 110 -200 -135 177 164 -156 -191 113
4333A13R4k84j51K68K00k36k39J96K63j60k96J23L13o2l17OL17M4l06r7L03J46
4355B38k84j89K52K27k04k62J55K95j14l07O5L27k3l32l0L06J06l12j30K56J97
4376B37k46k39K21K53j64k83J14L16p8l12J0L17N7l24r9L13J35k71k06K54K42
4397B47k13k65J75K94j14l24O3L22jl45l8L33R8l16j47K80J99k45k52K21K71j58
4419H5l18J30L23q2l39J9L42M2l33r9L21J61l01k08K63K56k23k88J78L21j42l19
4441b11P5L45k5l48l6L53R2l38j47L08K04k83k46K42K75j93l09J36L30p7l62M5
4463a70L56L3l70r5L60J36l13k20L05K48k52k95K13L17j43l57R5L65j6l82k7L67
4485A55Q9l47j56L35J97k93k52K54L01k18l23J62L50r9l73L8L89J0l82p3L64J35
$$ plain form
4333 113 207 -77 -228 40 240 4 -235 -39 224 64 -232 -109 204 142 -175 -169 148 192 -114 -211 92 238
4355 238 -46 -235 17 244 40 -222 -67 228 114 -193 -128 199 176 -156 -186 120 226 -86 -216 40 237
4376 237 -9 -248 -27 226 62 -221 -107 209 131 -181 -171 146 203 -121 -220 93 228 -43 -249 5 247
4397 247 34 -231 -56 238 124 -200 -137 185 184 -161 -199 134 232 -84 -231 49 248 3 -249 -28 243 85
4419 85 -233 -103 220 138 -201 -182 160 202 -131 -230 91 252 -49 -257 6 262 39 -249 -71 250 108 -211
4441 -211 -136 209 184 -164 -200 153 245 -93 -240 68 272 -11 -257 -15 260 67 -242 -106 224 147 -215 -170
4463 -170 186 219 -151 -246 114 250 -63 -283 22 270 18 -277 -64 253 110 -247 -152 213 197 -185 -212 155
4485 155 244 -103 -259 76 273 -20 -272 -18 283 65 -258 -96 254 155 -218 -180 209 219 -163 -236 128 263
4507B63l51j96L09K63k73l01K29L33j76l51J02L77m5l94j2L98P9l91j40L75J94
4528B92l36k52L01K95k41l46J95L72j39l78N6M06ql99o7M04J21l81j85L32K49
4549B91k96l06K55L46k07l71J39L99q2m13K1M08O4m07j24L92J77l49k44L27K94
4570C14k77l35K23L68j58l91P6M28k9m35j8M11J05m00j82L72K41l33l05K95L37
4591C07k39l79J90L99j03m37M5M39K3m32r6M24J61l96k23L54K93l08l40K48L82
4612C12j85m15J28M38o8m49nM39Q2m26j51M01K24l84k68L15L38k68l86K17M12
4633C01j51m39P5M60rm48p3M47J46m26k18L89K79l47l30K99L79k43m13J69M45
4654B92r3m54K3M66M9m58j19M38J93m28k46L71L10l14l66K60M09k04m41J21M71
$$ plain form
4507 263 -88 -284 25 288 15 -286 -57 276 100 -251 -149 228 183 -211 -223 175 254 -137 -277 98 292
4528 292 -44 -296 5 300 59 -287 -92 280 141 -237 -181 225 217 -182 -249 155 276 -105 -290 42 291
4549 291 -5 -311 -56 290 83 -288 -149 250 168 -245 -224 184 248 -159 -283 109 286 -63 -307 20 314
4570 314 37 -298 -75 293 135 -256 -180 248 219 -216 -234 177 282 -118 -300 72 313 -20 -325 -30 307
4591 307 68 -311 -121 278 175 -262 -217 222 245 -187 -283 141 302 -94 -317 37 330 22 -318 -70 312
4612 312 127 -288 -160 278 210 -239 -244 195 277 -149 -300 101 325 -59 -327 -12 326 58 -328 -111 301
4633 301 150 -289 -214 246 237 -211 -284 163 309 -117 -335 54 333 -14 -344 -45 334 91 -322 -153 292
4654 292 199 -255 -232 234 283 -175 -294 144 337 -91 -337 34 344 30 -336 -76 333 129 -312 -191 280
4675B80n0m80k9M67J15m62j76M19K52l88l12L49L69k81m15K25M26j33m68Q3M70
4696B61J6m86q9M66J66m37k41M13K88l48l66L15L97k44m51J75M72r3m84K1M79
4717B30P0m84j40M66J95m18k91L98L42l37l87K69M34j98m71J30M80m0m98m9N10
4738B11J13m70k02M49K77m09l39L66L82k92m41K25M74j54m83N6N05J3n00r2M90
4759A79J72m68k50M36K96l65l88L17M44k53m73J79M97q3n17J3N16N4n00j44M69
4780A31K42m50k99L90L75l52m08K69M67j90n15J30N27n0n32m7N34J18m97k11M60
4801I2K93m30l56L81L97k90m61K26M94j57n19P8N32J4n27j03N09J93m72k69M42
4822F7L29l90l99L32M48k52n02J95N17r3n41J0N37O6n21j64N14K30m75l09M27
$$ plain form
4675 280 230 -250 -279 188 303 -159 -335 84 336 -52 -364 -15 354 73 -342 -117 309 176 -292 -209 261
4696 261 277 -209 -298 168 334 -103 -344 69 357 9 -357 -42 355 111 -340 -165 307 214 -270 -249 230
4717 230 300 -184 -324 142 337 -81 -372 26 368 31 -356 -87 347 149 -322 -192 288 248 -250 -299 211
4738 211 324 -146 -348 101 378 -31 -370 -4 378 86 -355 -130 344 190 -293 -237 268 281 -219 -311 179
4759 179 351 -117 -367 69 365 0 -388 -71 373 120 -353 -174 323 240 -277 -264 252 306 -194 -338 131
4780 131 373 -77 -376 14 389 37 -371 -102 365 175 -340 -210 317 267 -265 -312 222 340 -157 -368 92
4801 92 385 -45 -401 -20 377 87 -374 -148 346 189 -330 -252 280 294 -233 -336 173 366 -106 -375 67
4822 67 396 6 -393 -61 387 135 -367 -172 345 252 -289 -279 258 324 -197 -361 153 383 -92 -401 26
4843B6L70l53m32K95M83k25n25J35N37m2n51l2N35J29n16k07M77K93m38l64L83
4864b2M30l21m78K55N02j57n47R2N48J0n45j19N49J89n16k69M58L56m19m02L32
4885g4M80k76n11J97N19r8n51K2N45Q4n53j66N25K46m86l16M37L93l68m65L00
4906a16N14k17n46J34N64m4n60n3N55J44n39k18N12L03m78l71L96M34l32m87K61
4927a44N13j61n52P8N59J9n64j07N48J83n02k87M83L45m15m11L55M67k73n26K01
4948a91N54j15n67J7N73O3n38j75N40K41m82l29M38L95l80m53L10N00k31n35J28
4969b37N72n8n59n1N72J28n49k12N02L01m67l65L86M50l31m91K50N47j76n56P6
4990b68N66K1n70j11N54J97n27k68M89L46m32m25L56M90k80n17J79N62j08n78
$$ plain form
4843 26 396 43 -389 -94 389 164 -361 -226 311 269 -282 -314 221 350 -166 -373 104 397 -41 -405 -22
4864 -22 408 87 -391 -136 366 209 -338 -246 302 312 -233 -352 197 386 -130 -399 59 415 -4 -406 -74
4885 -74 406 130 -381 -184 335 237 -314 -292 253 337 -216 -382 143 389 -97 -413 24 417 49 -416 -116
4906 -116 398 181 -365 -231 333 289 -271 -324 231 375 -164 -382 130 433 -45 -416 -20 414 82 -405 -144
4927 -144 369 208 -344 -266 293 312 -252 -359 189 372 -130 -417 66 411 -4 -415 -60 407 134 -392 -191
4948 -191 363 248 -319 -302 271 334 -204 -379 161 402 -80 -409 29 424 44 -409 -99 401 170 -365 -237
4969 -237 335 277 -282 -333 239 367 -182 -394 108 409 -58 -423 -37 413 82 -409 -159 388 212 -344 -268
4990 -268 298 319 -251 -362 192 389 -138 -406 83 429 -3 -428 -72 418 138 -379 -200 362 254 -324
5010c24J8N72P4n64j65N21K72m96l29M41M04l72m66L02N03k20n53J41N73k9n95
5031b92m1N67J46n54k26N25K89m55l85L99M49l27m95K50N47j69n70P5N82J6n79
5052b48j17N58K04n35k71M86L47m29m23L58M79k75n42K22N41j04n74jO03P0n60
$$ plain form
5010 -324 -306 266 340 -224 -389 132 404 -92 -421 20 424 52 -414 -112 391 171 -382 -241 332 303 -292
5031 -292 -333 234 380 -174 -400 125 414 -41 -426 -27 422 95 -400 -150 397 228 -342 -267 315 331 -248
5052 -248 -365 193 397 -138 -409 77 424 -5 -428 -70 409 134 -408 -186 355 251 -323 -324 279 349 -211
$$ [...]
8191C1
##END NTUPLES=NMR FID
##END=
