##TITLE=1H_Pr Gluam
 CD3OD, 8 sc, 
 29.9.2020
##JCAMPDX= 6.0         $$ Bruker NMR JCAMP-DX V2.0
##DATA TYPE= NMR FID
##DATA CLASS= NTUPLES
##ORIGIN= UXNMR, Bruker Analytische Messtechnik GmbH
##OWNER= root
$$ XWIN-NMR		Version 3.5
$$ Tue Sep 29 12:43:44 2020 Russian Standard Time (UT+4h)  she@DPX200
##.OBSERVE FREQUENCY= 200.1315066352
##.OBSERVE NUCLEUS= ^1H
##.DELAY= (6, 6)
##.ACQUISITION MODE= SIMULTANEOUS
##.ACQUISITION SCHEME= undefined
##.AVERAGES= 8
##.DIGITISER RES= 18
##SPECTROMETER/DATA SYSTEM= spect
##.PULSE SEQUENCE= zg30
##.SOLVENT NAME= MeOD
##.SHIFT REFERENCE= (INTERNAL, MeOD, 0, 15.7039)
##AUDIT TRAIL= $$ (NUMBER, WHEN, WHO, WHERE, WHAT)
$$ ##TITLE= Audit trail, XWIN-NMR		Version 3.5
$$ ##JCAMPDX= 5.01
$$ ##ORIGIN= Bruker BioSpin GmbH
$$ ##OWNER= she
$$ F:/spectra/data/she/nmr/H-F/1/audita.txt
$$ ##AUDIT TRAIL=  $$ (NUMBER, WHEN, WHO, WHERE, WHAT)
(   1,<2020-09-29 12:42:45.09 +0400>,<she>,<DPX200>,
      <created by zg, POWCHK disabled, PULCHK disabled
       configuration hash MD5:
       00 E9 B6 7A A2 85 ED C7 34 08 36 98 17 FE 4E 26
       data hash MD5: 16K
       DF B2 BD 0E AB 66 3E B3 D8 C4 9C FF 92 ED 8B 89>)
$$ ##END=
$$ 
$$ hash MD5
$$ 71 F1 A3 B7 05 57 FA 35 51 37 C8 1F 78 F0 CD 6F
##$RELAX= 
##$RELAX= 
##$RELAX= 
##$RELAX= 
##$RELAX= 
##$RELAX= 
$$ Bruker specific parameters
$$ --------------------------
##$DU= <F:/spectra>
##$EXPNO= 1
##$NAME= <H-F>
##$PROCNO= 1
##$TYPE= <nmr>
##$USER= <she>
##$AMP= (0..31)
100 100 100 100 100 100 100 100 100 100 100 100 100 100 100 100 100 100 
100 100 100 100 100 100 100 100 100 100 100 100 100 100 
##$AQSEQ= 0
##$AQ_mod= 1
##$AUNM= <au_zg>
##$AUTOPOS= <>
##$BF1= 200.13
##$BF2= 200.13
##$BF3= 200.13
##$BF4= 200.13
##$BF5= 200.13
##$BF6= 200.13
##$BF7= 200.13
##$BF8= 200.13
##$BYTORDA= 1
##$CFDGTYP= 0
##$CFRGTYP= 5
##$CHEMSTR= <none>
##$CNST= (0..31)
1 1 145 1 1 1 1 1 1 1 1 1 1 1 1 1 1 1 1 1 1 1 1 1 1 1 1 1 1 1 1 1 
##$CPDPRG= <>
##$CPDPRG1= <>
##$CPDPRG2= <>
##$CPDPRG3= <>
##$CPDPRG4= <mlev>
##$CPDPRG5= <mlev>
##$CPDPRG6= <mlev>
##$CPDPRG7= <mlev>
##$CPDPRG8= <mlev>
##$CPDPRGB= <>
##$CPDPRGT= <>
##$D= (0..31)
0 1.2 0 0 0 0 0 0 0 0.06 0 0.03 0 0 0 0 0.0002 0 0 0 0 0 0 0 0 0 0 0 0 
0 0 0 
##$DATE= 1601368964
##$DBL= (0..7)
120 120 120 120 120 120 120 120 
##$DBP= (0..7)
150 150 150 150 150 150 150 150 
##$DBP07= 0
##$DBPNAM0= <>
##$DBPNAM1= <>
##$DBPNAM2= <>
##$DBPNAM3= <>
##$DBPNAM4= <>
##$DBPNAM5= <>
##$DBPNAM6= <>
##$DBPNAM7= <>
##$DBPOAL= (0..7)
0.5 0.5 0.5 0.5 0.5 0.5 0.5 0.5 
##$DBPOFFS= (0..7)
0 0 0 0 0 0 0 0 
##$DE= 6
##$DECBNUC= <off>
##$DECIM= 32
##$DECNUC= <off>
##$DECSTAT= 4
##$DIGMOD= 1
##$DIGTYP= 9
##$DL= (0..7)
0 120 120 120 120 120 120 120 
##$DP= (0..7)
150 150 150 150 150 150 150 150 
##$DP07= 0
##$DPNAME0= <>
##$DPNAME1= <>
##$DPNAME2= <>
##$DPNAME3= <>
##$DPNAME4= <>
##$DPNAME5= <>
##$DPNAME6= <>
##$DPNAME7= <>
##$DPOAL= (0..7)
0.5 0.5 0.5 0.5 0.5 0.5 0.5 0.5 
##$DPOFFS= (0..7)
0 0 0 0 0 0 0 0 
##$DQDMODE= 0
##$DR= 18
##$DS= 0
##$DSLIST= <SSSSSSSSSSSSSSS>
$$ [...]
##$SUBNAM2= <"">
##$SUBNAM3= <"">
##$SUBNAM4= <"">
##$SUBNAM5= <"">
##$SUBNAM6= <"">
##$SUBNAM7= <"">
##$SUBNAM8= <"">
##$SUBNAM9= <"">
##$SW= 16.880792210976
##$SWIBOX= (0..15)
0 0 2 0 0 0 0 0 0 0 0 0 0 0 0 0 
##$SW_h= 3378.37837837838
##$TD= 16384
##$TD0= 1
##$TE= 0
##$TE2= 300
##$TE3= 300
##$TEG= 300
##$TL= (0..7)
0 120 120 120 120 120 120 120 
##$TP= (0..7)
150 150 150 150 150 150 150 150 
##$TP07= 0
##$TPNAME0= <>
##$TPNAME1= <>
##$TPNAME2= <>
##$TPNAME3= <>
##$TPNAME4= <>
##$TPNAME5= <>
##$TPNAME6= <>
##$TPNAME7= <>
##$TPOAL= (0..7)
0.5 0.5 0.5 0.5 0.5 0.5 0.5 0.5 
##$TPOFFS= (0..7)
0 0 0 0 0 0 0 0 
##$TUNHIN= 0
##$TUNHOUT= 0
##$TUNXOUT= 0
##$USERA1= <user>
##$USERA2= <user>
##$USERA3= <user>
##$USERA4= <user>
##$USERA5= <user>
##$V9= 5
##$VALIST= <valist>
##$VCLIST= <CCCCCCCCCCCCCCC>
##$VD= 0
##$VDLIST= <DDDDDDDDDDDDDDD>
##$VPLIST= <PPPPPPPPPPPPPPP>
##$VTLIST= <TTTTTTTTTTTTTTT>
##$WBST= 1024
##$WBSW= 4
##$XGAIN= (0..3)
0 0 0 0 
##$XL= 0
##$YL= 0
##$YMAX_a= 157185
##$YMIN_a= -134267
##$ZGOPTNS= <>
##$ZL1= 120
##$ZL2= 120
##$ZL3= 120
##$ZL4= 120
##$ABSF1= 10
##$ABSF2= 0
##$ABSG= 5
##$ABSL= 3
##$ALPHA= 0
##$AQORDER= 0
##$ASSFAC= 0
##$ASSFACI= 0
##$ASSFACX= 0
##$ASSWID= 0
##$AUNMP= <proc_1d>
##$AZFE= 0.1
##$AZFW= 0.1
##$BCFW= 1
##$BC_mod= 2
##$BYTORDP= 1
##$COROFFS= 0
##$CY= 11.3945322036743
##$DATMOD= 1
##$DC= 2
##$DFILT= <>
##$DTYPP= 0
##$F1P= 16.9975609425685
##$F2P= -3.02152046262296
##$FCOR= 0.5
##$FTSIZE= 0
##$FT_mod= 4
##$GAMMA= 1
##$GB= 0.15
##$INTBC= 1
##$INTSCL= 1
##$ISEN= 128
##$LB= 0.24
##$LEV0= 0
##$LPBIN= 0
##$MAXI= 10000
##$MC2= 0
##$MEAN= 0
##$ME_mod= 0
##$MI= 1.114404
##$NCOEF= 0
##$NC_proc= 0
##$NLEV= 6
##$NOISF1= 3.799351
##$NOISF2= 2.8
##$NSP= 1
##$NTH_PI= 0
##$NZP= 0
##$OFFSET= 15.70392
##$PC= 1
##$PHC0= -9974.342
##$PHC1= 15.80089
##$PH_mod= 1
##$PKNL= yes
##$PPARMOD= 0
##$PSCAL= 0
##$PSIGN= 0
##$REVERSE= no
##$SF= 200.130013532006
##$SI= 16384
##$SIGF1= 3
##$SIGF2= 2
##$SINO= 400
##$SIOLD= 16384
##$SREGLST= <1H.CDCl3>
##$SSB= 0
##$STSI= 0
##$STSR= 0
##$SW_p= 3612.71676300578
##$SYMM= 0
##$S_DEV= 0
##$TDeff= 0
##$TDoff= 0
##$TI= <>
##$TILT= no
##$TM1= 0
##$TM2= 0
##$TOPLEV= 0
##$USERP1= <user>
##$USERP2= <user>
##$USERP3= <user>
##$USERP4= <user>
##$USERP5= <user>
##$WDW= 1
##$XDIM= 8192
##$YMAX_p= 0
##$YMIN_p= 0
$$ End of Bruker specific parameters
$$ ---------------------------------
##NTUPLES= NMR FID
##VAR_NAME=  TIME,          FID/REAL,        FID/IMAG
##SYMBOL=    X,             R,               I
##VAR_TYPE=  INDEPENDENT,   DEPENDENT,       DEPENDENT
##VAR_FORM=  AFFN,          ASDF,            ASDF
##VAR_DIM=   8192,          8192,            8192
##UNITS=     SECONDS,       ARBITRARY UNITS, ARBITRARY UNITS
##FACTOR=    0.000296,      1,               1
##FIRST=     0,             0,               0
##LAST=      2.424536,      0,               0
##MIN=       0,             -134267,         0
##MAX=       2.424536,      157185,          0
$$ Real data points
##PAGE= N=1
##DATA TABLE= (X++(R..R)), XYDATA
0@%%%%%%%%%%%%%%%qJ6j6J6j6K4l2L2m0M8n6O9p8Q9j04J20j37J58j81K05k30K58
37A37k91L27l65M07m54N04n61O25o90P60q38R25j021J126j243J369j507J660j833
56i63K029k247K496k787L127l532M025m632N408o444P892j0080J3831l3157J82219
71A57185p3992j50928J26169p3219j19482J10999J19057k6814m5141p3380j2885
82f2431L8990J8700M9370N7537j02842q8316N1859K5317K6707O2454l3099p2379
94b8133k5609o558O7353O8791n3216q058p905j04858M5200J39907n2700l7691
106c477M6948r2114m2544J08479L5205k6251O250n3436m5570M5744K5179L5206
118C9619K5019q3194l4194N1615m0320K9863J22909q8279j06111Q4781K427o6373
$$ plain form
0 0 0 0 0 0 0 0 0 0 0 0 0 0 0 0 0 -8 8 -8 8 -8 16 -16 16 -24 24 -32 37 -41 48 -56 64 -73 85 -96 109 -121 137
37 137 -154 173 -192 215 -239 265 -296 329 -361 399 -439 486 -535 591 -652 717 -790 870 -963
56 -963 1066 -1181 1315 -1472 1655 -1877 2148 -2484 2924 -3520 4372 -5708 8123 -25034 157185
71 157185 83193 -67735 58434 -14785 -134267 -23268 95789 68975 23834 -49546 -62431
82 -62431 -23441 -4741 44629 102166 -676 -88992 -37133 -11816 14891 77345 44246 -28133
94 -28133 -53742 -60300 7053 75844 22628 14570 6665 -98193 -52993 86914 34214 -3477
106 -3477 43471 -48643 -91187 17292 52497 26246 32496 -20940 -66510 -20766 4413 39619
118 39619 64638 -18556 -52750 -1135 -41455 -11592 111317 23038 -83073 1708 4135 -62238
130f2238R7824N6829j01124m7032K6725K7841J3802K605K1327r332q4022n269
142f2064R1561O372k9094J6079k3653m5369J8503L3625L1094J0195o8575j4895
154c6221M3063l6061J3499R5794n5420q7175O2673K596m6683P1752L8512p9696
166a3367k3235K7473m600J6573K1774J686k0245m1297j143N1861M544j4994K1953
179B6983l2408m0515L7919K3081j0806K6052j6206n3628K0084K3922k725K0948
191B2701j930l2637n333k596Q480M4376p870l9238O745K401k1051K7449L2209
204C3706j8942k0368j5676M186K4860o11j862K1725k9364m1626M1243K3731k4003
217c001J6614O938m5290l0L3414l012M014P146j8834j7699M245J6875J7702p092
$$ plain form
130 -62238 35586 92415 -8709 -55741 -29016 -1175 12627 15232 36559 27227 -56795 -62064
142 -62064 29497 35869 6775 22854 -799 -46168 -27665 5960 37054 47249 -21326 -36221
154 -36221 6842 -29219 -15720 80074 24654 -62521 152 2748 -43935 27817 66329 -13367
166 -13367 -36602 -9129 -13729 2844 24618 26304 6059 -35238 -36381 15480 20024 5030 26983
179 26983 -5425 -45940 -8021 15060 4254 30306 14100 -39528 -19444 4478 1753 22701
191 22701 20771 -11866 -17199 -19795 -11315 33061 25191 -14047 -7302 -4901 -25952 1497 33706
204 33706 14764 -5604 -21280 -17094 7766 7155 5293 27018 -2346 -43972 -2729 21002 -3001
217 -3001 13613 20551 -24739 -24769 8645 5633 9647 16793 -2041 -19740 -15495 1380 19082 11990
231A1990j7194O740j2813j1832L2570J7681k6407o274K243j4672J4857J6116m587
244H418J063j0347k2329J3904K2063q209L834j59k0978k362J5445K682P755L594
258A4374k2512o172R125N122P684L326q498n640p889m167K6228O862k1220J323
272b054M492j7490O174K4522o361q526k381q934J528J4628K486l265o58j1232
286g071k784O311P316Q146m872j5550J183P798o781J0319J0833j3275j0947K974
300f400K418O485P133p873j454k601q730O506J5255k626r381M48n878O45Q827
315B774K810o27j794q876l995R800M084K898l561p319n3J260j669Q141Q936j3805
331i96p619O279J735m06O262J594p908l756j849O334O296j594l681k044l514k86
$$ plain form
231 11990 -5204 1536 -11277 -23109 9461 27142 735 -5539 -3296 -17968 -3111 13005 8418
244 8418 9481 -866 -23195 -9291 12772 4563 8397 8238 -12740 -15102 343 3025 10780 14374
258 14374 -8138 -14310 -5185 -63 7621 10947 2449 -3191 -11080 -15247 10981 17843 -3377 -2054
272 -2054 2438 -15052 -8878 15644 9283 757 -1624 -10558 -9030 5598 8084 4819 4161 -7071
286 -7071 -9855 -3544 3772 11918 7046 -8504 -7321 477 -6304 4015 14848 1573 -9374 -6400
300 -6400 -3982 2503 9636 1763 309 -2292 -11022 -4516 10739 8113 -1268 -820 -6698 -6053 2774
315 2774 5584 4957 3163 -5713 -9708 92 4176 7074 3513 -3806 -3859 -2599 -4268 3873 12809 -996
331 -996 -8615 -2336 -601 -1007 5255 6849 -1059 -4815 -6664 -330 5966 4372 691 -1353 -4867 -5153
347e153P673J118J015k911p394n14O743K439r48K285n534l590J009L516L926K088
363E768m880o903L459K180M43K353K464l693o460l43O091N927n434j551J848l528
379b259l355M949P821k822p022k401N672m32k700N608L935q760p213Q956L926
394C903m263R33L576n117n256M621M562J162m149k68J32l509J540O067N99o031
410a498P7N00j228O14N550N07p037L33J157P8J250K918j575k098j905j013L741
427C71K956n48n416K328J375n567L059Q337m190p248L333J191J48m86O55L312
443C610k558o973J629J1167l342r289O472O628j3561k499J8404l794j3602N941
457a767P586q760k992R908K096q750k120O507j034k264J541K915J87q331P30J0090
$$ plain form
347 -5153 2520 3638 4653 1742 -5652 -6166 577 3016 2068 4353 -1181 -4771 -3762 -246 3680 5768
363 5768 888 -6015 -2556 -376 67 2420 4884 1191 -5269 -5612 479 6406 972 -579 1269 -2259
379 -2259 -5614 -665 7156 4334 -2688 -5089 583 151 -2549 3059 6994 -1766 -8979 -23 3903
394 3903 -360 573 4149 -968 -6224 -1603 2959 4121 -28 -296 -164 -3673 -2133 3934 4533 -1498
410 -1498 -1421 -921 -2149 -1535 4015 4522 -2515 -2182 -1025 -947 303 3221 1646 -452 -2357 -3370 371
427 371 3327 2779 -2637 -309 1066 -4501 -1442 6895 2705 -4543 -1210 -19 129 -357 298 3610
443 3610 1052 -5921 -4292 6875 3533 -5756 716 7344 -6217 -8716 9688 5894 -7708 -1767
457 -1767 5819 -2941 -5933 3975 6071 -2679 -4799 1708 674 -1590 -49 2866 3053 -5278 -4548 5542
473E542k990q792R209L413j3312J036J3076k859j1679Q834M224j1001J225R193
487E119k603m019J073k079L971p95l528N770J568q151j003Q177j778m051L036
502G07K222n379K80L321j839L424j272o107M045N356p514j175J0230l315j0055
517g071M218J0563r025m441J1169k407r063M377N255l350K71j743N77L683n868
532b855o92Q997r00j2434O821R262j2283k910J5655l988j5017J0960O104j0334
546c614K22Q022k220o753K205M306m08l644J790J449j073k655M70N964k301n818
562d058L448M705o403j170P796j713o428K783M468n163O5M634k876j396J927j584
578i65M28L557m027j5L083l341l10K887k34j770J379j618J20J871r16j115K364
$$ plain form
473 5542 2552 -6240 2969 6382 -6930 -5894 7182 4323 -7356 1478 5702 -5299 -4074 5119
487 5119 2516 -1503 -430 -2509 1462 667 -2861 2909 4477 -3674 -4677 3500 1722 -2329 707
502 707 2929 -2450 -2170 1151 -688 2736 1464 -4643 -598 4758 -2756 -3931 6299 2984 -7071
517 -7071 -2853 7710 -1315 -5756 5413 3006 -6057 -1680 3575 225 496 -1247 -670 3013 -2855
532 -2855 -3547 5450 4550 -7884 -1063 8199 -4084 -6994 8661 4673 -10344 616 6720 -3614
546 -3614 -3392 4630 2410 -4343 -2138 2168 1760 -1884 -94 1355 282 -2373 -1903 4061 1760 -4058
562 -4058 -610 4095 -2308 -3478 4318 2605 -3823 -1040 3428 -1735 -1670 2964 88 -1308 619 -965
578 -965 -537 3020 -1007 -1022 2061 -1280 -1590 1297 1063 -707 672 -946 -826 1045 129 -986 1378
595A378l6m924L662L238m633r04M827j949m287L530K572k423k829M135Q11m755
611b587J991L108k225j707J301%O84n78j357L327o31l806J230M638l682k987N755
628B474m07n341K095M807m464q25K815l27j757RK114o61j285M5J795k017M22J488
646I80q71j02l95L52o08J069m03L6K46j100L21P44M44j350J142j62j314P51Q21
665F01k84p16P24n04L48p13Q08O09j738N63Q75q20o69K073q38j458J461J11q75
684d42J8J782j501l83O97j34l33J55P02p54L41p57O05J55j20L15q26N19j09jj21
705a92J202j280l46J165q07j24O11P15j529J85J155r81j06O31M65j394M32J19
723g9L8m7N17pr01M36K77k49j68P64m49q65P70J41k35l49J094j133M30L2m61O96
$$ plain form
595 1378 1342 -3582 80 3318 -1315 -2219 2608 659 -3628 -98 2474 51 -2778 1357 2168 -2587
611 -2587 -596 2512 287 -1420 -119 -119 565 -13 -1370 1957 1326 -2480 -1250 3388 -294 -3281 2474
628 2474 2067 -3274 -1179 3628 -836 -1661 1154 827 -930 -921 1193 532 -753 -708 1087 -930 -508 980
646 980 109 7 -388 -36 -644 425 22 58 304 -796 -475 269 713 -637 505 343 -971 -220 601
665 601 317 -399 325 -179 169 -544 264 873 -865 -302 573 -247 -916 1157 319 -1139 322 433 -442
684 -442 -424 1358 -143 -526 171 37 -296 -141 561 -193 148 -609 -4 151 31 346 -480 39 -70 -71 -192
705 -192 1010 -270 -616 549 -258 -382 229 944 -585 -400 755 -226 -332 299 764 -630 -198 -79
723 -79 -41 -88 429 422 -479 -43 234 -15 -183 581 132 -733 37 178 -57 -406 688 -445 -15 17 -444 252
745B52k16j24l07Q70p96n7R34m53m40N6R67r45Q4N28k3q56M28N85p18K72J82J90
767D13j410Q79Q12j062L65K90J74j165J045j57j25j47k8M76o90Q4K56J33m24K25
787e6K29l28J60m6N30q33L71q2J28P1m98P70j04n56M6R89p17n47Q70m21k94j05
809d23P06j15m18L64p6L11p88N46M1j5m22M91o48M67L66p24M65n6k78n2R93j048
831c13o0Q74l95l18k58J101o42l60J7Q44k76j013J019K39p33n91J504j72j103
850f36N89L10K52j016J84Q52J94j864J154J239k261k4J800J42k334J287J146j367
868c53k33N54O36p35k02l4J233j060r63J721k33q43K38Q59n68k96N8N67k12j174
888a040J606l96n59L34O87o89J27M70j006P56N36j410l97K357j430j476K350l78
$$ plain form
745 252 36 -88 -395 475 -321 -378 556 103 -337 -281 686 -259 -175 353 330 -526 -98 487 -231 41 223 413
767 413 -997 -118 694 -368 -3 287 461 -704 341 184 59 -88 -116 360 -330 -246 10 143 -281 -56
787 -56 173 -155 5 -41 489 -344 27 -55 73 144 -354 416 312 -244 -198 791 74 -473 397 -24 -318 -423
809 -423 283 168 -250 114 38 349 -439 107 148 133 -289 202 -446 21 387 -337 128 72 -206 -258 735 -313
831 -313 -373 501 106 -212 -470 631 -11 -371 -354 490 214 -799 220 459 -274 -865 639 467 -636
850 -636 -47 263 515 -501 -317 535 729 -1135 19 1258 -1003 -1027 773 915 -1419 -132 1014 -353
868 -353 -586 -32 604 -131 -333 -367 866 -194 -1157 564 331 -512 -274 585 17 -279 -221 346 134 -1040
888 -1040 566 170 -389 -55 632 -57 70 540 -466 290 826 -584 -981 1376 -54 -1530 820 442
906D42j528J272O08j333Q27j37n12J074j074j65J173Q9k280J806R57k280J2K065
924A016l56k515J654J632j740r38J530P73j864j74K044k10j999J256P70j113J95
941c9q01J466K99k282M31K957k321j339L308p88k648K007J408k494M59J538j775
958f14N04Q62j360L19J133j719K53J586j772N64R69p18l46P14o30J04K55j91K98
977B11m81N96j45o82N99J04r96N62J285j450m26J819p08j834J972Q79k765J650
995A90J025j773L62J022j469R64J75j881K078K39k086Q80J913k542r4K359j340
1012B2q50J079O01j422M52L19j55J08q10J081K58j434M93R70j034J9J020j131
1030d14M20nl55O06p8q45J099p4j466J557M27j477L80J185j402l0J356j386K71
$$ plain form
906 442 -1086 186 794 -539 288 151 -361 713 -361 -526 647 736 -1544 262 1219 -1061 -1049 1016
924 1016 660 -1855 -201 1431 -309 -1247 283 1056 -808 -982 1062 852 -1147 109 879 -234 -39
941 -39 -840 626 925 -1357 -926 2031 -290 -1629 1679 891 -1757 250 1658 -836 -377 1161 -614
958 -614 -110 752 -608 -289 844 -875 -622 964 -808 -244 725 7 -339 375 -255 -151 104 -87 211
977 211 -270 326 181 -501 98 202 -794 -232 1053 -397 -823 996 288 -1546 426 1305 -1460 190
995 190 1215 -558 -196 826 -643 321 496 -1385 693 932 -1154 -274 1639 -903 -997 1362 22
1012 22 -828 251 852 -570 -118 201 46 154 -656 425 683 -751 -258 712 -322 -303 717 -414
1030 -414 6 1 -354 252 174 -671 428 354 -1112 445 872 -605 -225 960 -442 -472 884 -502 -231
1049b31R36q92l84J562j506q0J697j451J71Q62j037K95J029j544o1J598j247j95
1067d78P56r0l96K30p1K24J19j008O79L84q16L20Q52p85k86J244j515L01J022
1086F86j020K7J372j483k69J647j518K61O98p69n6J074q86k90J439q46l37P16
1104D46l0r81J038l95j91Q56j181J48Q78q07k41J114n32o28J169o89j58L80j53
1123D3k85M38P0p19R40r43K47Q36p82l68J123n31q51J381m51m93O35l15n73R60
1143C62k33n85J144p35n09J114l36p09O27K34r71R06m93j20P12n09j78O94l70
1162D5n88R72n93k57R62m79k96M17l1p63J136l38q72J204l98n15P70r3r11P46
1182A18J18o68O11J48p70P05n4p11P04k14n87J259k58o72N53K11j027M35J90r3
$$ plain form
1049 -231 705 -187 -571 991 -515 -595 1102 -349 -178 684 -353 -58 971 -573 -634 964 -283 -478
1067 -478 278 188 -208 22 -49 175 294 -714 -35 349 -467 -147 705 -80 -366 878 -637 -336 686
1086 686 -334 -307 1065 -418 -687 960 -558 -297 401 -368 -424 650 -236 -526 913 67 -270 446
1104 446 416 -565 473 78 -113 743 -438 -290 588 -219 -460 654 122 -506 663 -26 -184 196 43
1123 43 -242 196 266 -453 487 -456 -209 627 -155 -523 600 69 -782 599 148 -345 290 -25 -598 362
1143 362 129 -456 688 -47 -556 558 222 -487 140 374 -597 309 -184 -304 408 -101 -279 415 45
1162 45 -543 429 -164 -421 541 62 -234 183 152 -611 525 187 -685 519 121 -394 376 283 -628 118
1182 118 236 -432 179 327 -443 262 208 -503 201 -13 -600 659 401 -271 282 493 -534 -99 91 -2
1202bJ55j00k51M23l29m85P54L6m10pL71k85P6L59o02N77j6o29N28J97o89J91
1224a38N19o32L98Jl44M92J02q62L91M58o84L77Q2k89J60J6n6J74J22p68P19j87
1246E1l81L68J86p60N37K87q78O26M90o70K57J19m19K54q7k9J97k06j49J73K84
1267B50k49q1M53m99K9R9L6L1J60k48j03j7M7M70m47j3M29l21k98M68O4k41J87
1290B06k81J11n6J77k12k4O29p48L81N0k18j01K47M8l86L37k48K81k82o4K09k28
1312a72J68j52M82j39k93J71j4k25Q6JR4J65m32M55k54j12q1N07m75Q0M74m52
1334a18J26J23j32j44K88j82k95N77o12M84j03k03j64M23J79m73J07L81j60l51
1354b49K93K49o60J82J71J07k12K08k09R9J39j55P4o9K47k17J04r7j56O1J36R8
$$ plain form
1202 -2 153 53 -198 225 -104 -589 165 201 -209 -216 155 -130 -54 305 -297 280 264 -365 163 360 -329 -138
1224 -138 381 -251 147 148 -196 296 398 -464 -73 385 -299 78 160 -129 31 47 -9 165 287 -481 238 51
1246 51 -330 38 224 -536 1 288 -590 36 526 -144 113 232 -187 67 -20 -49 148 -58 -207 -34 250
1267 250 1 -80 373 -126 -97 2 38 69 229 -19 -122 -139 -92 378 -69 -82 347 26 -272 196 260 19 206
1290 206 -75 36 -20 157 -55 -79 550 -198 183 233 15 -86 161 209 -177 160 -88 193 -89 -153 56 -172
1312 -172 -4 -156 326 187 -106 65 51 -174 -88 -87 7 172 -260 195 -59 -171 -252 255 -220 -140 334 -118
1334 -118 8 131 -1 -145 143 -39 -334 243 -369 115 12 -191 -355 68 247 -226 -119 262 102 -249
1354 -249 44 293 -367 -185 -14 93 -119 89 -120 -21 118 -37 37 -32 215 -2 102 5 -151 -90 46 144
1376A44m10K90L68o62K93J24Kj83O9k01K98j42J42k25M17k77m66N73j2m17J35
1397a40M53n55j67N39m1K6j22j66J73K04l16N7n1k3K71m32N23n60Q3L71j44k56
1419b73L25r1k16J78J03m4L0JQ0k41M44j82k32J34K15k91J35j48j50N22k99r4
1441i4J93J55m18K51J16j45K4J20q4m87M12J08l70K51J73n81L37Q3k07J14L2o1
1463g8J45k97L83j34J44k77Jj5K09J81l20J54j32OJ73j5k84R5Q6l55K52P6L2l30
1487c00P10o44J18K20j56j56K31P4l72L20j30k11L12R7j09j42K25j85j98M52m76
1508c20M71o2J51l07J15j70Q1m3m4L73k65M7K12k36J03k5o8k63L89k11J06p7o8
1531a11O2L16j65k27K62o0Ol29M70m51J34K20m23K75N6j31L39j78J38k03j0k71
$$ plain form
1376 144 -266 24 392 -270 23 147 149 -34 35 -166 132 -10 132 -93 324 47 -419 154 142 -275 -140
1397 -140 313 -242 -409 130 89 115 -7 -173 0 204 -112 -55 -106 -129 142 -290 233 -327 -244 127 -17 -273
1419 -273 52 -39 -255 -77 26 -18 12 13 93 -148 296 114 -118 16 231 -60 75 -73 -223 299 0 -94
1441 -94 99 254 -164 87 203 58 82 202 118 -369 43 151 -219 32 205 -376 -39 44 -163 -49 -17 -78
1463 -78 67 -230 153 19 163 -114 -113 -128 81 262 -58 96 -36 -30 143 128 -156 -61 25 -330 -78 -2 30 -300
1487 -300 410 -234 -116 104 -52 -208 23 97 -275 45 -85 -296 16 113 4 -138 87 -98 -296 156 -320
1508 -320 151 89 240 -67 48 -122 -41 -84 -128 245 -20 27 239 3 106 81 13 -250 139 -72 34 -43 -111
1531 -111 -49 267 102 -125 137 77 83 -246 224 -227 -93 127 -296 -21 35 -96 243 65 203 0 -10 -281
1553b81M11l63K18L44m67K67o9j99k6K49p3o1K52l48j8J80l70J31O14n37M2N53
1575D49k29k86J20J96j94K14k96j74J77J25p6n7j4j24L42k52K00j4k06O0q3K62
1597A40l39J45k69M69j79j72m4J80L80l79K03j25J4n8k9q3K44j21KK55M2m37J82
1620B1J73n85J85K74J08j44j5n9p5K55k74K6J70J17m85K94J13j1n1j18K69K38
1642D26p09K93N4N4o1j19k43N00K3n35M10kk6m05M24j14m4J84j71K58j06k10J4
1665a05L58k54j35L79j70o9o4r8K15l1m8j80L65k20J37O3k66K53r2K3j61M08m49
1688a41J30K2Q9k63j02P2J97m0k40M09r0l33K55K31j37k14J60j99M58l06j46p8
1710b66L94J4l14K51j89O6r3L49j25j67r6J35J45l23R1J02n1l6J68j11J99p4n64
$$ plain form
1553 -281 130 -233 -15 329 -138 129 60 -139 -165 84 11 -50 202 -146 -164 16 -354 -223 391 -146 -104 449
1575 449 220 -66 54 250 56 270 -26 -200 -23 102 26 -31 -45 -169 173 -79 121 107 -99 -39 -122 140
1597 140 -199 -54 -323 146 -33 -205 -249 -69 311 -68 135 10 24 -34 -63 -146 98 -23 -21 234 276 -161 21
1620 21 194 -391 -206 68 176 32 17 -42 -117 138 -136 -110 60 177 -308 -14 99 88 37 -81 188 426
1642 426 -283 10 64 118 57 -62 -305 195 218 -317 93 91 65 -340 84 -30 -74 110 -61 197 91 -119 -105
1665 -105 253 -1 -136 243 73 4 -60 -158 57 26 -22 -202 163 -57 80 143 -123 130 38 61 -100 308 -141
1688 -141 -11 11 100 -163 -265 -193 4 -36 -276 133 43 -290 -35 196 59 -155 5 -194 264 -42 -188 -266
1710 -266 128 142 -172 79 -110 -44 -137 212 87 -80 -176 -41 104 -219 -128 -26 -77 -113 55 -56 143 69 -495
1733d95N75L0j59j80J56R5N4Q0k78o4M21l25Q0m9J21j65J00L28l52j68J31j32
1755a96J10r1K62K51m32R5o1K6J42k29K47j6n8l44N49l17j73J59j48L49l91K41
1777b5J35m9N9j02k82M05j7l69K79J26j43K02j69LL1J8l47L54q4j23J36K7l08
1800b43JK51l7K20k90R5J50k40r3K9K80k0j01j54L12Pp7j66K06j16j57J06J81
1823A44j06K53l49R8K03k70n2J33J48m22J67L66q3n74L03j48L62q8l31L00K40
1844B94k51n41N61j04L5k39N92k45j50j09K33J63n90L28q6%K31k39J18J02l05
1865b02L8J08J04o4k63L00J43k5q7j16J35l7l23M06K61l08j62J69j07No8J5K78
1888B00Kl67J88O1j89J01j97L31J49m21k4M62k67l85J62K78j77K64j2nr0m0m96
$$ plain form
1733 -495 80 110 -49 -229 -73 22 76 156 -122 -186 235 -90 -10 -59 62 -103 -3 325 -27 -195 -64 -196
1755 -196 -86 -177 85 336 -96 -1 -62 -36 106 -123 124 108 50 -294 255 -62 -235 -76 -224 125 -266 -25
1777 -25 110 61 120 18 -264 141 124 -245 34 160 17 219 50 53 84 102 -245 109 25 -98 38 65 -243
1800 -243 -242 9 -28 192 -98 -3 147 -93 -186 -157 123 103 2 -152 160 167 90 -76 130 14 -143 -37 144
1823 144 38 291 -58 40 243 -27 -79 54 202 -220 -53 313 230 -344 -41 -189 173 85 -246 54 294
1844 294 43 -498 63 -41 -6 -245 347 102 -48 -157 76 239 -351 -23 -109 -109 122 -117 1 103 -202
1865 -202 -164 -56 48 -16 -279 21 164 139 52 -64 71 34 -289 117 378 70 -92 77 -30 -25 -93 -78 200
1888 200 202 -165 23 84 -105 -4 -201 130 279 -142 -166 296 29 -356 -194 84 -93 171 159 154 64 24 -472
1911d72N46p0j29J24J63j83k58L10Q8j78j38Q4L05l21K03k15J75M1m29m4N12o6
1933D8j19K02j16J63n09K34K91j72j71rQ0L55l09j39L97k7l64J26K1K17j89k08
1955a98J61K36m05K41K29j32q4j01K56j41O7l81L31J73l96RK51J36k85l0O2K47
1977B46K1n00N38l06J22k19J27J92j71p2Q4NJ59l04J32K65l95j47J93J04n6k76
1999b58J72K11k10j33K15K22l03p0K61J85m46J48q9K17j20k30K06J27J20n65L76
2020C6q6R4R7k10J50L13l21j7M0P6m73M36j12Nn8J13j35J81L7m31L86j54k51J42
2044a42J71k64K19j59L88j24k09k33K91J78k65J69q6K14j06l64L45L74n24l9J27
2065c9J10j91J56N7J98o21mM94K3k53mL46l78M0p5J30P0%l35K81l0m01K81J30
$$ plain form
1911 -472 74 4 -125 -1 162 -21 -279 31 119 -59 -197 -113 192 -129 74 -141 34 75 -354 -398 114 48
1933 48 -71 131 15 178 -331 -97 194 22 -149 -158 -78 277 -32 -171 226 199 -165 -39 -18 199 10 -198
1955 -198 -37 199 -206 35 264 132 48 -53 203 62 129 -252 79 252 -144 -135 116 252 -33 -63 -1 246
1977 246 267 -233 305 -1 121 -98 29 221 50 -22 62 67 226 -78 54 319 -76 -223 -30 74 18 -258
1999 -258 -86 125 -85 -218 -3 219 -84 -154 107 292 -154 -6 -95 122 2 -228 -22 105 225 -340 36
2020 36 -50 44 141 -69 81 394 73 56 96 172 -301 135 23 28 -30 83 -52 129 166 -265 121 -33 -284 -142
2044 -142 29 -235 -16 -175 213 89 -120 -353 -62 116 -149 20 -66 148 42 -322 23 397 -127 -166 -39
2065 -39 71 -120 36 93 291 -330 -334 160 183 -70 -74 272 -106 -66 -141 -11 59 59 -276 5 -25 -426 -145 -15
2089a5K99o3k41K04K1L2l20L28M7l13j99K54K68l66N7O4K56m97J03p1L21k16j12
2112a59J76j08J36j98J09K30M0k44j01L05k54n2J83l6O4k94J37Q9J14m32K67K93
2134B65k35Jk09K89k03j11K99M9k6j38m9J52j48O1k24M46n3J6l98L60r7j39m01
2157d93N88j50q9J7J39L7k67J45k6K60l59R2J63J90l78P9J2K20l15J49L21n9m12
2180a36J34J11j43K2r3J07K64k25k10K81L3k74l0L37n5k87l2K44j87J95j86M6
2202h4J43j75J24J83j01k52o7K40J16j27k25L50J14m61Q1L5M45n01o5K21J89l34
2224a51J27r0M11j29k30K8J71r7j76K05%j90rO2K62k97q8L08K6j72j42M17o7P7
2248B56n61L92n3M3q6k5K98l77j46K08J08j4k36K8L14K7j26j02N2j00l8j08M01
$$ plain form
2089 -15 284 221 -20 184 205 237 -83 245 292 -21 -220 34 302 -64 -7 57 313 -184 -81 -152 169 -47 -159
2112 -159 17 -91 45 -153 -44 186 226 -18 -119 186 -68 -120 63 27 91 -203 -66 23 137 -295 -28 265
2134 265 30 31 -178 111 -92 -203 96 145 119 -19 -68 84 -64 -3 -227 219 166 182 -216 144 47 -92 -493
2157 -493 95 -55 -144 -127 12 49 -218 -73 -99 161 -198 -106 57 247 -131 -52 -40 180 -135 14 335 276 -136
2180 -136 -2 109 -34 -12 -105 2 266 41 -169 112 145 -129 -159 178 123 -164 -196 48 -139 56 -130 -84
2202 -84 59 -116 8 191 90 -162 -229 11 127 0 -225 125 239 -222 -141 -106 339 -162 -227 -6 183 -151
2224 -151 -24 -114 297 168 -62 -34 137 40 -136 69 69 -121 -130 -68 194 -103 -191 117 143 -29 -171 246 179 256
2248 256 -305 87 34 77 -9 -34 264 -113 -259 -51 57 43 -193 -165 149 176 50 -52 0 -100 -138 -246 155
2271A55Q5l92j16K18J8k80K92N6p1M9k1J74j10j38j14M57L5l50l33N37J94k61
2293H4j48j22M68l07k24L01l2q8p4K83l0n5jR5r1k1j56J80k29K53l09K79k12P1
2317h5m8Q0J30J18l99l7O9K18k65M34j7no8l13J46J51j78j13K44o7O9J8J92q2
2341A92l53O4K81J15l74K10j18o3j56J45K07O7k38q9K9j3k19J89K88k06n1K34
2363A41j85Q6m11K24J17l6l7k26L90p3k39O0o5K58j54k37O60mm08kM45l77J74
2386A01O0K14r5k35k09K08l6K8j88P1K01j88k37J06K31j16l9r6L57k6l80L97j94
2409f5L65l36N9j29Q6o7R5J36j33q8L0j17J40L2jJJ3jk3L32m84L34l8j52J39J89
2435C17l92K37l31Q4L6p9R5m40N40j23P5o8N5Q9j15M8RL0k38L57k55J3K26n46
$$ plain form
2271 155 240 -152 -268 -50 -32 -312 -20 36 -35 14 -7 167 57 -81 -195 262 297 -53 -386 151 345 84
2293 84 -64 -186 282 -25 -249 52 20 -68 -142 141 111 56 55 150 59 38 -118 62 -167 86 -223 56 -156 -85
2317 -85 -133 -53 77 195 -204 -241 -172 46 -219 215 198 193 125 -188 -42 109 -69 -182 62 -5 64 82 274 192
2341 192 -161 -97 184 299 -75 135 17 -46 -202 -57 150 217 -21 -110 -81 -94 -313 -124 164 -42 -93 141
2363 141 -44 42 -369 -145 -28 -64 -101 -327 63 -10 -249 -189 -254 4 -150 -387 273 269 -139 -141 304 -73 101
2386 101 161 375 280 45 -164 44 8 36 -152 -81 120 -68 -305 -199 32 -84 -123 -219 138 112 -268 129 -65
2409 -65 300 -36 23 -106 -20 -87 8 144 11 -77 -47 -164 -24 8 7 8 21 20 -3 329 -155 179 141 -11 128 317
2435 317 -75 162 -169 -85 -49 -128 -33 -473 67 -56 19 -49 6 95 -20 28 37 67 -171 186 -69 -56 170 -376
2459c76K34J21j36P5Mn6J94k74M0K51k05RK77q7k19K31k47J19L17m26L66k02K13
2482B23k91O2O9k86J88J24j82P4p4J18J0n8k84J28J08j18O0L54k44J44o6l7j53
2505a31J18q1P8J89j74K36j47j18kK0J82j64JJ3k40K66j88J96J19j99l4n6J18
2528BM62l95%k31J70R8j79OJ17K17k65j03K05N8k02N1j01K43k57n3j56L06k9Q1
2552D5J14j47%k4j29J12J88m59L11r8P4J43q2j70J71o3M1J22K0j48m78L49K05
2575I7j24j29K44R8l10L3oJ27P7J52j70m6r0j56J39jK33k55O0J34j46K55r0j24
2599Bj37K21O3M0l01K39j49J84j36j4J22o1n6p4O6Oj20J50n4J9J04p0j17L03j68
2624F2N7L18n08j14M59k49q3J41j23k00K24j15M6r4K15J61k31P5j40O9k26K78
$$ plain form
2459 -376 -142 -21 -157 -82 -78 -134 60 -214 -174 77 -128 -119 158 71 -148 83 -164 -45 272 -154 212 10 223
2482 223 -68 -6 63 -223 -35 89 -93 -19 -93 25 35 -23 -307 -179 -71 -189 -129 225 -19 125 59 22 -131
2505 -131 -13 -94 -16 173 -1 235 88 -30 -32 -12 170 6 7 20 -220 46 -142 54 173 -26 -60 -116 2
2528 2 464 69 69 -162 8 106 -73 -67 50 267 2 -101 104 162 -40 11 -90 153 -104 -157 -313 -7 -36 45
2552 45 159 12 12 -12 -141 -29 159 -300 11 -87 -13 130 48 -122 49 -14 27 149 169 21 -457 -108 97
2575 97 -27 -156 88 186 -124 -91 -97 30 107 259 89 43 -47 -203 -64 -65 168 -87 -27 107 -39 216 126 2
2599 2 -135 86 149 189 -112 127 -22 162 26 12 134 73 17 -57 9 15 -105 45 -9 10 114 44 -73 230 62
2624 62 119 437 -71 -185 274 25 -58 83 -40 -240 -16 -131 -85 -179 36 197 -34 41 -99 -30 -256 22
2646B2O4k37L1M3Q4m3j94K35n2o1Q4Q6n9p3P0p8K70k35j5N7N9J04j70J25q7jj36
2673a07K3J83l3O3k85J68L0R8p9j06M2J05j72J24k6L02l05R2j05N4p5j25J0J04
2697b0k63L47J4O7j86K02l9j93p6K1RN8K64k32rJ76Q6l68K89l60j7J86R3k97J06
2722a42O2O7K85l12K3K84k96J57m8l36J77l3R9K9j8p4o4R1K51l46J96M2P6k59
2746h9rl6K32P7j39J9J9k58J56R0J99k1j62k1R0k29k9P6oM8N0j56K59k86J92j49
2772h3J29l7k77K60j13P1K2m1O6r0J44R7k70K63j18P6K5j19K8p5J33k24J77j39
2796i5M4J09Ml60M97j30J5j3l4L9K6k63R2M1l4J61r7j00K70j09j62J78j27J21
2820G3k04K20k87j6K07k23K43N5k74L95j60k0o5J2M7J00r0j20K60m5k53L26Rj37
$$ plain form
2646 22 86 -151 -120 -77 7 -36 -230 5 -47 -108 -24 62 3 -70 0 -78 192 -43 -58 -1 58 162 -8 117 30 29 -107
2673 -107 -84 99 66 129 -156 12 42 140 61 -45 -3 102 -70 54 28 330 25 117 12 66 -9 -134 -124 -20
2697 -20 -283 64 78 145 -41 161 122 -71 -147 -126 -117 -59 205 -27 -36 140 226 -142 147 -213 -230 -44 49 -248 -142
2722 -142 -80 -13 272 -40 -17 267 -29 128 80 -256 -79 -112 -13 16 -2 -76 -140 -49 202 -144 52 94 170 -89
2746 -89 -98 -134 98 175 36 55 74 -184 -28 62 261 240 78 57 147 -82 -111 -35 -41 7 57 -99 160 -126 66 -83
2772 -83 46 9 -268 -8 -121 -50 -28 -69 -3 -93 51 148 -122 141 23 99 124 5 33 -42 91 -133 44 -95
2796 -95 -51 58 62 -298 199 69 84 71 37 76 102 -161 -69 -28 -62 99 2 -98 172 63 -99 79 -48 73
2820 73 -131 89 -198 -214 -7 -230 13 68 -206 189 29 9 -56 -44 3 103 13 -107 153 108 -145 181 190 53
2844E3j04N7J07J18j66K3k50J15k8K11j56m5K72l58KK70k1j18n0K59j36p2K54
2867B37l80J22K2j71J44J61k7R0j49j46J00K9J06p7m0j88J89k69K77J13l06J21
2889d2k7J96m53K50J79qj57n4P9K76m03J88lL4q2NJ72j85J14j6k26J38p1J79r9
2914a6k17K65p7K61Mm48K53Q8r5m1n0K2K39j77j78K02J3J60m07K78L26m61J53
2937I7j98rJ08K02k74J58Om9J62l03Q7J07o1J96Jj77r3J77j92j24K56L0k45L91
2961B53l38k9J05K8O2n4m3k6m4M0J50j61L06j72J82j38j07J0J47l97M21j01j57
2984f3r5J68P3J93m27K80M3k50j00J09n3m0N11l08k33J92J16Q0k71R5J36J28l01
3007a7j06J31J0j15l6K24m64K10J86J29q3k14K2K97j51o8J35j97J43j12K6J59
$$ plain form
2844 53 -51 6 113 231 65 88 -162 -47 -75 136 -20 -65 207 -151 -149 121 100 -18 -68 191 55 -17 237
2867 237 -143 -21 1 -170 -26 135 108 198 49 -97 3 32 138 61 21 -167 22 -247 30 143 -163 -42
2889 -42 -69 127 -326 -76 103 95 -62 -116 -37 239 -164 24 21 55 -27 -22 150 -35 79 63 -163 -25 -96 83 -16
2914 -16 -233 32 -45 216 220 -228 25 113 18 -23 -73 -51 188 11 -167 35 48 208 -199 79 405 -56 97
2937 97 -101 -110 -2 200 -74 84 90 41 203 -100 -13 94 33 229 230 53 -40 137 -55 -179 77 107 -138 253
2961 253 -85 -114 -9 19 81 27 -16 -42 -86 -46 104 -57 249 77 259 121 14 24 171 -226 195 94 -63
2984 -63 -158 10 83 276 -151 129 172 -78 -178 -69 -122 -162 349 41 -192 0 116 196 -75 20 156 284 -17
3007 -17 -123 8 18 -97 -133 91 -373 -163 23 152 69 -145 -123 174 23 -45 90 -107 36 -76 -50 109
3029A09n3K16k67r3k6Q8j89J71Q7n9J82k22o3J34Q5m3O1j49J41j20J32j16R6j27
3053b5R3p7j23k1J26J33p5j37K71j88l07M08j23P7j45K21k22J95k61J22J36j56
3075g8p3J46j47%K28k66M21n35L43k9p6M7j47J92l7rj04J20Q9L8l60L11j34J55
3099I5k51R4m7N9J28q6J13j46j23j34J65L63l64J12Q5k44L90j15j32n5L00l22
3121a15L11r0k52L61J5j61l31K76J2J30lk44J46r3J45k92Q7R1j3j79K40J09J4
3144A64k47j28K07Q0j11l53N86j61J2j03q3J48j18l2K57L7m4LQj34j25L10j24
3167D9K60k61Q8r5j0o7P7n5Q1M0M0m6j17M8J08o5L6q2Q4m20J25L81j81K12l65
3192a35L25j24J3q0J41k40M9L09j55r8Q9L7r8o0R4pJ3j25j09J9J86o6p1J52k08
$$ plain form
3029 109 56 272 5 -88 -114 -26 -215 -44 43 -16 166 -56 -119 15 100 57 118 -31 110 -10 122 6 102 -25
3053 -25 68 -9 -132 -153 -27 106 31 -106 165 -23 -330 78 -45 32 -113 108 -114 81 -180 -58 78 -78
3075 -78 -151 -5 -152 -152 76 -190 231 -304 39 10 -66 -19 -166 26 -11 -20 -124 -4 85 123 -237 74 -60 95
3099 95 -156 -62 -109 -50 78 -8 105 -41 -164 -298 -133 230 -134 -22 63 -181 209 94 -38 -93 207 -115
3121 -115 196 106 -146 215 230 69 -262 14 26 156 153 -91 55 -38 107 -185 -98 -7 -20 -199 41 150 164
3144 164 -83 -211 -4 76 -35 -388 198 37 49 -54 -137 11 -107 -139 118 155 111 114 122 -12 -137 173 49
3167 49 309 48 136 41 31 -36 41 -14 67 107 147 101 -16 32 140 75 111 29 113 -307 -182 199 18 230 -135
3192 -135 190 66 79 -1 140 -100 -51 258 103 5 94 131 33 -27 67 60 73 -52 -161 -142 44 -22 -93 59 -149
3217a49K7K42k1L2l63L79J64j98j12J32l1k19l2J6J03L94n35J45L5J9k96N23j64
3240I1k01M51l23K8J60j59M1o5k5J18j53N1k4j28J30M2m8J4p1K19q4k84J72J65
3264A17j11K8j59N2M6J19k83J86o3J41N5J03j95J13j34NL9Pr3J30Kj15l1K6j41
3289a56J8L93k65L4o2J4o5J38j91J49M8o3q0J32j16o3K17k03J75j51K32k85J05
3312d5j63K47Rp4P7J64k06K81j66M9J53l70Q7j58J69j68K24o0J21j01j54J93j96
3335h7k5J91j27R5Q8j13j7n1P8j93K05J04j06j61J72p4j52N9K58Rl20L37j92K24
3359B02l70j16O9K05J89l20Q9l2m0J82j76J7P3K83jk15J31j71m7J55l7j21j3m2
3383a06j61L12j2l0Q9m2Q4j03M1M8P9q3j47N7m0J63l25k9L10l32N0J50J72p7J5
$$ plain form
3217 -149 -122 120 99 131 -232 147 311 113 1 133 102 -117 -149 -133 -30 364 -171 -26 9 28 -268 255 91
3240 91 -110 341 18 46 206 47 88 23 -2 116 -37 14 -10 -138 -8 34 -14 0 -71 148 64 -220 -48 117
3264 117 6 34 -125 -73 -27 92 -191 -5 -68 73 128 231 36 149 15 20 59 66 -27 103 105 -10 -41 -15 -156
3289 -156 -138 255 -10 24 -38 -24 -89 49 -142 7 55 -8 -88 44 -72 -135 82 -121 54 -97 135 -150 -45
3312 -45 -208 39 48 -26 51 215 9 290 124 173 326 -44 43 -115 54 -114 110 50 171 70 -84 109 -87
3335 -87 -112 79 -48 47 135 22 5 -46 32 -161 44 148 42 -119 53 -21 -173 -114 144 153 -167 170 -22 202
3359 202 -168 -284 -215 -10 179 -141 -52 -84 -124 58 -118 -101 -28 255 254 39 170 -1 -48 107 70 -51 -64 -106
3383 -106 -267 45 33 3 92 50 134 31 72 120 199 116 -31 26 -14 149 -176 -205 105 -227 -177 -27 145 68 83
3408H3n5p7n1K33j54L7P3q8L6J68m1j95J26K8j48J11l08J90Q5l41K39K86j24j29
3432a6n0J31j5qk4J14k37p3J67j40J84J45k50J77q9rl8J19j09k4k7K82l69R0Q1
3457A2J85q0r9n7L7M9n1O7l35K55r4J03q4J8P1J93k94K26l07N1J70j81K61k4J98
3482B90j31k3j95KJ25J16m5j82P4N2j31R1J09l9j38P7j50Q9J49l20K08j0N5j10
3506c7k46M66Kj68O9p4J59l55J46j78JK95p9o5J15k42K65j55J50j4k76L24m0j2
3530E1N9l21L84j08j43r3o9R1J00J30J6n2J83k42M6j1M6j65J38l50N11j45P2j37
3554ikr2J61OMr7P5R3k86K25k4j35j03M28j3j33q4K48k38K5J0J46j32l0q7L26
3580B82n52J74O5j54J28J03k79j09K87J56k34q9M22J22mn6l68J34m4L2q6J19o9
$$ plain form
3408 83 28 -49 -100 133 -21 16 89 1 37 205 164 -31 95 123 -25 86 -222 -32 53 -288 -49 237 113 -16
3432 -16 -66 65 50 42 18 132 -105 -178 -11 -151 33 178 -72 105 16 7 -31 88 -21 -45 -72 210 -159 -69 12
3457 12 197 117 18 -39 -2 47 -4 63 -272 -17 -111 -8 -92 -74 -3 190 -104 122 -185 -134 36 -145 116 92 290
3482 290 159 136 -59 -57 68 184 139 -43 31 83 -48 43 152 113 -25 52 -98 -9 140 -180 28 18 73 -37
3506 -37 -283 183 185 17 86 12 171 -184 -38 -216 -215 80 1 -64 51 -191 74 -81 69 55 -221 103 63 51
3530 51 110 -211 173 65 -78 -171 -240 -149 -49 81 97 45 228 -14 32 21 67 -98 40 -310 201 56 128 -9
3554 -9 -11 -103 58 64 68 -29 46 139 -147 78 54 -81 -184 244 231 98 14 262 24 49 59 205 73 43 -44 282
3580 282 -270 -96 -31 -185 -57 46 -233 -342 -55 101 -133 -222 200 322 318 262 -106 28 -16 16 -70 49 -20
3603b0M5M5l22K64J20j15Q5Q7j34k02j49R3K09j4K5R1j7k51R3L2P2Q5p0j31J05
3628B6m0L17k27j09Q8N7m9n1r4K88k36K70m08K33l8J7O3j08p7M50j90p7K0P8k97
3653i4p6L3J19L5j71J43m4K53l37L68l68K75k8j46J13l58K83L20l71j40J57J25
3675I1J18k28qK27r2j14J08J06k67j05M6N8%L0J90j72j11K29l53K13j46K17J47
3698A84j05k90j2K53R1l30K81k49L65l23k8K72j14nR6o8J61l43L66k27j03K21
3720I3j45N7j7P4QO5J10k29J11n8K23k70J25o3l1j64J04j6QJ49j43J16m4p7J05
3745I1j45M8R9j49N0k5n1j78J44K79J0k67J30j73k18J73RL59k38n8O4j35K41j78
3769a18m8K16j92K93k51r2K29k89L36k71K31P2K83n07O9K71l9k30J06k34j3L10
$$ plain form
3603 -20 25 70 -252 12 132 17 102 189 55 -147 -296 -203 6 -8 17 108 91 -160 -67 -35 37 122 52 -79 26
3628 26 -14 303 76 -33 55 112 63 12 -82 206 -30 240 -168 65 27 44 107 -1 -78 372 182 105 125 203 -94
3653 -94 -170 -137 -18 17 -154 -11 -55 198 -139 229 -139 136 108 -38 75 -283 0 320 -51 -191 -34 91
3675 91 209 -19 -27 200 108 -6 102 208 -59 -164 -118 -60 -60 -30 160 -12 -123 106 -247 -34 -180 37 184
3698 184 79 -211 -223 30 121 -209 72 -177 188 -135 -163 109 -5 -10 86 18 179 -164 202 -25 -128 93
3720 93 -52 5 -12 62 70 135 245 16 127 69 292 22 147 84 53 -111 -7 -23 -15 134 -9 107 63 -14 91
3745 91 -54 -6 93 -56 -6 -31 -82 -260 -116 163 173 -94 36 -137 -355 -182 -173 186 -52 -110 -46 -181 60 -118
3769 -118 -166 50 -142 151 -100 -192 37 -252 84 -187 44 116 399 -108 -39 232 193 -37 69 -165 -178 132
3791A32l42J5P7J17Q8Q7j5k33J59k09J53K43m04J83j15O7J50k94j16L43k51K29
3813F4j7q6K3l3R2O4k50K79j29Q9j24J82M2k85K22pm9l4j29J07J79l73K65l01
3837b09J89L1k10L96j92K32j76j7n5J33O3l12K13n2k56K12j1j69M31k27j59J49
3859Dj11K69j12n8J80k64J07M8J37m20J35J17N8l74K62l7K23l99J90J08p7M9R4
3882A29k89M9P0J15r9j49J82k28L09k77L98k94L06j99j56K13j25pkO5p8o6O8J85
3906A20o1m7oo1K9q7K92k15N8l0M03l58r4j59J01J28p8K12l30K96j10m5M4p1p5
3931a44K91pq8j10k4J72k26O2n8Q1P1J31j26J33j9j55K36k14J14K7m24M31n4j54
3955e4J00kj46M60m61Q1k8j02J94j48L30J0n9k17K07j31K6j94n0J72k7k1J82l8
$$ plain form
3791 132 -210 -195 -118 -1 87 174 159 -74 85 -124 29 272 -132 51 -64 3 153 -141 -257 86 -165 64
3813 64 47 -39 -16 -49 43 107 -143 136 7 96 -28 154 196 -89 133 126 77 43 -86 21 200 -173 92 -209
3837 -209 -20 11 -199 197 5 237 61 44 -11 122 185 -127 86 34 -222 -10 -21 -190 241 14 -145 4
3859 4 -107 162 50 -8 172 -92 15 63 200 -220 -85 32 90 -284 -22 -59 164 -235 -45 63 -14 35 129
3882 129 -160 -111 -41 74 -25 -174 8 -220 89 -188 210 -84 222 23 -133 80 -45 -52 -54 11 -67 -133 -65 120
3906 120 59 12 6 -55 -26 -113 179 -36 22 -8 395 37 -57 -216 -115 13 -65 147 -183 113 3 -42 2 -69 -144
3931 -144 147 140 52 -58 -82 90 -136 -74 -132 -51 20 151 25 158 139 -16 220 6 120 147 -277 154 100 -54
3955 -54 46 44 -102 358 -103 -22 -50 -152 42 -106 224 234 175 -42 165 34 60 -134 -184 -12 -39 -60 122 84
3979H4j00j5P9m2M5K9j37j48J47l3J52k05k6L00k17N7O3J20j67J75k29o2j1L24
4003A83k99K10k75K48j70k00L09K32j68J30k99j13L07p2j89J38k10o8L55p9kN2
4025B0O7J23K6l20j67J61O3J32l40N12l38K03j52o7J83j38j57K52j84N2O7L8j62
4048a26J62J0k4j76R6Q0j55J64j33K94m5Lm54M08j93rJ13m5M1J43o2j01N2L8k84
4073b03K03j11m3J75j6K2J85j31j45Jm6l0L35l70K27k84K83J0r0J16R3k89J84
4096G6j06N2J64L8k66J8L9j06K5J94j58r0K93j74j01K87l82J88K3kL4n7O6Q3n8
4121H0o2J46K03j60k31N9r4j73L1L24J26j55k44J16O6k20P3R0J4rQ6j16J95j06
4145C9j96M1j22L92q3k87K73k42R2j9K7J67k68J3K92k00J69l42L89o4j93J18j15
$$ plain form
3979 84 -16 -31 48 6 51 80 -57 -205 -58 -91 61 -144 -170 130 -87 -30 33 153 -14 161 -68 -130 -141 183
4003 183 -116 94 -181 67 -103 -303 6 238 70 200 -99 -212 95 23 -166 -28 -238 -306 49 -30 -32 20
4025 20 87 210 236 -84 -251 -90 -27 105 -235 277 -61 142 -10 -77 106 -32 -189 63 -121 -69 -2 36 -126
4048 -126 36 46 22 -154 -58 22 -133 31 -102 192 147 150 -304 104 -89 -98 15 -30 11 154 92 -9 43 81 -203
4073 -203 0 -111 -154 21 5 27 212 81 -64 -63 -109 -139 196 -174 53 -231 52 62 -28 88 181 -108 76
4096 76 -30 22 186 224 -42 -24 15 -91 -66 128 -30 -120 173 -1 -102 185 -197 -9 14 12 46 -11 55 138 80
4121 80 18 164 367 207 -24 35 -59 -232 -201 123 249 94 -150 -34 32 -188 -115 -25 -11 -20 66 -50 145 39
4145 39 -157 -116 -238 154 71 -216 57 -185 -93 -112 -85 82 -186 -173 119 -81 88 -254 135 71 -122 -4 -119
4168a19J76m2k78L85J0j42j51jN3J65r5N1r7K39Q0l2k21l8P4K74l47j43J43J48
4192I2Q3m24K2L42p9n3L10l64l3J75k95K26jK31j70l6l8p8J20N7J10j29j57L4
4216e5K3J0j66J50rN5J89l45L34l30q7k1N58k10r7r9q3J77M5j63J78K06k21j0
4240B9q3J91M8j74J35j81J02k17J31r2J37j74R9P7K8n2L3q7R9p9J2K9l11L12k46
4265b34K15j27K37j81J98j30J80j03j59K35k58j50J65M4O6J18j32J4J07M8j09
4286D4Pq0J34l2j38J22M4k06J68j67J44P8k28K65q1m5j83J37J40j78N2j48J22
4309b9K07l89M78m29P7J95k5J62j87k47L9Q6K45j56j73j36K49j44j08L22J6p0
4331a7r1p0L07j77p9J15Q7o2R4j74O4m3M6j45M24m20OK20j2j98OJ89k89K61n9
$$ plain form
4168 -119 57 15 -263 122 132 -10 -161 -162 -109 56 -39 12 -85 154 234 202 -19 -57 17 291 -56 -199 -56 92
4192 92 175 -249 -227 115 36 -17 293 -71 -104 71 -224 2 1 232 62 26 -12 -90 30 87 197 68 -89 -55
4216 -55 -32 -22 -188 -38 -47 8 197 -148 186 -144 -231 -252 306 96 -1 -100 -183 -6 39 -124 54 260 39 29
4240 29 -54 137 185 11 146 -35 67 -150 -19 -111 26 -148 -49 28 56 4 37 -50 49 -30 -18 11 -300 12 -234
4265 -234 -19 -146 91 -90 108 -22 158 55 -104 131 -127 -277 -112 -68 -2 116 -16 -2 105 153 44
4286 44 51 -29 105 73 -65 57 101 -105 63 -104 40 118 -110 155 74 29 -154 -17 123 -55 -3 -151 -29
4309 -29 178 -211 267 -162 -85 110 85 247 60 -187 -148 -62 183 27 -146 -282 -33 -177 -285 37 53 -17
4331 -17 -108 -178 129 -48 -127 -12 75 13 107 -67 -3 -46 0 -145 279 -141 -135 85 73 -125 -119 70 -219 42 -17
4356a7Mn3K13pR6q7N7k34j7K01j06j02L11l85J15k7J66l7j51P8j33M8M6L6j02
4381h7J3l8K20j61Q2p9l2j66K77j13j8K95J7j27P3j5j74ro1L5k96M77M7j01j7
4406D2J1J2l4J58k17K42k24J10Qj56J67k31P6k60K80k76J93J35k11Kj6Q4K29N2
4430A76j0j65J35k73J24NK08l04L2J46k39lL56p4k25J39j57L58l44J33l43J48
4452a77JRj4OK14L5p4Ql5N9J33j19o4j89K18k04R8J17k90k4L14j14Q7J5O4k4N9
4479A09o6j56L71m26K84j27j58Q1M4P5J4N7K0J33m06J00k30M17K3j76J44q6J47
4502A88k29pq0k0K13J52m21l2K86N6j66q9o4J14J45r0O9KK36l56j35k7K78J70
4526A93j67j53J75J1p5j2M6m6P3q6J10nn7J33p4j95j05J10J08K36k48k3m1J66
$$ plain form
4356 -17 -13 -66 147 140 236 149 206 -28 -45 156 50 -52 259 -126 -11 -38 128 91 -60 18 -115 -67 -21 15 -87
4381 -87 -74 -112 108 -53 29 -50 -82 -248 29 -84 -102 193 210 83 156 141 -33 -42 -103 -68 -364 113 160 59 42
4406 42 53 65 31 189 -28 214 -10 100 108 -48 119 -112 -36 -296 -16 -292 -99 36 -175 -173 -189 -105 124 176
4430 176 166 1 136 -137 -13 -8 200 -104 -72 74 -165 -168 188 114 -111 28 -129 229 -115 18 -325 -177
4452 -177 -176 -167 -181 -175 39 74 0 8 -27 32 165 46 -18 -207 11 -193 -95 22 -268 -292 22 -92 -5 10 74 50 109
4479 109 43 -113 258 -168 116 -11 -169 -88 -44 31 45 102 122 255 -151 -51 -281 136 159 -17 127 41 188
4502 188 -41 -48 -128 -148 65 217 -204 -236 50 106 -60 -149 -213 -99 46 -44 25 27 263 -93 -228 -255 23 193
4526 193 26 -127 48 59 -16 -28 18 -28 45 -41 69 64 7 140 66 -129 -234 -124 -16 220 -28 -51 -92 74
4550G4k15Q8j10P5P3J1Rj22J97j80K43k24J48j13Kl1q0N05n03M9N1K79k48pk6
4575e5J20j23M5k6N5R8j8l08N5pR4J3Lm8J8O9L5j28Q8q5j74N01k39J43j13k5M3
4602C1R8j73J87j85rj49J24q3J28O0j65n9L18p6k28K35J2jj17r6J13J50K5j91
4626e1K05j98j1l17M56q5k12J35J56o6j40N5J65k60K15j30r5N20k04r3n1o8J92
4649A18J56j93O3j16p0J48l3J89l16q0J31J55l3k89J7L0J32j77lL41j07R9j48
4672A4K99l11J11j61OJ5J31j73qJ47r0P1q1J34P3l56J94Q9J2k03J55j00R9m8j04
4697h5J02M4J44k38N7J28J4o4k81K48k4M3j32N2qJJ26j33j49Q1j04L72l18J9J75
4722G0k16l1K93j47j04K90k83O6J28j46m0K25j04M2Q7j67j47L34k87j3K10j73
$$ plain form
4550 74 -141 -53 -163 -88 -15 -4 5 -117 80 -100 143 -81 67 -46 -44 -75 -155 350 -153 -104 -53 226 -22 -29 -55
4575 -55 65 -58 -13 -39 16 114 96 -212 -157 -164 -70 -57 -54 -102 -84 -15 20 -108 -20 -105 -279 222 -17 126 13 -12 31
4602 31 129 -44 143 -42 -51 -200 -76 -159 -31 29 -136 -195 123 47 -181 54 66 65 -52 -148 -35 115 140 -51
4626 -51 154 -44 -55 -372 84 -1 -213 -78 78 12 -128 -73 92 -168 47 -83 -178 342 138 45 -6 -74 118
4649 118 274 81 144 28 -42 106 73 262 -54 -134 -3 152 119 -170 -153 -123 9 -168 -171 170 63 162 14
4672 14 313 2 113 -48 -42 -27 104 -69 -77 70 -20 51 -30 104 177 -179 15 104 116 -87 68 -32 67 19 -85
4697 -85 17 61 205 -33 24 152 166 102 -179 69 45 88 -44 8 0 1 127 -6 -155 -74 -178 194 -124 -105 70
4722 70 -146 -177 116 -31 -135 155 -128 -62 66 -80 -120 105 1 43 130 -37 -184 150 -137 -150 60 -113
4744a13kq6L43j60k15K91Mj64J44j98K94k79L2J56L5j52K81k78L7K47N7l71J59
4767F2j60P7o8K12j08nN9k1J06j04j83J16J70j52L8j55J1o2K32m5J30j48J68l65
4791a95J41j19J98K52l44j62L89j13J5J86l06K5N8k10J19K86r3J11k18p9j82K81
4813D0k02J60l9J39K46m78L10l6k22N3j22J03j15K27n9K34j17r6n9J55q9j01Q6
4836A8j35L44j73j97o4K10n1J18L2K19l27R3j38J4k01L60Q3j41J00j47j62k7K60
4859H8L7j26J97j44J01m3l22J95J11J3p1J34r3J53j80P4l05N7J3J44k79L22J36
4882B12n49K43j12L30j34q9K12O9k53L4P9m4j61L08l61L74m34J68M4J47Kj75K05
4905A15k23J08M9QK1l6Kj62J41J71l54K89Qm5q0j24N1m1J94K3l24L77k69K42k77
$$ plain form
4744 -113 -115 -201 142 -18 -233 58 62 -102 42 -156 138 -141 -109 47 82 -70 211 -67 -30 217 274 -97 62
4767 62 -98 -21 -89 123 15 10 69 48 154 50 -133 -17 153 1 39 -116 -105 -167 65 20 150 2 170 -195
4791 -195 -54 -173 25 277 -67 -229 160 47 62 248 -58 -33 25 -185 -66 220 127 238 20 -59 -241 40
4813 40 -162 -2 -41 98 344 -134 176 140 -82 -29 -151 -48 -163 64 5 239 122 26 -33 122 33 -68 18
4836 18 -117 227 54 -143 -207 3 -48 70 102 321 -6 87 -51 -37 -238 122 205 64 164 17 -145 -172 88
4859 88 125 -1 196 52 153 110 -212 -17 94 107 36 170 77 230 50 124 -181 -124 -111 33 -246 76 212
4882 212 -337 -94 -206 124 -10 -99 113 182 -71 -37 42 -2 -163 145 -216 158 -276 -108 -64 83 85 -90 115
4905 115 -108 0 49 57 78 42 44 -118 23 194 -160 129 137 92 12 -112 -61 -102 92 115 -209 168 -101 141 -136
4930a36L06L1l59jR4L0J33j37J2R2j60K48m62M48p4j66J4J21k44K11J06k10K70
4953A67k39m7R6KN3q4j8J80k09J65K05k01L9j07Q2k42J50o9m8K18J51k06N7j63
4977f8R6k5K7j4PO8J13l42K24l7J41l42J74M2j02k56K30l5lm9Q4J23J8K4L4k0
5003A12k40J56j8k67J51K28j48P6M9k22J25J01k04j68K77L6k90L72k69K37j40
5024d6%J24k87K52M9m02K05j15L28j65LqK16j49j4J82l94L03J34p3j36K05j05
5047A07r7M2j22l6K9j64M00j76j80J44J07k84K60n0M0r9Q8J02r7q7K47j72J9J7
5071C8o9j20Q9pK07O2k80rJ03N0l84M63k06J52j8r3Pk4K37k84rL87m04L45k13
5096B0q0J63PMl16J96j41J69l97K87J79j57j9Q9j57j13K04LK65j72j40J5J26p2
$$ plain form
4930 -136 170 201 -158 -159 -65 -35 98 -39 -27 65 -95 153 -309 139 65 -101 -87 34 -210 1 107 -103 167
4953 167 -72 -119 -23 -21 32 -52 -70 110 -99 66 271 70 109 2 84 -158 -8 -77 -125 93 244 38 95 -68
4977 -68 28 3 30 16 23 91 204 -138 86 49 190 -152 22 64 -38 -294 -64 -99 -102 -151 -67 56 74 98 132 112
5003 112 -128 28 10 -257 -106 122 -26 50 99 -123 2 103 -101 -269 8 44 -246 126 -143 94 -46
5024 -46 -46 78 -209 43 92 -310 -105 -220 108 -57 -54 -62 154 5 -9 173 -221 82 216 143 7 212 107
5047 107 10 52 -70 -106 -77 -241 159 -17 -197 -53 54 -230 30 -20 20 -79 9 111 14 -73 174 2 21 38
5071 38 -31 -151 -62 -69 138 200 -80 -89 14 64 -320 143 -63 89 71 -22 -15 -39 198 -86 -95 292 -112 233 20
5096 20 -60 103 110 114 -202 -6 -147 22 -375 -88 91 -66 -85 4 -153 -266 -62 -59 206 34 -106 -91 35 -37
5120c7K44k11j13J87Ol49L15k68L50o0k41J38l3P6j68L05K3j54j36K57j55Q8R4
5143A58j59l47N00l13m3K09j58M27j66l76K03Q9J64q3k75L30k31l3k43L21K09
5164A83j97L52n22K65o9O5j63K40j29k00K06j74j7K62j1j60K9l0jL6k7m1J83j3
5188F7j36m1K83k35M0M1k95L37j40J41j66J34J4j17k8j06J87O9J74m9J54l90j45
5211b07L99j66k31n6L07R1k44M4m0L0Q0J18m4r6k32K65j4j49J47J82k79J20R5
5234A20k6j26P6Q9o5l5j09J65r4l1J96J17m25K07k41K59K4j03l0J59j59M1O8j09
5258c2k36K81J0j92J14j0M3N5j6j1R2J2j15J29k12J34j2K7J31l77K06J10j31j91
5282a91L27k9j99K12o9k53J04k28L87k89J52K96k69P9P0j26J14Lp9o2j77K30j65
$$ plain form
5120 -37 207 -4 -117 70 76 -273 42 -226 124 64 -177 -39 -72 4 -164 141 164 10 -126 131 -24 64 158
5143 158 -1 -348 152 -161 -204 5 -153 274 108 -268 -65 24 188 105 -170 160 -71 -104 -347 -26 183
5164 183 -14 338 -184 81 12 77 -86 154 25 -175 31 -143 -160 102 91 -69 -40 -70 -71 -35 -62 -103 80 67
5188 67 -69 -110 173 -62 -22 19 -276 61 -79 62 -104 30 44 -73 -101 -207 -20 49 223 174 328 -62 -207
5211 -207 192 26 -205 -261 46 137 -107 -63 -103 -73 7 125 81 -15 -247 18 4 -145 2 184 -95 25 120
5234 120 94 -32 44 133 68 33 -76 89 -5 -36 160 277 -148 59 -182 77 101 -2 -32 127 -32 9 77 -32
5258 -32 -268 13 23 -169 -55 -65 -22 33 17 6 98 110 -5 124 -88 46 34 61 192 -185 21 131 0 -191
5282 -191 136 107 -92 120 51 -202 -98 -326 61 -228 -76 220 -49 30 100 -26 88 91 12 -50 -227 3 -162
5305a62K82k99K22j59J00l9L8k15M81ml28R8Jk37N08n74K31J14P4n6J02Q3k48
5328A3J23r7j02J09J74Q4l30o2R4j19rJ14K46p2j93R1j80J50P3k12j05K44J20
5351A54k90l2K33O2j33j89J22j49J16J0J30J83k51K88j28R2k86K12j92M0J75j23
5373D4j2J56k59J00K05k25J65k93K55mo0j52m1J07n2J43P9j51L4r2P4k33j1J88
5397c5l4j43L32k4q2K06j97k5j58J98o4K78k98K34j75J06j78n6K48j79n3j81K12
5420f8Q0J0k57L20o8K48l20M5N4J53k4j53L9j71r4M76k77K3M2j27p2Q4K84l48
5444a21k5O0J97j65q5K94n8l9k22K72k63J18K53nr9r0J33k96J54Ql7q7J17O0k19
5469a45K34l10J36P6j16J11jpL1j26L98k12n2P0R7K7Pk79q1K34o6j02L19l68K3
$$ plain form
5305 -162 120 -179 43 -116 -16 -55 -17 -232 249 245 -83 15 16 -221 287 -287 -56 58 132 76 178 261 13
5328 13 136 39 -63 46 220 304 -26 -88 6 -113 -122 -8 238 166 -27 64 -116 34 107 -105 -210 34 154
5351 154 -136 -168 65 127 -6 -195 -73 -222 -106 -96 34 217 -34 254 126 218 -68 144 -48 -8 167 44
5373 44 32 188 -71 29 234 9 174 -119 136 132 72 -80 -121 -14 -66 77 156 5 39 -53 21 -212 -223 -35
5397 -35 -69 -212 120 96 14 220 23 -2 -160 38 -26 252 -46 188 13 119 -59 -115 133 -46 -99 -280 -68
5420 -68 12 22 -235 85 17 265 -55 -10 44 197 173 20 59 -112 -206 270 -7 16 58 -69 -141 -57 227 -121
5444 -121 -146 -86 111 -54 -139 155 97 58 -164 108 -155 -37 216 211 112 22 155 -141 13 21 -16 -103 14 74 -145
5469 -145 89 -221 -85 -9 -125 -14 -15 -22 9 -117 281 69 17 87 184 211 218 -61 -142 92 26 -76 243 -125 -102
5494a02J35J16j69j01J26k13J20j3P3J72M3l52l1j19K23J41l2K7OQ2J40m08L19
5517A83J91m72R5k20L71l22J15K24j55q3P7O8l16L16k49J47P2J73m0j52P0j6r4
5540a7J55m1P2k28J10P8j93k7O0j94M02nj25K28k30j91L3R9J31J3l86J25L39j47
5564F1q8OR1Q0j36K12k39O3K1K3O6l38K15J77m11K40J30j14n6j8k6R2j35J70r1
5589epl08R9J79l33L87J76l57J17J07k40K77l70L24l45M13K6m12K69O3k20K82
5611A22k65k0N7K15l56K11J84k46r9O8J65J96k14r7K6j17K40j95K07r6L5J91l15
5634a03J11k00K86J00K2k04L3N6j12J8L1K6k41K58j75Q7OK18m12K25k80L57Mk8
5658H3m8K8l5J21j55j98J35J61k98K27J62J68n58K37j56K26n6l26K53P0M5j29
$$ plain form
5494 -102 33 149 -20 -121 5 -208 -88 -101 -28 144 187 -165 -196 -315 -92 49 17 44 50 132 272 -136 183
5517 183 374 -98 -3 -223 148 -174 -59 165 10 -73 4 72 -244 72 -177 -30 42 215 175 23 93 77 -17
5540 -17 138 97 169 -59 51 129 -64 -91 -31 -225 177 172 47 275 45 -146 -113 -14 117 130 -256 -131 208 61
5564 61 -27 -21 70 150 14 226 -13 50 71 94 160 -178 37 214 -197 43 173 59 3 -15 -41 51 -84 86 -5
5589 -5 -12 -320 -221 -42 -375 12 188 -169 -52 55 -185 92 -278 46 -299 114 140 -272 -3 60 -160 122
5611 122 -143 -163 -106 109 -247 -36 148 -98 -197 -129 36 232 18 -79 -53 -170 70 -125 82 -14 21 212 -103
5634 -103 8 -192 94 194 216 12 45 101 -11 7 38 64 -177 81 -94 -7 -1 217 -195 30 -250 107 111 83
5658 83 35 63 28 149 -6 -204 -69 92 -206 21 183 351 -207 30 -126 100 44 -282 -29 41 86 -43
5680d3M2j13J88k27J12L07k12k49J6M12j20k59J10j6L5k6l5j56K87N1j36O0Q5
5703A13k16L11j25j02k0o4J15N8j72L27l39K69l50R0M4q2Q6J02q6L8J02K0k04
5726h5J73rj04j74J58nJ01j54j1K63qk20J46K7M6o1j06l3K49k26J53q6P0r9m4
5751c9K0r6R5Q2l48K52K01j43j81K64k08K92j51j44K55l2k08LJ45Kk66K16q9J66
5775H8j7r9j5K39o9k00j16M11j66k9%J57J20l47r5K23j72R6L5R5l14J39O0M8n2
5800B0j2m8J46k52J26j17q2Q2O7P0N5M8k96M25l24K6J37Pp5l7k23L50k64O5K41
5825A35o9j59O5ko4P5k18J99lp0K60q4l08K13J8K95k23Q9j16L0M2R2n6n0j19m9
5851g7P7k10K37k35K23j55K39rj11m3L24k24qo6j11J00j79j15L45k5J28ro6n2
$$ plain form
5680 -43 -1 -114 74 -153 -41 266 54 -195 -179 233 113 -146 -36 -52 -17 -43 -78 -234 53 104 -32 28 113
5703 113 -103 208 83 -19 -39 -103 12 70 -102 225 -114 155 -195 -105 -61 -143 -57 45 -41 -3 99 119 -85
5726 -85 88 79 -25 -199 -41 -46 55 -99 -110 153 145 -75 71 98 144 83 -23 -56 193 -33 120 34 104 5 -39
5751 -39 -19 -115 -20 62 -286 -34 167 24 -157 107 -101 191 40 -104 151 119 -89 -86 59 61 -205 11 -78 88
5775 88 71 -28 -43 196 127 -73 -189 222 56 27 27 184 304 -43 -138 85 -87 9 44 139 -175 -36 24 72 20
5800 20 8 -40 106 -146 -20 -137 -219 -137 -70 0 55 103 -193 232 -92 -66 71 78 3 -34 -257 93 -171 -106 135
5825 135 66 -93 -28 -30 -94 -19 -237 -38 -41 -111 149 65 -243 -30 -12 283 60 149 33 63 105 197 141 91 -28 -77
5851 -77 0 -210 27 -208 15 -140 99 90 -21 -64 260 36 28 -38 -149 -49 -228 -343 2 -23 105 96 30 -22
5875b2j41K52O5m3j10L0J73k48k97K36l8K68L1J3K6j93n9K81k67p2k19L18P2j31
5899g5J5n6J07J0R3P7r9j22r9j38K10M8J1J53j87J53k59J72j10J80n6m1o7k6J92
5924H6Ol4Mj25K22j4j84J4O4l40K54P3q3n5L1K81j31j44K02l05M13j24o0o7q2
5949i8R3l6r8L47j04l5J36j34k9p9m9J39Q9m62J68L5K51j53K68l18K33k07J49
5972A06o4Q9k69K16o2R3j55L5P0q5J6k9P4j5j28J12l0j55L11k35J10P2m25K77
5996g1j05l9L25pO5k24n5J37N3j49K54k48L04k12qp2N9J19k24O5Kor4J19Q6R7
6022A71n1j61J34p1J19j37m9K34k62j2M2J0j26Q5J20j13k70J65M03j94J38L7j25
6045H7m35L90R1j33q7J38k22J89O8m2j12j86K17k9J37N7n1K7J4k96J18K13L2K81
$$ plain form
5875 -22 -163 89 154 111 1 31 204 -44 -341 -105 -143 125 156 169 195 2 -57 224 -43 -115 -334 -16 56 -75
5899 -75 -60 -116 -9 1 94 171 72 -50 -149 -287 -77 -29 -18 135 -52 101 -158 14 -96 84 28 -13 -80 -106 86
5924 86 92 58 62 -63 159 145 -39 -25 39 -301 -47 26 -57 -112 -81 200 69 -75 127 -178 235 111 51 -16 -98
5949 -98 -5 -41 -139 208 104 69 205 71 42 -37 -86 53 142 -320 -152 -117 134 -19 249 -69 164 -43 106
5972 106 42 131 -138 78 16 109 -46 -11 59 -26 -10 -39 35 20 -108 4 -26 -181 130 -105 5 77 -348 -71
5996 -71 -176 -215 110 103 168 -56 -111 26 79 -70 184 -64 240 28 20 -52 7 126 -98 -33 -31 -37 -131 -12 74 171
6022 171 120 -41 93 22 141 4 -45 189 -73 -85 -43 -33 -159 -74 46 -67 -337 -172 231 37 175 212 87
6045 87 -348 42 133 0 -87 51 -171 18 86 44 -68 -254 -37 -66 71 128 77 104 118 -178 -60 153 185 466
6069D66l36J12J6k69J7kr6K01j82N4j95N6J48m7j16L7L42J8j87J14r1K0k4j0J89
6094B35k25K06k90N2L8K13m07J61k01K94o2j55J71O2N0k5k42L33j39nJ06Pj86
6117iJ11J42k53k3j66Q4o8m5J23L44l60J85K2j23l9J63n5J92k92r2K70n1k4j28
6141i2J58R0j71J62Q7k84J0J78l4l19L52j88O2J1J36j19k5l02J42P4O2q7K21j47
6165b3j20M4R3N2L7p6p5L05j49n3J16Pj74RR6m6j99L79J5j27j67Q0p6m0J79j87
6191a00L6k07K08j45J95q6K38j94K44j48k35K50j91J20J88k82K2R8j85J95q1M1
6213a9j24J25L6L1J37l84l8J92Q8j10J70j87j09pJ55j81J34J19j60K33j0k81K94
6236A04k20M1K26j85L1l8J00k21K65q6N2M5j02k2L9J77l34r0K09J0J34Ql29J8
$$ plain form
6069 466 130 242 258 -11 6 4 -92 109 -73 -19 -214 -158 -10 -57 -173 -136 206 224 37 151 60 80 56 46 235
6094 235 10 216 -74 -22 16 229 -178 -17 -218 76 14 -141 30 92 142 117 -125 208 69 64 170 177 -9
6117 -9 102 244 -9 -32 -198 -114 -182 -227 -104 240 -120 65 87 -36 -75 88 33 225 -67 -159 111 60 36 -92
6141 -92 66 156 -15 147 234 -50 -40 138 104 -215 137 -51 11 22 158 39 14 -288 -146 -72 -10 -97 124 -23
6165 -23 -143 -99 -6 46 83 7 -68 237 88 35 151 158 -16 -7 89 43 -156 223 238 111 -56 24 -52 -92 87 -100
6191 -100 -64 -271 -63 -208 -13 -99 139 -55 189 41 -194 56 -135 -15 173 -109 -87 11 -174 21 -60 -19
6213 -19 -143 -18 18 49 186 -198 -236 -44 44 -66 104 -83 -192 -199 -44 -225 -91 28 -132 101 91 -190 104
6236 104 -116 -75 151 -34 -3 -41 59 -162 103 17 69 114 12 -10 29 206 -128 -218 -9 1 135 143 -186 -168
6260a68K96l2k6m6j39K20j5k34K42j26J95q8j52p4J07J81j15o2P4r0J02r8J47
6283I9j63k2j73L94Q6l23J88q7Q7J54q4k61J18J6q2J27j40pk5J74K9j88J58l7
6307C8Q6rK12k35m7r2o2M6J85Rk3M7J21k92K17l45J01J23k98J84r7L88m46J49
6331d0L67o12M49k38p9L21k05J24k13l9K95Q2l21O7L16l44J67j01j37M5OJ68O3
6354A41k78J83J62l48O2K35p7j10P9j79J53n8k53M12j22o8J86K4j40k46J25O0
6376e7r3J48mm7l9J08r3L5KJ2m4K44j56J1M8j45M9p1P7M3M5Q8j33J35k41K19j54
6403a3j24L16j2l17J73L8j71J20k7j46J10m4o4K36j95J40k75J08J58j50J57j74
6425a56K94k19M4JnJ17q0Ll13M09lJ40l18J19K19j65K66m52L6P3j71J10J99j68
$$ plain form
6260 -168 128 96 70 24 -115 105 90 -144 98 -28 167 79 -73 -147 -40 141 26 -36 38 -52 50 -48 99
6283 99 -64 -86 -259 135 221 -102 86 -1 86 240 156 -105 13 29 -53 74 -66 -73 -98 76 105 -83 75 38
6307 38 124 115 327 92 45 -47 -109 -63 122 131 108 155 276 -16 201 -144 -43 80 -218 -34 -131 257 -189 -40
6331 -40 327 -285 164 -74 -153 168 -37 87 -126 -165 130 212 -109 -42 274 -70 97 -4 -141 -96 -90 78 141
6354 141 -137 46 208 -140 -78 157 80 -30 49 -130 23 -35 -288 124 2 -66 120 144 4 -242 -117 -57
6376 -57 -150 -2 -6 -53 -92 16 -77 -42 -40 -28 -72 172 16 27 75 -70 -21 -92 -15 28 73 161 28 163 -78 141 -13
6403 -13 -137 179 167 -150 23 61 -110 10 -17 -163 -53 -97 -161 75 -120 20 -255 -147 11 -139 18 -156
6425 -156 138 -81 -37 -36 -41 76 -4 -1 -314 95 92 232 -86 33 252 87 353 -99 -63 10 -161 -51 148 -20
6449b0K32j32J22rj0k28R0l9L4M8j01l08M11k04J11r2J01j72J40nl1J33J40j21
6473I0j77K82k31J33p6j52L11j99N4j95K69j50J21k78KJ95j81K82J00l01P3M4
6495A6p9J51j17K70k10q8k5P6K00j30j8r3K5J00q7J71j21J35j81J40j17k18K51
6518E1j66k15K03j01L49K8J9j25j7K04j05j47k19L83j70P8j20J33%N6j04J29k12
6541f8q6m4L97k70Q4j70J83j65J55m4K8o7Rp6M66m03o1K0R4J63k85L04l36R7J07
6566C2J90k70j70M5J29p3M3J22j8J34q3j95K53r4j8J04k07l0J63j3j21J03K12
6589B38k20m7j16L20p7m2j53J94j97K2K7Q3j14N7J66k29K3K36k08J54j80l8o0
6612a61K28j14Lk56K20N5N2K13j22j04lj33J55K10l81K38M2j33o7J31j79kK7n1
$$ plain form
6449 -20 212 80 202 193 183 -45 45 6 40 88 -13 -321 90 -114 -3 -95 6 -166 -26 -31 -62 71 211 90
6473 90 -87 195 -36 97 21 -131 180 -19 35 -160 109 -41 80 -198 -196 -1 -182 100 200 -101 -28 16
6495 16 -63 88 -29 241 31 -57 -82 -6 194 64 46 -47 -22 78 -9 162 41 176 -5 135 18 -200 51
6518 51 -115 -330 -127 -228 121 149 168 43 26 230 125 -22 -241 142 -28 50 -70 63 63 119 15 144 -68
6541 -68 -154 -198 199 -71 13 -157 26 -139 16 -28 0 -67 -58 -134 332 -71 -132 -112 -18 145 -140 164 -172 -75 32
6566 32 222 -48 -218 -173 -44 -117 -74 48 30 164 81 -114 139 45 27 131 -76 -106 57 44 -77 26 238
6589 238 18 -29 -145 175 98 56 -97 97 -100 -78 -51 32 -82 -25 141 -88 -65 171 -37 117 -63 -101 -161
6612 -161 67 -47 -44 -300 -80 -25 27 240 118 14 11 -122 33 243 -138 100 142 9 -58 73 -106 -108 -81 -132
6636a32K03L2K10m86J39m4J67k9n9j56k8K73p7l4J27o8p5N0O5l30K44K5k05K01
6660A3n3r7J68j54L96m47K05J89k25O4j59J10R5j38m3m1j9K77Oj29J4K92m23J95
6684I6p6J23n6J3j72n2J72j22r1K54O2k02L38m66J32J28o9J38k19K02o0o1J9r4
6708f3n3J35l0R8p4m48N89l89K10J86m93L70k06J26J61r3rR7k19k3K1Q4R7j47
6732g3L39k10l1J09k79J66o8Q2Q8k55R9J13j62J20J78j99k3q4J68K62m26K45l92
6755b33J93K0J54q9l1j14Q9R4L5l57j14K91J04k13M20k12ll16K26J20J1j74K5
6778g4o4K50l6J47k63j04J98j38o1K49l3J03k48K91l93L55j35j58J75j78J06k16
6800b27M44r3k61J82rk52L4K21L6o2R5k18Ok0j3J80j25l6J27Q8k31J21J33j70
$$ plain form
6636 -132 71 103 313 -173 -34 -78 89 60 1 -155 -183 90 13 -21 106 38 -37 13 78 -252 -8 17 -188 13
6660 13 -40 -137 31 -123 273 -174 31 220 -5 59 -100 10 105 -33 -76 -117 -136 141 147 18 32 324 -99 96
6684 96 20 143 87 100 -72 -124 48 -74 -165 89 151 -51 287 -179 -47 81 12 150 -69 133 73 12 31 -63
6708 -63 -116 19 -11 87 13 -435 154 -235 -25 161 -332 38 -168 -42 119 26 17 114 -105 -128 -107 -23 74 -73
6732 -73 266 56 25 134 -145 21 -47 35 123 -132 -33 80 -82 38 216 17 -6 -90 78 340 -86 159 -233
6755 -233 -40 -20 134 45 14 -100 -11 83 118 -239 -353 -62 42 -171 249 37 34 -282 -56 64 75 -99 -74
6778 -74 -138 112 76 223 -40 -144 54 -84 -145 104 71 174 -74 217 -176 179 44 -114 61 -117 -11 -227
6800 -227 217 124 -137 45 36 -216 -182 39 75 13 108 -110 -104 -124 -137 43 -82 -118 9 97 -134 -13 120 -50
6824e0O7O9j67M0J54jr1J03kp5q5K4Q9J05L9m31K82k53Q8K00M1j05M2q1j83K20
6850C9R5j12j0K61k45l6j80K44j5J51j72j68L09q5J62k38j20R0R2j82J88l8m9
6873a9p0J94j32j43oo5K39j02J87k79J83J05j02Q8j96J60j96J90O3j74k7k83K83
6896a02J28R2k80P6Rn4J13k09K96O0P2r4k33J80m6J62L8k35p0R2j72L30l98M99
6920B54k99Q3J19k84K08p9J46N7m84M6J35M2m7J00n5P7J7J06j60J01L1J34j73
6943G5r5n6l6L41l35L04q2j35J91j78J00J47l39P0k45K18k6K3K13k5r5J00K7l44
6967a82J21J34j98P1k21j7J59L48m51L10O4rJ36j02m32M15o5K3Lk38k5R9J27p7
6991gk00K19n7J72l32oL49j35K3j78K04k01J76k3j19j11M85k12m9O9j67o9K39
$$ plain form
6824 -50 17 86 -81 -41 113 112 21 124 122 47 -38 -14 75 180 219 -212 70 -183 -95 105 146 41 83 2 -181 39
6850 39 134 22 12 273 28 -8 -188 56 41 192 20 -148 161 76 238 0 -120 -30 62 -120 68 30 -19
6873 -19 -89 105 -27 -170 -176 -241 -2 -104 83 -196 -13 92 -10 78 -118 42 -154 36 99 -75 -102 -385 -102
6896 -102 26 118 -162 -86 -77 -131 -18 -227 69 129 201 107 -126 54 8 170 208 -27 -97 -5 -177 153 -245 254
6920 254 -45 38 157 -127 81 2 148 205 -279 -233 -98 -56 -103 -3 -58 19 36 142 -18 83 114 248 75
6943 75 -20 -76 -112 229 -106 198 116 -19 172 -6 94 241 -98 -28 -273 -55 -81 -58 155 130 35 135 162 -182
6967 -182 -61 73 -125 -54 -275 -292 -133 215 -236 74 138 129 265 163 -269 146 81 104 107 -131 -156 -57 70 -7
6991 -7 -207 12 -45 127 -205 -211 138 3 26 -152 52 -149 27 4 -115 -226 259 47 -2 67 -100 -169 70
7014G0j36J19K7j57k5J87J16j17K46j31m2j68K39nl15k2M5jK88q7k37N3n4K71
7038A64r7j06J22j43J20k62r8M77k75j38K80r8NJ33j04M7k75K26NM6l6K18k15
7061dL9J25j39K82L1l04Q4j64K79l35l0J8K59j83J25l22L28j27R7Lk41R0k8p9
7085a96J33j3M1j23J59Q4q2R6l6kj52K42k32J22k5j51l2P6k01M15K56r9k33m5
7109BJ36Lm6m6R6j11M4Lp8j73J50j84K5J30N1r9j45K29M8M9j6k52P9j28K40o2
7135e5j38K22q3J46k62L52N9m00K53m1L8J0k05J60N3k15k1N2N6j45k3mK63j39
7159f7J00L1n7Q8l59L07j81J76K13l82L38k98l8K42m25M84n8k88J73l6n0JK03
7182A17l60R1O9J1J4j56M7J67J65rn3Q0k8j6k05o7P2r6R4J25j08J60m0j79L38
$$ plain form
7014 70 -66 53 80 -77 -102 85 201 84 330 199 157 -11 228 223 -92 -114 -69 -70 218 131 -106 -53 -107 164
7038 164 67 -39 83 -60 60 -202 -300 177 -98 -236 44 -54 -49 84 -20 27 -248 -22 -17 29 -7 211 -4
7061 -4 35 160 21 303 334 30 114 -50 229 -106 -136 -118 141 -42 83 -239 89 -38 59 62 -179 -89 -117 -196
7085 -196 -63 -76 -35 -158 1 85 3 99 63 61 -91 151 -81 41 16 -135 -167 -91 -292 123 379 280 47 2
7109 2 138 141 95 49 145 34 78 81 3 -170 -20 -204 -179 -49 2 -97 -242 -13 35 84 68 -184 -105 -233 7 -55
7135 -55 -193 29 -54 92 -170 182 241 -159 94 53 91 101 -104 56 109 -106 -127 -75 -19 -164 -187 -191 72 -67
7159 -67 33 64 7 95 -264 43 -138 38 251 -131 207 -91 -129 113 -312 172 114 -174 -1 -37 -87 -86 117
7182 117 -243 -152 -83 -72 -58 -214 -167 0 165 156 103 183 155 139 -66 -133 -61 -157 -63 62 -46 114 74 -105 233
7207B33k27O8k87J66M%K4j51L33l00K80j23O0j46r0l2J30L00k42j22K48k5l29
7230b28J76K22l02J22J8J78N9k99N4L6n4j5K0r5J82N4p3o3j67K30r5J42J16j03
7254A15qK6M8l22J08n4j8L90l10K73j89m6o6O5J13k86K3J8K21l36Q7j32L14%p3
7279c9j05p7K36k14K05j30K95m42M96m71J92M6J8k0k27L92J21k93r1M4j08O8K21
7302A17m7q5j85K25n8J06J0o9j77J67K57l61J72J10k97K53j09j58N7m1m1P9P0
7325eN0P6k83m6J94j99R0K46J6l33J0J26J45j3On6r4J70k57J67O5m3k86J67L3
7350e4K03j12q6Q4j66K15J1J5P0k02j40K01j41N1J75j00j71K18r3No6P0j73J01
7374h5K99j11r1J28k69R4J50k5R5ok72J75R0j15j78K31j27R2j17r4o2J88J29j50
$$ plain form
7207 233 6 74 -213 -47 -43 -43 -19 -170 163 -137 143 20 80 -66 -156 -188 -58 242 0 -122 126 101 -228
7230 -228 -52 170 -132 -10 8 186 245 -54 0 36 -18 -33 -13 -108 74 128 55 -8 -175 55 -40 102 218 115
7254 115 107 133 181 -141 -33 -87 -105 285 -25 248 59 13 -53 12 125 -161 -138 -120 101 -235 -148 -280 34 34 -39
7279 -39 -144 -221 15 -199 6 -124 171 -271 225 -246 -54 -8 10 -10 -237 155 276 -17 -108 -64 -172 -104 117
7302 117 70 -15 -200 25 -33 73 83 14 -163 4 261 -100 72 182 -115 138 29 -129 -72 -113 -154 -75 -5
7325 -5 45 121 -162 -208 -14 -213 -123 123 139 -194 -184 -58 87 74 80 24 -70 100 -157 10 75 32 -254 -87 -54
7350 -54 149 37 -49 35 -131 84 95 110 180 -22 -162 39 -102 -51 124 24 -147 71 -22 -17 -83 -13 -186 -85
7374 -85 214 103 12 140 -129 -35 115 90 185 179 -93 82 172 57 -121 110 -17 75 -42 -136 -198 -10 119 -31
7398c1J57K9j9j72J59j11L9j53J15J32j17J51J13l33K34k53J09J18j25j79J10
7419b7l20J40L22j03K58k97k19K52n1K22r1l83K62K18j71k3n3J22p9k4n6J33K
7442C4o7N2j12k30K83j38K63r3l7j42J72m4q8N9l0k55M11Q8Q6k94J80m3k44J37
7466e2j33J58p1K0l3J78p4J27q9Q5q5k05K95k20J33j36NL08j24k86J1J45R8q7
7490c2J50K3r2k33J09M36n09N7J14O6m1m8k67k2L20J35j31n3k78J91L35j38J2
7513A04k06L74k39j08j4J69k83K57N9j26P7l74L63J37Q1m12L03N7k15J32k6jR7
7536B06r3J10j55j71J27l9j7P0j37p3Qm4J98J11M3j57j48J55o9J72l9N3O7l45
7560a67M2Q2J19k63R1K84m26K43Q4r9J44l72O2oM06k49q1P4N9J19n3r1K13j87
$$ plain form
7398 -31 126 155 136 -36 123 12 51 -102 13 145 28 179 292 -41 193 -60 49 167 42 -137 -27
7419 -27 -347 -207 115 12 270 -27 -246 6 -45 177 86 -297 -35 183 12 -11 -64 58 -21 -45 -101 32 34
7442 34 -33 19 -93 -323 -40 -178 85 -8 -45 -187 -15 -59 -147 -88 -118 -373 38 126 212 -82 98 55 -189 -52
7466 -52 -185 -27 -98 -78 -111 67 -7 120 31 116 31 -174 121 -99 34 -102 -97 211 87 -199 -188 -43 55 -32
7490 -32 118 141 49 -184 -75 361 -148 -91 23 89 48 0 -267 -289 31 166 35 -18 -296 -105 230 92 104
7513 104 -102 272 33 -75 -89 80 -203 54 113 -13 64 -310 53 190 271 -141 162 219 4 136 110 109 206
7536 206 113 223 68 -103 24 -15 -32 38 -99 -172 -164 -208 -10 101 144 -13 -161 -6 -75 97 58 111 178 -167
7560 -167 -125 -43 76 -187 -96 188 -238 5 89 -10 134 -238 -176 -182 224 -25 -106 -32 27 146 93 2 215 28
7584B8p7L69k24l19J23J49K2Jk92J95J17j99P9%J1J01R2m51K67PQ3k43Q5n7k3
7609a56J58j76J15j50R0R0N4J96l54QK18l6j84J55J79k26j63J67O5J20q9R6k71
7632i4O7K74j92j01Oj2J01m5k07J74n2p3J83K11l23p4K57k07K73j28R2k96K83
7655A17k69k0J66K50k66P7j45P8Q1J29j09k72J21J7o1M3m2J50p5J22N6k13K44
7678A79l01J52Q7k62K2OJ79o5J39l28K8L5K72L4l07J53q7Kj71L90k78J95j83k4
7702a33J03j13J08L3P7p2p3P3R9j52L6JK30j29n2J42j7j69j7K13k02j12K36k05
7726i5J51k3K15l30J36L6k30K33J3k37K41p5Q4j96K55j46j51K03k84K10m0r1Q2
7749c9R7Q4k18P4N7J02j42k69L01q4q7J74P9k79J4K86k18l6j12O7J36k7J82m1
$$ plain form
7584 28 -49 320 96 -223 -100 49 71 72 -220 -25 92 -107 -28 -28 -17 84 176 -275 -8 -1 82 -161 -76 -133 -156
7609 -156 2 -174 -59 -209 -119 -29 25 221 -133 -125 93 57 -127 28 207 -19 -182 -15 50 170 81 177 -94
7632 -94 -27 247 55 -46 -40 -52 49 4 -203 -29 -81 -154 29 240 -83 -157 100 -107 166 38 130 -166 117
7655 117 -152 -172 -6 244 -22 55 -90 -12 69 198 89 -183 -62 -45 -106 -63 -105 45 -30 92 148 -65 179
7678 179 -122 30 117 -145 -123 -117 62 -3 136 -192 -164 -129 143 177 -130 23 -64 -62 -233 157 -121 74 -109 -133
7702 -133 -30 -143 -35 -2 75 3 -70 3 102 -50 -14 -13 217 88 36 178 161 -8 -25 188 -14 -126 110 -95
7726 -95 56 33 248 -82 54 90 -140 93 106 -131 110 35 119 -77 178 32 -119 84 -200 10 -30 -121 -39
7749 -39 58 142 -76 -2 55 157 15 -254 47 -37 -124 50 129 -150 -136 150 -68 -104 -216 -149 -13 -40 142 101
7773A01j45k6R5J0R0Mj59K40p3lk15P8K16l56mK95Lk33M9k0O0j04P8K43J7k24
7799A7r8k09L58j9m0J39m6kJ60m14K85k56K71j37j93M1L82k93O4o8J14l0j73M27
7823B80k60m0NM6R6K5j42J3J35n5J30k26R3o7Q8n6k37L55l06M1L7Q9K86n38L59
7848A51j76p6R1mj27q1L52m29L51j89M5K57k60J24M9K8l9k69J48j10L74m42L25
7871I3o1K8r5J89l15J5K85j61n6j51N0R7K29k61K25k72L97m94M58j95j37L8j8
7894a12j33m2J55J39j28P2j72K56P7rj73J58Q7Pl51K91K16m02K18k73L8o1K93
7917A51o3L4k33K13j01j62J70j87J71j19K54m02M91j96K7m0j35K36o9Q8j58k06
7939b36K35l16K95o4J42k6j20J20N7J10j02L92k94j33J41l19J66O5j28l3N9N2
$$ plain form
7773 101 -44 -70 25 35 125 129 -30 210 137 134 -81 -3 213 -143 -147 148 151 -82 -33 -53 7 -97 -19 224 241 17
7799 17 -81 -290 68 49 9 148 102 100 260 -154 131 -125 146 9 -184 -143 239 -54 10 -58 56 26 -147 280
7823 280 20 -20 -15 31 127 152 10 23 158 103 233 7 100 33 121 65 -172 183 -123 -82 -45 44 330 -208 151
7848 151 -25 -101 -10 -14 -141 -222 130 -299 52 -137 -92 165 -95 29 78 106 67 -202 -54 -164 210 -232 93
7871 93 32 60 -35 154 -161 -146 139 -22 -78 -229 -179 -82 147 -114 111 -161 236 -258 200 5 -132 -94 -112
7894 -112 -245 -287 -132 7 -121 -49 -221 35 112 103 -70 88 175 182 -169 122 338 -64 154 -119 -81 -142 151
7917 151 88 122 -111 102 1 -161 9 -178 -7 -126 128 -274 217 21 48 8 -127 109 40 128 -30 -236
7939 -236 -1 -317 -22 -86 56 30 -90 30 87 197 95 487 193 60 201 -118 48 113 -15 -48 11 63
7961F3k3J36k35M71m57J9K01kj04K71n21J64l6j66L86j32M5m95L89j21q5M32J20
7984C20k04k52j29K15L4J74m4j5J10M0mj81K7q5r6j29L66j56J03k19o6L16JK6
8008A52p3o2O5j50K31l25L80l26Q1N2j7kl01M53j89P0l0j60nL82l63q6K40o7P4
8033B4m1p4J23Q4k22P0j21J48j8p9K34k09J72j05j69R8r3L81l65j3O0O6K30j10
8057G1J1J34j87j4o2J54J7o6q1O2R8j89p9K1J46j97K54q9J06j70k4K21K26j81
8081A82l00K21n8O5j46Q0k07J07P3R9J87k13l20K08k1J62J05k95K24k40J64m7
8103C0j52J01mm5m4J34j93K34j66R7m9j40J86N8j23O8K54j85j0K13l11J39j01
8126iO1j1o7n2o6J49n4K72m70J94J22j9P8l05J92p0J35nM3j31M5J18l36L05k48
$$ plain form
7961 63 40 176 -59 412 -45 -26 175 173 69 340 -181 -17 -53 -219 167 35 80 -415 -26 -147 -232 200 320
7984 320 116 -136 -265 -50 -16 158 114 99 209 249 245 64 91 6 -90 -219 147 -9 94 -125 -191 125 126 152
8008 152 79 17 82 -68 163 -162 218 -108 -27 25 8 6 -295 158 -31 39 9 -151 -156 226 -137 -223 17 -50 24
8033 24 -17 -91 32 116 -106 -36 -157 -9 -27 -106 128 -81 91 -14 -183 -85 -178 203 -162 -175 -115 -49 181 71
8057 71 82 216 29 15 -47 107 124 58 -23 39 137 -52 -131 -110 36 -161 93 4 110 -60 -84 137 363 182
8081 182 -118 103 45 110 -36 44 -163 -56 17 116 303 90 -230 -22 -43 119 224 -71 153 -87 77 30
8103 30 -122 -21 -25 -70 -114 20 -173 61 -105 -8 -57 -197 -11 47 -76 -8 246 61 51 264 -47 92 -9
8126 -9 52 41 -26 -78 -144 5 -49 223 -247 -53 69 50 128 -177 15 -55 80 75 118 -13 32 150 -186 119 -129
8151a29J13Q2p7O0j51r9K57n8O8j05qn1M0K0j0P6K3j29J62j69qr3J45J46R0o1
8177A34P8n30K4K80j62K19K7l4o0RK09j71j24j4
$$ plain form
8151 -129 -16 66 -11 49 -102 -201 56 -2 66 -39 -47 -98 -58 -38 -48 28 51 -78 84 -85 -93 -186 -41 105 195 134
8177 134 212 -318 -294 -14 -176 43 70 36 -24 -15 194 23 -101 -115
8191a15
$$ Imaginary data points
##PAGE= N=2
##DATA TABLE= (X++(I..I)), XYDATA
0@%%%%%%%%%%%JrJ6j6J6k4L2l2M0m9N7p2Q8j03J19j36J54j78K05k33K65l03L44
34A82l88M37m91N51o16O88p66Q51r44J046j159J279j410J555j716J891k081K294
52A203k529K789l080L408l781M209m702N281n976O822p878R246j1091J3724j7806
67a0161K5035m1544J47028J4576k69081J31410Q198j07820J03515J35456q8639
78D7973p9227m1079J7261O6466L1293M55J8419q9929q2682Q6236O8543j0211K4564
91E8082m3400p9279M958M1602N0287N1213p0214n1744K2767m9980L1935J39371
103A05598n1955j02229N0016l4853m3950J18073M1129p3605j8757k0055l1561
114f2149O3127M2967q125K46o8300l9154P6471N749j3179Q9074o6270j29325R2424
$$ plain form
0 0 0 0 0 0 0 0 0 0 0 0 0 1 -8 8 -8 8 -16 16 -16 24 -25 32 -40 48 -55 64 -72 82 -96 109 -124 141 -162 182
34 182 -206 231 -260 291 -325 363 -403 448 -496 550 -609 670 -740 815 -901 990 -1091 1203
52 1203 -1326 1463 -1617 1791 -1990 2219 -2483 2798 -3178 3644 -4234 5012 -6079 7645 -10161
67 -10161 14874 -26670 120358 134934 -134147 -2737 5461 -102359 1156 136612 47973
78 47973 -31254 -72333 -55072 11394 42687 43142 61561 -28368 -111050 -24814 43729 33518 58082
91 58082 14682 -64597 -59639 -18037 32250 83463 13249 -38495 -15728 -65708 -33773 105598
103 105598 53643 -48586 1430 -33423 -77373 40700 81829 8224 -10533 -30588 -62149
114 -62149 978 43945 35820 36066 -32234 -71388 5083 10832 -2347 86727 20457 -108868 -16444
127a6444O0210p3870N4609O1243j14161n2259O6563L9869K670j1938m234j0407
139A851n4589K187R8554Q686o4916K260l527l2429K7761M6869L239j1453n5824
152c1331k0281O3612n805j5130O9997l8075j03692O3965M9959n5330M1297M1260
164F0446q5265l3053N7901R501J020J5340j4555k3753k3130J0764N2036P971l8837
177c614O814j1554l4436M1269L6587k5206o13m050m6729K1986M4423j1877M65
190A3465k593l2635k006K0513P182K6931q844m8096O422K1897j1960J5611K9356
203C5243k8973k8504J588J1825K5166M61j6108Q264j4147l4951L9533L6969l4841
216A525l689J3557l4181l370M5179j625j4981M501j6073j2277J4047J9589P415
$$ plain form
127 -16444 43766 -30104 24505 85748 -28413 -80672 -14109 25760 28430 16492 12258 1851
139 1851 -52738 -50551 48003 56689 -8227 -5967 -9494 -41923 -14162 32707 35946 24493 -31331
152 -31331 -51612 12000 6195 -8935 61062 22987 -80705 -16740 33219 -22111 19186 60446
164 60446 -24819 -57872 29 9530 10550 25890 11335 -12418 -35548 -24784 27252 35223 -3614
177 -3614 3200 -8354 -42790 -1521 35066 9860 9247 5197 -41532 -19546 24877 13000 13465
190 13465 10872 -21763 -23769 -3256 3926 30857 22013 -26083 -19661 2236 -9724 5887 35243
203 35243 6270 -22234 -20646 -8821 16345 16806 698 8962 -5185 -40136 -603 36366 1525
216 1525 -2164 11393 -22788 -26158 19021 17396 2415 6916 -9157 -21434 -7387 12202 19617
229A9617j1800k1685N635L773r230K6390J5604l2457j4882J5595n204R400J8696
242A9452j2670q975m101j2222J2808K6553j2185j0041L254j5605L75K0814M100
255A1557n128P34j8791n258J8219O695M43j207j0382o526K398Q69J8967O778k6585
270g217m230J2994r000K027K3757q250j8384K076j327L564J3222J494j1213j686
284b173n774r66J1755N134J218p275j3431J959J4283l639J571R619j4430j1412
298a3561Q558P957K192L616r235n671L318l886O175J2694m603j4431J689J405
312c783O01R451N00n261l339m362j672J1308M256l451l849o959J577N335N37L214
328D103N495j2368r169J0762M889k141K335P82r035k324L541N639N115m896n677
$$ plain form
229 19617 7817 -13868 -8233 -4460 -13690 12700 28304 -4153 -19035 -3440 -8644 756 19452
242 19452 6782 -2193 -6294 -18516 -5708 20845 8660 -1381 1873 -13732 -13357 7457 11557
255 11557 6429 7163 -11628 -16886 1333 8028 8471 7264 -3118 -9644 -7246 -6377 12590 19368 -7217
270 -7217 -11447 1547 -7453 -5426 18331 10081 -8303 -6227 -7554 -3990 9232 10726 -487 -2173
284 -2173 -7947 -8913 2842 7976 9194 1919 -11512 -9553 4730 1091 2662 12281 -2149 -13561
298 -13561 -5003 2954 5146 8762 -473 -6144 -2826 -6712 -537 12157 7554 -6877 -5188 -3783
312 -3783 -3182 6269 6769 1508 -1831 -6193 -7865 3443 7699 4248 399 -6560 -4983 352 889 4103
328 4103 9598 -2770 -11939 -1177 3712 1571 3906 4688 -4347 -6671 -3130 2509 7624 2728 -2949
343b949p65K83Q50P191J017m211k323n665J964Q153K363m863k97l311l253M394
359a422L753K482j366m765n544M571N145j026O69n4l519m989K643O412L961o105
375H46m643L387j241j406M081O281m831p506l36O235K309m804L974K127o971o131
391h629R242O459p011j193L043l462m353O046M788j369m637k073K775j627J036
406i65N325l91p049m47L460p01J050L132K68p347j23M288L44K33J338j577l584
423b746N17K74L802J878k587m016P47M027m223J491O786l350q789L941M718j950
439E20L66q98J901j979n006K402R032j880j1115N138P697r535n069J6958m04j7009
455h881N164R934o931n077R862J746r032k705P702R92m422K268J167k22o138M80
$$ plain form
343 -2949 -3714 -3431 -2581 4610 5627 1416 -907 -6572 -4608 3545 5908 1045 748 -2563 -5816 -1422
359 -1422 2331 4813 3447 -1318 -6862 -2291 2854 1828 2497 2443 -1076 -6065 -3422 2990 6951 846
375 846 -3797 -410 -1651 -3057 1024 7305 2474 -5032 -5368 867 3176 -1628 2346 4473 -2498 -8629
391 -8629 613 7072 61 -1132 1911 -1551 -5904 142 4930 3561 -1076 -3149 -374 -2001 -965
406 -965 4360 3969 -3080 -3527 -67 -768 282 3414 3682 -3665 -3788 500 844 1077 2415 838 -2746
423 -2746 -2229 -1955 1847 3725 1138 -2878 -2131 1896 -2327 -836 5950 2600 -6189 -2248 2470 520
439 520 886 -12 1889 -90 -5096 -2694 6338 4458 -6657 -1519 6178 -3357 -8426 8532 8128 -8881
455 -8881 -3717 6217 -714 -5791 4071 5817 -3215 -5920 1782 2774 -1648 620 1787 1565 -4573 -4093
471d093R812j694r837N732O610j2231k27J3298j661j2957N503Q450j0623p99J0620
486E903k385p336K573M45J236J643m284L638K126p046j326Q746o71n874K291K919
502B598m129j709N282j026j39P42n868K811O119n226l670R280k009r956L989J0438
518G527o365q201J0909M91j0498L683P669m437k186R49p25L400l191k279P306
533D052K83j1393L940J1401r508o394J3811k29j5952Q002J0764j1149k342R080
547D366j402p709K704N229j051m276J016K907k179j200M56M353j246o021K991
562a062N155m800l459Q109r54p199K353N491l767k624N457k427k518K358M07j324
578h04L154k352k262L844j982j207K966K22k984J241J67j058K338r61j262J126
$$ plain form
471 -4093 5719 4025 -5812 -80 6530 -5701 -5928 7370 5709 -7248 -1745 6705 -3918 -4717 5903
486 5903 3518 -3818 -1245 -800 436 2079 -2205 1433 3559 -3487 -4813 3933 3262 -2612 -321 2598
502 2598 -1531 -3240 2042 1016 877 1619 -4249 -1438 4681 -545 -4215 5065 3056 -6900 -2911 7527
518 7527 1162 -7039 3870 4361 -6137 -2454 5215 778 -1408 -459 -1184 2216 -975 -3254 4052
533 4052 4335 -7058 -3118 8283 -1225 -7619 6192 5963 -9989 -1987 8777 -2372 -4714 4366
547 4366 2964 -4745 -2041 3188 2137 -2139 -1123 1784 -395 -1595 -1139 3214 1968 -4053 -1062
562 -1062 4093 -707 -4166 3943 2989 -4210 -1857 3634 -133 -2757 2700 273 -2245 113 520 -804
578 -804 2350 -2 -2264 1580 -402 -1609 1357 1579 -1405 -164 3 -1055 1283 322 -940 186
594A86Q46l629J890M415m343j987M366j50m782K613L850k964l046K891K475m776
610b145R59M058k340k739K080Q25n11L53j894K290L61l715R64M753k360m627N021
627A333J094n216J053N437l557k777L600q9j694l57K414m66j765M81J024l91j012
644h88K084j109o73M33K01m9K84J66r99R15q25m7Q81M46j479K03J172j690O67
663c07J102n97o43N39j88l24J12L49J152k046L94J230q63m01J143K74k288J331
681c1O72o07m72J635j164j032J407m06O1q7M25l60l62K55mN87o67M60n86M41j03
702F2k40L71M13m17j061J442n28k14M65M67j372k4J545j159k9O87l8r39M57O83
722E71o82J71q7L56r92O16K64l89J64j89N34r65J003j4n24NK34r3o01Q20n31M86
$$ plain form
594 186 1032 -2597 -707 3708 -635 -2622 1744 1594 -3188 -575 3275 311 -2735 156 2631 -2145
610 -2145 -1186 2872 532 -2207 -127 698 187 540 -1354 936 1297 -2418 -1454 3299 939 -3688 1333
627 1333 2427 -2789 -1736 3701 144 -2633 967 878 -816 -1173 1241 775 -990 -509 515 124 -888
644 -888 1196 87 -586 -153 48 -1 283 449 -550 365 -460 -507 374 820 -659 -456 716 -974 -307
663 -307 795 198 -445 94 -94 -418 -306 43 1195 -851 -457 773 -90 -491 652 926 -1362 -31
681 -31 641 34 -438 1197 33 -999 408 2 63 -24 401 41 -321 -66 -70 517 -150 310 -276 165 62
702 62 -178 193 606 189 -872 570 42 -172 293 760 -612 -636 909 -250 -279 408 370 -569 -112 571
722 571 -111 60 -27 329 -663 -47 217 -172 -8 -197 337 -628 375 361 -163 -158 76 -17 -618 202 -329 157
744A57j87m70K00M68p0m42Q46m53k62kN77l10l34N56k48j15o59J496q49m33R65
765D31J5p96J3J308j308J65K39k20j22P4P56o00J72k87O34o84j45M24j8Nn39Q58
787C75m28p9K2M19k68l05O87n63M73r20O46K16n69l2N76k23n09R65l16k95l6O58
809D94m8n62M10k38K41n87L13L32o33J5M16m1m77O62n47K52M34q29L70N51k80
830B48j119J186j43l75j22Q23k72n90K47J75M45j307O30P97q12o81J313L27j517
849g47O42N06j23l59n84J189j28j464K26K520k145q27K068Q2k169P84J887j649
867b91k82O93L91m96n49M96O07j42j354J449K00j359L89O52o2r52L95M10K73j025
887e57P51M13j084M73L35k11n39J175j113o3J259r92n77J481Mk480K293L41k106
$$ plain form
744 157 -30 -500 -300 168 98 -344 502 49 -213 -215 362 52 -282 274 26 -89 -748 748 -101 -534 431
765 431 446 -350 -337 971 -337 -172 67 -153 -275 -201 555 -45 127 -160 474 -210 -355 69 51 56 -483 375
787 375 -53 -132 -110 309 41 -264 423 -140 333 -587 59 275 -294 -326 250 27 -482 483 167 -128 -164 494
809 494 446 -116 294 56 297 -290 23 355 -278 -263 153 112 -365 297 -250 2 436 -393 -23 528 248
830 248 -871 315 172 -203 -325 498 226 -364 -117 58 503 -804 -174 623 -189 -870 443 770 -747
849 -747 -105 401 278 -81 -665 524 396 -1068 -842 1678 -467 -1294 774 856 -1313 -529 1358 -291
867 -291 -573 120 511 15 -534 -38 569 427 -927 522 722 -637 -248 404 342 -610 -215 195 468 -557
887 -557 194 607 -477 -4 331 120 -419 756 -357 -420 839 -153 -730 751 755 -1725 568 909 -1197
906a197J200J141j674K37Q73j114J181q97n24J353K00j828N37K187k263l71J999
923A040R1k555Q08K216j808j002J062J675k191o34K168L2k067P34J607j464J5
940b73o6N86P74k014K6K593j108k850L511R6k865J162K026k025p74K476j659j49
958e33J398j085k58J318p52j018K097j288n00J338m14q23N79k53j97P44p90N24
976H7k68K45K9m55N04K38p29m4J309q50j092J766L2j888P76K170l053N58K267
995A602j984m03J577r42k07J305k174J321R23j946P04J842j817j028K463p55j490
1012a009J250O19j251O9P80m40J40m70M20O90j524L28R73n51q37J630j333O1O94
1031B39p22P04j06p30N70R84k089J155J087j944N33R93q04p48J837j090o48J517
$$ plain form
906 -1197 3 1144 -530 -293 580 -534 647 -250 -774 579 779 -1049 -512 1675 -588 -959 1040
923 1040 1131 -1424 -616 1600 -208 -1210 -148 1527 -664 -1298 870 902 -1165 -431 1176 -288 -273
940 -273 -339 247 1021 -993 -967 1626 518 -2332 1179 1275 -1590 -428 1598 -427 -1201 1275 -384 -533
958 -533 865 -220 -478 840 88 -930 1167 -121 -621 717 303 -520 59 -194 -391 353 -437 87
976 87 -181 64 93 -362 142 380 -349 -393 916 66 -1026 740 772 -1116 -340 1830 -1223 -665 1602
995 1602 -382 -785 792 -150 -357 948 -1226 95 1018 -928 -224 1618 -199 -1227 1236 481 -1009
1012 -1009 241 860 -391 -322 458 18 158 -312 108 798 -726 -398 575 24 -813 817 -516 -455 239
1031 239 -483 221 115 -615 -45 939 -1150 5 1092 -852 -319 674 -130 -878 959 -131 -779 738
1049G38r39o91J634m60j412J615n60k69Q96p45j3J006p47p56J615r31r47J327
1067C61j52n58j99N75M0N4n66L67O09r68p3J046k08j200J622o64p35J534p98l79
1087b92R73k47j077J590j036o34J143k86k48M99j51q88J379p39p09J342m84n86
1105d51N45L92j139J266n67m26J135r38k43R59k91j233J718j38j194P66k91p2
1123b02N84R5j048J102o78l13R06o41j00O57l13q61J490l87j025J030O4r51R92
1142D01j36p11J063m73q49J022k7p60K54M60r05O82L00p88O48j63m73M95O28j421
1162g53R09K28p94M23L2l58M13K59j074J103j55p80Q42J94q50M35L51r99O82L01
1182D09r59N71J94o00L02L84r22P04N29j090Q69j83n20K17N86q41K94K01l58L68
$$ plain form
1049 738 -201 -892 742 282 -1130 485 -75 -344 552 -193 -206 800 53 -703 912 -19 -966 361
1067 361 209 -349 -548 27 67 121 -445 -78 531 -437 -510 536 328 -872 750 86 -649 885 87 -292
1087 -292 681 434 -643 947 -89 -723 420 134 -114 385 234 -654 725 -14 -723 619 135 -451
1105 -451 94 486 -653 613 46 -380 755 -183 -426 533 242 -991 727 589 -605 161 -130 -202
1123 -202 382 477 -571 531 -147 -460 446 -195 -295 362 49 -812 678 291 -734 296 360 -591 401
1142 401 265 -446 617 144 -705 317 290 -470 -216 244 -661 21 321 -467 181 18 -455 40 668 -753
1162 -753 156 384 -410 13 45 -313 100 359 -715 388 233 -547 295 489 -361 74 425 -574 108 409
1182 409 -550 21 215 -385 -83 301 -621 83 612 -478 391 208 -312 -95 491 -350 -56 145 -213 155
1202A55J25o96O80L63j261J024K11j012N41L52n45k32O46q45K66N43q30N45K38
1221B68n51J11N43k53r3J08l57N03k78j28j84R41j051N19L62o29L06K46l75J33
1241A41K84m85j12N88p48J91J27k77R0O33n62j26M61l03OJ77j3l22P48n36j15
1262a53K29M4k21K36j84j39N30k00l47L78m96L41P0Po8J32l54J37L53m02K61k00
1284d6l8K5L38l07o3K83l36k05N44M4l69K42k09j69M81l73jK38P8k43K28j38q8
1307h4J14k38J89J7k9k04L76k24n0L9K09q7j91L44j64J27m32L38L69p39L40p0
1329e0J36l77N31n4l44M02n99P03n01J05l9K31m00k8M47l9j65l9K54k41J00J56
1351A89k56q2J0r2J36J67J2j13Q5j42L39n15L60l07J69P9j16N6J23J90l64N3j76
$$ plain form
1202 155 280 -416 264 627 -634 390 601 -411 130 482 -63 -295 351 -494 -228 315 -515 30 268
1221 268 -283 -172 371 118 25 133 -224 279 1 -127 -311 630 -421 98 460 -169 137 383 8 141
1241 141 425 -60 -172 416 -332 -141 -14 -291 -201 432 -130 -256 205 -98 -92 85 72 -250 498 -38 -153
1262 -153 76 120 -101 135 -49 -188 342 142 -205 173 -323 18 88 95 27 159 -195 -58 295 -107 154 -46
1284 -46 -84 -59 279 -28 -91 192 -144 -349 195 239 -130 112 -97 -266 215 -158 -159 79 157 -86 142 4 -84
1307 -84 30 -208 -19 -2 -31 -235 141 -83 -133 -94 115 28 -163 181 17 144 -288 50 419 -320 20 -50
1329 -50 86 -291 240 186 -158 244 -355 348 -153 -48 -87 144 -256 -284 163 124 -41 -80 174 -67 33 189
1351 189 -67 -149 -139 -231 -95 72 84 -29 56 -86 253 -262 98 -209 -40 39 -77 -21 102 292 -72 -19 -195
1374a95L64n33L03K90m86K36J92j35O0m4k33L09J33n13K29J64j85k48L69r5m4
1395f2j69K99K73o49O11k21n9J11Mr2%q7o3K63j75o5J67j57J0jK26j84j59J23
1419e6J68j65k3M52m48J15J54k78J81J16O8m76K88Q4n42K21L66n22K13L70m59
1440a73L51k23n8j82M17j67j07J88J78n30J48K51j73K14p0j20J72ql46j0L60k27
1462a15L12r4M8j49o4L16l07J36R5j16j04P2j80J20L49l83J39J43n3j84j57K95
1484A19J42n17J14J59m7L7M2n0o0K34n79M76k03j43N00j80l1RM5p6J16J4j49J1
1508a7J70J98k96l0Pj99J11jJ34k93J91K68j44j44J64k5j20R9k72K29K60l79K56
1531A67j33L3mL8l9k29J46L36l54P4J84k43Q6m8q7O5O9m0j44K34j71k42M31j75
$$ plain form
1374 -195 169 -364 -61 229 -257 -21 171 36 96 52 -181 128 261 -252 -23 141 -44 -292 77 -18 -62
1395 -62 -231 68 341 -308 303 82 23 134 138 46 46 -41 -104 159 -16 -81 86 -71 -61 -62 164 -20 -179 -56
1419 -56 112 -53 -76 376 -72 43 197 -81 100 216 284 -192 96 180 -362 -141 225 -297 -84 286 -173
1440 -173 178 -45 -103 -285 132 -35 -142 46 224 -306 -158 93 -80 134 64 -56 116 108 -238 -248 112 -115
1462 -115 197 103 151 2 -62 254 -53 83 178 62 -42 30 -150 -30 319 -64 75 218 165 -19 -176 119
1484 119 261 -256 -142 17 -30 7 49 -1 -61 173 -406 70 -133 -276 224 44 13 22 67 -9 107 121 -28 -17
1508 -17 153 351 55 25 32 -167 -56 -57 77 -216 -25 243 99 -45 119 94 -26 73 -199 30 290 -89 167
1531 167 34 67 63 101 62 -167 -21 315 -39 35 219 -24 62 14 -73 -8 61 21 -123 111 -60 -302 129 -46
1555d6O3L1k08R4J51%L11l10l07K06K80k47o9n9J97J70k16k27K85J31k47O5J81
1578B29k12L0K59n40J78J51rj85N2J56P7j40j63L27k91Ml5J21K81k46lp9l5Q2
1602IO3O2J8k86J92L3l01M56k79j85K51J48m36L33Q1o4L7k31J19j93N8p6K23L4
1626F6o3j0R4k9PJ1p0m9J71k27L09p3n9n8P7j38J78l79J17L59k38j33K09j32Q
1651e2Q2r6j56M48k78J95l0O4m72K70p8q6O6n7O1k18M59j00J11m0p3J40l10K51
1675A01j37Q2j72J41J21M7k69Q2kJ76K00l77o7J66l9j1M0k53J26J76k10J65Q4
1698A70K2l06N3Q8j64L14j28k4m3K6j93r6O1M1L31J09n23K38J91p5k14QJ84N3
1722A23k30k36N91j84k17J48L2q7K94m20K39K20k53J0j69N8j6J80m4r7K56l08
$$ plain form
1555 -46 17 48 -160 -66 85 85 396 86 -221 -15 265 18 -51 -110 87 257 41 -186 99 230 -17 48 229
1578 229 17 47 306 -234 -56 95 86 -99 -47 109 186 46 -117 210 -81 -77 -112 9 290 44 41 -38 -73 9
1602 9 72 134 152 -134 58 91 -210 246 -33 -218 33 181 -255 78 159 95 132 -99 20 -173 -115 -191 32 66
1626 66 3 -7 87 58 65 76 6 -43 128 -99 210 137 78 20 97 -41 137 -242 -125 234 -4 -137 72 -60 -52
1651 -52 30 -66 -222 226 -52 143 113 177 -295 -25 -103 -189 -123 -180 -119 -337 122 22 133 93 20 160 -150 101
1675 101 -36 46 -126 15 136 183 -86 -4 -6 170 370 -7 -74 92 53 42 82 -171 -45 131 -79 86 170
1698 170 192 -114 -61 27 -137 177 49 25 -18 8 -185 -281 -220 -179 152 261 -262 -24 167 92 -122 -114 70 123
1722 123 -107 -343 248 64 -153 -5 27 -60 234 -186 53 273 20 30 -139 -81 -97 83 39 -58 198 -110
1744a10J31m3J98n00M77J13k27j57L61l47p3J24J62k22R9m0J13M41l25l76J55
1765d6J90j62j43LM28m22j07M16j8k11K1J59j08J81k78J4J58l5j20K10lr7p9J12
1789F3J54l94J11m4M46j97l50L8J48R8j85R7J30k22PJ25L8j69q5J73M5j3j14J68
1813F8j61M42l83l08M96j45j32j40M76k29j65J12O5P1J04k26J65j38l05K25R3
1834a5J35l52J87J82j83J39O8l41K67k20J3K23n6n3l7N6K49l90J85mJ84l93J48
1857hj73J48L08m75J82K13l12n3M56L4k38j85L1J07m8r5K42p7K18l66O7J52J4
1880A42k63N6J05p6j82K74L30n67P2RL21j72q2R6R7P2k00l26L21M1k83L4K87j05
1904Ak15p7M33J6j67R8JM0l60K14j9K43k54r7J10L6j08r8J20M3K2J58n5R4l39
$$ plain form
1744 -110 21 -22 176 -324 153 266 39 -118 243 -104 -177 -53 109 -113 -14 -54 59 500 175 -201 -46
1765 -46 144 -18 -161 -158 270 -152 -259 157 139 -72 -51 108 0 181 -97 -83 75 40 -80 130 127 30 -49 63
1789 63 217 -177 -66 -110 336 139 -211 -173 -25 73 -112 -15 115 -107 -100 25 63 -106 -191 -18 27 14 -100 68
1813 68 -93 349 -34 -342 154 9 -123 -263 213 -16 -181 -69 -4 67 171 -55 110 -28 -333 -108 -15
1834 -15 120 -232 -45 137 -46 93 161 -180 87 -133 -120 103 47 -6 -43 13 262 -128 57 53 237 -156 -8
1857 -8 -181 -33 275 -200 -18 195 -117 -170 286 320 82 -103 -72 35 -13 -108 134 57 275 -91 -24 128 142
1880 142 -121 -65 40 -36 -218 56 386 -181 -109 -100 221 49 -33 63 160 232 32 -294 27 68 -215 -181 106 1
1904 1 -214 -291 142 158 -9 89 90 130 -230 -16 -35 208 -46 -143 -33 3 -105 -203 -83 -40 -18 140 85 179 -160
1929a60M8J82J52j42k36M11k94n3j6J72%q8k22L07j10J75l96M56jm79j7J94J42
1952B5j16j86L30R4k82Q6M58l77Qk29K74J09p8l11K98Q5m61L7J3M64j77j95J66
1975C5l4J02n66P05n8l32P7L2K87k75l6J18m8p9j77L08nR4l03j9J19k2j07K88
1999A04J28k10j9n6L26m48J38l4N7K09k19J1K65nm35K68q3k1k92L03R5p5m4O0
2023B3K94j81j47K0M9Qj51o1J20L61n94K20K91l56J82l24N03m00m3O8K65j6l09
2046a78nJ47J9N9l88M38J87k83%Q0q2J32m26L79L5q2k56L42J19l86J05K0J13k36
2070a47j19L73m7K2j55J26m5j56J67k56L27j59k20L25K52m84K8M70l53J6k03N4
2092a84N27j55n07Q8M50l09j10K40K58m21KK36L62k87j67J18R2k10m15N37J7k65
$$ plain form
1929 -160 -112 70 222 80 -156 255 -39 -92 -108 64 64 -24 -246 61 -49 126 -270 186 185 -294 -311 -117 25
1952 25 -91 -277 53 147 -135 -49 409 32 40 -189 85 194 116 -195 103 188 -273 -236 -223 241 64 -131 35
1975 35 1 103 -463 242 184 -148 -71 -39 248 -27 -63 55 7 -72 -249 59 54 148 -155 -174 -55 -77 -184 104
1999 104 232 22 3 -53 273 -175 -37 -71 -14 195 -24 -13 252 247 -188 80 -3 -24 -316 -13 82 7 -37 23
2023 23 317 136 -11 9 58 66 -85 -146 -26 335 -259 -39 252 -104 78 -246 257 -143 -186 -118 147 131 -178
2046 -178 -183 -36 -17 42 -346 92 279 -4 -4 76 -6 126 -300 79 114 32 -224 118 237 -149 -44 -24 89 -147
2070 -147 -266 107 60 82 -73 53 8 -148 19 -237 90 -69 -289 36 288 -196 -168 302 -51 -35 -238 -184
2092 -184 343 188 -319 -231 219 -90 -200 40 298 -123 -121 115 477 190 23 141 233 23 -392 145 162 -103
2114a03j37J4M44k73j37q0M63q7k22j4J83o1j48q7M24l1j91lJ22k32N1J19K51
2137B65l37j52L61o4p8k44J43M07o9m97M48O2ml32q1K63k46p0L5J07N01o06K85
2160I7k17Q7r0R7K8N0j00j32M39k63J15l65M15j63J16l29L62j95j05R5K75m0k90
2183a13J27J17o1k30J90J7q7K2l03L71R0j33j65M07k60J78o3j53K1PJ6j4K38k68
2207d9o1J21R5n3j67nN2J77k81J27o6k8l1L14R9l95K38R0j27J02k86J12L75j87
2231A66j93k4K13j63m8n5L6L19k89j84L81k31l05M75M8k21j23K42p9lj7j6L56
2254B85k71Q5k03L9J33j5j74L1K42O3j16J26q5j93K62ql3k30j5J64q9r9M1J52
2278I2j2ljk4L7j12k14J41K14l09J15lK78l41j8K90J12k63l16K18L14l89J84K63
$$ plain form
2114 -103 -240 -226 218 -55 -192 -272 191 104 -118 -132 51 -10 -158 -245 179 148 -43 -46 76 -156 -105 14 265
2137 265 -72 -224 137 73 -5 -249 -106 301 232 -265 183 245 241 -91 -172 91 -155 -225 -190 -83 418 -188 97
2160 97 -120 -33 -123 -26 2 52 -48 -180 259 -4 111 -254 161 -2 114 -215 147 -48 -153 -58 217 177 -113
2183 -113 14 131 70 -160 30 47 -40 -18 -321 50 140 7 -158 249 -11 167 104 -49 -28 -21 -5 -19 219 -49
2207 -49 -110 11 106 53 -114 -119 -67 110 -171 -44 -110 -138 -169 145 244 -151 87 177 50 152 -134 -22 353 166
2231 166 -27 -51 162 -1 -49 -104 -68 251 -38 -222 159 -72 -377 98 146 -75 -198 44 -35 -38 -55 -71 285
2254 285 14 99 -104 -65 68 53 -121 -90 152 215 99 225 140 -53 209 201 168 -62 -77 87 -2 -101 -60 92
2278 92 80 77 76 52 89 -23 -237 -96 118 -191 -76 -79 199 -142 -160 130 242 -21 -337 -119 195 -194 -10 253
2302B53k68J44l96J79L58k44r7J53k4j96N8K32j79J96k05J69n9O4l38K60J39j01
2324I8k84K48k10J56J4j73K22l68L29q4L18l17K63k91K15k81O0J14M7j61n2L4
2346a03R0j00O3j65L64O7m31L66j20J90n87L08n0J91k19m5L48N0k85L5J60m3M6
2369A30k0m9m5n5J51l65L79j00j2J53J20k22J05r3R8l40Q3J55p7k5n7JL17l07
2393g5K00j79K40K0l88L16Mj83k00P08m37J09m17L79p7kK4j25P8k56J38q6L05
2416I6k70J88J58k15K91k74J99l2Qj32O7k18J10%qQ5j52l9Q0Q3r3j60K24k5qj39
2442a76Lo4L41k93J49M4j69K01m0J93j24j08J17Q1l49J54j06K7K31n5j37J03k49
2465b26ML34o2J2j44M8M4n5j32M10k86pJ16p0J34L9j77P0k14J64O2J50m32L28
$$ plain form
2302 253 -15 129 -267 -88 270 26 -71 82 58 -138 -80 152 -27 169 -36 133 74 138 -200 60 199 98
2324 98 -186 62 -148 8 22 -151 71 -297 32 -52 266 -51 212 -79 136 -145 -85 29 76 -85 -137 -103
2346 -103 -13 -113 -50 -215 149 216 -215 151 31 221 -366 -58 -108 83 -136 -181 167 217 -68 -33 127 84 130
2369 130 110 61 16 -39 112 -253 126 26 14 167 287 65 170 77 175 -165 -82 73 -4 -29 -86 -85 232 -75
2393 -75 125 -54 186 206 -182 134 138 -45 -245 463 26 135 -282 97 20 18 42 -83 -5 -261 -123 -209 96
2416 96 -174 14 172 -43 248 -26 173 141 149 17 84 -134 -24 -24 -32 53 -99 -138 -58 25 -68 -228 -4 -29 -37 -176
2442 -176 -173 -237 104 -189 -40 4 -165 36 -4 189 65 -43 74 155 -194 -40 -146 -119 112 57 -80 23 -226
2465 -226 -222 112 50 62 -82 -34 10 -45 -177 233 -53 -60 56 -14 120 159 -18 52 -162 2 64 214 -218 110
2489A10r0q8L31k85n1j1Q4J28j60k38K53k12M69m0n41M39j21R6q5J67R0n31J52
2512a34J90l0J43k50K37k9J66l68Q3k14L8K41l7J4l20K54K39l87K88l3j25K01
2534A67j03K2q1J29j61k5j73M64k42J76j56r5Nj20J52J56k27Q7kj40j35J60O0
2557h2J72Q8l82J63j08K54l69K02K16k20O0L9O2k46O8J03m9L6oQ3k08J50oj08
2581h8o8L81k68n6N9K2j8o2K31j40k8M8j90N7J8m5n0J65k3m9J90l35L16q6j91
2606b10J81l8J03J55l79N0J57j18J88k00L48j16k18J21k77K61Kj95J55l7JJ21
2628E5m3m17M42j43J42r0K33k92J76k0j35K0L4J84m1q6k18J39N8k4m1q4J25N4
2652B8Rl17O4J69rN0J70p3j38p9J20pL8nJ43K3q3j37r6J33J32M0k11M5o2Q8k03
$$ plain form
2489 110 20 -68 263 -22 -73 -84 0 128 -32 -270 -17 -229 240 200 -341 98 -23 73 -12 155 245 -286 -134
2512 -134 56 26 169 -81 156 127 293 -75 8 -206 -168 73 36 50 -270 -16 223 -164 124 91 -34 167
2534 167 64 86 5 134 -27 -52 -225 239 -3 173 17 -78 -73 -193 -41 115 -112 -25 -27 -167 -302 -142 -82
2557 -82 90 178 -204 -41 -149 105 -264 -62 154 -66 -6 33 95 -151 -83 20 -29 7 1 84 -124 26 20 -88
2581 -88 -156 225 -43 -99 -40 -18 -36 -98 133 -7 -35 13 -177 -120 -102 -147 -197 -32 -55 -104 86 -249 67 -19 -210
2606 -210 -29 -67 36 191 -188 -138 19 -99 89 -111 237 121 -97 24 -253 8 10 -185 -30 -67 -66 55
2628 55 12 -405 37 -106 36 -54 179 -113 63 43 -92 -72 -38 146 105 19 -199 -60 -2 -26 -67 -151 -26 28
2652 28 37 -280 -216 -47 -56 -6 164 91 -47 -126 -6 -13 25 20 163 186 103 -34 -130 3 135 175 -36 9 -53 35 -168
2679a68K44k05J18J03j38O7m4K00l12K50n8P5l14J5L66K7n9m08J79L49l98K45
2701A34J55k96j03K9K00k8j52J61k46K40Jj41J22P4m11L8L48k35J68M5j45p4O5
2724e1J03p7j17JJ44j03J03J30l22J74J19o8j97M29k08K5r0l28M00K4J17j03j46
2747d1n5J17l31K14P6J46J46k40j28K83l98R5Q3O7j39Q6l01L82j33Q3K8r7P0p6
2771f3J20J47m37MQ0L67l44K5n3J50K29k90J44o3O5j03N7N6L5Q0k04r4K02o0q1
2796c1j05J10P3o4J14l18R0Rj03Q7N5K13j34j2P9k30L24l81K86%n1l6NK05k94
2821a09J36Q6P9j66O7o3q9K09m10K28J16p1k9L3o0K5O4j00j81M0K89j65r1K10
2845D8M7j35r7%k9L28k63K07M1l27K70R6Q7k38j88K63J25n5l01J34N6oL4M6k08
$$ plain form
2679 -168 76 -129 -11 92 -46 21 -23 177 -135 115 57 132 -182 -167 199 226 167 -241 -62 287 -111 134
2701 134 289 -7 -110 -81 119 91 -61 100 -146 94 95 -46 76 150 -261 -223 125 -110 58 103 -42 -116 -51
2724 -51 52 -25 -142 -141 3 -100 3 133 -189 -15 104 36 -161 268 60 85 -5 -333 67 91 208 105 -41
2747 -41 -96 21 -310 -96 -20 126 272 32 -96 187 -211 -116 -33 34 -105 -19 -320 62 -71 12 40 -57 13 -63
2771 -63 57 204 -233 -229 -149 218 -126 -101 -154 -4 225 -65 79 16 81 -22 35 91 126 206 2 -92 110 50 -31
2796 -31 -136 -26 47 -17 97 -221 -131 -122 -225 -138 -83 130 -4 -16 63 -167 157 -224 62 62 11 -25 -20 185 -109
2821 -109 27 113 192 26 93 30 -59 150 -260 -32 84 13 -16 17 -43 -18 46 -54 -235 -195 94 -71 -162 48
2845 48 95 -40 -137 -137 -166 162 -101 106 147 -180 90 186 273 35 -153 110 235 180 -121 13 69 63 97 143 -65
2870f5M9J75j59J35l02K71k4KP2J8l70J73Q6k8M3k20N6j54K57j28K45LL9M3j16
2895A01j56K02J51m98K50j40j04J31K40j83J41r7j71O5K41k11K61l05Q6O3p5J97
2917A89k04j41K11j11n4K55n5j1k0k66K11L8r4N4k8j6o9k2M6j05N8K85o6J49p2
2942A62j75K63j84q3o4J24J20j80j54K05j37l8oJ89J16j00J43l70L11j54m4O7
2964A1K82k66j89J03J14j01K27r5j51K9Q5Q2n7o9o3J04mrJ5J53k87K22k19J78
2988I5k63qJ47L4j48K08j01J88l06N2J33m9j29O4J74K7k58K04j00l05M18k23P1
3011g5L4n8J47j40J16j4K4NO9k9n9k27J29p3J98K67k96L1j57N2M0j37K30j35j91
3036b49K90j95K01j96J00j9N9k2k5j08J22N0j76L38j22m7l90M88PN1j41l1L0l9
$$ plain form
2870 -65 -16 159 0 135 -167 104 80 82 154 172 -198 -25 61 33 76 -144 -88 -242 15 -113 132 135 174 217 101
2895 101 -55 147 298 -200 50 -90 -194 -63 177 -6 135 38 -133 -68 173 -38 223 -82 4 67 -8 189
2917 189 -15 -156 55 -56 -110 145 90 79 59 -207 4 42 -52 2 -26 -42 -111 -133 -87 -192 -134 151 85 234 162
2942 162 -13 250 66 -17 -81 43 163 -17 -171 34 -103 -141 -147 42 158 58 201 -169 142 -12 -56 11
2964 11 293 27 -162 -59 55 -46 181 86 -65 -36 49 131 74 5 -58 46 42 33 48 201 -86 136 -83 95
2988 95 -168 -176 -29 5 -143 65 -36 152 -154 -102 31 -18 -147 -83 91 118 -140 64 -36 -341 77 -146 -75
3011 -75 -41 -99 48 -92 24 10 34 39 108 79 20 -207 -78 -151 47 314 18 49 -108 -56 -16 -153 77 -58 -249
3036 -249 41 -154 47 -149 -49 -68 -9 -31 -56 -164 -42 8 -168 170 48 1 -389 99 106 157 16 -15 15 -24
3060b4K1l1Q3J55j92j38P4J75N0j96J41J1j39j50J48k5K63k57r6k5R6J2j6m4n1
3085a55J7L35k54j80mj31N19j25Q1j83O8n5K01j14k54K33J4k6J57p7M9Q0k16M8
3109B8J24p3Pk9k26K92k12m8J93p9l10K58J67Ro9j23R0o9K6J26j84K70o7j56Q5
3134C0r8N1J70l04K24k28M33l09N9L5q4K7oJ16L9k1j91K02j12K7n1j98J10L8J87
3159A46K0oj99p4k28J77K87p1k11J51j73r2L56J26k0j05j3Q8k37j34K24K1J5L4
3183H2j39l9J46j16M8O4Pj85K85k35n2R8M9l0j84K05j92J83j77L14k9j57m9K24
3207A21j36J2j45N7K4k9O4p6K35R0j85L6J11o1m5K1m18L87J76j76Q6k68L34k69
3231e4J31j26K06k34K7K99j65R0k62M6P5O9k33K64r8k07N5Q3K35l75L1J22k0j0
$$ plain form
3060 -24 -3 -34 49 204 12 -126 -52 123 173 -23 118 129 -10 -160 -12 -37 226 -31 -127 -152 -56 -44 -60 -104 -155
3085 -155 -138 197 -57 -237 -241 -372 147 22 103 -80 -12 -67 134 20 -234 -1 13 -13 144 67 116 196 -20 28
3109 28 152 79 86 57 -169 123 -89 -137 56 -23 -333 -75 92 101 32 -91 -1 -70 -44 82 -102 168 101 -55 30
3134 30 -68 -17 153 -151 73 -155 278 -31 28 63 -21 6 0 116 155 134 -57 145 33 60 9 -189 -79 -41 146
3159 146 166 160 -39 -113 -341 -164 123 52 -159 -8 -181 -273 83 209 189 84 71 159 -78 -212 12 33 48 82
3183 82 -57 -96 50 -66 -18 46 53 -132 153 -82 -134 -36 13 -17 -201 4 -188 -5 -182 132 103 -54 -103 121
3207 121 -15 -3 -148 -91 -67 -96 -32 -108 127 217 32 68 179 118 73 94 -324 63 239 63 149 -119 215 -54
3231 -54 77 -49 157 -77 -50 249 84 174 -88 -42 33 102 -131 133 35 -172 -117 -34 201 -174 -143 -21 -41 -51
3255e1n7J47m5o5j32L28l60J01J00M6N4j36P9J77j88q0o2L3J36L1j71jJ70k4m6
3280a6PJ30j41R2qR0j75R4m4R9K4j45j82J8M6qK51j66rJ60k11Q9j54j16L18MQ3
3307A30Q7k34r4J11M4Qj7q5J59k48J80j9J6K5k55L87j43j85L9K69k08J78l75K50
3331B0j78J24J67j01m9M4m5K12j38j13K4J66k99J73k26K79l9M2k25L33j22j06
3353e7k7j3k0J63J12l57M48l81j11L50k6j16O2j71k8o9p6N13q5k33M4K24j19P
3377C4n2l4m6j0O6O9q2J17R2j85L0k55K01j77K72j10J28Jj18n8K56L5R6l97M1
3402h6J50k24P1J52k54L35k1k88J64l0K21o0j83J3j9j47J77o1m1K29k7r9q5K05
3426I2j94J78J9j64m1K37q4oK08k74N0j56j0J54l2q4J27O1k28M8k7Q2Q4Q3k27
$$ plain form
3255 -51 -108 39 -6 -71 -203 125 -235 -134 -34 12 66 -70 9 186 -2 -82 -144 -111 25 56 -115 -116 54 30 -16
3280 -16 -9 121 -20 72 64 154 -21 73 29 128 152 7 -175 -157 -111 -119 132 -34 -43 117 -94 -5 -159 -275 43 47 130
3307 130 217 -17 -111 0 44 52 35 -50 109 -139 41 22 38 63 -192 195 52 -133 -94 175 -33 145 -230 20
3331 20 -158 -34 133 32 -17 27 -18 194 56 -57 -33 133 -166 7 -219 60 21 63 -162 171 49 -57
3353 -57 -84 -97 -117 46 158 -199 249 -132 -243 107 81 -35 27 -144 -172 -241 -317 196 111 -122 -78 146 27 34
3377 34 -18 -52 -98 -108 -42 27 -55 62 154 -31 -1 -256 -55 -232 40 -70 58 59 -59 -117 139 174 270 -127 -86
3402 -86 64 -160 -89 63 -191 144 123 -165 -1 -31 190 130 -53 -40 -59 -206 -29 -90 -131 98 71 -28 -113 92
3426 92 -102 76 95 -69 -110 127 43 37 245 -29 21 -135 -145 9 -23 -107 20 81 -147 -99 -126 -44 40 123 -104
3451a04m3o8K97r7L7k03K25m3P8K1q5r0j96K40j11L5K4K61p6r8J18j35R4J8O2
3476A61l00Q2K7O5M4j18m5j60J63J6K77j77j51K3J39m1L0k49L28j18j00J59n7
3499bJ7K2k17n9L88R7k43L6r9L0J73j04J27j00j69J09J61m72N42l03j32O1K20
3522H3k2j11l3J98L6j51J4K9r7j67L35j41J88j64J5r4M9K3k07J64l6K6L60k32
3546F5r1M5j73K33J88k23k2k05P9N5J54k23o2Q4K44j31N9k66J48O7l09J97p0M5
3570a12K4l7K28j86n1j90K99r8k8K11j16J7n6j14L51j30o2p6K49q1J95k94J54
3593I7k76L76k25j09L1J18L98l55K8k82K5Q5Q1k77K65J5k00K53L8j89j71K33K14
3616A73k72L59Kn3J3N1j0m42M00k01m9j2l7J57L7O0l02l6J57r0o1J02L6O5K61
$$ plain form
3451 -104 -147 -215 82 -15 22 -181 44 1 79 100 15 -75 -271 -31 -142 -107 -83 178 102 4 122 -13 81 99 161
3476 161 -139 -57 -30 35 79 -39 -84 -244 -81 -65 212 35 -116 -93 46 5 35 -214 114 -4 -104 55 -2
3499 -2 15 37 -180 -239 149 246 3 39 -60 -30 143 39 166 66 -103 6 167 -305 237 -66 -198 -137 83
3522 83 61 -50 -83 115 151 0 14 43 -54 -221 114 -27 161 -3 12 -82 -33 -10 -217 -53 -89 -63 297 65
3546 65 -26 19 -154 79 267 44 22 -183 -104 -49 105 -118 -180 -96 148 17 76 -190 -42 25 -284 -87 -157 -112
3570 -112 -88 -125 103 -83 -134 -324 -25 -123 -151 60 -56 -39 -95 -209 142 12 -50 -126 123 42 237 -57 97
3593 97 -179 197 -28 -137 -106 12 410 55 83 -199 -174 -89 -8 -285 -20 -5 -205 48 86 -103 -274 -41 173
3616 173 -99 260 262 209 222 273 263 -179 221 20 -29 -41 -78 79 116 176 -126 -162 -5 -95 -156 -54 -18 47 308
3641C08j28l21p1K4J07j24K37n8R0k12L36j60K56k47k10J69m7K11k04J75r0J9
3663F0J25j34l3k8M4n9j7K35r7j18p2mj15K08j16J06L7NJ11j54P3r5P3m8j58P8
3689i3L62l85R9N8k14L36j00k51J25N2k01K27J4k39J87K38k06j75Q9J42l4o4J20
3712H7k5j89K70j9j7n7k04P6k7J89l20J91o8j14M27j89l3q9k1K58n2rL5q8K65
3737B77n72L46k8J83k23k0K21j45P5j87K98k64k1K14j05j21j36J47J48j59L6J12
3759G6M2mL7l15J7J09J45N2j68J71k88K17O1j04j10j73K62m8J90r3k07J66r1J64
3783A08k10K35k00K31J26k24O2l03Q0J89J1m8J02k28PJ27q6L5M4o4l6J88j59j26
3807a39N6J53k10J06K5p2Q5j35M41k69o1L5j96J78j51K86l96L03k91M11j57J11
$$ plain form
3641 308 180 -141 -212 -188 -81 -205 32 -26 64 -148 188 28 284 37 -173 -4 -51 160 -44 131 41 60
3663 60 185 51 18 -10 34 -25 -42 193 96 -22 -94 -98 -213 -5 -121 -15 22 27 138 -16 57 -38 35 -13 -171 -93
3689 -93 269 -116 -17 41 -173 163 63 -188 -63 -11 -212 15 29 -210 -23 215 9 -166 -77 65 31 -33 87
3712 87 62 -127 143 124 107 50 -154 -78 -105 84 -236 -45 -113 -227 200 11 -22 -111 -132 126 74 65 100 12 277
3737 277 -295 51 23 206 -17 -37 184 39 114 -73 225 -39 -60 154 49 -72 -208 -61 87 -72 -36 76
3759 76 118 114 151 -164 -147 -38 107 159 -9 162 -126 91 152 48 -62 -235 27 -21 169 76 -131 35 -56 108
3783 108 -102 133 -67 164 290 66 128 -175 -95 94 105 57 159 -69 -62 65 -21 14 58 -6 -42 146 -13 -139
3807 -139 -83 70 -140 -34 -9 -81 4 -131 310 41 -20 15 -181 -3 -154 132 -264 39 -252 159 2 113
3829A13N9j86M9l7m6j4J44k51M07k58jj7j3P5J2k63K19k45K86J07p5j63L44l24
3853g8OJ05J76l72L42k00j64R4J82j29QR6k92L08j84K19q5j12J91j91P7N8J93
3876B48k02k13K5J6N9m6L4O7m5j78k2K47n5K19k93J03K05m05K38j76O1j11K27
3899Cj00M1QK82j88r5n1O9q2P5O4J18j24N8k21rL05K7j65J75l92J74q4K16j9l09
3925b24K74n8K47j61r9q6K71r5J2M0r2p3n9J47N6j10j25j5k9R1J33o2O3j27J44
3950F3k2l28N52k32J14j30j23K45P1k37J14O4q3m2K41l34J66K7j16R4k12O8Lj14
3974a51Q9mj31L15j12J35k32K5J70k0m1M7j46R5J22j9p8k10J17L2k1J07L1q5L7
3999G2j40J64o1n0r3J21j62K28j36M5K1K57k79m6j15M1JJ01j16Q4J96m32K45P1
$$ plain form
3829 113 172 -14 35 -2 -48 -62 82 -169 238 -20 -21 -38 -51 24 36 -227 -8 -253 33 140 65 -98 246 -78
3853 -78 -72 33 209 -163 179 -21 -185 -91 91 -38 -30 66 -226 82 -102 117 32 -80 111 -80 -3 55 248
3876 248 46 -167 -142 -126 -67 -113 -79 -12 -57 -235 -257 -10 -65 154 -139 -36 169 -236 2 -174 -113 -224 3
3899 3 -97 -56 -48 234 46 -49 -100 -31 -113 -38 26 144 20 78 -143 -152 153 180 15 190 -202 -28 -112 104 85 -224
3925 -224 50 -8 239 78 -21 -107 164 69 81 121 29 -44 -103 44 100 -10 -135 -150 -179 -88 45 -17 46 -81 63
3950 63 41 -287 265 33 147 17 -106 139 210 -27 87 151 68 26 267 -67 99 126 10 104 -108 -40 -37 -151
3974 -151 -62 -66 -197 118 6 141 -91 -66 104 84 43 90 -56 39 161 142 64 -146 -29 3 -18 89 120 35 72
3999 72 -68 96 35 -15 -108 13 -149 79 -57 -12 9 266 -13 -59 -174 -133 -132 -31 -147 -63 133 -299 -54 17
4023A7j36q7M72k26N0j20J02J09l66N20j19j83k98J87O9L52m04m9l4K9J9O9J45
4046A18n9J52jk92J83k61K37j65n6K57p3k37K20K3j12m6L5q4q1J54L80k94J58
$$ plain form
4023 17 -119 -206 266 40 90 -30 72 181 -185 335 216 33 -265 -78 -9 343 -61 -110 -144 -115 -96 -27 118
4046 118 59 211 210 -82 101 -160 77 -88 -144 113 40 -197 23 46 -66 -112 -77 -161 -242 -88 292 -2 156
$$ [...]
8191B19
##END NTUPLES=NMR FID
##END=
