##TITLE=1H_Pr Glu_Cl
 CDCl3, 8 sc, 
 28.06.2021
##JCAMPDX= 6.0         $$ Bruker NMR JCAMP-DX V2.0
##DATA TYPE= NMR FID
##DATA CLASS= NTUPLES
##ORIGIN= UXNMR, Bruker Analytische Messtechnik GmbH
##OWNER= root
$$ XWIN-NMR		Version 3.5
$$ Mon Jun 28 11:39:27 2021 Russian Standard Time (UT+4h)  she@DPX200
##.OBSERVE FREQUENCY= 200.131506
##.OBSERVE NUCLEUS= ^1H
##.DELAY= (6, 6)
##.ACQUISITION MODE= SIMULTANEOUS
##.ACQUISITION SCHEME= undefined
##.AVERAGES= 8
##.DIGITISER RES= 18
##SPECTROMETER/DATA SYSTEM= spect
##.PULSE SEQUENCE= zg30
##.SOLVENT NAME= CDCl3
##.SHIFT REFERENCE= (INTERNAL, CDCl3, 0, 15.7039)
##AUDIT TRAIL= $$ (NUMBER, WHEN, WHO, WHERE, WHAT)
$$ ##TITLE= Audit trail, XWIN-NMR		Version 3.5
$$ ##JCAMPDX= 5.01
$$ ##ORIGIN= Bruker BioSpin GmbH
$$ ##OWNER= she
$$ F:/spectra/data/she/nmr/H-F/1/audita.txt
$$ ##AUDIT TRAIL=  $$ (NUMBER, WHEN, WHO, WHERE, WHAT)
(   1,<2021-06-28 11:37:46.87 +0400>,<she>,<DPX200>,
      <created by zg, POWCHK disabled, PULCHK disabled
       configuration hash MD5:
       00 E9 B6 7A A2 85 ED C7 34 08 36 98 17 FE 4E 26
       data hash MD5: 16K
       18 A0 BF 8B FB B7 C7 1C CB 4F 03 6E F2 93 9D AE>)
$$ ##END=
$$ 
$$ hash MD5
$$ F2 5F 85 B2 CA A1 17 06 49 0E FE 44 89 22 30 7E
##$RELAX= 
##$RELAX= 
##$RELAX= 
##$RELAX= 
##$RELAX= 
##$RELAX= 
$$ Bruker specific parameters
$$ --------------------------
##$DU= <F:/spectra>
##$EXPNO= 1
##$NAME= <H-F>
##$PROCNO= 1
##$TYPE= <nmr>
##$USER= <she>
##$AMP= (0..31)
100 100 100 100 100 100 100 100 100 100 100 100 100 100 100 100 100 100 
100 100 100 100 100 100 100 100 100 100 100 100 100 100 
##$AQSEQ= 0
##$AQ_mod= 1
##$AUNM= <au_zg>
##$AUTOPOS= <>
##$BF1= 200.13
##$BF2= 200.13
##$BF3= 200.13
##$BF4= 200.13
##$BF5= 200.13
##$BF6= 200.13
##$BF7= 200.13
##$BF8= 200.13
##$BYTORDA= 1
##$CFDGTYP= 0
##$CFRGTYP= 5
##$CHEMSTR= <none>
##$CNST= (0..31)
1 1 145 1 1 1 1 1 1 1 1 1 1 1 1 1 1 1 1 1 1 1 1 1 1 1 1 1 1 1 1 1 
##$CPDPRG= <>
##$CPDPRG1= <>
##$CPDPRG2= <>
##$CPDPRG3= <>
##$CPDPRG4= <mlev>
##$CPDPRG5= <mlev>
##$CPDPRG6= <mlev>
##$CPDPRG7= <mlev>
##$CPDPRG8= <mlev>
##$CPDPRGB= <>
##$CPDPRGT= <>
##$D= (0..31)
0 1.2 0 0 0 0 0 0 0 0.06 0 0.03 0 0 0 0 0.0002 0 0 0 0 0 0 0 0 0 0 0 0 
0 0 0 
##$DATE= 1624865866
##$DBL= (0..7)
120 120 120 120 120 120 120 120 
##$DBP= (0..7)
150 150 150 150 150 150 150 150 
##$DBP07= 0
##$DBPNAM0= <>
##$DBPNAM1= <>
##$DBPNAM2= <>
##$DBPNAM3= <>
##$DBPNAM4= <>
##$DBPNAM5= <>
##$DBPNAM6= <>
##$DBPNAM7= <>
##$DBPOAL= (0..7)
0.5 0.5 0.5 0.5 0.5 0.5 0.5 0.5 
##$DBPOFFS= (0..7)
0 0 0 0 0 0 0 0 
##$DE= 6
##$DECBNUC= <off>
##$DECIM= 32
##$DECNUC= <off>
##$DECSTAT= 4
##$DIGMOD= 1
##$DIGTYP= 9
##$DL= (0..7)
0 120 120 120 120 120 120 120 
##$DP= (0..7)
150 150 150 150 150 150 150 150 
##$DP07= 0
##$DPNAME0= <>
##$DPNAME1= <>
##$DPNAME2= <>
##$DPNAME3= <>
##$DPNAME4= <>
##$DPNAME5= <>
##$DPNAME6= <>
##$DPNAME7= <>
##$DPOAL= (0..7)
0.5 0.5 0.5 0.5 0.5 0.5 0.5 0.5 
##$DPOFFS= (0..7)
0 0 0 0 0 0 0 0 
##$DQDMODE= 0
##$DR= 18
##$DS= 0
##$DSLIST= <SSSSSSSSSSSSSSS>
$$ [...]
##$SUBNAM2= <"">
##$SUBNAM3= <"">
##$SUBNAM4= <"">
##$SUBNAM5= <"">
##$SUBNAM6= <"">
##$SUBNAM7= <"">
##$SUBNAM8= <"">
##$SUBNAM9= <"">
##$SW= 20.0188882624521
##$SWIBOX= (0..15)
0 0 2 0 0 0 0 0 0 0 0 0 0 0 0 0 
##$SW_h= 4006.41025641026
##$TD= 16384
##$TD0= 1
##$TE= 0
##$TE2= 300
##$TE3= 300
##$TEG= 300
##$TL= (0..7)
0 120 120 120 120 120 120 120 
##$TP= (0..7)
150 150 150 150 150 150 150 150 
##$TP07= 0
##$TPNAME0= <>
##$TPNAME1= <>
##$TPNAME2= <>
##$TPNAME3= <>
##$TPNAME4= <>
##$TPNAME5= <>
##$TPNAME6= <>
##$TPNAME7= <>
##$TPOAL= (0..7)
0.5 0.5 0.5 0.5 0.5 0.5 0.5 0.5 
##$TPOFFS= (0..7)
0 0 0 0 0 0 0 0 
##$TUNHIN= 0
##$TUNHOUT= 0
##$TUNXOUT= 0
##$USERA1= <user>
##$USERA2= <user>
##$USERA3= <user>
##$USERA4= <user>
##$USERA5= <user>
##$V9= 5
##$VALIST= <valist>
##$VCLIST= <CCCCCCCCCCCCCCC>
##$VD= 0
##$VDLIST= <DDDDDDDDDDDDDDD>
##$VPLIST= <PPPPPPPPPPPPPPP>
##$VTLIST= <TTTTTTTTTTTTTTT>
##$WBST= 1024
##$WBSW= 4
##$XGAIN= (0..3)
0 0 0 0 
##$XL= 0
##$YL= 0
##$YMAX_a= 461858
##$YMIN_a= -500741
##$ZGOPTNS= <>
##$ZL1= 120
##$ZL2= 120
##$ZL3= 120
##$ZL4= 120
##$ABSF1= 10
##$ABSF2= 0
##$ABSG= 5
##$ABSL= 3
##$ALPHA= 0
##$AQORDER= 0
##$ASSFAC= 0
##$ASSFACI= 0
##$ASSFACX= 0
##$ASSWID= 0
##$AUNMP= <proc_1d>
##$AZFE= 0.1
##$AZFW= 0.1
##$BCFW= 1
##$BC_mod= 2
##$BYTORDP= 1
##$COROFFS= 0
##$CY= 11.3945322036743
##$DATMOD= 1
##$DC= 2
##$DFILT= <>
##$DTYPP= 0
##$F1P= 15.9154993809931
##$F2P= -4.1035820241983
##$FCOR= 0.5
##$FTSIZE= 0
##$FT_mod= 4
##$GAMMA= 1
##$GB= 0.15
##$INTBC= 1
##$INTSCL= 1
##$ISEN= 128
##$LB= 0.24
##$LEV0= 0
##$LPBIN= 0
##$MAXI= 10000
##$MC2= 0
##$MEAN= 0
##$ME_mod= 0
##$MI= 1.114404
##$NCOEF= 0
##$NC_proc= 0
##$NLEV= 6
##$NOISF1= 3.799351
##$NOISF2= 2.8
##$NSP= 1
##$NTH_PI= 0
##$NZP= 0
##$OFFSET= 15.70392
##$PC= 1
##$PHC0= -11571.85
##$PHC1= 8.80101
##$PH_mod= 1
##$PKNL= yes
##$PPARMOD= 0
##$PSCAL= 0
##$PSIGN= 0
##$REVERSE= no
##$SF= 200.130013532006
##$SI= 16384
##$SIGF1= 3
##$SIGF2= 2
##$SINO= 400
##$SIOLD= 16384
##$SREGLST= <1H.CDCl3>
##$SSB= 0
##$STSI= 0
##$STSR= 0
##$SW_p= 3612.71676300578
##$SYMM= 0
##$S_DEV= 0
##$TDeff= 0
##$TDoff= 0
##$TI= <>
##$TILT= no
##$TM1= 0
##$TM2= 0
##$TOPLEV= 0
##$USERP1= <user>
##$USERP2= <user>
##$USERP3= <user>
##$USERP4= <user>
##$USERP5= <user>
##$WDW= 1
##$XDIM= 8192
##$YMAX_p= 0
##$YMIN_p= 0
$$ End of Bruker specific parameters
$$ ---------------------------------
##NTUPLES= NMR FID
##VAR_NAME=  TIME,          FID/REAL,        FID/IMAG
##SYMBOL=    X,             R,               I
##VAR_TYPE=  INDEPENDENT,   DEPENDENT,       DEPENDENT
##VAR_FORM=  AFFN,          ASDF,            ASDF
##VAR_DIM=   8192,          8192,            8192
##UNITS=     SECONDS,       ARBITRARY UNITS, ARBITRARY UNITS
##FACTOR=    0.0002496,     1,               1
##FIRST=     0,             0,               0
##LAST=      2.0444736,     0,               0
##MIN=       0,             -500741,         0
##MAX=       2.0444736,     461858,          0
$$ Real data points
##PAGE= N=1
##DATA TABLE= (X++(R..R)), XYDATA
$$ [...]
$$ plain form
2517 2414 819 -1779 -1657 1102 1821 -433 -2182 -674 2020 1238 -1961 -1854 1089 1856 -596 -2231
2533 -2231 -128 2070 363 -1605 -1114 1271 1598 -833 -1661 -79 1589 1073 -1501 -965 1475 1543 -415
2550 -415 -1592 148 1882 293 -1532 -835 1274 1414 -648 -1334 548 1380 -72 -1137 -522 1511
2566 1511 1031 -943 -1132 412 1465 -60 -1269 -521 1247 555 -877 -910 668 1358 -321 -1062 -259
2583 -259 896 819 -695 -584 652 769 -270 -1109 -459 1017 59 -856 -684 113 587 -282 -923 -230 686
2602 686 280 -731 -871 514 896 -643 -900 -104 535 380 -770 -496 223 621 -212 -954 85 762
2620 762 119 -781 -500 654 748 -374 -776 238 553 366 -1098 -508 956 764 -114 -673 109 853 297
2639 297 -650 -565 648 845 -229 -850 361 1169 108 -643 -356 524 843 -647 -660 316 781 279 -916
$$ packed form
2517B414j595k598J22K759P19k254j749J508K694p82l199J07K943P67k452j635
2533b231K103K198j707j968M91K385L27k431q28J582J668n16k574N36K440O8j958
2550d15j177J740J734j589j825O97K109J40k062o86J882Q32j452j065O15K033
2566A511m80j974j89J544J053j525j209P48J768o92j432l3J578O90j679p41Q03
2583b59J155p7j514J11J236J17j039q39O50J476r58r15J72P97M74q69o41O93R16
2602F86m06j011j40J385L82j539k57P96O39j55j150K74P19L98q33p42J039O77
2620G62o43r00K81J154R4j122m02J014L15j87j464N90J464j92q78n59P82P44n56
2639B97r47Q5J213J97j074o21J211Q08j061p51K87Q80L19j490j3R76M65n02j195
$$ plain form
2658 -916 -389 880 549 -581 -836 331 1368 -59 -934 -71 545 939 -508 -728 278 859 -1 -1001
2676 -1001 -408 719 696 -765 -909 471 835 4 -1201 -412 925 576 -696 -1335 251 1302 -288
2693 -288 -1532 -738 875 745 -1034 -1458 559 1404 -95 -1610 -666 1465 498 -1186 -1301 503 1633
2710 1633 -316 -1574 -324 1510 1164 -1037 -1864 1002 1999 -203 -1828 -237 2225 825 -1631 -998
2726 -998 1364 1483 -364 -1574 -130 1994 1239 -1410 -1592 1265 2242 -327 -2671 -166 2621 1029
2742 1029 -2036 -1318 2096 2037 -1347 -2135 542 2272 718 -1866 -1167 1285 2308 -537 -2861 34
2758 34 3024 925 -2701 -1822 2528 2426 -1965 -2649 1396 2460 -267 -2496 -925 1896 1807 -1096 -2381
2775 -2381 45 2732 702 -3198 -1992 2881 2524 -2633 -3365 1758 3439 -1157 -3051 -341 2635
$$ packed form
2658i16N27J269l31j130k55J167J037j427q75Q63O16L94j447k20J006N81q60j000
2676a001N93J127k3j461j44J380L64q31j205P89J337l49j272o39J586J051j590
2693b88j244P94J613j30j779m24K017Q45j499j515R44K131r67j684j15J804J130
2710A633j949j258J250J834l46k201q27K866R97k202j625J591K462j400k456O33
2726i98K362J19j847j210J444K124p55k649j82K857R77k569k344K505K787j592
2742A029l065P18L414n9l384p88K677J730j554k584O99K452J023k845k324K895
2758C4K990k099l626Q79M350j02m391o84M045J064k727k229J571K821q9k903j285
2775b381K426K687k030l900J206M873l57n157p32N123J681m596j894K710K976
$$ plain form
2790 2635 1390 -1969 -2009 605 2785 472 -2923 -1566 3100 2778 -2551 -3847 1803 4244 -1044 -4273
2806 -4273 129 3680 754 -3372 -1817 2233 2418 -651 -2639 -830 2814 2292 -2265 -3503 1901
2821 1901 4572 -927 -4837 -50 4913 958 -4129 -1684 3268 2518 -2105 -2596 642 2820 1135
2836 1135 -2511 -2568 1847 3720 -708 -4656 -224 5471 1222 -5120 -2094 4346 2920 -3438 -3479 1987
2852 1987 3074 -212 -2819 -1375 1969 2531 -1037 -3916 -257 4595 1239 -5088 -2487 4411 3168
2867 3168 -3870 -4220 3017 4106 -1852 -3889 86 2716 980 -2073 -2643 541 3526 854 -4151
2882 -4151 -2480 4174 3672 -3816 -4439 2796 4829 -2219 -5055 617 4234 579 -3482 -1872 2129
2897 2129 2446 -301 -2878 -1451 3301 2764 -3115 -4107 2419 5227 -1544 -5406 600 5505 660 -4581
$$ packed form
2790B635j245l359m0K614K180k313l395J357M666l22n329j296N650K441n288l229
2806d273M402L551k926m126J555M050J85l069j988J809L644n22m557j238N404
2821A901K671n499l910M787M963l955n087K445M952p50m623m91L238K178j685
2836A135l646n7M415J873m428l948M432N695m249o342L026O440j426o358m1N466
2852A987J087l286k607J444L344N62l568k879L659M852l356o327K601O898j243
2867C168p038l50P237J089n958k037L975K630j736l053n70L184K985k672n005
2882d151J671O654n02p488o23P235K033p048k836N672L617l655m061J610M001
2897B129L17k747k577J427M752n37n879r92O526K808o771l862O006M905m845n241
$$ plain form
2913 -4581 -1322 3363 2330 -2182 -2598 250 2690 1722 -2657 -2973 2023 4264 -1151 -5103 407 5363
2929 5363 650 -5179 -1604 4436 2423 -3194 -2904 2117 3004 -157 -2761 -1552 2173 2608 -1106 -3908
2945 -3908 72 4772 868 -4921 -1989 4596 2724 -3664 -3421 2534 3438 -1693 -3400 -209 2362
2960 2362 1381 -1771 -2541 396 3086 548 -3713 -2193 3818 2526 -3435 -3310 2360 3950 -1673 -3933
2976 -3933 676 3150 369 -2774 -1461 1575 2211 -358 -2685 -1001 2896 2644 -2530 -3113 2330 3708
2992 3708 -1443 -3858 657 3846 -24 -3330 -1193 2361 1900 -1371 -2297 423 2341 1120 -2209
3007 -2209 -1992 1974 2807 -1226 -3231 610 3467 419 -3521 -1007 3043 1541 -2030 -2051 1210 2156
3023 2156 -272 -2092 -901 1542 1808 -1179 -2392 117 2685 333 -3009 -1016 2853 1163 -2284
$$ packed form
2913d581L259M685j033m512m16K848K440r68m379l16M996K241n415l952N510M956
2929E363m713n829L575O040k013n617K90N021Q87l161k604J209L725M35l714k802
2945c908L980M700l904n789K932O585j872o388K43N955R04n131j707L191K571
2960B362r81l152p70K937K690k538m261J520O011j292n961J25N670J590n623k260
2976c933M609K474k781l143J313L036O36k569k327J684L897k52n174n83N443J378
2992C708n151k415M515L189l870l306K137L554m61l271r26K720J918j221l329
3007b209K17L966Q33m033k005L841K857l048l940K514M050j502l571k1L261R46
3023B156k428j820J191K443K66k987j213K509K568k352l342J993L869j690l447
$$ plain form
3038 -2284 -2064 1378 1959 -815 -2267 -138 1611 864 -1553 -1702 831 1999 -287 -2285 -732 2121
3054 2121 1300 -2046 -1683 1546 2070 -952 -2056 88 1857 243 -1554 -1225 1021 1461 -648 -1542
3070 -1542 -44 1782 803 -1841 -1373 1131 1807 -799 -1977 523 2167 136 -1609 -334 1318 1104
3086 1104 -954 -1176 563 1520 182 -1242 -750 1421 1165 -874 -1268 655 1270 40 -1223 -92
3102 -92 1426 827 -796 -1126 770 1064 -75 -1036 -133 1061 649 -929 -1000 651 1097 -218 -1148 -88
3120 -88 1085 494 -982 -524 544 1096 -464 -1099 38 921 258 -701 -666 448 636 -435 -1017 -197
3138 -197 946 313 -932 -418 604 461 -276 -1129 275 938 -78 -908 -616 493 784 -492 -780 257
3156 257 685 -16 -646 -272 804 350 -593 -419 313 893 91 -727 -263 783 482 -632 -585 447 725
$$ packed form
3038b284K20L442N81k774j452K129J749p47k417j49K533J168k286j998J553K853
3054B121q21l346L63L229N24l022j104K144J769j614j797L29K246M40k109q94
3070a542J498J826r79k644M68K504O76k606j178K500J644k031j745J275J652k14
3086A104k058k22J739R57j338j424M92K171k56k039l94J923O15j230j263J131
3102i2J518n99j623l30J896K94j139r61R03J194m12j578p1J651M46j315r30J060
3120h8J173n91j476M58J068N52j560o35J137Q83o63r59L5J114J88j071n82Q20
3138a97J143o33j245N14J022j43p37q53J404O63j016q30K92J109K91j276k88J037
3156B57M28p01o30L74J076m54r43J74P32N80q02q18M64J046l01j114M7J032K78
$$ plain form
3175 725 -235 -556 43 551 320 -415 -308 434 582 -89 -590 -78 585 272 -344 -474 -3 631 -169 -351
3195 -351 208 769 279 -234 -548 240 557 -355 -492 -300 464 245 -639 -465 463 663 -107 -857 -121 802
3215 802 99 -557 -538 384 558 -378 -870 -136 634 413 -648 -727 369 569 -250 -767 -38 862 262 -704
3235 -704 -366 594 701 -325 -719 162 783 224 -785 -549 698 728 -572 -931 273 962 202 -738 -344
3254 -344 1006 461 -126 -843 103 1015 149 -583 -729 935 1052 -350 -932 410 1119 235 -1027 -351
3272 -351 1339 830 -524 -817 217 968 181 -795 -570 784 681 -425 -1186 376 1438 190 -1269
3289 -1269 -521 1493 733 -982 -912 535 895 -71 -1296 -560 1085 622 -694 -1094 343 1481 215
3306 215 -1673 -416 1512 1128 -1269 -1396 851 1345 -680 -1529 -216 1221 714 -982 -1256 366 1304
$$ packed form
3175G25r60l21N99N08k31p35J07P42J48o71n01N12O63l13o16j30M71O34q00j82
3195c51N59N61m90n13l14P88L17r12j37J92P64k19q84J74R28K00p70p50P36R23
3215H02p03o56J9R22J74r36m92P34P70k21j061p9J096K00q19n17P29R00o00r66
3235g04L38R60J07j026l94Q81O21n59j009K36J247L0j300l59J204O89p60r40L94
3254c44J350n45n87p17R46R12q66p32j46J664J17j402n82J342P09q84j262O76
3272c51J690n09j354k93J034P51p87r76K25J354j03j106p61J562J062j248j459
3289a269P48K014p60j715P0J447L60r66j225P36J645m63j316m00J437J138j266
3306B15j888J257J928l84k397j27K247M94k025q49J313J437n07j696k74J622R38
$$ plain form
3323 1304 314 -1802 -709 1413 819 -1563 -1585 1144 1567 -710 -1747 56 1688 284 -1528 -998
3339 -998 965 1104 -283 -1404 -430 1823 1007 -1643 -1489 1452 2107 -667 -2369 488 2369 61
3355 61 -1938 -752 1681 1178 -930 -1527 68 1465 503 -1258 -1531 1360 2295 -916 -2523 349 2838
3372 2838 177 -2545 -543 2254 1102 -1737 -1318 1054 1787 28 -1770 -1108 1422 1764 -811 -2473
3388 -2473 305 2903 154 -3078 -800 2661 1163 -2369 -1942 1700 1763 -1005 -1794 -60 1562 879
3404 879 -1384 -1966 299 2422 135 -2818 -1041 2847 1467 -2586 -1944 2078 2454 -1524 -2491 536
3420 536 2219 356 -1598 -1151 1143 2068 -86 -2109 -681 2657 1726 -2558 -2380 2103 2954 -1477
3436 -1477 -2998 813 2912 52 -2156 -600 1880 1541 -891 -1652 140 1936 1428 -2023 -2266 2038
$$ packed form
3323A304r90k116J093K122n94k382k2K729M23k277j037J803J632j404j812N30
3339i98J963J39j387j121R74K253q16k650J54K941O55k774j702K857J881k308
3355F1j999J186K433n03k108n97J595J397r62j761k73K891R35l211j607K872K489
3372B838k661k722K002K797j152k839M19K372P33j759j798O62K530L42k575j662
3388b473K778K598k749l232K278L461j498l532M27L642O3k768p89J734J622o83
3404H79k263n82K265K123k287k953J777L888j380m053O42M022L76l978r67L027
3420E36J683j863j954M47K294R25k154k023J428L338r31m284J78M483Q51m431
3436a477j521L811K099k860k208J556K480l39k432p61J792J796n08l451k43M304
$$ plain form
3452 2038 2762 -1348 -3196 918 3716 -106 -3073 -384 2727 1384 -1828 -1580 914 1634 130 -1838
3468 -1838 -1403 1477 2092 -1483 -2851 715 3636 31 -3473 -541 3023 1044 -2581 -1638 1647 1763
3484 1763 -957 -1790 -257 1522 1151 -1408 -2151 517 2717 190 -3166 -880 3150 1346 -2898 -1697
3500 -1697 2113 2205 -1483 -2307 547 2094 384 -1809 -1525 954 2136 -181 -2464 -805 2525 1638
3516 1638 -2643 -2006 2515 2347 -1660 -2575 1193 2579 -167 -2265 -565 1405 1436 -903 -1525 168
3532 168 1997 1013 -2178 -1793 2050 2127 -1600 -2661 1018 2796 -229 -2555 -161 2165 698 -1350
3548 -1350 -1228 945 1603 111 -1711 -1004 1473 1762 -1323 -2464 685 2437 -90 -2711 -258 2340
3564 2340 788 -1885 -1351 1073 1441 -678 -1398 -285 1398 868 -1247 -1498 869 1952 -174 -2511
$$ packed form
3452B038P24m110j848M114K798l822k967K689L111j343l212K48K494P20j504j968
3468a838M35K880O15l575j368L566K921l605l504K932L564j979l625R43L285J16
3484A763k720q33J533J779l71k559p43K668K200k527l356K286M030j804m244J201
3500a697L810R2l688q24K854J547j710k193K84K479J182k317k283J659L330q87
3516A638m281O37M521j68m007r15L768J386k746k098J700J970L1k339o22J693
3532A68J829r84l191L85L843P7l727j061L679J778l025k326K394K326j467k048
3548a350J22K173O58j492j822P07K477K89l085j141L149J752k527k621K453K598
3564B340j552k673N34K424L68k119p20J113J683n30k115k51K367J083k126k337
$$ plain form
3580 -2511 -475 2471 625 -2028 -1201 1485 1408 -1007 -1781 275 1450 473 -1136 -781 813 1416 -291
3597 -291 -1669 -6 1919 815 -2003 -1170 1582 1367 -1017 -1720 613 1728 -33 -1413 -461 1014
3613 1014 908 -554 -1489 465 1489 197 -1390 -633 1503 1301 -851 -1451 584 1376 -160 -1073 -6
3630 -6 1385 589 -1196 -1066 472 1052 -68 -1026 -419 1320 1014 -905 -1316 856 1306 -257 -1296 -59
3648 -59 1607 375 -1064 -898 734 1167 -300 -920 -4 891 397 -934 -718 782 1050 -339 -1061 -20
3666 -20 1041 295 -974 -606 683 752 -564 -930 18 742 35 -1077 -567 736 630 -332 -878 151
3684 151 725 -208 -1060 -436 927 565 -637 -675 216 823 65 -753 79 575 423 -550 -763 582 974
3703 974 -179 -840 -47 618 388 -535 -676 512 787 247 -736 -81 634 223 -526 -361 343 591 -91
$$ packed form
3580b511K036K946j846k653Q27K686p7k415p74K056J175r77j609L55J594O03j707
3597b91j378J663J925j104k818Q33K752k15k384p03K333J115j761j380R52J475
3613A014j06j462r35J954J024j292j587P57K136k02k152o00K035P92j536r13J067
3630fJ391p96j785J30J538N80j120r58O07J739l06j919m11K172M50j563j039J237
3648e9J666j232j439J66J632M33j467o20R16Q95m94j331K16J500K68j389p22J041
3666b0J061p46j269L68J289O9j316l66R48P24p07j112N10J303j06r62n46J029
3684A51N74r33q52O24J363l62j202l8Q91O07p58q18Q32M96j52r73k13J345L92
3703I74j153o61P93O65k30r23j41J188K75n40r83O55P15m11p49J65P04K48o82
$$ plain form
3722 -91 -598 287 710 329 -536 -459 541 449 -72 -702 -137 730 553 -788 -592 606 492 -297 -768 -16
3742 -16 844 64 -571 -167 595 550 -667 -604 112 286 -128 -531 -739 462 453 -179 -468 25 777 -23 -623
3763 -623 -200 241 549 -491 -507 139 393 -50 -675 -228 355 517 -538 -621 78 519 52 -533 -315 312
3783 312 244 -356 -466 198 613 -124 -600 -91 591 400 -512 -499 326 664 91 -469 -45 700 446 -747
3803 -747 -629 316 664 -49 -433 -41 800 289 -258 -478 549 660 -309 -503 114 939 410 -550 -446 509
3823 509 729 -165 -619 -202 827 567 -441 -658 218 754 -69 -1002 -181 800 268 -720 -644 843 584
3842 584 -164 -787 -223 713 124 -664 -775 347 722 -110 -1139 -272 994 221 -1211 -642 845 876 -781
3861 -781 -902 373 626 279 -607 -357 420 743 15 -884 -118 1001 395 -882 -514 652 908 -720
$$ packed form
3722i1n07Q85M23l81q65P7J000r2n21o30N65Q67j77j341J96J198j14p89m71P52
3742a6Q60p80o35M04P62m5j217O3P16J74m14m03k08J201ro32k89M93P52q00o00
3763f23M23M41L08j040j6O46K54m43o25M47N83J62j055q3O99M41m67n85K18O27
3783C12o8o00j10O64M15p37m76N09O82j91r12J3Q25L38n73n60M24P45k54j193
3803g47J18R45L48p13l84L92Q41n11n47k20J027J11r69j94O17Q25n29r60J04R55
3823E09K20q94m54M17J029k60j008k17Q76N36q23r33Q21R81n32r88P6J487k59
3842E84p48o23N64R36n89p88j11J122L75q32j029Q67J266p73j432N69J487L1j657
3861g81j21J275K53l47q86K50P77L23p28q99P66J119o06j277L68J166K56j628
$$ plain form
3879 -720 -1055 213 1194 25 -893 -367 671 806 -163 -636 226 1035 464 -997 -777 977 906 -740
3897 -740 -1353 476 1338 -65 -1313 -306 923 607 -685 -889 445 943 334 -944 -723 971 1351
3914 1351 -700 -1460 453 1433 226 -1659 -224 1503 554 -1198 -763 757 922 -223 -895 -353 958
3931 958 666 -720 -1085 131 1667 -300 -1793 -591 1639 565 -1503 -1097 1313 1278 -1073 -1360 273
3948 273 800 268 -473 -944 494 1233 -191 -1435 -560 1634 806 -1765 -1273 1415 1601 -1090 -1718 404
3966 404 1583 -96 -1108 -408 925 1014 -96 -1137 -218 1650 948 -1478 -1403 1548 1654 -1102 -1847
3983 -1847 769 2217 -160 -1795 -232 1202 833 -649 -1116 123 1199 448 -1226 -1128 1176 1671
3999 1671 -753 -1852 505 2290 32 -1940 -198 1874 692 -1173 -936 839 1123 -84 -1244
$$ packed form
3879g20l35J268R81j169r18N26J038J35r69m73Q62Q09n71j461K20J754p1j646
3897g40o13J829Q62j403j248J007J229l16j292k04J334M98o09j278K21J694L80
3914A351k051p60J913R80j207j885J435J727r49j752M35J520J65j145o72N42J311
3931I58k92j386l65J216J536j967j493J202K230j074k068M06K410l5k351k87J633
3948B73N27n32p41m71J438P39j424j244Q75K194q28k571M92K688J86k691o28K122
3966D04J179j679j012P00J333Q9j110j041R19J868p02k426P5K951J06k756p45
3983a847K616J448k377j635J563J434l69j482m67J239J076p51j674R8K304M95
3999A671k424j099K357J785k258j972J742K072j182j865K37J775K84j207j160
$$ plain form
4014 -1244 -568 896 1087 -787 -1952 519 2194 -192 -2169 -669 2370 732 -2078 -1156 1258 1152
4030 1152 -743 -1129 86 1048 415 -872 -1339 350 1455 -48 -2036 -646 1747 1031 -1662 -1368
4046 -1368 1561 1573 -1054 -1576 330 1504 18 -1225 -494 595 1250 -114 -1552 -351 1573 1019
4062 1019 -1567 -1399 1484 1566 -1194 -1591 683 1785 2 -1424 -335 1292 648 -735 -960 24 1283
4079 1283 528 -1552 -980 1272 1531 -978 -1666 531 1778 -97 -1934 -146 1567 822 -859 -975
4095 -975 510 964 -155 -916 -674 665 919 -646 -1612 331 1911 -136 -1720 -195 1605 467
4111 467 -1339 -773 973 807 -736 -1086 -239 944 565 -830 -1107 318 1517 -183 -1565 -280 1588
4128 1588 447 -1465 -773 1093 1121 -683 -1151 350 1379 169 -916 -369 527 951 -246 -1327 39
$$ packed form
4014a244O76J464J91j874j165K471J675k386j977J500L039j638k810R22K414j06
4030A152j895l86J215R62o33j287m67J689J105j503j988J390K393p16k693K94
4046a368K929J2k627n22J906J174j486j243P31J089O55j364j438J201J924n54
4062A019k586J68K883Q2k760l97K274J102j783j426J089J627o44j383k25R84J259
4079A283p55k080N72K252K59k509o88K197J247j875j837J788J713p45j681j16
4095i75J485M54j119p61K42J339K54j565r66J943J580k047j584J525J800j138
4111D67j806N66J746j66j543l50Q47J183l79j395k77J425J199j700j382J285J868
4128A588j141j912O92J866K8j804m68J501J029j210j085N47Q96M24j197j081J366
$$ plain form
4145 39 1255 616 -1402 -869 1032 1134 -841 -1052 359 1223 180 -1241 -119 1137 560 -426 -908
4162 -908 74 1259 404 -1184 -636 984 1056 -915 -1160 552 1063 -65 -1259 -226 969 387 -656
4179 -656 -636 192 653 -5 -996 -134 900 725 -671 -1077 709 1088 -374 -919 -57 1100 597 -897
4197 -897 -708 888 190 -347 -735 -368 776 450 -910 -716 208 456 -580 -920 137 1063 301 -1050
4215 -1050 -476 590 513 -568 -862 38 596 48 -788 -256 397 574 -304 -868 91 1011 108 -741 -524
4234 -524 701 359 -404 -503 502 719 -108 -594 -134 706 365 -337 -340 137 859 22 -684 -288 449 491 -257
4255 -257 -416 290 764 -150 -356 -235 513 239 -554 -444 170 602 -16 -730 -146 575 92 -295 -503 216
4275 216 668 -267 -536 -35 571 258 -376 -423 432 383 -284 -400 -31 390 294 -690 -337 307 291 -248 -385
$$ packed form
4145C9J216o39k018N33J901J02j975k11J411Q64j043j421J122J256n77r86m82
4162i08R82J185q55j588N48J620P2j971k45J712N11j128j194J033J195n82j043
4179f56K0Q28M61o58r91Q62J034j75j396m06J786L79j462n45Q62J157n03j494
4197h97J89J596o98n37l88L67J144l26j360J94R24K48j036l40J057R26p62j351
4215a050N74J066p7j081k94R00N58n48q36N32O53J77q78n64R59R20r03q49K17
4234e24J225l42p63r9J005K17q27m86M60Q40l41p02lM77P22q37p06L96P37M2p48
4255b57j59P06M74r14k06J21P48k74p93J10O14M32o18p14N84P21m83l87k08P19
4275B16M52r35k69N01O06l13o34m7Q55m9o67j16L69M21r6r84L53O44j6n39j37
$$ plain form
4296 -385 -135 444 9 -568 -229 389 458 -211 -443 -30 508 148 -388 -348 602 242 -486 -372 286 527 -185
4317 -185 -478 109 223 50 -152 -273 -188 791 160 -80 -56 542 517 -269 -205 342 556 72 -384 50 433
4338 433 293 -211 -339 264 122 -45 -388 147 494 236 -385 -292 393 322 252 -381 -293 489 139 -398 -315 281
4360 281 365 -46 -492 -59 685 30 -315 -300 190 363 -107 -343 39 612 121 -611 -481 120 324 -18 -641
4381 -641 -159 513 -33 -560 -137 65 459 -179 -518 123 417 288 -231 -355 325 462 -159 -643 89 571
4401 571 186 -649 -236 412 513 -309 -577 97 525 13 -338 -224 412 489 -338 -404 -79 606 -11 -640 -395
4422 -395 332 572 -305 -467 216 835 60 -535 -188 251 80 -283 -208 402 642 190 -569 -278 416 629
4442 629 -243 -557 302 924 -214 -1052 -198 760 252 -425 -524 319 532 -76 -588 -493 297 425 -262 -933
$$ packed form
4296c85K50N79m35n77L39O18O9o69k32M13N38l60n36M0R50l60p28J14O58K41p12
4317a85k93N87J14j73k02j21Q5R79o31k40K4N98k5p86O4N47K14m84m56M34L83
4338D33j40n04j28O03j42j67l43N35L47k58o21R3O85p1p0o33Q8P82l50n37Q3N96
4360B81Q4m11m46M33P44o55l45J5M90J73m70k36L82N73m91p32J30O01K04l42o23
4381f41M82O72n46n27M23K02L94o38l39O41K94j29n19j24O80J37o21m84P32M82
4401E71l85q35M13O48J01q22k68O74M28n12l51J14O36P7q27o6L25O85o17o29K45
4422c95P27K40q77j62O83O19p75n95L47M39j71l63P5O10K40m52p59K91O94K13
4442F29q72l14Q59O22j138q38Q54R58n08o77r9Q43K13o08n12R5P90J28o87o71
$$ plain form
4462 -933 241 665 -69 -849 -117 940 351 -790 -327 215 389 -326 -541 20 368 361 -192 -656 127 798
4482 798 51 -855 -57 712 433 -956 -680 359 734 -458 -968 174 754 239 -545 -428 262 484 212
4501 212 -837 -305 656 611 -598 -978 646 922 -619 -997 260 1057 107 -821 -126 387 421 -291 -341
4520 -341 -406 790 627 -402 -686 582 963 -537 -1048 300 754 110 -809 -29 1043 372 -523 -631
4538 -631 317 524 109 -536 -521 425 857 -222 -962 207 1197 -129 -1128 -307 884 338 -727 -541 728
4557 728 582 -83 -822 -169 598 644 -401 -938 -16 1121 86 -1227 -449 1166 592 -995 -740 923
4575 923 1026 -508 -550 206 478 198 -426 -428 185 827 16 -867 -295 894 739 -913 -786 939 963 -631
4595 -631 -1227 94 977 -22 -871 -242 295 672 -163 -732 -117 884 393 -845 -829 515 1165 -382 -1179
$$ packed form
4462i33J174M24p34p80P32J057n89j141M63N42J74p15k15N61L48pn53m64P83O71
4482G98p47r06P98P69k79j389K76J039L75j192n10J142N80n15p84J17O90K22k72
4501B12j049N32R61m5j209l80J624K76j541l78J257P97r50r28O95N13L4p12n0
4520c41o5J196j63j029k84J268L81j500n11J348M54o44r19P80J072o71q95j08
4538f31R48K07m15o45J5R46M32j079p40J169R90j326r99Q21J191n46j065J86J269
4557G28j46o65p39O53P67M6j045n37R22J137j035j313P78J615n74j587K55J663
4575I23J03j534m2P56K72k80o24kO13O42q11q83N72J189j55j652J27J725K4j594
4595f31n96J321Q83r99q49O29N37L77q35n69O15J001m91j238J6J344O50j547p97
$$ plain form
4614 -1179 321 1237 -75 -1002 -26 910 396 -353 -560 149 787 597 -703 -662 428 907 -407 -782
4632 -782 312 1178 -92 -1111 -254 980 410 -919 -692 447 404 -234 -744 -158 507 583 -301 -633 30
4651 30 1033 -129 -1123 -392 1171 457 -869 -679 729 642 -913 -695 -63 669 295 -213 -716 49 657
4670 657 133 -1032 -263 966 459 -720 -697 689 826 -521 -791 535 794 -117 -709 -250 316 352 -254
4689 -254 -632 -278 568 325 -714 -482 547 817 -612 -815 532 917 -5 -610 -101 822 386 -530 -318
4708 -318 128 636 262 -534 -595 679 549 -539 -832 130 910 -367 -693 -254 690 259 -609 -443 463
4727 463 468 -5 -667 -474 554 567 -518 -593 311 720 -48 -759 127 680 233 -657 -400 420 498 -183 -488
4748 -488 -193 225 200 -324 -343 234 864 40 -523 -179 807 291 -594 -574 452 343 -418 -673 100 382 61
$$ packed form
4614a179J500R16j312r27R76R36n14p49k07P09O38j90j300M1J090M79j314l75
4632g82J094Q66j270j019Q57J234n70j329K27J139m3o38n10N86O65P6q84l32O63
4651C0J003j162r94P31J563p14j326J90J408q7j555K18O32P32l74n08n03P65O08
4670F57n24j165P69J229n07j179K3J386J37j347k70J326K59r11n92M59N66L6o06
4689b54l78L54Q46k43j039K32J029K70j429k03J347L85r22o05N09R23m36r16K12
4708c18M46N08l74p96o1J274j30j088k93R62P80j277l26M39R44m31q68J66R06
4727D63Nm73o62J93J028J3j085p5R04M09p68p11Q86N53m47q90K57Q20P8o81l05
4748d88K95M18k5n24j9N77O30q24n63L44R86n16q85K0J026j09p61k55P73K82l21
$$ plain form
4769 61 -448 -236 376 362 -124 -423 -168 572 423 -527 -322 497 555 -312 -656 399 732 113 -389 -150 542
4790 542 329 -296 -535 60 699 20 -529 -179 393 380 -381 -418 298 411 -17 -430 164 330 348 -401 -333
4811 -333 9 483 86 -483 -154 230 428 -325 -449 27 337 168 -342 -45 430 212 -275 -555 327 255
4831 255 -311 -447 -89 440 244 -246 -341 579 478 -118 -476 218 293 210 -473 -128 86 472 -67 -174 193
4852 193 326 9 -401 -66 195 193 -215 -165 -60 266 136 -499 68 267 316 -12 -317 170 423 -54 -238
4873 -238 -163 366 463 -224 -296 337 86 -48 -92 209 341 74 -535 -216 315 294 -52 -618 -111 284 492 -147
4895 -147 -238 87 227 -198 -196 220 209 260 -394 -180 127 351 -144 -132 -64 311 139 -292 -227 233 314 -152 -548
4918 -548 -198 280 39 10 -14 114 -25 -256 -91 -315 175 114 -368 -92 -10 584 -272 -486 128 479 113
$$ packed form
4769F1n09K12O12j4m86k99K55P40j49r50K05Q19N8q67l44J055L33o19n02K39O92
4790E42k13o25k39N95O39o79n49L50N72j3p61l7P16J13m28m13N94J66J8p49O8
4811c33L42M74l97n69L29L84J98p53j24M76L10j69n10K97M75k18m87k80Q82p2
4831B55n66j36L58N29j96m90r5R20j01n96l58O94P5q3o83L45K14L86n39j07L67
4852A93J33l17m10L35K61km08N0J05L26j30o35N67J99M9l28l05M87K53m77j84
4873b38P5N29R7o87p2O33k51j34m4L01J32k67o09L19N31k1l46n66N07L95K08o39
4895a47r1L25J40m25KM16j1N1o54K14L07K24m95J2O8L75j72m31O5M60Q1m66l96
4918e48L50M78k41k9k4J28j39k31J65k24M90o1m82K76Q2N94q56k14O14L51l66
$$ plain form
4939 113 -236 -193 231 439 -226 -200 180 371 225 -174 -445 374 375 -189 -268 144 152 208 -430 78 304 340 -106
4962 -106 -198 138 53 84 -154 -354 281 406 -446 -510 10 566 44 -485 -123 164 495 -116 -308 48 274
4983 274 16 -481 -103 406 360 -305 -552 93 495 111 -398 -61 433 428 -231 -489 199 301 46 -61 -289
5004 -289 303 252 -354 -347 88 305 69 -449 -149 496 427 -425 -166 115 175 -23 -510 15 246 93 -354 -186
5026 -186 -162 174 122 -608 -63 418 475 -413 -415 215 599 -41 -473 234 476 88 -182 -195 24 139 104 -423
5048 -423 -174 362 234 -359 -355 175 657 -82 -645 228 604 -62 -560 -293 268 351 -80 -270 -231 498 75
5069 75 -199 -445 208 638 210 -844 12 710 -202 -707 -226 419 379 -99 -382 285 353 70 -151 -359 172
5090 172 360 -226 -958 -119 830 200 -709 -203 495 401 -727 -478 20 188 -65 -411 120 8 221 -222
$$ packed form
4939A13l49M3M24K08o65K6L80J91j46l99k71Q19Jn64p9M12QN6o38N08K26L6m46
4962a06r2L36q5L1k38k00O35J25q52o4N20N56n22n29L62K87L31o11j92L56K26
4983B74k58m97L78N09m6o65k47O45M02l84n09L37M94no59k58O88J02k55j07k28
5004b89N92n1o06PM35K17k36n18L00O45o9q52K59K81O0j98m87N25K31j53m47J68
5026a86K4L36n2p30N45M81N7q88kO30L84o40m32P07K42l88k70j3K19J15l5n27
5048d23K49N36j28n93MN30M82p39n63Q73L76o66m98K67N61Q3m31j90L9P29m23
5069G5k74k46O53M30m28j054Q56O98r12n05M81O45m0m78k83O67O8k83k21k08N31
5090A72J88n86p32Q39R49o30r09N06O98r4j128K49M98J68k53l46N31j12K13m43
$$ plain form
5110 -222 -620 35 563 279 -514 -379 661 524 -344 -568 311 717 -302 -573 157 685 268 -321 -388 2
5130 2 186 165 -388 -365 464 653 -667 -630 115 743 -61 -932 225 857 181 -598 -75 178 187 -101 -263 -210
5152 -210 312 469 -360 -570 191 611 -160 -559 -118 636 6 -914 -248 446 571 -317 -400 94 103 112 -456 -658
5174 -658 336 701 -118 -678 -92 899 94 -635 -300 845 383 -490 -524 230 619 -21 -466 -203 139 421
5194 421 -317 -552 -165 428 412 -636 -233 525 524 -591 -683 457 529 -175 -662 71 513 281 -73 -386 110
5215 110 306 145 -443 -272 678 564 -502 -569 407 763 -257 -635 -8 442 -46 -411 -308 355 423 91
5235 91 -504 -363 315 623 -209 -474 444 467 23 -419 -41 541 272 -577 -336 234 397 84 -404 -97 274
5256 274 276 -251 -439 357 585 -64 -584 -48 350 418 -612 -123 465 26 -228 -190 61 397 52 -360 -343
$$ packed form
5110b22l98O55N28k84p93J35J040j37q68k24Q79M06j019k71P30N28m17n89o7L90
5130BJ84k1n53K3Q29J89j320L7P45O28q04q71J157O32o76p79N23K53Rk88j62N3
5152b10N22J57q29k10P61M20p71l99M41P54o30r20O66O94J25q88q3M94RRn68k02
5174f58R94L65q19n60N86R91q05p29L35J145m62q73l4P54L89o40m45K63L42K82
5194D21p38k35L87N93j6j048M03P58jj115r2J140P2p04m87P33M42k32l54l13M96
5215A10J96j61n88J71R50j14j066o7R76L56j020l78O27M50m88l65J03O63O8l32
5235I1n95J41O78L08q32k65R18K3m44m42L78N82k69q49K41N70J63l13m88L07L71
5256B74Kn27j88P96K28o49n20N36L98O8j030M89N88m39k54L8K51L36l45m12J7
$$ plain form
5277 -343 212 452 -310 -561 5 510 26 -495 -452 465 251 -328 -485 236 531 -161 -479 -23 222 286 -297
5298 -297 -445 298 286 -24 -649 -421 617 299 -630 -519 148 388 -472 -293 128 414 139 -390 -242 74
5318 74 347 -147 -330 -176 442 221 -160 -397 411 636 -45 -494 43 325 85 -445 -284 173 141 -44 -354
5339 -354 -12 358 3 -286 11 288 525 -262 -516 148 251 174 -468 -80 487 297 -111 -269 87 345
5359 345 -27 -438 -50 301 364 145 -412 66 354 14 -459 -235 134 271 -249 -257 238 319 -214 -449 -85
5380 -85 244 104 -234 -448 14 339 -135 -329 -284 337 168 -177 -262 112 160 -10 -206 -105 360 152 -578
5401 -578 -418 436 238 -62 -392 62 402 22 -177 -185 384 129 -122 -392 -19 277 81 -384 -395 170 326
5422 326 83 -118 224 226 -207 -527 -35 363 463 -119 -223 66 267 12 -355 -90 334 172 -23 -343 -187
$$ packed form
5277c43N55K40p62k51N66N05m84n21M3R17k14n79j57P21K95o92l18M56K45O4n83
5298b97j48P43j2l10o25K28J038l18r29J11O67K40q60J79M21K86k75n29J48L16
5318G4K73m94j83J54O18k21l81k37Q08K25o81m49N37K82k40n30J61M57l2j85l10
5339c54L42L70l55k89K97K77K37p87k54O64J03p7o42L88N67j90m08j58L56K58
5359C45l72m11L88L51O3k19n57M78K88l40m73K24L69J37n20qM95Q1n33k35L64
5380h5L29j40l38k14M62L25m74j94M5O21j69l45q5L74M8j70j96J01M65k08p30
5401e78J60Q54j98l00l30M54L40l80j99qN69k55k51k70L73K96j96m65j1N65J56
5422C26k43k01L42Km33l20M92L98J00n82j04K89K01k55l67K65M24j62j95l20J56
$$ plain form
5443 -187 556 101 -323 201 212 -2 -115 -221 199 265 30 -523 -18 180 160 -231 -378 -9 285 -57 -357
5464 -357 -191 329 251 -197 -75 -37 1 181 -476 -267 377 224 -338 -240 164 122 -211 -325 -103 186 19 -335
5486 -335 -329 44 441 199 -232 16 396 -3 -161 -69 458 296 -110 -312 94 340 37 -329 -357 262 19
5507 19 65 -61 49 355 258 -257 -214 66 282 -140 -168 -70 115 301 -165 -22 275 314 -1 -145 22 306
5529 306 141 -210 -100 -23 88 -88 -637 -199 410 185 -306 -238 203 251 -254 -195 252 220 0 -245 -163 241
5551 241 171 -100 -158 145 329 -29 -269 -257 194 125 -242 -267 -50 321 -109 -219 -56 135 -140 -30 -388 89
5573 89 170 -7 22 -132 195 7 -125 -327 220 324 117 -295 109 375 191 -168 -269 17 265 -246 -398
5594 -398 -19 300 230 -170 -268 129 386 200 -538 -56 449 63 -90 -9 308 48 -40 -341 101 -24 -10 -338
$$ packed form
5443a87P43m55m24N24J1k14j13j06M20O6k35n53N05J98k0l91j47L69K94l42l00
5464c57J66N20p8m48J22L8L8J80o57K09O44j53n62R8M04m2l33j14K22K89j67l54
5486c35OL73L97k42m31K48L80l99j58R2N27j62m06k02M06K46l03l66k8O19k43
5507A9M6j26J10L06r7n15M3K80K16m22k8R8J85J86m66J43K97L9l15j44J67K84
5529C06j65l51J10P7J11j76n49M38O09k25m91O8M41M8n05N9M47l2k20k45Q2M04
5551B41p0k71n8L03J84l58k40J2M51o9l67k5K17L71m30j10J63J91k75J10l58M77
5573H9Q1j77K9j54L27j88j32k02N47J04k07m12M04K66j84l59j01K86K48n11j52
5594c98L79L19p0m00r8L97K57j86p38M82N05l86j53Q1L17k60q8l01M42j25J4l28
$$ plain form
5616 -338 -417 431 248 -76 -309 -293 660 259 -482 -543 286 410 -18 -238 17 64 -98 -89 -31 75 175 -172
5638 -172 -40 31 355 227 -287 -373 394 370 -337 -313 369 511 -130 -125 -21 71 177 8 -331 -132 261 51
5660 51 -503 -466 182 249 -243 -309 121 389 -357 -349 -93 310 131 -37 -37 -121 202 -181 -140 -198 153 555 -236 -537
5684 -537 245 419 -74 -205 43 520 40 -305 -269 210 360 132 -44 9 182 425 -12 -401 93 439 -78
5705 -78 -318 169 471 295 -524 112 94 76 -163 -105 287 363 -4 -291 -263 -8 500 -59 -506 -443 266 222 -458
5728 -458 -224 342 605 -336 -531 -14 406 86 -405 -132 323 276 92 -67 -369 250 269 -336 -250 283 580
5749 580 -188 -494 256 432 -197 -611 -5 405 166 -325 -323 -47 428 89 -180 -333 321 450 39 -570 -45
5770 -45 364 257 -534 -86 262 179 -205 -115 144 316 220 -239 124 143 166 -135 -289 258 396 3 -358 -5
$$ packed form
5616c38p9Q48j83l24k33J6R53m01p41o1Q29J24m28k20K55M7j62RN8J06J00l47
5638a72J32P1L24j28n14q6P67k4p07K4O82J42o41NJ04R2J06j69l39J99L93k10
5660E1n54L7O48O7m92o6M30K68p46QK56M03j79j68%q4L23l83M1n8L51M02p91l01
5684e37P82J74m93j31K48M77m80l45L6M79J50k28j76N3J73K43m37l89M94L46n17
5705g8k40M87L02j76q19O36j8j8k39N8L92P6l67k87K8K55N08n59m47O3P09m4o80
5728d58K34N66K63r41j95N17M20l20m91K73M55m7j84j59l02O19J9o05Q6N33K97
5749E80p68l06P50J76o29m14O06M10k39m91KK76M75l39k69j53O54J29m11o09N25
5770d5M09j07p91M48L48q3l84R0K59J72r6m59L63J9K3l01j54N47J38l93l61L53
$$ plain form
5792 -5 521 119 -229 -36 429 340 93 -247 168 435 175 -410 -108 72 372 -32 -369 -202 288 213 -364
5813 -364 -529 277 415 -205 -503 -26 355 45 -254 -176 -22 211 221 -120 -356 273 145 -307 -383 541 476
5834 476 -213 -558 177 344 -21 -270 -336 164 109 141 -255 -53 257 239 -229 -102 268 539 -292 -686 343
5855 343 425 -111 -408 168 307 249 -151 -298 103 94 37 -230 -19 256 191 -66 -114 471 329 49 -366 152
5877 152 226 126 -271 55 319 286 -192 -357 35 133 330 -300 -316 317 255 -16 -504 66 271 -164 -247 -123
5899 -123 383 250 -161 -276 -195 184 111 -195 -274 74 343 -10 -183 61 155 197 -527 36 108 194 -133 -307
5921 -307 265 278 181 -345 -90 71 107 -255 -120 -15 197 -117 -369 -160 397 104 -175 -49 269 147 63
5942 63 -575 -3 151 -51 -202 -281 116 190 -137 -519 -132 178 330 -269 4 355 139 53 -124 -55 377 41
$$ packed form
5792eN26m02l48J93M65q9k47l40M15K67k60n85L02J80L00m04l37J67M90p5n77
5813c64j65Q06J38o20k98M77L81l10k99P8J54K33J0l41k36O29j28m52p6R24o5
5834D76o89l45P35J67l65k49o6N00n5L2l96K02L10j8m68J27L70K71q31l94J029
5855C43Q2n36k97N76J39n8m00j47M01rn7k67K11K75o5k57m8N85j42k80m15N18
5877A52P4j00l97L26K64l3m78j65L92R8J97o30j6O33o2k71m88N70K05m35q3J24
5899a23N06j33m11j15Q1L79p3l06p9L48K69l53j73K44R4M2p24N63P2Q6l27j74
5921c07N72J3r7n26K55J61L6l62J35J05K12l14k52K09N57k93k79J26L18j22q4
5942F3o38N72J54k02j51p9L97P4l27l82L87L10J52n99K73L51k16q6j77O9M32l36
$$ plain form
5964 41 -127 -138 109 289 -19 -83 -84 284 331 -110 -42 250 353 178 -181 29 300 -17 -338 24 -15 176 -43
5987 -43 -354 -95 -70 128 3 -32 130 177 -209 -166 107 213 202 -131 -105 237 240 -142 -281 181 -18 149 24
6010 24 -137 289 150 -122 -483 269 92 288 -270 -5 117 32 -150 -228 -57 210 -159 -361 96 57 223
6031 223 -343 -296 36 34 -88 -111 -13 136 193 -172 -285 39 229 -103 -174 187 -7 316 -247 87 149 511 232
6054 232 77 23 246 31 -158 -78 146 201 1 -123 -299 144 208 -54 23 135 310 -24 -406 42 419 -29
6076 -29 -51 -120 5 191 -93 -360 115 244 98 -134 -309 142 252 -32 -257 161 107 -231 -251 -105 -68 83
6098 83 -161 -197 373 -6 35 -125 -100 129 -73 -153 -265 312 266 -53 -206 36 103 78 -45 160 -108 96 -9
6121 -9 -59 -127 -14 244 -337 -15 243 474 120 -239 -205 159 48 -101 -53 307 32 136 -141 169 192 130 67
$$ packed form
5964D1j68j1K47J80l08o4jL68M7m41O8K92J03j75l59K10K71l17l21L62l9J91k19
5987d3l11K59K5J98j25l5J62M7l86M3K73J06j1l33K6L42Ll82j39M62j99J67j25
6010B4j61M26j39k72l61P52j77J96n58K65J22q5j82p8J71K67l69k02M57l9J66
6031B23n66M7L32kj22k3R8J49N7l65j13L24J90l32p1L61j94L23n63L34O2L62k79
6054B32j55n4K23k15j89Q0K24N5k00j24j76M43O4k62P7J12J75l34l82M48L77m48
6076b9k2o9J25J86k84k67M75J29j46k32j75M51J10k84k25M18n4l38k0J46L7J51
6098H3k44l6N70l79M1j60K5K29k02q0j12N77m6l19j53K42O7k5j23K05k68K04j05
6121in0o8J13K58n81L22K58K31l54l59L4L64j11j49M8L60k75J04k77L10K3o2o3
$$ plain form
6144 67 -124 288 28 -55 -156 203 254 217 -145 4 146 188 -2 -341 216 14 210 160 -69 -56 436 71
6166 71 -359 -88 220 126 -347 -217 -51 209 27 -400 33 101 -20 -236 -10 89 103 -18 -132 -109 364 20
6188 20 -266 -339 248 238 -140 -90 130 206 106 -370 -176 48 144 -194 -258 67 12 151 143 35 -102 9 106 76
6212 76 -50 342 -50 -332 -260 463 154 -100 -43 4 295 -149 -110 -269 -123 184 -5 -227 -12 229 22 -331
6234 -331 -154 351 106 -442 -248 174 185 83 -274 -211 80 -83 -89 37 -111 230 377 -357 -22 53 176 -456
6256 -456 -555 213 363 -244 -266 -121 171 73 -95 -154 193 273 46 -98 -88 161 69 -161 -580 114 46 -324 -378
6279 -378 31 222 80 -228 47 229 -38 -21 -202 -124 185 42 -28 -320 -42 253 -74 -410 110 343 270
6300 270 -409 84 85 -33 -88 -255 -63 137 7 -24 -266 121 83 53 -424 343 371 126 -276 -263 253 71 -340
$$ packed form
6144F7j91M12k60q3j01L59N1l7l62J49J42M2j90l39N57k02J96n0k29J3M92l65
6166G1m30K71L08r4m73J30J66K60j82m27M33O8j21k16K26R9J4j21j14K3M73l44
6188B0k86p3N87j0l78N0K20P6j00m76J94K24R6l38o4L25n5J39qj08j37J11R7l0
6212G6j26L92l92k82P2P23l09k54N7M7K91m44L9j59J46L07j89k22K15K41k07l53
6234c31J77N05k45n48J94M22J1j02l57O3K91j63oJ26j48L41J47p34L35P5J23o32
6256d56r9P68J50o07k2J45K92r8j68n9L47Q0k27j44J0K49r2k30m19O94o8l70n4
6279c78M09J91j42l08K75J82k67J7j81P8L09j43p0k92K78K95l27l36N20K33p3
6300B70o79M93Jj18n5j67J92K00j30l1k42L87l8l0m77P67K8k45m02J3N16j82m11
$$ plain form
6323 -340 -138 520 20 -31 -355 45 56 179 -85 -306 81 290 329 -428 -234 278 323 -364 -258 -41 175
6344 175 -188 -76 31 195 -183 -122 -42 -24 272 -8 -276 -233 102 313 -317 -159 267 37 -92 -447 -2
6365 -2 395 14 -183 -191 348 340 -218 -67 -271 308 99 -189 -195 282 238 -151 -258 185 429 1 -325 130 273
6388 273 202 -105 -380 -5 201 55 -129 -427 368 379 -130 -398 -141 382 177 -312 217 29 147 -235 -189
6409 -189 310 163 -89 -174 -23 207 185 57 -316 88 269 198 -374 -202 403 182 -198 -12 -41 280 -78
6430 -78 -427 -159 63 169 145 -314 76 118 141 -307 -211 101 -34 -481 -126 279 8 -183 -408 213 195 172
6452 172 -111 -164 157 380 33 -247 21 290 60 -294 -67 7 304 63 -27 76 256 -101 -258 -21 136
6473 136 279 46 -214 101 303 210 -176 -283 198 315 -98 -226 105 364 -72 -399 69 242 146 -102 -508
$$ packed form
6323c40K02O58n00n1l24M00J1J23k64k21L87K09L9p57J94N12M5o87J06K17K16
6344A75l63J12J07J64l78O1Q0J8K96k80k68M3L35K11o30J58M26k30j29l55M45
6365bL97l81j97qN39qn58J51k04N79k09k88oM77m4l89j07M43K44m28l26M55J43
6388B73p1l07k75L75K06j46j84k98P95J1n09k68K57N23k05m89N29j88J18l82M6
6409a89M99j47k52q5J51K30k2j28l73M04J81p1n72J72O05k21l80J86k9L21l58
6430g8l49K68K22J06k4m59L90M2K3m48R6L12j35m47L55M05k71j91k25O21j8k3
6452A72k83n3L21K23l47k80K68K69k30l54K27P4K97k41r0J03J80l57j57K37J57
6473A36J43k33k60L15K02r3l86j07M81J17m13j28L31K59m36l27M68J73r6k48m06
$$ plain form
6494 -508 -2 161 39 -178 -119 345 103 21 -125 228 233 148 -128 111 272 160 -86 -183 -64 317 -86 -573
6516 -573 -73 -133 26 -41 -144 22 168 -53 -201 22 100 400 -295 -159 90 75 -23 -281 222 375 147 -151
6538 -151 -172 57 368 -97 -107 -88 283 151 -31 168 57 242 105 -349 -145 216 43 -382 -92 68 227
6559 227 -36 -193 152 384 -1 3 98 -7 94 -90 -52 55 180 -15 -196 -106 374 -175 -132 -195 -69 138
6581 138 -61 -354 -138 26 165 -114 -119 217 -56 325 -243 60 270 55 319 -124 219 146 -10 -260 -53
6602 -53 189 61 -164 -183 -16 -42 -117 -244 54 4 105 -304 26 118 219 -210 -132 -127 261 70 -198 -66 122
6625 122 347 50 -7 148 59 -92 -146 -223 0 124 -43 -176 -52 227 72 -62 -211 195 -102 -66 -280 118
6647 118 236 -91 -245 -146 95 211 -142 -288 -39 316 38 -40 -200 341 147 -156 -198 -162 251 -39 -325
$$ packed form
6494e08N06J63j22k17N9M64k42q2j46L53Nq5k76K39J61j12k46r7J19L81m03m87
6516e73N00o0J59o7j03J66J46k21j48K23P8L00o95J36K49j5r8k58N03J53k28k98
6538a51k1K29L11m65j0J9L71j32j82J99j11J85j37m54K04L61j73m25K90J60J59
6559B27k63j57L45K32l85MR5j05J01j84L8J07J25j95j81R0M80n49M3o3J26K07
6581A38j99k93K16J64J39k79nL36k73L81n68L03K10k15K64m43L43p3j56k50K07
6602e3K42j28k25j9J67k6p5j27K98n0J01m09L30R2J01m29P8NL88j91k68J32J88
6625A22K25k97n7J55q9j51n4p7K23J24j67j33J24K79j55j34j49M06k97L6k14L98
6647A18J18l27j54R9K41J16l53j46K49L55k78p8j60N41j94l03m2L6M13k90k86
$$ plain form
6668 -325 -148 277 99 13 21 -72 167 314 -126 185 241 211 -260 75 103 211 -55 103 35 -107 77 109 -134
6691 -134 28 409 -63 -267 -205 141 311 30 -273 129 166 -10 -203 -311 286 166 -48 -93 102 183 129 -25
6713 -25 179 127 253 -226 -234 5 270 -42 -241 -233 -24 95 -192 -203 -16 232 -280 -170 98 271 -64 -217
6735 -217 -113 -249 198 -158 -201 -94 84 -89 -379 84 61 120 -67 -332 -69 337 172 53 -48 128 23
6756 23 118 -195 -65 122 -8 -190 107 64 52 -147 -115 121 139 45 -147 -160 -91 323 7 -213 -31 312 76
6779 76 -255 -324 285 82 49 -256 84 218 84 -333 -116 262 271 -137 -277 -11 197 74 -210 43 320 100
6801 100 -48 -152 -179 276 -73 -313 -316 99 -239 -253 0 103 142 -12 -232 -212 -200 91 -212 -238 248 210 13
6824 13 -420 186 264 121 -285 -68 -43 158 -329 -88 36 65 334 16 -239 169 270 107 -402 221 139 33
$$ packed form
6668c25J77M25j78q6Qr3K39J47m40L11N6l0m71L35K8J08k66J58o8j42J84L2k43
6691a34J62L81m72k04O2L46J70k81l03M02L7j76j93j08N97j20k14m5J95Q1n4j54
6713b5K04n2J26m79qK39K65l12j99QK09J19k87j1J87K48n12J10K68J73l35j53
6735b17J04j36M47l56m3J07J78j73k90M63k3N9j87k65K63M06j65j19j01J76j05
6756B3R5l13J30J87j30j82K97m3j2j99L2K36J8r4j92j3O9M14l16k20J82L43k36
6779G6l31o9O09k03l3l05L40J34j34m17K17L78Rm08j40K66K08j23k84K53K77k20
6801A00j48j04k7M55l49k40lM15l38j4K53J03L9j54k20K0J2K91l03k6M86l8j97
6824A3m33O06P8j43m06K17K5K01m87K41J24K9K69l18k55M08J01j63n09O23q2j06
$$ plain form
6846 33 -48 -102 -2 41 -133 -38 110 178 73 -108 -72 21 130 20 -240 48 261 334 -119 -213 188 118 -169 -134
6870 -134 155 326 159 -55 -14 190 34 61 -95 -4 168 -22 -96 -114 320 175 -83 -350 68 90 -10 -273
6892 -273 -53 171 130 -32 -24 203 264 -24 -161 -228 133 225 -262 -311 67 178 48 -156 121 299 185 25
6914 25 65 20 -72 -61 -154 -254 26 47 -139 -237 340 291 -57 -105 28 210 46 -146 -167 145 161 21 -224 -136
6938 -136 -60 -21 -80 -28 -51 16 116 -184 -41 118 135 -365 -285 201 230 -83 -252 146 306 -16 -98 -226 110
6961 110 314 -124 -90 241 253 190 193 0 370 81 -143 -67 -4 120 -3 -296 -22 152 -22 -309 131 61 132
6984 132 -194 -491 -3 201 140 -67 -292 281 490 -83 -61 154 107 100 31 -134 68 41 130 -365 -99 127 171
7007 171 -213 170 36 229 -22 -93 -114 177 -18 -310 -107 213 119 -72 -82 -18 201 267 -4 -388 105 128
$$ packed form
6846C3q1n4J00M3j74R5J48O8j05j81L6R3J09j10k60K88K13P3m53r4M01p0k87L5
6870a34K89J71j67k14M1K04j56K7j56R1J72j90p4j8M34j45k58k67M18K2j00k63
6892b73K20K24m1j62QK27O1k88j37o7L61R2m87m9L78J11j30k04K77J78j14j60
6914B5M0m5r2J1r3j00K80K1j86r8N77m9l48m8J33J82j64j92k1L12J6j40k45Q8
6938a36P6L9n9N2k3O7J00l00J43J59J7n00Q0M86K9l13j69L98J60l22q2j28L36
6961A10K04m38L4L31J2o3Lj93L70k89k24P6O3J24j23k93K74J74j74k87M40p0P1
6984A32l26k97M88K04o1k07k25N73K09n73K2K15m7po9j65K02k7Q9m95K66K26M4
7007A71l84L83j34J93k51p1k1K91j95k92K03L20r4j91j0O4K19O6k71l84M93K3
$$ plain form
7029 128 7 -149 163 165 156 -142 -112 -4 149 -27 -33 -4 139 37 -380 -126 217 99 -160 -346 204 355 114
7052 114 -46 -184 177 213 -369 -178 47 86 37 93 -388 212 35 161 -58 -324 200 211 -261 -94 135 123
7074 123 -310 -75 -37 308 76 -187 -365 247 59 -281 -164 291 192 -161 -231 79 299 -109 -11 -119 260
7095 260 114 -5 -113 127 134 19 -250 0 176 334 -188 -187 22 78 91 -317 -37 172 -7 -18 -190 48
7117 48 296 408 -319 -108 0 259 -47 67 56 268 -20 -420 -172 202 159 -230 -37 1 26 122 -32 -108
7139 -108 194 -147 -48 -115 209 147 252 -67 -174 230 81 -135 2 36 210 -176 -98 -33 55 98 -183 -132 215
7162 215 202 -4 -332 -112 297 135 -59 -250 66 128 -139 -97 -86 315 -9 -247 -81 -182 242 -50 -265
7183 -265 57 336 25 -119 -136 281 133 100 -212 -33 307 301 -88 -124 -98 72 -76 -199 18 253 132 -74
$$ packed form
7029A28j21j56L12Krk98L0J08J53j76oK9J43j02m17K54L43j18k59j86N50J51k41
7052A14j60j38L61L6n82J91K25L9m9N6m81O00j77J26k19k66N24J1m72J67K29j2
7074A23m33K35L8L45k32k63j78O12j88l40J17M55r9l53p0L10K20m08R8j08L79
7095B60j46j19j08K40Pj15k69K50J76J58n22JK09N6J3m08K80K09j79j1j72K38
7117D8K48J12p27K11J08K59l06J14j1K12k88m00K48L74m3l89J93L8K5R6j54p6
7139a08L02l41R9o7L24o2J05l19j07M04j49k16J37L4J74l86P8O5Q8M3k81N1L47
7162B15j3k06l28K20M09j62j94j91L16O2k67M2J1M01l24k38J66j01M24k92k15
7183b65L22K79l11j44j7M17j48l3l12J79L40ol89l6K6J70j48j23K17K35j21k06
$$ plain form
7205 -74 -129 264 107 -213 -331 248 194 194 -80 -99 314 -82 73 -54 87 20 276 -180 219 67 275 -229
7227 -229 -19 180 122 52 -172 3 87 112 17 -43 153 242 -57 23 -112 7 305 -17 1 148 47 61 -20 96
7251 96 108 166 -287 -36 220 165 -213 -122 193 117 220 -137 -153 95 76 -181 -105 103 65 89 -86 -91 -16 -109 -132
7276 -132 -20 -13 239 169 -90 70 167 -65 18 -331 -161 164 50 79 -164 -64 182 -131 -198 6 64 32 31 -3
7300 -3 57 295 178 -306 -149 159 166 -204 -134 -45 317 -75 -167 179 170 143 -288 -249 68 281 -336 -17 -71 162
7324 162 -60 -78 -130 193 64 -30 -172 447 216 48 -304 -307 157 -153 110 -100 120 -108 366 -190 -215 -108
7346 -108 243 -71 -175 -136 -24 -27 -91 -106 243 64 -79 -95 74 87 -197 -184 -255 93 183 100 -64 119 405 -87
7370 -87 -163 -52 83 -110 -303 -190 123 156 46 -109 -127 26 -48 -200 -114 200 321 -255 -123 60 16 117
$$ packed form
7205g4n5L93j57l20j18N79n4%k74j9M13l96J55j27J41o7K56m56L99j52K08n04
7227b29K10J99n8p0k24J75Q4K5r5o0J96Q9k99Q0j35J19K98l22J8J47j01J4q1J16
7251I6J2N8m53K51K56n5l78R1L15p6J03l57j6K48j9k57P6K08l8K4j75nP5r3k3
7276a32J12PK52p0k59J60R7k32Q3l49J70L25j14K9k43J00K46l13o7K04N8l2jl4
7300cO0K38j17m84J57L08Pl70P0Q9L62l92r2L46rk7m31L9L17K13o17L19n4K33
7324A62k22j8n2L23j29r4j42O19k31j68l52lM64l10K63k10K20k28M74n56k5J07
7346a08L51l14j04L9J12lo4j5L49j79j43j6J69J3k84J3p1L48R0q3j64J83K86m92
7370h7p6J11J35j93j93J13L13L3j10j55j8J53p4j52Q6L14J21n76J32J83m4J01
$$ plain form
7392 117 -68 2 50 303 -324 -31 77 222 30 -231 321 181 215 26 -37 92 308 195 -74 73 294
7413 294 246 -66 36 273 305 -205 -160 91 355 -88 -83 -10 120 296 -220 -223 -106 44 248 -67 -110 352 119
7436 119 -267 -201 -257 119 168 -75 -201 -48 32 -113 -297 -93 -131 80 -22 -13 -181 250 14 -357 -44 60
7458 60 75 -280 -76 102 312 -219 -91 22 383 -24 -301 -51 228 54 -224 -132 -80 43 -52 -262 -237 98
7480 98 171 -12 -270 67 266 140 96 -46 53 205 201 -93 -32 -71 124 -171 61 152 119 -79 -228 35 140
7503 140 45 -128 -81 175 134 -81 34 -36 113 204 -304 -163 143 -70 -88 -306 -19 198 -95 -166 -329 120
7525 120 64 197 -248 47 89 17 -112 -139 246 -259 -82 -94 70 213 -216 -262 -96 78 259 -219 -228 67 63
7548 63 -72 -226 13 215 46 -68 33 259 248 -115 -184 150 257 -61 265 66 0 142 -13 -112 -103 -59 18
$$ packed form
7392A17j85P0M8K53o27K93J08J45j92k61N52j40L4j89o3J29K16j13k69J47K21
7413B94m8l12J02K37L2n10M5K51K64m43NP3J30J76n16lJ17J50K04l15m3M62k33
7436A19l86O6n6L76M9k43j26J53Q0j45j84K04l8K11j02Rj68M31k36l71L13J04
7458F0J5l55K04J78K10n31J28J13L61m07k77K50K79j74k78R2N2J23r5k10K5L35
7480I8P3j83k58L37J99j26m4j42R9J52mk94O1l9J95k95K32R1l3j98j49K63J05
7503A40r5j73M7K56m1k15J15p0J49R1n08J41L06k13j8k18K87K17k93p1j63M49
7525A20n6J33m45K95M2p2j29k7L85n05J77j2J64J43m29m6J66J74J81m78rK95m
7548F3j35j54K39K02j69j14J01K26j1l63o9L34J07l18L26j99o6J42j55r9RM4P7
$$ plain form
7571 18 -176 -63 159 292 -187 -140 -150 160 122 -234 -179 147 75 156 91 92 227 73 -173 -43 212 80 -5 -37
7595 -37 24 199 -22 -128 -41 154 204 -51 76 -80 72 107 -27 -87 126 83 -107 69 58 258 -266 -117 5
7618 5 88 221 -249 -70 82 183 107 20 -250 -5 -71 -120 -163 165 55 -134 50 -204 137 41 -152 12 73
7641 73 -15 -383 -26 -135 371 188 -147 -152 177 203 -74 -283 85 129 396 110 4 189 40 -95 110 -8
7663 -8 159 193 -105 -448 105 284 108 -63 171 143 -17 -71 44 101 69 -96 -23 158 -106 -31 -306 43 225
7686 225 131 -158 -164 -125 162 -7 -486 75 218 50 -17 -137 0 48 -33 20 -97 210 89 -399 -304 2 277
7709 277 145 -200 -226 169 -18 -163 -366 -13 95 -151 -262 144 273 -17 -148 255 265 28 50 -268 112
7730 112 185 -108 -131 -108 142 226 1 -172 -61 -192 15 -98 -15 41 364 -245 -17 215 88 -38 -47 -125 85
$$ packed form
7571A8j94J13K22J33m79M7j0L10l8l56N5L26p2Q1o5JJ35j54k46J30K55j32q5l2
7595c7O1J75k21j06Q7J95N0k55J27j56J52L5j34o0K13m3j90J76j1K00n24J49J22
7618EQ3J33m70J79J52J01p6q7k70K45o6m9m3L28j10j89J84k54L41r6j93J64O1
7641G3q8l68L57j09N06j83l35nL29K6k77k09L68M4K67k86j06J85j49j35K05j18
7663hJ67L4k98l43N53J79j76j71K34k8j60n4J15N7l2j65P3J81k64P5k75L49J82
7686B25r4k89oL9K87j69m79N61J43j68o7j20J37M8q1N3j17L07j21m88R5L06K75
7709B77j32l45k6L95j87j45k03L53J08k46j11M06J29k90j31M03J0k37K2l18L80
7730A12P3k93k3K3K50Q4k25j73J11j31K07j13Q3N6L23o09K28K32j27j26rp8K10
$$ plain form
7753 85 147 65 -66 169 168 -237 -86 -42 250 33 -308 -497 166 282 -72 -136 -33 123 8 -156 29 48 114
7776 114 76 -248 -80 141 -107 -129 -192 133 66 -39 -66 165 133 -29 -146 -263 -16 -56 -69 -266 54 147 -43
7799 -43 100 -149 -2 160 -51 76 72 408 -70 -342 91 46 82 -24 -141 -177 236 121 -441 -15 233 170
7821 170 151 -154 100 112 -139 -113 -68 -110 12 -169 -253 -129 126 -173 -207 84 155 130 55 -126 -172 286 200 46
7845 46 156 161 78 -30 -278 15 117 -36 -170 -60 113 52 147 -48 20 180 116 191 -48 -11 -109 16 -53 -33
7869 -33 193 -4 -209 102 396 216 -285 -241 167 176 -123 25 -63 409 201 117 179 -67 57 -14 53 108 32 22
7893 22 -83 -62 138 42 -216 -22 246 47 46 -86 -109 240 64 42 -8 -62 -153 30 44 -52 302 318 -45 -261
7917 -261 53 209 41 -106 -11 85 -30 120 -84 101 289 -147 -22 115 235 318 56 63 116 29 -193 -123 61
$$ packed form
7753H5O2q2j31K35jm05J51M4K92k17l41j89O63J16l54o4J03J56j15j64J85J9O6
7776A14l8l24J68K21k48k2o3L25o7j05k7K31l2j62j17j17K47m0j3j97L20R3j90
7799d3J43k49J47J62k11J27mL36m78k72M33m5L6j06j17l6M13j15n62M26K48o3
7821A70j9l05K54J2k51K6M5m2J22j81q4J24K55k99l4K91P1k5p5j81m6M58q6j54
7845D6J10Nq3j08k48K93J02j53j34J10J73o1R5j95O8J60o4P5k39L7r8J25o9K0
7869c3K26j97k05L11K94j80n01M4M08Rk99J48q8M72k08q4O2k46J24p1O7N5p6j0
7893B2j05K1K00r6k58J94K68j99jj32k3L49j76k2n0n4r1J83J4r6L54J6l63k16
7917b61L14J56j68j47R5R6j15J50k04J85J88m36J25J37J20Q3k62PN3q7k22P0J84
$$ plain form
7940 61 -165 -63 119 -157 -93 163 72 -307 -347 150 162 -25 -84 -118 99 -15 -182 -35 93 22 -239 -64 82
7963 82 -75 -122 -190 -125 -170 -61 -209 -99 149 121 -43 -261 78 -9 -7 69 59 -10 -74 -7 -194 153 294 -74 -142
7988 -142 33 -29 20 -42 -179 -210 216 95 -136 62 103 -107 -194 -277 159 66 -76 12 -189 413 343 -107 -220
8011 -220 67 198 -91 -89 11 222 266 115 -150 -12 47 159 -166 -241 203 120 -361 -109 180 -59 283 -92
8033 -92 -51 97 1 35 -96 9 136 162 -277 -267 -281 83 6 -68 36 82 28 -326 112 47 -186 -92 -83 -2 -8 -3 62
8060 62 194 -77 -23 -261 -220 -261 6 -166 -72 -35 199 146 -51 -160 70 134 -150 -42 35 130 -92 -120 72 310
8084 310 -49 -3 -167 32 -35 91 -268 -120 1 -81 -38 -155 137 135 207 -111 -145 25 247 -101 -70 174 285
8107 285 -110 -187 182 -28 85 182 121 45 -33 -99 -132 -100 106 16 -83 -13 90 113 198 -120 98 29 -36 -175 -84
$$ packed form
7940F1k26J02J82k76O4K56r1l79m0M97J2j87n9l4K17j14j67J47J28p1k61J75J46
7963H2j57m7o8O5m5J09j48J10K48k8j64k18L39q7KP6j0o9o4O7j87L47J41l68o8
7988a42J75o2M9o2j37l1M26j21k31J98M1k10q7q3M36r3j42Q8k01O02p0m50j13
8011b20K87J31k89KJ00K11M4j51k65J38N9J12l25p5M44q3m81K52K89k39L42l75
8033i2M1J48r6L4j31J05J27K6m39J0j4L64p7p4J04M6n4l54M38o5k33R4RQ1oNO5
8060F2J32k71N4k38M1m1K67j72R4L7K34n3j97j09K30O4k84J08P7R5k22k8J92K38
8084C10l59M6j64J99o7J26l59J48J21q2M3j17K92kP2l18l4J70K22l48L1K44J11
8107B85l95p7L69k10J13R7o1p6p8o6l3L2K06r0r9P0J03K3Q5l18K18o9o5j39R1
$$ plain form
8132 -84 71 68 -231 49 -32 14 -25 201 -148 -91 135 -3 -82 -57 228 152 -178 -297 -74 60 -38 -366 -36 142
8156 142 6 -90 -300 -112 16 79 -91 -181 148 69 -99 -187 161 76 -131 14 -17 7 -100 -10 -145 -123 33
8179 33 141 -172 100 172 81 -66 -98 -28 -70 -176 -218 -335
$$ packed form
8132h4J55lk99K80q1M6l9K26l49N7K26j38p9K5K85p6l30j19K23J34r8l28L30J78
8156A42j36r6k10J88J28O3j70r0L29p9j68q8L48q5k07J45l1K4j07R0j35K2J56
8179C3J08l13K72P2r1j47l2P0m2j06m2j17
8191c35
$$ Imaginary data points
##PAGE= N=2
##DATA TABLE= (X++(I..I)), XYDATA
$$ plain form
0 0 0 0 0 0 0 0 0 0 0 0 8 -8 8 -11 16 -16 24 -32 32 -40 48 -58 69 -80 96 -112 128 -150 174 -197 225 -258
32 -258 290 -328 369 -416 467 -523 585 -651 723 -804 892 -987 1089 -1205 1329 -1463 1612
49 1612 -1776 1959 -2155 2375 -2624 2902 -3216 3575 -3989 4471 -5046 5741 -6601 7698 -9152
64 -9152 11172 -14177 19122 -28669 53697 -255224 -500741 339738 438844 -208510 -422078
75 -422078 103089 313994 19410 -210124 -121257 55619 211875 72903 -264032 -218570
85 -218570 277804 329537 -262551 -427405 221256 460143 -158834 -460517 77983 409255
95 409255 -2769 -331146 -63279 208513 115707 -74331 -152786 -64102 160640 191170 -137181
106 -137181 -304205 98535 387403 -45593 -423684 -9060 422584 71050 -379411 -110680
$$ packed form
0@%%%%%%%%%%Qj6J6j9K7l2M0n6O4p2Q8j06J27j49J76k08K40k78L24l71M22m83
32b58N48o18O97p85Q83r90J108j236J374j527J696j879K076k294K534k792L075
49A612l388L735m114M530m999N526o118O791p564Q460r517J0787j2342J4299j6850
64i152K0324k5349L3299m7791Q2366l08921k45517Q40479R9106o47354k13568
75d22078N25167K10905k94584k29534Q8867J76876J56256j38972l36935M5462
85b18570M96374N1733n92088j64854O48661K38887o18977l01683N38500L31272
95D09255m12024l28377K67867K71792r2806j90038p8455Q8684K24742L0530l28351
106a37181j67024M02740K88868m32996l78091M14624M31644l51534m50461K68731
$$ plain form
116 -110680 307770 139794 -192484 -144111 68932 143467 62956 -109657 -172645 66024 273980
127 273980 -2086 -333268 -51416 361793 114882 -343577 -163368 307526 201263 -236728
137 -236728 -206006 150108 197809 -46195 -164972 -45625 115157 128770 -45248 -193943
147 -193943 -25607 235518 90425 -246188 -150317 229322 197102 -197396 -225478 146056
157 146056 222997 -85486 -204344 15567 161083 38393 -106049 -89728 29313 122880
167 122880 37825 -149488 -104301 145707 151562 -132773 -193860 100243 204716 -66766 -199662
178 -199662 16073 168959 26455 -132516 -65038 76262 85548 -16564 -101894 -45110 101599
189 101599 93235 -87391 -134292 60047 162267 -28949 -171038 -3648 160391 39944
$$ packed form
116a10680M18450j67976l32278M8373K13043P4535q0511j72613o2988K38669K07956
127B73980k76066l31182K81852M13209k46911m58459J80209M70894j06263m37991
137b36728L0722L56114M7701k44004j18777J19347J60782J3613j74018j48695
147a93943J68336K61125j45093l36613R5871L79639l2220l94498k8082L71534
157A46056P6941l08483j18858K19911J45516j22690j44442J6321J19041R3567
167A22880q5055j87313M5187K50008N855k84335o1087K94103J04473k71482j32896
178a99662K15735J52886j42504j58971O7478J41300R286j02112q5330N6784J46709
189A01599q364j80626m6901J94339J02220j91216j42089J67390J64039j20447
$$ plain form
199 39944 -133747 -68997 102858 88463 -58246 -91299 13113 91429 35093 -75039 -67792
210 -67792 53694 101043 -18619 -118044 -6259 128331 35959 -114224 -55709 98214 77020
221 77020 -69523 -78990 40589 78943 -886 -67911 -28684 56436 54335 -31567 -69172 7661
233 7661 81620 16239 -80392 -33625 68946 50936 -52361 -62603 33437 63488 -12570 -59017
245 -59017 -12906 48379 29498 -38573 -42293 17284 45124 103 -50038 -19944 41697 29218
257 29218 -32753 -44257 16476 48235 -9223 -50156 -5978 39304 15133 -33601 -27239 19526
269 19526 26750 -7691 -30109 -9916 28080 17385 -25906 -25003 15335 29309 -7725 -32717 895
282 895 29032 6124 -21748 -13931 16207 20042 -9424 -18757 2393 19844 7982 -17915 -9279
$$ packed form
199C9944j73691O4750J71855j4395j46709l3053J04412P8316n6336j10132P247
210f7792J21486M7349j19662r9425J11785J34590r2372j50183N8515J53923k1194
221G7020j46543r467J19579L8354p9829o7025L9227Q5120k101q5902l7605P6833
233G661P3959o5381r6631M6767J02571j8010j03297j0242R6040L0051p6058m6447
245e9017M6111O1285j8881o8071l720N9577K7840m5021n0141L0094O1641j2479
257B9218o1971j1504O0733L1759n7458m0933M4178M5282k4171m8734O362M6765
269A9526P224l4441k2418K0193L7996j0695m3291R03M0338J3974l7034k4992L3612
282H95K8137k2908k7872P817L0138L835k9466r333K1150J7451j1862k5897Q636
$$ plain form
295 -9279 17109 12417 -7655 -12091 4151 16338 2360 -10641 -3119 10038 11611 -4625 -10549
308 -10549 7161 11654 -742 -6372 -723 8692 4414 -4565 -1799 2044 5754 2501 -5961 -610
322 -610 6426 1937 -2425 -3069 2912 4126 -3679 -1479 1260 -190 1393 -1830 -2558 1246 -445 -858
338 -858 -2648 -1503 2299 -2973 -3503 1444 -1847 -2258 -1166 -1889 -1017 -2443 -1176 -520 -3212 -79 -748
355 -748 -3695 331 -605 -2794 -1014 -926 -348 -2225 -2013 1944 -1715 -2714 1360 -464 -439 -748 -1395 2005
373 2005 388 -816 -458 -719 3591 1074 -4434 1281 4755 1462 -2436 -2079 5300 4251 -2470 -1820
389 -1820 1738 5394 3852 -5513 -2164 7828 5843 -2833 -6539 4734 11189 -1194 -7248 -371 8407
404 8407 7759 -6087 -8367 6973 11598 -903 -11737 -2350 14685 6318 -11273 -8814 6687 14082
$$ packed form
295i279K6388m692k0072m436J6242J2187j3978j3001P522J3157J573j6236n924
308a0549J7710M493j2396n630N649R415m278q979K766L843L710l253q462N351
322f10P036m489m362o44N981J214p805K200K739j450J583l223p28L804j691m13
338h58j790J145L802n272n30M947l291m11J092p23Q72j426J267O56k692L133o69
355g48k947M026r36k189J780Q8N78j877K12L957l659r99M074j824K5l09o47L400
373B005j617j204L58k61M310k517n508N715L474l293l898L57P379j049o721O50
389a820L558L656j542r365L349R992j985q676l706J1273O455j2383o054O877Q778
404H407o48j3846k280J5340M625j2501j0834R387J7035q367j7591K459J5501P395
$$ plain form
418 14082 -2229 -17182 -1929 16466 7682 -15456 -15906 12908 18861 -10268 -21731 1165 20913
431 20913 4792 -22234 -12731 14862 16099 -8799 -24835 -2086 25911 7102 -26877 -18934 20173
444 20173 25574 -17698 -32844 7665 31852 1164 -33166 -14104 28741 19996 -21843 -27465 8121
457 8121 31010 3388 -32350 -15792 26979 28446 -19249 -39965 11315 46373 -488 -46224
469 -46224 -11815 44360 24767 -36395 -30727 25349 36758 -6420 -36868 -9129 35765 27240
481 27240 -23681 -40744 13128 55960 2294 -59911 -14346 61036 31946 -52806 -42237 43657
493 43657 50552 -23848 -49583 3923 48595 18427 -37772 -34691 22381 51907 -1489 -63034
505 -63034 -17681 67357 37563 -63562 -56046 54749 68788 -41676 -73462 21521 68703 -125
$$ packed form
418A4082j6311j4953J5253J8395q784k3138m50K8814N953k9129j1463K2896J9748
431B0913j6121k7026R503K7593J237k4898j6036K2749K7997j8809l3979P943L9107
444B0173N401m3272j5146M0509K4187l0688l4330J9062M2845q745m1839n622L5586
457H121K2889k7622l5738J6558M2771J467m7695k0716N1280L5058m6861m5736
469d6224L4409N6175j9593o1162N668N6076J1409m3178l0448K7739M4894q525
481B7240n0921j7063N3872M2832n3666o2205M5565P5382k9090q4752J0569Q5894
493D3657O895p4400k5735N3506M4672l0168n6199L081N7072K9526n3396o1545
505f3034M5353Q5038k9794j01125P516J10795J4039j10464l1786R4983M7182o8828
$$ plain form
517 -125 -60323 -21297 42212 36392 -19854 -52094 -8663 59284 32337 -62541 -58509 53420 77461
530 77461 -44053 -92430 27404 92304 -10603 -86572 -11475 69288 26928 -47517 -40982 15129
542 15129 48502 16390 -53339 -48651 46548 74594 -34420 -97224 17337 109284 324 -109439
554 -109439 -19206 98572 36902 -79225 -47970 52138 53079 -15625 -50560 -20591 44094 55887
566 55887 -27400 -82859 7715 106078 16359 -115256 -35235 115233 56271 -100648 -68561
577 -68561 82318 76289 -52082 -70155 19085 60119 18429 -40105 -48910 16539 76481 14117
589 14117 -95126 -40825 105242 64912 -101911 -83638 89764 96841 -70124 -98910 44211
600 44211 89005 -13872 -70832 -16743 43704 40938 -11601 -61093 -26080 73308 58605 -79295
$$ packed form
517a25o0198L9026O3509n820n6246l2240M3431O7947k6947r4878M032J11929K4041
530G7461j21514m8377J19834O4900j02907p5969P5097Q0763m2360p4445O535N6111
542A5129L3373l2112o9729M688R5199K8046j09014o2804J14561R1947j08960j09763
554a09439R0233J17778o1670j16127L1255J00108R41o8704l4935K9969O4685J1793
566E5887q3287n5459R0574R8363q9719j31615Q0021J50468n8962j56919L2087
577f8561J50879o029j28371j8073Q9240M1034m1690n8534q805O5449N9942o2364
589A4117j09243N4301J46067m0330j66823J8273J73402P077j66965k8786J43121
600D4211M4794j02877n6960N4089O0447k766n2539m9492L5013R9388j4703j37900
$$ plain form
612 -79295 -87596 71809 106681 -59915 -119760 39928 116035 -19668 -102869 -6096 76506
623 76506 25162 -46758 -41098 7274 47503 31176 -51259 -69110 45220 96985 -33858 -118589
635 -118589 16163 127885 512 -124588 -18573 106683 34772 -80660 -46368 48215
645 48215 50338 -10485 -46836 -27700 39630 62842 -24826 -89238 6308 109859 16259 -118069
657 -118069 -33594 116543 50618 -99473 -60198 77825 66700 -47038 -60680 15545 51484
668 51484 20724 -33385 -48512 14173 73130 12663 -86525 -35754 94366 57065 -89145 -70079
680 -70079 76362 78742 -56260 -78292 34083 68430 -7767 -51042 -18394 29072 39134 -4157
692 -4157 -53370 -23440 60461 48071 -62090 -68127 53872 79419 -41290 -86695 23798 82837
$$ packed form
612g9295q301J59405L4872j66596n9845J59688P6107j35703q3201R6773Q2602
623G6506n1344p1920N660M8372M0229j6327q2435j7851J14330N1765j30843q4731
635a18589J34752J11722j27373j25100J06015J25256p1911j15432L4292R4583
645D8215K123o0823l6351J9136O7330K3212q7668o4412R5546J03551r3600j34328
657a18069Q4475J50137o5925j50091L9275J38023j1125j13738j3642P6225L5939
668E1484l0760n4109j5127O2685N8957o0467r9188N0771J30120l7301j46210J9066
680g0079J46441K380j35002k2032J12375L4347p6197m3275L2648M7466J0062m3291
692d157m9213K9930Q3901j2390j10161o037J21999K5547j20709m5405J10493N9039
$$ plain form
704 82837 -8026 -71907 -11517 50857 25909 -29015 -38828 1079 41735 24332 -43439 -50686
716 -50686 36992 66625 -28558 -79504 12815 82907 1065 -81134 -15618 68158 26921 -49852
728 -49852 -36989 27941 40488 -4629 -38293 -19777 32182 41446 -23373 -56104 11547 65420
740 65420 3515 -67895 -16116 65125 27734 -52667 -34690 38172 40424 -19625 -37787 3460
752 3460 32650 15931 -21533 -29641 12499 40872 2063 -44159 -14063 46193 26599 -40592
764 -40592 -32442 32425 37702 -19167 -37970 7772 34725 4637 -25880 -15868 15801 25327 -4869
777 -4869 -29862 -7513 30747 19401 -29384 -28951 24215 33434 -16703 -36335 5982 34653 2041
790 2041 -31112 -10989 21478 17550 -13119 -23868 2583 23685 6156 -23011 -17436 18533 23006
$$ packed form
704H2837r0863o3881O0390O2374k4948n4924r813L9907M0656j7403o7771p247
716e0686Q7678K9633r5183n0946R2319P0092q1842q2199O5516Q3776m1237p6773
728d9852J2863O4930J2547m5117l3664J8516N1959R264o4819l2731O7651N3873
740F5420o1905p1410N1779Q1241l7391q0401J7977P2862K252o0049j8162M1247
752C460K9190j6719l7464q108M2140K8373l8809m6222L0096O0256j9594o7191
764d0592Q150O4867N277n6869j8803M5742K6953l0088l0517J0012L1669R526l0196
777d869k4993K2349L8260j1346m8785M33N3166R219n0137j9632M2317K8671l2612
790B041l3153K0123L2467l928l0669j0749K6451K1102j7529k9167N575L5969M473
$$ plain form
803 23006 -14852 -27478 6297 27289 -3 -27504 -7264 22134 10977 -16110 -16316 8082
815 8082 17821 -2389 -17378 -5090 13854 11416 -10781 -15762 6794 17267 -955 -16948 -4013
828 -4013 16552 8210 -12873 -9243 8535 11952 -2735 -11637 126 11018 5021 -6584 -7725
841 -7725 5339 10990 -1311 -9435 -1098 10222 5840 -7969 -6298 6871 8100 -1985 -7690 239
855 239 8870 2647 -6261 -3530 4562 6630 -1946 -6976 952 6109 1866 -5025 -3903 4512 4689 -3317
871 -3317 -4799 454 4843 492 -5595 -1785 3389 1549 -2345 -3740 767 3136 -1371 -3305 -1082
886 -1082 1573 1347 -3142 -2453 1153 842 -1025 -2645 -1077 2003 -491 -2208 -1047 -58 1102 -959
902 -959 -2105 199 777 -237 -665 -1123 980 540 -828 75 -275 717 610 -877 -43 890 499 675
$$ packed form
803B3006l7858j2626L3775K0992k7292k7501K0240K9398j1157k7087k06K4398
815H082R739k0210j4989J2288J8944k438k2197m981K2556J0473j8222j5993J2935
828d013K0565q342k1083L630J7778L417j4687q902J1763J0892n997j1605j141
841g725J3064N651j2301q124Q337J1320m382j3809J671J3169J229j0085n705P929
855B39Q631o223q908K731Q092K068q576n030P928N157m243o891J122Q415J77q006
871c317j482N253M389m351o087L810N174j840l894j395M507K369m507j934K223
886a082K655k26m489O89L606l11j867j620J568L080k494j717J161R89J160k061
902i59j146K304N78j014m28m58K103m40j368R03l50R92j07j487Q34R33l91J76
$$ plain form
920 675 -596 512 1511 30 147 349 322 1918 154 -129 898 809 1287 128 -861 1405 1446 396
938 396 -23 -144 2062 1259 -667 -307 539 1683 901 -1887 -141 1969 985 -622 -1764 822 2960
955 2960 -912 -2128 -860 2135 2129 -2501 -2890 1612 2608 -544 -4046 -1687 4044 1519 -3699 -3514 1545
972 1545 4447 -1580 -6172 -650 4618 1460 -4979 -5151 3171 5062 -3120 -6385 -911 6080 2755
987 2755 -7122 -5293 4596 6260 -3026 -9244 302 9275 1302 -8634 -4786 6853 7320 -5415 -8902
1002 -8902 2063 9208 2121 -8598 -5864 8003 9024 -4913 -10745 1677 13435 2362 -13174
1015 -13174 -4654 12016 9438 -8235 -11575 6568 13658 -893 -11767 -3835 11607 10109 -7848
1028 -7848 -12414 4281 16379 2309 -17513 -6240 18052 11132 -14162 -14740 10743 18094 -5746
$$ packed form
920F75j271J108R99j481J17K02k7J596j764k83J027q9M78j159r89K266M1j050
938C96m19j21K206q03j926L60Q46J144p82k788J746K110r84j607j142K586K138
955B960l872j216J268K995om630l89M502R96l152l502K359N731k525n218J85N059
972A545K902o027m592N522N268l158o439j72Q322J891q182l265N474O991l325
987B755r877J829R889J664r286o218R546Q973p973r936L848J1639M67j2735l487
1002h902J0965P145p087j0719K734J3867J021j3937n832J2422J1758j1073j5536
1015a3174Q520J6670k578j7673l340J8143P090j4551j0874P932J5442j498j7957
1028g848m566J6695J2098j4070j9822J1273K4292o920k5294n78K5483P351k3840
$$ plain form
1041 -5746 -18065 91 16244 7088 -12976 -12990 8057 16456 -1462 -19066 -7007 19987 12863
1054 12863 -19327 -18827 14539 22415 -9557 -25464 2855 23481 2966 -19956 -10717 13338 15224
1067 15224 -6806 -18861 -3632 18969 12207 -19522 -21283 15659 26650 -10553 -31862 2945
1079 2945 32709 2595 -30483 -9262 23736 15127 -16051 -19671 5877 20367 5650 -19537
1091 -19537 -17390 16785 27245 -10813 -33769 3266 39003 5206 -39299 -11689 36259 18358
1103 18358 -27434 -22486 18622 24720 -6464 -22051 -6079 18612 19846 -11595 -28988 4000
1115 4000 36583 7027 -39085 -15719 40271 23927 -34799 -28477 27226 31828 -16656 -29971
1127 -29971 6017 25141 7071 -16225 -18614 6511 27428 5461 -32810 -17749 35096 28783
$$ packed form
1041e746j2319J8156J6153r156k0064j4K1047Q399j7918j7604J2059K6994p124
1054A2863l2190N00L3366P876l1972j5907K8319K0626k0515k2922R239K4055J886
1067A5224k2030j2055J5229K2601o762l1729j761L6942J0991l7203k1309L4807
1079B945K9764l0114l3078K1221L2998q609l1178l620K5548J4490j4717k5187
1091a9537K147L4175J0460l8058k2956L7035L5737l3797m4505K7610M7948j7901
1103A8358m5792M948M1108O098l1184j5587J5972K4691J234l1441j7393L2988
1115D000L2583k9556m6112K3366N5990j6344n8726O322N5703M602m8484j3315
1127b9971L5988J9124j8070k3296k389K5125K0917k1967l8271J5061N2845o313
$$ plain form
1139 28783 -34060 -36632 28541 40464 -20623 -42496 10799 38403 -1320 -30313 -10012 17694
1151 17694 18454 -4672 -25528 -11133 27382 25216 -28162 -38443 24398 46068 -19039 -51246
1163 -51246 9021 50789 -1085 -46622 -7918 35511 15026 -22065 -21021 5857 22795 10246
1175 10246 -21520 -26761 17605 40206 -12459 -48978 4590 53041 4365 -52903 -11927 47535
1187 47535 18216 -36205 -21569 22956 23473 -7171 -20145 -7597 15549 23798 -7258 -35467
1199 -35467 -324 44566 10661 -47551 -19000 48059 26467 -41642 -29398 32359 31225 -19102
1211 -19102 -28230 6497 22730 7574 -12839 -20042 2763 30465 9244 -36055 -20860 38274
1223 38274 31255 -37090 -38148 31634 40726 -22733 -39839 11678 35432 -1424 -26500 -9211
$$ packed form
1139B8783o2843k572O5173J1923o1087k1873N3295K7604l9723k8993K0301K7706
1151A7694P60k3126k0856J4395L8515k166n3378j0281O2841K1670o5107l2207
1163e1246O0267M1768n1874m5537L8704M3429k0485l7091J044K6878J6938j2549
1175A0246l1766n241M4366K2601n2665l6519N3568M8451m8676n7268M0976N9462
1187D7535k9319n4421J4636M4525N17l0644j2974J2548K3146Q249l1056k8209
1199c5467L5143M4890l3905n8212K8551O7059k1592o8109J2244O1757j134n0327
1211a9102r128L4727J6233j5156k0413p203K2805K7702k1221m5299J5195N9134
1223C8274p019o8345j058O9782R092o3459j7106N1517K3754l6856k5076J7289
$$ plain form
1235 -9211 14161 18097 -1825 -25496 -11857 26899 24135 -27199 -35779 23689 41541 -18941 -44864
1248 -44864 10061 42662 -2741 -38098 -5210 27768 11110 -16237 -17249 1987 18916 10095
1260 10095 -18847 -22770 15408 32681 -11542 -38938 5410 40804 1129 -39703 -7504 34796
1272 34796 12335 -25851 -15417 14659 16991 -2207 -16196 -8479 12898 19556 -6897 -27512
1284 -27512 1814 32621 5266 -32981 -11334 32037 17534 -26390 -19488 19621 21267 -8969
1296 -8969 -19499 195 16308 9040 -9732 -16352 3294 22918 4116 -25225 -10451 25322
1308 25322 17110 -22623 -21419 18473 23298 -12006 -22665 4366 20427 2383 -16214 -8709 9184
1321 9184 13429 -2226 -17145 -4799 17977 10600 -17332 -16828 14334 19830 -11312 -21280 5405
$$ packed form
1235i211K3372L936j9922k3671J3639L8756k764n1334q580N9468J7852o0482k5923
1248d4864N4925L2601m5403l5357L2888L2978j6658k7347j012J9236J6929q821
1260A0095k8942l923L8178J7273m4223k7396M4348L5394l9675m0832L2199M2300
1272C4796k2461l8186J0434L0076K332j9198j3989P717K1377O658k6453k0615
1284b7512K9326L0807k7355l8247K1647M3371j4503m3924O902L9109J646l0236
1296h969j0530J9694J6113p268j8772o620J9646J9624j8802k9341J4774L5773
1308B5322q212l9733J204L9892M825l5304j0659K7031J6061j8044j8597P505J7893
1321I184M245j5655j4919J2346K2776p377k7932N04L1162N496l1142r968K6685
$$ plain form
1334 5405 19956 -246 -18196 -5050 13373 7845 -8175 -11207 1214 12086 3652 -12354 -9511
1347 -9511 9585 13249 -7158 -16448 3577 16039 54 -15365 -4619 13065 7365 -9676 -8935
1360 -8935 4491 9867 281 -9636 -4188 8451 8052 -5054 -10795 2373 12806 548 -11873
1373 -11873 -3367 11145 7044 -8516 -8068 6463 9130 -1581 -8549 -1377 8436 4666 -6097 -6115
1387 -6115 3970 8768 -897 -8741 -1198 8704 3957 -6968 -5673 5991 7231 -3509 -6794 1041
1401 1041 6916 1299 -6094 -3345 4330 4204 -2334 -5356 364 5798 838 -5195 -3039 3507 3865
1416 3865 -3145 -4839 1325 3945 -253 -4234 -2206 3285 2051 -2709 -3435 350 3177 164 -3670
1431 -3670 -1250 2375 1857 -1917 -3002 562 2857 -528 -2578 -957 2142 1469 -2014 -2264 1050 2110
$$ packed form
1334E405J4551k0202j7950J3146J8423n528j6020l032J2421J0872q434j6006K843
1347i511J9096L664k0407r290K0025J2462j5985j5419J0746J7684n700j7041P41
1360h935J3426N376r586r917N448J2639l99j3106n741J3168J0433j2258j2421
1373a1873Q506J4512m101j5560M48J4531K667j0711o968P172R813l770j0763j8
1387f115J0085M798r665p844P543R902m747j0925J295J1664J240j0740l285P835
1401A041N875n617p393K749P675j26o538l022N720N434m960o033K156O546L58
1416C865p010j694O164K620m198l981K028N491j234m760p26L785K827l013l834
1431c670K420L625n18l774j085L564K295l385k050J621L099o73l483k50L314J060
$$ plain form
1447 2110 -216 -2380 -453 2347 1165 -1449 -1082 814 2254 -205 -1811 478 1736 1100 -1025
1462 -1025 -1120 1817 1677 -447 -978 7 1750 994 -1250 -127 1207 1382 -3 -1103 701 1750 158
1479 158 -498 -475 856 1645 -519 -680 507 800 299 -902 -742 933 632 -141 -682 25 1078 220
1497 220 -1228 -261 354 606 -706 -1495 -133 899 -53 -1010 -1175 463 795 -1049 -1327 24 936 514
1515 514 -1928 -1297 924 735 -883 -1910 -80 1894 -143 -1984 -1062 1049 1537 -1278 -2427 291
1531 291 1598 201 -2191 -1490 1756 1564 -1188 -2136 42 2746 826 -2801 -1070 2377 2377 -1128 -2832
1548 -2832 811 3426 395 -2631 -1431 3047 3358 -1913 -3204 1092 3956 1078 -3954 -1679 4562
1563 4562 3204 -2778 -3800 1938 5195 -289 -4519 -611 4458 2999 -3183 -4676 2137 5649 -3
$$ packed form
1447B110k326k164J927K800j182k614L67J896J440k459j606K289J258o36k125
1462a025r5K937j40k124n31R85J743p56k244J123J334J75j385j100J804J049j592
1479A58o56K3J331P89k164j61J187K93n01j201J60J675l01p73n41P07J053q58
1497B20j448R67O15K52j312p89J362J032r52r57j65J638L32j844k78J351R12m22
1515E14k442O31K221j89j618j027J830J974k037j841R22K111M88k815j149K718
1531B91J307j397k392P01L246j92k752r48K178K704j920l627J731L447%l505j704
1548b832L643K615l031l026J200M478L11n271j291M296K864k878n032K275O241
1563D562j358n982j022N738L257n484m230L908N069j459o182j493O813L512n652
$$ plain form
1578 -3 -5785 -2070 5969 4078 -5042 -5172 3491 6229 -1837 -7291 -197 6509 1851 -5306 -4694 3014
1594 3014 5947 -1422 -7150 -1871 6496 4088 -6916 -6807 5352 7889 -3348 -9426 265 8860
1608 8860 1695 -8510 -4057 5674 6092 -3271 -8172 -204 7643 3572 -7117 -7518 6075 9924 -4481
1623 -4481 -11588 1400 12072 1319 -11797 -3884 10050 6505 -6469 -8084 3060 9095 1339
1636 1339 -8309 -5256 7063 9885 -4560 -12622 2275 14529 2121 -14698 -4675 14356 7948
1649 7948 -11130 -9266 7355 10887 -2500 -10371 -1741 8746 7187 -5564 -10930 2555 14364
1662 14364 1805 -15502 -6026 15468 10332 -14062 -12441 11106 13588 -6407 -13420 1514 12002
1675 12002 2873 -8621 -7929 3967 12087 125 -14631 -5861 14396 10866 -14172 -15364 12127
$$ packed form
1578cn782L715Q039j891r120j30Q663K738q066n454P094O706m658p157O12P708
1594C014K933p369n728N279Q367k408j1004J09J2159K537j1237o078R691Q595
1608H860p165j0205M453R731M18r363m901P968P847m071j0689m01J3593L849j4405
1623d481p107J2988J0672j0753j3116P913J3934l545j2974j615J1144O035p756
1636A339r648L053J2319K822j4445q062J4897J2254j2408j6819J0023J9031o408
1649G948j9078J864J6621L532j3387p871Q630J0487j559j2751n366J3485J1809
1662A4364j2559j7307R476K1494n136k4394J621K3547K482j9995p013J4934J0488
1675A2002r129j1494O92J1896Q120j1962j4756Q770K0257l530k5038j192K7491
$$ plain form
1688 12127 17425 -9278 -18392 4491 17087 -395 -14585 -4280 9510 8096 -4044 -11806 -2539
1701 -2539 12706 8461 -12798 -14519 10841 18814 -8728 -21451 5085 21604 -613 -20432 -3448
1714 -3448 16830 6392 -11035 -9195 3980 10859 2928 -10222 -9762 8805 16275 -5808 -20653
1727 -20653 2705 22983 1551 -22603 -5486 21170 9183 -16799 -10879 11150 11795 -3463
1739 -3463 -10919 -3072 9090 9917 -4793 -15683 1047 20618 3446 -22106 -7554 22317 11936
1752 11936 -19918 -14494 16098 15459 -9935 -14910 3540 12737 2640 -9060 -8813 3898 13689
1765 13689 1726 -17779 -7192 18927 12239 -18615 -16794 16280 19073 -12628 -19200 7100 17259
1778 17259 -1988 -14783 -3369 9238 7353 -3397 -11480 -3705 13488 9384 -13588 -15028 11940
$$ packed form
1688A2127N298k6703r114K2883J2596j7482j4190J0305J3790j414j2140p762R267
1701b539J5245m245k1259j721K5360P973k7542j2723K6536J6519k2217j9819J6984
1714c448K0278j0438j7427J840J3175O879p931j3150M60J8567P470k2083j4845
1727b0653K3358K0278k1432k4154J7117K6656j1987k5982N920K2029O45j5258
1739c463p456P847J2162Q27j4710j0890J6730J9571j7172k5552J4552K9871j0381
1752A1936l1854N424L0592o39k5394m975J8450R197j0097j1700K47J2711R791
1765A3689j1963j9505J0587K6119o688l0854J821L3074K793l1701o572K6300J0159
1778A7259j9247j2795J1414J2607j885j0750q083P775J7193m104k2972j440K6968
$$ plain form
1791 11940 18894 -9888 -21210 6232 20539 -2238 -18654 -2199 14677 5437 -9223 -7985
1803 -7985 2372 9923 4177 -10364 -9972 8786 15227 -6217 -19235 3597 21287 93 -20546
1816 -20546 -3289 18693 6634 -14565 -8516 9481 9987 -2660 -9650 -3522 8948 9404 -5810
1829 -5810 -13730 2757 17641 1310 -18410 -4494 18228 8189 -15820 -10329 12620 11601 -7614
1842 -7614 -11002 2392 9791 3211 -7475 -7282 3893 11123 237 -13261 -3883 13940 7174 -13093
1856 -13093 -10269 10681 11913 -8423 -12537 4203 11228 -267 -9603 -3583 6129 6223 -2815 -8848
1870 -8848 -1680 9733 5021 -10034 -8598 8360 10535 -6387 -12567 3428 12002 -797 -11207
1883 -11207 -2579 8804 4482 -5779 -6841 2238 7358 1593 -7978 -5363 6972 8164 -5189 -10247
$$ packed form
1791A1940O954k8782j1322K7442J4307k2777j6416J6455J6876r240j4660J238
1803g985J0357P551n746j4541L92J8758O441k1444j3018K2832J7690k1194k0639
1816b0546J7257K1982j2059k1199O049J7997N06j2647o990O128J2470M56j5214
1829e810p920J6487J4884j6331j9720J3916K2722j0039k4009N491K2949j019j9215
1842g614l388J3394P399o580j0686J93J1175P230j0886j3498R378J7823o766k0267
1856a3093K824K0950J232k0336m114J6740P025j1495r336O020R712R4r038o033
1870h848P168J1413m712j5055J436J6958K175j6922o180J5995Q574j2799j0410
1883a1207Q628J1383m322j0261j062R079N120n765r571K615J2335J192j3353n058
$$ plain form
1897 -10247 2862 11445 -539 -10894 -1647 9297 4219 -7192 -5470 5179 6706 -1461 -6612
1910 -6612 -1336 6478 4383 -4544 -6009 2681 8147 -754 -8491 -889 8249 3112 -6492 -4349 5353
1925 5353 5920 -3308 -5744 898 5439 1687 -4800 -3116 3314 4482 -1189 -5569 -235 5970 1916
1940 1916 -5346 -3297 4244 4475 -3063 -5109 1310 4561 213 -4400 -2098 3229 2872 -2432 -3873
1955 -3873 247 4030 853 -4223 -2182 3204 3061 -2427 -4292 829 4065 -458 -4077 -1265 3230
1970 3230 1968 -2668 -2946 1186 2773 21 -3352 -1119 3004 1749 -2267 -2401 1467 3074 -441
1985 -441 -3156 -87 2603 819 -2163 -1795 1824 2065 -948 -1851 138 2172 869 -1971 -1146 1628
2001 1628 1609 -602 -1630 560 2167 394 -1221 -796 1257 1312 -656 -1041 761 1502 258 -1212 -645
$$ packed form
1897a0247J3109Q583j1984j0355R247J0944n078j1411J722J0649J527q167n151
1910f612N276P814k095q927j465Q690N466q901p737P602R138n137r604K143R702
1925E353N67r228k436O642M541l752o487J684O430J168n671m380N334O205m054
1940A916p262K049P541K31p538k046O419L251m348m613K302N327l57n304j441
1955c873M120L783l177n076K041N386j43n488j865N121L236m523l619K812M495
1970C230j262m636k78M132J587k752l373K233M123j255m016j34L868J607l515
1985d41k715L069K690j784k982L68L619K41l013r03J989K034j303k840Q25K774
2001A628j9k211j028K190J607j773j615M25K053N5j968l85J802P41j244j470N67
$$ plain form
2018 -645 1513 971 -831 -1158 216 1394 -2 -1288 -350 1071 965 -542 -1234 252 1072 -327 -1029
2035 -1029 -411 996 601 -975 -855 243 954 -131 -1364 -634 835 140 -770 -1129 206 797 -37
2052 -37 -1109 -500 791 381 -827 -955 498 806 -234 -1130 -372 826 297 -973 -617 428 696 -104
2070 -104 -1063 -138 985 388 -630 -750 861 1270 -280 -810 80 1223 923 -879 -575 971 1451 -98
2088 -98 -976 -263 1524 591 -938 -485 721 1756 -104 -1317 330 1566 554 -865 -1013 1082 1649
2105 1649 -221 -1381 -440 1907 1013 -1830 -1207 1246 1594 -554 -1888 47 2203 243 -1593 -1212
2121 -1212 1155 2035 -752 -2202 -37 2176 745 -2283 -1529 1840 2003 -1451 -2511 379 2574 31
2137 31 -2764 -1192 1624 1818 -1355 -3001 293 2826 463 -2792 -2072 2510 2782 -2077 -3334 809
$$ packed form
2018f45K158n42j802l27J374J178j396j286R38J421j06j507o92J486Q20j399p02
2035a029O18J407l95j576J20J098P11j085j233P30J469o95r10l59J335N91q34
2052c7j072O09J291m10j208j28J453L08j040q96P58J198n29j270L56J045K68q00
2070a04r59R25J123n97j018j20J611M09j550n30Q90J143l00j802L04J546M80j549
2088i8q78P13J787r33j529M53J206J035j860j213J647J236j012j419j48K095N67
2105A649j870j160R41K347q94k843O23K453L48k148j334J935K156j960j836L81
2121a212K367Q80k787j450K165K213j431l028P54L369J63l454j060K890K195k543
2137C1k795J572K816J94l173j646L294K533k363l255P20M582K72m859j257M143
$$ plain form
2153 809 3630 184 -3868 -1213 3287 1795 -2187 -2794 1008 3137 376 -3266 -1759 3026 3287 -2594
2169 -2594 -4041 1935 4473 -352 -4714 -1017 4646 2267 -3503 -2574 2267 3854 -524 -3886 -789
2184 -789 3836 2719 -2799 -4111 1992 5417 -665 -5369 -633 5727 2264 -5255 -3350 4054 4227
2199 4227 -2014 -4550 510 4508 1595 -3504 -3714 2345 5090 -726 -6175 -609 6608 2639 -6303
2214 -6303 -4334 5578 5186 -3850 -5734 1769 5648 356 -5252 -2456 3569 4025 -1735 -5708 -567
2229 -567 6529 2475 -6697 -4786 5848 6382 -5148 -7165 3268 7024 -1061 -6778 -998 5580 2667
2244 2667 -3584 -4559 800 5843 1495 -6353 -4174 5875 6690 -4957 -8193 3570 9198 -1704
2258 -1704 -8816 -175 8181 2402 -6232 -3476 3570 5011 -314 -5368 -2322 5254 5510 -4095 -7650
$$ packed form
2153H09K821l446m052K655M500j492l982o07L802K129k761l642J507M785K61n881
2169b594j447N976K538m825m362L697N663k379n770R29M841J587m378l362L097
2184g89M625j117n518j312O103L425o082m704M736O360l463p519J905P404J73
2199D227o241k536N060L998k913n099k10O059K745n816n449N566P217l969q942
2214f303J969R912l92r036j884P503L879n292n608K796O025M56n760l973N141
2229e67P096m054r172J911J0634N34j1530k017J0433L756q085n717N780O578k913
2244B667o251r75N359N043m348p848K179J0049Q15j1647l236J1763N628j0902
2258a704p112Q641Q356n779q634K756P046J441n325n054L046P576K56r605l555
$$ plain form
2273 -7650 2931 9563 -1123 -10202 -562 10230 2627 -8882 -4066 6871 4987 -3408 -5252 408
2287 408 4976 2780 -4310 -5636 2577 8091 -776 -9994 -974 10269 3074 -9912 -4915 8440
2301 8440 5968 -6470 -6448 3627 6259 -321 -5276 -2767 3494 5102 -1457 -7856 -1386 9000 3120
2316 3120 -9463 -5625 8307 7365 -7373 -8581 5011 8141 -2424 -7521 -484 5469 2504 -3124
2330 -3124 -4767 192 6471 2405 -7327 -5548 7211 7771 -6316 -9265 4859 10050 -2935 -9364
2344 -9364 712 8444 1641 -5959 -3026 3443 4561 6 -5433 -3097 5843 5967 -4817 -8322 4022
2359 4022 9900 -2277 -10226 751 9908 1595 -8352 -2959 6234 4187 -3167 -4469 488 4833
2373 4833 2976 -4166 -5434 2821 7615 -1263 -9262 -330 9494 1655 -9199 -3354 7465 4740
$$ packed form
2273g650J0581O632j0686r079R640J0792p603j1509M816J0937j884q395j844N660
2287D08M568k196p090j326Q213N514q867r218R020J1243p195j2986M997J3355
2301H440k472j2438K2J0075K632o580m955K509O261J608o559o399O470J0386n880
2316C120j2583L838J3932r42j4738j208J3592L130j0565n097P037N953k965n628
2330c124j643M959O279m066r732J779J2759N60j4087k949J4124N191j2985o429
2344i364J0076P732o803p600K933O469J118m555n439K336Q940J24j0784l505J2344
2359D022N878j2177p949J0977R157q313r947N393R193k047p354j302M957M345
2373D833j857p142j268Q255M794q878p999Q932R824p839j0854N845J0819k725
$$ plain form
2387 4740 -5662 -5078 2999 4648 247 -4368 -2572 2795 4854 -1630 -6570 -875 7483 2275 -7878
2402 -7878 -4279 6911 5349 -6024 -6411 4069 5964 -1947 -5832 -710 4088 2681 -2857 -4273
2416 -4273 848 5191 1546 -6261 -3401 5937 4981 -5193 -6018 3864 6821 -2573 -6725 788 5465
2431 5465 1130 -4281 -2638 2694 3602 -461 -3999 -1540 4606 3556 -3834 -4720 3134 5949 -1801
2446 -1801 -6030 705 5963 887 -4782 -1964 3674 3013 -2055 -3145 131 3476 1716 -3183 -3148 2611
2462 2611 4182 -1304 -5052 202 5389 954 -4795 -1928 4121 2685 -2959 -3256 1289 3203 119
2477 119 -3011 -1677 2502 2921 -1677 -3683 321 3918 698 -4113 -1488 3530 2233 -2852 -3123 1813
2493 1813 3303 -868 -3075 -618 2570 1218 -2218 -2469 1032 2531 -279 -3071 -1003 2826 1467
$$ packed form
2387D740j0402N84Q077J649m401m615J796N367K059o484m940N695Q358n208j0153
2402g878L599J1190j562j1373l87J0480J895p911l885N122M798j407n538j416
2416d273N121M343l645p807K860R338r56j0174q25R882K957r394m152P513M677
2431E465m335n411J643N332R08m063l538K459O146j050p390q86P854K815p750
2446a801m229O735N258n076n669K818N638o61n068j090L276L345j760m899L5N759
2462B611J571n486l748N254N187m435n749K867O049j436n644k97M545J914l084
2477A19l130J334M179M19m598k006M004L597l220m811K625N018j297n085k71M936
2493A813J490m171k207K457L188j352l436k51L501J499k810k792K068L829j359
$$ plain form
2508 1467 -2641 -2116 1743 2416 -1064 -2872 517 2439 527 -2061 -1419 1312 1804 -860 -1912 -116
2524 -116 2171 1415 -2146 -1456 1573 1937 -656 -2032 390 2171 349 -2003 -872 1531 1585 -957
2540 -957 -1576 401 1749 648 -1579 -919 1637 1498 -708 -1424 550 1914 192 -1625 -298 1450
2556 1450 988 -798 -1062 608 1347 -234 -1253 -276 1222 790 -1212 -1262 510 1168 -327 -1510 -394
2573 -394 1145 307 -1239 -880 718 1090 -552 -1117 -38 693 353 -1204 -999 744 873 -726 -1065
2590 -1065 52 1060 219 -1147 -653 624 759 -641 -724 26 802 -55 -484 -579 525 565 -567 -883
2608 -883 83 906 203 -626 -263 825 325 -346 -671 107 814 451 -791 -255 472 725 -309 -755 556
2627 556 872 320 -744 -195 1003 594 -247 -439 474 743 172 -710 -170 830 574 -369 -983 341 931
$$ packed form
2508A467m108N25L859O73l480j808L389J922j912k588O42K731M92k664j052J796
2524a16K287p56l561O90L029L64k593j376K422J781j822k352J131K403N4k542
2540i57o19J977J348j101k227O60K556j39k206p16J974J364j722j817J327J748
2556A450m62j786k64J670P39j581j019R77J498m32k002n0J772O58j495j183J116
2573c94J539q38j546L59J598L72j642n65J079P31l40j557K05J743J29j599l39
2590a065J117J008q41j366M94J277J35j400q3P50P76q57m29r5J104M0j132l16
2608h83R66Q23p03q29L63J088n00o71l25P78P07l63j242N36P27K53j034m46J311
2627E56L16n52j064N49J198m09q41j92R13K69n71q82N40J000k56r43o14J324N90
$$ plain form
2646 931 -63 -1185 -44 859 633 -661 -585 302 844 -198 -848 -268 922 439 -832 -734 263 886 196
2665 196 -1166 -348 754 379 -730 -1045 489 983 -269 -1130 -301 854 696 -825 -849 435 1214 -152
2683 -152 -1651 -258 1120 344 -1106 -953 501 1035 -258 -1406 -127 1067 1041 -1109 -1321 1036 1316
2700 1316 -440 -1555 130 1621 843 -1132 -861 1041 1397 -322 -1623 -266 1441 685 -1524 -1522 956
2717 956 1928 -583 -1939 324 2246 824 -1752 -909 1785 1363 -654 -1696 320 1947 573 -1392
2733 -1392 -1110 1190 1878 -716 -2472 364 2743 522 -2574 -1414 2461 1777 -1693 -1915 965 2167
2749 2167 -60 -2069 -908 1537 1678 -1043 -2760 35 2834 386 -2903 -1541 2726 1968 -2313
2764 -2313 -2523 1530 2440 -467 -2712 -294 2300 1126 -1614 -1912 517 2595 631 -3123 -1235 3033
$$ packed form
2646I31r94j122J141R03k26j294P6Q87N42j042o50N80J190m83j271R8R97O23o90
2665A96j362Q18J102l75j109l15J534M94j252q61Q29J155j58j521k4J284P79j366
2683a52j499J393J378p76j450J53J454N34j293j148J279J194k6k150k12K357K80
2700A316j756j115J685J491p78j975K71J902L56j719j301J357J707p56k209KK478
2717I56R72k511j356K263J922j422k576Q43K694m22k017j042K016J627j374j965
2733a392K82K300O88k594j756K836K379k221l096J160L875o84l470k22K880J202
2749B167k227k009J161K445J41k721j717K795K799k448l289J362M267p58m281
2764b313k10M053R10k907k245K418K594j174k740k98K429K078j964l754J888M268
$$ plain form
2780 3033 2478 -2640 -2885 1973 3400 -1271 -3293 385 2954 735 -2372 -1547 1538 2284 -73 -3111
2796 -3111 -1004 3158 2475 -2776 -3261 2439 4003 -1321 -4287 691 4118 548 -3545 -1275 2814
2811 2814 2261 -1249 -2670 -106 2800 1787 -2843 -2989 2082 4035 -1337 -5032 841 4765 405
2826 405 -4481 -1505 3803 2222 -2652 -2545 1269 2432 595 -2593 -2001 2075 3038 -1278 -4518 203
2842 203 5092 491 -5282 -1844 4495 2499 -3924 -3286 2766 2899 -1326 -3068 -544 2477 1998 -1787
2858 -1787 -3291 520 3979 862 -4838 -2111 4795 2847 -4336 -3735 3327 4410 -2526 -3819 1060
2873 1060 3422 532 -2575 -2216 1569 3051 413 -4025 -1715 4317 3059 -4100 -4183 3386 4779 -2394
2889 -2394 -5047 1491 4807 40 -3912 -979 2707 2404 -990 -2580 -620 3135 2045 -3374 -3646
$$ packed form
2780C033n55n118k45M858J427m671k022L678K569k219l107Q25L085P46k357l038
2796c111K107M162o83n251m85N700J564n324k966M978L427l570m093K270M089
2811B814n53l510j421K564K906j013m630j46N071J953n372l695N873L924m360
2826D05m886K976N308j581m874J07L814J163j837l188N92M076R63m316l240M721
2842B03M889m601n773L438O339j996o423O38O052J33m225j742K524L021m79l785
2858a787j504L811L459l117n700K727O906j948p183O01P062J083o936j293M879
2873A060K362k890l107L59L785J482k638m438K310O032j258p159q3P569J393p173
2889b394k653O538L316m767l952K933L686l03l394j590J960L755j090n419k72
$$ plain form
2904 -3646 2934 4763 -2058 -5490 1197 5557 -236 -5036 -985 3978 1879 -2925 -2510 1361 2653
2919 2653 491 -2581 -2292 2372 3652 -1673 -4790 596 5302 491 -5514 -1392 4743 1839 -3781
2934 -3781 -2631 2467 2722 -1143 -2884 -631 2392 2190 -1884 -3331 546 4101 592 -4570 -1793
2949 -1793 4860 2472 -4275 -2969 3263 3332 -2118 -3576 675 2870 910 -2491 -2020 1297 2845 -72
2965 -72 -3506 -1121 3905 2462 -3509 -3143 3005 3753 -2480 -3899 1247 3962 -157 -2821 -1061 2300
2981 2300 2023 -782 -2239 -256 2846 1649 -2744 -2510 2419 3511 -1968 -3708 1082 4159 -86
2996 -86 -3657 -652 3143 1343 -2052 -1960 965 2294 188 -2448 -1546 1896 2462 -1687 -3196 833
3012 833 3556 -231 -3656 -585 3200 1195 -2405 -2099 1714 1949 -883 -2202 -288 2013 1327 -1717
$$ packed form
2904c646O580J829o821l432O687M360n793m800M051M963k099m804M15L871J292
2919B653k162l072K89M664J280n325l117N386M706m811o005M122O135k904n620
2934c781J150N098K55l865j741K253L023k02m074j447L877L555l509n162K777
2949a793O653k388o747J306O232O9n450j458M251K195j960l401M71L317J548k917
2965g2l434K385N026j443n971L66O148P48o233j419N146K715m119k664J760L361
2981B300k77k805j457J983L102j197m393K34M929J092n479j740M790L077m245
2996h6l571L005L795j800l395R2K925J329k106k636R02L442N66m149j509M029
3012H33K723l787l425L071L785k005l600L06L813K35k832j319J914K301o86l044
$$ plain form
3028 -1717 -2084 809 2607 -549 -3056 -587 2871 1411 -2634 -1949 1724 1803 -1356 -2113 112 2021
3044 2021 124 -1506 -1438 1310 1941 -418 -1939 -542 2153 1032 -2330 -1566 2034 2070 -1253 -1886 590
3061 590 2137 -5 -1578 -314 1640 1385 -966 -1405 71 1811 402 -1667 -836 1727 1348 -1266
3077 -1266 -1842 781 2194 -61 -1631 -349 1484 833 -970 -1210 912 1451 -8 -1359 -438 1388
3093 1388 967 -1030 -1232 771 1414 -397 -1484 -109 1427 374 -1140 -959 559 1011 -587 -1218
3109 -1218 -379 891 353 -1094 -887 722 900 -666 -1197 -174 1177 122 -1062 -547 538 833 -496
3126 -496 -1055 155 1027 66 -858 -480 489 556 -271 -1019 240 914 80 -1000 -588 738 484 -631 -759
3145 -759 383 1022 -159 -748 -72 777 550 -566 -788 550 803 -156 -543 -251 709 540 -626 -421
$$ packed form
3028a717l67K893J798l156k507K469L458j460m045O85L673P9l159p57K225J909
3044B021j897j630O8K748O31k359j521J397K695j121l362P64L600L6l323o33K476
3061E90J547k142j573J264J954k55k351m39J476J740j409k069Q31K563l79k614
3077a266n76K623J413k255j570J282J833o51j803k40K122N39j459j351R21J826
3093A388m21j997k02K003O43j811j087J375J536j053j514J81J518M52j598o31
3109a218Q39J270n38j447K07J609J78j566n31J023J351j055j184N15J085K95j329
3126d96n59J210Q72r61r24L78R69O7q27p48J259O74q34j080M12J326k54j115j28
3145g59J142O39j181n89O76Q49k27j116k22J338K53r59l87K92R60j69j166K05
$$ plain form
3163 -421 652 774 131 -962 -109 894 329 -709 -837 218 655 -78 -670 14 744 402 -825 -536
3181 -536 656 509 -234 -398 -69 582 48 -672 -400 165 770 -102 -644 -2 685 96 -663 -665 404 608
3201 608 -433 -506 -267 606 226 -731 -525 646 543 -283 -770 153 646 25 -643 -281 437 492 -332 -812
3221 -812 340 661 179 -780 -639 539 392 -184 -807 190 951 22 -920 -250 566 434 -548 -652 106
3240 106 646 213 -626 -209 869 845 -419 -630 299 807 217 -677 -142 650 531 -690 -542 273 859
3259 859 13 -879 -287 897 932 -455 -993 346 1062 -41 -1049 -378 1015 495 -756 -850 548 931
3277 931 -53 -1110 -273 671 773 -715 -1289 349 1304 -251 -1397 -248 1419 458 -1290 -872 784
3294 784 1125 -395 -1069 -48 892 498 -959 -1015 610 1111 -74 -1630 -396 1609 624 -1210 -1044
$$ packed form
3163d21J073J22o43j093Q53J003n65j038j28J055M37p33n92O84P30l42j227K89
3181e36J192j47p43j64L29O51n34p20K72N65O05q72n42O42O87n89p59kJ069K04
3201F08j041p3K39Q73l80r57K06J171j03q26m87R23M93o21o68L62P18N5q24m80
3221h12J152L21m82r59J41J178j47n76o23R97P61r29r42O70Q16j32r82j04P58
3240A06N40m33q39M17J078k4j264k11R29N08n90q94N35P92j19j221J48Q15N86
3259H59q46q92N92J184L5j387n38J339P16j103j008O71J393n20j251r4J398L83
3277I31r84j057Q37R44J02j488n74J638R55j555j146J149J667r61j748M18J656
3294G84L41j520o74J021R40l94j457n6J625N01j185j556J234K005r85j834J66
$$ plain form
3311 -1044 1128 1165 -569 -1350 276 1325 248 -1291 -923 671 1035 -336 -1710 -373 1729 933
3327 933 -1275 -1371 1281 1878 -934 -2147 757 1860 68 -1631 -665 1263 1040 -670 -1256 27 1756
3344 1756 934 -1711 -1395 1804 1948 -1331 -2251 716 2549 -397 -2032 -319 1921 885 -1212 -1056
3360 -1056 452 1521 446 -1514 -1289 1379 1644 -1089 -2426 428 2531 -207 -2776 -293 2267
3375 2267 1054 -1745 -1413 1229 1451 -687 -1844 -721 1176 1245 -1175 -1999 651 2638 -118 -3150
3391 -3150 -423 2794 1064 -2525 -1564 1970 1884 -1242 -1833 163 1676 769 -1396 -1714 879 1823 -65
3408 -65 -2441 -360 2969 1050 -2883 -1965 2119 2246 -1889 -2442 1376 2123 -17 -1889 -868 1389
3424 1389 1579 -534 -1983 -389 2661 1432 -2516 -2163 2333 2904 -1812 -2860 1138 2881 -454 -2627
$$ packed form
3311a044K172L7j734p81J626J049j077j539L68J594L64j371j374J337K102p96
3327I33k208r6K652N97k812j213K904J103j792j699R66J928k23j710n86J283J729
3344A756q22k645L16L199J44l279r20K967J833k946j635J713K240j036k097J56
3360a056J508J069j075j960K25K668K65k733j337K854K103k738k569K483K560
3375B267j213k799L32K642K22k138j157J123J897O9k420q24K650J987k756l032
3391c150K727L217j730l589R61L534q6l126n91J996J513r07k165l18K593R44j888
3408f5k376K081L329j919l933R18M084J27m135n53L818P47k140j872J021K257
3424A389J90k113j449J594L050j229l948L53M496N71m716j048L998J743l335k173
$$ plain form
3440 -2627 -185 1812 1064 -1190 -1576 96 1733 887 -2180 -1784 1951 2470 -1671 -3161 947 3406
3456 3406 -589 -3537 -48 3086 909 -2240 -1393 1262 1658 -564 -1928 -980 1517 1875 -1694 -2780
3472 -2780 968 3124 -282 -3543 -475 3415 934 -2994 -1522 2331 1575 -1324 -1887 269 1710
3487 1710 951 -1142 -1988 760 2410 -259 -2959 -790 3472 1250 -3031 -1612 2442 2073 -1670 -2019
3503 -2019 870 2210 -269 -1549 -970 1223 1615 -120 -2182 -476 2647 1256 -2496 -1824 2544 2253
3519 2253 -1935 -2375 1275 2726 -608 -2201 -386 1921 917 -1153 -1615 388 1966 574 -2131
3534 -2131 -1410 1925 1986 -1753 -2496 1298 2389 -836 -2771 134 2259 697 -1592 -1192 878 1417
3550 1417 -386 -1499 -647 1653 1257 -1448 -1964 923 2296 -627 -2680 8 2680 544 -2377 -1132
$$ packed form
3440b627K442J997p48k254l86J672J637q46l067L96L735N19m141j490M108K459
3456C406l995k948L489L134k177l149Q47K655L96k222j364R48K497L58l569j086
3472b780L748K156l406l261L068L890k481l928J472L853p56k899n63K156J441
3487A710p59k093q46K748J650k669k700K169M262k222m281J419M054l69l743l49
3503b019K889J340k479j280N79K193L92j735k062J706L123j391l752O72M368k91
3519B253m188m40L650J451l334j593J815K307j004k070m62K003J578j392k705
3534b131P21L335O1l739p43L794J091l225j935K905K125j562k289M00K070N39
3550A417j803j113Q52K300l96k705n16K887J373k923k053K688K672k136k921J245
$$ plain form
3566 -1132 1644 1638 -886 -1818 216 1470 480 -1314 -1532 626 1779 -455 -2108 95 2414 675
3582 675 -2225 -966 2044 1375 -1327 -1422 706 1479 -290 -932 -429 1150 1259 -514 -1380 174 1911
3599 1911 350 -1811 -1010 1767 1275 -1459 -1482 1009 1450 -495 -1535 -18 1364 608 -647 -1084 484
3616 484 1451 72 -1507 -526 1478 990 -1013 -1456 833 1434 -404 -1569 91 1390 327 -1117
3632 -1117 -807 481 1317 -335 -1192 -141 955 488 -875 -1160 1197 1294 -716 -1296 -133 1396 242
3649 242 -1175 -770 964 787 -739 -1321 249 826 44 -925 -750 555 961 -584 -1350 418 1162 276
3667 276 -1012 -419 897 785 -763 -906 369 884 109 -681 -7 725 341 -701 -820 575 941 -176
3685 -176 -544 -74 982 690 -732 -404 516 587 -49 -949 -95 931 549 -353 -571 502 826 -158 -799
$$ packed form
3566a132K776ok524r32K034J254r90j794k18K158J153k234j653K203K319j739
3582F75k900J259L010o69k702r5K128P73j769o42N03J579J09j773q66J554J737
3599A911j561k161Q01K777m92k734k3K491M41j945j040J517J382p56j255m37J568
3616D84R67j379j579R81K004m88k003m43K289O01j838j165J660J299j063j444
3632a117L10J288Q36j652q57J051J096m67j363k85K357R7k010n80J163J529j154
3649B42j417M05J734j77j526n82J570N77p82r69J75J305M06j545p66J768P44q86
3667B76j288N93J316j12j548j43J275N15p75p90O74P32l84j042j19J395L66j117
3685a76l68M70J056k92j422L28R20P1o36r00Q54J026l82r02k18J073L24r84o41
$$ plain form
3704 -799 -12 671 522 -606 -596 684 703 -244 -607 -42 618 367 -644 -177 294 644 -320 -793 91 600
3724 600 243 -703 -442 510 316 -424 -592 89 489 263 -581 -181 309 463 -263 -728 176 567 21 -722
3744 -722 -413 454 366 -322 -559 200 629 -50 -446 -92 526 594 -210 -82 366 434 -7 -673 103 732 158
3765 158 -417 -388 205 392 -52 -395 -219 706 288 -238 -541 219 298 46 -459 -96 624 103 -478 -271 395
3786 395 653 -110 -688 -176 757 598 -178 -409 478 613 -157 -600 -115 747 332 -574 -649 373 390 -196
3806 -196 -702 19 643 319 -462 -494 281 479 -202 -702 -14 893 410 -615 -662 311 523 -74 -594 -165
3826 -165 774 191 -553 -529 396 711 -249 -1036 210 892 41 -852 -558 735 549 -666 -730 296 848
3845 848 98 -720 -552 516 759 -468 -866 -246 1220 310 -779 -315 790 733 -696 -726 475 876
$$ packed form
3704g99P87O83j49j128J0J280J9r47l63N65O60k51j011M67M71L50r64m73Q84N09
3724F00l57r46K61R52j94p40j68O81M00k26q44M00M90J54p26m65R04L91n46p43
3744g22L09Q67q8o88k37P59M29o79l96L54O18O8q04J28M48O8m41o66P76O29n74
3765A58n75K9N93J87m44l43J76R25m18n26l03P60P9k52n05L63P20n21n81K07O66
3786C95K58p63n78N12R33j59p76k31Q87J35p70m43M85Q62m15r06p5J022J7n86
3806a96n06P21O24l24p81l2P75J98o81n00O88R07m83j025m7R73K12n97n20M29
3826a65R39n83p44K4R25L15r60p87J246O82q51q93K94J293j86j215o4J026N52
3845H48p50q18J68J068K43j227l98O20J466r10j089M64J105n7j429l0J201M01
$$ plain form
3863 876 -122 -808 -171 687 653 -493 -791 46 937 455 -1074 -360 1161 1063 -665 -1029 515 1075 -241
3882 -241 -897 -102 782 277 -472 -735 225 796 268 -922 -386 995 1023 -864 -1152 499 1355 -355 -1201
3901 -1201 42 1024 389 -942 -883 461 760 -48 -1058 -579 1164 1093 -779 -1181 668 1619 -270 -1692
3919 -1692 8 1407 564 -1276 -876 744 1072 -641 -790 34 963 606 -786 -1278 415 1433 -310
3936 -310 -1653 -139 1905 553 -1677 -798 1392 1089 -1081 -1531 836 1121 -13 -898 -630 708 1352
3953 1352 -165 -1414 -546 1485 681 -1773 -1104 1564 1487 -977 -1195 965 1577 -258 -1227 -12 1078
3970 1078 824 -655 -1051 92 1459 468 -1431 -1171 1383 1506 -1223 -1756 768 1959 -364 -1946
3986 -1946 -15 1594 449 -908 -814 527 1185 268 -1315 -824 1210 1583 -1043 -1563 592 2087 -162
$$ packed form
3863H76r98o86O37Q58l4j146k98Q37Q91m82j529P14J521r8j728l64J544N60j316
3882b41o56P95Q84n05p49k63R60N71n28j190N36J381K8j887k88J651Q56j710q46
3901a201J243R82o35j331N9J344K99q08j010M79J743p1j872m02J849R51j889j422
3919a692J700J399q43j840M00J620L28j713j49Q24R29l57j392m92J693J018j743
3936c10j343J514K044j352k230Q79K190l03k170m50K367K85j134q85K68J338O44
3953A352j517j249Q68K031q04k454O69K668p7k464k18K160O12j835r69J215J090
3970A078k54j479l96J143J367r91j899K60K554J23k729n33K524J191k323j582
3986a946J931J609j145j357R4J341O58r17j583M91K034L73k626n20K155J495k249
$$ plain form
4003 -162 -2165 -205 2159 321 -1715 -925 1023 1164 -316 -1183 -301 1192 981 -835 -1562 526 1942
4020 1942 -133 -2076 -244 1914 717 -2045 -1005 1476 1157 -1078 -1334 413 1171 214 -1010 -857
4036 -857 762 1460 -208 -1820 -255 2049 942 -2130 -1202 1517 1528 -1169 -1704 775 1738 -364 -1301
4053 -1301 -214 717 1035 -208 -1621 41 1830 583 -1629 -1110 1499 1348 -1230 -1639 1087 2102
4069 2102 -263 -1735 165 1351 419 -1102 -804 528 1067 155 -1384 -732 1203 1585 -1124 -1910 723
4086 723 1910 -447 -2004 60 1673 356 -1566 -705 838 1011 -251 -1171 -481 1028 652 -874
4102 -874 -1634 560 1939 -268 -2131 -38 1733 475 -1654 -665 1130 822 -815 -1180 127 818
4118 818 330 -762 -670 473 1466 -357 -1460 147 1819 653 -1533 -789 1651 1322 -1099 -1203 447
$$ packed form
4003a62k003J960K364j838k036P90J948J41j480q67Q82J493k11j816p27K088J416
4020A942k075j943J832K158j197k762J040K481l19k235k56J747P58r57j224J53
4036h57J619O98j668j612J565K304j107l072R28K719J1k697n35K479R63k102r37
4053a301J087R31L18j243j413J662J789j247k212N19K609j51k578m09K726J015
4069B102k365j472J900J186r32j521K98J332N39r12j539O52J935L82k709p86K633
4086G23J187k357j557K064J613j317j922Q61J543J73j262r20O90J509l76j526
4102h74p60K194J379k207j863K093J771j258k129R89J795l08j637l65J307O91
4118H18m88j092R2J143R93j823j103J607J672j166k186P44K440l29k421j04J650
$$ plain form
4135 447 1267 73 -1086 -327 844 674 -341 -947 53 1249 515 -1415 -622 1224 944 -1063 -1068 963
4153 963 1245 -239 -1186 -120 995 443 -778 -475 277 991 177 -1147 -430 910 701 -926 -1135 635
4171 635 1281 -295 -1414 34 1032 216 -994 -530 494 519 -57 -1030 -102 826 376 -615 -919 560
4189 560 827 -161 -1134 136 1031 101 -1028 -314 618 447 -506 -864 54 848 242 -706 -416 525 834
4208 834 -242 -1126 -47 961 2 -941 -443 973 437 -602 -618 384 808 -54 -638 -29 581 541 -340
4227 -340 -391 336 674 6 -675 -184 858 536 -687 -720 506 668 -77 -521 -161 586 248 -449 -280 155
4247 155 696 14 -498 -288 663 177 -481 -490 340 785 -131 -458 102 524 125 -676 -439 554 452 -295 -686
4268 -686 -77 637 127 -730 -336 451 544 -312 -629 9 511 64 -385 -220 377 485 -404 -600 222 608
$$ packed form
4135D47Q20j194j159P59J171j70j015o06J000J196p34j930P93J846k80k007nK031
4153I63K82j484r47J066J115n52j221L03P52P14q14j324P17J340k09j627k09J770
4171F35O46j576j119J448R98q16j210M64J024K5n76r73R28R28m50r91l04J479
4189E60K67r88r73J270Q95r30j129P14R32j71r53l58R18P94o06r48K90R41L09
4208H34j076q84J079J008r59r43M98J416n36j039j6J002M24q62n84O09O10m0q81
4227c40n1P27L38o68o81M91J042l22j223l3J226J62p45m44L60P47l38o97J69M35
4247A55N41o82n12K10R51m86o58rQ30M45r16l27N60M22l99q01K37R93j02p47l91
4268f86O09P14n10q57L94P87R3q56l17O38N02m47m49J65N97J08q89j96Q22L86
$$ plain form
4288 608 92 -580 -128 292 327 -441 -430 135 593 41 -345 -280 57 353 -303 -377 198 436 204 -292 -254 679
4310 679 339 -382 -259 155 398 54 -538 -29 470 330 -418 -639 146 646 65 -441 -53 685 380 -445
4330 -445 -291 286 293 -283 -590 -114 375 130 -159 -265 254 260 -231 -595 79 305 162 -324 -444 577 456
4351 456 -205 -336 -39 649 285 -441 -262 241 369 -388 -744 -50 585 -108 -350 -490 466 487 -219 -227 18
4372 18 384 -67 -356 -191 255 343 -190 -622 87 333 -58 -535 -46 546 321 -389 -629 32 756 -49 -586
4393 -586 -111 167 274 -168 -476 83 329 324 -517 -52 472 320 -231 -622 -35 779 24 -428 -288 470 465
4414 465 -338 -454 195 474 288 -343 -463 388 364 -379 -461 318 386 67 -513 -132 432 106 -410 -650 311
4435 311 396 69 -417 -143 647 469 -373 -865 178 872 -183 -1034 14 837 407 -662 -572 368 518
$$ packed form
4288F08n16o72M52M20L5p68J1N65M58n52l86O5L37K96o56p4N75K38k32m96L8R33
4310F79l40p21J23M14K43l44n92N09M99j40p48k21P85N00n81n06L88P38l05q25
4330d45J54N77Pn76l07M76M89k45k89j06N19Om91l64O74K26j43m86j20J021j21
4351D56o61j31K97O88l64p26J79N03J28p57l56O94O35o93k42j40R56K1p06qK45
4372A8L66m51k89J65M46Q8n33m32P09K46l91m77M89N92k25p10k40O61P24q05n37
4393e86M75K78J07m42l08N59K46nq41M65N24j52n51l91N87Q14p55m52J40P58n
4414D65q03j16O49K79j86o31j20Q51k4p43q2P79O8l19n80L81N64l26n16k40R61
4435C11Q5l27m86K74P90j78q42m92J043O94j055q51J048Q23m30j069R0R40J50
$$ [...]
8191H8
##END NTUPLES=NMR FID
##END=
