##TITLE=1H_Pr GluCl
 CDCl3, 8 sc, 
 1.4.2019
##JCAMPDX= 6.0         $$ Bruker NMR JCAMP-DX V2.0
##DATA TYPE= NMR FID
##DATA CLASS= NTUPLES
##ORIGIN= UXNMR, Bruker Analytische Messtechnik GmbH
##OWNER= root
$$ XWIN-NMR		Version 3.5
$$ Mon Apr  1 15:47:36 2019 Russian Standard Time (UT+4h)  she@DPX200
##.OBSERVE FREQUENCY= 200.1316
##.OBSERVE NUCLEUS= ^1H
##.DELAY= (6, 6)
##.ACQUISITION MODE= SIMULTANEOUS
##.ACQUISITION SCHEME= undefined
##.AVERAGES= 8
##.DIGITISER RES= 18
##SPECTROMETER/DATA SYSTEM= spect
##.PULSE SEQUENCE= zg30
##.SOLVENT NAME= CDCl3
##.SHIFT REFERENCE= (INTERNAL, CDCl3, 0, 15.7039)
##AUDIT TRAIL= $$ (NUMBER, WHEN, WHO, WHERE, WHAT)
$$ ##TITLE= Audit trail, XWIN-NMR		Version 3.5
$$ ##JCAMPDX= 5.01
$$ ##ORIGIN= Bruker BioSpin GmbH
$$ ##OWNER= she
$$ F:/spectra/data/she/nmr/H-F/1/audita.txt
$$ ##AUDIT TRAIL=  $$ (NUMBER, WHEN, WHO, WHERE, WHAT)
(   1,<2019-04-01 15:46:21.25 +0400>,<she>,<DPX200>,
      <created by zg, POWCHK disabled, PULCHK disabled
       configuration hash MD5:
       00 E9 B6 7A A2 85 ED C7 34 08 36 98 17 FE 4E 26
       data hash MD5: 16K
       59 4D BF 6B 8C 45 13 44 6C A3 3F BA FF 60 11 4B>)
$$ ##END=
$$ 
$$ hash MD5
$$ 5E E1 BC 64 C4 A4 B0 51 B5 2B 5E 22 E0 56 BE B1
##$RELAX= 
##$RELAX= 
##$RELAX= 
##$RELAX= 
##$RELAX= 
##$RELAX= 
$$ Bruker specific parameters
$$ --------------------------
##$DU= <F:/spectra>
##$EXPNO= 1
##$NAME= <H-F>
##$PROCNO= 1
##$TYPE= <nmr>
##$USER= <she>
##$AMP= (0..31)
100 100 100 100 100 100 100 100 100 100 100 100 100 100 100 100 100 100 
100 100 100 100 100 100 100 100 100 100 100 100 100 100 
##$AQSEQ= 0
##$AQ_mod= 1
##$AUNM= <au_zg>
##$AUTOPOS= <>
##$BF1= 200.13
##$BF2= 200.13
##$BF3= 200.13
##$BF4= 200.13
##$BF5= 200.13
##$BF6= 200.13
##$BF7= 200.13
##$BF8= 200.13
##$BYTORDA= 1
##$CFDGTYP= 0
##$CFRGTYP= 5
##$CHEMSTR= <none>
##$CNST= (0..31)
1 1 145 1 1 1 1 1 1 1 1 1 1 1 1 1 1 1 1 1 1 1 1 1 1 1 1 1 1 1 1 1 
##$CPDPRG= <>
##$CPDPRG1= <>
##$CPDPRG2= <>
##$CPDPRG3= <>
##$CPDPRG4= <mlev>
##$CPDPRG5= <mlev>
##$CPDPRG6= <mlev>
##$CPDPRG7= <mlev>
##$CPDPRG8= <mlev>
##$CPDPRGB= <>
##$CPDPRGT= <>
##$D= (0..31)
0 1.2 0 0 0 0 0 0 0 0 0 0.03 0 0 0 0 0 0 0 0 0 0 0 0 0 0 0 0 0 0 0 0 
##$DATE= 1554119180
##$DBL= (0..7)
120 120 120 120 120 120 120 120 
##$DBP= (0..7)
150 150 150 150 150 150 150 150 
##$DBP07= 0
##$DBPNAM0= <>
##$DBPNAM1= <>
##$DBPNAM2= <>
##$DBPNAM3= <>
##$DBPNAM4= <>
##$DBPNAM5= <>
##$DBPNAM6= <>
##$DBPNAM7= <>
##$DBPOAL= (0..7)
0.5 0.5 0.5 0.5 0.5 0.5 0.5 0.5 
##$DBPOFFS= (0..7)
0 0 0 0 0 0 0 0 
##$DE= 6
##$DECBNUC= <off>
##$DECIM= 24
##$DECNUC= <off>
##$DECSTAT= 4
##$DIGMOD= 1
##$DIGTYP= 9
##$DL= (0..7)
0 120 120 120 120 120 120 120 
##$DP= (0..7)
150 150 150 150 150 150 150 150 
##$DP07= 0
##$DPNAME0= <>
##$DPNAME1= <>
##$DPNAME2= <>
##$DPNAME3= <>
##$DPNAME4= <>
##$DPNAME5= <>
##$DPNAME6= <>
##$DPNAME7= <>
##$DPOAL= (0..7)
0.5 0.5 0.5 0.5 0.5 0.5 0.5 0.5 
##$DPOFFS= (0..7)
0 0 0 0 0 0 0 0 
##$DQDMODE= 0
##$DR= 18
##$DS= 0
##$DSLIST= <SSSSSSSSSSSSSSS>
##$DSPFIRM= 0
$$ [...]
##$SUBNAM2= <"">
##$SUBNAM3= <"">
##$SUBNAM4= <"">
##$SUBNAM5= <"">
##$SUBNAM6= <"">
##$SUBNAM7= <"">
##$SUBNAM8= <"">
##$SUBNAM9= <"">
##$SW= 24.9336934301222
##$SWIBOX= (0..15)
0 0 2 0 0 0 0 0 0 0 0 0 0 0 0 0 
##$SW_h= 4990.01996007984
##$TD= 16384
##$TD0= 1
##$TE= 0
##$TE2= 300
##$TE3= 300
##$TEG= 300
##$TL= (0..7)
0 120 120 120 120 120 120 120 
##$TP= (0..7)
150 150 150 150 150 150 150 150 
##$TP07= 0
##$TPNAME0= <>
##$TPNAME1= <>
##$TPNAME2= <>
##$TPNAME3= <>
##$TPNAME4= <>
##$TPNAME5= <>
##$TPNAME6= <>
##$TPNAME7= <>
##$TPOAL= (0..7)
0.5 0.5 0.5 0.5 0.5 0.5 0.5 0.5 
##$TPOFFS= (0..7)
0 0 0 0 0 0 0 0 
##$TUNHIN= 0
##$TUNHOUT= 0
##$TUNXOUT= 0
##$USERA1= <user>
##$USERA2= <user>
##$USERA3= <user>
##$USERA4= <user>
##$USERA5= <user>
##$V9= 5
##$VALIST= <valist>
##$VCLIST= <CCCCCCCCCCCCCCC>
##$VD= 0
##$VDLIST= <DDDDDDDDDDDDDDD>
##$VPLIST= <PPPPPPPPPPPPPPP>
##$VTLIST= <TTTTTTTTTTTTTTT>
##$WBST= 1024
##$WBSW= 4
##$XGAIN= (0..3)
0 0 0 0 
##$XL= 0
##$YL= 0
##$YMAX_a= 307862
##$YMIN_a= -361766
##$ZGOPTNS= <>
##$ZL1= 120
##$ZL2= 120
##$ZL3= 120
##$ZL4= 120
##$ABSF1= 10
##$ABSF2= 0
##$ABSG= 5
##$ABSL= 3
##$ALPHA= 0
##$AQORDER= 0
##$ASSFAC= 0
##$ASSFACI= 0
##$ASSFACX= 0
##$ASSWID= 0
##$AUNMP= <proc_1d>
##$AZFE= 0.1
##$AZFW= 0.1
##$BCFW= 1
##$BC_mod= 2
##$BYTORDP= 1
##$COROFFS= 0
##$CY= 11.3945322036743
##$DATMOD= 1
##$DC= 2
##$DFILT= <>
##$DTYPP= 0
##$F1P= 18.9103706918063
##$F2P= -1.10871071338519
##$FCOR= 0.5
##$FTSIZE= 0
##$FT_mod= 4
##$GAMMA= 1
##$GB= 0.15
##$INTBC= 1
##$INTSCL= 1
##$ISEN= 128
##$LB= 0.24
##$LEV0= 0
##$LPBIN= 0
##$MAXI= 10000
##$MC2= 0
##$MEAN= 0
##$ME_mod= 0
##$MI= 1.114404
##$NCOEF= 0
##$NC_proc= 0
##$NLEV= 6
##$NOISF1= 3.799351
##$NOISF2= 2.8
##$NSP= 1
##$NTH_PI= 0
##$NZP= 0
##$OFFSET= 15.70392
##$PC= 1
##$PHC0= -9216.822
##$PHC1= 22.20026
##$PH_mod= 1
##$PKNL= yes
##$PPARMOD= 0
##$PSCAL= 0
##$PSIGN= 0
##$REVERSE= no
##$SF= 200.130013532006
##$SI= 16384
##$SIGF1= 3
##$SIGF2= 2
##$SINO= 400
##$SIOLD= 16384
##$SREGLST= <1H.CDCl3>
##$SSB= 0
##$STSI= 0
##$STSR= 0
##$SW_p= 3612.71676300578
##$SYMM= 0
##$S_DEV= 0
##$TDeff= 0
##$TDoff= 0
##$TI= <>
##$TILT= no
##$TM1= 0
##$TM2= 0
##$TOPLEV= 0
##$USERP1= <user>
##$USERP2= <user>
##$USERP3= <user>
##$USERP4= <user>
##$USERP5= <user>
##$WDW= 1
##$XDIM= 8192
##$YMAX_p= 0
##$YMIN_p= 0
$$ End of Bruker specific parameters
$$ ---------------------------------
##NTUPLES= NMR FID
##VAR_NAME=  TIME,          FID/REAL,        FID/IMAG
##SYMBOL=    X,             R,               I
##VAR_TYPE=  INDEPENDENT,   DEPENDENT,       DEPENDENT
##VAR_FORM=  AFFN,          ASDF,            ASDF
##VAR_DIM=   8192,          8192,            8192
##UNITS=     SECONDS,       ARBITRARY UNITS, ARBITRARY UNITS
##FACTOR=    0.0002004,     1,               1
##FIRST=     0,             0,               0
##LAST=      1.6414764,     0,               0
##MIN=       0,             -361766,         0
##MAX=       1.6414764,     307862,          0
$$ Real data points
##PAGE= N=1
##DATA TABLE= (X++(R..R)), XYDATA
$$ [...]
3132D719k321l760k977O24P253J299p634k392M122K803J725k687n803J740P749
$$ 4719 2398 -1362 -4339 -3715 3538 4837 -2797 -5189 -1067 1736 3461 774 -5029 -3289 4460
3147D460q01m837j485N55L589L914m821n746M333M279q54j797k920j138N702K327
$$ 4460 3659 -1178 -2663 -2108 1481 5395 574 -5172 -839 3440 2586 789 -2131 -3269 2433 4760
3163D760n779k360K777Q80K039m77n669J61N842Q8l006j017j146J757N144k667
$$ 4760 -1019 -3379 -602 278 2317 1840 -3829 -3668 2174 2262 -744 -1761 -2907 -1150 3994 1327
3179A327n491K261L696k99M78k799k734M656L141l526k551J402M69K445P35n460
$$ 1327 -4164 -1903 1793 1494 1972 -827 -3561 1095 4236 710 -1841 -439 30 2475 3210 -2250
3195b250j058N345N09k533l23j854P36M700j350n180J145K731n00J288k088l570
$$ -2250 -3308 2037 2546 13 -310 -2164 -1428 3272 1922 -3258 -2113 618 118 1406 -682 -4252
3211d252L546L962l259j822J052p14K624J692m406j267M575O31j705j86j684r1
$$ -4252 -706 3256 -3 -1825 -773 -1487 1137 2829 -1577 -2844 1731 2362 657 471 -1213 -1304
3227a304M998j262m394J012J872m06J576j440l589K253L412k505j756Q05j085
$$ -1304 3694 2432 -1962 -950 922 516 2092 652 -2937 -684 2728 223 -1533 -728 -1813
3242a813K032K521l607k633L220J441p84M25k367j231M625N79l663L44J253m18
$$ -1813 219 2740 -867 -3500 -280 1161 377 802 -1565 -2796 1829 2408 -1255 -911 342 -76
3258g6K333m30m395J174L854j007j185j60k095K197L354l143l332K584J026q0
$$ -76 2257 1827 -2568 -1394 2460 1453 268 108 -1987 210 3564 421 -2911 -327 699 619
3274F19R29k740k411M742J320l400o41K20N9L115K41m873L10L867k56n89k69k817
$$ 619 1548 -1192 -3603 1139 2459 -941 -1582 -1362 -1303 1812 2053 -2820 -2510 1357 1101 512 243 -2574
3292b574J899M423k165l847J602Q42R56K154l380l645M160K867k364j271j221
$$ -2574 -675 3748 1583 -2264 -662 180 1136 3290 -90 -3735 425 3292 928 -343 -1564
3307a564l01M118J262n803j254L831Q62J98j055l848J157N387p02m549L86L06
$$ -1564 -1865 2253 3515 -2288 -3542 289 1151 1349 294 -3554 -2397 2990 2288 -2261 -1875 -1569
3323a569K242K953l072m862K954M189q30j314k483j026N018K927n398l316K776
$$ -1569 673 3626 554 -4308 -1354 2835 2005 691 -1792 -2818 2200 5127 -271 -3587 -811
3338h11K531J287j144n355o7O737N92m617j555K35J836M056k207n898N71N158
$$ -811 1720 3007 1863 -3492 -3559 3178 3770 -847 -2402 -2167 -331 3725 1518 -4380 -3809 1349
3354A349J142q02l847l269N551N730m685n046R23L391L456n23o476j904P325K882
$$ 1349 2491 1689 -2158 -5427 124 5854 1169 -3877 -2954 437 3893 3370 -3106 -5010 2315 5197
3370E197m234k461j877K661N773j320o989q13M707K694L79n001n524N037P680
$$ 5197 963 -1498 -3375 -714 5059 3739 -3250 -4063 644 3338 3717 -1284 -6808 -1771 5909
3385E909k777o924j448L625N936P68q593l848P666M806k637m298k526J650P510
$$ 5909 3132 -3792 -5240 -1615 4321 5089 -3504 -7352 314 5120 2483 -1815 -4341 -2691 4819
3400D819K54o988k645L283M385K805m610p920K764R719J51p260m391J895P862
$$ 4819 5073 -1915 -4560 -1277 3108 5913 1303 -6617 -3853 5866 6017 -1243 -5634 -3739 4123
3415D123L522q888p030N860P301o16m894m937N28Q463K965p239m698J457N116
$$ 4123 7645 -1243 -8273 -2413 4888 4272 -622 -5559 -5031 3432 6397 -842 -5540 -4083 1033
3430A033N524l267j0251k22J1010M321o296q131k73R372P697q529j0585M206R444
$$ 1033 6557 3290 -6961 -7183 3827 8148 1852 -6279 -6552 2820 10517 1988 -8597 -4391 5053
3445E053J678m892p404n54R040M353o147o172J53L912P632j124j1061l793J0022
$$ 5053 6731 1839 -5565 -6119 2921 7274 1127 -5045 -4892 -980 6652 5528 -5533 -9326 696
3460F96P470l490r846n041R505J1620o094j3501J032R986N537l560r317k753R189
$$ 696 8166 4676 -5170 -10211 -706 10914 4820 -8681 -7649 2337 7874 4314 -5003 -7756 1433
3475A433P243n098o772k227L272Q078K530j0520p398O961R856R53r927r512O347
$$ 1433 8676 3578 -3194 -5421 -2149 5929 8459 -2061 -9459 -2498 7358 8311 -1616 -11128 -4781
3490d781J5158j592j4807m978R523R557j019j1362n932Q826R291l052p595l171
$$ -4781 10377 8785 -6022 -11000 -1477 8080 7061 -4301 -10233 -1407 7884 4832 -2763 -5934
3504e934J546Q404M847q594r503L999J0103N263p282j3331K093J6930M332j4236
$$ -5934 -4388 4016 8863 269 -9234 -5235 4868 10131 2849 -10482 -8389 8541 12873 -1363
3518a363j0069O216J2820K887j1739j0418P339J2068j201p800n113P99P868O381
$$ -1363 -11432 -5216 7604 10491 -1248 -11666 -4327 7741 6540 -1260 -6373 -5574 2294 8675
3532H675o535r782M9Q735Q096l588j4370l500J6179R995j0850j3861J798J3558
$$ 8675 2140 -7642 -7593 1142 9238 5650 -8720 -12220 3959 13954 3104 -10757 -8959 4599
3546D599Q797j0488j4254M080J4180K472q289o861n71P766P461m617r758j711
$$ 4599 13396 2908 -11346 -7266 6914 9386 1097 -5764 -6335 1431 8892 4275 -5483 -7194
3560g194N394R378J408j3575r076J2305J3901n134j5076n285J1777J4443n745
$$ -7194 -1800 7578 8986 -4589 -13665 -1360 12541 7407 -7669 -12954 -1177 13266 7521
3573G521j7740r35J4368O540o299q721l264P909Q843k760q376l756L227R347M341
$$ 7521 -10219 -11154 3214 9754 3455 -5266 -8530 -621 8222 5462 -2914 -6670 -3443 5904 10245
3588A0245j0397j2013O929J4844J175j3220j0605P180J7421m49j7511o738J2470
$$ 10245 -152 -12165 -5236 9608 10783 -2437 -13042 -5862 11559 11110 -6401 -13139 -669
3601f69J0211k963j0897n914P250J0600j629q646l765J480Q035O463p194j2486
$$ -669 9542 6579 -4318 -10232 -2982 7618 5989 -2657 -6422 -4942 3093 9556 2362 -10124
3615a0124K500J3202N984q789j3605J708J7044O505j5405j1867Q148J2815J472
$$ -10124 -7624 5578 11562 2773 -10832 -9124 7920 14425 -980 -12847 -4699 8116 9588
3628I588j0356r504N131J1938L28q231m699K22O198P391l855j1462j914J0354
$$ 9588 -768 -10272 -5141 6797 7125 -1106 -5805 -5583 615 8006 4151 -7311 -9225 1129
3642A129Q127l469j3258m798J4304J1723r866j4318J795J2730O651p309j2652
$$ 1129 9256 5787 -7471 -12269 2035 13758 3892 -10426 -8631 4099 10750 3441 -9211
3655i211J282J2823L966p324n963j121N007Q230j697j0335l581O454Q691O73j1151
$$ -9211 -7929 4894 8860 1536 -4427 -5548 -541 7689 5992 -4343 -7924 -1470 7221 7894 -3257
3670c257q845R645J3992m636j4181l310R918J0247l125j3753k716J1773O585n162
$$ -3257 -12102 -2457 11535 6899 -7282 -10592 -674 9573 6448 -7305 -10021 1752 8337 3175
3684C175o930k665N002P890l03q391m574M408P201L407p782j0353M886J3674L44
$$ 3175 -3755 -6420 -1418 6472 6169 -2222 -6796 -2388 4813 8220 438 -9915 -5029 8645 8989
3699H989j1416o536M774J2066J052j2414o909R092Q681k774p218m000K929Q682
$$ 8989 -2427 -8963 -4189 7877 8929 -3485 -10394 -1302 7379 4605 -2613 -6613 -3684 4998
3713D998R94p901m146K536N403M913m366j0082J218J0729M126p416p786O19J0392
$$ 4998 5992 -1909 -6055 -3519 1884 6797 2431 -7651 -6433 4296 8422 1006 -6780 -6161 4231
3728D231N427q862r337N059Q887J052n904o316J148Q375K955o577m777Q72M018
$$ 4231 9658 796 -8541 -3482 5405 6457 553 -5763 -4615 3760 6715 138 -4639 -3767 251
3743B51N235j877q839j873Q325N264l748p217l192Q318Q213o374r318J406Q097
$$ 251 5486 3609 -5230 -7103 1222 6486 2738 -4479 -7671 647 8860 2486 -6832 -5426 2671
3758B671L575l785p215q76P901M508n257m695l20L514M983m68p502k866O427L940
$$ 2671 6246 2461 -4754 -5630 2271 6779 1522 -3173 -3493 21 5004 4536 -2966 -5832 595 4535
3774D535j076n324m367M474Q646k906q463j590O090M441o52o996l363O441N628
$$ 4535 3459 -1865 -6232 -1758 6888 3982 -4481 -6071 19 4460 3808 -3188 -6551 -110 5518
3789E518l688m626p87K116M866J029o428k471M111L920Rl202m984J854P688k50
$$ 5518 1830 -2796 -3583 -1467 3399 4428 -2000 -4471 -360 3560 3569 367 -4617 -2763 4925 4675
3805D675o554k411L019M232J426n311m432L787N755k096l424j956P07M353K043
$$ 4675 -1879 -4290 -1271 2961 4387 -924 -5356 -1569 4186 2090 -1334 -3290 -2583 1770 3813
3820C813m916l103K864K839J107j669m396k19O296J820n113k147J411K561L146
$$ 3813 -1103 -4206 -1342 1497 2604 935 -3461 -3680 2616 4436 -677 -2824 -1413 1148 4294
3835D294k690n752K018N239J09k815k233r40L970L272m174l756K280K108J205
$$ 4294 1604 -4148 -2130 3109 3218 403 -1830 -2770 1200 4472 298 -3458 -1178 930 2135
3850B135l29m365j244N013K328l884j952r6K001L718j298n758R16M405N84j111
$$ 2135 1806 -2559 -3803 1210 3538 -346 -2298 -2394 -393 3325 2027 -3731 -2815 1590 2174 1063
3866A063k400j438K916L728k866l626J560J878J504J79l648j902M465J547k153
$$ 1063 -1337 -2775 141 3869 1003 -2623 -1063 815 2319 2498 -1150 -3052 1413 2960 807
3881H07k056m73P88L454o56m040n70L599K16p31q95k509K078L735j584l211O99
$$ 807 -1249 -1722 -934 2520 1864 -2176 -2746 853 1069 338 -557 -3066 -988 2747 1163 -2048 -1349
3898a349J196J147J131k711k742L493K336k046o11q85k7L101P24l710o80K113
$$ -1349 -153 994 2125 -586 -3328 165 2501 455 -156 -1041 -1068 2033 2757 -953 -1633 480
3914D80N87K45m64k913N79L979j040k609Q1J17R05K049k090k757K212J916o74
$$ 480 1067 1312 848 -2065 -1486 2493 1453 -1156 -1075 -958 -53 1996 -94 -2851 -639 1277 603
3931F03q47q57r39K949J480l165j069J997L30P40O6k900P7L273K97k228k92n26
$$ 603 -244 -1101 -2040 909 2389 -776 -1845 152 482 1222 1288 -1612 -1535 1738 2035 -193 -485 -1011
3949a011J446K193j394l890J716K378m71n57j210j420K561K001l145j258J028
$$ -1011 435 2628 1234 -2656 -940 1438 967 410 -800 -2220 341 2342 -803 -2061 -1033
3964a033Q25J001N02l013p07L507L60j518l79r35P82L090q33l497N50K418j78
$$ -1033 -208 793 1295 -1718 -2425 1082 1442 -76 -455 -1390 -608 2482 1649 -1848 -1298 1120 942
3981I42M79j268k253J662L168j853j904J02N10J203J532k993k010K547J306r81
$$ 942 1421 153 -2100 -438 2730 877 -1027 -925 -415 788 2320 -673 -2683 -136 1170 189
3997A89m20j860L11L567J39l360l39J530O75J364j241l327J416L652r93j651k84
$$ 189 -231 -2091 -1780 1787 1926 -1434 -1773 -243 432 1796 555 -2772 -1356 2296 1303 -348 -632
4014f32o45K162K125k415l165K169K185m95m92k106r19M186P41l177j425J126
$$ -632 -1277 885 3010 595 -2570 -401 1784 1289 797 -1309 -2228 1958 2699 -478 -1903 -777
4030g77O85J931o83l975N60L479K38j297j151j298J977L601k315l680Q13K921
$$ -777 -92 1839 1156 -2819 -2259 1220 1458 161 -990 -2288 -311 3290 975 -2705 -1892 1029
4046A029Q49p8k790k003M345J975k756j811M1P74K471M02m442n86L391R83m36
$$ 1029 1878 1800 -990 -2993 1352 3327 571 -1240 -1199 -425 2046 2448 -1994 -2580 811 1794 1358
4063A358j505k934J730M632j125m554m76K460K224O34l597l334M004L893k480
$$ 1358 -147 -3081 -1351 3281 2156 -2398 -2874 -414 1810 2444 -1153 -4487 -483 3410 930
4078I30k477o71P81L244J263m250j843K873K050O94j385m373O64N359R90m663
$$ 930 -1547 -2218 -1437 1807 3070 -1180 -3023 -150 1900 2594 1209 -3164 -2500 2859 3849 -814
4094h14k358J940L349J753l984m719K854N336j056k643k337k43M067K554m106
$$ -814 -3172 -1232 2117 3870 -114 -4833 -1979 3357 2301 -342 -2679 -2922 1145 3699 -407
4109d07l141J730K462J844p93m813r90O178K647m405l499J95L845M510l591o388
$$ -407 -3548 -1818 644 2488 1695 -3118 -4108 2070 4717 312 -3187 -2992 853 5363 1772 -4616
4125d616J688N993M70k727k797j265M135L563l373l996N09K237K759Q95n699l402
$$ -4616 -2928 3065 3535 808 -1989 -3254 881 4444 1071 -2925 -2416 -179 2580 3475 -2224 -5626
4141e626N743M541k697m852k147L972O387k042p870m52O677K367k250m176k093
$$ -5626 117 4658 1961 -2891 -5038 -1066 5321 3279 -4591 -5043 1634 4001 1751 -2425 -4518
4156d518M545M704k296m653p23K031L842K146n702m754L932N785l23m868m698
$$ -4518 27 4731 2435 -2218 -2941 -910 2932 5078 -624 -5378 -1446 4339 4016 -852 -5550
4171e550K710Q005M69q779l115N729M846j021m921m029L754O363j561m444j821
$$ -5550 -2840 5165 5634 -3145 -6260 -531 4315 3294 -1627 -5656 -1902 4461 2900 -1544 -3365
4186c365J082L739L674m164o515K344O096K472l727o686Q3Q942L587q047n804
$$ -3365 -2283 1456 5130 966 -5549 -3205 2891 5363 1636 -5050 -4967 3975 7562 -485 -6289
4201f289L748O254J439n033n804K688P099k64m376k791KL902M051k749o416p8
$$ -6289 -2541 3713 5152 119 -5685 -2997 4102 3838 -538 -3329 -3327 575 4626 1877 -4539 -4617
4217d617N582L789j787p417k636Q476O355n785q098J450O826M310m179q064P06
$$ -4617 965 4754 2967 -4450 -7086 1390 7745 1960 -6138 -4688 2138 6448 2269 -5795 -5089
4232e089Q628K031m466l879n49L161N058j572n987j962L934N105M69o758o261
$$ -5089 3539 5570 1104 -2775 -3324 -163 4895 3323 -2664 -4626 -692 4413 4882 -1876 -8137
4247h137O732Q529k659r100k325O313P227k094r663j511Q262L825l264m328k323
$$ -8137 -1405 7124 4465 -4635 -6960 -647 6580 4486 -5177 -6688 1574 5399 2135 -2193 -4516
4262d516L379N405N2o230k647K196N120L410n556p647L111J0007N98q570m953
$$ -4516 -1137 4268 4320 -1910 -4557 -2361 2759 6169 613 -7034 -3923 6084 6682 -1888 -6841
4277f841L696Q825J373r908n102O928O725j833n755l460K573O310Q28n741l119
$$ -6841 -3145 5680 7053 -2855 -7957 -1029 5696 3863 -1892 -5352 -2779 3531 4359 -1382 -4501
4292d501K080L435M340l115q146K99Q862L704n573p461N27R117N200q418p927
$$ -4501 -2421 1014 5354 2239 -5907 -5608 3254 6958 1385 -6076 -5549 3568 8768 350 -7577
4307g577M759P664L84n302m800J541O657J651n032l577P91K293N386j527p736
$$ -7577 -2818 4846 5230 -72 -4872 -3331 3326 4977 -55 -3632 -2841 -548 4838 3311 -4425
4322d425j943P192N192l069p191l139P784P895n875r364J490P971L295l547o848
$$ -4425 -6368 824 6016 2947 -4244 -7383 401 8296 2421 -6943 -5453 2518 5813 2266 -4582
4337d582n64P514L414m657l758k51K214N031L11o964l262M649N843n37n856n998
$$ -4582 -5146 2368 5782 1125 -2633 -2884 -670 4361 4672 -2292 -5554 -905 4938 4401 -1455 -7453
4353g453N150R027j936r511j936O588N344j565p279k655O613M875l411m158j031
$$ -7453 -2303 6724 4788 -4723 -6659 -71 5273 3708 -3571 -6226 387 5262 1851 -2307 -3338
4368c338J663M785J418n534l477K878M426K170m245o755K046R291R08q172l938
$$ -3338 -1675 3110 4528 -1006 -4483 -1605 2821 4991 746 -6009 -3963 5328 6236 -1936 -5874
4383e874L805O241J628p322m923M998O193j614m830j822Q82M615K159m492l946
$$ -5874 -2069 4172 5800 -1522 -6445 -1447 4746 3132 -1698 -3520 -2638 1977 4136 -356 -4302
4398d302J478L932L184j917p159l52Q078L111n624n316P43O375M041n182p026
$$ -4302 -2824 1108 4292 2375 -4784 -5136 2942 6053 429 -4887 -4144 2231 6272 1090 -5936
4413e936L287O449M98m185l143Q6M857K675m124l990Q07K670L333m61n945k087
$$ -5936 -2649 3800 4298 113 -3030 -2944 1913 4588 464 -3526 -2719 -49 3284 2823 -3122 -5209
4429e209N800M357l065n111j354M467N485l274p002J058O029J784k739l842j227
$$ -5209 591 4948 1883 -3228 -4582 -115 5370 2096 -4906 -3848 2181 3965 1226 -2616 -3843
4444c843M807L434k844l872L61J862K859M75m474l138M133L882j093l676l294
$$ -3843 964 4398 1554 -2318 -1957 -95 2764 3239 -1235 -4373 -240 3642 2549 -1127 -4421
4459d421L061N863q00o640j544M754K567m98l983k792L453M828k046l611o03J213
$$ -4421 -1360 4503 3703 -2937 -4481 273 2840 2342 -1641 -4433 -980 3848 1802 -1809 -2412 -1199
4475a199K675J705l553l319K551L862O3k202l477L61N832J302n388k832K991L005
$$ -1199 1476 3181 -372 -3691 -1140 2722 2785 583 -2894 -2533 3299 4601 -787 -3619 -628 2377
4491B377O08k837l779J928N036r68l331r90N23K293K225k898l677J744L111N79
$$ 2377 2985 148 -3631 -1703 3333 2365 -966 -1956 -1433 860 3085 187 -3490 -1746 1365 1944
4507A944j234l245n95M314K146l308l101J731K568K109k327l991P96M596K26k618
$$ 1944 710 -2535 -3130 1184 3330 22 -3079 -1348 1220 3329 1002 -2989 -2193 2403 2629 11
4523A1j358k56K112L022k482l727J169K345R84o99k572j483L214L044l134k847
$$ 11 -1347 -1603 509 3531 1049 -2678 -1509 836 1820 1121 -1451 -2934 280 3324 190 -2657
4539b657P86J884J856n09l967r2L755J216k129j092r62J599L003j022l657Q91
$$ -2657 -1871 13 1869 1360 -2607 -2699 1056 2272 143 -949 -1911 -312 2691 1669 -1988 -1097
4555a097K006L03O44k105k320K762K703j968k128k34J080J654P00l288j595L247
$$ -1097 909 1212 1856 -249 -2569 193 2896 928 -1200 -1434 -354 1300 2000 -1288 -2883 364
4571C64J426j164j466r29N69L078l33l398K18J321P52J021j615k305J827K635
$$ 364 1790 626 -840 -1769 -1200 1878 1545 -1853 -1635 -314 438 1459 -156 -2461 -634 2001
4587B001j009j615l88L63J906J010k732j588J752J752j92o40k022jK690R48l335
$$ 2001 992 -623 -1011 -648 1258 2268 -464 -2052 -300 1452 1260 620 -1402 -1403 1287 2235 -1100
4604a100k90J051O59J164j367k562R88K939p53j295l23l09J171K208k315j858
$$ -1100 -1390 -339 320 1484 117 -2445 -1457 1482 729 -566 -889 -1198 -27 2181 -134 -1992
4620a992J783J153m82L95j907p63L042R61k654m71J002j50J589m75k401M07K147
$$ -1992 -209 944 462 857 -1050 -1813 1229 2190 -464 -935 67 -83 1506 1031 -1370 -963 1184
4637A184m55j060R9j077J293J894j870j582R82P25J20N03j692j047K144J092j580
$$ 1184 729 -331 -232 -1309 -16 1878 8 -1574 -592 133 253 756 -936 -1983 161 1253 -327
4654c27n06N40m83J767J02k674L2K371K17n14m26j443R26K680j362k137Q14P31
$$ -327 -833 -293 -776 991 1093 -1581 -1549 822 1039 525 99 -1344 -418 2262 900 -1237 -423 308
4672C08M95Q27j738j835J787J443j011o69m88j27J733Q04k476p55J822M06k03
$$ 308 803 1630 -108 -1943 -156 1287 276 -393 -881 -1008 725 1529 -947 -1702 120 526 323
4689C23K0j659R2K717l22j796J01L60M18J302j151k055J431K134j114o19m22p12
$$ 323 343 -1316 -1224 1493 1171 -625 -524 -164 254 1556 405 -1650 -219 1915 801 182 -240 -952
4707i52J812J251k540j211R93R38J76M65k405l52K638J78j812k28P9P07J947j391
$$ -952 860 2111 -429 -1640 -647 291 467 932 -1473 -1825 813 991 -821 -1049 -970 -263 1684 293
4725B93k413J054K120q8l44j546o16J656K332j998j536M80R67N48N26j976j155
$$ 293 -2120 -1066 1054 966 622 -924 -1540 116 2448 450 -1086 -606 361 909 1435 -541 -1696
4742a696K674R06j515n43o20P7K328r6k831k60J652M61J10r60k095J479K876j218
$$ -1696 978 1884 369 -174 -794 -717 1611 1515 -1316 -1576 76 537 647 -313 -2408 -929 1947 729
4760G29j969K13M01Q63J566k133k057K431J261l24q29j431j97L074Q70l191j119
$$ 729 -1240 -1027 -626 237 1803 -330 -2387 44 1305 981 152 -1279 -1476 1598 2468 -723 -1842
4777a842J516J325M04q95k623P69L540q58k017l30k98J540J719k126k203J567
$$ -1842 -326 999 1403 508 -2115 -1346 2194 1336 -681 -1011 -1309 231 1950 -176 -2379 -812
4793h12J727K7l33k142r05L215K246l098k196J220J478J774q96l285K86L722l7
$$ -812 915 942 609 -1533 -2438 777 3023 -75 -2271 -1051 427 2201 1305 -1980 -1694 2028 1991
4810A991k113p93k46J181K485j604k842P90J432R61N37k700j870K757K727j614
$$ 1991 -122 -915 -1161 20 2505 901 -1941 -1151 281 1242 1779 -921 -2791 -34 2693 1079
4826A079k969l93K097K227q4m297p29M052J419j824j456r54J456L012j290k901
$$ 1079 -1890 -2283 -186 2041 1957 -2340 -3069 983 2402 578 -878 -1832 -376 2636 1346 -1555
4842a555J43J155J526J374k389l060J790L912o72k736j966J232L634O94m605j834
$$ -1555 -1412 -257 1269 2643 254 -2806 -1016 2896 2224 -512 -2478 -1246 2388 3082 -1523 -3357
4858c357L337K488j224j820k071J304L525l44l330n96J048J596K063j913l981
$$ -3357 -20 2468 1244 -576 -2647 -1343 2182 1838 -1492 -2088 -1040 556 2619 706 -3275
4873c275R41M080Q58k375k834K8M235K548m592l306K725L285O5k070k841O85L784
$$ -3275 -2334 1746 2604 229 -2605 -2577 1658 4206 -386 -3692 -967 2318 2383 313 -2528 -1843 1941
4890A941O57l193r73J12J500K147q78l789l77L527J874j194l172k198M308M136
$$ 1941 2598 -595 -1568 -1456 44 2191 1313 -2476 -2853 674 2548 1354 -1818 -4016 292 4428
4906D428l186m935J149M028J406j811l781QM834J281l057j786L19J197K310P3
$$ 4428 1242 -3693 -2544 1484 2890 1079 -2702 -2694 2140 3421 364 -1422 -1103 94 2404 2477
4922B477l969j295K770K616k98l162l244K963N277j581n434p55L656L433j128
$$ 2477 -1492 -2787 -17 2599 2301 -861 -4105 -1142 4135 2554 -2880 -3635 21 3454 2326
4937B326m707j508M193K675k416k133n26R52K916Q31l795j796K277K720J239k541
$$ 2326 -2381 -3889 304 2979 563 -1570 -2096 -1144 1772 2603 -1192 -2988 -711 2009 3248 707
4953G07m409J307N857L68n027k374K260M064R97m623l509L657L969j456k778j514
$$ 707 -3702 -2395 3462 3830 -1197 -3571 -1311 2753 3750 -873 -4382 -725 3244 1788 -990 -2504
4969b504J060L071O58k941k157J209J964J992q28m470n47N518K017l291l931J69
$$ -2504 -1444 1627 2285 -656 -2813 -1604 360 2352 1524 -2946 -3493 2025 4042 751 -3180 -3011
4985c011M505L351m077n037K758M463k15k929k009L49L300J551k592k529M03J738
$$ -3011 1494 4845 768 -4269 -1511 2952 2737 -192 -2201 -1852 1448 2999 407 -2122 -1719 19
5001A9K282o1m200k169M386L338k080m093j558M020M580k503n924R36M518J399
$$ 19 2301 2240 -1960 -4129 257 3595 1515 -2578 -4136 -116 4464 1961 -3963 -3027 1491 2890
5017B890j549l529n84L757K462k653k678J86J342K475N75l287l015L007L665n25
$$ 2890 1341 -2188 -2772 985 3447 794 -1884 -1698 -356 2119 2694 -593 -3608 -601 3064 2539
5033B539l276l113K431N088m18o044j166M153K965j402l921j587L538L333k139
$$ 2539 -737 -3850 -1419 3669 3251 -2793 -3959 194 3159 1757 -2164 -3751 -213 3120 981
5048I81k445l09Q49K215J387k821k844J603L351P43k337l551M78N910J109n184
$$ 981 -1464 -1773 -924 1291 2678 -143 -2987 -1384 1967 2710 373 -3178 -2700 3210 4319 -865
5064h65k929L127L368P13l768l282K758L779q13l355o86N67J853J984k227l114
$$ -865 -3794 -667 2701 3414 -354 -3636 -878 2901 2088 -1267 -1953 -1386 467 2451 224 -2890
5080b890P87K862J454j044l558j285N178K381l411l594Q80L916J633k618l935
$$ -2890 -2103 759 2213 1169 -2389 -3674 1504 3885 474 -3120 -2240 1676 3309 691 -3244
5095c244J101M430N74l140j370K23K067K239k088k645K42K113J243L81l419k077
$$ -3244 -2143 2287 2861 -279 -1649 -1426 641 2880 792 -1853 -1611 502 1745 2126 -1293 -3370
5111c370L028L652k207l709P7K666K904j237m841Q9M078J352j864k182l66J899
$$ -3370 -342 3310 1103 -2606 -2529 137 3041 1804 -3037 -2948 1130 2482 618 -1564 -1930 -31
5127c1K087m32l360N98J294J059J068k650k632K182L959j095l197j004J305L513
$$ -31 2056 1624 -1736 -1138 156 1215 2283 -367 -2999 -817 3142 2047 -1150 -2154 -849 2664
5143B664j54m237j546L530K053j168j974j545J305K965n47k667m09J285J156J434
$$ 2664 2510 -1727 -3273 257 2310 1142 -832 -2377 -1072 1893 1346 -1321 -1730 -445 711 2145
5159B145k137k806J483L199K36k371j543K44L148J593l693k133K269K059j11j655
$$ 2145 8 -2798 -1315 1884 2120 -251 -1794 -1550 1598 3191 -502 -2635 -366 1693 1582 -73
5175g3j911M99L302K04k782n00O19Q75J480q66k905N60K634L00j399j495q37K913
$$ -73 -1984 -1485 1817 2021 -761 -1261 -642 233 1713 847 -2058 -1498 1136 1436 37 -1458 -2295 618
5193F18K036k497k623J342K219M68q51k345J3L176N70k292r20M46P63J660o11
$$ 618 2654 157 -2466 -1124 1095 1563 712 -1633 -1620 1556 2126 -166 -1086 -640 123 1783 1172
5210A172k910M58K363O41q54j567j201J752K414j351k949M36K019J013m94k165
$$ 1172 -1738 -1280 1083 1724 870 -697 -1898 -146 2268 917 -2032 -1596 423 1436 942 -1223
5226a223j014K370J749k071q96K06N71J906k35k681k01K011P49l21q44j338P08
$$ -1223 -2237 133 1882 -189 -1085 -879 -308 1598 1363 -1318 -1519 492 1241 920 76 -1262 -554
5243e54K675o50k224l58J087J113L10k098j303K065J562j096r35o44L07J659K60
$$ -554 2121 1471 -753 -1111 -24 1089 1399 -699 -2002 63 1625 529 -406 -1050 -743 916 1176
5260A176j978q82J282J015K43j204j131O21K069j85j816q9L81J040J271j655j615
$$ 1176 -802 -1684 -402 613 856 -348 -1479 -858 1211 1026 -790 -879 -498 542 1813 158 -1457
5277a457J138J664m71j033q78K61J576R42j772j369J489N31M7j76j663J16J915
$$ -1457 -319 1345 874 -159 -1037 -776 800 1742 -30 -1399 90 621 668 492 -1171 -1055 860
5294H60K00j509o81O95L87J209r94j699P43J351O9l44p89o57J618J026j697r39
$$ 860 1060 -449 -1130 -435 -48 1161 167 -1532 -789 562 631 287 -502 -1159 459 1485 -212 -1151
5312a151J172O86K06p0j590n08K254M9j304j14m3J57J356n08j716M77Q46M12k12
$$ -1151 21 707 913 843 -747 -1255 999 1048 -256 -370 -413 -256 1100 592 -1124 -647 199 611 399
5331C99o22j392J682J157j165j055L02M53P05M58j716n75J960L89p65m88k98K31
$$ 399 -223 -1615 67 1224 59 -996 -694 -241 464 922 -794 -1369 591 980 215 -273 -571 -340
5349c40J499j40j670j5J086J69Qn68j313R79J543p04j390L86j63J054O27j447
$$ -340 1159 1019 -651 -666 420 589 597 29 -1284 -305 1238 534 -856 -470 -633 421 1048 -399
5367c99j012J271P87n61l03k90n01J792L23j868l46J178L84L01l01j603M35J713
$$ -399 -1411 -140 647 86 -217 -507 -1008 784 1107 -761 -1107 71 455 756 455 -1148 -713 1000
5385A000l06r81j2n7P33J133j667j448J424P00pj97j005k53J257P27j383m38L21
$$ 1000 694 -287 -299 -356 377 1510 -157 -1605 -181 519 512 315 -690 -943 314 1041 -342 -780 -459
5404d59L21Q20R9j708k70J896k15o70l66p9N05J346p64j708J026P60j59J78p13
$$ -459 -138 682 781 -927 -1197 699 484 -186 -552 -631 -126 1220 456 -1252 -226 534 375 553 -160
5423a60j042J847Q91j316q08M48k83J209L92k119k67J514K73q71K05j010J66K165
$$ -160 -1202 645 1536 220 -588 -140 -423 786 1178 -941 -1208 306 579 -292 -87 -1097 -931 1234
5441A234p80j715L88P88J95O12n77j435J161J398p60n14o73K15J353M62j709j088
$$ 1234 454 -1261 -873 -85 110 722 145 -1290 -129 1269 509 -5 -678 -463 890 1352 -357 -1445
5459a445J707P76n86k10j271J07K192r3j837Q8K55L75J090n66k055O76J423M7
$$ -1445 262 1038 452 242 -1029 -922 1270 1177 -660 -572 -317 58 1148 582 -1473 -797 626 673
5477F73o30p43o10J215J677j593j461J103R02L43l56j323m00K207K20j501l90
$$ 673 43 -700 -1310 -95 1582 -11 -1472 -369 533 876 520 -803 -1203 1004 1224 -277 -667
5494f67K92K60J293m07j932Q1J608K29k33p37j067P01K109q43k018K89R42Q40
$$ -667 -375 -115 1178 771 -1161 -1080 528 757 524 -213 -1280 -579 1530 687 -1331 -1042 -100 740
5512G40J79j770r13K017R89r59j018j30L64J466M74k460J98R13M14M45q28j456
$$ 740 919 -851 -1764 253 1242 283 -735 -865 -501 965 1439 -1021 -823 90 504 949 121 -1335
5530a335O11K365l32j775m40M49J178R66j966j620J709J791j267q89n80L27J706
$$ -1335 -724 1641 1309 -466 -906 -457 721 1687 -279 -1899 -190 1601 334 -555 -1135 -808 898
5547H98L13j813n48J075K93O00j11j927j89K024Q80j393j056J11J428J625j892
$$ 898 1211 -602 -1150 -75 218 818 707 -1220 -1409 615 1495 102 -954 -843 585 2210 318
5564C18k169J171K138m82j006r40R0J894O04k091q96Q13O28J025j87j760q96J684
$$ 318 -1851 -680 1458 976 -30 -970 -880 1014 1618 -473 -1369 -556 72 1097 910 -850 -1746 -62
5582f2J431r91j097q28J173K148j122l172P61K597M31p99j348n88J896J466j653
$$ -62 1369 378 -719 -1547 -374 1774 652 -2520 -1759 838 1269 470 -878 -1466 430 1896 243
5599B43j322L58R07N59N69j779j408J897J568n84j533j005N76K921k80l086m68
$$ 243 -1079 -721 186 745 1314 -465 -1873 24 1592 1008 -525 -1530 -954 1967 1687 -1399 -1867
5616a867J897J466n41j781j126J910J818j524j472O44J54J103N17j177j506R97
$$ -1867 30 1496 955 -826 -1952 -42 1776 252 -1220 -576 -422 681 1198 21 -1485 -488
5632d88J689J87j086j699P3K842Q63k900j373J068K108Q79k292k224J588K765
$$ -488 1201 1388 302 -1397 -1324 1518 2381 -519 -1892 -824 1284 2163 -129 -2353 -765 2000
5648B000r64k046k70O90R16J115j391j639R71R53R05k94j993j210K547J907j969
$$ 2000 1036 -1010 -1280 -590 326 1441 50 -1589 -618 335 1240 946 -1047 -2257 290 2197 228
5665B28k201O91K271R70j001k955M66L318j61j672p51Q8J223J241j437j958P23
$$ 228 -1973 -1282 989 1959 958 -1997 -1531 1787 1626 -46 -797 -709 514 1755 318 -1640 -917
5682i17J223M80P48k192j366J827K175j205k272o31J749K205n12l252l07L256
$$ -917 306 786 1534 -658 -2024 -197 1978 773 -1499 -2130 -381 1824 1312 -1940 -2247 1009
5698A009O77j413j507m01J360J941j076j842O35P55P56O38j470k122J200K559
$$ 1009 1686 273 -1234 -1635 -275 1666 590 -1252 -617 138 894 1532 62 -2060 -860 1699
5714A699k38j721j390Q55K486L08l160j524K940J521o60j926r88J325K021p66
$$ 1699 1461 -260 -1650 -795 1691 1999 -1161 -2685 255 1776 1116 -810 -1798 -473 1548 782
5730G82j652k3P04M99O72p26j943L53K547J42j125j380l89K573J488k795k230
$$ 782 -870 -893 -189 310 982 256 -1687 -1334 1213 1355 230 -1150 -1539 1034 2522 -273 -2503
5747b503K090J861K89j822j641P00K623l72j825n51O59O63R61n49k000L6J973
$$ -2503 -413 1448 1737 -85 -1726 -1026 1597 1225 -600 -1151 -492 171 1132 583 -1417 -1381 592
5764E92Q12r58j392j256K307K497j981k760P45K434Q64j204k499L73K707N88k144
$$ 592 1404 446 -946 -2202 105 2602 621 -2139 -1394 1040 1904 700 -1799 -1426 1281 1869 -275
5781b75o06L82O86J201n14j749k38J617O58k61j336j839J848K587j057k611j59
$$ -275 -881 -499 187 1388 874 -875 -1113 504 1162 901 -435 -2274 -426 2161 1104 -1507 -1666
5798a666J765J259o1k929n32K931R62j964q68J28P26J237Rk050j22J519L33K00
$$ -1666 99 1358 1297 -1632 -2164 767 1729 -235 -1103 -975 -249 988 997 -1053 -1175 344 677 877
5816H77p24j612K61L127p87j763p75J152J199P40k213j628K139J741q80j804J45
$$ 877 153 -1459 -1198 1929 1142 -621 -1396 -244 955 1695 -518 -2146 -7 1734 854 -950 -805
5833h05N28J378j93j391o54R97N66L60k4k228L31K510j15j384j172K26J755J331
$$ -805 -277 1101 908 -483 -1137 -140 426 786 762 -1466 -1135 1375 1260 -124 -1296 -1070 685 2016
5851B016k156k087J417K194m55j146n80O7J603K10j412q59Q69R62R4j50j627m58
$$ 2016 -140 -2227 -810 1384 929 -217 -797 -730 873 1083 -329 -1188 -319 643 737 587 -1040 -1498
5869a498K129N60r11r15p31J315J483j122j928N74J953Q4r65q52l32J558J014
$$ -1498 631 1191 280 -635 -1366 -51 1432 310 -1618 -1044 909 993 28 -824 -1156 402 1416
5886A416j391r83M56P24L64J59j300o05J323P98o39m96q91R95J305k61k443L89
$$ 1416 25 -958 -502 222 586 745 -555 -1160 163 961 322 -174 -1065 -70 1235 974 -1469 -1080
5904a080J238Q21o23q66q55J475J020j008j113M39N89M65K32j268o10J366O88
$$ -1080 158 979 356 -510 -1365 110 1130 122 -991 -552 37 502 734 -534 -1144 222 910
5921I10n40m85q17L74J366J93j606l09J502j08K44p22j264J036J580j010p89k86
$$ 910 370 -115 -932 -558 808 1001 -605 -914 588 480 724 2 -1262 -226 1354 344 -445 -731
5939g31K98R47L75j206r96J527M91k73m38j062o2K226n8j336o11Q68N65L29o44
$$ -731 -433 514 889 -317 -1313 214 705 432 -6 -1068 -1130 1096 1038 -298 -909 -41 524 853 209
5958B09j274N60J692m31j098k57q0J217M37j055r87Q07N58K35n45n95n54J681
$$ 209 -1065 -505 1187 756 -342 -599 -679 538 975 -80 -1067 -260 298 533 -12 -607 -1161 520
5976E20L25j267k90K49K45P19j85j613K92J576k04l18l34l73O47J007q45r68L03
$$ 520 845 -422 -712 -463 -218 501 316 -1297 -1005 571 367 49 -285 -658 -11 996 151 -817 -514
5995e14R91M86k29r96o69J332N77r90n95O46n9Q19o2j370k25J301J36o19k82k71
$$ -514 477 963 734 -262 -931 401 978 -12 -607 39 -20 799 737 -633 -858 443 579 -40 -322 -593
6015e93J69J323m32j303J01Q49J98K77p61r97J172J147q31r04M50k8O66L07j274
$$ -593 -424 899 467 -836 -735 114 312 589 -172 -1169 3 1150 319 -585 -135 -163 503 810 -464
6034d64j3Q22L06m84k22n66P3J540o21p76J14J12K95O67n60j487R74R64n64p41
$$ -464 -477 345 651 167 -55 -621 -548 992 371 -405 -291 -179 116 783 223 -1264 -290 674 110 -631
6054f31N7p4O96R15j157p39J088J73k82J63n60l46J112N65j046O7Q7O3P28l46
$$ -631 -574 -648 48 963 -194 -933 155 328 46 209 -351 -697 415 980 -66 1 88 151 879 533
6074E33j400L98J219k89p12j47k7O85N91o13j009O22%K54J83l45q44J105N17q40
$$ 533 -867 -469 750 461 -251 -398 -425 260 851 238 -771 -149 -149 105 288 -57 -901 204 721 -119
6094a19j44m19L19R46j2j427L63J052j24l74K19j010L40J154l00j191M07K09L56
$$ -119 -263 -682 -363 583 571 -856 -493 559 435 61 280 -730 -390 764 464 -727 -320 -111 245
6113B45L15o03j167J380N26n15k3o80J66O90K77r36n23J051Q4Ml50q97L59J179
$$ 245 560 -43 -1210 170 696 181 158 -522 -356 334 611 -325 -848 203 287 291 -59 -956 -597 582
6133E82o8j181L92K2M46M64n59j219J145N99k87l89L2k39O71M69j299k90N20N87
$$ 582 514 -667 -275 -253 193 657 98 -1121 24 623 336 -53 -21 -260 411 880 -419 -709 -189 398
6153C98l09J86j087K58R08J96q10q2k36L06J238q34j158O92Q37j00m17n49j96
$$ 398 89 275 -812 -554 354 550 -260 -342 -578 -272 966 132 -1026 -334 503 403 -14 -563 -759
6172g59J124N80q78o57M74L52n8K00j114J21J363j14o56p6n17K50J083J1j867
$$ -759 365 945 67 -590 -116 236 178 378 -736 -615 748 634 -22 -98 -615 -365 718 729 -1138
6191a138L72R20J85j09n11n12L64J351p14j056O05R5M80J87q79k30P25M18l42
$$ -1138 -766 154 339 230 -281 -793 -429 922 208 -848 -243 -148 332 519 -360 -590 135 553 211
6210B11O6o54O4Q54K40j017l07O06N71j29l07j307N40J606p30q80L50k52L30N19
$$ 211 277 -377 -313 541 781 -236 -543 63 634 505 198 -1109 -569 1037 307 -573 -223 -475 -145 374
6230C74n68q69R27K70J16Lq96m17J559L89j265l73L29O26P73p07j410L59J769
$$ 374 -194 -1063 -136 134 250 253 -643 -1060 499 888 -377 -750 -421 205 978 271 -1139 -780 989
6249I89k26j024k97J42N22Q49p88j086P11M59j40L04l45j051P71J014o97r22J76
$$ 989 763 -261 -558 -416 106 955 167 -919 -208 251 111 415 70 -981 -210 804 107 -815 -639
6268f39K87J288j08k091J50J651L13j104j46j47M65J155o27j054M34N40k31L42
$$ -639 -352 936 828 -1263 -1113 538 851 -253 -399 -546 -81 1074 447 -607 -173 367 136 478
6286D78l92j056J063R18n22o32l09J3J093O22j875r62J748N78k71p52m92M67J618
$$ 478 86 -970 93 1011 489 -143 -452 -439 654 1276 -599 -1561 187 765 494 -258 -750 -283 1335
6305A335q01j331L09K54M21J92l33q44Q5J603j79q05k76o60J280J032j352j315
$$ 1335 534 -797 -488 -234 187 379 46 -798 -713 890 711 -94 -370 -1030 250 1282 -70 -1385
6323a385J060J197q3p61p72K00J800m72j228j85N36M10M33q09r20N7J247K27m06
$$ -1385 -325 872 789 28 -744 -544 1256 784 -444 -629 -93 317 750 -59 -979 -922 325 552 146
6342A46l65j021J384R59q99j472O11J033N96n64j464K28J646M13j712j03L66M80
$$ 146 -219 -1240 144 1103 204 -1268 -657 376 972 408 -1056 -828 818 1231 -481 -584 -218 262
6360B62K82J72j527L93N28J78q2k81j030P44J689n78j908J23Q88Q37K90j964n15
$$ 262 544 716 -811 -418 110 288 206 -75 -1105 -361 1328 750 -1158 -1035 -147 690 980 -984 -1499
6379a499J894J084j711n14lQ26N66j91j082J73O90r3kL32j124L2J538j04j211
$$ -1499 395 1479 -232 -746 -749 77 643 452 -630 -457 233 140 138 470 -654 -622 916 812 -399
6398c99n86N15J214M28j622q72J720R49j192n21k56K36J300m19r44p07J225j10
$$ -399 -985 -470 744 1172 -450 -1322 398 1347 155 -366 -622 -386 914 495 -449 -1156 69 -41
6416d1l1M45q98l54J363M27r63m30k90J094J300j812j452J099J617l18p38q58
$$ -41 -72 373 -525 -879 484 911 -52 -482 -772 322 1622 -190 -1642 -543 1074 756 18 -840
6434h40L20J347Q6j191l81N84K65K79m0j014m61J560K19o78k62q69J027J082o02
$$ -840 -520 827 913 -278 -659 -75 190 469 429 -585 -1046 514 733 55 -207 -1076 -49 1033 431
6453D31j554K80J357N57n61j340J36J274P56j319m64M39K47J28M5q46l92R45O97
$$ 431 -1123 -843 514 1071 510 -830 -694 580 1336 17 -447 -8 239 367 412 -434 -826 119 816
6472H16n47l36j236J121J280N1k033p7J147O24k77r85n49J007J078r12j151O61
$$ 816 269 -67 -1303 -182 1098 1149 -884 -961 186 810 533 -452 -1001 6 1084 172 -979 -318
6490c18J09L87N56j209m62J050K26k00k56o56N2J527K14j188r06J016P74J66r33
$$ -318 -209 178 734 -475 -937 113 339 139 -117 -773 -721 806 1020 -168 -1074 -58 716 882 -51
6509e1j587J336J254k70j159k70N74M95N08j011o06O12N06J25k54p80k20J093
$$ -51 -1638 -302 952 682 -477 -747 -173 322 830 -181 -787 -175 331 456 202 -578 -798 295
6527B95J034j347q80L58P09R41o61j453M05J519k50q50l96L20O19M47q66n92N00
$$ 295 1329 -18 -898 -540 169 1110 449 -1004 -599 920 670 -180 -576 -256 363 810 -56 -648 -148
6546a48M42J5J66r79o56J249R48q91j011J33N15Q28o8j574K18J156N44j040n80
$$ -148 294 309 475 -504 -1160 89 1037 146 -865 -732 -217 611 543 -1031 -813 343 887 -153 -733
6565g33K70L54R15n17j125N86P05P5J71j041m37Q67P93o16m96j27K7M74R69j755
$$ -733 -463 -109 806 289 -836 -250 455 530 701 -340 -777 90 883 267 -229 -356 -329 145 1114 -641
6585f41k83J202O73o43m65o66N73J137n72j077J71L98M66L21o47q82N67J090m84
$$ -641 -924 278 951 308 -157 -823 -250 887 315 -762 -591 -193 273 594 -53 -935 -368 722 238
6604B38k66m59J27Q52M62j389l62Q28L96K4o01m56J94J417o53p86K57K4K56L06
$$ 238 -28 -487 -360 492 954 -435 -797 31 427 451 -150 -606 -412 1005 352 -434 -177 -153 103 409
6624D09l72q74O80O65n8o87J33j61K95J011j040q59O23Q86j44l30p34M8J243K92
$$ 409 37 -837 -157 508 450 -237 -104 -265 30 1041 1 -858 -235 651 507 177 -557 -509 734 1026
6644A026j454N6K22M14J57k63r94P07L97K43n85k86o16J102M31l75p90N79L30
$$ 1026 -428 -372 -150 264 421 158 -836 -129 268 511 -74 -360 -976 126 557 182 -608 -29 301
6663C01j17K37q47k95Q76M43o32l94K71kO92P4j086r7P79L07k74l76n61P31Q38
$$ 301 184 421 -426 -721 155 598 -34 -428 -157 -159 533 607 -479 -576 203 510 236 -140 -701 30 868
6684H68n74q13K25N47J7j3l47o57R01Q85p72m85l33J86P77Oq99l07J209l91J0
$$ 868 294 -519 -294 253 270 257 -90 -747 154 1039 267 -218 -551 -365 412 418 -481 -788 421 30 40
6705D0j78k83j9R36l34m49P0K90N0N37l21j134R35M63n44j34o3j95Q04N69j377
$$ 40 -138 -421 -440 496 162 -287 -217 73 123 660 339 -795 140 603 59 -75 -138 -333 471 1040 -337
6726c37k54Q21J85k45j43l55k0O70l38l82lJ07J52N85m32j017Q67N59o53K6K81
$$ -337 -591 230 415 170 27 -328 -348 322 -16 -398 -401 -294 -142 443 11 -1006 -139 420 -233 -207 74
6747G4p89R01N45p63n61O08O78k70j63o96n8J170j49o42j87L56kL77k49p91L76
$$ 74 -715 186 731 -32 -593 15 693 423 260 -436 -494 676 527 -115 -302 54 52 429 180 -611 -235
6768b35N68l98j55K17n28L66N98p97j70L62J70N5L71n89l82Q07N8k05j13P6j69
$$ -235 333 -65 -220 -3 -531 -165 433 -364 -534 -172 -2 53 424 -165 -547 260 318 113 0 76 -93
6789i3O51k09r64M33L95k65M2p1l70K97P14m12m92K9J99K98J25k71j010J046o1
$$ -93 558 349 -615 -182 213 -52 -10 -81 -451 -154 560 148 -344 -315 -116 182 307 36 -974 72 11
6810A1j51o7jK42J97N1o40n0M71J65j13J86p84J17Q23n32q4K79l65L06N82p74
$$ 11 -140 -207 -208 34 231 282 -358 -408 63 228 115 301 -483 -366 457 -75 -159 120 -245 61 643 -131
6832a31k9K16J66p2P3k49n06P79O51j182q8L06M09K9k65p12K61P57K6q37L81l08
$$ -131 -160 56 222 150 223 -26 -532 247 898 -284 -372 -66 343 372 107 -605 -344 413 439 -398 -17 -325
6854c25L81N19m13o77L88L34j93L92m43n95P54P16p90m00P8J70M98J19j062q5
$$ -325 56 575 162 -515 -127 207 14 406 -37 -632 122 838 48 -352 -274 -104 394 513 -549 -634
6874f34R69n9k62m17K10o7P59l22l93J4K44j27K33j98n60O03K01j07l66J81k23
$$ -634 335 276 14 -403 -193 -260 499 177 -216 -202 42 -85 148 -50 -610 -7 194 87 -279 -98 -321
6895c21N52L71o01m37P10m8k16k48l75K03P33P5r00j69O73l8J41p9m08K88K78
$$ -321 231 602 1 -436 274 226 10 -238 -613 -410 323 398 -502 -671 2 -36 105 26 -382 -94 184
6916A84k27j90Q4n79Q11M40p24l92P18K22k24j66k33k47J258r2r05J90J70M4J42
$$ 184 -43 -233 -149 -728 83 523 -201 -593 125 347 123 -43 -276 -523 735 643 -262 -72 98 142 284
6937B84l2p53N58L51m20Rr9k14M20L89j37n45l67N96K59Q8j077j61J019M80q59
$$ 284 252 -501 57 408 -12 -3 -102 -316 104 493 356 -189 -556 40 299 387 -690 -851 168 648 -211
6958b11j26K05K46J94k2p83K18N76J8k84K35o72K0O21K99q47j37K44M26K67q68
$$ -211 -337 -132 114 308 286 -497 -279 297 315 31 266 -406 -386 235 534 -313 -450 -206 220 487 -381
6979c81l63Q50O18o98k81J42j18N25p2l75k88M12p0J96Rk95L8O66m0p40j04K47
$$ -381 -744 106 724 26 -255 -113 -231 294 222 -153 -441 -29 -99 97 106 -189 -151 515 475 -265 -369 -122
7001a22J08P20n78q74O95R01n79j76k74j23P28K04q28l97P26P1k17J73o28j04
$$ -122 -14 706 128 -746 -51 850 271 95 -179 -302 426 630 -198 -595 131 202 -15 158 -470 -574
7021e74P23P6l44M8k62K98P05l68q08J20O60J73m53m27l65J401K14j090l25Q89
$$ -574 149 225 -119 -71 -333 -35 670 302 -506 -386 274 447 -6 -433 -798 603 817 -273 -598 291
7041B91k55n1L43n61%M25K87n52J76n14J40P67l2p39j07N23J4J59o14m93O97R66
$$ 291 36 -15 328 -233 -233 192 479 -73 103 -411 -271 496 464 -275 -382 141 155 314 -300 -793 -96 870
7063H70p08p48M70K62J57L3o66J65L30O2j49J19k60l80P79L45j166m6N41N5M37
$$ 870 162 -586 -116 146 303 336 -330 -165 165 227 78 197 -63 -443 336 681 -485 -531 10 65 502
7084E02m63o54L23J109p47m70r8P94j87J21n41p22J189L94l61m12J94n91O75N66
$$ 502 39 -615 -292 817 70 -400 -498 296 109 230 -311 -1033 156 550 189 -223 -29 -620 55 621
7104F21p51j74J57J25M24J58j397M04J273k93p66j94J78N19K99o14q37P69N02
$$ 621 -130 -304 -147 -22 402 560 -837 -433 840 547 -219 -413 -235 284 583 -31 -868 -99 403
7123D03l70J34l82k25L96M28L4o01j66J64P92k02j158r4J154K79m95o56N2O85
$$ 403 33 167 -215 -440 -44 384 418 -183 -349 -185 607 405 -753 -847 307 586 91 -565 -513 172
7143A72N80q23o27O06R83q24J37m11l64N98O70n31j59j83k37P81L83q57m57O53
$$ 172 752 -71 -698 -92 891 67 204 -207 -571 27 697 166 7 -176 -413 368 751 -106 -563 90
7163I0O45o36l98k55K31J156m53p58o8N69J41j18l0m24J41P37n42J3l87j45O31
$$ 90 735 99 -299 -554 -323 833 380 -378 -446 123 264 146 116 -308 -167 570 28 41 -346 -491 140
7184A40O78n25j195J032M65k14k89m49K68O85m6j241nQ87q7o7j98n83N20P08N4
$$ 140 818 293 -902 130 595 381 92 -357 -89 596 550 -691 -696 191 104 37 -161 -744 -224 484 538
7205E38n21m09o8M49M26o50o41N97L75N91k15r17KR88K69r19k08J61L01l0K69
$$ 538 17 -392 -460 -11 415 -235 -876 -279 96 687 472 -445 -443 545 814 -105 -313 -152 149 119 388
7226C88p03K73J97l14J42J63m50N75K99k10j152O09K40J10K39j029K02O47K46
$$ 388 -315 -42 155 -159 -17 146 -304 271 570 360 -792 -183 57 167 406 -623 -421 226 472
7245D72q52N3K07J07N66n43l39O4N65j20m68K03l24J98Q18k89p15K37K18L78o5
$$ 472 -380 -327 -120 -13 553 10 -329 -265 300 180 -288 -85 -409 -211 607 318 -397 -160 58 436 371
7266C71n26m71N59O36n24j47m1j49O33J12p96J51K36k9l6J49n98n0R45j71n43
$$ 371 -155 -626 -67 569 45 -102 -143 -292 341 453 -343 -192 44 15 -21 128 -470 -520 425 254 -289
7287b89K05K22j05P07r07l27O30M72n79k53M6K81M79M1r05k15N93r3j07K07l80
$$ -289 -84 138 33 740 -167 -494 136 608 29 -224 -178 103 582 623 -282 -497 96 3 -104 103 -277
7308b77j21M50K39m70k5K16M3K96N4j068K74N49k6j61m19k25R47J83o26l97M97
$$ -277 -398 52 291 -179 -204 12 55 351 405 -663 -389 160 134 -27 -446 -671 276 459 -167 -564 -67
7329f7JO4L12q07k04R31M6n36O9j1k37J057j46p98NL91J65j77l58j54N81K20p2
$$ -67 -66 -2 310 -497 -701 230 276 -260 -191 -202 -439 618 472 -326 -321 70 235 58 -300 -454 127 347 275
7352B75o90N06k02L64K13o09k26N72L7n94M00L7k00L19J15o07Q0J63M19m42M75
$$ 275 -415 91 -111 253 466 -143 -369 203 240 -354 46 83 -117 202 317 -290 -210 -47 372 -70 405
7373D05q64N33L05o59J99p0J29L1M31o78m54R35J48m59J00l0k65O12K20p13n6
$$ 405 -459 74 379 -280 -81 -151 -22 9 440 -238 -692 243 391 -68 32 2 -263 349 569 -144 -200
7394b00KJ14N8L0k96o7P41k04m77N22j71kL48k44l03l37J069n31k29K28n49M86
$$ -200 -198 -84 -26 4 -292 -359 382 178 -299 223 52 50 398 154 -149 -486 583 52 -177 51 -498 -12
7416a2L28o19q7N25j69K18k9q54O39K74l4l80j83K78j33O36m53j14o2N43j50j46
$$ -12 316 -303 -390 135 -34 184 155 -699 -60 214 180 -200 -383 -105 -238 398 -55 -169 -231 312 162 16
7438A6m32O0M98K76n24m11N38J83jJ52m11k90P53j80m55J38j08J36P27l74q41
$$ 16 -416 -356 142 418 -106 -517 21 204 203 355 -56 -346 407 227 -228 -90 -198 -62 665 291 -550
7459e50N51J92K45j25l70q14J034K37m20k57K93k27M33J96o28k76O40K00m86M7
$$ -550 1 193 438 313 -57 -871 163 400 -20 -277 16 -211 222 418 -210 -486 154 354 -132 -85
7479h5J09l73M56j74k99L19j58L81k1K00r54M22P11n11l35j9r0P34j31m07l12
$$ -85 24 -349 107 -67 -366 -47 -205 176 155 355 -599 -177 534 23 -312 -331 -421 313 182 -225 -537
7500e37M78K19KP2l89k18O53J43n51L41j34J08J09k48p38M3R45k25k30L70q6K08
$$ -537 -59 160 162 234 -155 -373 280 423 -128 213 79 187 296 48 -690 -647 298 73 -157 213 127 335
7522C35k26k22k54L14K21k19N2m23j20N97M94q76K23k4J9M94j85l53j96N62j07
$$ 335 109 -113 -367 -53 168 -51 1 -422 -542 55 549 -327 -104 -128 -109 385 200 -153 -349 213 106
7543A06l14L71l54K26N24m39o33M40M97k71M66n33m67M55L73m20k24L26l99L82
$$ 106 -208 163 -191 35 559 120 -513 -73 424 153 619 86 -381 74 447 27 -197 129 -270 112
7563A12K27p59K61J36L8l07N16o32J93N04o4m41K23j6K04K7j70l53M31N0j10n0
$$ 112 339 -420 -159 -23 15 -292 224 -408 -215 289 225 -216 7 -9 195 222 52 -301 130 180 70 20
7585B0O2m88Q44J93q02j59J95M05k0k93n05L86M69j09m39K55m43qQ68j26n64k7
$$ 20 82 -406 438 631 -171 -330 -135 270 250 -43 -548 -162 307 198 -241 14 -429 -437 431 305 -259 -286
7607b86M94l02j07L29m20M51J21o3l93N71l36l23N45l27l67P90K9p77M21j29K55
$$ -286 208 -94 -201 128 -292 159 280 217 -176 395 59 -264 281 -46 -413 377 406 -371 50 -79 176
7628A76R6L9m05k39M78J43k83O5j38J25M42n60l97K28L49k57L29k79j98K05K12
$$ 176 272 311 -94 -333 145 288 5 70 -68 57 499 -61 -458 -230 119 -138 191 -88 -286 -81 131
7649A31Q4l55J74l70L72J52l16rJ31J29K41k92m94J99O52o06j36L74l85N76L6
$$ 131 215 -140 34 -336 36 188 -128 -137 -6 123 364 72 -422 -223 429 -177 -313 61 -324 252 288
7670B88k73r1pP0Q4j2k23j23L74J41n18k30N34j0j27N14p41j13P45j86r2k11K19
$$ 288 15 -76 -83 -13 71 59 -164 -287 87 228 -290 -520 14 4 -123 391 -350 -463 282 96 4 -207 12
7693A2m7J01Lo47P24L05o08j28R8P7M9J21j72L0O8N2O0K18j41m62Q25m5p02L15
$$ 12 -35 66 69 -578 146 451 -157 -285 -187 -110 -61 60 -112 -82 -14 38 98 316 175 -287 538 493 -209 106
7717A06j70J27L60j65m39L5M17m15J24J31m33K78O58m11l94K23k05M80J70p00
$$ 106 -64 63 423 258 -181 -146 271 -144 -20 111 -322 -44 614 203 -191 32 -173 307 477 -223
7737b23m55Q89J46m00K08n54K00O19n84k78M52K9r4K06K71r20M36M70l54M3k97
$$ -223 -678 211 357 -43 165 -389 -189 430 -154 -432 20 49 -45 161 432 -488 -52 418 64 107 -190
7758a90p6M68M56n81m13M48J8j61L16j02k91L97r8o17K15K38K43m85K63m75K48
$$ -190 -266 202 658 77 -336 112 130 -31 285 183 -108 289 191 -426 -211 27 270 -215 48 -427 -179
7779a79M16l12k95M25p1m41Q00m31l61O35l63K87kk55j37M62L18l70j67L57o1
$$ -179 237 -75 -370 55 -16 -457 343 -88 -449 186 -177 110 108 -147 -284 178 496 126 -41 316 255
7800B55N9M4o78J60L07l45o5K47K0m43O45l07k59N5M13j7N26p48m34N29N68p07
$$ 255 314 358 -320 -160 147 -198 -263 -16 4 -439 206 -101 -360 -305 108 91 617 -131 -565 -36 532 -175
7822a75l26L76lL82j1o38J52N26J8l33M33n64j97P29k47m18M65k59%M27l41k15
$$ -175 -501 -125 -128 254 243 -395 -243 283 301 -32 401 -163 -360 369 122 -296 169 -90 -90 337 -4 -219
7844b19K46K22k04j96k74K86L76l1n92k4P55l87O9JR1m64K80M76q39M99k54p3
$$ -219 27 249 45 -151 -425 -139 237 206 -386 -410 345 -42 27 28 119 -345 -65 411 -428 71 -183 -256
7866b56N01j46n97K07O62k35m33K60Q6q0K80m42k21N02K30k53p9O5k60J82L75
$$ -256 245 99 -498 -291 371 136 -297 -37 49 -31 249 -193 -414 88 318 65 -14 51 -209 -27 348
7887C48l86k89L31l62P83k2o11K9L63K5o5M1o84Q38rk93k73J50L81k29k97p3J67
$$ 348 -38 -327 4 -358 425 403 -208 -179 184 209 144 185 -499 339 330 37 -236 -86 295 66 -231 -304 -137
7910a37K44N1r3K7kj73K7L26l75n9M05K5M6j78p76N09P26n12n57K72M02RJ21m67
$$ -137 107 158 65 92 90 -83 -56 270 -105 -164 241 266 312 134 -642 -133 593 81 -476 -204 198 207 328 -139
7934a39j62M33K95n99j28K39j43K06M17p12J69L85k3m9j58m02K57M47j18m27Q7
$$ -139 -301 132 427 -172 -300 -61 -204 2 419 -293 -124 261 238 189 31 -371 -114 333 215 -212 -125
7955a25J90K72m8l20j50M05J49o98L04K0k25K35L04k80j57L90n33M77O6m58j00
$$ -125 65 337 289 -31 -181 224 373 -325 -21 -1 -226 9 313 33 -124 266 -267 210 276 -182 -282
7976b82O35k53k86m1J11M0O56n75m68N69L19m96p4J58l47N14j22j60k72M35k51
$$ -282 353 100 -186 -227 -116 -76 580 5 -463 106 425 -71 -145 13 -334 180 58 -102 -374 61 -190
7997a90L71J54p02J63M89m48M2K56j32j83K52R0m34J20l5L48p2j44l36N24M12
$$ -190 181 335 -367 -204 285 -163 -121 135 3 -180 72 162 -272 -152 -187 161 89 -55 -391 133 545
8018E45m54j45K58n57O16l64p6q3L36L26k74r0k82J83L15m98k6qL35L8J89k37
$$ 545 91 -54 204 -353 263 -101 -177 -260 76 402 128 38 -244 -61 254 -244 -270 -278 57 95 284 47
8040D7n58N00K8J2j52J25k98J27N19n21m19N59K42K39l76k56j09N92o4n30J43
$$ 47 -511 -11 17 29 -123 2 -296 -169 350 -171 -590 -31 211 450 74 -182 -291 301 237 -293 -150
8061a50L25j86N9r4m15O22J94k04m59q4m4M06M75n29j54L84J07O0l07J8l20M92
$$ -150 175 -11 48 -46 -461 161 355 151 -308 -392 -436 -30 445 -84 -238 146 253 313 6 24 -296 196
8083A96J86m54P8J56J28p3k03M3O8n3k36J7R5K94n3L5o2l81J89k6J66j8n9l76
$$ 196 382 -72 6 162 290 217 14 57 125 72 -164 -147 -52 242 189 224 162 -219 -30 -56 110 92 33 -343
8107c43O88j73j07J5j89r0J34J85k39N3J58R4l04J12R3k4J53n8m75M42N97n40
$$ -343 345 172 65 80 -109 -199 -65 120 -119 -66 92 186 -118 -6 87 63 216 158 -317 125 722 182
8129A82j99l93K61K76J73o36L79J02p1m13M33l96J2J87L77k32K93m49j66R06o66
$$ 182 -17 -410 -149 127 300 -336 43 145 74 -339 94 -302 -290 -103 274 42 335 -114 -280 626 -40
8150d0k72L26L40n02K26K7l35m9N11m7k57N0m5K28K0j38j52K44j90m0J21l14j13
$$ -40 -312 14 354 -148 78 105 -230 -279 232 185 -72 -22 -67 161 181 43 -109 135 -55 -95 26 -288 -401
8173d01L93Q8k76J28L27n84NM55k92O8K36m86M01r3k4K87J5N6
$$ -401 -8 80 -196 -68 259 -325 -320 135 -157 -89 147 -339 62 -31 -55 232 247 303
8191C03
$$ Imaginary data points
##PAGE= N=2
##DATA TABLE= (X++(I..I)), XYDATA
0@%%%%%%%QqQj6J6j6K4l2L2m0M8n5O7p7Q9j04J21j38J57j80K04k27K57k93L27
$$ 0 0 0 0 0 0 0 0 8 0 8 -8 8 -8 16 -16 16 -24 24 -31 36 -41 48 -56 65 -73 84 -96 108 -119 138 -155 172
32A72l66M13m61N08n64O28o96P71q55R46j046J160j286J426j586J769j979K227
$$ 172 -194 219 -242 266 -298 330 -366 405 -450 496 -550 610 -676 750 -836 933 -1046 1181
50A181k520K871l309L870m608N633p160R661j4447K6738j10328k69348L08245
$$ 1181 -1339 1532 -1777 2093 -2515 3118 -4042 5619 -8828 17910 -92418 -361766 -53521
63e3521L39319j02856l43193q4406K44696K11322j15512k09926j2220J10321P8021
$$ -53521 285798 182942 -160251 -244657 39 211361 95849 -114077 -126297 -15976 62045
74F2045M5936o7436j64394k3467J99523J51922j18777k67833l4837L15386K05657
$$ 62045 107981 40545 -123849 -147316 52207 204129 85352 -182481 -217318 98068 303725
85C03725k66403l22686J27513L50025N0985k84637k05670J60986K71762k9917
$$ 303725 37322 -285364 -157851 192174 243159 -41478 -247148 -86162 185600 155683
95A55683k33966o2780J12259Q7059K4279m3773j10537m7229J00509J43323K099
$$ 155683 -78283 -141063 -28804 58255 82534 38761 -71776 -119005 -18496 124827 126926
106A26926k00550j51595J88689K82054r8327l34999m2528K93923J89513j76457
$$ 126926 -73624 -225219 -36530 245524 147197 -187802 -230330 63593 253106 76649
116G6649k82194L4269K88059Q1904k02892j32108O6657J09794N6547l3690j09866
$$ 76649 -205545 -171276 116783 198687 -4205 -136313 -69656 40138 96685 62995 -46871
127d6871o0362O6321J28354N0642j42975j88530Q8739K78332J7855k79890j47070
$$ -46871 -107233 -40912 87442 138084 -4891 -193421 -104682 173650 191505 -88385 -235455
138b35455J88242K50903m2870k89676r9221K45835J87523j32861j95953k087J36903
$$ -235455 -47213 203690 160820 -128856 -228077 17758 205281 72420 -123533 -125620 11283
149A1283J06304m1229j30514m4614O9644R0777M6881p7116j60438J0594K15918
$$ 11283 117587 76358 -54156 -98770 -29126 61651 108532 31416 -129022 -118428 97490
160I7490Q6024j85994j79310P8386K35301N6694k31682j69212J62933K15043n4870
$$ 97490 183514 -2480 -181790 -103404 131897 188591 -43091 -212303 -49370 165673 110803
171A10803j87873n6268J07234J24986j5740j25081n0229N8910O8907M0294l7003
$$ 110803 -77070 -133338 -26104 98882 83142 -41939 -92168 -33258 35649 75943 38940
182C8940j21669k6016J46586R7193r6509j47743l418J60797J12738j26615j81818
$$ 38940 -82729 -108745 37841 135034 38525 -109218 -112636 48161 160899 34284 -147534
193a47534N5642J85501L1434j27901j04260L9141J33918L7934j10611p5567M1484
$$ -147534 -91892 93609 125043 -2858 -107118 -67977 65941 103875 -6736 -82303 -40819
204d0819O2641L6769j4386q9955m6815Q6645R3082k7046j09069o3551Q9567J43280
$$ -40819 21822 58591 44205 -45750 -92565 -5920 87162 60116 -48953 -112504 -22937 120343
216A20343m0399j73787k1865J44390Q1554o7831j15605j7052J14352P6830p3650
$$ 120343 79944 -93843 -115708 28682 110236 42405 -73200 -90252 24100 100930 27280
227B7280q7615J0194N4115N1267K884q2902n4806O5955Q1203r610p5502o4478
$$ 27280 -60335 -50141 3974 55241 58125 -24777 -79583 -13628 67575 57965 -17537 -82015
239h2015M2113J17263L143j26140m9378Q4246Q0207j2619q9945n7497P4839R4617
$$ -82015 -39902 77361 80504 -45636 -95014 -10768 69439 56820 -33125 -90622 -15783 78834
251G8834l6724q7004j0983M6320N2619P278o8102m4471N0828N4815m077l7147
$$ 78834 42110 -44894 -55877 -9557 43062 50340 -17762 -62233 -11405 43410 39333 2186
263B186m7685M309Q2568K9161p9964n3157M0769O1660J5680n7371o3644L8383
$$ 2186 -45499 -41190 41378 70539 -9425 -62582 -21813 39847 55527 -1844 -65488 -27105
275b7105Q0001j3461o1569j5502J8887L6214K3141m1861m6009K6391M1805M733
$$ -27105 52896 39435 -22134 -37636 -18749 17465 40606 -1255 -47264 -20873 20932 25665
287B5665j7067l7820j1233N6885L1771m8191l5220J6678K8246K5353j4687n4069
$$ 25665 8598 -29222 -40455 16430 48201 10 -35210 -18532 9714 35067 20380 -33689
299c3689J947N6962R937l2455j9859n177K6502L5025k7089m4131J6383K8577J651
$$ -33689 -31742 25220 35157 2702 -17157 -22334 4168 39193 12104 -32027 -15644 12933 14584
312A4584k761k2117k1674L1732K9834k5354k3431K021Q890K6238M341m4254r531
$$ 14584 11823 -10294 -31968 -236 29598 4244 -19187 -17166 -8276 17962 22303 -21951 -31482
325c1482M2709J0614k0472q652q523J0361L0346j0833l1867Q856J5752R67P939
$$ -31482 11227 21841 1369 -7283 -15806 -5445 24901 14068 -17799 -8943 6809 7776 15715
338A5715j3535k4469K1791K6284k1131j5502O691P4J1506P998k5172p895K3299
$$ 15715 2180 -22289 -498 25786 4655 -10847 -4156 -4082 7424 15422 -9750 -17645 5654
351E654O96r256M416j1941l650K6548k264k5917P531J2751n862O111k393j5304
$$ 5654 6350 -2906 1510 -10431 -14081 12467 10203 -15714 -8183 4568 -1294 4817 2424 -12880
365a2880J2647J3967j5833j447J0149j1071L930J5951j5560r894J7724j017r255
$$ -12880 -233 13734 -2099 -3546 6603 -4468 -538 15413 -147 -10041 7683 6666 -2589
378b589Q191o195p218J6624l099j6724J1874M787j4936Q988O884j6669M271J3018
$$ -2589 5602 -593 -7811 8813 5714 -11010 864 5651 -9285 -297 6587 -10082 -5811 7207
392G207j1957j153J0484j0511J358J3211j2727m716J7680o669j1060J5347j007
$$ 7207 -4750 -5903 4581 -5930 -4572 8639 -4088 -8804 8876 2207 -8853 6494 5487
405E487j2619J2015K756j2609Q591L994j2857Q255N486j5086N879J1536j6057
$$ 5487 -7132 4883 7639 -4970 3621 7615 -5242 3013 8499 -6587 -708 10828 -5229
418e229q69J5329j0959o591J3150o184o583J1293m927p490J3321l438j2050J3475
$$ -5229 -6098 9231 -1728 -8319 4831 -1353 -7936 3357 -1570 -9060 4261 823 -11227 2248
432B248K206j4212J0267O547j4884O379J0777j1829J61R385r323K764J0706j4322
$$ 2248 4454 -9758 509 7056 -7828 -1449 9328 -2501 -2340 7045 -2278 486 11192 -3130
446c130l860J8472o503j1377J1443l300q025J3609k185j5410Q617O445r038N920
$$ -3130 -6990 11482 4979 -6398 5045 1745 -6280 7329 5144 -10266 -1649 4796 -4242 1678
460A678o19j5046J2690J4148j8567n446J2657l198J127Q628j4977n196K0031R5
$$ 1678 1059 -13987 -1297 12851 -5716 -11162 1495 -1703 -576 8052 -6925 -12121 7910 8005
474H005j0901M317o069o64K1160m713k5481Q897J6784n433j406m071j3172J4086
$$ 8005 -2896 1421 -4648 -5312 15848 11135 -14346 -5449 11335 5902 4496 425 -12747 1339
488A339J6685j7316j1242P179n12R109R941k5067j3835K7779J1089j4879p514
$$ 1339 18024 708 -10534 -3355 -3867 5242 15183 -9884 -23719 4060 15149 270 -7244
501g244p085N047K7539m319l2238K061K0950N681J502j3364k1964J8881L1806
$$ -7244 -14329 -9282 18257 13938 -18300 -16239 4711 10392 11894 -1470 -23434 -4553 27253
514B7253j5169k4070N99P364J8666J0297l0685k1669K6787K2335p519j5478k1348
$$ 27253 12084 -11986 -11387 -4023 14643 24940 -5745 -27414 -627 21708 14189 -1289 -22637
527b2637L818M2422O030m5641j6051K6597K3704L416k7220l1745K4215M2852j2005
$$ -22637 -18819 23603 29633 -16008 -32059 -5462 18242 21658 -5562 -37307 -13092 29760 17755
540A7755l1661o276O648K4978K0157l0403l4974J9769L4453P694j9107l8143j670
$$ 17755 -13906 -20182 -13534 11444 31601 1198 -33776 -14007 20446 28140 9033 -29110 -30780
553c0780N6514K1224n1158l4102K2444L7206J6858l1856m9182J6888N6965J615
$$ -30780 25734 46958 -4200 -38302 -15858 21348 38206 6350 -42832 -25944 31021 32636
565C2636l8835k2744M189L4596K8458l1586m5012J1328L6945K0622r885m8341
$$ 32636 -6199 -28943 -24754 9842 38300 6714 -38298 -26970 9975 30597 20712 -27629
577b7629k3399N8308N0402l9371o0128r95N3621M7712l2132p7144M597P6502K2333
$$ -27629 -51028 7280 57682 18311 -41817 -42812 10809 58521 26389 -50755 -46158 30344 52677
590E2677m4971m0020j507M1334L9949k5488n3116n019L3624L6905O119n7138n0218
$$ 52677 7706 -32314 -33821 7513 47462 21974 -31142 -36161 -2537 34368 40487 -16651 -66869
603f6869N1085P7622j8034p8812l3392N5103P9949j5187j00982k5449Q5569N5352
$$ -66869 -15784 61838 43804 -35008 -68400 -13297 66652 51465 -49517 -74966 10603 65955
615F5955l8756o3664j7532N2665N8222k3300o3311j2126L3778M0716J7136m8714
$$ 65955 27199 -36465 -53997 -1332 56890 33590 -29721 -41847 -8069 32647 49783 1069
627A069o3963K8674Q5249J4969p2673o8146L0601J05893K2720j13135o8192P9965
$$ 1069 -62894 -34220 51029 65998 -6675 -74821 -44220 61673 84393 -28742 -96934 -16969
639a6969R0769k1291q6424l9683N8196P5314j8517o9692j8283K8506L7576K9130
$$ -16969 73800 52509 -33915 -73598 -15402 59912 41395 -28297 -46580 -18074 19502 48632
651D8632l0946p1766q83Q0531M9388m8301r3089r562J13604P1492r6820j11724
$$ 48632 17686 -54080 -54963 25568 74956 26655 -66434 -75996 37608 109100 12280 -99444
663i9444M5238J17187K2611r0180q0348M2282J01871N660p9882l7959K4381M1854
$$ -99444 -54206 62981 85592 -4588 -84936 -42654 59217 64877 -15005 -52964 -28583 13271
675A3271L5076j9411o9117k3171N9091O8232q651r6251o0474R1959J19922n0506
$$ 13271 48347 28936 -40181 -63352 -4261 63971 55320 -40931 -101405 -9446 110476 59970
687E9970j43835j4474J25349Q2954p2347j25841Q330J27384M3417q4929o5069
$$ 59970 -83865 -98339 27010 109964 37617 -88224 -79894 47490 90907 5978 -59091
698e9091J8476N3568L9901j5221o3828l3099L9510O9265K2405q0654r4071N5634
$$ -59091 -40615 12953 52854 37633 -26195 -59294 -19784 49481 71886 -8768 -102839 -47205
710d7205J41888o55j46548o8934J04064J26743l1827j51727m0511J31834Q8598
$$ -47205 94683 94028 -52520 -121454 -17390 109353 77526 -74201 -114712 17122 105720
721A05720p3073r7274J175P0036N3828k0657o5744k6264L0693N4095L4130m7289
$$ 105720 32647 -64627 -63452 6584 60412 39755 -25989 -52253 -21560 32535 66665 19376
733A9376r8146Q098J30629N0297j12147j10826N0330J47198L0099j46716r8145
$$ 19376 -78770 -70672 59957 110254 -1893 -112719 -62389 84809 114908 -31808 -129953
744a29953J04538J27813l6748j14819l1678O8496P1648j3119o7481k7396K2586
$$ -129953 -25415 102398 65650 -49169 -80847 -12351 59297 46178 -21303 -48699 -26113
755b6113L7126M0836j2962q8948l4286R7343Q8092n6926j25216j6016J32012R3359
$$ -26113 11013 51849 38887 -50061 -84347 12996 101088 44162 -81054 -97070 34942 128301
767A28301j01660j41972M2671J45287K6045j05312p9720M1412R7530J6531p4107
$$ 128301 26641 -115331 -72660 72627 98672 -6640 -86360 -44948 52582 69113 -4994
778d994m7250J9338L8823L8870m91p2869n1975O2125R5136q202j12018o8025R4251
$$ -4994 -52244 -32906 5917 44787 44296 -28573 -80548 -18423 76713 68511 -43507 -111532 -17281
791a7281J34160m4662j61666k0968J40749Q2828p8974j18253N900J16435N0839
$$ -17281 116879 72217 -89449 -110417 30332 113160 34186 -84067 -78167 38268 89107
802H9107p6539o9441J6550M8632L6761r29n9338n0477L8539Q1946J7874q1229
$$ 89107 12568 -56873 -40323 8309 45070 44141 -15197 -65674 -27135 54811 72685 -8544
814h544q7516M7043J36147P867j42633o7818J02144J10458l1499j24289l9485
$$ -8544 -96060 -49017 87130 94997 -47636 -115454 -13310 97148 65649 -58640 -98125
825i8125J03172Q2939n4797q5006p95N2012M1629n53n0176m1026K2996N6590K9307
$$ -98125 5047 87986 33189 -51817 -52612 -600 41029 40476 -9700 -50726 -27730 28860 58167
838E8167l8945q0815k474J07359N2002r2704r2589M1281J09395K5342r8320q1080
$$ 58167 19222 -61593 -64067 43292 95294 2590 -89999 -48718 60677 86019 -12301 -93381
850i3381O2190J02329j5172q4671k8058L8427M9924J1451m3498m2444J0346M1730
$$ -93381 -31191 71138 55966 -28705 -56763 -18336 31588 43039 -459 -42903 -32557 9173
862I173L4591j1781o9391l2789P7005P3959m8171r4367o106Q9329O5416n9677
$$ 9173 43764 31983 -37408 -70197 6808 80767 32596 -61771 -67877 21452 86868 27191
874B7191j02756J6190J04232K7395o9612n6717J6164O2349L1451m3461n3427O755
$$ 27191 -75565 -59375 44857 72252 2640 -54077 -37913 24436 55887 12426 -41001 -34246
886c4246M0642L1606m036n6249l9853N1328P0977j8534p7663l2049N8152P8664
$$ -34246 6396 38002 33966 -22283 -62136 -10808 60169 41635 -36028 -68077 -9925 68739
898F8739k1155j00040j9401Q7302N1677m5106o4935n880N8737M5050l4416n5148
$$ 68739 47584 -52456 -71857 15445 67122 22016 -42919 -48799 9938 54988 20572 -34576
910c4576K407L6119K5762J903l8844l7658K9563N5538p67n0040l6638K3295O5320
$$ -34576 -32169 3950 29712 31615 -7229 -44887 -15324 40214 39447 -10593 -47231 -23936 41384
923D1384R644p2330l8614N1780N2721j3343n1107k6925L4952N1470j2698m9644
$$ 41384 51028 -21302 -59916 -8136 44585 31242 -19865 -46790 -11838 39632 26934 -22710
935b2710r188K4996K4730Q832k6091l4321J4688M0863Q813k5286l2791k522M7267
$$ -22710 -31898 -6902 17828 26660 569 -33752 -19064 21799 30612 5326 -27465 -29987 17280
948A7280L0411m3654m5622K1118M5396J1297l2295m0689J2161N1214P025m1149
$$ 17280 47691 4037 -41585 -20467 24929 36226 3931 -36758 -24597 26617 33642 -7507
960g507j9806J2811K3419J6986j8098l5258M120L3616J2717j3540k7349j3723
$$ -7507 -27313 -14502 8917 25903 7805 -27453 -23333 10283 23000 9460 -17889 -31612
972c1612L3499L5206k5566m1063O054L2311J9528j3915l7512n163M2104J8123
$$ -31612 1887 37093 11527 -29536 -23482 8829 28357 14442 -23070 -28233 13871 31994
984C1994k8080k2109K729J8900K1700j1112l3716M37K7462Q756q146j6796j4553
$$ 31994 3914 -18195 -15466 3434 25134 14022 -19694 -19257 8205 16961 8815 -7981 -22534
997b2534J8610K8187j3085k8735j15J6273J6509m45k7366j2910K8601J7689j6930
$$ -22534 -3924 24263 11178 -17557 -17672 -1399 15110 14665 -12701 -25611 2990 20679 3749
1010C749j4865j040Q830J8627k176k4655j688J8229M399j587o437j4507P743K2070
$$ 3749 -11116 -12156 -3326 15301 13125 -11530 -13218 5011 9410 7823 1386 -13121 -5378 16692
1024A6692n745j8645k77N685Q386O906j5174j4438J5109J2877q557n667m147k198
$$ 16692 10947 -7698 -7975 -2290 6096 13002 -2172 -16610 -1501 11376 2819 -2848 -6995 -9193
1038i193J5084N546j7937n374J1625K651J495p47j2912K219J7046k823j0732J722
$$ -9193 5891 11437 -6500 -11874 -249 2402 3897 3150 -9762 -7543 9503 6680 -4052 -2330
1052b330q7K499J0868o795j4187Q474J0109n023j467l298n763J0671O885j3522
$$ -2330 -2417 82 10950 4155 -10032 -1558 8551 3528 2061 -1237 -7000 3671 10556 -2966
1066b966l788Q188k029J541L826j0722k373J3303j357q415L385j382j413R850
$$ -2966 -6754 1434 -595 946 4772 -5950 -8323 4980 3623 -4792 -1407 -2789 -4202 5648
1080E648l652j0796P323O307o186K021J341p049N763P490r307j889P027l997O06
$$ 5648 1996 -8800 -1477 4830 -1356 665 2006 -5043 720 8210 -1097 -2986 4041 44 650
1095F50N788p999l441J1385l132p367O004q45n228O989m97q435N227L721p204
$$ 650 6438 -1561 -5002 6383 3251 -4116 1888 1043 -4185 2804 2307 -6128 -901 2820 -4384
1110d384L714K839p906L558P218q312p92P326m855j488Q012n254m205Q779j995
$$ -4384 -670 2169 -5737 -2179 5039 -3273 -4065 3261 -1594 -3082 4930 -324 -4529 4250 2255
1125B255m890O607j712o380Q183J136q919L927M490p216L508L627q509J434P200
$$ 2255 -2635 3972 2260 -4120 4063 5199 -3720 207 4697 -2519 989 4616 -3893 -2459 4741
1140D741o490j228N451n883r43R151n386o694Q038J08m636N774k068o938Q777
$$ 4741 -1749 -2977 2474 -3409 -4352 4799 -587 -7281 757 865 -3771 2003 -65 -7003 1774
1155A774L307q420K567L370n193N101M155j0600P3J0155l454l055L644o139J59
$$ 1774 5081 -3339 -772 2598 -2595 2506 6661 -3939 -3866 6289 2835 -220 3424 -2715 -2556
1170b556J0821n063r334O040J379k366N798m641r992R488P763q828k437J404k625
$$ -2556 8265 3202 -6132 -92 1287 -1079 4719 78 -9914 -426 7337 -1491 -3928 -2524 -5149
1185e149Q086M883j3784l232J1867P14j864L01q752J522J5470k089j3763J535
$$ -5149 2937 7820 -5964 -9196 2671 3385 1521 1822 -6930 -5408 10062 7973 -5790 -4255
1199d255M549L024O630p730j3938R725J3476o239o748l561k616J3396Q406j8087
$$ -4255 294 3318 9948 2218 -11720 -1995 11481 5242 -1506 -5067 -7683 5713 14119 -3968
1213c968j0196J2599P491m9m943j3435J916K0791L95j6923k874L928O794J1079
$$ -3968 -14164 -1565 5926 5877 934 -12501 -10585 10206 10601 -6322 -9196 -5268 1526 12605
1227A2605q485j9834O851J9435M99q187j0925n043J9364J5600j9979j8960J0906
$$ 12605 4120 -15714 -8863 10572 11071 2884 -8041 -13084 6280 21880 1901 -17059 -6153
1240f153J4382N450p027k0664r12K5654O738j8679j0296R85J0376J6737p604k6945
$$ -6153 8229 13679 6652 -14012 -14924 10730 17468 -1211 -11507 -10522 -146 16591 8987 -17958
1254a7958Q99K2025R324o848j8286j2216K2196K7255j6763k9827K353K1721J7362
$$ -17958 -17059 4966 14290 7442 -10844 -23060 -864 26391 9628 -20199 -17846 3875 21237
1267B1237o765l1238p216L2702J6844j9534j8113k685J3480K2359m015l0581p747
$$ 21237 14472 -16766 -23982 8720 25564 6030 -12083 -14768 -1288 21071 17056 -13525 -21272
1280b1272K0982J7858M38k3008k5125J9631L9705p527l8873j2066K3059L0509
$$ -21272 -290 17568 18006 -5002 -30127 -10496 29209 21682 -17191 -29257 -6198 24311
1292B4311m38m0175j9275L5200K9072j5977k5358r459J4195K8913J466l1548j4603
$$ 24311 23873 -16302 -35577 -377 28695 12718 -12640 -22099 -7904 21009 22475 -9073 -23676
1305b3676J6552K2081J0596j9890l5982Q410M7105R925l8315k9920J2967M3821
$$ -23676 -7124 14957 25553 5663 -30319 -21909 25196 35121 -3194 -33114 -20147 23674
1317B3674J6146m5171l8471L0780M3967n618l4339k1705J4116L6882P268l2710
$$ 23674 39820 -5351 -43822 -13042 30925 25307 -9032 -30737 -16621 20261 27529 -5181
1329e181k1353J0519K2869K0104j1418m4278o949M8282L0174k9155m6964m928
$$ -5181 -26534 -16015 6854 26958 15540 -28738 -35687 12595 42769 13614 -33350 -38278
1341c8278N2658M0206m2441o0591J8392N9183J2602l8891l8241Q770M7043J7242
$$ -38278 14380 54586 12145 -48446 -30054 29129 41731 2840 -35401 -26631 20412 37654
1353C7654l5821k8921O688K2594K5151l748m4361k1749L9853M2854j1641n2399
$$ 37654 1833 -27088 -20400 2194 27345 23597 -20764 -42513 -2660 40194 28553 -23846
1365b3846k8438M5866O2663k3732p6446o719O4446L7265l1998n5898m361N5861
$$ -23846 -52284 -6418 56245 32513 -43933 -50652 13794 51059 19061 -36837 -41198 14663
1377A4663L0743l5124l6846L730K2549K5476L312l6757k9850K3681M4978R208
$$ 14663 45406 10282 -26564 -22834 -285 25191 28503 -8254 -38104 -14423 30555 39763
1389C9763m3230m9435K4559P6173N092p9046l6945N3718O0578j2671o8076k7016
$$ 39763 -3467 -52902 -28343 47830 52922 -26124 -63069 -9351 51227 38556 -29520 -56536
1401e6536N5622M9386k7404m6668m846K3729K8505P779l0747l1718R844L9945
$$ -56536 -914 48472 21068 -25600 -30446 -6717 21788 29567 -1180 -32898 -23054 16891
1413A6891K5666k5523o0671l430P7170L7554o5143o5382K7771P7046J9946o9265
$$ 16891 42557 17034 -43637 -47067 30103 67657 2514 -62868 -35097 41949 61895 -7370
1425g370n8907M3362P2017r090n7609k2416K4000L7132J1604k9878l3356K611
$$ -7370 -66277 -22915 49102 40012 -17597 -40013 -16013 21119 32723 2845 -30511 -27900
1437b7900L1486L2391o833n9353k8310O2923O1883l7918p9348o668P6664N3816
$$ -27900 3586 35977 29144 -30209 -58519 4404 66287 28369 -50979 -57647 19017 72833
1449G2833n3128q3648J8155Q5170J7047n8061m2194J7355M7297J9064l2482l4757
$$ 72833 19705 -63943 -45788 39382 56429 -1632 -43826 -26471 20826 39890 7408 -27349
1461b7349K198K4331K8434N440m6103m1144L8544O6812q082p2111l6019N4975
$$ -27349 -25151 -820 27614 33054 -13049 -54193 -15649 51163 43081 -29030 -65049 -10074
1473a0074P5540k2045r3488j4512Q1277M5323m5285n8809J689N3244L1690l1162
$$ -10074 65466 43421 -50067 -64579 16698 62021 16736 -42073 -40384 12860 44550 13388
1485A3388l9121J785K1266K2199J2629k9770m4127J5302N8998J7739n1704n5914
$$ 13388 -25733 -23948 -2682 19517 32146 2376 -41751 -26449 32549 50288 -1416 -57330
1497e7330K2677Q2051J4772q4543m8444N9444O6513j6712o5939k5660M7342M9924
$$ -57330 -34653 47398 62170 -22373 -70817 -11373 55140 38428 -27511 -53171 -5829 44095
1509D4095j9714m6781p127K0433K3277J5161k0046m1446j54M6011L1794k6360
$$ 44095 24381 -22400 -29527 -9094 14183 29344 9298 -32148 -32302 13709 45503 19143
1521A9143n9639q776P1927M5401n9581o9908K6216P3776J6695n8707n1847L0184
$$ 19143 -40496 -49272 22655 68056 8475 -61433 -35217 38559 55254 -3453 -55300 -25116
1533b5116O4911m58n2067k1159J9173K7423J5583j7272l6747n606L3278L2199
$$ -25116 39795 39337 -12730 -33889 -14716 12707 28290 11018 -25729 -31335 1943 34142
1545C4142q372n0147k7515N1879N8693l2813p1742j886O4547L9795l9413o5165
$$ 34142 25770 -24377 -51892 -13 58680 25867 -45875 -47761 16786 56581 17168 -47997
1557d7997Q426O7623J8936m6791l3011J2860L1604J8450j6593l3726m976K4488
$$ -47997 -39571 28052 46988 197 -32814 -19954 11650 30100 13507 -20219 -25195 -707
1569g07K4070K554l3974l4330K7460N6034o967n8171k2753M0053M9352j0947o1865
$$ -707 23363 25917 -8057 -42387 -14927 41107 34140 -24031 -46784 -6731 42621 31674 -30191
1582c0191j7495N4434L5730k9420l8080k035K7685K6583r201l2031q136J7617
$$ -30191 -47686 6748 42478 13058 -25022 -27057 628 27211 18010 -14021 -22157 -4540
1594d540J9261R463j8926l5068P447M6546J1936l8503l3300J4386M7627J4283
$$ -4540 14721 24184 5258 -29810 -22363 24183 36119 -2384 -35684 -21298 26329 40612
1606D0612m8749l6333L3296M3620q436l5892j8105J8293L3127J618l1820j4626
$$ 40612 -8137 -44470 -11174 32446 24010 -11882 -29987 -11694 21433 23051 -8769 -23395
1618b3395J3488J8647J1847j1978l2268j107L6896J8611k3489l1768j345L7513
$$ -23395 -9907 8740 20587 8609 -23659 -24766 12130 30741 7252 -24516 -25861 11652
1630A1652K7460l2007m2352J5868M1212P108k7915k6544P561L4875R990k9546
$$ 11652 39112 7105 -35247 -19379 21833 28941 1026 -25518 -17957 16918 26908 -2638
1642b638j8926J1179J7006J0907q162k7286m017K7216J6278j3469k2589r202K2977
$$ -2638 -21564 -10385 6621 17528 9366 -17920 -21937 5279 21557 8088 -14501 -23703 -726
1655g26K8732j5392l6858K690L0976J2467j3709k4599m189K8364J6498k0475j8465
$$ -726 28006 12614 -24244 -21554 9422 21889 8180 -16419 -20608 7756 24254 3779 -14686
1668a4686N316J1697J2086k160k1493p411J8510J2525n551j3210j2113R395K4673
$$ -14686 -9370 2327 14413 12253 -9240 -16651 1859 14384 8833 -4377 -16490 -7095 17578
1681A7578l089k6193n762J6501J3263q74j8259j3470J7554J9435r775j5931j253
$$ 17578 14489 -11704 -17466 -965 12298 11424 -6835 -20305 -2751 16684 6909 -9022 -10275
1694a0275O538J2418M140j6908j0246J3132J0711r22o643j2599J570K0508L889
$$ -10275 -3737 8681 12821 -4087 -14333 -1201 9510 8588 1945 -10654 -9084 11424 15313
1707A5313j8954q067Q340J0446N789j1738j6983R197J8899l932j2213m522J472
$$ 15313 -3641 -11708 -3368 7078 12867 1129 -15854 -6657 12242 8310 -3903 -8425 -6953
1720f953J1325P550j4245j0870R651Q737J76l389j0463j672J6357N140j3620n579
$$ -6953 4372 11922 -2323 -13193 -3542 5195 5371 1982 -8481 -10153 6204 11344 -2276 -7855
1734g855M543N592O934m796j4109L881J4408j243p421l075k037P490Q259r581
$$ -7855 -3312 2280 9214 4418 -9691 -5810 8598 7355 -66 -3141 -5178 2312 10571 990
1748I90j0058P112N424o65K80p216m128J0828M723r664k493K458M20N768L33j0714
$$ 990 -9068 -1956 3468 2803 3083 -4133 -8261 2567 7290 -2374 -4867 -2409 -1989 3779 4112 -6602
1764f602O39J0208j453l412N72m184K838Q829n002p434M495K692j168L528m327
$$ -6602 -5963 4245 2792 -620 -48 -4232 -1394 7435 2433 -5001 -506 2186 1018 4546 219
1779B19n750P255M506o762r42J676k602M493K561q420j004P091j866j716J917
$$ 219 -5531 1724 6230 -532 -1474 202 -2400 2093 4654 -3766 -4770 2321 455 -1261 656
1794F56m736J57P978k809o011M053O49j171M315k290o258N848M358n389L29J882
$$ 656 -4080 -3923 4055 1246 -4765 -712 -63 -1234 3081 791 -5467 381 4739 -650 -321 1561
1810A561l724L645M244p294j233O153k101j344L004m272j652O706j560n598L235
$$ 1561 -2163 1482 5726 -1568 -2801 3352 1251 -93 2911 -1361 -3013 3693 2133 -3465 -230
1825b30L22k889N354j246o879M131M143m598P29J498m404L336N011n892j756N031
$$ -230 92 -2797 2557 1311 -5568 -1437 2706 -1892 -1163 335 -4069 -733 4278 -1614 -3370 1661
1841A661j320m34M014m866k715P324k1n295K611m45k294N537j3p732K804M432
$$ 1661 341 -93 3921 -945 -3660 3664 3643 -1652 959 514 -1780 3757 3744 -3988 -1184 3248
1857C248l581R69R80o236K874O531n054l498L255r50L29N043n742m450P209K553
$$ 3248 -333 636 1616 -4620 -1746 4785 -269 -3767 -512 -1462 -1133 3910 -1832 -6282 927 3480
1873C480m915J119j144k115P415J478q649N60N205j211J750k23p422K728Q713
$$ 3480 -1435 -316 -1460 -3575 3840 5318 -3331 -2771 2434 1223 2973 2750 -4672 -1944 6769
1888F769l600n369R78l24K309N812o696p371O732M913l109p51l925k465R017L457
$$ 6769 3169 -2200 -1222 -1546 763 6575 -121 -7492 -760 4153 1044 293 -3632 -6097 2920 6377
1904F377r573k312L988J412L811k68j0289P75J1497k6n793j561k506M751R716
$$ 6377 -3196 -5508 -1520 -108 3703 3435 -6854 -6079 5418 5392 -401 -1962 -4468 283 9999
1919I999o538j1541M924Q002M86j423p250n093J1207P332r527o904K276L443O681
$$ 9999 3461 -8080 -3156 4846 5332 3909 -3341 -8434 2773 10105 578 -6326 -4050 -607 6074
1934F074O2j3401l292J2974N202n310o429o131P080J5006n199j6779Q38J1040
$$ 6074 6136 -7265 -10557 2417 7619 2309 -4120 -10251 -3171 11835 6636 -10143 -9305 1735
1948A735O300j139j1640p798J3697J2547q909j0971k03N072J0371J863j5591p908
$$ 1735 8035 6896 -4744 -12542 1155 13702 4793 -6178 -6381 -1309 9062 10925 -4666 -12574
1962a2574J2940R703k074r622j1451N874K0212q61k0725o342J2205J2262J613
$$ -12574 366 10069 7995 -1627 -13078 -7204 13008 12147 -8578 -14920 -2715 9547 11160
1975A1160j5391j3415J3732J8033o101j4204m486M726J3792O293j6477j2325R810
$$ 11160 -4231 -17646 -3914 14119 8018 -6186 -10672 -5946 7846 14139 -2338 -14663 -4853
1988d853J3792L575q693j7682P61K5376P932k1472j5394P764J9107Q953j7913
$$ -4853 8939 12514 3821 -13861 -13100 12276 20208 -1264 -16658 -8894 10213 19166 1253
2001A253k2429J1234K4623o31j7408j0252L028J7039J0104j5759j6838M905J5058
$$ 1253 -21176 -9942 14681 14050 -3358 -13610 -10582 6457 16561 802 -16036 -11131 3927
2014C927R847m599k2929p586K6885J8465j7301k4705n0K3726K0238j6577l1653
$$ 3927 13774 9175 -13754 -21340 5545 24010 6709 -17996 -18046 5680 25918 9341 -22312
2027b2312M344L1334Q439j8519j8156QK0648J4694j3901k0460K82J3766J4702
$$ -22312 -17968 13366 21805 3286 -14870 -14862 5786 20480 6579 -13881 -13599 167 14869
2040A4869N0k3796j6759K1862K7212p682k9111j3591K1868L2060p563l9916p948
$$ 14869 14919 -8877 -25636 -3774 23438 15756 -13355 -26946 -5078 26982 19419 -20497 -28445
2053b8445L3342K0447j4402k6291o231K2711K1843j1716k2808l347J1154J6661
$$ -28445 4897 25344 10942 -15349 -21580 1131 22974 11258 -11550 -14897 -3743 12918
2065A2918O841j9979k4467J2544L1530N349k6807k6714J1797M1848O817m3325
$$ 12918 19759 -220 -24687 -12143 19387 24736 -2071 -28785 -16988 24860 31677 -11648
2077a1648k3963K8828L2991n248l2610j7563K2584K9730o998k6782q153J0367
$$ -11648 -35611 -6783 26208 20960 -11650 -29213 -6629 23101 16103 -10679 -18832 -8465
2089h465J7484J1638j5944k7311L386L0807J6262j8372l6022j465M4484K4407
$$ -8465 9019 20657 4713 -22598 -19212 11595 27857 9485 -26537 -28002 16482 40889
2101D0889l8248l9841J7750M2774R634l4612l1806J7701L9810R34l1290j4613
$$ 40889 2641 -37200 -19450 23324 32958 -1654 -33460 -15759 24051 24985 -6305 -20918
2113b0918R094J8956J3588j2878k6448l669K3926K2589o619l5676j7921L7190
$$ -20918 -11824 7132 20720 7842 -18606 -22275 1651 24240 17621 -18055 -35976 1214
2125A214L8862k3027m8424p51M3219K7673k6594m4752N098M5662J3920l0347k2928
$$ 1214 40076 17049 -31375 -32126 11093 38766 12172 -32580 -27482 18180 32100 1753 -21175
2138b1175N699K0874J6141r443k4397p851J5807K2403N836k9075l0630K2428M6441
$$ -21175 -15476 5398 21539 12096 -12301 -20152 -4345 18058 23894 -5181 -35811 -13383 33058
2151C3058l536m8041k1322L3446M3174j0291n1980j3592M4746K9048k2924l1815
$$ 33058 29522 -18519 -39841 -6395 36779 26488 -25492 -39084 5662 34710 11786 -20029
2163b0029l136K3219K2174o521k5359r687J1315K0649J2648k0078l4759P152M5337
$$ -20029 -23165 54 22228 15707 -9652 -19339 -8024 12625 25273 5195 -29564 -22412 22925
2176B2925J3818l8637l6225J6832N0647J0447n0643l3490L5212M2704r614l8208
$$ 22925 36743 -1894 -38119 -21287 29360 39807 -10836 -44326 -9114 33590 23976 -14232
2188a4232j6001K2055L0256k189k7959j2969J0223J8359J4004j1489l2536m661
$$ -14232 -30233 -8178 22078 19889 -8070 -21039 -10816 7543 21547 10058 -22478 -27139
2200b7139L6928K4584k2928m0105k656M6250K9002l7880m6138J7444M7955P998
$$ -27139 9789 34373 11445 -28660 -31316 14934 43936 6056 -40082 -22638 25317 33315
2212C3315l5201k8365J4160L6263N050k8516j6465P805J6458J3659n432k7416
$$ 33315 -1886 -30251 -16091 20172 25222 -3294 -19759 -11954 4504 18163 12731 -14685
2224a4685j1458K5151K6881p706l5008j7544L2391M0015j9104m8976j806M2346
$$ -14685 -26143 -992 25889 18183 -16825 -34369 -1978 38037 18933 -30043 -31849 10497
2236A0497K3566k3455l6902J099L7634J6517k4663k2197M018J5855J5013j580
$$ 10497 34063 10608 -26294 -25195 12439 28956 4293 -17904 -13886 1969 16982 15402
2248A5402k2859j4394J5710K4824L369k5970k6507J6373M2738o06m3728j9108
$$ 15402 -7457 -21851 -6141 18683 22052 -3918 -30425 -14052 28686 28080 -15648 -34756
2260c4756K9560L3928o852l8770j5644L2506K7949j5360k7615m089J5559J8979
$$ -34756 -5196 28732 21880 -16890 -32534 -28 27921 12561 -15054 -19143 -3584 15395
2272A5395J751k1583j5423J0908K1125Q754j6559k7446L630L7448J2437l2261
$$ 15395 17146 -4437 -19860 -8952 12173 20927 4368 -23078 -19448 18000 30437 -1824
2284a824k6937J4431L4342Q385l2416k7212K0995L3839m784k7278j1965J1495
$$ -1824 -28761 -14330 20012 28397 -4019 -31231 -10236 23603 18819 -8459 -20424 -8929
2296h929K1259M963j9670j5864Q131J6546R015q597k3176m210K7861J7695j9356
$$ -8929 12330 17293 -2377 -18241 -10110 6436 15451 6854 -16322 -20532 7329 25024 5668
2309E668k5642K021K6577J7953k0581l0144Q602L1006N726k0964j6260L728K0813
$$ 5668 -19974 -17953 8624 26577 5996 -24148 -15546 15460 21186 222 -16038 -12310 8503
2322H503J0527j6720j6640M387J3273R114l210j8851r100J9105J7719q812k0687
$$ 8503 19030 2310 -14330 -9943 3330 12444 9234 -9617 -18717 388 18107 9295 -11392
2335a1392p410J6389K2140o898k8985l224K3868J3004j0572j7380n155J6890J6095
$$ -11392 -18802 -2413 19727 12829 -16156 -19380 4488 17492 6920 -10460 -15615 1275 17370
2348A7370r919j7498n23J0472J0596J063j5298j1791J2436J6705k634j4385j0986
$$ 17370 7451 -10047 -10570 -98 10498 11561 -3737 -15528 -3092 13613 10979 -3406 -14392
2361a4392P195K0607K573k3789j0221J5762J4929k344j5291j1312J1517J8782
$$ -14392 -7197 13410 15983 -7806 -18027 -2265 12664 10320 -4971 -16283 -4766 14016
2373A4016m652j7170l740Q411J0417L806j2528j2422R250J4071l61r352r947J998
$$ 14016 9364 -7806 -11546 -3135 7282 11088 -1440 -13862 -4612 9459 9098 -254 -10201 -8203
2387h203J6491O993j6727j1418R050J2170K321j0084j2986N532J7109k93j3740
$$ -8203 8288 15281 -1446 -12864 -3814 8356 10677 593 -12393 -6861 10248 9955 -3785
2400c785m907M555P794N526q929j1395N870J0660M51n162o777k567J1336P791
$$ -3785 -8692 -4137 3657 9183 254 -11141 -5271 5389 5840 678 -6099 -8666 2670 10461
2414A0461r818r150L927O926N050l415j0853p93J3306L048q022n112L64M976P602
$$ 10461 643 -8507 -4580 2346 7396 3981 -6872 -7665 5641 8689 667 -4445 -4081 895 8497
2429H497m326j0843K265P484J318j563n341n071P319P651n614p427J246L072N162
$$ 8497 4171 -6672 -4407 3077 4395 2832 -2509 -7580 -261 7390 1776 -5651 -4405 -1333 3829
2444C829J251r469l778R561M510m540l902j924K165Q376j116r462K83N991J565
$$ 3829 5080 -4389 -8167 1394 5904 1364 -2538 -4462 -2297 6079 4963 -4499 -4216 1775 3340
2459C340L52l525n607M683P602l718o007N00J437L683K198o737m387O511L761
$$ 3340 3692 167 -5440 -757 6845 3127 -2880 -2380 -943 2740 4938 -1799 -6186 325 4086
2474D086l112k184k500L7P323K33p934m26M971M79P97j133n576K866O911k785
$$ 4086 974 -1210 -3710 -3673 3650 3883 -4051 -4477 494 973 1770 637 -4939 -2073 4838 2053
2490B053l973Q33J48K293L616m991m263N100K409k385L64k397j456N448R98n926
$$ 2053 -1920 -1087 -939 1354 4970 -21 -4284 816 3225 840 1204 -1193 -2649 2799 3797 -2129
2506b129j29K728q82J531K84n110Q23N655k293k287J153j621J109M347k678m744
$$ -2129 -2258 470 -412 1119 1403 -3707 -2884 2771 478 -1809 -656 -2277 -1168 3179 501 -4243
2522d243L769K310j902J360j423l105M807K339m292n47J752j262K208J541m921
$$ -4243 -474 1836 -66 1294 -129 -3234 1573 3912 -380 -927 825 -437 1771 3312 -1609
2537a609q15N038q62j849O88k083j89N071j997n252K796J718j193J734j454m170
$$ -1609 -2424 2614 1752 -97 591 -1492 -1681 3390 1393 -3859 -1063 655 -538 1196 -258 -4428
2553d428L862L710l699j384J633j510K657K742m946k147M942O11j518N48k610
$$ -4428 -566 3144 -555 -1939 -306 -1816 841 3583 -1363 -3510 1432 2043 525 1073 -1537
2568a537n95O066o66n184R05J783k90K527j823n717L463M655k939j505n55j376
$$ -1537 -2132 3934 3268 -1916 -1011 772 482 3009 1186 -4531 -1068 3587 648 -857 -1412 -2788
2584b788L082L846n237l685M428J422o67J321m627j499P016J577n221j055P64
$$ -2788 294 4140 -1097 -4782 -354 1068 401 1722 -2905 -4404 2612 4189 -1032 -2087 -1323
2599a323J023M744j204p911J950O349m41j879k201k924M524N554n193n338K556
$$ -1323 -300 4444 3240 -4671 -2721 3628 3187 1308 -893 -3817 707 6261 1068 -4270 -1714
2614a714K475J356J309o031l513P078L947m815k883r13J472O696j41r491o24P226
$$ -1714 761 2117 3426 -2605 -6118 960 4907 92 -2791 -3704 -2232 4464 4323 -5168 -5792 1434
2630A434K343j028m123m487M694Q286l440p585J090L042L263K734p138n858O577
$$ 1434 3777 2749 -1374 -5861 -1167 7119 3679 -3906 -2816 226 3489 6223 -915 -6773 -196
2645a96O562k792m565m010P75R090K730j0976m567O857N285O74n158q311L883
$$ -196 6366 3574 -991 -5001 -4226 4864 7594 -3382 -7949 -1092 4193 4867 -291 -8602 -4719
2660d719J1584j705q935j993K241N979M790o922q675M824Q901O88m116p779j924
$$ -4719 6865 5160 -3775 -5768 -3527 2452 7242 320 -8355 -3531 5370 6058 1942 -5837 -7761
2675g761J2410O550j1091q981M769Q821M319o350j2127K255J4334J518r336n871
$$ -7761 4649 11199 108 -8873 -4104 4717 9036 2686 -9441 -7186 7148 8666 -670 -6541
2689f541P58P257P886o453j2270K129R993M378k908j0521n641J3007J2125r343
$$ -6541 -5783 1474 9360 2907 -9363 -7234 2759 7137 4229 -6292 -11933 1074 13199 3856
2703C856j3934J031J1034R833n121j6634j105J6761O714r998q754j287Q013J0848
$$ 3856 -10078 -9047 1987 11820 6699 -9935 -11040 5721 12435 2437 -6317 -7604 409 11257
2717A1257m408j4656j108R693P299M0j1293j0968J0580J6846m298j6579n862J0072
$$ 11257 6849 -7807 -8915 778 8077 8117 -3176 -14144 -3564 13282 8984 -7595 -13457 -3385
2731c385J5469n85k0211p781J7224J2249p163j1951n164Q367J4143j967j4612
$$ -3385 12084 11499 -8712 -16493 731 12980 5817 -6134 -11298 -2931 11212 9245 -5367
2744e367m681P317R678M741r888j5417N453J9819K954j5451j3465M986K0519O720
$$ -5367 -10048 -2731 6947 11688 1800 -13617 -8164 11655 14609 -842 -14307 -9321 11198 17918
2758A7918k1437j5830J4171J8392j757j5329j0547P037J7597J445j5499p732N396
$$ 17918 -3519 -19349 -5178 13214 11457 -3872 -14419 -7382 10215 11660 -3839 -11571 -6175
2771f175J0053Q046p129j7734l59J9729J0309j1977j8174k035K2132J5741j8349
$$ -6175 3878 11924 4795 -12939 -13298 6431 16740 4763 -13411 -15446 6686 22427 4078
2784D078k4013Q485K3317N257j5204j7313M236K0999N566j6013j0516K935R879
$$ 4078 -19935 -11450 11867 17124 1920 -15393 -11157 9842 15408 -605 -11121 -8186 1693
2797A693R981l596j7897n618J5619J4481m437j9288j1504J8756K3808j0439k8651
$$ 1693 11674 8078 -9819 -15437 182 14663 10226 -9062 -20566 -1810 21998 11559 -17092
2810a7092j956K3547J5202j1217k3065k421K2994J2432j4335j3959j20R723J2032
$$ -17092 -19048 4499 19701 8484 -14581 -17002 5992 18424 4089 -9870 -9990 -267 11765
2823A1765n33j6467r239J0514J6093K745j6825j8895J0870K9274l02k9219j3131
$$ 11765 11232 -5235 -14474 -3960 12133 14878 -1947 -20842 -9972 19302 19000 -10219 -23350
2836b3350J9510K2610l538k6887j1015K2495J9288j0673j8311l222J0173J3846
$$ -23350 -3840 18770 15232 -11655 -22670 -175 19113 8440 -9871 -13093 -2920 10926
2848A0926J398j5060j1308P116J4821P684j0914k1969J992K8615J0157k4367k1065
$$ 10926 12324 -2736 -14044 -6928 7893 15577 4663 -17306 -15314 13301 23458 -909 -21974
2861b1974J0371K7016P334k6161k1650J7548K5828m140k0630q865Q337J6033M002
$$ -21974 -11603 15413 22747 -3414 -25064 -7516 18312 14172 -6458 -15323 -6986 9047 13049
2874A3049j4215j1546L834J2124R804m478k0953p144K3692J7876j4412k4834j453
$$ 13049 -1166 -12712 -8878 3246 13050 8572 -12381 -19525 4167 22043 7631 -17203 -18656
2887a8656K5338J8498j8449k9023P370K8533N387j8844j4943L859J8772P738j2883
$$ -18656 6682 25180 6731 -22292 -14922 13611 18998 154 -14789 -10930 7842 15580 2697
2900B697j3518J445R668J0177P00j8079j2420J6325K0628m712k3097j1740J8528
$$ 2697 -10821 -9376 292 10469 11169 -6910 -19330 -3005 17623 12911 -10186 -21926 -3398
2913c398K5611q040l1380m299K6992J4787j3017k0426k824J9165J4210j1615j5651
$$ -3398 22213 14173 -17207 -21506 5486 20273 7256 -13170 -15994 3171 17381 5766 -9885
2926i885K02Q523J0572L501j4697j4601R828J9761K541j7852j7351R096K7683
$$ -9885 -9683 -1160 9412 12913 -1784 -16385 -6557 13204 15745 -2107 -19458 -10362 17321
2939A7321K436k8748j3743J9699K0571m418k1929j0867J7045J9008p570j7332
$$ 17321 19757 -8991 -22734 -3035 17536 13118 -8811 -19678 -2633 16375 8805 -8527
2951h527l023P900J0622M737j1830j3131N034J5503O762j0263j7646k48K3948
$$ -8527 -11550 -3650 6972 11709 -121 -13252 -8218 7285 14047 3784 -13862 -14110 9838
2964I838J1306k0634j9365R525K1447N278j8060j7222R807K1651j020j6702p032
$$ 9838 21144 510 -18855 -9330 12117 17395 -665 -17887 -8080 13571 12551 -4151 -11183
2977a1183N417J0440O164q841j2962J991J1690P890l946j5388p437J8105J5986
$$ -11183 -5766 4674 10838 1997 -10965 -8974 2716 10606 6660 -8728 -16165 1940 17926
2990A7926j2081j9876P06J7773J2661j0975k0878K062K1371N686j3265j0676J821
$$ 17926 5845 -14031 -13325 4448 17109 6134 -14744 -12682 8689 14375 1110 -9566 -7745
3003g745J0963Q686o709j3490K5R281P440j95j2427j0025J1476J6383m789j6929
$$ -7745 3218 11904 5195 -8295 -8270 1011 8451 8256 -4171 -14196 -2720 13663 8874 -8055
3017h055n691J1605J5315k622k0529n739J8037J1218q663j2469k702R768J1777
$$ -8055 -13746 -2141 13174 10552 -9977 -15716 2321 13539 4876 -7593 -10295 -527 11250
3030A1250m468j3405j632Q199O670J743q737j0728O585J4443k17j1901q044M525
$$ 11250 6782 -6623 -8255 -56 6614 8357 -380 -11108 -4523 9920 9703 -2198 -10242 -5717
3044e717J4335M008j6714r896J1801J2146k947j0585o744N962J2755r25j2541
$$ -5717 8618 12626 -4088 -13984 -2183 9963 7016 -3569 -10313 -4351 8404 7479 -5062
3057e062l045O031N828L082o154r696L270J1663J851p114p133k12J0347P872j0636
$$ -5062 -8107 -2076 3752 6834 680 -9016 -5746 5917 7768 654 -6479 -6691 3656 11528 892
3072H92j0899O007J0167J587o855q576J892J1919K349j0079n056L601N010L992
$$ 892 -10007 -4000 6167 7754 899 -7677 -5785 6134 8483 -1596 -6652 -3051 1959 5951
3086E951k993r970Q04R359K460m010n884l441P812Q906o084j0600J841Q267L763
$$ 5951 2958 -7012 -6208 3151 5611 1601 -4283 -7724 88 8994 2910 -7690 -5849 2418 6181
3101F181k548q809k263J0473N472p397n539Q89L815N594j441r088r83P694K900
$$ 6181 3633 -5176 -7439 3034 8506 1109 -4430 -3541 274 5868 4427 -4661 -5644 2050 4950
3116D950k454m315m278M419Q515k945r046k38N174M102K9p199m067P428N902m700
$$ 4950 2496 -1819 -6097 -1678 6837 3892 -5154 -5392 -218 3884 3913 -3286 -7353 75 5977 1277
3132A277m668n84K447N760k0p782j448O115K371j001k151m381K045P605j333p265
$$ 1277 -3391 -3975 -1528 4232 4212 -3570 -5018 1097 3468 2467 316 -4065 -2020 5585 4252 -3013
3148c013m0L027K520J433m285n150M685N488l259k965r45J24M340K089o237k201
$$ -3013 -3053 -26 2494 3927 -358 -5508 -823 4665 1406 -1559 -2504 -2380 1960 4049 -2188 -4389
3164d389M232J969m68n13m523L30O654K79n070m67J098J297L333k381n268K766
$$ -4389 -157 1812 1344 831 -3692 -3362 3292 3571 -1499 -1966 -868 429 3762 1381 -3887 -1121
3180a121M446j402j548j069j961L787L359m479l389L102J068R10J18m039j412
$$ -1121 3325 1923 375 -694 -2655 1132 4491 12 -3377 -275 793 1703 1821 -2218 -3630
3195c630N517Q38l910p15P7O99L532o68n627J408M334m88p16r95k822L481L653
$$ -3630 1887 2725 -1185 -1900 -1823 -1124 2408 1740 -3887 -2479 1855 1367 651 -344 -3166 315 3968
3212C968l368k794K173R40N14Q78l515j976N009J250l551l24k27k9L449l26n336
$$ 3968 600 -2194 -21 919 1433 2311 -1204 -3180 1829 3079 -472 -796 -1023 -1052 2397 2071 -3265
3229c265J200L553j326J93m48l126J879M288k599k844J581L73Q42J845l054k545
$$ -3265 -2065 1488 162 355 -93 -3219 -1340 2948 349 -2495 -914 -541 301 2146 -908 -3453
3245c453M209J715k108n75j24j220L578J255m519n15L226o73L65J94l699O37M384
$$ -3453 756 2471 363 -212 -336 -1556 2022 3277 -1242 -1757 1469 796 1161 1355 -2344 -1707 2677
3262B677j680k525Q19n83R31K595k277l607K702K582j342j61j421k094M480J910
$$ 2677 997 -1528 -709 -1292 -361 2234 -43 -3650 -948 1634 292 131 -1290 -3384 1096 3006
3278C006m213r71K152J02J393O08m267j19N098j98k466k30j087J049L836k271
$$ 3006 -1207 -2178 -26 76 1469 2077 -2190 -2309 2789 2591 125 -105 -1192 -143 3693 1422
3294A422m205J427K993n30L25k107k893L787L133l649k331J226L07K608J066n209
$$ 1422 -2783 -1356 1637 1107 1432 -675 -3568 219 3352 -297 -2628 -1402 -1095 1513 2579 -2630
3310b630j258M909J256k156q68j827J345M893j173n213R55K566N29J251k084m219
$$ -2630 -3888 1021 2277 121 -747 -2574 -1229 3664 2491 -2722 -1767 799 1328 2579 495 -3724
3326c724L411M743k475k913o76j95L642L048o056l716M693K660q42j645l480J80
$$ -3724 -313 4430 1955 -958 -1634 -1829 1813 4861 -1195 -4911 -218 2442 1600 -45 -3525 -3345
3342c345O644M18o051j300K345J811K761k301n677K080O080n16k775k530j043
$$ -3345 3299 3717 -2334 -3634 -1289 522 3283 982 -4695 -2615 3465 2949 174 -2356 -3399
3357c399M960M594n234o029L277M720J032k186n404m48P525J832o078k797J520
$$ -3399 1561 6155 921 -5108 -1831 2889 3921 1735 -3669 -4117 3408 5240 -838 -3635 -2115
3372b115K341L664j737o941J08O836J409k367l841k966M867P157l989p648P53
$$ -2115 226 3890 2153 -4788 -4680 2156 3565 1198 -2643 -5609 -742 6415 2426 -5222 -4469
3387d469N466L929j367p434k674Q410N051n505m969L91L080N328q36p879j546
$$ -4469 997 4926 3559 -3875 -6549 1861 6912 1407 -3562 -3171 -91 5237 4401 -3478 -5024
3402e024N494L589j94m526n883L642R893j904r239k374M630O878Q60r056n584
$$ -5024 470 4059 3865 -661 -6544 -2902 6991 5087 -4152 -6526 -1896 4982 5842 -3214 -8798
3417h798P918P494l417o501k038K704P395J247q189l791M790M816J934m000q256
$$ -8798 -880 6614 3197 -3304 -5342 -2638 4757 6004 -2185 -5976 -1186 3630 5564 1564 -6692
3432f692J550J1218K556r628o096K986Q814M301r492r507O682J0064j078p452
$$ -6692 -5142 6076 8632 -996 -7092 -4106 4708 9009 -483 -9990 -3308 6756 5678 -1774
3446a774m825K283Q349K812q287n450L516N480L679k500r650j610J1092N871p082
$$ -1774 -6599 -4316 4033 6845 -1442 -6892 -3376 2104 5783 3283 -6367 -7977 3115 8986 1904
3461A904q848n69R916Q672p645j3519L481J2818K228o905p956p5J0398M890p646
$$ 1904 -6944 -7513 2403 11075 3430 -10089 -6608 6210 8438 1533 -6423 -6498 3900 8790 1144
3476A144p474J504N485N337m84r979n146R198Q717l101j0314n316Q492J2715l780
$$ 1144 -6330 -4826 659 5996 5512 -4467 -9613 -415 8302 5201 -5113 -10429 -1937 10778 6998
3491F998j6081j542J3047P643n791j0728l003J1054Q103o304q426j25M378O557
$$ 6998 -9083 -10625 2422 10065 4274 -6454 -9457 1597 9700 3396 -5030 -5155 -777 5780
3505E780J874r533p328O353J0445P98r295r735M749J5687J427j6526p413J1044
$$ 5780 7654 -1879 -9207 -2854 7591 8389 -906 -10641 -5892 9795 11222 -5304 -12717 -1673
3519a673J1498j703j2929p007J0040J1692m571j0281k140M512P133L184q126q651
$$ -1673 9825 8122 -4807 -11814 -1774 9918 5347 -4934 -7074 -2562 4571 7755 -371 -9022
3533i022M340R649M017o527j1633k16J6209P263j4272j2187O408J4058M036j2836
$$ -9022 -4682 4967 8984 2457 -9176 -9392 6817 14080 -192 -12379 -5971 8087 12123 -713
3547g13j2085P385J4882q02j1575m919L498P583M866o982q646J192Q123N981k607
$$ -713 -12798 -5413 9469 8667 -2908 -7827 -4329 3254 8120 1138 -7508 -6316 1807 7788 5181
3562E181j2044n043J3537J1977r056j5153l0J3997J0220q996j6305K017J6905
$$ 5181 -6863 -11906 1631 13608 4552 -10601 -10631 3366 13586 4590 -11715 -9698 7207
3575G207L826j0252q226J576Q692O579n714r657k42O317O540O58j0436q927R603
$$ 7207 11033 781 -7445 -5869 2823 9402 3688 -5969 -6211 106 6646 7304 -3132 -12059 -2456
3590b456J3686l320j4717n708J0513J4077l700j7930l654J5692R033p727j0937
$$ -2456 11230 7910 -6807 -12515 -2002 12075 8375 -9555 -13209 2483 11516 3789 -7148
3603g148j389R227Q795m484j0681j061N819O217K393p779j0174N454J3517J603
$$ -7148 -8537 690 9485 5001 -5680 -6741 -922 5295 7688 -91 -10265 -4811 8706 10309
3617A0309j1787j0067N225J6234K603j7150r605J2347J2768l570j1657o561P985
$$ 10309 -1478 -11545 -6320 9914 12517 -4633 -14238 -1891 10877 7307 -4350 -10911 -2926
3630b926J1234j820j0751l069M722O227L378n142j0071J335J1638M963p265j1147
$$ -2926 8308 6488 -4263 -7332 -2610 3617 6995 1853 -8218 -6883 4755 9718 2453 -8694
3644h694p39J4702Q551j2676j3305O030J3932K691j0052j0584M318J3236J685
$$ -8694 -9433 5269 13820 1144 -12161 -6131 7801 10492 440 -10144 -5826 7410 9095
3657I095j0778n644L556N807M829l609j0212q71R220O543l699r939m959J0897
$$ 9095 -1683 -7327 -3771 2036 6865 3256 -6956 -7827 1393 7936 4237 -5702 -10661 236
3671B36J1588p082j4506N17J2449P389o833j2503K08J3578N121r312o841J230
$$ 236 11824 4742 -9764 -9247 3202 10591 3758 -8745 -8537 5041 10162 850 -5991 -4761
3685d761O148O110l048q986k024P237N400o93p510p241O743J2098k623j2812l802
$$ -4761 1387 7497 4449 -4537 -6561 676 6076 5383 -2127 -9368 -2625 9473 6850 -5962 -9764
3700i764Q663R632k036j2725m431J1460Q171n994q049j130N308O860q21q603k550
$$ -9764 -1101 8531 6495 -6230 -10661 799 8970 2976 -5073 -6203 -895 5965 5144 -3459 -6009
3715f009N176N047J449n454p323K563J1081J467r430o195M222R564K280j0017
$$ -6009 -833 4214 5663 209 -7114 -4551 6530 7997 -1433 -7628 -3406 6158 8438 -1579
3729a579q200P626R872k613p843l845L438P759J416q301m092L895M639K304k651
$$ -1579 -9779 -2153 7719 5106 -2737 -6582 -3144 4615 6031 -2270 -6362 -2467 2172 4476 1825
3744A825p875K49R209L602o311o432L91Q301N827p180r444L564R449J363o015
$$ 1825 -6050 -5801 3408 7010 699 -5733 -5342 2959 8786 1606 -7838 -4274 5175 6538 523
3759E23n551Q64P949L130o951n211K771M006K903k119o835q79O805L981l872n431
$$ 523 -5028 -4164 3785 6915 -36 -5247 -2476 1530 4433 2314 -4521 -5400 1405 5386 1514 -3917
3775c917j918N301P161l776r118N30Q038L066l243n854j768P352M673n344n212
$$ -3917 -5835 -534 6627 2851 -6267 -5737 2301 5367 2124 -3730 -5498 1854 6527 1183 -4029
3790d029J497L495L104o15o012j965N445L470k279l803k363K163O584p18p392
$$ -4029 -2532 963 4067 3452 -2560 -4525 920 4390 2111 -1692 -4055 -1892 4692 3974 -3418
3805c418j216M769L153l67n132l083M271O071l332n114O1K628L179J118n110k882
$$ -3418 -4634 135 3288 2921 -2211 -5294 -1023 5048 1716 -3398 -3337 -709 2470 3588 -1522 -4404
3821d404M287L604j551k245k779P90N570J236n713k287L068K601J466l446m339
$$ -4404 -117 3487 1936 -309 -3088 -2298 3272 4508 -1205 -3492 -424 2177 3643 197 -4142
3836d142K705N276j040m338j030Q91L073K023m096l688L124L230l07j391l014
$$ -4142 -1437 3839 2799 -1539 -2569 -1678 1395 3418 -678 -4366 -1242 1988 1681 290 -2724
3851b724m95M957K114m655k326K366J761J844j311m997J216N286k04k780j824
$$ -2724 -3219 1738 3852 -803 -3129 -763 998 2842 1531 -3466 -2250 3036 2832 52 -1772
3866a772J57K525L061l071m171K174K790M7o16k636j550M214K127l741j885O73
$$ -1772 -1615 910 3971 900 -3271 -1097 1693 1740 1124 -1512 -3062 1152 3279 -462 -2347 -1674
3882a674J972J414k09m412J49M136N55k158p26j138J834L283k296l574J759K309
$$ -1674 298 1712 1503 -2909 -2760 1376 1931 -227 -953 -2091 -257 3026 730 -2844 -1085 1224
3898A224K41K83k474j485K740K866k687k016O83N87J901L07l686n15K957O50j772
$$ 1224 1465 1748 -726 -2211 529 3395 708 -1308 -625 -38 1863 2170 -1516 -2031 926 1576 -196
3915a96n1j713L42L697n68l100J07J644K85J188j918k485K173L184k020j186J42
$$ -196 -247 -1960 -1618 2079 1511 -1589 -1482 162 447 1635 -283 -2768 -595 2589 569 -617 -475
3932d75n21K592P57k797j221K321Q10l62n00j486o21L431K09l376j75J270K93
$$ -475 -996 1596 2353 -444 -1665 656 1466 1104 604 -882 -1503 1928 2137 -1239 -1414 -144 149
3949A49J635j383l174J465K958j055j405j61r33K235J996k915j851K389O76M17
$$ 149 1784 401 -2773 -1308 1650 595 -810 -971 -1904 331 2327 -588 -2439 -50 626 1043
3965A043L4k324q62L653Q53k849l19O54M27K019r86l253Q47K667m67r80l43j327
$$ 1043 1077 -1247 -2109 1544 2397 -452 -771 -117 310 2329 1343 -1910 -1063 1604 1137 157 -186 -1513
3983a513J065K766k053k287J371P91J81O72k444j243K958J536j932n81n12P7K560
$$ -1513 -448 2318 265 -2022 -651 140 321 993 -1451 -2694 264 1800 -132 -713 -1225 -1148 1412
4000A412K69l209j15K911P6j59j061j918J214L228j230k545K65O25J393J349k831
$$ 1412 1681 -1528 -1643 1268 1344 1185 124 -1794 -580 2648 1418 -1127 -862 -237 1156 2505 -326
4017c26k713K603K512j199j679j232J19L245J386m182r09K208R78L41n39l212
$$ -326 -3039 -436 2076 877 -802 -2034 -1915 1330 2716 -1466 -2375 -167 811 1152 613 -2599
4033b599M95M096m6k812m90R1J594K910k439l661J601L623q91r06k260p72L982
$$ -2599 -2104 1992 1946 -866 -1356 -1265 329 3239 800 -2861 -1260 2363 1472 566 -1694 -2466 1516
4050A516K265l951k138J404J199J396J27m217o29M087J083k203k140k72J383M327
$$ 1516 3781 -170 -2308 -904 295 1691 1818 -2399 -3028 1059 2142 -61 -2201 -2473 -1090 3237
4066C237j503n042L76M084J366j274k757k044M031L217k683l120J032J172K496
$$ 3237 1734 -3308 -2932 1152 2518 1244 -1513 -3557 474 3691 1008 -2112 -1080 92 2588
$$ [...]
8191C3
##END NTUPLES=NMR FID
##END=
