##TITLE=1H_Pr GluA
 D2O, 8 sc, 
 22.9.2020
##JCAMPDX= 6.0         $$ Bruker NMR JCAMP-DX V2.0
##DATA TYPE= NMR FID
##DATA CLASS= NTUPLES
##ORIGIN= UXNMR, Bruker Analytische Messtechnik GmbH
##OWNER= root
$$ XWIN-NMR		Version 3.5
$$ Tue Sep 22 10:54:25 2020 Russian Standard Time (UT+4h)  she@DPX200
##.OBSERVE FREQUENCY= 200.1315066352
##.OBSERVE NUCLEUS= ^1H
##.DELAY= (6, 6)
##.ACQUISITION MODE= SIMULTANEOUS
##.ACQUISITION SCHEME= undefined
##.AVERAGES= 8
##.DIGITISER RES= 18
##SPECTROMETER/DATA SYSTEM= spect
##.PULSE SEQUENCE= zg30
##.SOLVENT NAME= D2O
##.SHIFT REFERENCE= (INTERNAL, D2O, 0, 15.7039)
##AUDIT TRAIL= $$ (NUMBER, WHEN, WHO, WHERE, WHAT)
$$ ##TITLE= Audit trail, XWIN-NMR		Version 3.5
$$ ##JCAMPDX= 5.01
$$ ##ORIGIN= Bruker BioSpin GmbH
$$ ##OWNER= she
$$ F:/spectra/data/she/nmr/H-F/1/audita.txt
$$ ##AUDIT TRAIL=  $$ (NUMBER, WHEN, WHO, WHERE, WHAT)
(   1,<2020-09-22 10:53:25.46 +0400>,<she>,<DPX200>,
      <created by zg, POWCHK disabled, PULCHK disabled
       configuration hash MD5:
       00 E9 B6 7A A2 85 ED C7 34 08 36 98 17 FE 4E 26
       data hash MD5: 16K
       C9 6D 1D 47 FE 99 CF 4B A7 9A D0 8A 52 E8 CE 36>)
$$ ##END=
$$ 
$$ hash MD5
$$ 36 C4 E5 BC 05 F3 E7 78 A6 DF D4 1C 0C 0E 52 D6
##$RELAX= 
##$RELAX= 
##$RELAX= 
##$RELAX= 
##$RELAX= 
##$RELAX= 
$$ Bruker specific parameters
$$ --------------------------
##$DU= <F:/spectra>
##$EXPNO= 1
##$NAME= <H-F>
##$PROCNO= 1
##$TYPE= <nmr>
##$USER= <she>
##$AMP= (0..31)
100 100 100 100 100 100 100 100 100 100 100 100 100 100 100 100 100 100 
100 100 100 100 100 100 100 100 100 100 100 100 100 100 
##$AQSEQ= 0
##$AQ_mod= 1
##$AUNM= <au_zg>
##$AUTOPOS= <>
##$BF1= 200.13
##$BF2= 200.13
##$BF3= 200.13
##$BF4= 200.13
##$BF5= 200.13
##$BF6= 200.13
##$BF7= 200.13
##$BF8= 200.13
##$BYTORDA= 1
##$CFDGTYP= 0
##$CFRGTYP= 5
##$CHEMSTR= <none>
##$CNST= (0..31)
1 1 145 1 1 1 1 1 1 1 1 1 1 1 1 1 1 1 1 1 1 1 1 1 1 1 1 1 1 1 1 1 
##$CPDPRG= <>
##$CPDPRG1= <>
##$CPDPRG2= <>
##$CPDPRG3= <>
##$CPDPRG4= <mlev>
##$CPDPRG5= <mlev>
##$CPDPRG6= <mlev>
##$CPDPRG7= <mlev>
##$CPDPRG8= <mlev>
##$CPDPRGB= <>
##$CPDPRGT= <>
##$D= (0..31)
0 1.2 0 0 0 0 0 0 0 0.06 0 0.03 0 0 0 0 0.0002 0 0 0 0 0 0 0 0 0 0 0 0 
0 0 0 
##$DATE= 1600757604
##$DBL= (0..7)
120 120 120 120 120 120 120 120 
##$DBP= (0..7)
150 150 150 150 150 150 150 150 
##$DBP07= 0
##$DBPNAM0= <>
##$DBPNAM1= <>
##$DBPNAM2= <>
##$DBPNAM3= <>
##$DBPNAM4= <>
##$DBPNAM5= <>
##$DBPNAM6= <>
##$DBPNAM7= <>
##$DBPOAL= (0..7)
0.5 0.5 0.5 0.5 0.5 0.5 0.5 0.5 
##$DBPOFFS= (0..7)
0 0 0 0 0 0 0 0 
##$DE= 6
##$DECBNUC= <off>
##$DECIM= 32
##$DECNUC= <off>
##$DECSTAT= 4
##$DIGMOD= 1
##$DIGTYP= 9
##$DL= (0..7)
0 120 120 120 120 120 120 120 
##$DP= (0..7)
150 150 150 150 150 150 150 150 
##$DP07= 0
##$DPNAME0= <>
##$DPNAME1= <>
##$DPNAME2= <>
##$DPNAME3= <>
##$DPNAME4= <>
##$DPNAME5= <>
##$DPNAME6= <>
##$DPNAME7= <>
##$DPOAL= (0..7)
0.5 0.5 0.5 0.5 0.5 0.5 0.5 0.5 
##$DPOFFS= (0..7)
0 0 0 0 0 0 0 0 
##$DQDMODE= 0
##$DR= 18
##$DS= 0
##$DSLIST= <SSSSSSSSSSSSSSS>
$$ [...]
##$SUBNAM2= <"">
##$SUBNAM3= <"">
##$SUBNAM4= <"">
##$SUBNAM5= <"">
##$SUBNAM6= <"">
##$SUBNAM7= <"">
##$SUBNAM8= <"">
##$SUBNAM9= <"">
##$SW= 16.880792210976
##$SWIBOX= (0..15)
0 0 2 0 0 0 0 0 0 0 0 0 0 0 0 0 
##$SW_h= 3378.37837837838
##$TD= 16384
##$TD0= 1
##$TE= 0
##$TE2= 300
##$TE3= 300
##$TEG= 300
##$TL= (0..7)
0 120 120 120 120 120 120 120 
##$TP= (0..7)
150 150 150 150 150 150 150 150 
##$TP07= 0
##$TPNAME0= <>
##$TPNAME1= <>
##$TPNAME2= <>
##$TPNAME3= <>
##$TPNAME4= <>
##$TPNAME5= <>
##$TPNAME6= <>
##$TPNAME7= <>
##$TPOAL= (0..7)
0.5 0.5 0.5 0.5 0.5 0.5 0.5 0.5 
##$TPOFFS= (0..7)
0 0 0 0 0 0 0 0 
##$TUNHIN= 0
##$TUNHOUT= 0
##$TUNXOUT= 0
##$USERA1= <user>
##$USERA2= <user>
##$USERA3= <user>
##$USERA4= <user>
##$USERA5= <user>
##$V9= 5
##$VALIST= <valist>
##$VCLIST= <CCCCCCCCCCCCCCC>
##$VD= 0
##$VDLIST= <DDDDDDDDDDDDDDD>
##$VPLIST= <PPPPPPPPPPPPPPP>
##$VTLIST= <TTTTTTTTTTTTTTT>
##$WBST= 1024
##$WBSW= 4
##$XGAIN= (0..3)
0 0 0 0 
##$XL= 0
##$YL= 0
##$YMAX_a= 132076
##$YMIN_a= -130413
##$ZGOPTNS= <>
##$ZL1= 120
##$ZL2= 120
##$ZL3= 120
##$ZL4= 120
##$ABSF1= 10
##$ABSF2= 0
##$ABSG= 5
##$ABSL= 3
##$ALPHA= 0
##$AQORDER= 0
##$ASSFAC= 0
##$ASSFACI= 0
##$ASSFACX= 0
##$ASSWID= 0
##$AUNMP= <proc_1d>
##$AZFE= 0.1
##$AZFW= 0.1
##$BCFW= 1
##$BC_mod= 2
##$BYTORDP= 1
##$COROFFS= 0
##$CY= 11.3945322036743
##$DATMOD= 1
##$DC= 2
##$DFILT= <>
##$DTYPP= 0
##$F1P= 16.9975609425685
##$F2P= -3.02152046262296
##$FCOR= 0.5
##$FTSIZE= 0
##$FT_mod= 4
##$GAMMA= 1
##$GB= 0.15
##$INTBC= 1
##$INTSCL= 1
##$ISEN= 128
##$LB= 0.24
##$LEV0= 0
##$LPBIN= 0
##$MAXI= 10000
##$MC2= 0
##$MEAN= 0
##$ME_mod= 0
##$MI= 1.114404
##$NCOEF= 0
##$NC_proc= 0
##$NLEV= 6
##$NOISF1= 3.799351
##$NOISF2= 2.8
##$NSP= 1
##$NTH_PI= 0
##$NZP= 0
##$OFFSET= 15.70392
##$PC= 1
##$PHC0= -10051.4
##$PHC1= 13.0009
##$PH_mod= 1
##$PKNL= yes
##$PPARMOD= 0
##$PSCAL= 0
##$PSIGN= 0
##$REVERSE= no
##$SF= 200.130013532006
##$SI= 16384
##$SIGF1= 3
##$SIGF2= 2
##$SINO= 400
##$SIOLD= 16384
##$SREGLST= <1H.CDCl3>
##$SSB= 0
##$STSI= 0
##$STSR= 0
##$SW_p= 3612.71676300578
##$SYMM= 0
##$S_DEV= 0
##$TDeff= 0
##$TDoff= 0
##$TI= <>
##$TILT= no
##$TM1= 0
##$TM2= 0
##$TOPLEV= 0
##$USERP1= <user>
##$USERP2= <user>
##$USERP3= <user>
##$USERP4= <user>
##$USERP5= <user>
##$WDW= 1
##$XDIM= 8192
##$YMAX_p= 0
##$YMIN_p= 0
$$ End of Bruker specific parameters
$$ ---------------------------------
##NTUPLES= NMR FID
##VAR_NAME=  TIME,          FID/REAL,        FID/IMAG
##SYMBOL=    X,             R,               I
##VAR_TYPE=  INDEPENDENT,   DEPENDENT,       DEPENDENT
##VAR_FORM=  AFFN,          ASDF,            ASDF
##VAR_DIM=   8192,          8192,            8192
##UNITS=     SECONDS,       ARBITRARY UNITS, ARBITRARY UNITS
##FACTOR=    0.000296,      1,               1
##FIRST=     0,             0,               0
##LAST=      2.424536,      0,               0
##MIN=       0,             -130413,         0
##MAX=       2.424536,      132076,          0
$$ Real data points
##PAGE= N=1
##DATA TABLE= (X++(R..R)), XYDATA
$$ [...]
2172H35j392q54N62J445Q29o04j385q17N41J431Q36n99j397q01N39J390Q57n96
$$ 835 -557 -1411 -849 596 1425 821 -564 -1381 -840 591 1427 828 -569 -1370 -831 559 1416 820
2190H20j412p88N48J391Q26n63j405q07N79J367P98n36j400q23O06J372P74n33
$$ 820 -592 -1380 -832 559 1385 822 -583 -1390 -811 556 1354 818 -582 -1405 -799 573 1347 814
2208H14j366q37N76J402P66n65j326q28N56J396P66n70j321q02N29J384P80n73
$$ 814 -552 -1389 -813 589 1355 790 -536 -1364 -808 588 1354 784 -537 -1339 -810 574 1354 781
2226G81j345p60N29J327Q12n52j366p60N57J299Q10n34j375p69N86J289P65m86
$$ 781 -564 -1324 -795 532 1344 792 -574 -1334 -777 522 1332 798 -577 -1346 -760 529 1294 808
2244H08j378p71O02J267P64n08j331p74N71J308P44n14j307p83N41J338P30n52
$$ 808 -570 -1341 -739 528 1292 784 -547 -1321 -750 558 1302 788 -519 -1302 -761 577 1307 755
2262G55j274p38M72J329P87o05j263p08M71J299P97n89j293o91M98J256P94n55
$$ 755 -519 -1257 -785 544 1331 726 -537 -1245 -774 525 1322 733 -560 -1251 -753 503 1297 742
2280G42j309o89N13J243P73n23j301p26N48J252P25n00j249p61N27J293O76n15
$$ 742 -567 -1256 -743 500 1273 750 -551 -1277 -729 523 1248 748 -501 -1262 -735 558 1234 719
2298G19j188p98N33J292O86n36j175p69M80J307O80n48j181p17M68J263P19n37
$$ 719 -469 -1267 -734 558 1244 708 -467 -1236 -756 551 1231 683 -498 -1215 -747 516 1235 698
2316F98j226o80M82J207P37n22j239o77N35J157P15m61j260o90N60J151O79m32
$$ 698 -528 -1208 -726 481 1218 696 -543 -1220 -685 472 1187 726 -534 -1224 -664 487 1166 734
2334G34j233p21N63J167O48m38j191p37N31J184O60m63j167p17M86J203O69n13
$$ 734 -499 -1220 -657 510 1158 720 -471 -1208 -677 507 1167 704 -463 -1180 -694 509 1178 665
2352F65j138o78M41J183P01n25j156o27M30J148P36n23j182o05M47J102P43m79
$$ 665 -473 -1151 -710 473 1174 649 -507 -1134 -704 444 1180 657 -525 -1130 -683 419 1162 683
2370F83j190o33M82J096P00m48j156o78M94J122O50m33j121p10M73J158O19m43
$$ 683 -507 -1140 -658 438 1138 690 -466 -1144 -650 472 1122 689 -432 -1142 -669 489 1108 665
2388F65j089p15M47J176O23m77j048o98M08J162O60m94j064o43L90J133O78m79
$$ 665 -424 -1139 -692 484 1107 630 -418 -1116 -708 454 1114 620 -444 -1087 -697 436 1114 635
2406F35j102o13M15J075O88m34j127o23M63J031O59l92j117o37M71J031O23l72
$$ 635 -467 -1080 -665 410 1098 664 -463 -1086 -623 408 1067 675 -442 -1079 -608 423 1046 674
2424F74j086o76M73J053N94l73j065o77M37J089O09m13j042o53L98J087O24m63
$$ 674 -412 -1088 -615 438 1032 659 -406 -1083 -646 443 1052 639 -403 -1056 -658 429 1053 590
2442E90j005o13L71J055O55m62j025n66L58J027O76m35j058n79L96R95O58l90
$$ 590 -415 -1028 -657 398 1053 591 -434 -1000 -642 385 1061 626 -432 -1011 -615 380 1038 648
2460F48j064n96M07J002O16l68j036o33M17J011N95l77r89o61M15J031N59l84
$$ 648 -416 -1012 -605 397 1013 645 -391 -1024 -607 404 999 622 -367 -1028 -613 418 977 593
2478E93r57o62L83J053N71m05r53o20L65J017O09m12r56o09L69R83O35m06r92
$$ 593 -364 -1026 -643 410 981 576 -377 -997 -632 385 994 582 -374 -983 -614 369 1004 598 -394
2497c94n73L87R45O08l42j013n88M11R21N92l28j004o06M19R23N83l29r66o19
$$ -394 -967 -580 365 973 631 -382 -970 -559 362 954 626 -378 -984 -565 358 941 612 -354 -973
2516i73L86R62N62l56r41o07L62R65N77l76r19n90L44R68N85l87r14n66L18R35
$$ -973 -587 375 937 581 -360 -967 -605 360 937 561 -358 -948 -604 364 949 562 -352 -918 -600 335
2536C35O18l75r38n52L32R21O06l52r37n56L23R12N86l27r42n74L53R10N52l04
$$ 335 953 578 -360 -912 -580 341 947 595 -342 -898 -575 337 923 596 -346 -920 -567 343 895 591
2556E91r20o01L73Q98N35l05q97n95L41R12N47l25q69n81L01R27N60l40q63n71
$$ 591 -329 -930 -557 341 876 571 -326 -921 -580 332 879 554 -315 -896 -595 332 892 552 -311 -882
2576h82L12Q93N74l28q86n41L00Q66N90l29q92n35L11Q49N67k96q92n56L30Q41
$$ -882 -570 323 897 569 -317 -858 -558 308 898 569 -323 -858 -547 302 869 573 -319 -875 -545 296
2596B96N54k79q82n67L35Q48N39k93q42n90L24Q55N40l04q27n72L07Q60N42l09
$$ 296 850 571 -311 -878 -543 305 844 551 -291 -881 -557 298 838 534 -293 -865 -558 302 844 535
2616E35q24n50K87Q59N49l25q12n34K78Q28N58l01q32n37K83Q17N48k78q39n24
$$ 535 -289 -839 -552 307 856 531 -281 -815 -537 291 849 548 -284 -821 -538 279 827 549 -290 -814
2636h14K80Q11N39k79q34n31K98Q09N09k55q16n46K97Q06N14k66p87n45K71Q15
$$ -814 -534 277 816 537 -297 -828 -530 279 788 533 -283 -829 -532 274 788 522 -265 -810 -539 276
2656B76N35k98p73n30K58Q12N22k90p71n13K36P93N53k82p86n16K48P73N50k68
$$ 276 811 513 -260 -790 -532 280 802 512 -259 -772 -536 257 810 528 -258 -774 -526 247 797 529
2676E29q00n05K56P74N06k43p84n23K79P58N07k39p76n28K70P75M86k35p39n41
$$ 529 -271 -776 -520 254 760 517 -267 -790 -511 247 754 515 -261 -789 -519 256 742 507 -232 -773
2696g73K56P73M86k40p26n24K42P62M99k54p31n08K27P54N08k44p48m87K39P17
$$ -773 -517 256 742 502 -224 -748 -506 256 755 501 -230 -738 -511 243 751 507 -241 -728 -489 228
2716B28N16k33p63m84K47O92N12k00p64m97K55P12M87k00p54m94K57P06M90k10
$$ 228 744 511 -252 -736 -489 203 715 515 -249 -746 -491 221 708 508 -246 -740 -483 223 713 503
2736E03p22n05K31P17M85k16p09m92K15P23M88k30p10m68J88P14N19k53p00m59
$$ 503 -219 -724 -493 224 709 493 -216 -708 -493 230 718 488 -222 -690 -502 212 731 478 -222 -681
2756f81J97O89N06k29p13m53K01O77N08k28p00m76K25O66M97k01o93m84K11O87
$$ -681 -484 205 711 482 -231 -684 -483 194 702 474 -226 -702 -477 189 686 485 -208 -692 -481 206
2776B06M58j81o73m99K01P01M60k05o41n01J90P07M60k17o46m81J64P08M68k11
$$ 206 664 483 -190 -689 -488 213 673 468 -173 -674 -484 223 683 466 -180 -661 -497 211 679 468
2796D68o65m71J88O69M85j99o68m69J80O47M90j69o81m80K05O38M75j53o90m79
$$ 468 -197 -668 -480 189 674 475 -193 -662 -482 165 655 486 -195 -675 -470 168 643 490 -200 -679
2816f79K22O34M60j40o67m96K07O45M45j43o48m88J74O62M67j77o28m85J54O59
$$ -679 -457 177 637 497 -170 -666 -459 186 631 488 -160 -648 -474 188 655 478 -150 -635 -481 178
2836A78M70k03o14m56J33O50M84j86o39m37J41O17M98j75o41m40J48O08M94j57
$$ 178 648 445 -169 -625 -492 158 642 456 -183 -620 -479 138 636 461 -180 -620 -472 136 630 473
2856D73o46m45J55O00M79j31o28m90J81O09M57j33o01n05J52O49M36j45n90m83
$$ 473 -173 -618 -463 137 616 485 -143 -633 -452 157 614 481 -120 -625 -473 176 612 467 -123 -606
2876f06J35O25M53j54n84m80J31O25M63j52o03m60J40N78M77j16o30m37J40N73
$$ -606 -471 154 607 453 -131 -611 -480 145 608 456 -147 -607 -467 111 588 472 -158 -595 -455 118
2896A18M83j28o14m58J63N48M67r0o14m69J61N59M66j03o03m63J34N66M58j18
$$ 118 601 473 -141 -599 -436 112 579 489 -125 -594 -433 126 592 489 -114 -577 -443 123 581 463
2916D63n73m66J12N84M64j36n58m52P2N93M66j31n52m52R1N59N02j32n71m33Q1
$$ 463 -110 -576 -464 120 584 448 -110 -562 -490 103 569 438 -114 -566 -475 84 586 454 -117 -550 -469
2937d69N57M76r2n84m43Q5N68M68j00n54m66R3N61M47p7n54m77J06N70M26q7n28
$$ -469 88 564 472 -112 -555 -470 98 566 466 -88 -554 -461 100 547 470 -84 -561 -455 115 541 454 -74
2959g4m90J01N62M35q9n24m76P9N71M45j03n15m58O2N50M66q9n32m52P6N21M78
$$ -74 -564 -463 99 534 445 -79 -555 -476 95 540 437 -78 -536 -474 76 542 453 -79 -531 -455 66 544
2981E44p3n49m59Q7N11M68m4n52m67R6N09M52l9n42m70P9N04M59m5n37m61O8N20
$$ 544 471 -78 -537 -450 61 529 485 -67 -534 -438 71 523 484 -58 -528 -449 55 514 469 -68 -529 -461 59
3004E9M46m5n16m73O1N28M45o9m90m66M0N30M68o6n13m36K9N17M72n9n17m50N1
$$ 59 505 460 -56 -529 -468 60 505 436 -54 -520 -480 50 518 452 -61 -497 -468 49 521 462 -55 -505 -454
3027d54N02M65n4n08m45L8N10M54m4n02m62M8M86M53j4n17m59M6N08M25j8m98
$$ -454 48 513 459 -49 -494 -456 54 508 464 -38 -500 -452 34 487 473 -44 -503 -457 51 476 458 -40
3049d0m67M3M97M61m5m79m58K0N05M55l0m87m66K2M90M77l6m91m51L4M70M81l2
$$ -40 -507 -464 33 494 449 -30 -488 -468 37 492 462 -25 -491 -469 21 498 462 -29 -480 -446 24 505 473
3072D73m91m50K6M65M51Mm96m64K6M66M47J6m90m72K5M73M48nm59m68J7M64M59
$$ 473 -18 -468 -442 23 474 478 -18 -482 -456 10 457 473 -17 -489 -464 9 457 452 -7 -475 -458 6 465
3095D65j1m52m72nM87M70qm86m57mM75M74j3m54m62j0M61M74Qm81m60MM55M72
$$ 465 454 2 -470 -475 12 482 474 -12 -469 -473 2 476 463 9 -453 -463 -2 472 480 -1 -461 -457 -2 470
3119D70lm69m56j1M60M63Pm60m61j4M50M55L3m67m71LM45M62J7m44m61l1M76M51
$$ 470 467 -2 -458 -469 -9 454 461 1 -460 -474 -24 431 464 -3 -474 -471 -26 436 453 9 -452 -483 -7 444
3143D44J8m35m65l2M49M67K7m43m49l9M33M61K6m48m47l7M40M63L2m31m70k7M30
$$ 444 462 27 -438 -470 -21 446 473 30 -419 -458 -25 436 462 14 -433 -470 -30 433 465 34 -436 -463 -33
3166c3M55L5m25m85j8M40M47M3m29m88k0M37M56N5m23m84l8M35M61M8m24m73m3
$$ -33 422 457 32 -453 -471 -31 416 459 30 -458 -478 -41 415 470 47 -437 -475 -40 421 469 45 -428 -471
3189d71M33M71L7m18m65m9M18M74N1m33m74m2M10M76N8m32m58n8M03M87P2m44
$$ -471 -38 433 470 52 -413 -462 -44 430 481 48 -426 -468 -58 418 476 44 -414 -472 -69 418 490 46
3211D6m66o3M14M60Q0m18m72o5M01M82P3m08m77o2M18M72N1l90m78p2M04M76O6
$$ 46 -420 -483 -69 391 471 53 -419 -484 -83 399 472 64 -413 -475 -57 415 466 76 -402 -474 -70 406 472
3234D72l91m74q4M02M76P1m10m41r9L95M78P5l97m62q9L96M63Q6l93m75p5L76
$$ 472 81 -393 -477 -75 401 472 62 -379 -478 -83 395 470 73 -389 -478 -82 381 467 74 -401 -476 -100
3256a00M66J05l90m71q2L83M64R8l73m95p6L94M66Q6l79m69r0L92M56Q1l68m65
$$ -100 366 471 81 -390 -472 -89 375 473 100 -395 -471 -77 389 475 96 -373 -463 -71 385 466 98 -367
3278c67j03L77M75Q9l70m74j02L79M73R5l79m67j03L70M80R4l84m49j07L62M69
$$ -367 -470 -93 382 471 101 -373 -475 -96 377 472 93 -374 -477 -107 373 467 83 -366 -473 -111 358
3299C58J04l63m75q9L60M73J08l68m67j08L62M77J02l52m74j16L72M68J09l59
$$ 358 462 99 -376 -465 -105 368 476 108 -359 -467 -105 372 474 122 -352 -468 -96 372 481 122
3319A22m76j29L73M82J04l67m43j39L51M89J05l59m65j38L64M68J23l47m77j17
$$ 122 -354 -483 -110 372 476 109 -334 -473 -122 367 472 113 -352 -490 -126 342 465 118 -359 -476
3339d76L58M54J36l62m63j20L53M50J53l59m70j21L51M55J30l23m90j20L48M53
$$ -476 -118 336 472 110 -353 -473 -120 330 483 124 -346 -467 -116 339 469 146 -344 -464 -116 337
3359C37J48l43m82j34L47M66J31l30m76j41L31M81J45l46m59j50L18M84J59l49
$$ 337 485 142 -340 -474 -127 339 470 140 -336 -477 -146 335 480 134 -325 -475 -157 327 486 137
3379A37m75j20L00M86J47l34m63j45L18M79J55l28m79j30K97M90J49l25m74j55
$$ 137 -338 -458 -158 328 475 141 -322 -467 -149 330 485 157 -322 -452 -155 335 484 159 -315 -470
3399d70L18M83J60l28m67j70L16M80J47l12m59j83L16M83J41l00m54j95L22M83
$$ -470 -152 331 491 163 -304 -474 -158 322 469 157 -302 -485 -169 314 455 155 -299 -494 -172 311
3419C11J51l07m62j80L25M68J69l08m60j90L10M75J66k96m80j58L04M69J79l09
$$ 311 462 155 -307 -487 -162 306 475 167 -293 -483 -173 302 468 172 -308 -466 -162 307 486 177
3439A77m69j69K99M57J80k94m95j58L06M65J64k85m82j80L01M70J78k82m79j91
$$ 177 -292 -461 -162 295 475 181 -314 -472 -166 299 463 178 -304 -484 -183 287 465 183 -296 -487
3459d87K95M77J92k95m74j81K85M71J93k94m67j86K82M85J96k98m67k00K81M69
$$ -487 -192 285 477 182 -292 -473 -188 283 476 182 -285 -471 -189 296 492 194 -273 -473 -192 277
3479B77K18k97m76j99K87M61K02k74m76j93K69M60K08k69m74k06K73M71K00k61
$$ 277 495 198 -278 -477 -190 271 473 199 -277 -470 -201 259 467 198 -276 -482 -209 262 462 201
3499B01m70k15K69M70K19k66m79k11K68M79K14k63m70k23K68M75K13k69m76j96
$$ 201 -269 -484 -215 255 474 208 -271 -482 -214 265 479 216 -254 -477 -209 266 479 210 -266 -462
3519d62K49M66K27k66m63k16K45M76K13k55m73k26K67M54K26k47m76k30K58M66
$$ -462 -213 253 480 214 -249 -465 -220 256 469 214 -259 -485 -218 236 462 215 -261 -491 -233 233
3539B33K30k53m73k30K63M70K24k48m60k42K42M80K35k36m83k33K56M66K40k46
$$ 233 463 210 -263 -493 -230 240 464 216 -244 -486 -244 236 471 235 -248 -481 -225 241 481 235
3559B35m66k40K32M73K42k52m65k27K12M82K44k39m65k36K26M70K41k36m70k40
$$ 235 -231 -471 -239 234 476 224 -241 -468 -256 226 470 231 -234 -470 -244 226 467 231 -239 -479
3579d79K33M65K54k35m63k56K30M70K58k27m78k44K26M83K35k27m66k51K31M71
$$ -479 -246 219 473 238 -225 -481 -251 219 477 250 -228 -472 -246 237 472 245 -221 -472 -241 230
3599B30K47k09m89k59K31M79K43k30m55k63K16M79K54k33m62k58K08M67K75k15
$$ 230 477 268 -221 -480 -249 230 473 243 -212 -475 -259 220 474 241 -221 -479 -271 196 471 256
3619B56m79k51K08M67K63k01m74k70K19M67K62k12m64k66K12M66K69k07m68k73
$$ 256 -223 -474 -266 201 464 263 -211 -481 -262 205 467 255 -209 -475 -263 203 472 265 -203 -476
3639d76K18M58K68k01m66k70J88M80K72k12m68k62J89M60K89j98m76k70J91M62
$$ -476 -258 200 468 267 -199 -469 -281 199 471 259 -209 -471 -282 178 467 269 -207 -477 -286 176
3659A76K94j95m92k47J84M61K75j72m72k86J86M80K81j81m75k72J88M52K81j81
$$ 176 470 275 -217 -464 -280 181 456 284 -188 -474 -288 192 473 292 -183 -455 -267 185 466 285
3679B85m64k91J94M63K78j73m61k96J76M66K83j72m59k92J69M69K91j86m64k98
$$ 285 -179 -470 -276 187 465 292 -169 -465 -289 177 460 288 -171 -463 -294 175 466 280 -184 -482
3699d82J84M72K77j63m74k85J78M56L02j70m69k92J79M58K89j64m66k99J71M68
$$ -482 -298 174 451 288 -186 -471 -293 163 465 295 -174 -466 -287 171 460 296 -170 -469 -298 170
3719A70K93j70m56l05J81M46L10j68m59l01J61M69K92j72m56k99J61M47L18j72
$$ 170 463 293 -163 -468 -287 159 469 301 -158 -459 -298 171 463 291 -165 -464 -303 144 462 290
3739B90m59l03J62M58L08j64m67k85J55M53L10j59m69k77J45M43L23j49m57l17
$$ 290 -169 -472 -310 148 456 292 -175 -460 -305 148 458 299 -170 -447 -302 141 464 315 -142 -459
3759d59J57M51L10j39m73l03J47M49L12j40m59l17J45M53L12j34m55l21J39M51
$$ -459 -302 149 459 320 -153 -456 -309 140 452 312 -147 -464 -319 134 446 312 -143 -464 -325 126
3779A26L17j47m33l26J32M69L12j43m43l18J35M63L11j43m48l21J46M41L29j37
$$ 126 443 296 -137 -463 -331 138 450 307 -136 -454 -319 144 455 312 -136 -457 -311 130 459 322
3799C22m45l32J42M36L21j20m44l40J40M48L20j24m50l29J33M45L12j20m53l28
$$ 322 -123 -455 -313 123 444 324 -120 -460 -320 128 448 324 -126 -455 -322 123 435 315 -138 -466
3819d66J38M37L25j13m56l29J38M47L18j29m34l29J19M59L30j21m67l10J22M30
$$ -466 -328 109 434 321 -135 -464 -326 121 439 310 -124 -453 -334 125 455 334 -133 -443 -321 109
3839A09L45j09m65l16J07M27L56j18m51l27R6M37L39q5m58l28J04M20L49r6m52
$$ 109 454 345 -120 -436 -329 98 454 336 -115 -442 -346 91 430 345 -113 -441 -337 83 432 336 -116
3860a16l33R5M44L40j02m30l46R1M58L31j00m24l48R3M47L43q5m46l47Q5M51L34
$$ -116 -449 -354 90 430 328 -102 -448 -357 101 432 332 -92 -440 -347 100 443 358 -88 -435 -350 101 435
3882D35r8m18l56Q4M30L62j04m26l45Q9M36L39q2m32l62R7M35L36r2m21l60Q9
$$ 435 337 -81 -437 -353 77 439 335 -91 -436 -347 89 428 346 -86 -448 -351 84 420 328 -93 -453 -364
3904c64M51L31p4m16l66P9M31L54q9m08l63P3M35L50o4m37l39O6M22L69q6m23
$$ -364 87 418 344 -72 -438 -359 72 426 337 -71 -434 -361 74 424 360 -77 -416 -350 72 441 355 -68
3926f8l65Q4M08L66o7m38l50Q1M14L52m8m42l65R1M14L38n4m19l63O6M33L54p1
$$ -68 -433 -349 59 425 358 -80 -430 -349 65 417 369 -73 -438 -347 67 405 351 -68 -431 -365 68 422 351
3949C51m12l66O1M30L59o4m14l66N9M23L64o7m07l62N0M25L68p1m19l51M8M00
$$ 351 -61 -427 -366 64 423 359 -55 -421 -362 61 425 358 -49 -411 -361 64 432 361 -58 -409 -361 39
3971C9L85o3m13l56M1M11L74n3m39l47N1M12L61m2m19l59N3M13L58l5m16l69M9
$$ 39 424 361 -52 -408 -367 44 418 365 -74 -421 -370 42 403 361 -58 -417 -364 49 407 372 -44 -413 -364
3994c64M06L64m4m10l62M4M10L72m1m14l66L7M12L74m2m07l69L4M02L71l6m06
$$ -364 42 406 362 -48 -410 -366 44 416 375 -39 -405 -368 44 418 376 -31 -400 -366 36 407 371 -35
4016c5l74K9M05L82l2m02l83M0L91L85l5m13l73L8L95L69om06l84K6L97L88k7
$$ -35 -409 -380 25 407 375 -27 -410 -370 21 406 371 -42 -415 -377 18 387 381 -25 -409 -383 14 402 375
4039C75l99l71K3M03L66ql99m01K2M08L72k5l84l78J3L96L84j7m05l76K1L86L87
$$ 375 -24 -395 -372 31 397 389 -10 -411 -389 19 391 366 -18 -396 -383 13 397 380 -25 -401 -380 6 393
4062C93j6m02l81J4M02L82k1l83l95K6L90L85nl90m01J8L94L77%l84m00K7L80
$$ 393 377 -25 -406 -392 10 392 371 -12 -407 -381 9 394 389 -1 -402 -384 10 387 387 3 -397 -370 10
4085A0L80Mm01l91QL92L76Rl95l86ML90L89pm07l74ML91L93qm00l67mL81L97N
$$ 10 390 394 -7 -398 -390 2 378 387 -8 -394 -390 0 389 382 -25 -399 -395 -4 389 381 -19 -386 -390 -9 388 393
4111C93m09l77nL87L98Jl77l94lL83L89J5m03l85qL81L96Ll81l91j4L87L92J0
$$ 393 -16 -393 -398 -11 387 388 11 -383 -386 -3 386 401 -2 -387 -395 -14 382 385 4 -387 -401 -14 378 388
4135C88l74m01qL84L88%l69l90k9L86M00Ql76l87j7L80L84K2l82l82j1L55M10
$$ 388 14 -387 -395 -11 377 377 8 -382 -411 -25 375 383 7 -380 -397 -17 367 389 7 -375 -386 -31 379
4158C79J1l68m00j2L71L82K7l75l81k7L75L84L0l73l89l5L83L78L0l73m03k5L92
$$ 379 390 22 -378 -390 -19 363 390 15 -366 -393 -18 366 396 23 -366 -401 -18 360 390 17 -386 -411 -19
4181a9L79J9l56l88l6L56M08K6l71l89j9L54L94K6l64l82l3L66L91L7l70l97k3
$$ -19 360 379 23 -365 -401 -45 363 389 18 -371 -390 -36 358 384 20 -362 -395 -29 362 399 29 -368 -391
4204c91L56L95M3l60m04l0L59L92L1l63l84l8L51L99M0l63m05l0L62L90L5l47
$$ -391 -35 360 403 43 -361 -391 -32 360 391 28 -356 -394 -43 356 396 33 -372 -402 -40 350 385 38
4226C8m03l7L50M05K9l55l84m7L50M10L7l57l85m1L31M07N4l70l78n1L53L88O9
$$ 38 -365 -402 -52 353 382 27 -357 -404 -54 356 393 36 -349 -390 -59 348 402 32 -346 -397 -44 344 413
4249D13l65l98m7L43L93N3l56l88m0L46L87M5l46l91n5L60L77N2l32l97n9L53
$$ 413 48 -350 -397 -54 339 392 36 -352 -392 -46 341 386 40 -351 -406 -46 331 383 51 -346 -405 -52
4271e2L91M0l26l98o5L55L93M8l27l89p8L48L98N5l38m01l4L21L93P0l50l97n7
$$ -52 339 379 53 -345 -410 -55 338 386 59 -330 -408 -60 338 393 55 -346 -380 -59 334 404 54 -343 -400
4294d00L33L95O8l31m20m7L34L90O9l40l98n3L25L89Q1l29m03p5L41L89P3l27
$$ -400 -67 328 396 65 -355 -402 -68 322 391 51 -347 -400 -75 314 395 66 -337 -412 -71 318 391 64
4316F4l94o7L24M04O5l36l80q5L25M08P1l21l94o9L01M16O8l35l87p7L10M01P4
$$ 64 -330 -397 -73 331 396 60 -320 -405 -80 328 399 78 -316 -385 -84 332 400 65 -322 -399 -89 312 386
4339C86l08l99p6L09L94P9l18l94p8L14M03P7l17l87q1L08L97P8l04l82j08L26
$$ 386 78 -321 -397 -88 306 385 67 -327 -405 -91 312 389 72 -315 -396 -88 309 387 83 -299 -407 -81
4361h1L93P1k95m04q6L14L92Q7k98m08p9K96M05Q3l02m01q3L02L92Q5k95l97q9
$$ -81 312 383 88 -316 -402 -88 304 391 93 -315 -394 -98 307 390 88 -313 -396 -94 298 383 88 -309 -398
4384c98K97L82R8k88l97j02L14L76J03k82l96j07L03L89Q7k78l85j02K88L85R8
$$ -398 -101 281 379 91 -306 -408 -94 282 385 103 -293 -400 -97 292 379 101 -284 -386 -98 287 385
4405C85k89l77j06K79L95J05k82l94j09L02L80J07k97l89j00K75L91J04k75l97
$$ 385 96 -281 -387 -108 287 392 110 -284 -393 -91 289 396 99 -290 -390 -115 276 380 105 -292
4425b92q7K66L77J18k79l98q8K70L76J12k62m03r3K71L83J09k73l81j10K71L87
$$ -292 -379 -113 264 382 103 -295 -383 -113 263 375 113 -290 -383 -112 271 380 107 -274 -384 -113 274
4446B74J10k62l85j23K67L96J16k77l87j14K62L92J13k68l75j18K65L74J25k78
$$ 274 384 122 -263 -386 -119 277 393 116 -271 -385 -123 269 382 114 -261 -379 -114 260 385 107
4466A07l88j15K69L80J32k57l92j29K68L75J24k54l83j38K77L73J32k55l79j34
$$ 107 -281 -396 -127 253 385 128 -264 -393 -125 250 374 120 -263 -401 -124 249 381 126 -253 -387
4486c87K58L82J26k52l81j26K49M01J17k50l87j29K50L76J35k65l64j39K49L75
$$ -387 -129 253 379 127 -254 -380 -131 270 387 137 -250 -379 -129 247 382 117 -247 -386 -137 238
4506B38J39k44l89j28K32L95J21k37l75j40K44L75J48k46l70j48K44L87J20k28
$$ 238 377 133 -256 -384 -152 243 364 127 -248 -388 -144 231 379 133 -237 -385 -141 246 366 138
4526A38l66j49K36L84J37k33l75j43K42L65J32k18l73j47K14L79J60k39l80j48
$$ 138 -228 -377 -141 243 380 147 -228 -371 -129 236 368 150 -223 -370 -156 223 383 144 -236 -384
4546c84K26L70J55k32l69j43K25L74J44k31l78j44K31L74J47k20l72j44K16L64
$$ -384 -158 212 367 135 -234 -377 -152 222 366 135 -243 -387 -156 218 365 145 -227 -371 -155 209
4566B09J72k36l69j55K27L66J56k21l69j46K21L62J42k00l87j45K09L81J49k26
$$ 209 381 145 -224 -379 -152 214 370 149 -220 -366 -145 217 359 159 -228 -373 -164 217 366 140
4586A40l64j54K10L71J56k15l57j56K01L67J64k20l54j68K10L65J72k14l72j50
$$ 140 -224 -378 -168 203 359 144 -213 -369 -168 199 363 143 -211 -379 -169 196 368 154 -218 -368
4606c68K02L63J68k08l57j65J98L76J65k12l61j64K01L58J59j87l80j59K01L65
$$ -368 -166 197 365 157 -200 -365 -167 209 374 162 -199 -363 -162 196 355 168 -212 -371 -170 195
4626A95J46j90l53j69J99L61J67k03l39j78J88L62J52j84l46j78K03L58J61j79
$$ 195 341 151 -202 -371 -172 189 356 153 -186 -364 -176 186 338 154 -192 -370 -167 191 352 173
4646A73l58j73J90L53J74j90l55j70J81L58J69j76l70j70J96L42J77j89l56j62
$$ 173 -185 -358 -168 185 359 169 -186 -356 -175 183 352 176 -194 -364 -168 174 351 162 -194 -356
4666c56J68L68J68j83l48j84J85L60J62j73l37j88J69L67J84j86l55j71J58L77
$$ -356 -188 180 348 165 -183 -367 -182 178 340 167 -170 -358 -189 178 362 176 -179 -350 -192 185
4686A85J72j82l52j72J55L63J85j73l58j65J64L33K00j82l51j66J63L42J85j67
$$ 185 357 175 -177 -349 -194 169 354 181 -177 -342 -178 155 355 173 -178 -344 -181 161 346 179
4706A79l58j80J75L41J77j60l37j90J53L50J87j62l36k00J70L43J85j71l22j88
$$ 179 -179 -359 -184 157 334 174 -163 -353 -200 150 337 175 -161 -361 -191 152 337 166 -156 -344
4726c44J52L45J77j44l34k04J62L37J90j48l53j89J66L35J88j35l53j93J54L33
$$ -344 -192 153 330 186 -148 -352 -190 147 337 189 -164 -353 -187 148 336 201 -152 -345 -191 142
4746A42J86j41l46j87J57L27J83j26l43k00J49L37J88j36l40j96J59L16K02j42
$$ 142 328 187 -159 -346 -189 138 321 195 -148 -348 -199 138 326 190 -150 -346 -187 129 331 189
4766A89l25j89J34L24J92j29l21j99J31L24K05j36l36j89J28L19K06j29l33j92
$$ 189 -136 -325 -191 133 325 196 -125 -324 -193 131 336 200 -136 -325 -197 122 328 199 -134 -326
4786c26J26L13K09j25l30j97J29L23J93j22l25j90J11L34J96j20l24k07J24L31
$$ -326 -200 113 322 197 -133 -330 -201 122 315 193 -132 -322 -211 123 319 199 -125 -332 -208 123
4806A23J94j22l16j96J18L22K03j26l16k10J15L24K08j22l09k21J22L26J95j16
$$ 123 317 195 -121 -317 -199 123 326 200 -116 -326 -211 113 321 199 -110 -331 -209 117 312 196
4826A96l12k14J16L14K05j03l14k17J20L19J98j11l09k05J12L10K00j05l12k09
$$ 196 -116 -330 -214 100 305 202 -112 -329 -209 110 308 197 -112 -317 -205 105 305 200 -112 -321
4846c21J10L20K00j04k97k23J07L13K02r8l09k15J00L15K13j04l13k05R1L08K21
$$ -321 -211 109 309 205 -92 -315 -208 105 307 209 -100 -315 -215 100 313 209 -104 -309 -218 90 311
4867C11j05l12k18J07L00K20r5l06k20J01K96K24r5l10k13R5L04K10p7k99k27
$$ 311 206 -106 -324 -217 83 303 208 -98 -318 -217 79 303 208 -102 -315 -220 84 294 217 -82 -309
4888c09R2L07K07q5k89k19Q0L04K16r6k95k19R1K97K23r2k90k26P9K87K30q4l03
$$ -309 -217 90 297 212 -77 -296 -216 88 304 208 -87 -306 -215 82 305 213 -77 -303 -224 63 293 209 -94
4911i4k16R3K86K20q6k89k12P9K92K28q4k97k20P9K95K25o9k99k25O4L03K15o7
$$ -94 -310 -217 69 289 203 -86 -298 -219 73 301 217 -80 -300 -221 74 299 230 -69 -294 -230 73 288 221
4934B21k96k11O4K93K08o0k82k34P3K93K23p3k89k16O6K71K38p7k83k18O1K88
$$ 221 -75 -286 -222 71 279 219 -63 -297 -224 69 292 219 -70 -286 -220 51 289 212 -71 -289 -228 60
4956F0K15n5k91k21N6K83K38o1k80k29N3K70K41n4k86k19M6K98K03m3k73k45P2
$$ 60 275 220 -71 -292 -236 47 285 224 -56 -285 -232 38 279 225 -61 -280 -234 64 267 224 -49 -294 -222
4979b22K73K25n8k63k34M8K72K31n9k68k27N3K65K25l6k78k34O0K57K30m3k65
$$ -222 51 276 218 -45 -279 -231 41 272 213 -55 -282 -229 36 261 225 -53 -287 -227 30 260 217 -48
5001d8k20M4K69K15l0k77k29N2K60K30m6k70k37N8K66K25l8k77k14L3K61K31k9
$$ -48 -268 -224 45 260 230 -47 -276 -224 36 266 220 -50 -287 -229 37 262 224 -53 -267 -234 27 258 229
5024B29k73k18L4K54K36l5k74k24L8K68K17l5k59k24K6K69K32l8k52k30K1K72
$$ 229 -44 -262 -228 26 262 227 -47 -271 -233 35 252 217 -42 -266 -240 29 261 223 -29 -259 -238 34
5046C4K29l0k59k51M2K47K43k9k64k21K0K57K46m5k43k57M7K60K25j6k54k44J8
$$ 34 263 233 -26 -277 -235 12 255 226 -38 -259 -239 18 264 219 -24 -281 -234 26 251 235 -19 -263 -245
5069b45K66K22pk64k42L0K63K25k0k49k40J8K47K49k5k44k47K2K57K22j0k57k18
$$ -245 21 243 236 -28 -270 -240 23 248 228 -21 -261 -243 4 253 228 -16 -263 -241 16 238 228 -29 -247
5092b47QK39K37jk49k32J7K38K24Pk56k40K6K30K32kk38k45J5K40K35j0k41k46
$$ -247 -239 0 237 236 -13 -245 -228 10 234 241 -15 -255 -229 1 233 231 -7 -252 -237 3 238 228 -13 -259
5116b59J4K47K34j9k36k28%K40K46rk36k48MK53K34j0k45k27J0K45K23Qk49k31
$$ -259 -245 2 236 217 -19 -247 -247 -7 239 230 -6 -254 -250 3 237 227 -18 -245 -235 10 233 241 -8 -239
5140b39PK27K37Qk46k39RK22K41Ok39k45J4K26K41j4k19k34rK34K49qk22k39j5
$$ -239 -232 -5 232 240 -6 -245 -236 -14 227 233 -6 -251 -237 -11 230 216 -3 -237 -246 -12 237 229 7 -232 -247
5165b47K32K54j4k23k35j5K27K56kk27k27k4K33K42J2k39k31j1K33K33J4k22k54
$$ -247 -15 239 225 2 -233 -248 -21 235 233 6 -221 -245 -12 230 242 3 -228 -239 -6 227 241 19 -235
5188b35j1K18K41K5k33k47KK23K30Lj99k53j5K24K47Ok11k45k6K48K30Ok06k49
$$ -235 -246 -28 213 238 5 -242 -240 -17 213 216 17 -236 -251 -27 220 226 15 -230 -256 -8 222 228 22 -227
5212b27j8K31K37Rk13k33k7K23K44Pk05k56j3K23K38K1k22k53lK11K34K8k09k58
$$ -227 -245 -14 223 232 19 -214 -241 -18 226 233 28 -228 -241 -18 220 241 19 -234 -237 -26 208 236 27 -231
5236b31k0K27K22M2k16k49j3K10K33L5k10k45l4K19K45K1k17k29k8K07K49K3k15
$$ -231 -251 -24 198 240 24 -225 -238 -28 205 240 30 -215 -249 -30 215 236 19 -210 -238 -31 218 241 26
5259B6k37l0K00K54K5k08k41k4J84K49M0k13k26l7J96K41L5k09k31n8K15K56L4
$$ 26 -211 -241 -41 213 238 30 -211 -235 -51 198 238 25 -201 -238 -42 199 234 25 -206 -264 -49 207 241
5282B41k10k28m9K02K40L1j89k38n2K10K33M6j93k36n2K04K44L9k04k37m9K06
$$ 241 31 -197 -246 -44 196 227 38 -200 -252 -42 191 237 44 -192 -244 -40 204 243 39 -198 -247 -41
5304d1K31M9j99k44l8K01K42L6j88k44n4K02K31N5j93k61k7K03K31L6j85k50m3
$$ -41 190 239 40 -204 -242 -41 201 237 49 -195 -249 -47 184 239 46 -215 -242 -39 192 228 43 -207 -250
5327b50K08K33M8j99k30n5J86K45M6j81k47m8J92K42M8j95k42m2J90K44M3j83
$$ -250 -42 191 239 40 -190 -245 -59 186 232 51 -196 -244 -52 190 238 43 -199 -241 -51 193 236 53
5349E3k53l3J62K52N8j98k27o3J90K39N4j82k47n1J79K41N2j67k46n5J90K22O9
$$ 53 -200 -233 -71 181 239 41 -186 -249 -59 180 234 52 -195 -246 -67 174 226 59 -187 -242 -52 170 239
5372B39j93k36m5J74K32O3j81k41o1J97K23O0j81k34n2J67K43O0j80k38n3J73
$$ 239 46 -190 -235 -61 171 234 53 -188 -249 -52 171 231 50 -184 -236 -69 174 234 54 -184 -237 -64
5394f4K33O2j77k29o6J76K37O2j86k36o3J92K28O4j74k51o4J86K35P4j87k27o3
$$ -64 169 231 54 -175 -241 -65 172 234 48 -188 -251 -59 169 233 59 -192 -256 -70 165 239 52 -175 -238
5417b38J64K40O8j65k46p3J81K36O9j64k42p9J75K42P3j71k33p8J64K37P8j72
$$ -238 -74 166 234 69 -177 -250 -69 167 236 72 -170 -249 -74 168 241 70 -163 -241 -77 160 238 66
5439F6k39p8J75K42N9j57k37p0J59K39P5j61k40o9J54K36Q6j65k46p8J69K53P0
$$ 66 -173 -251 -76 166 225 68 -169 -239 -80 159 234 73 -167 -236 -82 154 240 75 -171 -249 -80 173 243
5462B43j68k48p4J70K27P9j49k43q1J65K41P9j70k42o5J57K44P3j55k50p5J49
$$ 243 75 -173 -247 -77 150 229 80 -163 -244 -79 162 241 71 -171 -236 -79 165 238 83 -167 -242 -93
5484i3K50Q2j58k37p4J36K49Q4j63k24j02J46K52Q7j56k19j03J58K29J02j45k45
$$ -93 157 239 81 -156 -230 -94 155 239 76 -148 -250 -104 148 235 79 -140 -243 -85 144 246 101 -144
5506a44j06J70K24J00j62k33r4J57K38P9j35k51r2J59K39Q1j36k38j05J48K48
$$ -144 -250 -80 144 244 82 -151 -245 -88 150 229 94 -157 -249 -90 149 230 94 -144 -249 -101 147
5527A47R3j51k29r4J36K41R5j60k28q7J47K28J01j48k32r4J40K33R7j44k37r3
$$ 147 240 89 -140 -234 -98 143 238 78 -150 -237 -90 138 239 91 -141 -235 -95 138 235 91 -146 -239
5549b39J49K35Q8j35k45j00J52K27R6j33k40r9J40K36R2j24k35j06J40K29J02
$$ -239 -90 145 233 98 -147 -247 -95 132 228 95 -145 -244 -104 132 224 100 -135 -241 -101 128 230
5570B30j35k28j06J33K43R7j31k30j09J22K49J07j38k32j13J37K34J13j42k46
$$ 230 95 -133 -239 -106 137 234 103 -127 -236 -114 135 242 104 -128 -241 -104 130 243 101 -145
5590a45p9J14K37J15j29k42j10J32K28J08j25k32j21J38K27J20j35k26j21J36
$$ -145 -224 -110 127 242 113 -129 -239 -107 121 229 104 -128 -249 -111 116 236 101 -125 -246 -110
5610a10K39J01j25k38j00J22K39J19j47k23j09J30K16J27j30k47r7J06K46J19
$$ -110 129 230 105 -133 -233 -111 128 247 100 -123 -232 -102 114 241 111 -136 -233 -127 119 238
5630B38j26k40j02J20K23J25j22k35j19J18K33J19j06k40j24J19K35J14j10k35
$$ 238 112 -128 -230 -110 113 238 116 -119 -238 -120 113 232 126 -114 -238 -119 116 230 120 -115
5650a15j27J17K43J05j13k24j25J19K41J03j16k25j13R5K44J32j20k38j22J17
$$ -115 -242 -125 118 223 110 -114 -239 -120 121 224 108 -117 -230 -135 109 241 121 -117 -239 -122
5670a22K34J14j01k34j33J19K22J35j24k25j18J16K25J20j11k19j27J13K21J16
$$ -122 112 226 125 -109 -242 -123 99 234 110 -115 -233 -117 108 228 117 -102 -229 -116 105 221
5690B21r4k24j38J15K25J22j08k27j22J08K26J29j14k19j29J07K22J31r7k45j18
$$ 221 127 -97 -235 -120 105 227 119 -108 -230 -122 104 233 119 -100 -229 -122 100 231 134 -111 -229
5711b29J02K29J26j06k18j28R2K27J28r9k27j35R9K31J31j03k29j21J06K06J38
$$ -229 -127 102 228 122 -96 -224 -132 95 223 124 -103 -238 -139 92 223 120 -109 -230 -124 82 220
5732B20r1k28j31R0K31J23q9k27j32R3K37J32j07k19j30R3K25J32r2k21j30R3
$$ 220 129 -99 -230 -140 91 214 125 -102 -234 -141 96 228 121 -98 -228 -135 90 222 130 -91 -221 -128
5754a28K16J39j01k18j29Q2K29J28q9k19j40R4K24J29q8k16j41R6K19J30q5k22
$$ -128 88 227 126 -92 -221 -139 90 218 129 -90 -230 -136 88 217 129 -87 -228 -132 87 217 132 -90
5776i0j26Q3K21J29p4k29j38Q3K32J35q8k26j34P8K32J32q9k10j41P8K25J28p5
$$ -90 -216 -133 88 217 143 -86 -224 -141 91 226 138 -88 -222 -144 88 220 131 -79 -220 -142 83 211 136
5799A36k21j54R9K10J55q6k21j36Q1K10J44q3k14j47Q8K18J34q1k28j29R3K20
$$ 136 -85 -239 -140 70 225 139 -82 -218 -137 73 217 134 -80 -227 -139 79 213 132 -96 -225 -132 88
5821H8J28p8k22j30P8K11J46q2k20j33O3K19J52q4k15j43Q6K10J45p3k30j40P8
$$ 88 216 138 -84 -214 -136 75 221 139 -81 -214 -151 68 220 136 -79 -222 -136 74 219 146 -84 -224 -146
5844a46K20J32o0k26j37P4K03J54p7k16j38O5K25J34o4k15j41N6K28J37p0k06
$$ -146 74 206 146 -80 -217 -143 60 214 137 -79 -217 -152 73 207 143 -72 -213 -157 71 208 138 -68
5866f8j47O2K17J54p3k16j44O2K24J43o9k11j52P5J99J61p0k16j35N3K17J43o1
$$ -68 -215 -153 64 218 145 -71 -215 -153 71 214 145 -66 -218 -143 56 217 147 -69 -204 -151 66 209 148
5889A48k08j52O6K15J50q6k03j46O5K19J33m4k16j55N6K06J59o6k19j32N0K22
$$ 148 -60 -212 -146 69 219 133 -70 -216 -151 68 201 157 -59 -214 -158 48 207 141 -78 -210 -160 62
5911F2J35n1k12j49O0K14J45o1k07j46O0K12J44n9k08j44N2K07J53o3j99j51N7
$$ 62 197 146 -66 -215 -155 59 204 143 -64 -210 -150 62 206 147 -61 -205 -153 54 207 144 -55 -206 -149
5934a49K04J54o2k04j46N2K07J56o4k12j36N5J86J57n3k04j43M8K08J52n7k10
$$ -149 55 209 147 -57 -203 -151 56 212 148 -64 -200 -145 41 198 145 -59 -202 -154 54 206 149 -61
5956f1j43M1K14J47m1k18j51M8K05J56m5j98j60M2K13J54o6j77j57M2K01J52m0
$$ -61 -204 -163 51 198 157 -61 -212 -164 41 197 152 -46 -206 -164 49 203 137 -40 -197 -155 46 198 158
5979A58k12j48N5J85J65n2j96j63N0K06J46l4k10j60N7K10J29l6j83j68M3K03
$$ 158 -54 -202 -147 38 203 151 -45 -208 -158 48 194 160 -50 -210 -153 57 186 150 -33 -201 -158 45
6001D5J43l4k02j59N0J88J77m7k00j59L9J92J61m4j94j48K9K04J63n0j99j45K5
$$ 45 188 154 -48 -207 -157 31 208 161 -39 -198 -159 33 194 150 -44 -192 -163 41 204 154 -45 -190 -165
6024a65J99J68n3j89j56M1J82J60l3j92j61M3J87J61l6j90j63M5J88J49k4j97
$$ -165 34 202 149 -40 -196 -155 27 187 154 -38 -199 -156 31 192 156 -34 -197 -152 36 185 161 -36
6046c6j56J9K17J51m5j89j64L4J94J62k6j97j66L4K00J61m3j91j58M6J85J55k3
$$ -36 -192 -173 44 195 150 -39 -203 -169 25 187 161 -36 -202 -168 32 193 150 -41 -199 -153 32 187 164
6069A64j93j71M0J92J60l5j91j59K4J86J66l0j86j53K7J88J49j3j90j75L6J90
$$ 164 -29 -200 -160 32 192 157 -34 -193 -169 17 183 153 -33 -186 -159 29 178 165 -25 -200 -164 26
6091B6J58k5j84j58J8J90J62l7j72j62J8J86J62m1j78j45K1J84J66k9j92j47J5
$$ 26 184 159 -25 -183 -165 25 187 150 -22 -184 -166 20 182 141 -37 -182 -161 23 189 160 -32 -179 -164
6114a64J82J58k0j86j53J9J87J62k7j77j73L0J82J57k1j79j54J9J87J52k5j72
$$ -164 18 176 156 -30 -183 -164 23 185 158 -19 -192 -162 20 177 156 -23 -177 -158 29 181 156 -16
6136a6j70J9J82J61k0j68j72K1J78J64j4j88j56J3J80J67k5j77j57MK06J43j7
$$ -16 -186 -167 15 176 156 -12 -184 -163 15 179 165 -23 -179 -166 14 181 156 -21 -178 -174 32 175 158
6159A58j75j78K9J80J71j8j87j66L2J69J63j5j83j62J5J82J54rj67j72K2J74J67
$$ 158 -17 -195 -166 14 185 167 -20 -186 -154 15 178 163 -20 -182 -167 15 169 160 -7 -179 -157 17 184
6182A84k9j72j54J7J74J48Jj88j55K2J68J58j4j76j60J9J57J71qj76j63K1J70
$$ 184 155 -17 -171 -154 20 168 169 -19 -174 -152 16 174 160 -16 -176 -157 0 171 163 -13 -176 -155 15
6205A5J57rj68j67J0J80J58j9j71j68J0J83J68j5j78j62J4J66J72j2j69j70NJ74
$$ 15 172 163 -5 -172 -162 18 176 157 -14 -182 -172 11 179 164 -14 -176 -162 4 176 164 -5 -175 -170 4
6229DJ67jj86j50MJ72J61j0j70j73K1J61J62j2j69j50%J68J72mj84j48lJ72J69
$$ 4 171 170 -16 -166 -162 10 171 161 -9 -182 -161 0 162 150 -19 -169 -169 -1 171 167 -17 -165 -168 4 173
6254A73oj82j54nJ74J67jj65j70J2J63J61Jj72j73J7J65J52mj67j54MJ72J63j2
$$ 173 167 -15 -169 -174 0 167 166 1 -169 -157 6 167 168 -4 -177 -160 5 157 153 -14 -168 -164 8 171 159
6279A59j67j67J4J73J51oj65j55PJ56J59Nj63j66KJ66J70j1j59j66%J58J58Pj63
$$ 159 -8 -175 -161 12 163 157 -8 -163 -156 0 159 164 1 -165 -163 3 173 162 3 -163 -163 -5 153 160 -3
6304cj69J4J60J67oj71j59J2J59J67kj74j66J1J57J66Lj66j62nJ72J60lj61j66
$$ -3 -172 -158 2 169 163 -8 -167 -155 4 171 169 -5 -171 -160 -3 163 166 0 -162 -167 5 165 162 1 -165
6329a65NJ65J61%j64j62lJ64J62lj53j67OJ52J65oj61j49j1J56J73mj54j69RJ50
$$ -165 -160 5 166 166 2 -160 -163 1 163 160 7 -160 -154 -2 163 157 -4 -153 -164 -8 165 161 7 -162 -153 -3
6355cJ60Jj54j55qJ71J37J7j60j72jJ66J58Kj57j54j1J59J59Pj71j53kJ47J72
$$ -3 157 158 4 -151 -159 12 149 166 6 -166 -167 -1 157 159 2 -152 -163 -4 155 162 -9 -162 -164 -17 155
6380A55J0j60j61%J52J62lj52j63J1J41J60Oj53j55oJ48J73kj56j66nJ67J49L
$$ 155 165 5 -156 -156 -4 158 155 3 -160 -149 -8 152 158 5 -150 -156 -8 165 163 7 -159 -164 3 152 155
6405A55j47j55j2J57J61Kj52j71OJ55J60oj48j62kJ52J67Rj76j50KJ52J59oj49
$$ 155 8 -147 -159 -2 159 161 9 -162 -156 -1 159 153 5 -157 -159 -7 160 169 -7 -157 -155 -3 156 150 1
6430Aj52qJ63J50Qj64j61kJ59J60lj51j62qJ62J55%j40j67pJ61J56rj35j61jJ54
$$ 1 -151 -159 4 154 162 -2 -163 -165 -6 154 151 0 -162 -170 -8 147 147 7 -160 -167 -6 150 141 6 -155 -156 -2
6457bJ46J0j60j44j5J56J60Kj60j56J2J39J61%j59j48rJ64J54Lj49j64j0J52J63
$$ -2 144 154 -6 -150 -165 -9 151 153 -7 -163 -151 -12 149 149 -10 -158 -167 -3 151 154 5 -159 -169 -17 146
6482A46Rj57j52LJ48J56J2j65j54rJ68J47Oj59j61mJ63J50jj41j54oJ39J67Jj57
$$ 146 155 -2 -154 -151 -3 153 165 0 -154 -163 5 152 158 -1 -162 -166 -3 147 146 5 -149 -155 -16 151 152 -5
6508ej50mJ48J51J4j57j48pJ51J59Pj56j60oJ49J80j6j40j60j3J65J53kj36j69
$$ -5 -155 -159 -11 140 154 -3 -151 -158 -7 152 159 3 -157 -163 -14 166 150 10 -150 -163 2 155 153 17 -152
6533a52jJ48J54Oj46j61nJ52J57Lj55j52j2J67J44J1j62j41l1J63J52K4j60j43
$$ -152 -153 -5 149 155 9 -152 -157 -5 152 155 0 -152 -164 3 147 158 -4 -145 -176 -13 139 163 3 -140
6557a40j4J45J53J8j58j54%J33J68Rj55j48JJ30J67kj48j56MJ42J54Qj49j62k
$$ -140 -154 -9 144 162 4 -150 -150 -17 151 160 5 -143 -142 -12 155 153 5 -151 -147 -5 149 157 8 -154 -156
6582a56J43J64Kj45j51oJ39J58Mj52j47rJ45J43J8j47j53qJ48J61Kj42j57j1J54
$$ -156 -13 151 153 8 -143 -149 -10 148 152 0 -147 -156 -11 132 150 3 -150 -158 -10 151 153 11 -146 -157 -3
6607cJ47J7j58j53nJ50J51Nj47j55rJ47J52J6j47j55mJ39J57Pj45j47j7J52J48
$$ -3 144 161 3 -150 -155 -5 146 151 4 -151 -160 -13 139 155 8 -147 -151 -12 145 152 7 -140 -157 -5 143
6632A43J0j37j76LJ50J58Lj50j48j7J36J70Rj35j64j3J39J66Pj51j51KJ30J57
$$ 143 153 16 -160 -157 -7 151 154 4 -144 -161 -25 145 154 19 -145 -158 -19 147 154 3 -148 -146 -16 141
6656A41J3j55j45pJ54J43Pj35j56j5J47J51Nj42j51nJ31J53J4j40j56k0J56J48
$$ 141 154 -1 -146 -153 1 144 151 16 -140 -155 -8 143 148 6 -145 -150 -19 134 148 8 -148 -168 -12 136
6680A36J7j41j57j1J48J51Nj26j64j9J57J45J3j37j59j1J46J53Qj33j57j6J38
$$ 136 153 12 -145 -156 -8 143 148 22 -142 -161 -4 141 154 17 -142 -153 -7 146 154 21 -136 -152 -14
6703a4J60J3j57j44j9J42J61Mj34j47j3J36J42K5j61j45mJ36J64Nj43j50oJ36
$$ -14 146 159 2 -142 -161 -19 142 146 12 -135 -148 -12 130 155 -6 -151 -155 -19 145 150 7 -143 -149 -13
6727a3J55Rj40j50j1J44J42J3j35j58qJ34J66Oj36j58j8J43J57Jj34j53j4J38
$$ -13 142 151 11 -139 -150 -6 136 149 14 -144 -152 -18 148 154 18 -140 -158 -15 142 143 9 -144 -158 -20
6751b0J59Nj42j51lJ36J51J4j46j45j7J45J60nj35j56MJ32J64Jj36j57jJ37J48
$$ -20 139 144 2 -149 -152 -16 135 149 3 -142 -159 -14 146 141 6 -150 -146 -14 150 151 15 -142 -143 -6 142
6776A42Qj49j40qJ36J43K1j39j57pJ40J50K3j51j47j3J44J44J5j40j56j3J46J43
$$ 142 150 1 -139 -147 -11 132 153 14 -143 -150 -10 140 163 12 -135 -148 -4 140 155 15 -141 -154 -8 135
6800A35J7j40j49k3J45J46J5j40j45rJ37J49Qj27j52k2J42J50J5j42j34k3J40
$$ 135 152 12 -137 -160 -15 131 146 6 -139 -148 -11 138 146 19 -133 -155 -13 137 152 10 -124 -147 -7
6823gJ43J7j39j56j7J47J36K2j39j50NJ23J41J9j37j57oJ36J61Kj37j46mJ32J50
$$ -7 136 153 14 -142 -159 -12 124 146 7 -143 -138 -15 126 145 8 -149 -155 -19 142 144 7 -139 -143 -11 139
6848A39Qj32j44k4J42J60Mj33j51k4J43J51Oj43j34j6J34J57J7j45j48oJ33J48
$$ 139 147 15 -129 -153 -11 149 153 20 -131 -155 -12 139 145 2 -132 -148 -14 143 160 15 -133 -139 -6 142
6872A42J0j34j53j4J28J52L3j43j62j1J47J44J1j38j42k3J41J44J7j35j45j7J32
$$ 142 152 18 -135 -149 -21 131 164 21 -141 -152 -5 139 150 12 -130 -153 -12 132 149 14 -131 -148 -16
6895a6J51J9j37j47j6J42J36J7j39j38j1J18J69oj35j53MJ23J50K0j36j51rJ27
$$ -16 135 154 17 -130 -146 -4 132 149 10 -128 -139 -21 148 142 7 -146 -142 -19 131 151 15 -136 -145 -18
6919a8J53J3j39j43j7J36J44K1j39j50k1J43J45J7j32j50j1J42J44J7j33j52j7
$$ -18 135 148 9 -134 -151 -15 129 150 11 -139 -160 -17 128 145 13 -137 -148 -6 138 155 22 -130 -147
6942a47J38J48Rj28j44j9J30J45J6j37j45nJ20J58Qj41j49kJ31J52J3j39j45j1
$$ -147 -9 139 148 20 -124 -143 -13 132 148 11 -134 -139 -19 139 147 6 -143 -145 -14 138 151 12 -133 -144
6966a44J40J27J5j26j45j1J29J53Pj31j45j3J25J53J4j29j51j5J38J43K0j43j36
$$ -144 -4 123 138 12 -133 -144 -15 138 145 14 -131 -144 -19 134 148 19 -132 -147 -9 134 154 11 -125
6989a25k7J49J39J5j40j41j2J23J45K3j30j50j2J20J68Nj37j46mJ21J57J0j40
$$ -125 -152 -3 136 151 11 -130 -142 -19 126 149 19 -131 -143 -23 145 150 13 -133 -137 -16 141 151 11
7012A1j49j0J42J39J1j31j42j0J29J48Kj24j45k0J45J42J4j33j49k0J49J37Lj20
$$ 11 -138 -148 -6 133 144 13 -129 -139 -10 138 140 16 -129 -149 -4 138 152 19 -130 -150 -1 136 139 19
7036A9j50qJ21J54Pj31j44j5J30J50J6j32j46j4J42J33J8j42j40j2J40J39J7j28
$$ 19 -131 -139 -18 136 143 12 -132 -147 -17 133 149 17 -129 -143 -1 132 150 8 -132 -144 -4 135 152 24
7060B4j54j3J32J44Pj24j48j2J40J39J3j31j42j8J32J40J1j27j54qJ28J50Qj16
$$ 24 -130 -143 -11 133 140 16 -132 -144 -4 135 148 17 -125 -143 -11 129 140 13 -141 -149 -21 129 137 21
7084B1j61j6J40J39Pj16j48k4J40J46J9j27j49j1J24J53J3j37j43j7J31J47K4
$$ 21 -140 -156 -16 123 130 14 -134 -158 -18 128 147 20 -129 -140 -16 137 150 13 -130 -147 -16 131 155
7107A55j42j41rJ20J51Qj42j24j8J21J57Pj28j56j0J33J46J6j28j46j8J34J34
$$ 155 13 -128 -137 -17 134 142 0 -124 -142 -21 136 143 15 -141 -151 -18 128 144 16 -130 -148 -14 120
7130A20K4j42j38j6J29J33L4j35j38j4J24J42K3j28j54j1J28J47K1j45j31j0J12
$$ 120 144 2 -136 -152 -23 110 144 9 -129 -143 -19 123 146 18 -136 -147 -19 128 149 4 -127 -137 -25
7153b5J54J6j31j45j2J24J43K4j37j46qJ21J45Rj07j57oJ26J47Qj31j41k2J33
$$ -25 129 145 14 -131 -143 -19 124 148 11 -135 -143 -22 123 132 25 -132 -138 -12 135 143 12 -129 -151 -18
7177a8J48J6j20j55j3J27J44J9j29j49j1J26J32J7j17j42k3J28J46J3j34j33j1
$$ -18 130 146 26 -129 -142 -15 129 148 19 -130 -141 -15 117 134 17 -125 -148 -20 126 139 5 -128 -139
7200a39J21J50J2j33j48j1J40J35K0j30j36k2J26J46Rj35j34j6J26J48K2j42j43
$$ -139 -18 132 144 11 -137 -148 -8 127 147 17 -119 -141 -15 131 140 5 -129 -145 -19 129 151 9 -134
7223a34j4J31J43J6j27j45j0J34J26K5j23j57j5J37J38J6j29j43pJ28J31K4j35
$$ -134 -148 -17 126 142 15 -130 -140 -6 120 145 22 -135 -150 -13 125 141 12 -131 -138 -10 121 145 10
7246A0j43j4J24J50J8j40j42mJ25J42K0j42j41MJ27J40J6j29j40k8J44J30K5j39
$$ 10 -133 -147 -23 127 145 5 -137 -141 -16 126 146 4 -137 -133 -6 134 150 21 -119 -147 -3 127 152 13
7270A3j44kJ23J50Jj18j57j6J35J38K9j44j28k9J27J50J1j26j53j6J36J51J8j32
$$ 13 -131 -133 -10 140 141 23 -134 -150 -15 123 152 8 -120 -149 -22 128 139 13 -140 -156 -20 131 149 17
7294A7j41j6J24J44J8j16j52k5J25J56J8j28j46k3J31J47J5j29j36l0J34J39K7
$$ 17 -124 -140 -16 128 146 30 -122 -147 -22 134 152 24 -122 -145 -14 133 148 19 -117 -147 -13 126 153
7317A53j42j43j5J27J49J0j21j43l0J36J50Mj17j50j0J26J48J1j27j48j0J27J35
$$ 153 11 -132 -147 -20 129 139 18 -125 -155 -19 131 135 18 -132 -142 -16 132 143 16 -132 -142 -15 120
7340A20K2j20j44k3J28J49J9j32j47j6J23J50J7j26j51j9J22J50K1j22j43l8J36
$$ 120 142 22 -122 -145 -17 132 151 19 -128 -144 -21 129 146 20 -131 -150 -28 122 143 21 -122 -160 -24
7363b4J54J7j27j52j5J26J39K3j18j46k7J28J48J7j31j45k4J37J44K1j26j46k0
$$ -24 130 147 20 -132 -147 -21 118 141 23 -123 -150 -22 126 143 12 -133 -157 -20 124 145 19 -127 -147
7386a47J21J52K6j34j31l5J22J51K4j35j44j7J27J35L2j22j54j4J25J30L1j28
$$ -147 -26 126 152 18 -113 -148 -26 125 149 14 -130 -147 -20 115 147 25 -129 -143 -18 112 143 15
7408A5j40l0J30J53K0j23j53k6J31J52K3j23j57l0J37J55K2j30j47k8J31J45K7
$$ 15 -125 -155 -25 128 148 25 -128 -154 -23 129 152 29 -128 -158 -21 134 156 26 -121 -149 -18 127 154
7431A54j25j51j6J11J55L0j33j60j2J23J46K9j30j41l7J38J38L0j16j67k1J32
$$ 154 29 -122 -138 -27 128 158 25 -135 -147 -24 122 151 21 -120 -157 -19 119 149 33 -134 -155 -23
7453b3J35L4j11j70k6J39J44L9j39j47j9J13J43L5j25j47l7J33J49L7j21j59l6
$$ -23 112 146 35 -135 -161 -22 122 161 22 -125 -144 -31 112 147 22 -125 -162 -29 120 157 36 -123 -159
7476a59J29J53L1j28j43k7J21J45L4j35j55k1J27J54J9j25j44l3J23J56K4j24
$$ -159 -30 123 154 26 -117 -144 -23 122 156 21 -134 -155 -28 126 145 20 -124 -157 -34 122 146 22
7498B2j45l9J25J60L0j29j50l0J36J49J5j19j47l2J27J58L3j32j50l4J22J56K8
$$ 22 -123 -162 -37 123 153 24 -126 -156 -20 129 144 25 -122 -154 -27 131 164 32 -118 -152 -30 126 154
7521A54j35j49k4J30J36L6j23j53k2J28J37K9j17j56l4J19J61M6j32j61j4J22
$$ 154 19 -130 -154 -24 112 148 25 -128 -150 -22 115 144 27 -129 -163 -44 117 163 31 -130 -144 -22
7543b2J45M2j33j45k3R6J62L5j24j57k3J13J61J7j14j57l5J25J51M0j18j61l7
$$ -22 123 165 32 -113 -136 -40 122 157 33 -124 -147 -34 127 144 30 -127 -162 -37 114 154 36 -125 -162
7566a62J29J61K1j17j51l0J13J53L1j17j51l6J14J58L8j23j54l7J28J53K7j03
$$ -162 -33 128 149 32 -119 -149 -36 117 148 31 -120 -156 -42 116 154 31 -123 -160 -32 121 148 45
7588D5j64k9J24J49L2j20j55m4J31J58K8j19j62j9J11J46L8j17j56l6J22J58K5
$$ 45 -119 -148 -24 125 157 37 -118 -162 -31 127 155 36 -126 -145 -34 112 150 33 -123 -159 -37 121 146
7611A46j17j50n2J31J57L1j19j48m5J28J57L8j27j52k7J16J60K6j15j58k5J02
$$ 146 29 -121 -173 -42 115 146 27 -121 -166 -38 119 157 30 -122 -149 -33 127 153 38 -120 -145 -43
7633d3J49N6j27j40m3J14J58K4j04j65l7J08J66L7j15j60l1J10J50M3j16j52n3
$$ -43 106 162 35 -105 -148 -34 124 148 44 -121 -158 -50 116 153 38 -122 -153 -43 107 150 34 -118 -171
7656a71J24J69L9j09j67m2J20J52N0j16j75l2J16J70L7j24j46n1J21J62L6j27
$$ -171 -47 122 161 52 -115 -157 -37 115 165 49 -126 -158 -42 128 165 41 -105 -156 -35 127 163 36
7678C6j51m4J11J58N4j24j59m0J10J60M9j15j63m5J20J51M6j00j74l8J23J41O0
$$ 36 -115 -159 -48 110 164 40 -119 -159 -49 111 160 45 -118 -163 -43 108 154 54 -120 -158 -35 106 166
7701A66j27j47m8J19J52N0j06j69l7J07J65L9j20j54m3J01J67M9j13j59n3J12
$$ 166 39 -108 -156 -37 115 165 59 -110 -147 -40 125 164 44 -110 -153 -52 115 164 51 -108 -161 -49
7723d9J64L9j12j58n0J20J54M7j07j64n1J14J73L3j06j59n1J08J64O0j25j46n3
$$ -49 115 154 42 -116 -166 -46 108 155 48 -116 -167 -53 120 153 47 -112 -163 -55 109 169 44 -102 -155
7746a55J09J56O3j17j60n1J14J48M7r5j74m5J19J47N0j11j57m0J00J56M3r7j66
$$ -155 -46 110 173 56 -104 -155 -41 107 154 59 -115 -160 -41 106 156 45 -112 -152 -52 104 147 50 -116
7769a16m7J01J64N1j01j76m1J14J52O7j14j64m8R1J68O5j08j68n2J06J64O5j26
$$ -116 -163 -62 102 153 52 -124 -165 -51 101 168 54 -110 -158 -67 101 166 58 -110 -162 -56 108 173 47
7792D7j59l8J02J61N9j12j74o1J31J53M2q5j85m5J19J50N2j01j68n3J10J54O4
$$ 47 -112 -150 -48 113 172 60 -114 -175 -44 109 151 66 -119 -164 -45 105 157 56 -112 -165 -55 99 163
7815A63j03j72o0J10J73N1j08j63o0J11J64N3j05j55o1J13J61N5j11j61o5J19
$$ 163 60 -112 -172 -62 111 162 54 -109 -169 -58 106 159 54 -101 -162 -49 112 167 56 -105 -170 -51
7837e1J57N9r1j87m3R5J54O9j05j65n0R0J70N9j02j73n5J05J64O2j06j63n9J06
$$ -51 106 165 74 -113 -156 -61 93 162 57 -108 -158 -68 102 161 59 -114 -169 -64 100 162 56 -107 -166 -60
7861f0J61O2j05j66n6J02J58O8j00j61o7R2J77O0j02j68n3Q4J78O4r9j65o5Q9
$$ -60 101 163 58 -108 -164 -62 96 164 64 -97 -164 -72 105 165 63 -105 -158 -74 104 168 69 -96 -161 -72
7885g2J68N2r8j54o5J00J59P0r6j79o0J16J51O9j01j71n7R8J71O7j03j65o3R7
$$ -72 96 148 50 -104 -169 -69 90 160 64 -115 -175 -59 92 161 60 -111 -168 -70 101 168 65 -100 -163 -66
7909f6J72N9r7j71o1J01J64O8r8j63p4R2J69P2j07j63p3J08J57P8j03j68o8R6
$$ -66 106 165 68 -103 -164 -63 101 169 71 -92 -166 -74 95 167 60 -103 -176 -68 89 167 64 -104 -172 -76
7933g6J61P8r3j79n0Q6J67O8q3j73p2J06J52Q1j05j62p0J01J77M8r0j68q2J05
$$ -76 85 163 70 -109 -159 -73 94 162 79 -94 -166 -60 92 173 68 -94 -164 -63 114 162 72 -96 -178 -73
7957g3J70O9r8j63p7J02J60Q0j00j71o4R3J67O6r3j62q8J02J69O6q7j65p9R8J65
$$ -73 97 166 68 -95 -172 -70 90 170 70 -101 -165 -72 95 161 68 -94 -182 -80 89 155 68 -97 -176 -78 87
7982H7P5r6j67p1J00J59O7p8j59p9R3J61P6r0j70p0Q7J77N9q2j66q1R0J76N6q2
$$ 87 162 66 -101 -172 -72 87 154 76 -83 -162 -69 92 168 78 -92 -162 -75 102 161 79 -87 -168 -78 98 154 72
8008G2j52q8R6J59Q2j08j66o6R6J56R0j02j61q7J02J64Q4r7j70o6Q5J64P9q0j66
$$ 72 -80 -168 -72 87 169 61 -105 -171 -75 81 171 69 -92 -179 -77 87 171 74 -96 -162 -77 87 166 86 -80
8033h0q1R5J64P0r6j57p2Q6J62P7r6j53p9P9J64P9r4j65o9R5J55Q0j01j57p6P8
$$ -80 -161 -66 98 168 72 -85 -157 -71 91 168 72 -81 -160 -81 83 162 68 -97 -166 -71 84 164 63 -94 -170 -92
8059i2J80O6p9j72o4P9J69P4p6j72p5Q0J77O4p7j66p5P5J75P9q6j66q6Q8J70P8
$$ -92 88 154 75 -97 -161 -82 87 161 85 -87 -162 -82 95 159 82 -84 -159 -84 91 170 84 -82 -168 -80 90 168
8085A68q6j67p8Q9J67O8p9j69q9R0J66R3r5j70p6P8J76O5p0j67q6Q9J61Q9q8j59
$$ 168 82 -85 -163 -74 93 161 82 -87 -176 -86 80 173 78 -92 -168 -90 86 151 81 -86 -172 -83 78 167 79 -80
8111h0r3R1J67Q2r0j55p8Q4J51R0p9j69q7R0J48R5q4j64p7P7J66Q1q4j62q1P6
$$ -80 -173 -82 85 167 77 -78 -156 -72 79 169 90 -79 -166 -76 72 167 83 -81 -158 -81 85 166 82 -80 -161 -85
8137h5J66Q1p9j79q0Q3J68Q5p4j70q6Q1J60J01r1j61p0P1J61Q3p8j61q2P8J62
$$ -85 81 162 83 -96 -176 -93 75 160 86 -84 -170 -89 71 172 81 -80 -150 -79 82 165 87 -74 -156 -78 84
8162H4R0q3j62q2P2J58R7q3j66q7P0J70R4q2j64q9O8J62Q2o3j63q7O7J68Q5o4
$$ 84 174 91 -71 -153 -81 77 174 91 -75 -162 -92 78 172 90 -74 -163 -95 67 149 86 -77 -164 -97 71 156 92
8188I2j65r2P1
$$ 92 -73 -165 -94
8191i4
$$ Imaginary data points
##PAGE= N=2
##DATA TABLE= (X++(I..I)), XYDATA
0@%%%%%%%%%%%%%%%%kJ0j6J6j6J6j7K5l2L2m0M8n6O4p2Q2r0J04j20J36j53J70
$$ 0 0 0 0 0 0 0 0 0 0 0 0 0 0 0 0 0 -2 8 -8 8 -8 8 -9 16 -16 16 -24 24 -32 32 -40 42 -48 56 -64 72 -81 89
38H9j89K13k39K64k92L25l60L97m39M86n35N90o50P15p87Q68r59J060j175J304
$$ 89 -100 113 -126 138 -154 171 -189 208 -231 255 -280 310 -340 375 -412 456 -503 557 -618 686
58F86j454J631j838K090k401K797l321M049n144O997j0906L3697o5338r1958N4967
$$ 686 -768 863 -975 1115 -1286 1511 -1810 2239 -2905 4092 -6814 26883 -38455 -130413 -75446
73g5446J09187R2597l9961j29279q3050M8875J14807Q2458l7243j21571q3875
$$ -75446 33741 126338 86377 -42902 -125952 -77077 37730 120188 82945 -38626 -122501
84a22501M3568J18967P6887l9593j12245q1762L5912J20640P5645m3253j05776
$$ -122501 -78933 40034 116921 77328 -34917 -116679 -80767 39873 115518 72265 -33511
95c3511p6437K9281J17904P6955m4543j03702p0357K6646J11368P7615m1740j04283
$$ -33511 -109948 -80667 37237 114192 69649 -34053 -104410 -77764 33604 111219 69479 -34804
107c4804o6578K8350J03746P5305l5591j04420o6576L2161R8196O9787k9042j01754
$$ -34804 -101382 -73032 30714 106019 70428 -33992 -100568 -68407 29789 99576 70534 -31220
119c1220o9142L4871R5939O3318k4970r6298p1406L4245R5890N8841k4483r0099
$$ -31220 -100362 -65491 30448 93766 68796 -27502 -98908 -64663 31227 90068 65585 -24514
131b4514p0879L0468R5418N8008k6125q5709o7170K5906R2611N9804k7518q4275
$$ -24514 -95393 -64925 30493 88501 62376 -23333 -90503 -64597 28014 87818 60300 -23975
143b3975o1807K3060Q7422O1897k6862q4825n7282K2686Q1438O2280k4106q5239
$$ -23975 -85782 -62722 24700 86597 59735 -25090 -82372 -59686 21752 84032 59926 -25313
155b5313n5187K3892P6811O0254k0746q3859n5273K4914P4631N6747j8564q0283
$$ -25313 -80500 -56608 20203 80457 59711 -24148 -79421 -54507 20124 76871 58307 -21976
167b1976n6124K4358P4491N3485j8434p5630n6006K1978P4801N1822j9687p1550
$$ -21976 -78100 -53742 20749 74234 55800 -19830 -75836 -53858 20943 72765 53078 -18472
179a8472n4339J8920P4080N1756k0932o9161n1638J6676P1817N2239k0942o8345
$$ -18472 -72811 -53891 20189 71945 51013 -18148 -69786 -53110 18707 70946 50004 -18341
191a8341m9142J5990O8733N2062j9671o8045m7728J6610O5843N0746j7664o7211
$$ -18341 -67483 -51493 17240 69302 49631 -18414 -66142 -49532 16311 67057 49393 -17818
203a7818m7529J7385O4015M8639j5925o5500m7838J7599O3173M6544j5150o3220
$$ -17818 -65347 -47962 16053 64692 48767 -16733 -64571 -46972 16201 62745 47595 -15625
215a5625m7803J6977O2752M5132j5256o1064m6979J5826O2047M4553j5634n9538
$$ -15625 -63428 -46451 16301 61433 46177 -14887 -61866 -46040 16007 60560 44926 -14612
227a4612m5561J4768O0751M4433j5712n8668m4091J4201N9071M4188j5247n8097
$$ -14612 -60173 -45405 15346 59779 44067 -14601 -58692 -44491 14580 58768 43521 -14576
239a4576m2952J4060N7415M3603j4458n7392m2308J4090N6099M2682j3713n6372
$$ -14576 -57528 -43468 13947 57550 43092 -14300 -56608 -42518 13581 56263 42550 -13822
251a3822m1931J3976N5098M1741j3169n5135m1551J3573N4290M0939j2824n3915
$$ -13822 -55753 -41777 13321 55062 41893 -13242 -54793 -41220 13070 54009 41185 -12730
263a2730m1032J3038N3474M0320j2615n2812m0365J2510N2563L9835j2349n1838
$$ -12730 -53762 -40724 12750 53070 40455 -12357 -52722 -40212 12351 52186 39837 -12001
275a2001l9711J2051N1559L9365j1974n0957l9085J1657N0586L8850j1595n0085
$$ -12001 -51712 -39661 11898 51263 39289 -11668 -50753 -39096 11490 50340 38745 -11340
287a1340l8523J1341M9662L8288j1218m9184l7988J0988M8742L7767j0811m8280
$$ -11340 -49863 -38522 11140 49428 38210 -10974 -48962 -37974 10768 48535 37724 -10556
299a0556l7501J0607M7850L7240j0428m7410l6974J0227M6986L6729j0088m6512
$$ -10556 -48057 -37450 10400 47640 37212 -10198 -47172 -36945 10041 46770 36682 -9830
311i830l6461R830M6109L6263r722m5657l5936R421M5209L5822r343m4848l5402
$$ -9830 -46291 -36461 9648 45911 36189 -9468 -45404 -35983 9226 45048 35705 -9143 -44545
324d4545R082M4289L5350q904m4054l4934Q796M3374L4838q432m3252l4552Q555
$$ -44545 -35463 8826 44176 35272 -8782 -43716 -34920 8454 43292 34860 -8392 -42944 -34389
337c4389M2539L4226p974m2354l4234Q263M1837L3595p656m1348l3889P812M1277
$$ -34389 8150 42376 34402 -7952 -42186 -33923 7914 41509 33853 -7495 -41384 -33572 7705
350G705L3057p560m0356l3322P214M0651L2751p568l9541l2559O704L9811L2597
$$ 7705 40762 33202 -7154 -40476 -33262 7389 40140 32572 -6969 -39528 -32824 6987 39584
363C9584p493l9010l1703O383L8704L2453p122l8698l1015O433L7562L1971o449
$$ 39584 32091 -6919 -38622 -32239 6465 38918 31796 -6902 -37917 -31484 6078 38049 31600
376C1600l8309l0750O701L6717L1068n776l7525l0852O896L6382K9917n449l6317
$$ 31600 -6709 -37459 -30758 5959 37027 31251 -6274 -37126 -30230 6152 36069 30620 -5697
389e697l0943O595L6432K8997n654l4932l0646N842L6395K8671o227l3874k9738
$$ -5697 -36640 -30045 6387 35384 29730 -5202 -35848 -30006 6389 35060 28833 -5041 -34779
402c4779M908L5812K8915o539l3533k8537M456L4546K9230o219l3810k7558M777
$$ -34779 -29871 5941 34856 28317 -5216 -33753 -29297 5249 34479 28260 -5550 -33108 -28331
415b8331L2953K9043n184l4149k7257N659L1650K8131l929l3936k7646O470L1163
$$ -28331 4622 33665 28481 -5668 -32925 -27266 4384 32515 28586 -5350 -32996 -26526 4637
428D637K6730l151l2914k8184O532L1435K5568l330l1344k8189N588L1882K5293
$$ 4637 31367 28216 -4698 -32882 -26350 5085 30653 27323 -4021 -32210 -26622 5260 30553
441C0553m333l0043k7150M111L1709K6030n443k9645k5387K955L0575K7139n808
$$ 30553 26220 -3823 -30973 -26862 4847 30877 25434 -4211 -29598 -26643 3932 31071 25263
454B5263l0100k3777K763K8875K7678n139l0774k3116L504K7442K7052l834l0750
$$ 25263 -4837 -28614 -25851 3024 30702 25563 -5211 -28327 -24823 2619 29671 25837 -4913
467d913k3635M427K7046K5464k796k9543k4803M667K7812K3684k759k7480k5664
$$ -4913 -28548 -24121 2925 28389 25593 -3950 -28753 -24086 3726 27410 24651 -2829 -28493
480b8493L913K9036K2640l719k5489k5484K434K9717K2751m938k4520k4237J220
$$ -28493 -24580 4456 27096 23377 -2112 -27596 -25162 4555 27306 22368 -2152 -26389 -25169
493b5169K9095K3594n388k4876k2761J132K7318K4233m508k6011k1995K289K5363
$$ -25169 3926 27520 22132 -2744 -25505 -24373 2945 27178 22670 -3341 -25336 -23047 2316
506B316K3804k721k6847k2366L989K4183K2353r89k6618k3430N098K4139K0667
$$ 2316 26120 23399 -3448 -25814 -21825 2358 24711 23722 -2896 -26326 -21228 2911 23578
519B3578k69k5385k4271M991K4842J9681q44k3876k3984L729K5320J9993k222
$$ 23578 23309 -2076 -26347 -21356 3486 23167 22323 -1553 -25537 -21808 3512 23505 21283
532B1283k2976k2492K164K4866K1270l328k3174k0483J244K3371K2611l419k4102
$$ 21283 -1693 -24185 -22021 2845 24115 20787 -2387 -22870 -21626 1745 24356 20937 -3165
545c165j8968J403K1618K3009k533k4827j8654K304K0529K2183j378k4576j9382
$$ -3165 -22133 -20730 888 23897 21364 -3463 -22117 -19813 716 22899 21521 -3055 -22437
558b2437L051K0611K0637q18k3195k0351K913K1569J9305j229k1329k0775J912
$$ -22437 -19386 1225 21862 21044 -2151 -22502 -19589 1980 21285 20056 -1273 -22048 -20136
571b0136K2584J8822k289j9894k0204O10K2841J9185l208j9396j9085j64K2112
$$ -20136 2448 21270 18981 -913 -21117 -20507 2334 21519 18311 -1085 -20170 -20334 1778
584A778J9809l359j9802j8079O3K0771J9961k562k0490j7733J012J9560J9305
$$ 1778 21587 18228 -1574 -19653 -19590 1181 21142 18580 -1910 -19643 -18631 929 20234
597B0234j319k0720j8165K081J9021J8126l88k0174j8880K545J9210J7006k01
$$ 20234 18915 -1805 -19970 -17889 1132 19258 18870 -1304 -20184 -17639 1571 18577 18376
610A8376j9131j9197K199J9617J6508o94j8196j8793J406J9695J6717j388j7801
$$ 18376 -755 -19952 -17753 1864 18372 17678 -518 -19311 -17905 1790 18507 17119 -682
623f82j7825P37J9132J7281j754j7989j6775N55J8191J7645j597j8361j6130Q54
$$ -682 -18507 -17770 1362 18643 16889 -1100 -17875 -17320 871 18516 16919 -1442 -17572 -16718
637a6718J7294J7486j042j8528j6041J355J6775J6880n36j8221j6286J650J6777
$$ -16718 576 18062 17020 -1508 -17549 -16194 581 17461 16925 -1296 -17582 -15932 845
650H45J6112m01j7508j6479J529J7019J5590o81j6747j6326J105J7159J5416j095
$$ 845 16957 16556 -952 -17431 -15902 1117 16707 16026 -721 -17047 -15942 1217 16633 15538
664A5538j6219j5854O68J6943J5514j333j6042j5312M71J6471J5584j287j6065
$$ 15538 -681 -16535 -15867 1076 16590 15257 -785 -16097 -15626 845 16429 15142 -923
677i23j4892N44J5927J5463j026j6066j4698P68J5486J5132p23j5892j4674R70
$$ -923 -15815 -15271 656 16119 15093 -973 -15671 -14903 583 15715 14992 -900 -15574 -14604
691a4604J5279J4668n65j5539j4666R89J5204J4303n87j5128j4541Q73J5129J4065
$$ -14604 675 15343 14778 -761 -15427 -14438 766 15069 14482 -646 -15187 -14314 815 14880
705A4880o87j4783j4291P16J4946J3954p99j4542j3961N81J4671J3861p82j4402
$$ 14880 14193 -590 -14881 -14165 781 14735 13936 -606 -14567 -13986 685 14546 13764 -638
719f38j3682N56J4345J3736p10j4248j3475N78J4069J3549o29j4069j3306O13
$$ -638 -14320 -13764 581 14317 13607 -641 -14116 -13538 531 14080 13451 -618 -13924 -13311
733a3311J3829J3300n45j3843j3175O21J3652J3071n15j3581j3024N72J3475J2869
$$ -13311 518 13818 13273 -570 -13745 -13124 528 13599 13084 -497 -13521 -12949 526 13395
747A3395n11j3347j2837N08J3295J2703n19j3133j2631M58J3070J2556m88j2943
$$ 13395 12884 -463 -13300 -12792 503 13206 12687 -446 -13077 -12619 451 13007 12519 -424
761d24j2455M18J2847J2406m32j2759j2290L95J2629J2248l65j2586j2131L83
$$ -424 -12879 -12461 386 12792 12360 -399 -12689 -12294 335 12583 12218 -368 -12499 -12116
775a2116J2419J2073k92j2397j2018L83J2269J1862k82j2144j1902L27J2124J1713
$$ -12116 303 12376 12084 -313 -12331 -11948 321 12183 11901 -243 -12145 -11818 306 12019
789A2019k95j1906j1759K47J1993J1574l34j1736j1534J75J1809J1482l60j1616
$$ 12019 11724 -182 -11941 -11694 299 11873 11539 -197 -11731 -11556 253 11735 11375 -241
803b41j1284J30J1563J1411l11j1543j1098J83J1274J1299j83j1462j1002K88
$$ -241 -11525 -11395 168 11579 11268 -275 -11373 -11190 84 11383 11200 -262 -11264 -10976
817a0976J1050J1066k5j1315j0981L61J0965J0759O0j1041j0973L17J0942J0538
$$ -10976 74 11140 11115 -200 -11181 -10820 145 10904 10964 -77 -11050 -10733 209 10747
831A0747k2j0702j0873J48J0942J0428j84j0426j0641q3J0809J0496l44j0314
$$ 10747 10725 23 -10850 -10702 240 10668 10484 58 -10583 -10666 143 10639 10295 -19
845a9j0283k34J0518J0595l57j0370r945k09J0127J0580j58j0454r819LR787J0349
$$ -19 -10302 -10536 -18 10577 10220 -150 -10095 -10304 -177 10403 10245 -209 -10028 -10025 -238 10111
861A0111J49j0365r924K18R685R914L47j0054j0132K96R848R462L07r569j0219
$$ 10111 10260 -105 -10029 -9811 -126 9788 10135 81 -10051 -9755 93 9555 9862 293 -9926
876i926R7J0063R247M7r124j0058k49J0109R344k78q976r614n12R836R560l54
$$ -9926 -9829 234 9481 9528 404 -9654 -9903 206 9550 9272 296 -9318 -9830 6 9566 9212
892I212r138r145m64R277R717j09r448q920j10Q734R552L63r642r012L37Q465
$$ 9212 74 -9071 -9535 -258 9459 9350 -98 -9018 -9128 -394 9158 9521 -121 -9133 -8796 -331
908c31R097P67r476r325O04Q545Q600Q41r018r513M27Q871Q344N05q513r336n3
$$ -331 8766 9533 57 -9268 -8664 -119 8481 9322 304 -9209 -8782 89 8433 8938 425 -8911 -8964
925h964R060Q515l8q231q800n72Q896Q953m05q349q150p65Q403R332l86q700p720
$$ -8964 96 8611 8573 342 -8458 -9030 -134 8819 8414 65 -8085 -8850 -447 8885 8499 -201 -7921
942g921o03P863R332Nq932p764j61P574Q901M29q761q190J65P745Q235O13q225
$$ -7921 -8524 -661 8671 8676 -256 -8020 -8181 -607 8294 8723 -38 -8228 -8063 -318 7917 8530 305
959C05q622J28Q237P691L85p527q777k66Q668P590j02p039q512p55Q723P852m64
$$ 305 -8317 -8189 48 7739 8124 597 -8180 -8446 222 7812 7710 671 -7841 -8596 127 7979 7515
976G515p031p979r56Q299Q207m36p427p547p10P650Q275L8p866p497j56P118P969
$$ 7515 484 -7495 -8451 -152 8055 7619 192 -7355 -8065 -415 7860 7898 32 -7465 -7621 -503 7466
993G466O61q024p792L63O961P410J079p776q192N36P179O957J022p257q332K40
$$ 7466 8127 103 -7689 -7326 -365 7045 8124 348 -7844 -7308 -129 6828 7850 593 -7739 -7499
1009g499P505O855O21o821q039k91P575P176J56o742p436p20P281P667p7p006
$$ -7499 6 6861 7482 661 -7378 -7669 -94 7082 7238 496 -6940 -7660 -379 7288 7211 205
1025B05o849p74O751P945P7p354o599m93O284P861M37p499o709j52O166P431P38
$$ 205 -6644 -7418 -667 7278 7355 1 -6598 -7091 -807 7054 7491 -8 -6717 -6869 -703 6728 7466
1042G466p261p053MO385O928P55o741p318j63O756O651M73o221p288n46P008O647
$$ 7466 205 -6848 -6844 -459 6469 7224 483 -6835 -6998 -242 6409 6882 661 -6627 -7173 -165 6482
1059F482J27n946o993q66O904O891q2n999o627r34O558P093j2o263o376p26O144
$$ 6482 6609 663 -6330 -7196 -292 6599 6517 518 -6109 -7043 -485 6608 6596 333 -6043 -6769 -625
1076f25P025L37o443o414l93N890O751O75o405o642j43N901O358Q39o154o814
$$ -625 6400 6737 294 -6120 -6513 -623 6128 6803 398 -6244 -6387 -486 5872 6711 557 -6257
1092f257j50O048O129P38n819o824l50O171O112N14n630o603n84O119O259L36
$$ -6257 -6407 -359 5770 6508 689 -6135 -6485 -314 5798 6312 682 -5921 -6505 -386 5873 6209
1108F209n613o291p21N897O412K99n714o066o80N619O457M41n843n975n24N402
$$ 6209 596 -5695 -6416 -519 5893 6192 478 -5588 -6268 -649 5808 6249 406 -5569 -6093 -691
1124f91O341O07n834o031l83N358O110P23n684o126l54N416N918P00n453o140
$$ -691 5650 6257 423 -5608 -5991 -633 5477 6200 516 -5610 -5964 -548 5370 6070 617 -5523
1140e523m54N491N815O00n260o064o00N512N830M79n168n903p04N404N884M35
$$ -5523 -5977 -486 5329 5929 669 -5395 -5995 -483 5347 5826 658 -5245 -5949 -545 5339 5774
1156E774n179n742p05N229N913M73n219n642o40N078N823N84n204n641n41M988
$$ 5774 595 -5147 -5852 -623 5290 5763 544 -5098 -5738 -660 5163 5747 543 -5098 -5639 -651
1172f51N693O73n138n662n06M971N586O74n017n648n26M980N479O39m894n597
$$ -651 5042 5715 577 -5085 -5591 -620 4966 5640 623 -5025 -5551 -571 4908 5547 653 -4944
1188d944n80M975N431N82m802n510o32M891N447N35m756n403o53M776N450N64
$$ -4944 -5524 -549 4882 5464 662 -4848 -5480 -589 4858 5393 637 -4766 -5419 -643 4807 5371
1204E371m764n311o33M683N380N97m721n253o17M608N298O53m689n233n67M552
$$ 5371 607 -4704 -5337 -654 4726 5323 602 -4651 -5268 -660 4638 5291 602 -4631 -5198 -646
1220f46N200O58m565n231n76M549N112O50m484n180o12M522N069O03m402n091
$$ -646 4554 5212 647 -4584 -5160 -611 4501 5151 667 -4513 -5125 -603 4466 5069 667 -4424
1236d424o58M470N059N53m348n004o75M373N048N70m345m902o70M263N007O13
$$ -4424 -5082 -612 4447 5000 652 -4352 -5027 -654 4394 4964 619 -4283 -4953 -690 4317 4930
1252D930m325m864o06M163M932O73m288m854n59M118M819P17m174m886n60M143
$$ 4930 605 -4259 -4865 -702 4230 4903 615 -4239 -4798 -680 4139 4856 682 -4204 -4764 -621
1268f21M705O87m052m858o25M177M648O10l946m763p17M144M662N50l896m650
$$ -621 4084 4771 719 -4139 -4764 -587 4061 4671 725 -4038 -4755 -611 4051 4601 705 -3945
1284c945p61M037M708N21l921m520p29L877M713N99l983m474o12L743M617P27
$$ -3945 -4706 -669 4039 4560 639 -3881 -4610 -733 3980 4579 596 -3878 -4490 -747 3870 4597
1300D597l981m504n06L681M460Q29l881m588m79L726M319Q09l728m592n66L810
$$ 4597 616 -3888 -4394 -713 3747 4576 695 -3893 -4372 -646 3673 4482 754 -3838 -4404 -594
1316e94M254P00l579m507p00L831M306N40l508m333q16L708M448M51l569m115
$$ -594 3660 4360 781 -3726 -4426 -595 3711 4251 743 -3590 -4406 -698 3750 4201 632 -3483
1332c483q50L552M501N22l679m023p20L334M465O77l729m078n66L283M266Q15
$$ -3483 -4333 -781 3720 4242 563 -3460 -4180 -846 3619 4296 567 -3511 -4077 -794 3472 4287
1348D287l625m219m91L380M024Q31l387m342n59L543L890P06l148m340p26L627
$$ 4287 662 -3557 -4048 -668 3356 4187 800 -3542 -4101 -558 3332 4038 890 -3450 -4176 -549
1364e49L919N36l032m172r07L593M032M19l065l962r36L373M172M79l246l809
$$ -549 3370 3906 874 -3298 -4205 -612 3420 3839 774 -3188 -4124 -751 3421 3900 654 -3155
1380c155p97L118M149P03l417l828n53K945L979R49l442l980l56K958L726J058
$$ -3155 -3952 -834 3315 4018 601 -3227 -3780 -835 3144 4093 651 -3329 -3685 -727 2999 4057
1396D057l276m132l47L085L560R70l043m134n69L241L590P45k880l958p98L238
$$ 4057 781 -3351 -3698 -613 2947 3917 874 -3260 -3829 -588 3002 3747 867 -3091 -3889 -651
1412f51L781N11k896l637r70L042M016M53l053l398r51K808M109N65l207l331
$$ -651 3130 3641 745 -2892 -3862 -820 3196 3649 596 -2802 -3753 -945 3164 3729 522 -2809
1428b809p80K620L991P82l235l478n88K635L719R33l055l712n51K828L453Q91
$$ -2809 -3589 -969 3022 3804 569 -2909 -3497 -862 2857 3790 735 -2977 -3528 -700 2753 3644
1444C644k757l848o79L056L332O95k504l760r12L165L405M76k415l573j056L060
$$ 3644 887 -2961 -3640 -584 2748 3443 939 -2821 -3733 -568 2837 3313 898 -2675 -3731 -671
1460f71L578M06k546l361j022K815L685N52k777l264q11K574L585P96k894l364
$$ -671 2907 3313 767 -2594 -3616 -801 2884 3436 659 -2605 -3416 -842 2743 3539 645 -2719
1476b719n42K450L388J000k847l535m04K513L136J050k654l652m58K673L036R16
$$ -2719 -3261 -811 2577 3577 730 -2805 -3209 -696 2440 3490 836 -2816 -3274 -601 2435 3351
1492C351k473l595o45K769L099P09k387l378q28K691L299N54k453l123q99K502
$$ 3351 878 -2717 -3362 -593 2506 3215 828 -2550 -3378 -687 2612 3166 713 -2410 -3309 -807
1508h07L460N48k603k955q22K298L483O78k708k963o62K187L343Q28k686l092
$$ -807 2653 3201 598 -2357 -3179 -881 2602 3280 572 -2391 -3053 -866 2477 3305 619 -2473
1524b473n46K236L122R03k522l223n56K380K985P98k304l265o79K523K943O57
$$ -2473 -3019 -783 2339 3242 720 -2503 -3059 -679 2306 3104 800 -2465 -3144 -621 2322 2979
1540B979k157l174q37K558L009N41k149l016r00K449L120N10k245k874q64K295
$$ 2979 822 -2352 -3189 -631 2378 2919 770 -2246 -3146 -697 2423 2933 688 -2186 -3050 -755
1556g55L139O17k361k860p13K168L051P44k385k923n90K133K927Q11k303l007
$$ -755 2384 3001 640 -2220 -2933 -765 2286 3030 645 -2278 -2868 -735 2192 3003 700 -2307
1572b307n49K192K796Q09k194l049n76K261K734P29k082l012o59K281K800O20
$$ -2307 -2856 -664 2132 2941 747 -2302 -2878 -617 2117 2846 764 -2248 -2907 -626 2174 2794
1588B794k063k866p60K227K875N74k111k745p53K119K897O16k174k690p01K030
$$ 2794 731 -2135 -2895 -668 2207 2781 670 -2075 -2828 -709 2188 2804 630 -2060 -2761 -731
1604g31K883O52k188k701o22J988K803P12k155k740n81K009K681P31k075k766
$$ -731 2152 2804 616 -2085 -2707 -719 2084 2796 641 -2099 -2680 -671 2010 2741 666 -2100
1620b100n98K065K625O83j976k755o49K096K608O25j930k692o93K071K644N73
$$ -2100 -2698 -633 1992 2675 699 -2056 -2705 -609 1999 2624 694 -1998 -2691 -620 2024 2597
1636B597j930k621o93K012K648N70j978k540o71J952K638O20k010k533o01J876
$$ 2597 667 -1954 -2647 -635 2013 2583 605 -1935 -2606 -654 1984 2604 594 -1939 -2540 -664
1652f64K596O40j978k545n59J885K515O51j931k554n58J903K478O29j883k541
$$ -664 1932 2572 594 -1951 -2510 -625 1890 2541 610 -1944 -2502 -599 1879 2508 625 -1916
1668a916n78J936K428N95j849k479o06J907K451N43j844k413o18J868K467N21
$$ -1916 -2494 -558 1870 2465 616 -1863 -2469 -562 1889 2432 588 -1825 -2443 -575 1892 2413
1684B413j845k374o05J830K438N45j854k355n61J773K406N74j846k359n18J765
$$ 2413 568 -1806 -2411 -581 1857 2402 548 -1807 -2368 -595 1811 2385 539 -1820 -2338 -573
1700e73K344N96j805k383n15J793K297N81j767k365n22J812K272N19j708k325
$$ -573 1771 2367 562 -1821 -2336 -543 1754 2335 568 -1797 -2319 -507 1765 2284 576 -1749
1716a749n63J805K284M82j707k265n73J762K305M50j719k201n61J710K299M82
$$ -1749 -2312 -507 1777 2259 552 -1713 -2286 -524 1781 2231 512 -1689 -2250 -540 1759 2241
1732B241j764k165n25J669K274N08j779k177m55J648K211N32j722k223m36J696
$$ 2241 477 -1688 -2213 -544 1730 2238 459 -1718 -2173 -525 1686 2218 496 -1727 -2163 -467
1748d67K125N21j660k241m39J733K093M72j605k211n00J769K090M04j581k130
$$ -467 1658 2179 519 -1722 -2161 -428 1665 2137 532 -1679 -2179 -410 1680 2084 503 -1627
1764a627n36J719K148L70j616k061n31J660K160M07j678k025m60J573K137M60
$$ -1627 -2163 -444 1704 2074 458 -1603 -2134 -474 1686 2093 415 -1610 -2070 -497 1640 2100
1780B100j704k041l77J537K069N31j687k104l16J563J977N42j639k116l37J608
$$ 2100 396 -1645 -2022 -485 1584 2115 428 -1676 -1992 -429 1548 2090 451 -1665 -2002 -394
1796c94J934M97j553k114l91J644J957L98j520k026m69J628K033L23j546j910
$$ -394 1540 2037 484 -1630 -2021 -377 1580 1978 458 -1568 -2037 -409 1624 1947 401 -1509
1812a509m95J549K089L05j605j828m62J481K083L57j659j823l79J429K026M32
$$ -1509 -2004 -455 1634 1939 334 -1494 -1956 -475 1608 1965 306 -1517 -1896 -467 1559 1991
1828A991j649j900l08J449J911M64j569j965l10J552J812M19j444k011l71J645
$$ 1991 342 -1558 -1866 -417 1494 1958 389 -1576 -1886 -334 1478 1897 453 -1558 -1929 -284
1844b84J778L23j362j956m58J660J836K31j368j852m97J614J894K26j440j769
$$ -284 1494 1817 455 -1501 -1959 -299 1537 1768 400 -1452 -1949 -335 1559 1785 345 -1424
1860a424m62J486J933K96j536j755l23J374J885M06j577j801k28J364J768M87
$$ -1424 -1886 -400 1533 1829 293 -1462 -1785 -411 1474 1880 303 -1498 -1726 -362 1406 1893
1876A893j538j898j81J430J661M74j446j924k20J496J644L72j349j896l17J544
$$ 1893 355 -1543 -1724 -294 1367 1841 395 -1529 -1749 -253 1391 1763 414 -1482 -1799 -255
1892b55J689K78j363j760l99J498J802K02j410j641m19J403J879K32j518j574
$$ -255 1434 1712 349 -1411 -1810 -312 1490 1692 282 -1359 -1778 -375 1504 1736 218 -1356
1908a356l47J303J874K96j563j595k52J269J782L57j519j685j86J331J653L78
$$ -1356 -1703 -400 1474 1770 207 -1388 -1640 -371 1411 1768 249 -1436 -1622 -291 1362 1740
1924A740j420j775k11J434J585L17j320j763l15J516J585K20j243j723l81J520
$$ 1740 320 -1455 -1666 -232 1353 1670 350 -1413 -1728 -212 1373 1593 350 -1373 -1754 -234
1940b34J659J43j274j612m08J444J716J63j356j557l36J343J719K29j420j561
$$ -234 1425 1568 294 -1318 -1726 -282 1434 1597 241 -1316 -1652 -309 1410 1639 219 -1342
1956a342k43J291J647L39j463j612j58J280J567L72j408j693j38J346J488L42
$$ -1342 -1585 -294 1353 1692 229 -1383 -1541 -261 1306 1678 270 -1423 -1561 -215 1273 1615
1972A615j318j712j75J391J489K75j273j661k55J415J549J77j256j566l13J378
$$ 1615 297 -1415 -1590 -199 1290 1565 292 -1369 -1624 -209 1340 1517 261 -1305 -1618 -240
1988b40J621J52j317j486k92J288J662J74j388j445k56J232J663K22j402j491
$$ -240 1381 1533 216 -1270 -1562 -274 1388 1562 174 -1271 -1527 -295 1368 1590 188 -1303
2004a303j96J236J583K60j376j539j54J266J496K73j300j587j82J346J440K33
$$ -1303 -1499 -263 1320 1580 204 -1335 -1489 -223 1273 1546 246 -1341 -1523 -177 1263 1496
2020A496j235j591k23J385J444J82j224j528k60J360J519J24j235j468k70J316
$$ 1496 261 -1330 -1553 -168 1276 1458 234 -1294 -1554 -194 1325 1449 214 -1254 -1524 -208
2036b08J519J71j303j426k29J257J528J98j338j441j74J240J489K25j320j491
$$ -208 1311 1482 179 -1247 -1476 -219 1309 1507 169 -1272 -1446 -206 1283 1508 188 -1303
2052a303j26J230J437K60j298j522j28J273J416K15j244j520j51J300J403J90
$$ -1303 -1429 -199 1238 1498 200 -1322 -1450 -177 1239 1454 210 -1310 -1461 -161 1242 1432
2068A432j236j467k06J303J442J44j222j410k38J279J459J51j248j393k06J217
$$ 1432 196 -1271 -1477 -174 1268 1412 190 -1220 -1458 -179 1280 1431 183 -1210 -1416 -199
2084a99J476J57j277j384j76J201J453J80j269j407j57J216J400K09j245j434
$$ -199 1277 1434 157 -1227 -1403 -202 1251 1431 162 -1245 -1402 -186 1214 1423 178 -1256
2100a256j29J207J381K07j221j443j46J249J360J69j177j421j83J260J364J48
$$ -1256 -1385 -178 1203 1410 189 -1254 -1400 -151 1209 1378 201 -1220 -1403 -143 1221 1369
2116A369j168j398k07J246J382J49j193j355k05J206J390J53j198j358j70J181
$$ 1369 201 -1197 -1404 -158 1224 1373 180 -1175 -1380 -174 1216 1369 171 -1187 -1357 -176
2132a76J380J64j215j344j54J169J349J93j209j362j20J163J321J95j186j370
$$ -176 1204 1368 153 -1191 -1345 -176 1173 1366 157 -1205 -1325 -162 1159 1354 168 -1202
2148a202j29J182J302J61j127j370j59J207J299J57j141j337j74J180J328J37
$$ -1202 -1331 -149 1153 1314 187 -1183 -1342 -135 1164 1321 180 -1157 -1331 -151 1177 1314
2164A314j162j289j74J156J330J36j178j268j55J112J337J53j184j273j19J112
$$ 1314 152 -1137 -1311 -155 1175 1311 133 -1135 -1290 -178 1159 1312 128 -1145 -1264 -152
2180a52J292J72j178j293j12J118J269J75j138j305j17J144J250J41j110j281
$$ -152 1140 1312 134 -1159 -1271 -153 1116 1291 153 -1152 -1269 -125 1125 1266 156 -1125
2196a125j52J152J245J32j101j269j48J141J270J09j106j242j79J135J289R8j137
$$ -1125 -1277 -125 1120 1252 151 -1118 -1266 -125 1145 1254 148 -1094 -1273 -138 1151 1249 112
2213A12j202j65J098J286J12j128j204j29J072J255J38j125j235j05J082J228
$$ 112 -1090 -1255 -157 1129 1241 113 -1091 -1220 -148 1107 1245 120 -1115 -1220 -138 1090
2229A090J40j093j248j17J124J175J38j045j260j43J142J177J21j027j249j51
$$ 1090 1230 137 -1111 -1228 -104 1071 1209 164 -1096 -1239 -97 1080 1201 174 -1075 -1226
2245a226J135J181R2j037j208j48J091J211Q8j060j162j59J066J208J31j095j171
$$ -1226 -91 1090 1182 145 -1063 -1211 -120 1091 1179 119 -1043 -1202 -136 1072 1203 108 -1063
2262a063j02J014J207J58j101j192o7J013J147J90j072j204o1J021J130J86j058
$$ -1063 -1165 -151 1056 1214 113 -1079 -1146 -133 1014 1204 132 -1072 -1133 -112 1018 1204 146
2279A46j212q1J050J130J29j023j183j07J048J152Q7j007j143j42J028J183P3
$$ 146 -1066 -1147 -97 1033 1162 139 -1044 -1151 -103 1049 1136 129 -1014 -1156 -128 1055 1128
2296A128j031j085j49R89J195J04j071j068j31R50J197J19j067j069j12R54J144
$$ 1128 97 -988 -1137 -148 1047 1151 80 -988 -1119 -169 1028 1147 80 -989 -1101 -147 997
2313I97J40j017j125j00R91J102J39j002j128j15J036J068J11r46j135j41J058
$$ 997 1137 120 -1005 -1105 -114 988 1127 125 -1003 -1118 -82 986 1097 151 -984 -1125 -67
2330f7J066O5r27j100j74J041J090M4r15j061j78R85J124O0r62j040j38R47J097
$$ -67 999 1064 137 -963 -1137 -96 994 1038 123 -938 -1116 -131 993 1053 91 -949 -1087 -140 957
2349I57J23r90j035j08R18J070J60r80j095n3R17J025J83r57j109o4R48R90J70
$$ 957 1080 90 -945 -1053 -135 935 1095 115 -980 -1033 -116 909 1092 135 -974 -1038 -90 900 1070
2368A070r21j111q5R55R99J25q83j072j34R39J044R2r05j009j69R20J077Q7r28
$$ 1070 149 -962 -1047 -92 907 1032 149 -923 -1057 -118 926 1018 113 -896 -1065 -145 932 1019 91
2387I1r85j46Q66J092J11r47r68j20Q41J066J40r45r83r7Q43J022J61r15j026
$$ 91 -894 -1040 -174 918 1029 82 -886 -1006 -165 901 1041 96 -887 -984 -141 881 1042 127 -899
2406h99r1Q73R83J43q64j043j06R03R61J11q16j032j39R18R72P4q06r97j79R10
$$ -899 -990 -117 866 1009 145 -898 -1004 -101 860 971 155 -877 -1016 -98 874 948 142 -855 -1034 -124
2426a24R90Q3q26r59j68Q62J008R5q64r31j31Q13J005J38q80r63j00Q08R57J71
$$ -124 866 949 123 -836 -1004 -142 866 961 97 -834 -965 -152 853 991 111 -852 -952 -144 813 984
2446I84q61r80o6Q03R27J79q49j007o9Q35R04J52q03r89j20Q47R21J18p96r44
$$ 984 123 -857 -923 -120 807 986 137 -870 -939 -104 800 952 149 -840 -960 -113 808 926 130 -814
2466h14j48Q36R52R6q09r05j54Q06R79Q2q20q81j56P82R83J05q32q82j24P53R54
$$ -814 -962 -126 826 922 113 -792 -946 -140 839 921 101 -780 -936 -154 829 934 102 -780 -904 -151 803
2487H03J37q32r01j00P64R01J50p87r27j19Q04Q65J42p48r41j34Q23Q68J18p40
$$ 803 940 108 -793 -893 -129 772 922 135 -792 -911 -107 758 900 152 -789 -923 -100 768 886 146
2507A46r21j50Q22Q76J10p44q99j52P84R12Q9p51q63j42P46R04J27p72q68j31
$$ 146 -775 -925 -103 773 883 139 -760 -912 -128 784 873 122 -741 -883 -137 767 894 122 -746 -877
2527h77P30Q98J51p71q86j01P14Q75J65p70q77j00P13Q39J92p56q97j16P39Q45
$$ -877 -147 751 902 131 -755 -856 -142 733 898 128 -749 -849 -136 703 895 139 -758 -874 -135 710
2547G10J47p06q88j38P45Q39J31p00q48j54P21Q65J20p06q19j83P18Q75J19p26
$$ 710 857 151 -737 -875 -130 709 840 140 -708 -862 -141 724 844 138 -681 -864 -146 729 848 122
2567A22q12j42O88Q54J39p13q21j35O67Q51J51p18q25j24O74Q12J69o88q59j23
$$ 122 -690 -832 -144 710 849 136 -685 -820 -153 698 849 131 -694 -818 -144 668 837 149 -710 -833
2587h33P02P96J51o62q41j47O96Q05J37o58q26j46O84Q17J22o46q21j45O71Q23
$$ -833 -131 665 816 154 -687 -834 -138 667 804 146 -680 -826 -142 675 797 151 -670 -815 -144 679
2607F79J34o72p91j46O37Q26J54o75q07j32O43Q09J43o68p94j28O48P72J65o55
$$ 679 813 141 -650 -796 -159 667 821 146 -661 -793 -150 659 802 134 -660 -788 -140 632 797 142
2627A42p99j30O43P69J64o39p96j39O45P72J49o27p85j56O43P73J43o10p75j64
$$ 142 -657 -787 -144 625 789 150 -646 -785 -140 632 781 154 -631 -787 -144 629 772 162 -613 -777
2647g77O38P81J36o39p51j52O01P87J51o32p52j52O04P73J61o40p60j21N88P45
$$ -777 -139 642 778 139 -612 -764 -163 624 775 143 -609 -761 -157 616 777 137 -623 -744 -156 589
2667E89J73o14p67j36N97P34J84o04p75j29O08P31J46n76p47j62N99P60J22n74
$$ 589 762 148 -619 -755 -158 576 760 156 -619 -748 -140 591 737 161 -586 -748 -149 611 733 159
2687A59p31j69N82P58J24n65p24j89N98P51J43o04o98j58N56P38J59n85p15j53
$$ 159 -572 -741 -159 599 723 158 -566 -755 -157 594 737 133 -565 -723 -167 571 730 145 -570 -723
2707g23N68P18J64n76p27j41N62P10J64n57p32j60N86O92J56n33p23j76N90O94
$$ -723 -155 563 727 151 -576 -717 -155 555 719 162 -570 -730 -144 548 704 171 -552 -728 -138 556
2727E56J36n22p19j64N82O83J47n37o90j74N62O89J51n48o86j61N29P01J62n55
$$ 556 692 170 -549 -713 -131 552 699 162 -528 -702 -140 549 700 152 -534 -695 -166 535 697 142
2747A42o86j34N10O83J90n56p07j27N26O61K00n41p01j35N33O50J77n20o92j47
$$ 142 -544 -678 -168 515 705 149 -558 -685 -159 502 702 161 -540 -675 -142 508 685 165 -527 -674
2767f74N27O69J58n16o83j65N28O79J43n15o41j95N12P05J33n22o36j76M77P05
$$ -674 -147 522 680 164 -519 -684 -156 523 666 151 -490 -685 -173 532 665 143 -493 -669 -192 513
2787E13J56n37o41j49M76O86J63n26o37j53M75O65J77n07o63j48M92O35J72m69
$$ 513 669 132 -509 -658 -182 504 667 141 -496 -649 -174 491 668 161 -502 -650 -158 477 649 180
2807A80o71j74N20O28J58m51o55k13N25O46J46m59o44k10M99O52J63m78o32j90
$$ 180 -491 -665 -145 483 641 190 -465 -678 -153 493 639 180 -464 -674 -175 477 640 162 -470 -660
2827f60M71O58J76m95o09j87M50O47K09m90o45j51M46O28K00m72o53j53M56O08
$$ -660 -189 469 645 150 -459 -646 -196 451 660 170 -475 -626 -180 448 648 176 -477 -630 -174 434
2847D34K13m53o67j48M54O03K04m46o42j93M69O15J88m46o19k04M46O34J70m31
$$ 434 647 194 -473 -621 -167 436 640 194 -448 -641 -172 443 631 185 -434 -638 -192 442 612 181
2867A81o04k04M28O49J71m58n82k06M21O44J99m69n93k00M17O36J90m37o14j85
$$ 181 -423 -627 -199 450 621 163 -419 -625 -204 440 639 170 -423 -623 -206 430 620 183 -431 -616
2887f16M36N90K10m05o34k04M41N95J90l92o29k10M50N83J86l77o34k16M45N90
$$ -616 -180 410 620 215 -419 -623 -182 413 603 211 -418 -628 -178 405 591 214 -420 -636 -191 399
2907C99J92l93o03k27M35N94J88l95n98k04M17N95K09m11n96j91L85N91K25m22
$$ 399 591 198 -405 -632 -197 397 585 190 -408 -612 -195 400 609 198 -398 -589 -204 387 612 190
2927A90n92j70L66N82K37m02o12j80L73N79K35l88o10j91L88N70K22l82n97k15
$$ 190 -402 -572 -206 376 613 211 -401 -581 -208 371 606 218 -392 -583 -195 375 597 215 -382 -597
2947e97L83N87K06l60n82k31L66O08J93l75n58k30L55O14K08l84n56k31L57O02
$$ -597 -214 373 579 219 -363 -594 -228 380 573 198 -360 -590 -235 379 587 203 -353 -584 -227 375
2967C75K17l70n71k30L43N93K31l56n82k26L56N65K26l50n83k17L50N58K30l27
$$ 375 592 222 -349 -579 -236 357 588 232 -350 -576 -220 345 571 221 -362 -579 -229 329 559 232
2987B32n80k43L69N52K19l24n70k47L66N63K27l41n52k54L50N73K19l34n56k31
$$ 232 -348 -591 -222 330 549 225 -345 -592 -226 337 564 223 -329 -583 -233 340 559 225 -331 -562
3007e62L28N78K25l39n56k36L25N55K54l37n66k23L14N59K56l45n65k18L16N45
$$ -562 -234 344 569 230 -326 -562 -237 318 572 235 -331 -554 -240 319 575 230 -335 -553 -237 308
3027C08K58l25n74k36L30N40K44l04n63k57L46N44K24l04n45k49L25N62K23l00
$$ 308 566 241 -333 -569 -239 301 545 241 -322 -579 -233 311 535 231 -314 -563 -238 324 547 247
3047B47n48k59L10N70K24l12n35k51L04N52K49l08n52k48L00N42K66k97n66k42
$$ 247 -301 -560 -250 320 544 232 -303 -554 -250 302 551 243 -309 -557 -257 285 551 254 -312 -554
3067e54L04N16K79k90n47k59K94N46K48k82n53k59K96N34K65k85n39k62K91N43
$$ -554 -250 266 545 255 -292 -551 -257 289 537 255 -298 -557 -261 273 538 253 -286 -548 -257 286
3087B86K56k81n30k74K82N56K42k79n34k63K75N33K76k86n33k65K61N43K78k82
$$ 286 542 261 -269 -543 -261 295 537 258 -276 -539 -264 269 545 259 -274 -539 -278 265 543 261
3107B61n45k68K85N26K83k63n62k56K67N08K94k61n43k64K70N21K81k52n46k61
$$ 261 -284 -552 -267 259 542 279 -283 -539 -272 236 530 269 -274 -538 -268 253 534 282 -264 -525
3127e25K71N12K68k44n29k76K54N31K69k52n11k91K40N44K79k62n18k77K30N26
$$ -525 -254 258 526 282 -247 -523 -269 262 531 279 -232 -523 -283 261 540 278 -240 -517 -287 239
3147B39K97k70n14k83K41N13L03k53n23k76K31N15L07k37n30k78K32N24K80k32
$$ 239 536 266 -248 -531 -290 223 526 273 -250 -526 -295 220 527 290 -240 -518 -286 238 518 286
3167B86n30k86K39N31K88k34n09l10K40N23K87k31n14l01K19N30K79k24n01l05
$$ 286 -244 -530 -291 240 528 294 -215 -525 -285 238 525 294 -220 -521 -302 228 507 283 -218 -523
3187e23K11N35K83k18n08l01K17N15L07k19n14l07K18N11L04k00n29k98K24M82
$$ -523 -312 223 506 288 -220 -521 -304 211 518 299 -215 -522 -304 207 511 311 -218 -516 -292 190
3207A90L13j84n14l23K25M98K94j85n12l13K06N10K98j92m98l29J96N15L16k08
$$ 190 503 319 -195 -518 -293 205 499 314 -198 -511 -305 205 503 311 -187 -516 -320 195 511 303
3227C03m94l01J74M99L18j89n09k97J79N01L22j97n01k99J81M87L20j76n08k97
$$ 303 -191 -492 -318 181 499 310 -199 -496 -317 184 506 309 -192 -491 -310 177 497 321 -187 -484
3247d84J70M93L24j79m98l29J84M94L27j80m85l36J76N04L23j87m79l39J70N14
$$ -484 -314 179 503 324 -174 -503 -319 175 502 322 -163 -499 -323 181 504 317 -162 -501 -331 183
3267A83L05j64m78l43J57N03L25j69m87l15J51M85L36j58n00l12J58M80L32j43
$$ 183 488 324 -154 -497 -340 163 488 319 -168 -483 -332 153 489 331 -169 -481 -323 157 489 346
3287C46n07l29J69M81L29j52n03l22J63M72L41j37m94l46J61M74L31j40m86l31
$$ 346 -161 -490 -321 160 489 337 -166 -488 -325 147 488 351 -143 -489 -328 146 477 337 -149 -480
3307d80J47M75L40j51m75l39J40M95L28j59m58l42J39M78L46j54m81l19J39M64
$$ -480 -333 142 482 331 -144 -483 -343 152 480 321 -137 -479 -340 138 484 330 -151 -470 -331 133
3327A33L65j58m84l18J29M69L43j31m73l40J32M56L51j28m68l42J30M66L31j17
$$ 133 498 340 -144 -462 -333 136 479 348 -125 -465 -333 123 474 346 -122 -464 -334 132 463 346
3347C46m55l66J29M70L46j21m67l64J33M86L20j14m44l69J10M82L39j13m65l40
$$ 346 -109 -475 -346 124 470 349 -118 -482 -349 137 457 343 -101 -470 -360 122 461 348 -117 -457
3367d57J01M73L47j02m75l57J33M43L59q4m83l61J23M51L51q8m80l61J31M40L59
$$ -457 -356 117 464 362 -113 -470 -337 106 465 381 -102 -463 -340 111 462 374 -106 -467 -336 104 463
3388D63r8m70l55J17M31L63q4m73l60J06M58L53r1m55l54Q5M54L75j10m57l41
$$ 463 365 -105 -460 -343 88 451 367 -106 -466 -360 98 451 360 -95 -449 -364 90 465 355 -102 -443
3409d43P6M58L80r9m58l65Q1M62L69q6m61l54P9M48L69r3m40l66P2M47L67p1m51
$$ -443 -367 91 471 372 -86 -451 -370 92 461 375 -86 -440 -361 87 456 363 -77 -443 -371 76 443 372 -79
3432g9l81Q0M45L83p8m40l90Q6M41L73o9m48l83Q3M49L72o9m24l90O6M49L70o9
$$ -79 -460 -380 65 448 370 -70 -460 -374 67 440 371 -77 -460 -377 72 444 375 -49 -439 -373 76 446 377
3455C77m34l74M8M56L71o5m45l76O4M31L97n7m41l93N5M27L88l8m49l89N6M38
$$ 377 -57 -431 -383 73 444 379 -66 -442 -378 53 450 393 -48 -441 -386 41 429 391 -58 -447 -391 47
3477D7L87m7m34l94M0M51L80l8m31l91M2M43L75l3m31l98N1M28M03n0m27l95K6
$$ 47 434 387 -47 -441 -401 50 430 392 -39 -430 -388 55 430 397 -34 -432 -381 47 450 400 -27 -422 -396
3500c96M46L90n1m20l86J7M31M08m1m29l92K7M19M01j9m32l90K5M16L96j6m27
$$ -396 50 440 389 -31 -417 -400 31 439 398 -31 -423 -396 23 424 405 -27 -417 -392 24 420 404 -23
3522b3m02L0M17L96j1m17m14L1M24L94k4m06m08J0M29L88nm01m14NM21M04j6m07
$$ -23 -425 -395 22 418 407 -10 -424 -393 31 425 401 -5 -413 -403 26 414 409 8 -406 -401 20 424 408 1
3546Am10JM17M12j7m19m04J3M05M16nm21m14K0M01M14%m16m06NM16L96J7m28m02
$$ 1 -409 -408 9 421 404 -15 -419 -406 -1 415 410 -11 -425 -405 -4 410 410 -6 -412 -407 9 405 422 -6 -408
3571d08PM06L96K2m12m22JM04M17J1m09m10rM10M12%l98m17k1M04M25K1m24m08
$$ -408 -401 5 401 423 11 -411 -410 -6 411 422 13 -397 -406 4 416 416 18 -399 -420 -16 409 430 6 -402
3595d02k3M22M13mm06l95k8L91M30K3l97m16k2M01M23J6l89m21j9L91M21K8l96
$$ -402 -425 -3 410 406 0 -395 -423 -32 398 421 24 -392 -414 -13 410 426 37 -384 -403 -12 409 437 41
3618D1m26l6M01M25J8l82m36k9L97M24J8l91m16m0L92M37J7l79m33l3L93M20M2
$$ 41 -385 -421 -20 405 423 41 -395 -424 -27 397 415 24 -392 -432 -40 397 414 35 -398 -431 -38 382 424
3641D24l85m29l8L77M45L3l87m34k6L80M23M5l80m19m7L80M25O2l88m34n0L81
$$ 424 39 -390 -428 -51 394 427 40 -394 -420 -40 383 428 48 -371 -418 -38 387 449 61 -373 -423 -42
3663d2M29N3l78m35n3L69M40M6l81m35n2L83M28N6l68m45n6L76M32O4l87m16o4
$$ -42 387 440 62 -373 -426 -57 383 429 48 -387 -439 -56 372 428 60 -385 -441 -65 367 431 44 -372 -436
3686d36L76M38O1l80m16o6L70M28O5l69m34n8L62M32P9l78m30p2L60M34P8l69
$$ -436 -60 378 439 59 -357 -423 -53 375 440 71 -363 -421 -59 373 452 74 -356 -428 -68 366 444 75
3708G5m39q0L67M28Q7l70m35p1L62M41P2l73m18r0L69M41P0l63m36q3L60M45P9
$$ 75 -364 -444 -77 351 438 68 -367 -438 -76 365 437 64 -354 -444 -75 366 436 73 -363 -446 -86 359 438
3731D38l56m34q3L55M52P2l57m40q0L51M44Q2l58m32q2L55M23J08l60m50r8L72
$$ 438 82 -352 -435 -80 372 444 87 -353 -433 -82 362 444 86 -346 -428 -73 350 458 98 -352 -450 -78
3753g8M28J05l69m41r1L57M30R8l45m43j05L64M36J06l52m50r3L52M44J09l63
$$ -78 350 455 86 -355 -446 -89 341 439 94 -349 -454 -90 346 452 100 -350 -443 -91 353 462 99
3774I9m32j05L52M45J05l56m50q7L21M58J14l62m33j02L22M61Q6l37m37j09L42
$$ 99 -333 -438 -86 359 464 108 -342 -429 -108 350 464 102 -331 -433 -111 350 436 99 -338 -447 -105
3795a05M47J00l34m42j22L45M51J03l31m54j05L34M51J12l28m41j34L41M47J15
$$ -105 342 442 108 -334 -456 -111 340 443 112 -342 -447 -113 338 450 122 -319 -453 -112 335 450
3815D50l29m32j34L32M39J20l26m45j15L26M47J13l14m62j18L40M31J36l31m66
$$ 450 121 -311 -445 -113 326 446 120 -325 -440 -114 333 446 132 -330 -448 -108 323 459 128 -338
3835c38j09L31M36J19l10m55j22L28M46J23l20m64j06L15M43J36l16m57j25L23
$$ -338 -447 -116 320 439 129 -326 -448 -120 326 449 129 -335 -441 -126 317 453 137 -320 -445 -122
3855a22M46J33l20m50j25L02M56J37l10m56j44L14M68J37l42m31j30K87M53J49
$$ -122 324 457 137 -313 -438 -136 320 457 147 -309 -453 -139 329 466 124 -307 -437 -150 303 452
3875D52l28m34j46L02M58J49l17m47j40L00M59J51l08m59j50L13M52J39l02m34
$$ 452 124 -310 -456 -154 304 453 136 -311 -451 -151 308 459 151 -308 -458 -145 307 446 144 -290
3895b90j64L12M51J48l03m43j67L04M58J46k98m40j56K89M63J37k91m48j62L00
$$ -290 -454 -142 309 457 154 -289 -456 -152 306 452 154 -286 -442 -153 310 447 156 -292 -454 -154
3915a54M50J48k90m46j63K97M49J70l04m55j59K90M51J66k70m59j65K83M55J66
$$ -154 296 444 154 -292 -455 -158 291 461 157 -298 -457 -167 284 450 180 -279 -444 -161 294 460
3935D60k76m55j72K74M61J58k73m58j76K91M51J85l04m39j82K85M54J63k75m55
$$ 460 184 -271 -443 -169 292 450 177 -281 -457 -166 285 470 166 -273 -455 -170 284 447 172 -283
3955b83j68K67M58J87l01m46j70K68M59J80k73m63j64K71M40J91k66m59j79K96
$$ -283 -451 -184 274 461 160 -286 -456 -188 271 451 178 -285 -449 -178 262 453 187 -272 -451 -155
3975a55M30J74k58m65j79K74M52J81k69m42j92K65M65J71k66m47j87K65M39J98
$$ -155 275 449 191 -274 -453 -179 273 454 185 -257 -449 -184 281 452 186 -261 -448 -183 256 454
3995D54k71m49j98K71M57J88k78m39j89K54M49K01k59m53j88K50M56K00k63m57
$$ 454 183 -266 -464 -193 264 452 174 -265 -454 -200 249 450 191 -262 -450 -200 256 456 193 -264
4015b64j85K59M42J96k44m64j92K58M44K04k50m58k00K59M48K01k63m37k17K50
$$ -264 -449 -190 252 448 204 -260 -452 -194 250 454 204 -254 -454 -195 253 454 191 -246 -463 -213
4035b13M59J99k44m52k01K39M50K05k43m40k06K36M54K03k48m35k24K42M57K08
$$ -213 246 445 201 -251 -452 -213 237 442 199 -241 -447 -211 243 446 198 -237 -461 -219 238 446
4055D46k27m54k09K34M53K14k40m45k17K41M48J94k14m51k31K34M51K12k22m49
$$ 446 219 -235 -444 -210 243 457 217 -228 -445 -204 244 438 224 -227 -458 -224 227 439 217 -232
4075b32k25K31M59K13k42m35k28K50M39K12k32m49k19K45M37K14k27m49k06K31
$$ -232 -457 -226 233 446 204 -231 -459 -209 230 442 210 -239 -458 -213 224 438 211 -238 -444 -213
4095b13M40K25k24m55k21K40M29K37k27m55k19K35M45K14k26m49k28K29M35K32
$$ -213 227 452 228 -227 -448 -208 221 458 231 -224 -443 -208 237 451 225 -224 -452 -223 212 444
4115D44k13m66k13K23M35K32k22m31k42K15M57K24k16m50k32K19M52K26k14m41
$$ 444 231 -235 -448 -225 210 442 220 -211 -453 -238 219 443 227 -223 -455 -236 216 442 228 -213
4135b13k27K14M49K33k09m56k16J93M46K30k13m38k24J99M35K54k12m48k38K06
$$ -213 -440 -226 223 456 247 -209 -425 -232 214 444 231 -207 -431 -232 203 457 245 -203 -441 -235
4155b35M41K33j98m46k43K06M49K33k04m41k46K02M57K29k10m32k41K06M39K33
$$ -235 206 439 241 -205 -448 -242 207 440 236 -205 -451 -249 208 437 227 -205 -446 -240 199 432
4175D32j96m40k27J94M39K44k08m25k33J72M50K41j93m38k41J85M38K54k01m33
$$ 432 236 -204 -431 -237 202 446 238 -187 -420 -248 202 443 250 -188 -429 -244 194 448 247 -186
4195a86k42J81M34K55j97m42k53K10M31K41j84m27k68J92M49K34j84m21k63K02
$$ -186 -428 -247 187 442 245 -197 -450 -240 191 432 248 -179 -447 -255 194 428 244 -177 -440 -238
4215b38M26K51j78m34k49J85M30K58k01m22k40J83M08K70j91m35k42J85M25K47
$$ -238 188 439 261 -173 -422 -237 193 451 250 -172 -412 -229 179 449 258 -177 -419 -234 191 438
4235D38j82m40k42J80M17K62j86m38k33J82M10K67j82m31k55J81M26K52j62m29
$$ 438 256 -184 -426 -246 171 433 247 -191 -424 -242 168 435 253 -178 -433 -252 174 426 264 -165
4255a65k51J68M21K61j74m32k57J73M39K57j88m16k51J52M40K65j76m29k53J64
$$ -165 -416 -248 173 434 260 -172 -429 -256 183 440 252 -164 -415 -263 177 442 266 -163 -416 -252
4275b52M22K52j68m16k72J70M32K55j54m30k69J86M15K46j51m18k80J74M19K48
$$ -252 170 422 254 -162 -434 -264 168 423 269 -161 -430 -244 171 417 266 -152 -432 -258 161 409
4295D09j37m22k75J64M37K50j54m06k81J60M23K47j41m08k76J55M12K64j44m28
$$ 409 272 -150 -425 -261 176 426 272 -134 -415 -255 168 415 274 -134 -410 -255 157 421 277 -151
4315a51k60J41M13K67j40m27k64J53M01K82j30m39k58J40M02K81j27m25k76J41
$$ -151 -411 -270 143 410 270 -157 -421 -268 133 415 285 -154 -412 -272 130 411 284 -141 -417 -276
4335b76M02K86j30m15k82J51M10K60j26m12k68J29M10K91j48m04k68J19M13K79
$$ -276 126 412 282 -133 -415 -264 146 406 280 -132 -400 -271 139 430 282 -122 -390 -271 142 421
4355D21j41m02k66J07M14K83j46l99k76J13M16K91j49l94k66J13M01K87j20m05
$$ 421 280 -122 -388 -281 133 416 270 -129 -405 -292 124 415 266 -128 -394 -281 120 407 287 -118
4375a18k74J22L83K91j18l98k82J19M12K59j09l90k90J20M01K78j27l82k92J10
$$ -118 -392 -270 113 404 286 -112 -394 -275 137 396 287 -103 -393 -273 128 406 279 -103 -395 -285
4395b85M11K66j10l94k79J10M00K81j10m04k81J15L87K82r9l97k77J18L69K81
$$ -285 126 392 282 -112 -391 -281 119 400 290 -114 -395 -280 107 389 290 -107 -384 -266 103 384
4415C84j02l86k88J09L87K85r3l96k83J06L82K84r8l85k97J13L87K73r3l85k83
$$ 384 282 -104 -392 -283 104 389 296 -100 -383 -277 105 389 291 -94 -391 -278 109 382 289 -96 -379
4436c79R3L85K91j09l75k73Q2L65K99j03l73k84Q4L82K94r0l79k93R7L72K91p3
$$ -379 -286 99 390 281 -94 -367 -285 80 379 276 -97 -381 -297 85 379 289 -90 -383 -286 86 377 304
4458C04l84k88R4L51L00q1l68k94R1L57L03q3l61l12Q6L68K86p4l73k99P5L75
$$ 304 -80 -368 -274 77 377 296 -72 -366 -275 82 385 302 -59 -371 -285 83 369 295 -78 -377 -302 73
4480G3K93p8l62l03Q6L60L06p6l72k96P9L64L00p9l68k81O3L61L06p8l74k74O7
$$ 73 366 288 -74 -377 -291 69 375 299 -73 -369 -290 74 374 295 -73 -354 -291 70 376 298 -76 -350 -283
4503b83L52L07p7l59k92P1L45L00n6l67k98P1L52K99p2l45l04N1L73K89o3l48
$$ -283 69 376 299 -60 -352 -281 64 364 308 -59 -357 -286 66 365 293 -52 -356 -305 68 357 294 -54
4525e4k97N4L59K90o0l37l03N1L55L06o0l48l10O2L47L03n3l53k97N3L49K98l7
$$ -54 -351 -297 62 352 292 -45 -348 -297 58 364 304 -44 -354 -292 55 358 305 -48 -345 -292 57 355 318
4548C18l53k99M6L54K90n5l47k98N6L33K97m2l42l01L6L56K84l7l39l07M3L48
$$ 318 -35 -334 -288 66 356 301 -46 -344 -288 45 342 300 -42 -343 -307 49 333 296 -43 -350 -307 41
4570D1K87k7l41l08M7L41L01l6l37l03L1L47L02l4l38l05M3L19L22l8l38l04M8
$$ 41 328 301 -40 -348 -301 40 341 305 -32 -335 -304 43 345 311 -27 -332 -289 30 352 314 -24 -328 -280
4593b80L15L02l2l29k95L2L14L04l2l20l08L5L22K94j9l38k93K3L40L01k5l32
$$ -280 35 337 305 -24 -319 -287 27 331 299 -21 -329 -294 28 322 303 -35 -328 -305 35 336 311 -21
4615b1l05K8L22L00k8l16k96J7L23L13k3l24k99J4L18L03ml25l12J5L21L04j4
$$ -21 -326 -298 24 324 296 -20 -316 -299 24 337 314 -10 -309 -295 23 326 322 -3 -315 -300 21 325 311
4638C11l30l00J9L19K91j2l10l16L5L07K91ml17l16K1L22L02j7k98l17QL28K93
$$ 311 -19 -319 -300 19 310 298 -12 -328 -293 14 305 301 -16 -332 -311 11 313 296 -2 -319 -311 17 310
4661C10rk95l15OL16L09pl03l11nL10L15j1l11l02JL01L14kl14l01JL00K89K8
$$ 310 301 6 -309 -303 13 322 315 12 -299 -304 6 321 310 -1 -303 -302 -1 313 311 -3 -304 -303 -3 286 314
4686C14l21l08RL06K91J6k97l27K0K97K98Rl04k94k1K98L22jk99l02oK90L18m
$$ 314 -7 -315 -306 0 291 307 10 -317 -297 0 298 307 3 -291 -312 -14 308 307 8 -294 -300 -10 308 304
4710C04k99k98oK73L32J0l03k98j6K88L02J9l05l00j1K82L10K9l10k85j8K72L16
$$ 304 5 -293 -299 -26 306 316 13 -285 -301 -13 289 308 3 -297 -308 -26 284 313 3 -282 -300 -28 288
4733B88J7k67l26j4K72L14K2k66l18k9K86L10K3k66l16l0K78L02K6k68l00m8K88
$$ 288 305 38 -288 -302 -30 284 306 40 -278 -307 -21 289 312 46 -270 -300 -22 280 306 38 -262 -310 -22
4756b2L06Pk52l08m0K66L15K6k69l04k6K63K99N3k75l16k9K63L11L7k64l13k8
$$ -22 284 291 39 -269 -309 -43 272 298 29 -275 -301 -38 261 314 39 -277 -306 -43 268 305 41 -272 -300
4779c00K74K87M3k51l18k8K65K90N5k57l18l8K63L04M1k62l05m2K58L00N5k69
$$ -300 -26 261 304 53 -265 -293 -28 262 317 60 -258 -296 -33 271 312 50 -255 -297 -39 261 316 47
4801D7k98n0K44L09N1k72k91l0K29L24M1k59l06m2K42L05O3k65l02k6K32L06O3
$$ 47 -251 -301 -57 252 303 31 -260 -290 -61 263 304 45 -261 -303 -61 244 307 42 -260 -286 -54 252 315
4824C15k59k99n0K48L02M8k41l02n4K46L01N2k50k97n6K36L09M5k37k91o8K31
$$ 315 56 -243 -293 -45 257 305 64 -238 -292 -46 255 307 57 -240 -296 -60 249 294 57 -234 -302 -71
4846g1L04O1k55k86o0K32L06O5k36l02n3K29L02P2k45k95o0K33K94P1k36k95p9
$$ -71 233 294 39 -247 -307 -75 231 296 60 -242 -295 -66 236 308 63 -232 -292 -59 235 306 70 -225 -304
4869c04K45K93O4k14l03p4K37K92O1k20l09p0K35K99O0k23l05o7K24L02O7k20
$$ -304 -59 234 298 84 -219 -293 -56 236 297 77 -232 -302 -67 232 292 69 -236 -303 -79 223 290 70
4891G0k93p8K26K87R8k38l05o4K18L07Q0k31k86p6K11K91Q9k23l01o1K02K89R7
$$ 70 -223 -301 -75 212 310 72 -233 -297 -79 228 308 77 -209 -285 -74 217 306 83 -218 -279 -77 212 309
4914C09k15l01r1K22K86Q0k06l01q8K22K97Q1k17k85r0K01K94R2j99l04q4K19
$$ 309 94 -207 -298 -76 210 290 84 -217 -305 -83 214 295 78 -207 -297 -96 198 290 91 -213 -297 -78
4936g8K87R5k21k83q8K06K90R5k10k88q8J90L06R2k08l01p4J91K96Q9j94k97r2
$$ -78 209 304 83 -200 -288 -82 208 303 93 -195 -283 -93 213 305 97 -204 -278 -87 209 298 104 -193 -285
4959b85J97K91R6k04k98q4J98K92Q4j99k75j07J89K96R6k02k78j06J96K94R1j91
$$ -285 -88 203 299 95 -203 -287 -89 203 287 88 -187 -294 -105 191 287 85 -193 -299 -103 191 282 91
4981I1k74j02J85K97J02j86k84j13J98K78J04j75l10r0J84K85J22k02k93r4J87
$$ 91 -183 -285 -100 197 299 113 -171 -284 -86 192 296 121 -189 -279 -95 190 312 110 -183 -277 -90
5002i0K83J03j92k91r8J76K95J06j88k85j07J84K88R0j59k91j08J77K93R6j73
$$ -90 193 296 104 -187 -285 -109 186 292 104 -181 -288 -104 184 274 115 -176 -284 -107 186 282 109
5023A09k85j06J65K90J18j77k76j22J82K80J21j78k73j18J66K86J13j72k96j10
$$ 109 -176 -282 -117 173 291 114 -162 -284 -102 178 299 121 -152 -270 -104 182 295 123 -173 -283
5043b83J75K88J00j51k97j15J64K84J16j72k79j15J62K88J23j68k81j24J66K98
$$ -283 -108 180 280 129 -168 -283 -119 165 281 109 -170 -285 -123 165 288 120 -161 -285 -119 179
5063A79J09j70k72j14J50K85J25j63k70j34J70K79J27j82k72j19J45K79J35j68
$$ 179 288 118 -154 -268 -118 167 292 129 -141 -275 -105 174 301 119 -153 -272 -127 152 287 119
5083A19k70j33J71K60J32j56k88j12J46K74J26j53k67j32J58K76J23j44k76j24
$$ 119 -151 -284 -113 147 279 123 -165 -277 -131 143 269 116 -151 -283 -125 151 274 130 -146 -270
$$ [...]
8191A43
##END NTUPLES=NMR FID
##END=
