##TITLE=1H_Pr Glu-OH
 D2O, 8 sc, 
 9.06.2021
##JCAMPDX= 6.0         $$ Bruker NMR JCAMP-DX V2.0
##DATA TYPE= NMR FID
##DATA CLASS= NTUPLES
##ORIGIN= UXNMR, Bruker Analytische Messtechnik GmbH
##OWNER= root
$$ XWIN-NMR		Version 3.5
$$ Wed Jun  9 13:43:09 2021 Russian Standard Time (UT+4h)  she@DPX200
##.OBSERVE FREQUENCY= 200.131506
##.OBSERVE NUCLEUS= ^1H
##.DELAY= (6, 6)
##.ACQUISITION MODE= SIMULTANEOUS
##.ACQUISITION SCHEME= undefined
##.AVERAGES= 8
##.DIGITISER RES= 18
##SPECTROMETER/DATA SYSTEM= spect
##.PULSE SEQUENCE= zg30
##.SOLVENT NAME= D2O
##.SHIFT REFERENCE= (INTERNAL, D2O, 0, 15.7039)
##AUDIT TRAIL= $$ (NUMBER, WHEN, WHO, WHERE, WHAT)
$$ ##TITLE= Audit trail, XWIN-NMR		Version 3.5
$$ ##JCAMPDX= 5.01
$$ ##ORIGIN= Bruker BioSpin GmbH
$$ ##OWNER= she
$$ F:/spectra/data/she/nmr/H-F/1/audita.txt
$$ ##AUDIT TRAIL=  $$ (NUMBER, WHEN, WHO, WHERE, WHAT)
(   1,<2021-06-09 13:40:18.78 +0400>,<she>,<DPX200>,
      <created by zg, POWCHK disabled, PULCHK disabled
       configuration hash MD5:
       00 E9 B6 7A A2 85 ED C7 34 08 36 98 17 FE 4E 26
       data hash MD5: 16K
       8F 97 65 32 F2 8E F9 02 72 52 4C 97 49 57 F4 63>)
$$ ##END=
$$ 
$$ hash MD5
$$ 32 37 7D 1A 23 A9 8B BB 37 B2 2E FF 20 2E 56 7F
##$RELAX= 
##$RELAX= 
##$RELAX= 
##$RELAX= 
##$RELAX= 
##$RELAX= 
$$ Bruker specific parameters
$$ --------------------------
##$DU= <F:/spectra>
##$EXPNO= 1
##$NAME= <H-F>
##$PROCNO= 1
##$TYPE= <nmr>
##$USER= <she>
##$AMP= (0..31)
100 100 100 100 100 100 100 100 100 100 100 100 100 100 100 100 100 100 
100 100 100 100 100 100 100 100 100 100 100 100 100 100 
##$AQSEQ= 0
##$AQ_mod= 1
##$AUNM= <au_zg>
##$AUTOPOS= <>
##$BF1= 200.13
##$BF2= 200.13
##$BF3= 200.13
##$BF4= 200.13
##$BF5= 200.13
##$BF6= 200.13
##$BF7= 200.13
##$BF8= 200.13
##$BYTORDA= 1
##$CFDGTYP= 0
##$CFRGTYP= 5
##$CHEMSTR= <none>
##$CNST= (0..31)
1 1 145 1 1 1 1 1 1 1 1 1 1 1 1 1 1 1 1 1 1 1 1 1 1 1 1 1 1 1 1 1 
##$CPDPRG= <>
##$CPDPRG1= <>
##$CPDPRG2= <>
##$CPDPRG3= <>
##$CPDPRG4= <mlev>
##$CPDPRG5= <mlev>
##$CPDPRG6= <mlev>
##$CPDPRG7= <mlev>
##$CPDPRG8= <mlev>
##$CPDPRGB= <>
##$CPDPRGT= <>
##$D= (0..31)
0 1.2 0 0 0 0 0 0 0 0.06 0 0.03 0 0 0 0 0.0002 0 0 0 0 0 0 0 0 0 0 0 0 
0 0 0 
##$DATE= 1623231618
##$DBL= (0..7)
120 120 120 120 120 120 120 120 
##$DBP= (0..7)
150 150 150 150 150 150 150 150 
##$DBP07= 0
##$DBPNAM0= <>
##$DBPNAM1= <>
##$DBPNAM2= <>
##$DBPNAM3= <>
##$DBPNAM4= <>
##$DBPNAM5= <>
##$DBPNAM6= <>
##$DBPNAM7= <>
##$DBPOAL= (0..7)
0.5 0.5 0.5 0.5 0.5 0.5 0.5 0.5 
##$DBPOFFS= (0..7)
0 0 0 0 0 0 0 0 
##$DE= 6
##$DECBNUC= <off>
##$DECIM= 32
##$DECNUC= <off>
##$DECSTAT= 4
##$DIGMOD= 1
##$DIGTYP= 9
##$DL= (0..7)
0 120 120 120 120 120 120 120 
##$DP= (0..7)
150 150 150 150 150 150 150 150 
##$DP07= 0
##$DPNAME0= <>
##$DPNAME1= <>
##$DPNAME2= <>
##$DPNAME3= <>
##$DPNAME4= <>
##$DPNAME5= <>
##$DPNAME6= <>
##$DPNAME7= <>
##$DPOAL= (0..7)
0.5 0.5 0.5 0.5 0.5 0.5 0.5 0.5 
##$DPOFFS= (0..7)
0 0 0 0 0 0 0 0 
##$DQDMODE= 0
##$DR= 18
##$DS= 0
##$DSLIST= <SSSSSSSSSSSSSSS>
$$ [...]
##$SUBNAM2= <"">
##$SUBNAM3= <"">
##$SUBNAM4= <"">
##$SUBNAM5= <"">
##$SUBNAM6= <"">
##$SUBNAM7= <"">
##$SUBNAM8= <"">
##$SUBNAM9= <"">
##$SW= 20.0188882624521
##$SWIBOX= (0..15)
0 0 2 0 0 0 0 0 0 0 0 0 0 0 0 0 
##$SW_h= 4006.41025641026
##$TD= 16384
##$TD0= 1
##$TE= 0
##$TE2= 300
##$TE3= 300
##$TEG= 300
##$TL= (0..7)
0 120 120 120 120 120 120 120 
##$TP= (0..7)
150 150 150 150 150 150 150 150 
##$TP07= 0
##$TPNAME0= <>
##$TPNAME1= <>
##$TPNAME2= <>
##$TPNAME3= <>
##$TPNAME4= <>
##$TPNAME5= <>
##$TPNAME6= <>
##$TPNAME7= <>
##$TPOAL= (0..7)
0.5 0.5 0.5 0.5 0.5 0.5 0.5 0.5 
##$TPOFFS= (0..7)
0 0 0 0 0 0 0 0 
##$TUNHIN= 0
##$TUNHOUT= 0
##$TUNXOUT= 0
##$USERA1= <user>
##$USERA2= <user>
##$USERA3= <user>
##$USERA4= <user>
##$USERA5= <user>
##$V9= 5
##$VALIST= <valist>
##$VCLIST= <CCCCCCCCCCCCCCC>
##$VD= 0
##$VDLIST= <DDDDDDDDDDDDDDD>
##$VPLIST= <PPPPPPPPPPPPPPP>
##$VTLIST= <TTTTTTTTTTTTTTT>
##$WBST= 1024
##$WBSW= 4
##$XGAIN= (0..3)
0 0 0 0 
##$XL= 0
##$YL= 0
##$YMAX_a= 582334
##$YMIN_a= -486646
##$ZGOPTNS= <>
##$ZL1= 120
##$ZL2= 120
##$ZL3= 120
##$ZL4= 120
##$ABSF1= 10
##$ABSF2= 0
##$ABSG= 5
##$ABSL= 3
##$ALPHA= 0
##$AQORDER= 0
##$ASSFAC= 0
##$ASSFACI= 0
##$ASSFACX= 0
##$ASSWID= 0
##$AUNMP= <proc_1d>
##$AZFE= 0.1
##$AZFW= 0.1
##$BCFW= 1
##$BC_mod= 2
##$BYTORDP= 1
##$COROFFS= 0
##$CY= 11.3945322036743
##$DATMOD= 1
##$DC= 2
##$DFILT= <>
##$DTYPP= 0
##$F1P= 15.9154993809931
##$F2P= -4.1035820241983
##$FCOR= 0.5
##$FTSIZE= 0
##$FT_mod= 4
##$GAMMA= 1
##$GB= 0.15
##$INTBC= 1
##$INTSCL= 1
##$ISEN= 128
##$LB= 0.24
##$LEV0= 0
##$LPBIN= 0
##$MAXI= 10000
##$MC2= 0
##$MEAN= 0
##$ME_mod= 0
##$MI= 1.114404
##$NCOEF= 0
##$NC_proc= 0
##$NLEV= 6
##$NOISF1= 3.799351
##$NOISF2= 2.8
##$NSP= 1
##$NTH_PI= 0
##$NZP= 0
##$OFFSET= 15.70392
##$PC= 1
##$PHC0= -11392.85
##$PHC1= 7.201015
##$PH_mod= 1
##$PKNL= yes
##$PPARMOD= 0
##$PSCAL= 0
##$PSIGN= 0
##$REVERSE= no
##$SF= 200.130013532006
##$SI= 16384
##$SIGF1= 3
##$SIGF2= 2
##$SINO= 400
##$SIOLD= 16384
##$SREGLST= <1H.CDCl3>
##$SSB= 0
##$STSI= 0
##$STSR= 0
##$SW_p= 3612.71676300578
##$SYMM= 0
##$S_DEV= 0
##$TDeff= 0
##$TDoff= 0
##$TI= <>
##$TILT= no
##$TM1= 0
##$TM2= 0
##$TOPLEV= 0
##$USERP1= <user>
##$USERP2= <user>
##$USERP3= <user>
##$USERP4= <user>
##$USERP5= <user>
##$WDW= 1
##$XDIM= 8192
##$YMAX_p= 0
##$YMIN_p= 0
$$ End of Bruker specific parameters
$$ ---------------------------------
##NTUPLES= NMR FID
##VAR_NAME=  TIME,          FID/REAL,        FID/IMAG
##SYMBOL=    X,             R,               I
##VAR_TYPE=  INDEPENDENT,   DEPENDENT,       DEPENDENT
##VAR_FORM=  AFFN,          ASDF,            ASDF
##VAR_DIM=   8192,          8192,            8192
##UNITS=     SECONDS,       ARBITRARY UNITS, ARBITRARY UNITS
##FACTOR=    0.0002496,     1,               1
##FIRST=     0,             0,               0
##LAST=      2.0444736,     0,               0
##MIN=       0,             -486646,         0
##MAX=       2.0444736,     582334,          0
$$ Real data points
##PAGE= N=1
##DATA TABLE= (X++(R..R)), XYDATA
$$ plain form
0 0 0 0 0 0 0 0 0 0 0 0 1 -8 8 -8 8 -16 16 -24 32 -32 40 -48 56 -71 80 -94 112 -127 148 -171 194 -222 253
33 253 -285 323 -363 408 -458 511 -572 636 -707 786 -871 962 -1063 1175 -1294 1429 -1574
50 -1574 1730 -1909 2105 -2321 2564 -2836 3146 -3500 3910 -4395 4971 -5671 6553 -7686 9217
65 9217 -11404 14804 -20853 34876 -137550 120535 456620 262524 208398 -27247 -443393
76 -443393 -486646 16131 336869 322770 216896 15381 -331558 -417096 -119531 241927 347373
87 347373 223390 -11281 -229027 -342885 -198729 162296 379383 218501 -30807 -167274
97 -167274 -290312 -259569 110256 390524 228589 -24001 -120783 -265889 -296631 53234 368901
108 368901 249152 15901 -93404 -246116 -299891 -6961 306969 275474 72581 -84995
$$ packed form
0@%%%%%%%%%%JrJ6j6J6k4L2m0N6o4P2q8J04j27J51j74K06k39K75l19L65m16M75
33B53n38O08o86P71q66R69j083J208j343J493j657J833k025K238k469K723l003
50a574L304l639M014m426M885n400N982o646P410q305R366j0642J2224j4239J6903
65I217k0621K6208l5657N5729j72426K58085L36085j94096n4126k35645m16146
76d43393m3253N02777L20738j4099j05874k01515l46939q5538K97565L61458J05446
87C47373j23983k34671k17746j13858J44156L61025K17087j60882k49308j36467
97a67274j23038L0743L69825K80268j61935k52590r6782j45106l0742L49865L15667
108C68901j19749k33251j09305j52712n3775K92930L13930l1495k02893j57576
$$ plain form
118 -84995 -228789 -267639 -62315 220386 297326 134204 -87609 -213918 -220439 -105160 132310
129 132310 307305 188491 -84161 -200617 -182361 -133637 62181 298768 226943 -61433
139 -61433 -185532 -167655 -150452 15704 269831 247835 -15449 -164487 -173972 -158377 -11169
150 -11169 224187 252559 45081 -137719 -190939 -159951 -26501 169176 245078 108062 -105757
161 -105757 -207067 -159248 -36760 115542 228801 160919 -69226 -213157 -160989 -48396
171 -48396 71106 207494 196291 -27989 -203677 -168380 -64784 40598 183659 210763 16020
182 16020 -177669 -180419 -86561 22763 159733 207247 58526 -139109 -192312 -111673 12482
193 12482 138138 192677 94195 -95138 -198212 -136873 1845 118793 175569 121419 -51394
$$ packed form
118h4995j43794l8850K05324K82701P6940j63122k21813j26309o521J15279K37470
129A32310J74995j18814k72652j16456J8256M8724J95818K36587p1825k88376
139f1433j24099J7877J7203J66156K54127k1996k63284j49038r485J5595J47208
150a1169K35356K8372k07478j82800n3220L0988J33450J95677P5902j37016k13819
161a05757j01310M7819J22488J52302J13259o7882k30145j43931N2168J12593
171d8396J19502J36388j1203k24280j75688L5297J03596J05382J43061K7104j94743
182A6020j93689k750R3858J09324J36970M7514j48721j97635n3203Q0639J24155
193A2482J25656N4539r8482j89333j03074O1339J38718J16948N6776n4150j72813
$$ plain form
204 -51394 -193517 -159028 -15039 100906 161241 138737 -12696 -176650 -174908 -39400 82736
215 82736 150950 147477 19638 -149310 -182721 -68513 62925 143077 149746 45073 -116037
226 -116037 -181924 -97742 40921 135283 148472 64267 -82271 -173504 -122324 17027 125453
237 125453 146049 78809 -51700 -159352 -139809 -8187 112134 143901 90788 -25700 -141421
248 -141421 -149840 -34300 94309 141858 101517 -4113 -121559 -152487 -58825 72842 138354
259 138354 111293 14478 -101196 -149517 -80247 48402 131306 119902 31959 -80665 -142304
270 -142304 -97266 22839 119759 126015 48579 -60693 -132330 -108627 -931 104535 128591
281 128591 63789 -41813 -121048 -115389 -22056 87028 127822 77404 -23594 -108880 -118830 -40485
$$ packed form
204e1394j42123L4489J43989J15945O0335k2504j51433j63954J742J35508J22136
215H2736O8214l473j27839j68948l3411J14208J31438Q0152O669j04673j61110
226a16037o5887Q4182J38663R4362J3189q4205j46538r1233N1180J39351J08426
237A25453K0596o7240j30509j07652J9543J31622J20321L1767n3113j16488j15721
248a41421q419J15540J28609M7549m0341j05630j17446l0928R3662J31667O5512
259A38354k7061r6815j15674m8321O9270J28649Q2904j1404q7943j12624o1639
270a42304M5038J20105R6920O256p7436j09272p1637K3703J07696J05466K4056
281A28591o4802j05602p9235N659R3333J09084M0794n0418j00998q5286r950P8345
$$ plain form
293 -40485 68272 123847 89273 -5636 -95973 -119738 -56177 49465 117025 98604 11689 -82230
305 -82230 -118640 -69592 30844 107734 105393 28617 -67151 -115408 -80939 12497 96147 109244
317 109244 44554 -50724 -109796 -90176 -5365 82558 110078 58883 -33495 -101709 -96797 -22077
329 -22077 67733 107930 70795 -16332 -91519 -100788 -37373 52132 103242 80349 471 -79540
341 -79540 -102108 -50996 36056 96231 87340 16306 -66174 -100791 -62553 20029 87158 91658
353 91658 30929 -51894 -97063 -71886 4325 76218 93479 44158 -36907 -91171 -78984 -10546
365 -10546 63966 92665 55569 -21703 -83327 -83762 -24186 50872 89277 64783 -6649 -73854
377 -73854 -86261 -36002 37799 83652 71122 7289 -63074 -86437 -45904 25281 76450 74742
$$ packed form
293d0485J08757N5575l4574r4909r0337k3765O3561J05642O7560j8421q6915r3919
305h2230l6410M9048J00436P6890k341p6776r5768m8257L4469R3436Q3650J3097
317A09244o4690r5278n9072J9620Q4811Q7923K7520n1195r2378o8214M912P4720
329b2077Q9810M0197l7135q7127p5187r269O3415Q9505N1110k2893p9878q0011
341g9540k2568N1112Q7052O0175q891p1034q2480l4617L8238Q2582O7129M500
353I1658o0729q2823m5169K5177P6211P1893J7261m9321q1065n4264J2187O8438
365a0546P4512K8699l7096p7272o1624m35N9576P5058L8405k4494p1432o7205
377g3854j2407N0259P3801M5853j2530o3833p0363k3363M0533P1185N1169j708
$$ plain form
389 74742 20019 -51196 -84664 -54371 13257 68211 76002 31211 -38362 -80943 -61752 1650
401 1650 59667 75397 40283 -25397 -75312 -67720 -9323 51323 73476 47197 -12719 -67809
413 -67809 -72327 -20362 42576 70621 52445 -408 -58315 -74911 -31380 32992 67051 56112
425 56112 10489 -47397 -74601 -41612 22417 62765 58456 19244 -36050 -71016 -50436 10641
437 10641 57945 60237 25824 -25214 -64608 -57258 -2012 52285 61887 30757 -15662 -56284 -61555
450 -61555 -14845 45347 63094 35072 -7477 -47410 -63024 -26700 36445 63299 39904 -188
462 -188 -39146 -61809 -36491 25163 61384 45616 6677 -32234 -57980 -43233 11988 56696
474 56696 51921 13501 -26851 -52374 -46587 -1877 49374 57889 20359 -22555 -46025 -47125 -14723
$$ packed form
389G4742n4723p1215l3468L0293O7628N4954P791m4791o9573m2581J9191O3402
401A650N8017J5730l5114o5680m9915P592N8397O0646K2153k6279n9916n5090
413f7809m518N1965O2938K8045j8176n2853n7907j6596M3531O4372L4059j0939
425E6112m5623n7886k7204L2989O4029M0348m309l9212n5294l4966K0580O1077
437A0641M7304K292l4413n1038l9394P350N5246N4297R602l1130m6419m0622n271
450f1555M6710O0192J7747k8022m2549l9933j5614L6324O3145K6854k3395m0092
462a88l8958k2663K5318O1654L6221j5768l8939l8911k5746J4747N5221M4708
474E6696m775l8420m0352k5523N787M4710N1251Q515l7530m2914k3470j100L2402
$$ plain form
487 -14723 40008 62001 27325 -18240 -40227 -46062 -24969 29500 62899 34581 -12316 -35719
499 -35719 -44685 -31533 18668 59380 41849 -4019 -32853 -43766 -33855 8345 51361 48398 6546
512 6546 -31031 -43528 -32918 -539 40459 53085 17920 -28973 -43693 -30716 -7669 28883
524 28883 55011 28496 -25120 -43344 -29372 -13010 18848 53674 36593 -18247 -41749 -30573
536 -30573 -16679 12006 48964 41214 -8265 -38563 -34451 -19074 8334 41343 42581 4140 -33714
549 -33714 -40002 -20653 6729 31968 41333 17118 -27345 -45144 -22112 5626 22920 38538
561 38538 27793 -19945 -47636 -24306 3641 16274 35243 34205 -11732 -45981 -28043 -561
573 -561 13002 32370 35587 -3219 -39829 -32896 -7077 12547 30104 33009 5141 -30326 -37762
$$ packed form
487a4723N4731K1993l4676m5565k1987n835K1093N4469L3399k8318m6897k3403
499c5719q966J3152N0201M0712j7531m5868k8834j0913R911M2200M3016k963m1852
512F546l7577j2497J0610L2379M0998J2626l5165m6893j4720J2977K3047L6552
524B8883K6128k6515n3616j8224J3972J6362L1858L4826j7081n4840k3502J1176
536c0573J3894K8685L6958p750m9479l0298M112J5377K7408L3009J238l8441l7854
549c3714o288J9349K7382K5239R365k4215m4463j7799K3032K7738J7294J5618
561C8538j0745m7738k7691K3330K7947J2633J8969j038m5937l4249J7938K7482
573e61J3563J9368L217l8806l6610O933K5819J9624J7557K905k7868l5467p436
$$ plain form
586 -37762 -15027 13103 28204 28490 12399 -19696 -41031 -22721 12729 26308 24312 17937 -10089
599 -10089 -41462 -28787 10037 24114 22119 21317 -3050 -38550 -32467 4262 21597 22665 22572 1231
613 1231 -32448 -33973 -4158 18839 25303 22071 3352 -24231 -33684 -13708 15516 28490 20929
626 20929 4571 -15586 -31964 -22524 11235 30343 20217 5834 -8285 -29213 -28451 5946 29696
639 29696 20832 7828 -3766 -25908 -30648 -160 26248 22754 10752 -1808 -22424 -29626 -6464
652 -6464 20559 25301 14312 -1502 -19069 -26617 -12366 13805 27467 17968 -1469 -15921 -23053
665 -23053 -17070 7120 28148 21110 -486 -13027 -20058 -20184 1218 26583 23435 2180 -10549
678 -10549 -18216 -21340 -3497 22682 24826 6434 -8418 -17439 -20833 -6811 17105 25016 11512
$$ packed form
586c7762K2735K8130J5101K86j6091l2095k1335J8310L5450J3579j996o375k8026
599a0089l1373J2675L8824J4077j995q02k4367l5500O083L6729J7335J068r3k1341
613A231l3679j525K9815K2997O464l232j8719k7583r453J9976K9224J2974p561
626B0929j6358k0157j6378R440L3759J9108j0126j4383j4119k0928P62L4397K3750
639B9696q864j3004j1594k2142m740L0488K6408l494j2002j2560k0616p202K3162
652f464K7023M742j0989j5814j7567p548J4251K6171J3662r499j9437j4452p132
665b3053N983K4190K1028p038k1596j2541p031j26K1402K5365l148k1255j2729
678a0549p667l124J7843K6179K144j8392j4852r021l394J4022K3916P911j3504
$$ plain form
691 11512 -6247 -17353 -19467 -8888 11120 24082 16312 -3763 -17221 -18081 -10272 5778 22112
704 22112 19947 -613 -16331 -17334 -11408 1706 19481 21876 3106 -14331 -17288 -12571 -1138
717 -1138 16307 22164 7146 -11223 -17491 -13915 -3057 13016 21120 10942 -7379 -17526 -15179
730 -15179 -4442 9819 19247 13983 -3290 -16808 -16283 -5922 6945 17090 16017 712 -15189
743 -15189 -17086 -7608 4362 14967 16964 4240 -12583 -17377 -9516 2145 13025 16952 7129
756 7129 -9363 -17042 -11520 65 11289 16310 9311 -5918 -16125 -13338 -2036 9565 15407
769 15407 10922 -2529 -14492 -14726 -4283 7700 14442 12057 489 -12427 -15426 -6627 5621
782 5621 13349 12781 3111 -9943 -15419 -8822 3270 12133 13249 5326 -7265 -14679 -10650 749
$$ packed form
691A1512j7759j1106k114J0579K0008J2962p770k0075j3458q60P809J6050J6334
704B2112k165k0560j5718j003N926J3114J7775K395j8770j7437k957M717J1433
717a138J7445N857j5018j8369o268L576J0858J6073Q104j0178j8321j0147K347
730a5179J0737J4261R428n264j7273j3518N25J0361J2867J0145j073j5305j5901
743a5189j897R478J1970J0605J997j2724j6823m794P861J1661J0880L927r823
756G129j6492p679N522J1585J1224N021o999j5229j0207K787J1302J1601N842
769A5407m485j3451j1963k34J0443J1983O742k385j1568j2916k999Q799J2248
782E621P728n68r670j3054n476O597J2092Q863J116p923j2591p414M029J1399
$$ plain form
796 749 10680 13323 7089 -4662 -13442 -11931 -1666 9050 13168 8473 -2314 -11920 -12665 -3862 7203
811 7203 12755 9556 -254 -10281 -12955 -5858 5234 12128 10498 1686 -8547 -12834 -7557 3136
825 3136 11181 11236 3526 -6671 -12313 -8973 914 9868 11578 5256 -4706 -11437 -9943 -1213 8242
840 8242 11595 6759 -2739 -10300 -10523 -3059 6473 11223 7931 -862 -8998 -10717 -4704 4654 10547
855 10547 8849 916 -7587 -10653 -6042 2856 9625 9420 2575 -6037 -10287 -7155 1081 8416 9709
870 9709 4037 -4449 -9682 -7988 -594 7093 9687 5329 -2761 -8814 -8514 -2182 5608 9377 6423
885 6423 -1086 -7732 -8810 -3631 4024 8791 7288 577 -6477 -8837 -4884 2398 7975 7875 2136
900 2136 -5061 -8587 -5925 848 6956 8186 3512 -3654 -8097 -6724 -625 5790 8169 4718 -2144
$$ packed form
796G49R931K643o234j1751q780J511J0265J0716M118m695j0787r606p45Q803J1065
811G203N552l199r810j0027k674P097J1092O894j630q812j0233m287N277J0693
825C136Q045N5p710j0197n642L340R887Q954J710o322r962o731J494Q730R455
840H242L353m836r498p561k23P464R532M750l292q793q136j719O013R358N893
855A0547j698p933q503l066M611Q898O769k05o845q612m250L132Q236P335J293
870I709n672q486n233J694P394P687K594m358q090o053L00O332P790L769k954
885F423p509o646j078N179P655M767j503o711p054k360L953P282N577j00n739
900B136p197l526K662O773O108J230m674p166m443J373O099O415K379l451o862
$$ plain form
915 -2144 -7400 -7239 -2020 4504 7877 5679 -681 -6536 -7540 -3203 3245 7405 6405 683 -5517
930 -5517 -7606 -4226 1974 6743 6857 2023 -4397 -7488 -5119 713 5909 7076 3235 -3100 -7141
945 -7141 -5865 -454 4977 7012 4264 -1770 -6560 -6400 -1627 3990 6690 4967 -435 -5754 -6726 -2675
961 -2675 2966 6290 5463 772 -4803 -6818 -3618 1940 5763 5736 1797 -3738 -6684 -4491 947 5248
977 5248 5856 2682 -2618 -6330 -5237 -135 4686 5906 3403 -1406 -5656 -5825 -1304 3894 5806 3978
993 3978 -290 -4802 -6144 -2440 2994 5561 4394 687 -3827 -6038 -3430 1901 5189 4684 1430
1008 1430 -2847 -5629 -4168 750 4764 4938 1970 -2021 -5057 -4698 -462 4246 5200 2505 -1292 -4356
1024 -4356 -5016 -1653 3495 5416 3084 -587 -3617 -5034 -2725 2487 5385 3687 174 -2967 -4883
$$ packed form
915b144n256J61N219O524L373k198o360n855j004M337O448M160j000n722o200
930e517k089L380O200M769J14m834o420l091K369N832N196J167l841o335m041
945g141J276N411N431K035k748o034m790J60M773N617K700j723n402n319r72M051
961b675N641L324q27m691n575k015L200N558L823k7l939n535k946K193N438M301
977E248O08l174n300l712J093N102M821J220k503m809m250j69M521N198J912j828
993C978m268m512j342L704N434K567j167l707m514k211K608N331L288n05l254
1008A430m277k782J461M918M014J74k968l991l036L59M236M708R54k695l797l064
1024d356o60L363N148J921k332l671l030j417K309N212K898j698l513l141j916
$$ plain form
1039 -4883 -3522 1279 4987 4315 972 -2412 -4474 -3952 -2 4235 4850 1811 -1923 -4062 -3974 -1164
1055 -1164 3265 5192 2645 -1463 -3643 -3891 -2107 2189 5309 3447 -927 -3293 -3775 -2771 1140
1070 1140 5038 4133 -110 -2961 -3723 -3140 192 4410 4664 942 -2555 -3823 -3276 -513 3425 4906
1086 4906 2201 -2045 -4031 -3279 -1031 2278 4842 3394 -1340 -4187 -3317 -1439 1213 4493 4337 -493
1102 -493 -4093 -3437 -1815 389 3954 4873 557 -3661 -3714 -2225 -98 3363 4903 1662 -2834 -4112
1118 -4112 -2749 -301 2730 4480 2735 -1715 -4425 -3277 -377 2084 3877 3617 -471 -4593 -3849
1133 -3849 -506 1504 3211 4167 716 -4332 -4296 -900 1062 2748 4363 1668 -3582 -4563 -1667 688
1149 688 2532 4112 2314 -2399 -4586 -2699 324 2533 3679 2670 -982 -4335 -3781 -125 2583
$$ packed form
1039d883J361M801L708o72l343l384k062N22L950M237O15l039l734k139Q8K810
1055a164M429J927k547m108k180k48J784M296L120j862m374k366m82J004L911
1070A140L898r05m243k851p62N83L332M218K54l722l497j268N47K763L938J481
1086D906k705m246j986P52K248L309K564j448m734k847Q70J878K652L280j56m830
1102d93l600O56J622K204L565R19m316m218n3J489K127L461J540l241m496j278
1118d112J363K448L031J750j745m450k710J148K900K461J793k60m088m122P44
1133c849L343K010J707R56l451n048L6L396J962J686J615k695n250r81K896K355
1149F88J844J580j798m713k187J887L023K209J146j009l652l353N54L656K708
$$ plain form
1164 2583 3194 2839 350 -3807 -4640 -724 2528 2833 2901 1410 -3091 -5106 -1517 2174 2703 2981 2046
1181 2046 -2246 -5078 -2443 1457 2811 3095 2245 -1372 -4539 -3362 425 2968 3286 2227 -518 -3718
1197 -3718 -4214 -765 3008 3524 2145 282 -2734 -4692 -1916 2745 3665 2157 890 -1865 -4787 -2901
1213 -2901 2071 3752 2479 1233 -1238 -4416 -3572 1029 3663 2971 1520 -869 -3796 -3883 -201 3339
1229 3339 3594 1761 -680 -3084 -3972 -1404 2786 4193 2048 -476 -2395 -3862 -2462 2091 4447
1244 4447 2481 -191 -1926 -3647 -3142 1180 4426 3050 257 -1622 -3420 -3440 269 3984 3611 866
1260 866 -1470 -3213 -3457 -636 3272 4083 1615 -1340 -3008 -3294 -1399 2390 4368 2389 -1050 -2861
1276 -2861 -3154 -1987 1493 4364 3064 -567 -2685 -3083 -2375 668 4007 3594 131 -2447 -3068 -2580
$$ packed form
1164B583O11l55k489m157q33L916L252L05O8j491m501k015L589L691N29K78r35
1181B046m292k832K635L900J354K84q50l617l167J177L787K543L18j059k745l200
1197c718m96L449L773N16j379j863l016j958K776M661R20j508j267k755k922J886
1213b901M972J681j273j246k471l178Q44M601K634o92j451k389k927q7L682L540
1229C339K55j833k441k404q88K568M190J407k145k524j919j467J400M553K356
1244D447j966k672j735j721N05M322L246j376k793j879j798k0L709L715l73k745
1260H66k336j743k44K821L908Q11k468k955j668k86J895L789J978j979l439j811
1276b861k93J167L480K871j300l631k118l98P08L043L339m13l463k578o21M88
$$ plain form
1292 -2580 -2 3437 3921 932 -2120 -3215 -2699 -501 2742 4036 1813 -1673 -3290 -2797 -924 2016
1308 2016 3969 2605 -1030 -3249 -2972 -1312 1328 3706 3142 -255 -3028 -3124 -1654 763 3331 3470
1324 3470 519 -2630 -3253 -1991 290 2863 3595 1302 -2119 -3398 -2358 -91 2393 3581 1954
1339 1954 -1432 -3438 -2723 -479 1956 3449 2505 -715 -3297 -3066 -927 1537 3260 2912 44 -2966
1355 -2966 -3356 -1445 1134 3046 3125 711 -2460 -3508 -1964 658 2761 3232 1356 -1806 -3490 -2430
1371 -2430 174 2487 3252 1816 -1172 -3384 -2811 -280 2170 3206 2216 -593 -3125 -3118 -827 1819
1387 1819 3172 2519 -23 -2797 -3382 -1359 1436 3088 2758 498 -2343 -3457 -1932 961 2964 2932
1403 2932 976 -1817 -3407 -2407 415 2787 3076 1422 -1294 -3231 -2776 -150 2484 3143 1819 -788
$$ packed form
1292b580K578L439M84k989l052j095N16K198L243J294k223l486j617M93J873K940
1308B016J953j364l635k219K77J660K640K378n64l397k773r6J470K417K568J39
1324C470k951l149o23J262K281K573P32k293l421j279J040K267K484J188j627
1339A954l386k006P15K244K435J493r44l220k582K31K139K464J723l48k868l010
1355b966l90J911K579J912P9k414l171j048J544K622K103M71j876l162j684J060
1371b430K604K313P65j436k988k212N73K531K450J036r90k809k532PK291K646
1387A819J353o53k542k774n85K023K795J652l30k260k841j114J525K893K003l2
1403B932j956k793j590J000K822K372K89j654k716j937M55K626K634O59j324k607
$$ plain form
1419 -788 -2959 -3067 -742 2051 3171 2161 -236 -2634 -3192 -1296 1622 3182 2466 132 -2278 -3203
1435 -3203 -1811 1061 3023 2701 622 -1821 -3166 -2256 472 2836 2944 1045 -1413 -3003 -2555 -125
1451 -125 2475 3133 1503 -982 -2762 -2757 -718 2052 3194 1914 -548 -2478 -2832 -1275 1519 3175
1467 3175 2319 -95 -2186 -2867 -1706 896 3031 2677 364 -1914 -2820 -2034 344 2757 2977 890
1483 890 -1592 -2779 -2271 -208 2304 3166 1469 -1209 -2701 -2434 -694 1786 3235 2015 -747 -2566
1499 -2566 -2531 -1135 1227 3095 2497 -230 -2377 -2591 -1433 702 2835 2837 387 -2125 -2744 -1685 273
1516 273 2446 3024 1011 -1822 -2856 -1922 -60 2002 3051 1671 -1315 -2887 -2142 -320 1594 2932
1532 2932 2161 -793 -2911 -2361 -583 1181 2731 2538 -204 -2741 -2619 -893 955 2483 2699 470
$$ packed form
1419g88k171j08K325K793J120j010k397k398n58J896K918J560p16k334k410r25
1435c203J392K872J962l22k079k443j345R10K728K364J08j899k458j590M48K430
1451a25K600O58j630k485j780NK039K770J142j280k462j930l54J557K794J656
1467C175q56k414k091o81J161K602K135l54k313k278r06P86K378K413K20k087
1483H90k482j187N08K063K512Q62j697k678j492K67J740K480J449j220k762j819
1499b566L5J396K362J868n98k727k147k14J158K135K133Kk450k512o19J059J958
1516B73K173N78k013k833j034R34J862K062J049j380k986j572P45J822J914J338
1532B932p71k954k118N50J778J764J550j93k742k537J22J726J848J528K16k229
$$ plain form
1548 470 -2379 -2919 -1233 752 2258 2731 1084 -1871 -3125 -1718 568 2029 2571 1625 -1167 -3249
1564 -3249 -2175 360 1772 2378 2019 -507 -3102 -2598 -52 1578 2215 2187 81 -2785 -2929 -543 1414
1581 1414 2200 2180 548 -2176 -3122 -1228 1222 2289 2102 908 -1476 -3143 -1939 970 2398 2005
1597 2005 1111 -787 -3015 -2567 514 2396 1981 1281 -213 -2683 -2971 -38 2248 2089 1436 179 -2225
1614 -2225 -3107 -719 1883 2355 1597 306 -1742 -2945 -1478 1395 2623 1800 305 -1277 -2635 -2148
1630 -2148 788 2858 2015 361 -808 -2298 -2644 110 2853 2283 503 -453 -1988 -2853 -503 2551
1646 2551 2536 848 -314 -1726 -2791 -1093 1971 2764 1360 -269 -1624 -2506 -1542 1183 2936 1973
1662 1973 -219 -1568 -2116 -1854 323 2934 2514 -70 -1503 -1830 -2081 -389 2681 2912 318 -1353
$$ packed form
1548D70k849n40J686J985J506M73j647k955j254J407K286J461N42r46k792k082
1564c249J074K535J412O06l59k526k595N04K546J630O37k8k106k866j44K386J957
1581A414P86k0j632k724r46J894K450J067j87j194k384j667J204K909J428l93
1597B005q94j898k228M48L081J882m15p00j494k470k88K933K286j59o53j257k404
1614b225q82K388K602M72p58j291k048j203J467K873J228q23j495j582j358M87
1630b148K936K070q43j654j169j490l46K754K743n70j780r56j535q65K350L054
1646B551j5j688j162j412j065J698L064P93j404j629j355q82R64K725J753r63
1662A973k192j349n48K62K177K611m20k584j433l27k51J692L070K31k594j671
$$ plain form
1678 -1353 -1716 -2128 -897 2258 3094 836 -1108 -1730 -2119 -1143 1656 3073 1544 -790 -1937 -2080 -1186
1695 -1186 929 2831 2248 -367 -2136 -2030 -1188 282 2481 2853 145 -2192 -2025 -1223 -246 2034 3132
1712 3132 720 -1993 -2101 -1373 -526 1658 3117 1286 -1501 -2261 -1646 -640 1259 2816 1798 -846
1728 -846 -2346 -1937 -641 941 2370 2229 -122 -2362 -2236 -678 653 1950 2477 567 -2190 -2465
1744 -2465 -833 448 1594 2580 1077 -1827 -2587 -1128 185 1353 2476 1493 -1292 -2573 -1554 -71
1760 -71 1238 2261 1690 -623 -2441 -2038 -300 1180 2023 1844 52 -2151 -2402 -600 1114 1801 1850
1777 1850 566 -1822 -2633 -938 928 1681 1902 993 -1385 -2655 -1354 651 1610 1914 1208 -966 -2516
1794 -2516 -1773 220 1560 1973 1315 -472 -2252 -2141 -236 1538 1998 1410 -82 -1878 -2390 -724 1359
$$ packed form
1678a353l63m12J231L155Q36k258j944o22l89R76K799J417j529k334j147j43Q94
1695a186K115J902n83k615j769J06Q42J470K199L72k708k337J67Q02R77K280J098
1712C132k412k713j08P28Q47K184J459j831k787p60O15J006J899J557j018k644
1728h46j500M09J296J582J429j41k351k240J26J558J331J297N27j910k757k75
1744b465J632J281J146R86j503k904p60J459J313J168J123r83k785j281J019J483
1760g1J309J023n71k313j818M03J738J480Q43j79j792k203k51J802J714O87M9
1777A850j284k388q11J695J866P53K21r09k378j270J301K005R59L04p06k174j550
1794b516P43J993J340M13o58j787j780J11J905J774M60n88j492j796n12J666K083
$$ plain form
1811 1359 2036 1483 256 -1526 -2474 -1140 1082 2020 1619 553 -1245 -2437 -1502 696 1946 1775 743
1828 743 -917 -2258 -1805 239 1891 1990 946 -654 -2043 -1985 -246 1696 2112 1101 -410 -1782 -2109
1845 -2109 -707 1414 2196 1301 -135 -1557 -2118 -1072 1061 2176 1534 113 -1331 -2122 -1343 695
1861 695 2076 1786 370 -1157 -2042 -1569 258 1918 1979 656 -952 -1924 -1662 -171 1652 2174 937
1878 937 -712 -1785 -1790 -480 1348 2165 1257 -444 -1624 -1856 -821 1038 2145 1517 -126 -1491 -1895
1895 -1895 -1047 697 1987 1721 202 -1324 -1914 -1242 360 1792 1873 553 -1130 -1911 -1401 49 1572
1912 1572 2027 868 -885 -1868 -1560 -281 1323 2070 1191 -602 -1762 -1729 -529 1043 2023 1464 -246
1929 -246 -1609 -1841 -805 817 1920 1636 125 -1459 -1924 -1051 529 1762 1792 466 -1192 -1911 -1272
$$ packed form
1811A359O77n53j227j782r48J334K222R38m01j066j798j192R35K198J250j71j032
1828G43j660j341M53K044J652R9j044j600j389N8J739J942M16j011j511j372l27
1845b109J402K121P82q95j436j422n61J046K133J115o42j421j444p91P79K038
1861F95J381k90j416j527q85M73J827J660O1j323j608r72K62J491J823N22j237
1878I37j649j073nJ310J828Q17r08j701j180k32J035J859J107o28j643j365m04
1895a895Q48J744J290k66j519j526n90O72J602J432Q1j320j683p81N10J450J523
1912A572M55j159j753r83L08J279J604P47q79j793j160L3J200J572R80n59j710
1929b46j363k32J036J622J103k84j511j584m65Q73J580J233L0j326j658p19O39
$$ plain form
1946 -1272 278 1611 1889 749 -984 -1930 -1483 -73 1434 1965 1046 -671 -1908 -1641 -352 1213
1962 1213 1944 1297 -365 -1734 -1838 -603 1018 1933 1511 -43 -1567 -1925 -867 767 1854 1674 285
1979 285 -1369 -1985 -1122 521 1760 1796 571 -1101 -2006 -1384 200 1614 1849 836 -818 -1972 -1614
1996 -1614 -67 1439 1901 1113 -535 -1806 -1789 -406 1226 1922 1295 -236 -1672 -1899 -740 995 1905
2013 1905 1483 65 -1468 -1967 -1012 736 1843 1641 316 -1196 -1941 -1251 413 1762 1773 598 -982
2030 -982 -1900 -1481 69 1598 1888 843 -712 -1800 -1668 -272 1394 1950 1100 -435 -1659 -1787 -557
2047 -557 1140 1916 1322 -168 -1524 -1861 -859 815 1884 1541 143 -1344 -1866 -1135 515 1802 1723
2064 1723 420 -1094 -1824 -1337 178 1637 1862 720 -830 -1762 -1533 -195 1407 1934 992 -576 -1661
$$ packed form
1946a272J550J333K78j140j733r46M47J410J507N31r19j717j237K67J289J565
1962A213P31o47j662j369j04J235J621R15m22j554j524l58J058J634J087j80j389
1979B85j654o16Q63J643J239L6j225j672r05O22J584J414K35j013j654j154L58
1996a614J547J506M62p88j648j271J7J383J632O96o27j531j436k27J159J735R10
2013A905m22j418j533m99R55J748J107k02j325j512p45O90J664J349J1j175j580
2030i82r18M19J550J529K90j045j555j088J32J396J666N56q50j535j224j28J230
2047e57J697P76n94j490j356l37J002J674J069l43j398j487n22P31J650J287p9
2064A723j303j514p30M87J515J459K25j142j550r32K29J338J602N27r42j568j085
$$ plain form
2081 -1661 -1668 -468 1156 1964 1256 -293 -1567 -1741 -752 837 1876 1479 -4 -1431 -1767 -962 506
2098 506 1759 1688 288 -1259 -1793 -1160 240 1624 1834 598 -1021 -1781 -1343 -15 1424 1921 874
2115 874 -787 -1749 -1522 -259 1219 1912 1166 -444 -1677 -1649 -542 968 1838 1390 -157 -1557 -1765
2132 -1765 -749 718 1711 1589 159 -1348 -1798 -983 471 1592 1677 463 -1176 -1797 -1164 206 1452
2149 1452 1747 728 -906 -1796 -1366 -28 1285 1750 971 -632 -1716 -1502 -280 1162 1743 1137 -306
2166 -306 -1592 -1646 -485 946 1704 1327 -23 -1455 -1731 -719 747 1630 1478 227 -1251 -1802 -962
2183 -962 497 1516 1579 486 -1010 -1778 -1176 213 1401 1594 734 -787 -1711 -1401 -44 1247 1683
2200 1683 931 -498 -1614 -1548 -297 1096 1690 1112 -226 -1462 -1627 -563 893 1645 1267 31 -1311
$$ packed form
2081a661pJ200J624Q08p08j549j274j74R89J589J039l97j483j427l36Q05J468
2098E06J253p1j400j547n34O33J400J384K10j236j619p60M38J328J439M97j047
2115H74j661r62K27J263J478O93p46j610j233K8J107J510Q70m48j547j400k08
2132a765J016J467R93j22j430j507m50Q15J454J121Q5j214j639o21O33J370J246
2149A452K95j019j634q90M30J338J313M65p79j603j084K14J222J442N81o06j443
2166c06j286n4J161J431P58l77j350j432k76J012J466Q83j52j251j478n51Q40
2183i62J459J019O3j093j496p68O02J389J188J93q60j521r24L10J357J291M36
2200A683p52j429j116O6J251J393N94n78j338j236j65J064J456P52l78j236j342
$$ plain form
2217 -1311 -1717 -810 683 1591 1427 285 -1115 -1744 -1058 399 1493 1543 548 -912 -1751 -1294 126 1381
2235 1381 1628 756 -645 -1617 -1458 -168 1229 1634 953 -375 -1492 -1576 -435 1026 1659 1137 -133
2252 -133 -1355 -1640 -650 795 1592 1300 108 -1151 -1658 -901 545 1547 1465 332 -990 -1687 -1117 267
2270 267 1456 1550 553 -802 -1579 -1316 31 1318 1620 760 -566 -1540 -1465 -261 1152 1644 947 -353
2288 -353 -1395 -1512 -504 918 1643 1133 -126 -1271 -1542 -734 696 1566 1297 99 -1117 -1538 -910
2305 -910 479 1516 1409 301 -937 -1562 -1093 196 1421 1515 561 -762 -1509 -1234 -60 1233 1557
2322 1557 722 -579 -1450 -1348 -274 1049 1597 920 -336 -1329 -1422 -491 820 1564 1120 -144 -1200 -1467
2340 -1467 -678 600 1500 1297 126 -1086 -1464 -863 368 1356 1397 332 -908 -1424 -1008 109 1249
$$ packed form
2217a311m06R07J493R08j64j142j400o29O86J457J094N0r95j460q39M57J420J255
2235A381K47q72j401r72J59J290J397M05o81j328j117q4J141J461O33n22j270
2252a33j222k85R90J445P97k92j192j259n07P57J446J002q2j133j322o97N70J384
2270B67J189R4r97j355p77K63J347J287L02q60j326r74P5J204J413M92o97j300
2288c53j042j17J008J422P25n10j259j145k71Q08J430Q70k69j198j216m21O28
2305i10J389J037j07j108j238o25M69J289J225R4r54j323p47K75J174J293L24
2322A557q35j301q71J02J074J323N48o77j256r93r3R31J311P44m44j264j056k67
2340a467P89J278R00k03j171j212l78O01J231R88M1j065j240n16M16J117J140
$$ plain form
2357 1249 1469 582 -679 -1384 -1141 -89 1081 1486 774 -466 -1334 -1253 -289 876 1459 943 -267 -1257
2375 -1257 -1316 -476 683 1379 1116 -34 -1143 -1359 -628 487 1331 1243 198 -990 -1404 -816 311 1231
2393 1231 1339 433 -815 -1388 -967 87 1073 1369 625 -627 -1357 -1093 -80 965 1354 819 -380 -1278
2411 -1278 -1211 -299 787 1341 980 -148 -1179 -1317 -481 622 1291 1119 64 -1048 -1337 -653 446 1196
2429 1196 1171 262 -889 -1388 -824 265 1145 1264 464 -678 -1342 -991 65 1050 1272 668 -469 -1266
2447 -1266 -1123 -133 881 1291 797 -262 -1156 -1200 -302 768 1249 939 -35 -1053 -1276 -525 596 1211
2465 1211 1022 114 -927 -1283 -675 377 1173 1114 281 -740 -1275 -864 193 1060 1170 456 -554 -1212
2483 -1212 -971 -8 957 1211 597 -379 -1116 -1069 -200 806 1187 764 -176 -1020 -1141 -415 638 1158 864
$$ packed form
2357A249K20q87j261p05K43J052J170M05p12j240q68Q1R64J165N83n16j210r90
2375a257n9Q40J159O96k63j150j109k16P31J115Q44q8j045j188m14N88J127R20
2393A231J08r06j248n73M21J054R86K96p44j252p30K64J013J045L89n35j199q98
2411a278O7R12J086N54l61j128j031j38Q36J103O69j72j055j112k89O84J099P50
2429A196k5r09j151m99N64J089Q80J19q00j142o64L51J056R85K22o04j137p97
2447a266J43R90J014M10m94j059q94m4Q98J070M81l10r74j018k23P51J121O15
2465A211j89r08j041l56O08J052P96n9q33j021n35M11J057Q67J10p14j010o58
2483a212K41R63R65K54o14r76p37M7Q69J006L81m23r40q44j21P26J053N20k94
$$ plain form
2502 864 -25 -897 -1159 -582 453 1124 956 122 -757 -1155 -711 274 1036 1040 270 -628 -1111 -822 82 947
2522 947 1115 447 -490 -1043 -919 -112 810 1140 593 -314 -1002 -964 -229 688 1127 720 -151 -876 -996 -440
2542 -440 489 1093 837 -2 -803 -1013 -544 314 1012 950 177 -683 -1036 -666 167 895 992 316 -565 -1037 -752
2563 -752 -20 791 1032 529 -414 -997 -828 -159 668 1030 642 -266 -921 -905 -261 516 1036 748 -89 -848
2583 -848 -936 -378 398 962 878 116 -721 -995 -522 284 874 924 281 -576 -971 -642 128 768 920 418 -455
2604 -455 -995 -721 12 658 900 519 -272 -925 -810 -125 552 917 637 -133 -857 -883 -267 464 867 709
2624 709 21 -718 -900 -441 358 807 728 186 -554 -925 -585 265 772 761 309 -418 -900 -676 127 701 774
2645 774 428 -257 -851 -752 -61 571 732 484 -116 -752 -801 -218 462 744 532 -1 -623 -799 -369 399 747
$$ packed form
2502H64q89q72k62N77J035O71j68q34q79l98M44R85P62Mp70q98m83K89R04Q65
2522I47J68o68r37n53J24Q07R22L30n47r07o88L8P35R17M39m07q71p25j20N56
2542d40R29O04k56q39q01k10M69Q58O98o2p73q60l53L70Q33P28R7o76q81m72K85
2563g52P32Q11K41n03r43n83J69O69Q27L62l88r08o55J6O44P77N20k88q37p59
2583h48q8N58P76N64q4p62q37k74M73Q06N90N0o43q57l95L29P70O40J52n02q73
2604d55n40K74P33O46K42l81p91o53J15O85O77L65k80p70p24k6O16P31M03j58
2624G09o88p39j82M59P99M49p9n42p40l71L40Q50N07j1m52p27m82K24Q03N74P3
2645G74l46o85n94R9O91O32J61k48o00o36m9N83O80K82k12n33o22j76M30P68L48
$$ plain form
2666 747 592 51 -496 -773 -503 214 753 622 138 -363 -741 -632 93 689 678 264 -186 -643 -691 -54 627
2687 627 674 313 -150 -601 -672 -210 470 710 452 -81 -563 -687 -300 330 740 507 -35 -486 -633 -420 191
2708 191 724 620 33 -394 -589 -508 49 649 700 128 -338 -565 -539 -73 590 704 255 -215 -515 -554 -159
2729 -159 489 734 406 -169 -538 -557 -247 298 701 525 -63 -540 -564 -286 183 638 625 5 -506 -540 -358
2750 -358 31 587 680 122 -415 -516 -405 -55 462 700 266 -344 -563 -410 -83 372 642 365 -240 -546
2770 -546 -452 -114 322 578 466 -71 -565 -487 -123 206 483 539 62 -507 -529 -160 123 437 570 159 -446
2791 -446 -559 -231 89 377 556 237 -319 -557 -332 28 317 503 295 -194 -532 -402 0 280 438 364
2811 364 -31 -494 -470 -34 265 365 338 29 -417 -521 -93 223 348 396 171 -351 -521 -176 178 370 380
$$ packed form
2666G47j55n41n47k77K70P17N39j31m84n01l78J09P25N96j1m14m50m57m8O37O81
2687F27M7l61m63m51p1M62O80K40k58n33m82j24L87O30M10k33n42m51j47K13O11
2708A91N33j04n87m27j95Q1N57O00N1n72m66k27K6M66O63J14m49m70l00l9L95
2729a59O48K45l28n75l69j9L10N45M03j76n88m77k4K78M69M55j3o20n11l4J82
2750c58L89N56R3n58n37j01J11L50N17K38m34o10k19J53L27M55K70k77o05l06
2770e46R4L38M36K56j12n37m94P8L64L29K77N6m77n69k2L69K83L14J33m11o05
2791d46j13L28L20K88J79l19n56k38K25L60K89J86k08m89l38J30M02K80J58p4
2811C64l95m63K4M36K99J00k7l09m46j04M28L16J25M8k25n22j70L45L54J92J0
$$ plain form
2832 380 190 -238 -494 -307 99 336 371 218 -128 -467 -401 0 326 339 221 -8 -397 -469 -53 320 347 219
2854 219 65 -294 -486 -142 257 343 261 92 -242 -460 -232 193 372 289 112 -170 -396 -291 91 367 325
2875 325 107 -120 -346 -356 -31 341 381 112 -65 -280 -371 -118 315 364 109 -27 -206 -382 -190 247 337 189
2897 189 21 -178 -351 -238 149 337 273 52 -161 -327 -219 57 310 312 69 -176 -223 -259 -49 305 353 68
2919 68 -139 -186 -258 -124 222 338 101 -110 -178 -241 -165 195 331 167 -34 -179 -251 -154 127 292 209 -19 -190
2942 -190 -196 -144 44 246 263 30 -206 -213 -124 -8 194 288 89 -123 -206 -97 -58 139 282 136 -109 -163 -148 -87
2966 -87 116 245 150 -73 -185 -130 -59 72 220 179 12 -165 -187 -56 50 140 195 40 -146 -186 -63 5 118
2989 118 208 96 -151 -189 -93 -34 63 190 132 -60 -173 -105 -19 89 181 144 -15 -172 -140 -32 66 148 135 14 -114
$$ packed form
2832C80j90m28k56J87M06K37L5j53l46l39O6M01L26J3j18k29l89p2M16L73K7j28
2854B19j54l59j92L44L99Q6q2j69l34k18K28M25J79q3j77k82k26J05L82K76m2
2875C25k18k27k26j0L25L72M0k69j77k15r1K53M33M9k55j36j79j76J92M37R0j48
2897A89j68j99j73J13L87J88o4k21k13j66J08K76K53Kk43k45m7l6K10L54M8k85
2919F8k07m7p2J34L46J16k37k11o8o3P6L60J36j64k01j45p2R7K81J65q3k28j71
2942a90oN2J88K02J7k33k36pQ9J16K02R4j99k12q3J09L9J97J43j46k45n4J5O1
2966h7K03J29r5k23j12N5P1J31J48m1j67j77k2J31J06R0N5j55j86m0J23O8J13
2989A18R0j12k47l8R6N9R7J27n8j92j13O8Q6J08R2l7j59j57L2J08R8Q2j3j21j28
$$ plain form
3014 -114 -128 -26 54 101 117 65 -71 -176 -58 40 81 119 115 -73 -188 -82 -2 51 107 101 -31 -152 -105 -31 67 100
3040 100 84 33 -106 -132 -48 64 105 87 68 -70 -108 -71 32 95 76 94 18 -101 -79 39 65 66 72 11 -119 -83 -18
3067 -18 45 67 52 9 -109 -74 -14 59 48 75 24 -18 -91 -74 65 45 42 47 11 -95 -84 8 66 29 45 40 -21 -70 -25 26
3097 26 36 28 14 -9 -42 -28 17 24 49 65 -7 -33 -48 14 62 15 31 40 -32 -80 0 8 27 67 58 -11 -76 -59 -11 32 40 59 0
3130 0 -39 -66 -30 69 43 44 25 -41 -83 -18 12 54 80 54 -37 -76 -30 38 49 70 66 2 -65 -75 30 67 92 65 26 -77 -102
3161 -102 -20 53 62 57 16 -54 -103 -47 53 66 60 19 -29 -126 -119 63 77 72 58 -1 -120 -117 14 106 104 47 10 -105 -130 -2
3191 -2 67 99 97 21 -77 -120 -65 62 114 94 6 -75 -131 -100 46 154 99 30 -43 -74 -115 -1 144 116 67 -18 -123 -153
3219 -153 -21 110 144 64 -32 -97 -161 -94 89 136 109 5 -114 -161 -106 43 141 123 35 -99 -146 -114 -16 164 180 34
$$ packed form
3014a14j4J02Q0M7J6n2j36j05J18R8M1L8mj88j15J06Q0N3N6oj32j21M7P4R8L3
3040A00j6n1j39k6Q4J12M1j8j9j38l8L7J03O3j9J8p6j19K2J18K6JOo1j30L6O5
3067a8O3K2j5m3j18L5O0P3j1K7n1m2p3J7J39k0lNl6j06J1R2N8l7J6no1m9M5N1
3097B6J0qj4k3l3J4M5PK5J6p2k6j5O2M8m7J6Rp2m8Q0QJ9M0ro9o5J7M8M3QJ9n9
3130@l9k7L6R9k6Jj9o6m2O5L0M2K6k6r1l9M6O8J1K1mo4o7j0J05L7K5k7l9j03k5
3161a02Q2P3Rnm1p0m9N6J00J3om1m8r7PJ82J4nj4n9j19LJ31R2kn7l7j15k5J28
3191bO9L2kp6r8m3N5J27N2k0q8q1n6L1J46J08n5o9p3l1m1J14J45k8m9q5j05l0
3219a53J32J31L4q0r6o5o4O7J83M7k7j04j19m7N5J49R8j8q8j34m7L2R8J80J6j46
$$ plain form
3245 34 -73 -138 -149 -20 149 195 32 -73 -90 -151 -74 133 192 91 -37 -108 -185 -88 89 173 124 -33 -140 -199 -118
3270 -118 44 185 163 2 -112 -183 -107 6 155 207 60 -100 -180 -131 -4 186 279 128 -79 -171 -161 -51 124
3293 124 260 142 -80 -159 -177 -79 96 209 170 -9 -183 -212 -100 66 223 211 37 -186 -230 -127 32 177
3315 177 222 68 -155 -233 -145 4 185 225 110 -98 -242 -177 -8 154 229 145 -55 -244 -203 -72 123 245 183
3338 183 -6 -198 -247 -87 100 221 219 25 -152 -249 -138 79 186 244 131 -134 -247 -145 29 169 256 96
3360 96 -114 -262 -201 -21 162 260 149 -65 -258 -232 -38 144 246 204 -23 -227 -272 -141 149 225 192 31 -189
3383 -189 -268 -138 110 229 212 87 -158 -296 -187 84 208 230 106 -136 -301 -223 7 216 274 135 -78 -264
3405 -264 -254 -44 194 257 185 -56 -228 -297 -122 147 295 193 -26 -205 -300 -178 127 301 220 36 -168 -310
$$ packed form
3245C4j07o5j1J29J69M6j63j05j7o1P7K07N9j01j28p1p7R7J77Q4m9j57j07n9Q1
3270a18J62J41k2j61j14p1P6J13J49N2j47j60q0M9J27J90R3j51k07r2J0J10J75
3293A24J36j18k22p9j8R8J75J13l9j79j74k9J12J66J57j2j74k23m4J03J59J45
3315A77M5j54k23p8Q8J49J81M0j15k08j44O5J69J62P5q4k00j89M1J31J95J22o2
3338A83j89j92m9J60J87J21kj94j77r7J11K17J07N8j13k65j13J02J74J40Q7j60
3360I6k10j48O1J80J83R8j11k14j93K6J94J82J02m2k27k04m5J31K90P6l3j61k20
3383a89p9J30K48J19j7j25k45j38J09K71J24K2j24k42j65P8K30K09N8j39k13j86
3405b64J0K10K38O3p2k41j72o9J75K69J48j02k19j79r5J22L05J74q1j84k04j42
$$ plain form
3427 -310 -189 81 284 240 74 -152 -306 -231 13 235 284 131 -116 -307 -244 -29 211 316 156 -95 -273
3448 -273 -287 -100 185 337 178 -68 -278 -320 -153 124 298 249 -4 -208 -331 -197 75 303 276 55 -178
3469 -178 -317 -232 56 306 293 128 -152 -299 -244 -14 264 342 164 -111 -291 -267 -59 216 319 217 -64 -288
3491 -288 -281 -112 119 362 258 -22 -249 -289 -129 101 313 259 42 -242 -329 -225 71 286 312 97 -178 -337
3513 -337 -238 19 244 318 159 -140 -312 -264 -29 226 346 218 -78 -308 -298 -89 160 356 288 -23 -259 -317
3535 -317 -150 141 308 304 40 -249 -335 -201 77 306 313 66 -197 -329 -238 34 286 304 138 -159 -339 -264 -35
3558 -35 223 328 179 -105 -322 -295 -69 204 339 247 -31 -297 -310 -109 174 361 263 37 -247 -323 -173 125
3580 125 318 282 81 -232 -343 -219 63 296 343 105 -172 -361 -262 18 260 325 147 -143 -336 -299 -64 229
$$ packed form
3427c10J21K70K03m4j66k26j54P5K44K22M9j53k47j91O3K15K40J05j60k51j78
3448b73j4J87K85J52j59k46k10m2J67K77J74m9k53k04j23J34K72K28k7k21k33
3469a78j39Q5K88K50j3j65k80j47N5K30K78P8j78k75j80K4K08K75J03j02k81k24
3491b88PJ69K31K43j04k80k27m0J60K30K12n4k17k84q7J04K96K15K6k15k75j59
3513c37R9K57K25P4j59k99j72M8K35K55J20j28k96k30J0K09K49J96o8l11k36n8
3535c17J67K91J67mk64k89q6J34K78K29Pk47k63j32R1K72K52J8j66k97j80P5K29
3558c5K58J05j49k84k17K7K26K73J35r2k78k66j3K01K83J87r8k26k84p6J50K98
3580A25J93l6k01l13j11J24K82K33M7k38k77j89R9K80K42O5j78k90j93L7K35K93
$$ plain form
3602 229 362 220 -67 -322 -312 -72 179 326 255 3 -266 -341 -158 145 359 301 55 -224 -315 -186 100 337
3624 337 301 102 -198 -323 -234 40 296 302 129 -123 -334 -263 -9 256 323 170 -92 -321 -289 -96 214 301 219
3647 219 -61 -296 -321 -146 166 307 247 14 -257 -328 -194 86 290 286 64 -185 -308 -195 22 284 291 104
3669 104 -124 -312 -262 -57 265 328 171 -85 -299 -286 -73 210 317 206 -75 -286 -312 -109 177 293 227 -16
3691 -16 -250 -315 -157 122 296 253 35 -221 -323 -184 54 284 311 101 -177 -324 -226 1 231 315 134 -111
3713 -111 -304 -256 -36 228 345 217 -81 -278 -290 -84 155 343 252 -36 -267 -315 -121 120 294 257 42 -214
3735 -214 -315 -193 66 269 286 86 -222 -309 -203 33 254 268 128 -164 -281 -249 -26 232 322 161 -80 -285
3757 -285 -288 -39 192 315 208 -46 -274 -277 -91 156 286 250 11 -219 -280 -126 107 275 264 73 -203 -306
$$ packed form
3602B29J33j42k87k55J0K40K51J47p1k52k69p5J83L03K14n8k46k79r1J29K86K37
3624C37l6j99l00j25Q9K74K56Oj73k52k11P1K54K65O7j53k62k29L2J93L10Q7q2
3647B19k80k35k5J75L12J41o0k33k71p1J34K80K04mk22k49j23J13K17K62Pj87
3669A04k28j88N0K05L22O3j57k56k14J3K13K83J07j11k81k11k6K03K86J16o6k43
3691a6k34o5J58K79J74m3k18k56j02J39K38K30K7k10k78j47R8K27K30Q4j81k45
3713a11j93M8K20K64J17j28k98j97j2K06K39J88r1k88k31m8J94K41J74l7k15k56
3735b14j01J22K59K03J7k00l08q7J06K36K21J4j40k92j17L2K23K58R0j61k41k05
3757b85lK49K31J23j07k54k28lJ86K47J30l6k39k30o1J54K33J68j1j91k76j03
$$ plain form
3779 -306 -208 45 251 257 70 -194 -296 -224 12 225 305 135 -103 -311 -262 -52 208 299 156 -87 -263 -245 -91
3802 -91 181 277 228 -5 -212 -272 -120 122 288 226 38 -183 -286 -171 68 252 267 57 -170 -277 -213 31
3824 31 250 292 101 -146 -255 -232 -15 163 262 167 -107 -265 -263 -65 156 269 194 -19 -223 -257 -126 134 315
3847 315 216 22 -188 -294 -139 83 266 256 61 -162 -254 -158 28 201 253 117 -120 -256 -227 6 218 281
3869 281 113 -114 -268 -264 -95 153 259 141 -80 -239 -262 -72 134 253 228 -27 -211 -244 -98 97 244 205
3891 205 29 -190 -246 -172 84 252 274 85 -124 -279 -182 61 221 286 115 -116 -266 -228 -4 200 271 143
3913 143 -64 -258 -251 -58 168 269 171 -22 -248 -256 -96 132 272 227 14 -202 -262 -142 79 233 206 38 -169
3936 -169 -289 -188 41 250 252 83 -151 -245 -200 4 227 283 134 -87 -230 -209 -8 160 263 170 -33 -212
$$ packed form
3779c06R8K53K06Oj87k64j02P2K36K13Q0j70k38k08M9K10K60R1j43k43j76J8J54
3802i1K72R6m9k33k07o0J52K42J66o2j88k21j03J15K39J84J5k10k27j07O4K44
3824C1K19M2j91k47j09K3K17J78R9r5k74j58KJ98K21J13p5k13k04l4J31K60J81
3847C15r9j94k10j06J55K22J83j0j95k23r2R6J86J73N2j36k37j36K9K33K12O3
3869B81j68k27j54MJ69K48J06j18k21j59k3J90K06J19k5k55j84l3J46J95J47l9
3891B05j76k19n6P4K56J68K2j89k09j55R7K43J60O5j71k31j50L8K24K04P1j28
3913A43k07j94PJ93K26J01r8j93k26qJ60K28J40m5k13k16o0J20K21J54k7j68k07
3936a69j20J01K29K09Kj69k34r4M5K04K23N6j49k21j43K1K01J68J03r3k03j79
$$ plain form
3958 -212 -230 -56 153 270 192 -13 -238 -230 -119 114 235 193 -3 -172 -273 -136 86 217 224 39 -132 -241
3980 -241 -162 28 210 252 88 -93 -272 -185 -2 203 266 123 -68 -212 -218 -28 166 250 171 -22 -193 -236 -86
4003 -86 137 238 204 8 -189 -260 -125 79 221 197 17 -162 -260 -149 34 192 207 76 -125 -248 -212 8
4025 8 182 226 110 -98 -204 -186 -15 181 256 131 -64 -185 -199 -95 135 232 189 9 -187 -218 -76 136 228
4048 228 210 2 -174 -204 -128 63 212 215 57 -123 -231 -173 57 194 206 102 -94 -227 -173 -6 160 222 115
4071 115 -69 -243 -219 -39 152 214 155 -31 -208 -205 -80 92 234 153 19 -170 -214 -109 68 233 197 37 -155
4094 -155 -227 -128 63 206 197 54 -115 -213 -154 17 195 209 85 -124 -198 -179 -37 154 214 100 -55 -216 -193 -57
4118 -57 131 214 144 -12 -202 -210 -68 81 236 172 0 -141 -197 -109 81 213 167 28 -150 -230 -143 33 181 188
$$ packed form
3958b12j8J74K09J17p8k05k25QJ11K33J21m2j96j69j01J37K22J31Pj85j71j09
3980b41P9J90J82M2j64j81j79Q7J83K05O3j43j91j44oJ90J94Q4p9j93j71m3J50
4003h6K23J01l4j96j97p1J35K04J42k4j80j79r8J11J83J58J5j31k01j23L6K20
4025HJ74M4j16k08j06J8J71J96P5j25j95j21j4J04K30R7m3j80j96l1J42K12R2
4048B28j8k08j76l0P6J91J49Lj58j80j08N8K30J37J2j04j96j33N4J67J66O2j07
4071A15j84j74K4J80J91O2n9j86j77LJ25J72J42q1j34j89m4J05J77J65l6j60j92
4094a55p2R9J91J43rj43j69r8N9J71J78J4j24k09p4J9J42J91O0j14j55j61K3J36
4118e7J88Q3p0j56j90qJ42J49J55o4j72j41n6Q8J90J32m6j39j78q0Q7J76J48P
$$ plain form
4142 188 81 -111 -211 -158 19 154 197 81 -87 -216 -182 -44 142 232 129 -69 -186 -192 -91 138 182 119 -34
4165 -34 -180 -204 -84 76 200 157 11 -145 -219 -113 58 179 178 51 -103 -219 -136 27 192 202 87 -93 -193
4188 -193 -138 -5 195 221 108 -66 -178 -212 -38 104 192 108 -25 -175 -193 -91 87 201 128 -1 -152 -223 -63
4211 -63 65 175 179 54 -134 -200 -109 47 183 163 63 -112 -179 -136 7 161 181 117 -64 -175 -134 -21 132 219
4235 219 114 -29 -167 -174 -72 86 177 121 3 -189 -181 -79 81 174 146 19 -150 -188 -106 53 156 145 38 -137
4259 -137 -204 -129 -13 144 158 75 -113 -222 -128 -5 123 167 112 -47 -148 -167 -30 139 184 104 -32 -169 -153 -19
4283 -19 92 163 121 8 -97 -167 -95 57 164 143 34 -137 -153 -85 33 129 144 54 -90 -166 -131 -3 123 153 81
4308 81 -66 -134 -132 -12 105 141 130 -31 -139 -158 -11 119 141 115 6 -132 -148 -42 102 142 144 31 -115 -146 -76
$$ packed form
4142A88j07j92j00N3J77J35M3j16j68j29L4J38J86R0j03j98j17oJ01K29M4o3j53
4165c4j46k4J20J60J24m3j46j56p4J06J71J21jj27j54j16Q3J63J65J0j15j80j00
4188a93N5J33K00K6j13j74j12l4J74J42Q8q4j33j50j8J02J78J14p3j29j51p1J60
4211f3J28J10Mj25j88o6R1J56J36k0j00j75o7M3J43J54K0o4j81j11M1J13J53Q7
4235B19j05j43j38pJ02J58R1n6j18j92QJ02J60R3k8j27j69l8Q2J59J03j1j07j75
4259a37o7P5J16J57J4q3j88j09R4J23J28M4n5j59j01j9J37J69M5q0j36j37J6J34
4283a9J11P1m2j13j05p0P2J52J07k1j09j71j6O8J18R6J5r0j44p6L5J28J26L0p2
4308H1j47o8KJ20J17L6j1j61j08j9J47J30K2k6j09j38j6J06J44M0Kj13j46l1P0
$$ plain form
4333 -76 19 151 108 62 -104 -146 -109 30 138 146 60 -63 -158 -127 1 127 141 38 -61 -128 -116 -29 89 138 58 -51
4359 -51 -133 -145 -21 80 152 115 -12 -115 -134 -59 46 128 116 14 -99 -135 -86 42 131 115 25 -99 -147 -84 6 122
4385 122 131 67 -53 -139 -101 -3 110 124 61 -51 -135 -132 -20 107 148 96 -26 -133 -88 -50 90 179 82 -8 -113 -123
4411 -123 -42 68 125 118 16 -94 -145 -73 30 133 108 24 -84 -107 -57 51 122 110 49 -56 -129 -112 4 98 117 78
4437 78 -39 -114 -128 -15 61 108 55 -5 -133 -124 -50 40 108 87 -21 -87 -106 -37 12 104 86 12 -73 -130 -67 29 127 128 65
4466 65 -69 -107 -79 0 82 134 56 -53 -108 -89 -38 96 116 82 -41 -112 -99 -53 53 88 95 -35 -128 -127 -53 41 119 90
4494 90 1 -74 -143 -73 47 93 66 7 -76 -82 -72 8 103 85 27 -46 -98 -73 13 65 104 55 -42 -102 -93 -1 98 91 42 -26 -102
4525 -102 -96 -6 44 79 42 -14 -70 -87 -58 56 95 83 -8 -84 -111 -40 48 89 90 -5 -53 -76 -49 28 87 78 4 -50 -76 -51 22
$$ packed form
4333g6R5J32m3m6j66m2L7J39J08Qq6j23r5L1J28J26J4j03r9o7J2Q7J18M9q0j09
4359e1q2j2J24J01P2l7j27j03j9P5J05Q2j2j02j13l6M9J28Q9j6r0j24m8O3R0J16
4385A22Ro4j20q6L8R8J13J4o3j12q4LJ12J27M1n2j22j07M5L8J40Q9r7r0j05j0
4411a23Q1J10N7pj02j10n1P2J03J03k5q4j08k3N0J08P1j2o1j05p3J7J16R4J9l9
4437G8j17p5j4J13P6M7n3o0j28RP4R0O8k1j08o6j9O9M9R2j8p4q5n7O3R6R8Jo3
4466F5j34l8K8P9Q2N2p8j09n5J9N1J34K0l4j23p1J3M6J06L5Pj30r3JP4R4P8k9
4494I0q9p5o9P0J20M6k7n9q3oJ0Q0R5j8n8p3n2K5Q6N2L9m9r7o0RR2R9pm9o8p6
4525a02OR0N0L5l7n6n6j7K9J14L9j2r1p6k7P1Q8M1Jr5m8k3K7P7N9rp4n4k6K5P3
$$ plain form
4556 22 87 112 50 -19 -85 -58 14 85 110 42 -51 -69 -74 -14 46 90 65 -26 -93 -64 -30 31 80 74 2 -82 -98 -60 23 81 67
4587 67 -4 -30 -82 -58 11 92 82 30 -43 -100 -59 -5 56 84 40 -46 -61 -26 21 25 92 54 -15 -51 -60 -26 18 72 62 -14 -80
4618 -80 -70 -35 53 98 50 -1 -72 -99 -43 49 59 60 4 -38 -73 -35 8 61 65 -6 -28 -84 -45 2 71 80 28 -21 -49 -40 -4 83
4650 83 62 47 -45 -61 -86 3 30 54 40 -2 -49 -88 -8 43 64 83 -7 -69 -58 -23 -7 78 32 -30 -53 -70 -36 27 73 38
4680 38 -3 -52 -76 -27 4 27 68 25 -47 -76 -44 -2 54 33 30 -33 -52 -52 2 39 63 40 -18 -27 -58 13 57 35 44 -20 -41 -57
4712 -57 -4 24 48 11 -1 -65 -55 -3 4 60 16 13 -64 -63 -50 23 50 51 45 -59 -60 -52 -6 15 64 19 -33 -49 -59 8 29 71 28
4745 28 -3 -51 -43 -2 29 37 4 -26 -48 -16 13 32 54 29 -9 -51 -21 4 59 47 9 -17 -46 -54 -22 11 43 45 -13 -13 -51 -36 8
4778 8 34 38 5 -23 -40 -28 16 68 46 19 -16 -18 -18 4 35 39 -2 16 -37 -16 18 34 54 29 -21 -49 -29 -22 36 35 32 -31 -45 -56
$$ packed form
4556B2O5K5o2o9o6K7P2P1K5o8r3j8nO0O0M4k5r1o7K9L4O1M9op2q4j6L8Q3N8j4
4587F7p1k6n2K4O9Q1j0n2p3n7M1N4O1K8m4q6j5L5M7MO7l8o9l6rL4M4N4j0p6o6
4618h0J0L5Q8M5m8n1p1k7N6R2J0Jn6m2l5L8M3N3Mp1k2n6L9M7O9Rn2m9k8RL6Q7
4650H3k1j5r2j6k5Q9K7K4j4m2m7l9Q0N1K1J9r0o2J1L5J6Q5m6o2k3j7L4O3M6l5
4680C8m1m9k4M9L1K3M1m3p2k9L2M2N6k1lo3j9%N4L7K4k3n8rl1P1M4k2Ro4k1j6
4712e7N3K8K4l7j2o4J0N2PN6m4lp7JJ3P3K7Joj04jQM6K1M9m5n2j6j0O7K1M2m3
4745B8l1m8QM1L1Ql3l0k2L2K9J9K2k5l8m2L0K5N5j2l8k6k9qL2L3L2Kn8%l8J5M4
4778HK6Ml3k8j7J2M4N2k2k7l5k%K2L1Mm1J8n3K1L4J6K0k5n0k8K0PN8jlo3j4j1
$$ plain form
4812 -56 -16 -3 7 53 -46 -26 -50 -45 26 32 35 -13 -33 -44 -56 1 29 48 38 -49 -36 -40 23 53 27 37 -16 -42 -46 14 22 42 38 -14
4846 -14 -48 -31 3 32 56 3 -16 11 -35 -19 36 22 25 -4 -26 -38 -26 5 37 26 -12 -53 -65 -47 13 33 16 -25 -1 -19 -8
4877 -8 31 19 26 -21 -41 -21 -16 22 23 29 9 -9 -34 -8 22 42 29 5 -30 -43 -11 8 33 20 16 -10 -52 -40 -2 -1 29 24 3 -22
4911 -22 -41 6 18 25 16 -36 -65 -39 -4 13 24 23 -14 -31 -24 33 -5 33 27 -19 -32 -21 -31 -14 23 58 13 -6 -27 -18 15 17 37 40
4945 40 -19 -43 -22 -7 19 42 14 -22 -32 -29 -19 19 35 5 -18 -38 -19 -11 23 39 -3 -25 -24 -46 -9 5 26 16 -5 -28 -12 1
4977 1 17 45 45 18 -9 -47 -15 26 52 26 -6 -26 4 -7 -11 27 34 3 -8 -24 -11 28 26 39 22 -22 -70 -23 -2 21 -12 10 -15
5010 -15 -26 -35 0 29 28 17 -17 -23 -25 -11 15 30 18 -20 -2 -22 15 32 52 32 9 -5 -12 -19 30 39 20 -10 5 -47 3 23 30 33 -23
5045 -23 -14 -61 -28 0 17 8 6 -25 -39 -31 9 18 29 -3 -16 -49 -38 11 -6 42 18 4 -29 -24 3 -5 30 32 5 8 -24 -17 35 33 39 3
$$ packed form
4812e6M0J3J0M6r9K0k4NP1OLm8k0j1j2N7K8J9j0q7J3mO3L0k6J0n3k6mO0QK0mn2
4846a4l4J7L4K9K4n3j9K7m6J6N5j4Lk9k2j2J2L1L2j1l8m1j2J8O0K0j7m1K4j8J1
4877hL9j2Pm7k0K0NL8JOk0j8k5K6L0K0j3k4l5j3L2J9K5j3mk6m2J2L8JL0nk1k5
4911b2j9M7J2Prn2k9K6L5J7J1jl7j7PN7l8L8om6j3J1j0J7L7L5m5j9k1RL3KK0L
4945D0n9k4K1J5K6K3k8l6j0LJ0L8J6l0k3k0J9QL4J6m2k2Jk2L7J4K1j0k1k3J6J3
4977AJ6K8%k7k7l8L2M1K6k6l2k0L0j1mL8Pl1j1j6J3L9kJ3j7m4m8M7K1K3l3K2k5
5010a5j1rL5K9jj1l4okJ4K6J5j2l8J8k0L7J7K0k0k3j4ppM9Rj9l0J5n2N0K0PLn6
5045b3Rm7L3K8J7rkl1j4QM0RJ1l2j3l3J1M9j7M8k4j4l3NK7qL5Kk7Ll2PN2kOl6
$$ plain form
5081 3 -11 -31 -29 14 23 44 0 -21 -27 -27 -2 37 -5 10 -34 -33 -32 -6 21 20 -1 -3 -49 -25 0 16 20 31 -9 -37 -5 13 26 33 37 12
5117 12 -23 -16 -2 -25 36 29 10 -18 -22 -12 -4 29 35 14 -19 -34 -17 -5 40 43 18 -28 -12 -30 -13 24 33 -1 -38 -23 -45 -12 11 15
5151 15 0 -23 -44 -59 9 14 23 29 -11 -43 -48 14 37 60 40 3 -14 -38 -21 52 56 17 42 -11 -40 7 0 38 16 10 -28 -55 -7 24
5185 24 26 20 22 -7 -37 -23 1 33 -3 -4 -9 -38 4 3 42 13 33 -26 -36 -48 8 25 41 3 -24 -17 -32 20 10 60 7 15 -31 -12
5219 -12 -3 19 49 20 17 -19 -29 -5 0 45 1 -1 -7 -33 5 -10 -29 22 29 -28 -41 -37 -3 15 -5 -4 -22 -14 -22 -11 25 49 34 -21 -19 -15
5255 -15 14 4 37 25 -32 -36 -6 1 16 26 32 -2 -32 -23 -52 4 38 46 36 -38 -26 -23 -6 18 16 -11 -37 -22 -37 5 14 29 -19 -16 -38
5290 -38 -46 18 48 43 5 -11 -31 -48 22 9 38 22 0 -26 -53 6 38 2 40 -3 -25 -10 -7 19 35 36 27 -27 -53 5 30 41 26
5323 26 -18 -57 -15 -51 12 23 22 21 -44 -10 -26 -7 -4 28 21 1 -26 -21 9 16 31 17 -40 -39 2 7 30 54 36 -8 0 -39 10 29 37
$$ packed form
5081Cj4k0KM3RK1m4k1o%K5L9m2J5m4JJK6K7jk1km6K4K5J6MJ1m0k8L2J8J3PMk5
5117A2l5PJ4k3O1pj9k8mJ0QL3Ok1l3j5J7J2M5Lk5m6J6j8J7L7Rl4l7J5k2L3K3M
5151A5j5k3k1j5O8NROm0l2nO2K3K3k0l7j7k4J7P3Ml9K5n3k9M7pL8k2ol8k7M8L1
5185B4KoKk9l0J4K4L2l6jnk9M2jL9k9K0n9j0j2N6J7J6l8k7Pj5N2j0N0n3Qm6J9
5219a2RK2L0k9ll6j0K4NM5m4kok6L8j5j9N1Pn7j3ML4J8k0Jj8QqJ1L6K4j5n5KM
5255a5K9j0L3j2n7mL0PJ5J0Ol4l0Rk9N6L4Qj0p4J2LJ7K4kk7k6J5j5M2RJ5m8Lk2
5290c8qO4L0nl8j6k0j7P0j3K9j6k2k6k7N9L2l6L8m3k2J5LK6J6Jrn4k6N8K5J1j5
5323B6m4l9M2l6O3J1jjo5L4j6J9LL2pk0k7NL0PJ5j4n7JM1NK3K4j8m4Ql9M9J9Q
$$ plain form
5358 37 53 15 -16 -36 -18 42 18 8 20 -12 -15 -6 31 33 14 15 -37 -37 -20 -3 13 30 -1 -21 -39 -31 -1 21 32 4 -37 -29 -31 -24 24
5393 24 22 20 -24 -28 -34 0 47 49 8 -9 -22 -27 9 11 56 49 19 -19 -48 -28 14 30 19 14 -18 -11 -11 29 31 15 20 -50 -44 -20 1 16 31
5430 31 4 1 -41 -13 7 48 22 14 -30 -7 17 6 33 -4 30 -11 -43 -42 7 24 65 43 -8 -23 -36 12 26 30 50 24 -5 -30
5462 -30 -4 0 26 50 -7 -3 -30 3 8 19 19 -2 -28 -39 -30 1 22 32 38 -15 -46 -38 -31 36 44 30 1 -29 -31 9 40 16 14 22 -36 -20
5498 -20 -19 12 48 37 7 -6 -24 -16 35 60 29 16 -33 -54 7 20 43 11 34 -9 -44 -30 27 31 12 6 -14 -41 -42 5 15 37 -5
5531 -5 2 -34 -20 -10 14 35 25 -23 -40 -38 0 36 53 45 -19 -40 -23 -5 35 56 40 -9 -20 -12 -12 -2 17 20 4 -19 -40 7 -8 26
5565 26 42 -18 -18 -11 -13 -7 11 44 7 -8 -57 -39 17 37 29 24 -10 -24 -38 12 13 89 56 -15 -29 -21 -22 -15 40 27 -22 -23 -10 -11 -6 28 32
5602 32 2 -18 -67 -27 10 32 28 10 -25 -23 -13 1 -2 24 26 6 -28 -41 -39 7 22 26 9 -31 -21 -20 41 17 54 -9 -27 -27 -24 2 36
$$ packed form
5358C7J6l8l1k0J8O0k4j0J2l2lRL7Kj9Jn2%J7J7J6J7l1k0j8QL0K2J1k8m1QkPM8
5393B4kkm4moL4M7Km1j7j3nL6KM5pl0l8k9K0M2J6j1nl2P%M0Kj6Np0OK4K1J5J5
5430C1k7lm2K8K0M1k6qm4K3K4j1K7l7L4m1l2JM9J7M1k2n1j5j3M8J4MK0k6k9k5
5462c0K6MK6K4n7Mk7L3NJ1%k1k6j1RL1K1J0On3l1QPO7Qj4k9l0kM0L1k4kQn8J6
5498b0JL1L6j1l0j3j8QN1K5l1j3m9k1O1J3K3l2K3m3l5J4N7Mj9ok0k7jM7J0K2m2
5531ePl6J4J0K4K1j0m8j7KL8L6J7qo4k1J7J8M0K1j6m9j1Q%J0J9Lj6k3k1M7j5L4
5565B6J6o0%PkOJ8L3l7j5m9J8N6K0qnl4j4j4N0JP6l3p1j4QjPN5j3m9jJ3jNL4M
5602C2l0k0m9M0L7K2mj8l5KJ0J4lK6Kk0l4j3KM6J5Mj7m0J0JO1k4L7o3j8%LK6L4
$$ plain form
5637 36 40 24 -32 -34 -14 27 12 20 13 1 -44 13 6 25 42 6 4 -44 -18 -24 2 11 11 -11 -13 -48 3 2 23 -4 1 -7 -15 -32 -2 9 18 5
5675 5 9 -26 5 18 19 38 7 -22 -32 1 18 30 31 34 -13 -4 -3 19 33 26 -3 12 2 -49 -18 21 7 2 -20 -13 -32 -3 -13 26 22 -1
5711 -1 -8 -24 1 0 14 38 12 -16 7 -3 24 12 21 3 -38 -5 -7 4 40 53 31 10 -14 4 -24 34 26 25 11 -22 -20 3 20 2
5745 2 23 -5 -21 -23 -12 8 13 21 -9 -28 -24 -26 -9 6 11 16 -2 -31 -55 -7 39 30 -19 -6 -13 -9 -12 21 15 21 8 -19 -16 8 2 23 24 7 11
5784 11 -2 -21 23 38 21 19 8 -21 1 15 30 21 -16 -8 -19 -12 3 18 31 22 4 -15 -29 -10 10 16 6 -19 -38 -7 -14 10 37 51
5818 51 21 2 -24 -6 35 32 31 -5 -7 -7 11 23 18 37 20 -23 -15 -16 4 18 -3 22 5 -8 -12 15 -9 13 11 -7 -11 -4 -21 23 -4 18
5854 18 0 -8 -3 -16 -32 6 24 3 -7 -5 10 9 42 22 1 2 9 2 -6 5 42 42 -2 -25 14 -4 20 14 9 -4 -13 -20 -16 15 15 19 8 -16
5892 -16 -19 -10 -2 8 3 29 -13 -7 -13 18 34 30 8 -27 -26 -5 -9 1 23 13 16 -10 7 -3 26 33 46 16 -48 -14 11 27 43 21 5 -2
$$ packed form
5637C6Mj6n6kK0M1j5Qpj2m5N7pJ9J7l6km8K6oK6R%k2kl5N1jK1k7Nqqj7L0J1Rj3
5675EMl5L1J3JJ9l1k9j0L3J7J2JLm7RJK2J4pk9J5j0n1L1L9j4nk2Pj9K9j0L9mk3
5711apj6K5jJ4K4k6k8K3j0K7j2Rj8m1L3kJ1L6J3k2k1k4J8k8N8qjj4l3KK3J7j8
5745BK1k8j6kJ1K0NQl0j9MkJ7J5NNj8k9k4M8M6rm9J3pMlL3oOj3k7LK4oK1Jj7M
5784A1j3j9M4J5j7kj1k9K2J4J5rl7Qj1PJ5J5J3rj8j9j4J9K0Oj0k5j9L1pK4K7J4
5818E1l0j9k6J8M1ljl6k%J8J2nJ9j7m3QjK0J4k1K5j7j3mK7k4K2kj8mPj7M4k7K2
5854A8j8qNj3j6L8J8k1j0KJ5jL3k0k1JPpqJ1L7%m4k3L9j8K4onj3rpML1%Mj1k4
5892a6lRQJ0nK6m2OoL1J6mk2l5JK1mJ0K2j0Lk6J7j0K9PJ3l0o4L4K5J6J6k2j6p
$$ plain form
5928 -2 -10 -14 -1 3 10 19 0 -37 -35 3 23 29 -22 0 -37 -11 -9 6 10 -4 14 -18 -25 3 3 29 -7 7 -14 6 -6 15 10 13 -18 14 -13
5965 -13 -5 20 32 17 2 3 -4 -21 -21 17 18 26 -40 -11 -22 0 33 7 -11 -7 -2 -25 -10 -15 11 -10 7 0 -29 -30 -15 20 21 -25 7 -8
6001 -8 11 9 8 29 4 15 -4 -9 17 7 2 24 22 22 3 -8 35 31 33 -5 -14 1 12 -6 6 38 1 -2 -4 -4 18 25 16 16 9 -18 -13 33 29 10
6041 10 -15 12 6 -3 10 30 37 25 29 -21 5 -24 9 17 19 10 -17 -9 8 41 22 7 12 26 8 -10 28 12 14 14 -17 -9 -5 -9 15 7 10 -10
6079 -10 -21 -16 8 -14 -1 17 -24 -23 -24 19 13 -8 -9 -7 -20 -20 -4 6 12 10 -16 -22 19 27 21 28 39 7 8 13 14 22 51 24 -14 -26 -9 -21 20
6118 20 22 31 16 2 -19 2 4 16 19 9 4 -35 -2 14 13 23 14 2 10 -20 13 4 13 22 9 -23 -42 -16 -14 6 28 13 -14 -4 -15 -8 22
6155 22 32 17 4 -7 -21 7 19 28 -9 -16 -17 -31 -3 30 13 -17 22 -26 -29 -3 14 3 19 -2 -22 -41 -11 -8 -9 10 7 -7 -28 -2
6189 -2 1 25 36 29 -6 -10 -33 5 2 28 23 -9 -38 -2 36 26 18 35 8 -25 -20 9 43 27 13 0 1 -20 -27 -11 30 16 -19 -7 -6 -24
$$ packed form
5928bqmJ3MPRj9l7KL8K0On1K2l7K6KJ5Mj4J8l2pK8%K6l6J4k1K0j2K1nLl1L2k7
5965a3QK5J2j5j5Jpj7%L8JQo6K9j1K2L3k6j8MNk3J5nK6k1J7pk9jJ5L5Jm6L2j5
6001hJ9kjK1k5J1j9nK6j0nK2k%j9j1M3mKl8rJ5J1j8J2L2l7lk%K2Pr%pk7NM6mj9
6041A0k5K7orJ3K0Pj2Mn0K6k9L3QKrk7QJ7L3j9j5NJ4j8j8L8j6K%l1QMmK4qLk0
6079a0j1NK4k2J3J8m1JjM3ok1jKj3%J6J0Okk6oM1QoPJ1l2JNJQK9k7l8j2J7j2M1
6118B0KRj5j4k1K1KJ2Lj0nl9L3J6jJ0rj2Ql0L3rRRj3l2j9K6KK0K2j5k7J0j1PL0
6155B2J0j5j3j1j4K8J2Rl7pjj4K8L3j7l0L9m8lK6J7j1J6k1k0j9L0LjJ9lj4k1K6
6189bLK4J1pl5mk3L8lK6nl2k9L6L8j0qJ7k7l3NK9L4j6j4j3Jk1pJ6M1j4l5J2Jj8
$$ plain form
6225 -24 -6 22 5 -10 -23 -19 -28 -28 31 -2 -22 -9 -21 -8 10 9 40 18 6 -16 -21 -15 -7 42 26 -8 -10 -3 -1 17 37 13 -2 -25 -24 -14
6261 -14 2 26 25 19 -18 -38 -20 5 7 -2 -5 -9 -20 -9 10 8 27 1 -15 0 -13 6 18 46 11 -3 -22 4 -13 15 -3 28 16 -26
6295 -26 -4 -16 26 16 36 -4 3 -9 -23 16 38 22 21 -32 11 -2 12 8 46 -5 -2 -18 -4 -1 -5 7 -7 0 -30 -19 -13 7 19 37
6329 37 20 -17 -33 -13 57 24 18 19 14 -26 -17 -13 9 52 23 -6 -16 -2 -1 13 -1 12 -12 -24 11 -12 3 6 25 13 -39 -19 -12 37
6363 37 25 31 -11 -18 -19 -37 14 28 22 -10 -25 -37 -11 17 23 37 5 -5 2 -9 2 14 34 1 -2 -4 -8 -22 35 39 39 0 -31 1 10 -1
6399 -1 29 33 -14 -30 -5 8 24 29 39 -9 -18 -5 -34 10 0 28 -4 4 -26 -11 1 29 0 7 -6 -20 3 -1 25 41 -11 -26 -8 -27
6433 -27 2 23 7 45 2 -37 -2 20 27 10 26 -2 -2 -9 -4 23 6 14 25 -9 11 -45 5 5 2 14 5 1 -9 1 -4 51 -19 -12 -31 -17
6469 -17 1 7 24 5 4 -40 6 3 18 29 30 35 1 -30 3 35 46 1 29 16 -11 -11 33 42 36 32 -5 -35 -38 11 2 24 27 -12 -23 -23 9
$$ packed form
6225b4J8K8j7j5j3Mr%N9l3k0J3j2J3J8jL1k2j2k2nOQM9j6l4kPKJ8K0k4j5k3JJ0
6261a4J6K4jol7k0J8K5Krlmj1J1J9kJ9k6j6J5j3J9J2K8l5j4j9K6j7K8j8L1j2m2
6295b6K2j2M2j0K0m0Pj2j4L9K2j6jn3M3j3J4mL8n1Lj6J4LmJ2j4Pl0J1OK0J2J8
6329C7j7l7j6K0P0l3oJnm0RMK2M3k9k9j0J4JJ4j4J3k4j2L5k3J5LJ9j2n2K0PM9
6363C7j2Om2pjj8N1J4ol2j5j2K6K8OJ4l2j0Pj1J1J2K0l3lkmj4N7M%l9l1L2Rj1
6399aL0Mm7j6K5J3J6NJ0m8rJ3k9M4j0K8l2Ql0J5J2K8k9Pj3j4K3mK6J6n2j5J8j9
6433b7K9K1j6L8m3l9L5K2Pj7J6k8%pNK7j7QJ1l4K0n6N0%lJ2rmj0J0nN5p0Pj9J4
6469a7J8OJ7j9jm4M6lJ5J1JNl4l1L3L2J1m5K8j3k7%M4Roml7l0lM9rK2Ll9j1%L2
$$ plain form
6506 9 43 29 -4 3 -34 -29 -9 25 20 17 12 -45 7 -4 29 14 36 -7 -32 -27 -9 15 36 -2 17 -22 -11 -13 -9 33 27 34 16 -20 -16 4
6542 4 11 24 16 -11 -1 -16 -15 28 22 22 -13 -35 -23 -45 -7 29 12 -14 -2 -31 -17 20 5 41 0 3 -13 -17 -8 37 23 15 -4 6 -17
6577 -17 10 3 51 32 -42 -3 -17 -7 24 47 68 2 -25 -31 2 13 26 6 -1 -8 -33 -41 -2 16 12 1 -55 -36 -18 3 29 15 -3
6610 -3 -30 -28 -19 36 33 8 11 -11 -13 -25 3 23 18 43 -10 -30 -35 -7 40 52 38 20 -33 -20 -18 13 36 20 -4 -50 -9 -34 -25 9 33
6645 33 13 -18 -17 -35 -1 -2 30 13 -4 10 -42 13 18 25 22 6 -54 -18 -13 36 27 10 21 -9 -43 -26 6 67 28 1 -7 -8 -15 21 41
6680 41 28 6 -9 -23 -33 -6 -1 43 0 -24 -8 -29 -37 13 -8 -3 -4 -11 -19 11 -11 25 24 8 -28 -3 28 17 49 34 -5 -6 -25 -20 43
6715 43 24 22 -11 -28 -21 -13 21 49 29 -20 16 -41 -28 23 22 21 14 -5 -12 4 -2 35 15 11 -5 -37 -57 -13 3 61 24 -19 -8 -24 -22
6750 -22 -12 20 53 10 -16 -22 -15 16 26 30 18 -24 -12 3 15 18 70 22 -13 -21 -33 19 33 49 25 2 -27 -14 -20 0 -3 15 -19 -21
$$ packed form
6506IL4j4l3Pl7NK0L4nlnn7N2j1L3j5K2m3k5NJ8K4K1l8J9l9J1kMM2oPj8l6MK0
6542DPJ3qk7J0j5JM3o%l5k2J2k2L8L6j7k6J2k9J4L7j5L6m1Lj6mRM5j4qj9J0k3
6577a7K7pM8j9p4L9j4J0L1K3K1o6k7oL3J1J3k0ppk5qL9J8mj1n6J9J8K1K6j4j8
6610ck7KRN5lk5Lk2kj2K8K0nK5n3k0nK8M7J2j4j8n3J3KL1K3j6k4m6M1k5RL4K4
6645C3k0l1Jj8L4jL2j7j7J4n2N5NPlj6o0L6NM9rj7J1l0l4J7L2O1l9k7qjpL6K0
6680D1j3k2j5j4j0K7NM4m3k4J6k1qN0k1NjpqL0k2L6jj6l6K5L1j1L2j5l9jj9NO3
6715D3j9kl3j7PQL4K8k0m9L6n7J3N1jjpj9pJ6oL7k0mj6l2k0M4J6N8l7m3J1j6K
6750b2J0L2L3m3k6oPL1J0Mj2m2J2J5J2LN2m8l5qj2N2J4J6k4k3k9J3oK0lJ8l4k
$$ plain form
6784 -21 -35 7 5 36 39 2 -27 -26 -40 16 37 7 18 -26 -6 2 -2 27 19 -5 -22 -18 -23 3 38 21 25 5 -10 -9 21 45 49 10 10 -24
6820 -24 -27 12 25 42 18 16 -38 -34 -9 23 19 19 6 -5 -32 -15 4 32 10 23 -21 -27 4 -4 31 29 1 -14 -31 -21 8 -1 68 25 -6
6855 -6 -23 -30 -10 26 46 29 2 -5 -26 -28 19 64 32 29 -31 -49 -25 23 34 36 -4 -3 -10 -8 7 25 21 18 -32 -43 -2 6 6 36 11 2 -31
6892 -31 -30 -32 5 44 10 21 -58 -18 -13 30 33 27 4 -19 -25 -17 7 33 38 16 -35 -3 0 12 44 23 11 -23 -22 -34 -11 27 25 -8 -21 -22
6928 -22 -42 -7 12 18 14 -15 -4 -32 -49 7 42 29 24 -26 -26 -12 21 6 31 13 -18 -54 -8 12 12 38 14 -9 -17 -38 -8 34 43 33
6962 33 -1 -22 -29 11 30 28 -11 -14 -31 -25 0 15 14 17 18 -30 -53 -23 12 33 44 16 -17 -43 -32 -2 13 44 2 -9 -28 -22 19 44
6996 44 24 37 -4 -42 -31 16 31 29 26 30 -27 -8 -20 30 46 17 0 -15 -18 0 26 37 28 12 -9 -22 -12 -15 40 11 -30 -24 -35 -7
7030 -7 6 9 22 3 -16 -43 -30 -22 46 18 28 -15 -40 -32 1 53 37 4 0 -31 -27 -1 13 42 9 8 -30 -38 -32 20 -4 21 -3 -24 -35
$$ packed form
6784b1j4M2kL1Ll7k9Jj4N6K1l0J1m4K0QmK9qk4j7MnK6L5j7Mk0j5JL0K4Ml9%l4
6820b4lL9J3J7k4kn4MK5L2m%j3j1k7J7J9K8k2J3m4oL1qL5kk8j5j7J0K9rO9m3l1
6855fj7pK0L6K0j7k7pk1kM7M5l2lo0j8K4M8J1Km0JpKJ5J8mln0j1M1Q%L0k5rl3
6892c1JkL7L9l4J1p9M0NM3Lok3k3oQK4K6Nk2n1L2LJ2L2k1j2l4Jj2K3L8kl3j3j
6928b2k0L5J9Omk9J1k8j7N6L5j3nn0%J4L3j5K5j8l1l6M6K0%K6k4k3qk1L0M2Rj0
6962C3l4k1pM0J9kl9lj7OK5J5jLJm8k3L0L5K1J1k8l3k6J1L0J5L1m2j1j9OM1K5
6996D4k0J3m1l8J1M7J5klMn7J9j2N0J6k9j7j5lJ8K6J1rj6k1j3J0lN5k9m1Oj1K8
7030gJ3LJ3j9j9k7J3QO8k8J0m3k5QL3N2j6l3ml1MK6J4K9l3jl8qON2k4K5k4k1j1
$$ plain form
7065 -35 -9 -25 16 17 -9 -11 -45 -28 -11 46 23 19 -10 -52 -21 -22 9 57 23 -20 -38 -21 23 12 44 44 4 -35 -12 -11 10 42 14
7098 14 12 -16 5 -16 -12 22 39 26 -33 -25 -14 12 45 16 10 -10 -20 -17 -19 13 22 18 -12 -46 -49 19 9 9 24 4 -29 -28 -21 12 30 35 25
7135 25 -32 -29 13 30 17 56 20 -10 -28 1 11 26 8 45 -11 -52 1 -3 27 -4 22 -10 -54 -31 -6 3 23 8 5 -33 -29 -9 15
7168 15 36 31 -13 -23 -17 -19 -3 63 3 -20 -27 -26 -11 2 26 42 15 -24 -2 -25 26 16 31 24 -3 -18 -4 -7 10 28 22 -25 -56 -14
7202 -14 -16 5 35 -12 -24 -34 -12 3 -6 17 24 -4 -19 -40 -23 -5 -1 22 12 -28 -23 -1 7 32 33 15 5 -32 -5 15 34 29 21 -8 -35
7237 -35 4 26 51 17 37 4 -24 1 -32 14 29 21 10 -48 -30 -7 21 3 0 1 -32 -42 0 -5 28 49 7 15 -37 -35 -3 20 47
7270 47 -9 -41 -50 -29 2 20 27 29 -4 -12 -6 2 40 26 2 19 -24 -9 -16 23 31 27 9 -38 -2 -12 -7 32 37 -8 -42 -44 -30 10 -8 26
7306 26 -13 -22 -54 -8 -16 -9 12 4 -7 -33 -39 7 55 13 16 -12 -48 -22 -4 23 19 34 -3 -5 -20 -27 26 61 34 -7 4 -9 -12 36 31 12
$$ packed form
7065c5K6j6M1Jk6kl4J7J7N7k3mk9m2L1jL1M8l4m3j8J7M4j1L2%m0l9K3JK1L2k8
7098A4kk8K1k1ML4J7j3n9QJ1K6L3k9ok0j0LkL2Rml0l4lO8j0%J5k0l3JPL3J8Nj0
7135B5n7LM2J7j3L9l6l0j8K9J0J5j8L7n6m1N3mL0l1K6l2m4K3K5RK0j5ll8MK0K4
7168A5K1nm4j0OkJ6O6o0k3pJJ5J3K4J6k7l9K2k3N1j0J5pk7j5J4lJ7J8om7l1M2
7202a4kK1L0m7j2j0K2J5rK3Pk8j5k1J7J8MK3j0m0NK2QK5Jj8j0l7K7K0J9nqk9k7
7237c5L9K2K5l4K0l3k8K5l3M6J5qj1n8J8K3K8j8lJl3j0M2nL3K1m2Qn2KL2K3K7
7270D7n6l2rK1L1J8PKl3qOQL8j4k4J7m3J5pL9Qmj8m7L6j0NL9Nm5l4kJ4M0j8L4
7306B6l9rl2M6qPK1qj1k6oM6M8m2Lk8l6K6J8K7mJ5l7kj5pN3L5k7m1J1j3lM8nj9
$$ plain form
7342 12 23 -15 -22 -4 -5 13 7 13 -11 -44 -44 -12 37 30 51 0 -2 -29 -43 38 -2 9 0 18 -34 -12 9 43 27 0 -12 -5 -19 16 34
7377 34 28 21 20 -24 -33 17 12 15 20 16 -14 -22 15 14 15 5 -7 -12 -35 -14 -3 31 13 -30 -35 -37 -13 12 -7 18 36 -22 -17 -30 -7 27 9 23
7415 23 1 -32 -8 7 -20 19 29 -8 -3 -23 -15 4 18 16 -1 -17 -14 -7 -7 2 4 -7 -31 -36 3 11 24 41 4 -39 -23 -26 -4 26 21 -16
7451 -16 -14 -34 4 17 16 14 -4 1 -40 -19 -27 -8 40 13 13 -12 7 16 27 19 27 -4 4 4 -16 24 16 -8 30 -31 -19 -14 20 -11 -11 -7 -20 -27
7489 -27 -59 1 1 18 6 -3 -17 -9 8 -17 35 27 -28 -34 14 2 22 3 12 -8 -19 -25 4 -16 17 -8 -4 7 -11 -14 25 36 8 -15 -10
7524 -10 -35 -8 13 16 -11 8 -23 -24 -35 -21 26 13 -9 1 -22 1 -16 -2 11 12 6 -24 -39 -31 15 21 2 -9 7 -9 -14 -1 33 3
7558 3 10 22 -11 -1 17 35 32 -9 -11 -14 4 -8 26 31 -10 -12 -10 -7 1 41 -8 23 -1 1 -18 -9 32 2 18 -8 -1 -18 22 -12 25 20 21 -20
7596 -20 -19 -11 -18 32 26 39 2 5 3 21 16 -19 1 9 -15 19 6 3 9 -22 31 11 33 -4 18 -14 30 13 18 -25 -2 25 22 8 -7 -19
$$ packed form
7342A2J1l8pJ8jJ8oOk4l3%L2M9pK1n1kk7j4Q1m0J1rJ8n2K2K1L4j6k7j2Pj4L5J8
7377C4opjm4rN0nLNml0qL7jJj0j2nk3K1J1L4j8m3nkK4K5j9K5J8n8Nj3K3L4j8J4
7415B3k2l3K4J5k7L9J0l7Nk0QJ9J4kj7j6LP%RKj1k4nL9QJ3J7l7m3J6lK2L0nl7
7451a6Kk0L8J3jkj8Nm1K1qJ9M8k7%k5J9RJ1qQl1Q%k0M0qk4L8o1J2NL4l1%Mj3p
7489b7l2O0%J7j2rj4QJ7k5N2qn5oM8j2K0j9Rk0j1oK9k0L3k5MJ1j8lL9J1k8k3N
7524a0k5K7K1Lk7J9l1jj1J4M7j3k2J0k3K3j7J4J3Jol0j5QM6Oj9j1J6j6nJ3L4l0
7558CPJ2l3J0J8J8lm1klJ8j2L4Nm1kKLQM0m9L1k4Kj9RM1l0J6k6Pj7M0l4L7nJm1
7596b0JQpN0oJ3l7LkJ8nl5K0Qk4L4j3lOl1N3k0K2l7K2l2M4j7Nm3K3K7lj4j5j2
$$ plain form
7632 -19 -31 13 -24 18 5 -5 -15 -20 17 23 -1 -1 5 -4 9 -5 0 14 15 9 0 -4 -18 -2 16 15 32 -14 -21 -12 -4 7 -4 30 -7 -1 -24 39
7670 39 12 13 17 30 -36 -35 1 -3 7 11 -6 7 16 -13 -14 17 23 26 7 -16 -21 -21 1 -4 34 34 -12 -18 -4 9 15 8 26 11 -29 12 -22 -9
7708 -9 30 -1 3 2 5 23 -5 24 24 -4 14 -7 -7 -4 35 14 5 -16 -25 -33 12 14 18 -14 -17 -11 -1 -6 12 2 20 -24 -31 2 29 3 -3 34 20
7747 20 -28 -14 -6 29 28 2 6 -12 -16 -12 7 27 33 9 -28 -8 -20 15 1 1 21 -31 -24 10 20 19 26 9 16 -29 -11 6 21 14 11 11 4 -25
7785 -25 30 2 28 -11 6 -10 -14 -3 -5 22 44 23 -12 -1 11 7 53 29 9 -11 -6 -6 -3 27 1 9 -1 -10 -10 -29 2 5 12 -22 -37 -17
7821 -17 -13 10 0 29 -1 -35 -31 -19 -17 8 18 -13 -26 -18 1 27 16 25 17 -28 -1 -13 19 4 1 17 31 4 -5 -13 24 14 13 -6 -21
7856 -21 -31 -26 17 -4 6 5 -45 -22 -5 11 -2 15 -21 -3 -20 5 -32 8 5 -6 -9 -18 -12 12 31 35 2 -20 1 -22 11 6 40 33 15
7891 15 -1 -2 4 22 46 29 20 -17 -29 4 12 24 25 -12 -27 -13 -5 -22 44 22 8 -27 -23 -17 -29 27 16 9 -6 -20 -2 -1 22 18 23 -22
$$ packed form
7632a9j2M4l7M2j3j0j0nL7Ok4%OrJ3j4NJ4Jormj4J6J8jJ7m6pRQJ1j1L4l7Ok3O3
7670C9k7JMJ3o6JL6mJ0Mj7J3Rk9jL1OLj9k3n%K2nL8%m6oJ4J3OpJ8j5m0M1l4J3
7708iL9l1MjLJ8k8K9%k8J8k1%LL9k1rk1rqM5KMl2lOJ0nJ8j0J8m4pL3K7k6oL7j4
7747B0m8J4QL5jk6Mj8mMJ9K0Ok4l7K0j2L5j4%K0n2PL4J0jPj7Pm5J8J7J5pl%pk9
7785b5N5k8K6l9J7j6mJ1kK7K2k1l5J1J2mM6k4k0k0N%LL0k6Qj0r%j9L1LPl4j5K0
7821a7MK3j0K9l0l4MJ2KK5J0l1j3QJ9K6j1Rqm5K7j2L2j5lJ6J4k7rqL7j0jj9j5
7856b1j0NM3k1J0jn0K3J7J6j3J7l6J8j7K5l7M0lj1lrOK4J9Ml3k2K1k3L3nL4pj8
7891A5j6jOJ8K4j7rl7j2L3QJ2Jl7j5J4Qj7O6k2j4l5MOj2N6j1pj5j4J8JK3mNm5
$$ plain form
7927 -22 -10 -18 -14 37 23 40 8 -4 -4 -11 31 45 26 1 -21 -12 6 5 60 39 0 10 -22 -15 2 24 38 7 -10 -17 2 -12 10 15 -6
7962 -6 -15 -16 -24 8 -10 25 42 11 -7 -12 -19 18 21 25 10 -3 -19 11 17 47 57 4 -10 -22 17 15 27 10 10 -6 -16 -19 17 10 19 -30 -7
7999 -7 -35 -37 6 7 34 3 -3 -5 -15 -36 6 43 5 -8 -38 -13 -47 11 -4 18 -2 16 -29 -17 12 14 8 -4 4 -14 6 13 17 35 6
8034 6 -8 -13 -14 13 -7 23 20 -12 3 -20 -8 25 15 -14 -34 -19 -37 -28 25 21 17 -17 -31 -32 -16 -14 18 22 2 -17 -28 -13 20 -3 35
8069 35 5 -25 -17 -16 -6 16 46 43 12 -23 -23 11 43 43 17 0 -16 -28 -21 28 20 12 -9 -35 -29 -9 7 10 12 23 -15 -58 -25 31 21 34
8105 34 18 -42 -19 -29 -4 16 8 8 -2 -19 -10 -2 37 0 33 0 -26 -10 24 6 15 25 18 -12 -15 4 17 24 44 -19 -32 -35 -5 7 23
8140 23 17 3 -5 -20 -14 32 -1 0 7 12 -17 -27 17 17 7 -12 -9 -25 14 6 23 33 12 -9 -27 -26 -11 31 33 12 -1 -51 -39 1 4 29
8176 29 17 15 -16 -27 -11 -5 44 0 8 -35 -34 0 1 35 26
$$ packed form
7927b2J2qMN1j4J7l2j2%pM2J4j9k5k2RJ8jN5k1l9J0l2PJ7K2J4l1j7pJ9j4K2Nk1
7962frjqL2j8L5J7l1j8npL7LMj5j3j6L0OL0J0n3j4j2L9kJ2j7%j6j0lL6pRm9K3
7999gk8kM3JK7l1okj0k1M2L7l8j3l0K5l4N8j5K2k0J8m5J2K9Koj2Qj8K0PMJ8k9
8034Fj4njK7k0L0ll2J5k3J2L3j0k9k0J5j8RN3mml4j4jJ6KL2Mk0j9j1J5L3k3L8
8069C5l0l0QJJ0K2L0ll1l5%L4L2%k6j7j6j2PM9qqk1k6OK0J6LKJ1l8m3L3N6j0J3
8105C4j6o0K3j0K5K0q%j0j7RQL9l7L3l3k6J6L4j8RJ0pl0lJ9J3PK0o3j3lL0J2J6
8140B3oj4qj5OM6l3JPNk9j0M4%j0j9Lj6L9qJ7J0k1k1j8JJ5M2Kk1j3n0J2M0LK5
8176B9j2kl1j1J6OM9m4Qm3JL4JL4r
8191B6
$$ Imaginary data points
##PAGE= N=2
##DATA TABLE= (X++(I..I)), XYDATA
$$ plain form
0 0 0 0 0 0 0 0 0 0 0 8 0 8 -8 8 -16 16 -24 24 -32 40 -48 56 -64 80 -88 104 -120 140 -163 184 -211 243 -274
33 -274 309 -349 391 -442 495 -551 616 -684 760 -843 932 -1031 1140 -1255 1387 -1525 1679
50 1679 -1853 2041 -2249 2484 -2745 3042 -3382 3768 -4226 4767 -5415 6223 -7246 8599
64 8599 -10477 13261 -17834 26647 -49887 242761 582334 97837 -123851 -248977 -414220
75 -414220 -277251 289372 503380 233592 -59980 -216485 -371071 -261427 131247 411306
85 411306 303957 10026 -233368 -305212 -216092 32569 317662 360949 48321 -248492 -267561
96 -267561 -177879 -39420 261586 396106 86314 -245372 -244157 -175454 -90144 213743 406085
107 406085 132321 -202894 -236169 -190300 -116757 165252 373870 183066 -131314 -237587
$$ packed form
0@%%%%%%%%%QqQj6J6k4L2m0M8n6P2q8J04j20J44j68J92k24K60l03L47l95M54n17
33b74N83o58P40q33R37j046J167j300J444j603J775j963K171k395K642k912L204
50A679l532L894m290M733n229N787o424P150p994Q993j0182J1638j3469J5845
64H599j9076K3738l1095M4481p6534K92648L39573m84497k21688j25126j65243
75d14220J36969N66623K14008k69788k93572j56505j54586J09644L92674K80059
85D11306j07349k93931k43394p1844Q9120K48661K85093M3287l12628k96813j9069
96b67561Q9682J38459L01006J34520l09792l31686J215O8703Q5310L03887J92342
107D06085k73764l35215l3275M5869P3543K82009K08618j90804l14380j06273
$$ plain form
117 -237587 -212828 -113324 118424 308843 226601 -45457 -242169 -235933 -94425 79518 234224
128 234224 256409 35272 -238120 -254449 -81467 49211 173642 268616 97087 -215505
138 -215505 -263481 -89789 24496 137370 264140 137613 -170218 -259979 -120407 1382
148 1382 121298 245518 159544 -108394 -244758 -163247 -20938 115706 217415 168861 -40140
159 -40140 -219923 -205672 -43782 111602 187264 170247 21973 -187818 -236433 -69179 101364
170 101364 162028 168879 70110 -150301 -249052 -98911 80557 145900 167562 99733 -109640
181 -109640 -241403 -131512 48830 138078 167738 113004 -69331 -217182 -162319 9601 133544
192 133544 169382 115697 -33746 -184058 -185733 -31654 125723 171303 116571 -3510 -149152
$$ packed form
117b37587K4759R9504K31748J90419q2242k72058j96712O236J41508J73943J54706
128B34224K2185k21137k73392j6329J72982J30678J24431R4974j71529l12592
138b15505m7976J73692J14285J12874J26770j26527l07831q9761J39572J21789
148A382J19916J24220q5974k67938j36364Q1511J42309J36644J01709m8554k09001
159d0140j79783J4251J61890J55384P5662j7017j48274k09791m8615J67254J70543
170A01364O0664O851r8769k20411r8751J50141J79468O5343K1662o7829k09373
181a09640j31763J09891J80342Q9248K9660n4734j82335j47851N4863J71920J23943
192A33544L5838n3685j49443j50312j675J54079J57377M5580n4732j20081j45642
$$ plain form
203 -149152 -198741 -70668 109045 171372 121261 20849 -117752 -199561 -103346 82092 167307
214 167307 131081 40776 -90941 -189553 -128025 47084 157368 143401 57683 -68418 -172103
225 -172103 -143958 9210 141281 154681 73036 -48868 -151589 -151748 -26013 120143 161583
236 161583 87826 -30828 -131446 -153356 -55429 95286 162265 102547 -12575 -113378 -150974
247 -150974 -78156 67896 156170 117101 7091 -97225 -146156 -94258 40364 143909 129363
258 129363 27648 -81627 -139874 -105435 14087 126795 137598 48811 -64410 -132178 -113324
269 -113324 -10031 106303 140452 68750 -45178 -122595 -118342 -30524 84996 137646 85128
280 85128 -25098 -111358 -121138 -47494 64320 130731 97789 -4941 -98439 -122082 -61928 44618
$$ packed form
203a49152m9589J28073J79713O2327n0111j00412j38601q1809R6215J85438Q5215
214A67307l6226r0305j31717r8612O1528J75109J10284j3967q5718j26101j03685
225a72103K8145J53168J32071J3400q1645j21904j02721j59J25735J46156M1440
236A61583p3757j18654j00618k1910R7927J50715O6979n9718j15122j00803l7596
247a50974P2818J46052Q8274l9069j10010j04316m8931N1898J34622J03545j4546
258A29363j01715j09275n8247L4439J19522J12708J0803q8787j13221o7768J8854
269a13324J03293J16334L4149p1702j13928p7417M253Q7818J15520N2650n2518
280H5128j10226q6260r780P3644J11814O6411l2942j02730r3498k3643O0154J06546
$$ plain form
292 44618 121102 106860 14671 -83813 -121132 -74443 25972 109706 112510 32649 -67974 -118010
304 -118010 -85162 8201 97072 115256 48942 -50977 -112454 -94087 -9125 83072 115149 63366
316 63366 -33101 -104154 -100843 -25926 67744 112398 75461 -14953 -93386 -104803 -41491 51510
328 51510 107024 84912 2416 -80753 -105847 -55213 34953 99457 91815 18789 -66708 -104176
340 -104176 -67015 18228 89781 96104 33797 -51806 -99994 -76446 2019 78380 97644 47020
352 47020 -36358 -93470 -83468 -13384 65710 96597 58439 -20657 -84849 -88204 -27720 52080
364 52080 93170 67563 -5280 -74385 -90476 -40705 37979 87702 74316 9275 -62430 -90125
376 -90125 -51955 23992 80567 78361 21970 -49729 -87152 -60938 10549 72301 80122 32630
$$ packed form
292D4618P6484j4242r2189r8484l7319M6689J00415Q3734K804p9861j00623n0036
304a18010L2848R3363Q8871J8184o6314r9919o1477J8367Q4962R2197L2077n1783
316F3366r6467p1053L311P4917R3670M4654l6937r0414p8433j1417O3312R3001
328E1510N5514k2112q2496q3169k5094N0634R0166O4504p642p3026q5497l7468
340a04176L7161Q5243P1553O323o2307q5603m8188K3548P8465P6361J9264n0624
352D7020q3378n7112J0002P0084P9094L0887l8158p9096o4192l355O0484P9800
364E2080M1090k5607p2843o9105j6091M9771P8684M9723j3386o5041p1705k7695
376i0125L8170P5947N6575k206n6391p1699l7423K6214P1487O1752P821m7492
$$ plain form
388 32630 -36863 -81866 -67830 -2605 63054 80227 41522 -24219 -74563 -72549 -15461 52826
400 52826 79150 48862 -12603 -65974 -74816 -27329 42005 77127 54826 -2364 -56761 -74791
412 -74791 -38159 30159 73976 60129 7237 -47038 -72424 -47620 17171 69008 64629 16286
424 16286 -37367 -68176 -54494 3978 61762 68004 24998 -28349 -62660 -58288 -8623 52070
436 52070 69924 33680 -20201 -56848 -59082 -19757 40280 70043 42382 -12583 -51356 -57782
448 -57782 -28700 27454 67921 50676 -4699 -46152 -55580 -35381 14854 63226 57658 4342
460 4342 -40767 -53627 -40045 3530 55655 62197 14879 -34275 -52446 -42913 -5512 45567 63389
473 63389 26591 -26323 -52064 -44448 -11961 33952 61186 38189 -17056 -51747 -45255 -16264
$$ packed form
388C2630o9493m5003J4036O5225O5659J7173l8705o5741n0344K014N7088O8287
400E2826K6324l0288o1465n3371q842M7487O9334L5122k2301n7190n4397j8030
412g4791L6632O8318M3817j3847n2892n4275k5386K4804O4791N1837m379m8343
424A6286n3653l0809J3682N8472N7784O242m3006n3347l4311M372M9665O0693
436E2070J7854l6244n3881l6647k234L9325O0037K9763k7661n4965l8773o426
448e7782K9082N6154M0467j7245n5375m1453r428K0199N0235M8372n568n3316
460D342m5109j2860J3582M3575N2125O542m7318m9154j8171R533L7401N1079J7822
473F3389l6798n2914k5741P616L2487M5913K7234k2997n5245l4691O492K8991
$$ plain form
485 -16264 22334 56240 47997 -6798 -50268 -46048 -19562 12286 49650 54577 4030 -46246 -47339
498 -47339 -23301 4774 42493 56703 14885 -38524 -49179 -28311 282 35668 54088 24884
510 24884 -27372 -50890 -34499 -1913 29694 48005 33139 -14283 -51332 -40928 -3364 24651
522 24651 40616 38866 -1382 -49383 -46362 -5961 20200 34372 41781 9349 -44088 -49603 -11216
535 -11216 15932 30782 41942 16553 -35392 -50131 -19343 11509 30040 39675 20312 -23870
547 -23870 -47877 -29371 6731 31026 35869 21706 -11053 -43383 -39305 1336 31921 31807 21845
560 21845 517 -37435 -46374 -4709 30923 29124 22060 8556 -30715 -48938 -11789 26613 28744
573 28744 23467 12221 -23999 -46464 -19457 18829 30332 26199 12317 -17524 -40039 -27040
$$ packed form
485a6264L8598L3906q243n4795m3470M220K6486L1848L7364M927n0547n0276j093
498d7339K4038K8075L7719J4210m1818n3409j0655K0868K8593L5386J8420k9204
510B4884n2256k3518J6391L2586L1607J8311j4866m7422l7049J0404L7564K8015
522B4651J5965j750m0248m8001L021M0401K6161J4172P409l2432n3437n515L8387
535a1216K7148J4850J1160k5389n1945j4739L0788L0852J8531R635j9363m4182
547b3870k4007J8506L6102K4295M843j4163l2759l2330M078M0641L0585j14r962
560B1845k1328l7952q939M1665L5632j799p064j3504l9271j8223L7149L8402K131
573B8744n277j1246l6220k2465K7007L8286J1503m133j3882k9841k2515J2999
$$ plain form
585 -27040 8583 32257 29528 10804 -11689 -31904 -33081 -1979 32875 32486 9781 -6611 -24256
598 -24256 -36647 -11049 30740 34184 10789 -2553 -18885 -37240 -17450 25345 34378 14626
610 14626 581 -16218 -34884 -21183 16901 33196 20791 2805 -15676 -30388 -22837 6762
622 6762 30780 27658 4857 -15775 -25132 -23260 -3240 27033 33263 7579 -15011 -20598 -23050
635 -23050 -11013 22169 35878 11246 -12620 -17977 -22755 -15370 16558 34966 15858 -8330 -17310
648 -17310 -22666 -16631 10683 31130 20787 -2707 -17739 -22801 -15937 5101 25730 25220 3441
661 3441 -18073 -22866 -14676 231 19947 28209 9232 -17146 -22718 -14115 -3712 14812 29105
674 29105 14067 -14177 -22201 -14876 -6451 10827 27639 17635 -9169 -21276 -16925 -8048 7974
$$ packed form
585b7040L5623K3674k729j8724k2493k0215j177L1102L4854l89k2705j6392j7645
598b4256j2391K5598M1789L444k3395j3342j6332j8355J9790M2795R033j9752
610A4626j4045j6799j8666J3701L8084J6295j2405j7986j8481j4712P551K9599
622F762K4018l122k2801k0632r357J872K0020L0273O230k5684k2590n587k452
635b3050J2037L3182J3709k4632k3866n357m778P385L1928J8408j9108k4188q980
648a7310n356O035K7314K0447j0343k3494j5032n062O864K1038K0629n10k1779
661C441k1514m793Q190J4907J9716Q262j8977k6378n572Q603J0403J8524J4293
674B9105j5038k8244q024P325Q425J7278J6812j0004k6804j2107M351Q877J6022
$$ plain form
687 7974 24322 19908 -2958 -19670 -19525 -9084 6079 20159 20823 3293 -17316 -21824 -10190
700 -10190 4573 16297 20732 8547 -14096 -23057 -11811 2841 13336 20127 12209 -10199 -22734
713 -22734 -14028 490 11304 19146 14353 -5830 -20896 -16434 -2446 9822 17996 15253 -1501
726 -1501 -17996 -18467 -5625 8451 16772 15389 2329 -14428 -19730 -8872 6693 15508 15256 5505
740 5505 -10709 -19845 -11770 4322 14170 15182 7859 -7237 -18786 -13998 1413 12709 15202 9467
754 9467 -4158 -16847 -15525 -1801 10960 15269 10638 -1591 -14369 -16289 -5008 8874 15144
767 15144 11598 714 -11767 -16360 -7937 6354 14644 12508 2815 -9231 -15837 -10262 3520 13593
781 13593 13329 4765 -6864 -14814 -11934 564 11972 13849 6647 -4585 -13425 -12932 -2242 9872
$$ packed form
687G974J6348m414k2866j6712J45J0441J5163J4080O64j7530k0609m508J1634
700a0190J4763J1724M435j2185k2643q961J1246J4652J0495O791p918k2408j2535
713b2734Q706J4518J0814P842m793k0183j5066M462J3988J2268Q174k743j6754
726a501j6495m71J2842J4076Q321j383j3060j6757n302J0858J5565Q815k52r751
740E505j6214r136Q075J6092R848J012p323j5096j1549M788J5411J1296K493n735
754I467j3625j2689J322J3724J2761M309m631j2229j2778j920J1281J3882O270
767A5144l546j0884j2481m593Q423J4291Q290k136r693j2046o606N575J3782J0073
781A3593k64q564j1629p950K880J2498J1408J877p202j1232q840M93J0690J2114
$$ plain form
795 9872 13990 8335 -2354 -11816 -13335 -4736 7500 13654 9800 -310 -10157 -13275 -6667 5165
809 5165 12882 10931 1597 -8513 -12986 -8223 2837 11766 11778 3518 -6789 -12462 -9396 613 10285
824 10285 12220 5377 -4940 -11707 -10342 -1506 8557 12265 7040 -2939 -10635 -10951 -3420 6619
838 6619 11825 8410 -908 -9348 -11158 -5106 4636 11046 9334 1021 -7811 -11076 -6442 2758 9999
853 9999 9964 2768 -6172 -10692 -7553 992 8755 10219 4353 -4529 -10055 -8398 -744 7375 10182 5642
869 5642 -2813 -9191 -8970 -2330 5877 9833 6712 -1130 -8110 -9261 -3774 4266 9226 7572 559
884 559 -6805 -9264 -5079 2631 8360 8145 2150 -5347 -9017 -6165 984 7342 8445 3589 -3776 -8468
900 -8468 -7015 -602 6120 8436 4829 -2219 -7676 -7593 -2078 4830 8183 5793 -681 -6710 -7897 -3362
$$ packed form
795I872M118n655j0689r462j519Q599J2236O154l854j0110r847l118O608J1832
809E165P717j951r334j0110m473M763J1060Q929J2q260j0307n673L066J0009R672
824A0285J935o843j0317o767J365Q836J0063L708n225r979p696l16P531J0039
838F619N206l415r318q440j810O052R742O410j712q313q832l265M634R200P241
853I999l5p196q940m520L139Q545P763J464n866q882n526J657P654Q119K807m540
869E642q455o378K21O640Q207L956l121p842o980j151N487Q040M960j654p013
884E59p364k459M185P710N729k15n995p497l670K852P149O358J103m856p365m692
900h468J453O413O722K316l607p048n457Q3N515O908L353k390o474o029j187M535
$$ plain form
916 -3362 3461 7700 6492 758 -5596 -7954 -4494 2125 7024 6955 2048 -4406 -7745 -5455 796 6243
932 6243 7189 3219 -3096 -7342 -6227 -512 5325 7243 4155 -1754 -6650 -6769 -1826 4283 7083 4926
948 4926 -504 -5738 -6994 -3015 3191 6737 5500 662 -4671 -6961 -4059 1966 6272 5914 1688
963 1688 -3601 -6664 -4918 738 5639 6175 2484 -2657 -6201 -5499 -490 4898 6343 3290 -1724 -5593
979 -5593 -5856 -1677 3960 6426 4049 -799 -4881 -5925 -2801 2803 6259 4730 147 -4052 -5786
994 -5786 -3718 1552 5794 5257 1094 -3261 -5444 -4334 305 5067 5605 1953 -2464 -5042 -4604 -785
1010 -785 4095 5733 2846 -1758 -4645 -4650 -1653 3012 5711 3711 -994 -4305 -4598 -2387 1865 5425
1026 5425 4543 -145 -3886 -4522 -2962 730 4872 5166 915 -3278 -4505 -3370 -191 4023 5379 2068
$$ packed form
916c362O823M239j208n734o354k358L460O619M899o9m907o454l339K290O251N447
932F243R46l970o315m246J115N715N837J918l088n909m896j19M943O109K800k157
948D926n430n234j256L979O206L546j237m838n333k290K902O025M306l58m226
963A688n289l063J746N656M901N36l691n141l544P02N009N388J445l053n014l869
979e593k63M179N637K466k377m848m082j044L124N604L456j529m583m199j734
994e786K068N270M242n37m163m355k183J110M639M762N38l652m417k578M38L819
1010g85M880J638k887m604k887nK997M665K699k000m705l311k93K211M252L560
1026E425q82m688l741o36J560L692M142K94m251m193j227J135L179M214J356l311
$$ plain form
1042 2068 -2467 -4430 -3714 -925 3038 5183 3155 -1423 -4354 -3975 -1405 2043 4719 4030 -321 -4218
1058 -4218 -4204 -1763 1186 4040 4616 793 -3844 -4411 -2139 439 3350 4901 1847 -3170 -4600 -2631
1074 -2631 -117 2771 4802 2752 -2133 -4603 -3312 -596 2337 4352 3396 -805 -4369 -4071 -1033
1089 -1033 2020 3801 3749 633 -3875 -4814 -1493 1749 3222 3852 1790 -3164 -5253 -2157 1329 2790
1105 2790 3846 2620 -2229 -5272 -2923 696 2599 3792 3048 -1180 -4806 -3773 -177 2554 3733
1120 3733 3083 -154 -3972 -4538 -1181 2519 3648 2892 788 -2905 -5063 -2213 2370 3594 2718 1546
1136 1546 -1848 -5214 -3182 1890 3538 2703 2050 -963 -4914 -3892 947 3377 3019 2279 -360 -4174
1152 -4174 -4301 -343 3062 3552 2322 -81 -3167 -4408 -1777 2542 4089 2406 111 -2125 -4230
$$ packed form
1042B068m535j963P16K789L963K145k028m578k931L79K570L448K676o89m351l897
1058d218J4K441K949K854N76l823m637n67K272K578K911J551l054n017j430J969
1074b631K514K888K031k050m885k470J291K716K933K015r56m201l564K98L038
1089a033L053J781n2l116m508r39L321L242J473O30k062m954k089L096L486J461
1105B790J056j226m849l043K349L619J903J193p44m228l626J033L596K731J179
1120C733o50l237l818n66L357L700J129p56k104l693k158K850M583J224q76j172
1136A546l394l366K032N072J648q35o53l013l951J022M839K430l58p40k639l814
1152d174j27L958L405M90j230k403l086j241K631M319J547j683k295k236k105
$$ plain form
1167 -4230 -3045 1825 4455 2584 345 -1263 -3865 -3912 917 4420 2983 756 -718 -3515 -4300 -107
1183 -107 3955 3511 1334 -535 -3070 -4211 -1204 3042 4062 2117 -465 -2704 -3850 -2222 1881
1198 1881 4495 2910 -367 -2311 -3360 -3024 619 4540 3651 -59 -1985 -2927 -3513 -519 4143 4196
1214 4196 577 -1675 -2700 -3612 -1287 3370 4474 1467 -1328 -2712 -3506 -1791 2350 4507 2542
1229 2542 -864 -2895 -3298 -2042 1215 4262 3565 -264 -2999 -3111 -2193 200 3805 4296 444 -2895
1245 -2895 -3108 -2377 -565 3162 4650 1290 -2532 -3206 -2567 -1020 2482 4601 2147 -1839 -3396 -2855
1261 -2855 -1258 1822 4257 2972 -944 -3482 -3152 -1362 1225 3700 3595 51 -3416 -3475 -1525 676
1277 676 3146 3933 1036 -3010 -3746 -1846 270 2609 3998 1799 -2399 -3856 -2275 -109 2195 3840
$$ packed form
1167d230J185M870K630j871k239j608k602m7M829L503j437k227j474k797p85M193
1183a07M062m44k177j869k535j141L007M246J020j945k582k239j146J628M103
1198A881K614j585l277j944j049L36L643L921q89l710j926r42n86K994M662N3
1214D196l619k252j025r12K325M657J104l007k795j384p94J715M141K157j965
1229B542l406k031m03J256L257L047o97l829k735j12R18K393L605M91l852l339
1245b895k13P31J812L727J488l360l822o74O39J547L502K119k454l986j557N41
1261b855J597L080K435j285l916k538L30J790K587K475j05l544l467n9J950K201
1277F76K470P87k897m046p36J900K116K339J389k199m198j457J581K166K304J645
$$ plain form
1293 3840 2417 -1557 -3853 -2815 -492 1899 3561 2845 -601 -3603 -3350 -888 1594 3231 3101 296
1309 296 -3165 -3760 -1441 1277 2964 3226 1096 -2546 -3922 -1977 830 2658 3245 1664 -1797 -3883
1325 -3883 -2516 320 2451 3219 2073 -1069 -3597 -3010 -281 2225 3163 2365 -363 -3213 -3432 -926
1341 -926 1893 3132 2570 272 -2743 -3707 -1598 1446 3070 2793 822 -2163 -3713 -2227 897 2932
1357 2932 2989 1253 -1619 -3568 -2735 243 2689 3155 1685 -1006 -3277 -3087 -463 2365 3243 2045
1373 2045 -508 -2916 -3299 -1068 1967 3268 2341 13 -2508 -3410 -1628 1445 3230 2636 410 -2142
1389 -2142 -3430 -2120 899 3069 2917 895 -1766 -3345 -2559 240 2836 3164 1324 -1351 -3149 -2842
1405 -2842 -408 2475 3342 1767 -870 -2895 -3020 -939 2027 3375 2165 -394 -2585 -3110 -1458 1428
$$ packed form
1293C840j423l974k296J038K323K391J662p16l446l002K53K462K482J637j30k805
1309B96l461n95K319K718J687K62k130l642j376J945K807J828N87j581l461k086
1325c883J367K836K131P68j146l142k528N87K729K506R38p98k728k850k19K506
1341i26K819J239n62k298l015r64K109L044J624k77j971k985j550J486L124K035
1357B932N7j736k872j949Q33K978K446M66j470k691k271J90K624K828Q78j198
1373B045k553k408l83K231L035J301r27k328k521r02J782L073J785n94k226k552
1389b142j288J310L019K170j52k022k661j579P86K799K596L28j840k675j798L07
1405b842K434K883Q67j575k637k025j25K081K966J348j210k559k191n25J652K886
$$ plain form
1421 1428 3295 2551 103 -2288 -3120 -1892 906 3088 2901 599 -1956 -3119 -2172 320 2759 3110
1437 3110 1140 -1568 -3010 -2475 -250 2370 3227 1652 -1120 -2883 -2660 -733 1863 3257 2097 -647
1453 -647 -2687 -2822 -1188 1358 3071 2527 -35 -2439 -2903 -1531 839 2829 2824 559 -2076 -2969 -1860
1470 -1860 346 2502 3025 1148 -1678 -3011 -2161 -88 2125 3065 1675 -1155 -2948 -2428 -483 1719
1486 1719 2989 2117 -570 -2797 -2722 -873 1327 2762 2485 120 -2536 -2946 -1265 939 2522 2725
1502 2725 745 -2092 -3130 -1665 564 2224 2776 1315 -1577 -3162 -2086 213 2031 2742 1736
1517 1736 -931 -3048 -2501 -194 1870 2629 1994 -308 -2756 -2907 -597 1678 2459 2130 287 -2381
1533 -2381 -3204 -1104 1394 2369 2197 749 -1960 -3313 -1620 1088 2369 2279 1075 -1410 -3207 -2152
$$ packed form
1421A428J867p44k448k391q32J228K798K182j87k302k555j163R47K492K439L51
1437C110j970k708j442N35K225K620Q57j575k772j763K23J927K596J394j160k744
1453f47k040j35J634K546J713n44k562k404m64J372K370J990nk265k635q93J109
1470a860K206K156N23j877k826j333Q50K073K213R40j390k830j793N20J945K202
1486A719J270q72k687k227P5J849K200J435k77k365k656m10J681K204J583K03
1502B725j980k837j038J465K229J660N52j461k892j585J076K299J818P11j006
1517A736k667k117N47K307K064P59o35k302k448j51K310K275P81l29j843k668
1533b381q23K100K498R75j72j448k709j353J693K708J281r0j204k485j797J055
$$ plain form
1549 -2152 652 2372 2378 1268 -876 -2919 -2644 26 2351 2517 1392 -358 -2488 -3035 -676 2195
1565 2195 2638 1526 56 -1980 -3184 -1314 1841 2723 1655 356 -1537 -3123 -1867 1289 2765
1580 2765 1915 519 -1239 -2831 -2287 580 2703 2344 676 -1025 -2403 -2523 -257 2540 2792 841
1596 841 -841 -1979 -2627 -1001 2168 3116 1137 -669 -1626 -2585 -1615 1669 3223 1546 -392 -1438
1612 -1438 -2461 -1948 1005 3094 2074 -22 -1412 -2283 -2035 296 2710 2616 385 -1469 -2146 -1976 -401
1629 -401 2192 3104 923 -1531 -1985 -1851 -1046 1608 3337 1454 -1348 -1913 -1799 -1397 1080 3316 1953
1646 1953 -927 -1900 -1854 -1552 557 2979 2440 -265 -1918 -2077 -1465 234 2397 2783 547 -1912 -2367
1663 -2367 -1344 -72 1729 2957 1339 -1765 -2592 -1370 -344 1148 2976 2027 -1402 -2725 -1509
$$ packed form
1549b152K804J720Oj110k144k043K75K670K325J66j125j750k130n47K359K871
1565B195M43j112j470k036j204J870L155Q82j068j299j893j586J256L156J476
1580B765q50j396j758j592N44K867K123l59j668j701j378j20K266K797K52j951
1596H41j682j138o48J626L169R48j979j806r57r59R70L284J554j677j938j046
1612a438j023N13K953K089j020k096j390q71K48K331K414r4k231j854o77J70J575
1629d01K593R12k181k454m54J34Q05K654J729j883k802n65J14M02K477K236j363
1646A953k880r73M6L02K109K422n39k705j653j59O12J699K163L86k236k459m55
1663b367J023J272J801J228j618l104q27J222J026J492J828r49l429j323J216
$$ plain form
1678 -1509 -557 754 2769 2392 -776 -2665 -1860 -757 581 2494 2535 -34 -2386 -2338 -966 565 2044
1695 2044 2531 764 -1962 -2783 -1232 568 1705 2401 1504 -1445 -3103 -1555 519 1353 2245 2004 -859
1712 -859 -3117 -1919 218 1166 2090 2213 -285 -2853 -2299 -252 1062 2026 2165 236 -2301 -2662 -841
1729 -841 1035 1986 2012 727 -1609 -2832 -1422 970 1936 1832 1079 -963 -2893 -1910 698 1901 1758
1746 1758 1340 -462 -2715 -2324 311 1774 1797 1492 -51 -2392 -2536 -263 1598 1965 1562 190 -1891
1763 -1891 -2591 -924 1268 2132 1602 361 -1391 -2531 -1541 898 2220 1662 477 -923 -2391 -2026
1779 -2026 488 2213 1822 663 -577 -2188 -2242 11 2040 1995 896 -350 -1905 -2331 -495 1732
1795 1732 2214 1246 -208 -1640 -2274 -1027 1292 2348 1540 -23 -1401 -2174 -1427 781 2336 1799 163
$$ packed form
1678a509R52J311K015l77l168j889Q05J103J338J913M1k569k352M8J372J531J479
1695B044M87j767k726q21J551J800J137O96q97k949j658J548K074Q34Q92k41k863
1712h59k258J198K137R48R24J23k498k568N54K047J314R64J39j929k537l61J821
1729h41J876R51K6j285k336j223J410K392R66j04p53k042j930R83K608J203j43
1746A758m18j802k253L91K635J463K3l05j543k341j44K273J861L67m03j372k081
1763a891p00J667K192Q64n30j241j752j140R90K439J322n58j185j400j468L65
1779b026K514J725l91j159j240j611n4K253K029m5j099j246j555m26J836K227
1795A732M82r68j454j432o34J247K319J056q08j563j378p73P47K208J555n37j636
$$ plain form
1812 163 -1194 -2037 -1714 279 2252 2066 425 -1033 -1906 -1880 -135 1965 2232 785 -815 -1834 -1952
1829 -1952 -511 1594 2343 1186 -572 -1738 -1959 -820 1187 2384 1559 -309 -1666 -1925 -1056 767
1845 767 2259 1896 -2 -1510 -1921 -1272 378 2027 2072 346 -1348 -1922 -1466 46 1799 2164 743
1862 743 -1084 -1957 -1595 -221 1500 2210 1117 -785 -1939 -1716 -500 1183 2143 1469 -411 -1838 -1850
1879 -1850 -754 874 2030 1725 -52 -1676 -1906 -933 584 1900 1903 349 -1448 -1961 -1179 307 1704
1896 1704 1958 688 -1144 -1984 -1415 69 1469 1959 1002 -798 -1945 -1611 -200 1271 1955 1257 -452
1913 -452 -1897 -1812 -481 1012 1891 1485 -125 -1724 -1940 -760 785 1831 1675 244 -1421 -1992 -1030
1930 -1030 530 1756 1802 545 -1181 -1986 -1322 244 1594 1866 815 -888 -1949 -1547 -44 1401
$$ packed form
1812A63j357q43L23J993J973j86j641j458q73K6J745K100K67j447j600j019j18
1829a952J441K105P49j157j758j166k21J139K007J197q25j868j357k59Q69J823
1845G67J492l63j898j508m11O49J650J649M5j726j694n74M56J512J753L65j421
1862G43j827q73L62J374J721P10j093j902j154K23J216J683R60o74j880j427j2
1879a850J096J628J156l05j777j624k30R73J517J316Lj554j797n13P82J486J397
1896A704K54j270j832q40N69J484J400M90r57j800j147L34J411J471O84o98j709
1913d52j445Q5J331J493Q79m06j610j599k16J180J545J046j56j431j665n71R62
1930a030J560J226M6j257j726q05O64J566J350K72j051j703j061M02J503J445
$$ plain form
1946 1401 1865 1076 -570 -1858 -1764 -329 1246 1874 1300 -273 -1700 -1934 -642 996 1863 1480 9
1963 9 -1505 -1969 -972 728 1825 1643 298 -1304 -2000 -1251 469 1764 1776 578 -1026 -1967 -1483 131
1981 131 1648 1895 836 -731 -1877 -1684 -155 1461 1933 1085 -501 -1755 -1813 -481 1210 1985 1331
1998 1331 -237 -1601 -1881 -818 934 1929 1547 50 -1424 -1936 -1107 609 1885 1705 338 -1221
2014 -1221 -1924 -1328 283 1740 1844 632 -995 -1867 -1486 -26 1561 1944 918 -746 -1805 -1607 -342
2031 -342 1317 2007 1190 -440 -1687 -1711 -611 1039 2001 1422 -187 -1524 -1815 -862 704 1871 1614
2048 1614 117 -1357 -1832 -1126 436 1749 1757 477 -1130 -1862 -1310 139 1513 1880 800 -888 -1865
2065 -1865 -1456 -147 1346 1940 1110 -574 -1751 -1629 -457 1075 1889 1389 -251 -1620 -1752 -703 789
$$ packed form
1946A401M64p89j646j288R4J435J575O28n74j573j427k34J292J638Q67l83j471
1963Ij514m64R97J700J097j82j345j602o96P49J720J295J2j198j604r41M84J614
1981A31J517K47j059j567j146J93J529J616M72q48j586j254n8J332J691P75o54
1998A331j568j364k80J063J752R95l82j497j474n12Q29J716J276j80j367j559
2014a221p03N96J611J457J04j212j627q72L81J460J587L83j026j664j059J98J265
2031c42J659O90q17j630j247k4J100J650R62n79j609j337k91R53J566J167k57
2048A614j497j474m75P06J562J313Qj280j607p32N52J449J374L67j080j688r77
2065a865M09J309J493N94q30j684j177J22J172J532Q14n00j640j369j32J049J492
$$ plain form
2082 789 1841 1558 100 -1436 -1819 -950 561 1717 1706 386 -1209 -1873 -1190 273 1543 1770 728
2099 728 -984 -1899 -1401 37 1347 1810 982 -687 -1843 -1537 -215 1168 1829 1230 -351 -1717 -1720 -469
2117 -469 972 1785 1439 -58 -1510 -1815 -791 734 1727 1595 250 -1249 -1882 -1064 508 1599 1662
2134 1662 560 -1017 -1884 -1279 230 1478 1674 801 -769 -1839 -1482 -38 1312 1698 1001 -496 -1727
2151 -1727 -1623 -300 1132 1738 1154 -268 -1579 -1703 -577 939 1718 1312 4 -1333 -1765 -832 729
2168 729 1716 1438 248 -1116 -1749 -1089 456 1629 1547 462 -888 -1746 -1339 184 1491 1632 721 -695
2186 -695 -1691 -1472 -95 1296 1691 926 -477 -1565 -1574 -419 1068 1719 1117 -241 -1453 -1637 -697 818
2204 818 1693 1294 14 -1230 -1702 -904 588 1651 1457 260 -1026 -1663 -1102 354 1564 1575 514
$$ packed form
2082G89J052k83j458j536l83Q69J511J156j1j320j595o64O83J463J270K27j042
2099G28j712r15M98J438J310M63q28j669j156L06J322J383O61n99j581j366lJ251
2117d69J441Q13l46j497j452l05J024J525R93j32j345j499o33Q18J572J091O3
2134A662j102j577q67O05J509J248J96q73j570j070L57J444J350L86o97j497j231
2151a727J04J323J432O06n84j422j311j24J126J516P79m06j308j337m32R33J561
2168G29R87k78j190j364o33O60J545J173q2j085j350q58M07J523J307J41r11j416
2186f95r96K19J377J391L95p65j403j088rJ155J487O51o02j358j212j84R40J515
2204H18Q75l99j280j244m72P98J492J063j94j197j286o37N61J456J210J1j061
$$ plain form
2221 514 -837 -1648 -1314 67 1370 1696 749 -621 -1597 -1450 -245 1188 1730 988 -419 -1503 -1540 -509
2239 -509 934 1698 1194 -193 -1332 -1620 -731 670 1679 1370 74 -1150 -1630 -1005 445 1546 1490
2256 1490 363 -978 -1615 -1144 191 1441 1593 584 -806 -1567 -1278 -78 1260 1680 837 -573 -1527
2273 -1527 -1400 -294 1060 1692 1052 -378 -1441 -1503 -558 842 1648 1238 -128 -1297 -1593 -769 597
2290 597 1577 1359 125 -1155 -1598 -935 401 1477 1470 384 -956 -1579 -1118 155 1334 1567 625 -766
2308 -766 -1536 -1237 -69 1164 1613 841 -573 -1493 -1331 -276 1007 1588 1027 -306 -1383 -1425 -518 779
2326 779 1567 1199 -85 -1234 -1508 -724 529 1457 1315 190 -1085 -1542 -893 334 1317 1411 413 -906
2344 -906 -1541 -1047 156 1176 1470 673 -635 -1465 -1178 -83 1030 1472 859 -435 -1366 -1275 -302 850
$$ packed form
2221E14j351q11L34J381J303L26r47j370r76J47J205J433N42p42j407j084l7J031
2239e09J443P64n04j387j139k88Q89J401J009l09j296j224m80O25J450J101n6
2256A490j127j341o37M71J335J250J52j009j390p61K89J200J338M20q43j410r54
2273a527J27J106J354O32o40j430j063o2R45J400Q06m10j366j169k96Q24J366
2290E97R80k18j234j280m43O63J336J076pj086j340o23M61J273J179K33r42j391
2308g66p70K99J168J233M49p72j414r20J62J055J283N81n61j333j077m2R07J297
2326G79P88l68j284j149k74P84J253R28j42j125j275m57O49J227R83R4r98j319
2344i06o35M94J203J020K94p97j308q30K87J095J113M42o13j294r31R1R73J152
$$ plain form
2362 850 1459 1025 -190 -1293 -1374 -517 659 1425 1136 58 -1129 -1436 -703 509 1308 1244 262 -912
2380 -912 -1472 -918 304 1172 1298 479 -767 -1448 -1061 118 1077 1311 677 -559 -1369 -1180 -136 967
2398 967 1351 861 -298 -1285 -1271 -341 821 1353 962 -84 -1101 -1327 -555 660 1325 1094 125 -958
2416 -958 -1384 -767 475 1246 1147 287 -811 -1396 -911 253 1140 1248 474 -636 -1318 -1047 27 1022 1289
2435 1289 652 -436 -1248 -1176 -204 902 1310 793 -263 -1124 -1233 -462 722 1336 925 -83 -988 -1279
2453 -1279 -594 543 1268 1048 109 -861 -1272 -762 356 1196 1129 280 -722 -1253 -912 148 1087 1202 460
2472 460 -595 -1200 -1028 -110 914 1242 600 -416 -1131 -1112 -317 754 1239 811 -245 -1010 -1111 -467 574
2491 574 1215 918 -41 -886 -1152 -599 405 1132 1075 177 -756 -1160 -736 232 1042 1078 341 -630 -1128 -805
$$ packed form
2362H50O09m34j215j103q1Q57J176P66k89j078j187l07P33J212P99o4r82j174
2380i12n60N54J222Q68J26q19j246o81L87J179R59K34o34j236q10J89J044J103
2398I67L84m90j159r87J4R30J162N32l91j046j017k26P72J215O65k31r69j083
2416i58m26O17J242P71r9q60j098n85M85J164Q87J08p74j110o82K71J074R95K67
2435A289o37j088q12P2R72J106M08n17j056q61j09P71J184O14m11j008r05k91
2453a279O85J137P25k20r39r70m11N10J118Q40o7q49j002n31L41J060R39J15p42
2472D60j055o05J72R18J024L28o42j016p15J9P95J071M85m28j056p65j01O44J041
2491E74O41k97r59q45k66N53J004P27n7q98r33m04M24R68Q10L6p37r71m98L23
$$ plain form
2511 -805 57 933 1144 528 -474 -1071 -885 -130 759 1139 670 -335 -1015 -1002 -281 599 1118 807 -161 -949
2531 -949 -1035 -427 472 1058 896 35 -827 -1060 -550 337 979 976 235 -695 -1053 -660 170 877 1023 403 -553
2552 -553 -1046 -759 7 771 1008 545 -348 -1012 -865 -121 649 1006 639 -186 -927 -987 -268 534 948 746
2572 746 -6 -853 -1030 -411 402 918 806 136 -699 -1021 -551 273 853 894 291 -548 -1030 -704 133 797
2592 797 933 427 -393 -951 -821 -46 754 917 497 -222 -900 -892 -184 616 901 595 -119 -824 -949 -330 514
2613 514 889 678 61 -665 -968 -487 371 845 779 135 -567 -955 -613 191 794 834 278 -450 -853 -689 25
2634 25 731 879 370 -322 -787 -762 -151 659 893 470 -155 -663 -795 -298 523 853 558 -57 -583 -800 -454
2655 -454 336 818 645 68 -496 -771 -540 162 721 702 148 -475 -712 -562 15 618 778 267 -358 -688
$$ packed form
2511h05Q62Q76K11o16j002n97J86P55Q89L80m69j005o80J3P21Q80N19l11r68p88
2531i49q6O08Q99N86j62q61q62k33N10Q87O42lp41r30l58L93Q30P07J46o20r56
2552e53m93K87P66P64K37m63q93o64J47P44P70L57l67q25p41o0P19Q02M14k02
2572G46p52q47j77O19Q13N16j12o70q35l22M70Q24N80M1o03q39m82L26Q37O64
2592G97J36n06q20n58J30P75Q00J63m20p19o78QP08Q00K85l06p14p05j25O19Q44
2613E14L75k11o17p26l03M81Q58M74o6o44p02l88L42Q04O03M0n56p28m03J64P14
2634B5P06J48n09o92m65K5O11Q10K34m23o25n08j32M97Q21L30k95o15n26k17L46
2655d54P90M82j73n77n64k75K31P02N59j9n54o23k37J50N77O03J60n11o25l30
$$ plain form
2675 -688 -579 -158 557 835 357 -275 -590 -601 -263 421 821 502 -150 -560 -621 -337 281 747 601 -8 -526
2696 -526 -663 -391 158 658 672 124 -483 -659 -388 46 540 704 260 -409 -678 -454 -37 394 732 399
2716 399 -333 -675 -477 -119 327 709 519 -194 -617 -533 -218 226 659 566 -31 -553 -614 -259 211 603 596 131
2738 131 -484 -657 -336 151 478 618 260 -399 -694 -388 92 404 581 398 -297 -717 -478 14 330 560
2758 560 449 -168 -642 -545 -76 275 551 448 -33 -547 -623 -181 261 472 467 104 -426 -626 -260 247 474
2779 474 461 208 -309 -628 -371 198 413 421 263 -178 -657 -463 81 406 430 277 -127 -568 -482 1 364 436
2801 436 319 -28 -459 -536 -149 308 470 312 11 -327 -536 -257 259 467 297 87 -219 -550 -373 178
2821 178 462 319 123 -124 -477 -414 90 434 379 173 -130 -412 -420 -12 367 451 217 -101 -356 -395 -167 270
$$ packed form
2675f88J09M21P15K78m78o32l15j1L38O84M00l19o52m10o1K84O18M66j46o09n18
2696e26j37K72N49N00J4n48o07j76K71M34M94J64m44o69k69K24M17M31L38l33
2716C99p32l42J98L58M46L82j90p13m23Q4L15M44M33r3n97n22o1L55M70L92pm65
2738A31o15j73L21M87L27J40l58o59k95L06M80L12J77j83o95m20K39M92L16K30
2758E60j11o17m74R7M69L51K76j03m81n14p6M42M42K11nl63n30k00L66N07K27
2779D74j3k53n17l19K57N69K15Qj58m41m79J94N44L25K4j53m04m41Q6M83L63P2
2801D36j17l47m31p7L87M57J62j58l01l38k09K79N16K08j70k10l06l31J77N51
2821A78K84j43j96k47l53O3N04L44n5k06l03k82qM08L79Q4k34l18k55l9K28M37
$$ plain form
2843 270 473 231 -68 -260 -391 -263 177 480 255 -17 -226 -353 -368 131 447 319 38 -196 -341 -356 37
2864 37 379 361 92 -157 -299 -329 -61 301 412 177 -156 -299 -293 -133 214 441 241 -137 -286 -271 -183 108
2886 108 432 311 -81 -260 -244 -199 38 384 305 -30 -235 -271 -266 -10 309 338 72 -235 -305 -245 -39 231 340
2909 340 176 -155 -319 -223 -36 172 336 253 -119 -289 -184 -52 85 299 309 -49 -269 -195 -89 66 275
2930 275 311 2 -213 -230 -109 30 218 282 58 -199 -267 -168 25 159 224 121 -138 -285 -172 16 138 175
2952 175 175 -60 -282 -188 2 105 172 181 -6 -269 -189 -20 71 154 217 22 -186 -221 -40 80 161 191 65 -151
2976 -151 -218 -119 36 172 126 72 -64 -218 -162 64 147 116 123 -17 -191 -175 18 118 115 105 8 -154 -204 -21 109
3001 109 127 123 36 -110 -185 -66 63 102 120 47 -66 -171 -138 51 140 94 59 -33 -151 -137 25 110 94 44 14 -109
$$ packed form
2843B70K03k42k99j92j31J28M40L03k25k72k09j27j5M99L16j28k81k34j45j5L93
2864C7L42j8k69k49j42l0K68L62J11k35l33j43OJ60L47K27k00l78j49J5Q8K91
2886A08L24j21l92j79J6M5K37L46p9l35k05l6NK56L19K9k66l07p0O0K06K70J09
2909C40j64l31j64R6J87K08J64q3l72j70J05J32J37K14J0l58k20P4J06J55K09
2930B75L6l09k15j7J21J39J88O4k24k57o8R9J93J34O5j03k59j47J13J88J22L7
2952A75%k35k22R4J90J03O7Rj87k63Q0J69R1Q3O3j95k08l5J81J20Q1L0j26k16
2976a51o7R9J55J36m6n4j36j54N6K26Q3l1Pj40j74J6J93J00lj0r7j62n0J83J30
3001A09J8mq7j46p5J19J29L9J8p3j13j05L3J89Q9m6l5r2j18J4J62Q5j6n0l0j23
$$ plain form
3027 -109 -152 -42 103 120 54 8 -87 -141 -51 73 88 68 11 -37 -129 -97 17 94 82 12 -17 -108 -115 -22 129 90 27 -15
3055 -15 -79 -107 -25 111 104 47 9 -20 -74 -53 40 103 55 39 -24 -77 -51 19 69 68 19 -16 -79 -74 -10 76 42 31 -20 -32 -63
3086 -63 -47 36 59 29 -3 -34 -38 -59 -13 64 0 0 20 -50 -57 -7 44 66 0 16 13 -55 -49 43 64 21 26 3 -37 -54 12 81 36
3119 36 15 -8 -25 -50 -28 48 18 48 15 -26 -44 -54 27 44 63 48 -37 -56 -70 -11 58 3 8 -14 -53 -104 -12 106 50 19
$$ packed form
3027a09m3J10J45J7o6m6r5n4R0J24J5k0n7m8r2L2J14P7j2p0k9r1pR3J51l9o3m2
3055a5o4k8Q2J36pn7l8k9n4K1R3O3m8j6o3n3K6P0N0jm9l5o3NO4Q6l4j1n1j2l1
3086f3J6Q3K3l0l2l1mk1M6P7o4%K0p0pN0N1K2o6J6lo8OR2K1m3Nk3m0j7O6O9m5
3119C6k1k3j7k5K2P6l0L0l3m1j8j0Q1J7J9j5q5j9j4N9O9n5Nk2l9n1R2J18n6l1
$$ [...]
8191A1
##END NTUPLES=NMR FID
##END=
