##TITLE=1H_Pr Glu-Cl2
 CDCl3, 8 sc, 
 11.06.2021
##JCAMPDX= 6.0         $$ Bruker NMR JCAMP-DX V2.0
##DATA TYPE= NMR FID
##DATA CLASS= NTUPLES
##ORIGIN= UXNMR, Bruker Analytische Messtechnik GmbH
##OWNER= root
$$ XWIN-NMR		Version 3.5
$$ Fri Jun 11 10:26:14 2021 Russian Standard Time (UT+4h)  she@DPX200
##.OBSERVE FREQUENCY= 200.131506
##.OBSERVE NUCLEUS= ^1H
##.DELAY= (6, 6)
##.ACQUISITION MODE= SIMULTANEOUS
##.ACQUISITION SCHEME= undefined
##.AVERAGES= 8
##.DIGITISER RES= 18
##SPECTROMETER/DATA SYSTEM= spect
##.PULSE SEQUENCE= zg30
##.SOLVENT NAME= CDCl3
##.SHIFT REFERENCE= (INTERNAL, CDCl3, 0, 15.7039)
##AUDIT TRAIL= $$ (NUMBER, WHEN, WHO, WHERE, WHAT)
$$ ##TITLE= Audit trail, XWIN-NMR		Version 3.5
$$ ##JCAMPDX= 5.01
$$ ##ORIGIN= Bruker BioSpin GmbH
$$ ##OWNER= she
$$ F:/spectra/data/she/nmr/H-F/1/audita.txt
$$ ##AUDIT TRAIL=  $$ (NUMBER, WHEN, WHO, WHERE, WHAT)
(   1,<2021-06-11 10:24:38.14 +0400>,<she>,<DPX200>,
      <created by zg, POWCHK disabled, PULCHK disabled
       configuration hash MD5:
       00 E9 B6 7A A2 85 ED C7 34 08 36 98 17 FE 4E 26
       data hash MD5: 16K
       C8 26 73 54 25 9D 3B 16 7A 53 92 44 A1 D8 03 B1>)
$$ ##END=
$$ 
$$ hash MD5
$$ 39 A1 BB 3F 57 D9 62 2B 98 E6 BC 14 56 B6 6E 0A
##$RELAX= 
##$RELAX= 
##$RELAX= 
##$RELAX= 
##$RELAX= 
##$RELAX= 
$$ Bruker specific parameters
$$ --------------------------
##$DU= <F:/spectra>
##$EXPNO= 1
##$NAME= <H-F>
##$PROCNO= 1
##$TYPE= <nmr>
##$USER= <she>
##$AMP= (0..31)
100 100 100 100 100 100 100 100 100 100 100 100 100 100 100 100 100 100 
100 100 100 100 100 100 100 100 100 100 100 100 100 100 
##$AQSEQ= 0
##$AQ_mod= 1
##$AUNM= <au_zg>
##$AUTOPOS= <>
##$BF1= 200.13
##$BF2= 200.13
##$BF3= 200.13
##$BF4= 200.13
##$BF5= 200.13
##$BF6= 200.13
##$BF7= 200.13
##$BF8= 200.13
##$BYTORDA= 1
##$CFDGTYP= 0
##$CFRGTYP= 5
##$CHEMSTR= <none>
##$CNST= (0..31)
1 1 145 1 1 1 1 1 1 1 1 1 1 1 1 1 1 1 1 1 1 1 1 1 1 1 1 1 1 1 1 1 
##$CPDPRG= <>
##$CPDPRG1= <>
##$CPDPRG2= <>
##$CPDPRG3= <>
##$CPDPRG4= <mlev>
##$CPDPRG5= <mlev>
##$CPDPRG6= <mlev>
##$CPDPRG7= <mlev>
##$CPDPRG8= <mlev>
##$CPDPRGB= <>
##$CPDPRGT= <>
##$D= (0..31)
0 1.2 0 0 0 0 0 0 0 0.06 0 0.03 0 0 0 0 0.0002 0 0 0 0 0 0 0 0 0 0 0 0 
0 0 0 
##$DATE= 1623392677
##$DBL= (0..7)
120 120 120 120 120 120 120 120 
##$DBP= (0..7)
150 150 150 150 150 150 150 150 
##$DBP07= 0
##$DBPNAM0= <>
##$DBPNAM1= <>
##$DBPNAM2= <>
##$DBPNAM3= <>
##$DBPNAM4= <>
##$DBPNAM5= <>
##$DBPNAM6= <>
##$DBPNAM7= <>
##$DBPOAL= (0..7)
0.5 0.5 0.5 0.5 0.5 0.5 0.5 0.5 
##$DBPOFFS= (0..7)
0 0 0 0 0 0 0 0 
##$DE= 6
##$DECBNUC= <off>
##$DECIM= 32
##$DECNUC= <off>
##$DECSTAT= 4
##$DIGMOD= 1
##$DIGTYP= 9
##$DL= (0..7)
0 120 120 120 120 120 120 120 
##$DP= (0..7)
150 150 150 150 150 150 150 150 
##$DP07= 0
##$DPNAME0= <>
##$DPNAME1= <>
##$DPNAME2= <>
##$DPNAME3= <>
##$DPNAME4= <>
##$DPNAME5= <>
##$DPNAME6= <>
##$DPNAME7= <>
##$DPOAL= (0..7)
0.5 0.5 0.5 0.5 0.5 0.5 0.5 0.5 
##$DPOFFS= (0..7)
0 0 0 0 0 0 0 0 
##$DQDMODE= 0
##$DR= 18
##$DS= 0
##$DSLIST= <SSSSSSSSSSSSSSS>
$$ [...]
##$SUBNAM2= <"">
##$SUBNAM3= <"">
##$SUBNAM4= <"">
##$SUBNAM5= <"">
##$SUBNAM6= <"">
##$SUBNAM7= <"">
##$SUBNAM8= <"">
##$SUBNAM9= <"">
##$SW= 20.0188882624521
##$SWIBOX= (0..15)
0 0 2 0 0 0 0 0 0 0 0 0 0 0 0 0 
##$SW_h= 4006.41025641026
##$TD= 16384
##$TD0= 1
##$TE= 0
##$TE2= 300
##$TE3= 300
##$TEG= 300
##$TL= (0..7)
0 120 120 120 120 120 120 120 
##$TP= (0..7)
150 150 150 150 150 150 150 150 
##$TP07= 0
##$TPNAME0= <>
##$TPNAME1= <>
##$TPNAME2= <>
##$TPNAME3= <>
##$TPNAME4= <>
##$TPNAME5= <>
##$TPNAME6= <>
##$TPNAME7= <>
##$TPOAL= (0..7)
0.5 0.5 0.5 0.5 0.5 0.5 0.5 0.5 
##$TPOFFS= (0..7)
0 0 0 0 0 0 0 0 
##$TUNHIN= 0
##$TUNHOUT= 0
##$TUNXOUT= 0
##$USERA1= <user>
##$USERA2= <user>
##$USERA3= <user>
##$USERA4= <user>
##$USERA5= <user>
##$V9= 5
##$VALIST= <valist>
##$VCLIST= <CCCCCCCCCCCCCCC>
##$VD= 0
##$VDLIST= <DDDDDDDDDDDDDDD>
##$VPLIST= <PPPPPPPPPPPPPPP>
##$VTLIST= <TTTTTTTTTTTTTTT>
##$WBST= 1024
##$WBSW= 4
##$XGAIN= (0..3)
0 0 0 0 
##$XL= 0
##$YL= 0
##$YMAX_a= 575177
##$YMIN_a= -562228
##$ZGOPTNS= <>
##$ZL1= 120
##$ZL2= 120
##$ZL3= 120
##$ZL4= 120
##$ABSF1= 10
##$ABSF2= 0
##$ABSG= 5
##$ABSL= 3
##$ALPHA= 0
##$AQORDER= 0
##$ASSFAC= 0
##$ASSFACI= 0
##$ASSFACX= 0
##$ASSWID= 0
##$AUNMP= <proc_1d>
##$AZFE= 0.1
##$AZFW= 0.1
##$BCFW= 1
##$BC_mod= 2
##$BYTORDP= 1
##$COROFFS= 0
##$CY= 11.3945322036743
##$DATMOD= 1
##$DC= 2
##$DFILT= <>
##$DTYPP= 0
##$F1P= 15.9154993809931
##$F2P= -4.1035820241983
##$FCOR= 0.5
##$FTSIZE= 0
##$FT_mod= 4
##$GAMMA= 1
##$GB= 0.15
##$INTBC= 1
##$INTSCL= 1
##$ISEN= 128
##$LB= 0.24
##$LEV0= 0
##$LPBIN= 0
##$MAXI= 10000
##$MC2= 0
##$MEAN= 0
##$ME_mod= 0
##$MI= 1.114404
##$NCOEF= 0
##$NC_proc= 0
##$NLEV= 6
##$NOISF1= 3.799351
##$NOISF2= 2.8
##$NSP= 1
##$NTH_PI= 0
##$NZP= 0
##$OFFSET= 15.70392
##$PC= 1
##$PHC0= -11487.33
##$PHC1= 17.20101
##$PH_mod= 1
##$PKNL= yes
##$PPARMOD= 0
##$PSCAL= 0
##$PSIGN= 0
##$REVERSE= no
##$SF= 200.130013532006
##$SI= 16384
##$SIGF1= 3
##$SIGF2= 2
##$SINO= 400
##$SIOLD= 16384
##$SREGLST= <1H.CDCl3>
##$SSB= 0
##$STSI= 0
##$STSR= 0
##$SW_p= 3612.71676300578
##$SYMM= 0
##$S_DEV= 0
##$TDeff= 0
##$TDoff= 0
##$TI= <>
##$TILT= no
##$TM1= 0
##$TM2= 0
##$TOPLEV= 0
##$USERP1= <user>
##$USERP2= <user>
##$USERP3= <user>
##$USERP4= <user>
##$USERP5= <user>
##$WDW= 1
##$XDIM= 8192
##$YMAX_p= 0
##$YMIN_p= 0
$$ End of Bruker specific parameters
$$ ---------------------------------
##NTUPLES= NMR FID
##VAR_NAME=  TIME,          FID/REAL,        FID/IMAG
##SYMBOL=    X,             R,               I
##VAR_TYPE=  INDEPENDENT,   DEPENDENT,       DEPENDENT
##VAR_FORM=  AFFN,          ASDF,            ASDF
##VAR_DIM=   8192,          8192,            8192
##UNITS=     SECONDS,       ARBITRARY UNITS, ARBITRARY UNITS
##FACTOR=    0.0002496,     1,               1
##FIRST=     0,             0,               0
##LAST=      2.0444736,     0,               0
##MIN=       0,             -562228,         0
##MAX=       2.0444736,     575177,          0
$$ Real data points
##PAGE= N=1
##DATA TABLE= (X++(R..R)), XYDATA
0@%%%%%%%%%Qj6J6j6K4l2M0m8N6p2Q8j04J24j48J75k07K40k74L15l67M24m83N50
32B93o26P09p99R00j011J132j267J412j572J748j939K147k373K623k893L188l514
49a842L872m267M701n181N716o316O993p765Q649r674J0886j2340J4121j6364
63h811J9289k3273K9044l8182N4852r4638L52393K84503r89057p9516P92447J77275
75D76326o87254j59612M66797J91030k79421j64943M3933J77033J32878j45692
85E1075l07050J27571M29410r8074n28259J06830N49852j12544n30444J30339
95a81294M66977j49613l83739J85054K62504k06244j37869K16223K4585k21461
105a24877O1921K29773j33246k22392J73578J93598j77146j51204J47600R8661
$$ plain form
0 0 0 0 0 0 0 0 0 0 0 8 -8 8 -8 16 -16 24 -24 32 -40 48 -56 68 -80 95 -112 128 -146 169 -198 226 -257 293
32 293 -333 376 -423 477 -534 598 -669 743 -829 919 -1020 1127 -1246 1377 -1516 1672 -1842
49 -1842 2030 -2237 2464 -2717 2999 -3317 3676 -4089 4560 -5114 5772 -6568 7553 -8811
63 -8811 10478 -12795 16249 -21933 32919 -61719 290674 575177 -413880 -493396 299051 476326
75 476326 -210928 -370540 96257 287287 7866 -157077 -113144 63889 196767 51075
85 51075 -255975 -128404 301006 202932 -325327 -218497 331355 218811 -311633 -181294
95 -181294 285683 136070 -247669 -62615 199889 -6355 -144224 71999 96584 -124877
105 -124877 -62956 166817 33571 -188821 -15243 178355 1209 -149995 -2395 96266
115I6266j02224k5730L5822o6581N3910J59350j51828k40716K30449L16962k83689
126B1991l85893L13789M30211l11663m43690K69919M37735k00402m12695J21601
136a59097L57693l2258k71720p0615J75294J70906p6562k49739k3977L08441J20204
147B48570l50591j91069L68375K33511l51828k57552L12614K67296k62846k52877
157b36397K04077K16962j33076j72475O4068J26262r819p2027l4690J6390P7651
168D6926K4013j09357m5110J22177N4701j20862n5018J15216L6902j01811m180
179c6403P7877k9773n6587O0142M7748r3337m7469J25833M5661j44741n0527J45529
191D3953O6109j37867q4055J18760R4925q0758j05443K7658J17481K4658j23359
$$ plain form
115 96266 -5958 -31688 4134 -62447 -8537 150813 -1015 -241731 -11282 305680 21991
126 21991 -363902 -50113 380098 68435 -375255 -105336 332399 131997 -280698 -159097
136 -159097 198596 166338 -105382 -175997 -703 170203 93641 -156098 -180075 128366 248570
147 248570 -102021 -293090 75285 308796 -43032 -300584 12030 279326 16480 -236397
157 -236397 -32320 184642 51566 -120909 -56841 69421 59602 -12425 -47115 -30725 46926
168 46926 70939 -38418 -83528 38649 93350 -27512 -82530 32686 69588 -32223 -36403
179 -36403 41474 11701 -44886 15256 63004 -30333 -77802 48031 93692 -51049 -101576 43953
191 43953 110062 -27805 -111860 6900 101825 21067 -84376 -56718 60763 85421 -37938
202c7938p1789J13385J18031r6347j59039P6610J83578n0079j92068J3384J92961
213I0689K2157j85453m8297J61810O9240j24660r0505Q7645J04050n1395j05148
224f9867J2246J02054K4799r8907m9794R0194O3545o9748p4753M9709Q2302l4619
236B7161p8487K1250O6950n175n6334n007M7043O433l0766n775J3169R053m315
249E200p886K677N92n51N763L59n588q117O544J9579j0007k5621Q139K8391K462
264B1936l5312j2939M1051J9735l9874k7397L1794L9114k6633m6206K0216M4527
276C0012o596m3626r198M4821J7963m1608k3494L0830L1020k1890l7696J6172
288a3290L6390q218l2248l931L1433J0963l1074j1704K4067J3053j5134j8352
$$ plain form
202 -37938 -109727 3658 121689 25342 -133697 -57087 126491 76412 -115656 -102272 90689
213 90689 112846 -72607 -120904 40906 110146 -14514 -105019 -17374 86676 35281 -69867
224 -69867 -57621 44433 69232 -29675 -79469 10725 74270 4522 -70231 -20522 61780 27161
236 27161 -51326 -30076 36874 31699 -24635 -29642 17401 23834 -6932 -12707 462 9515 5200
249 5200 -2686 -9 583 32 5795 6154 566 -7551 -1007 18572 8565 -17056 -8917 19474 21936
264 21936 -13376 -26315 14736 34471 -5403 -32800 -1006 38108 11475 -34731 -14515 30012
276 30012 23416 -20210 -29408 15413 33376 -8232 -31726 -896 30124 8234 -29462 -13290
288 -13290 23100 14882 -17366 -21297 10136 21099 -9975 -21679 2388 15441 307 -18045
300a8045J1612J9256r792j4852L404J2586L060j4749k959J3496J167p151l860
313f827M380O565m808m874M165J845K44k372j044M341k475r48L481l212N79J868
329I08n49J216k988N72M467k480j301k90J957L326n268j294N670j533j263o88
345D62M17L682l515j539L283l19l96k430J364M480m721k498M681J94j202k890
361i47N40N413l317l885K324K533P66n478j052P301k138m883R02K597K615m835
377a544l964O764J905n053l175L512O471n374p055O116M743k288o366j258R885
392C319O03r527j039O456M825n823p934O981O558l556o128j312Q791L790j0314
407d310k693O195N022j480q743R39Q178J625m821o840M102J1013m305r663M17
$$ plain form
300 -18045 -6433 12823 3031 -11821 -8417 4169 7229 -7520 -10479 3017 4184 -2967 -6827
313 -6827 -2447 4118 -690 -5564 -1399 446 690 -1682 -2726 1615 -860 -1808 1673 -1539 -960 908
329 908 359 1575 -1413 -841 3626 1146 -155 -445 1512 4838 -430 -1724 3946 2413 1150 462
345 462 879 4561 1046 -493 2790 2471 2075 -355 1009 5489 768 -1730 2951 3145 1943 -947
361 -947 -407 5006 1689 -2196 128 2661 3427 -2051 -3103 4198 2060 -2823 -1921 676 3291 -1544
377 -1544 -5508 1256 3161 -1892 -5067 -1555 4916 -458 -7513 -1397 3346 1058 -5308 -6566 3319
392 3319 3922 -5605 -6644 -188 4637 -1186 -9120 -2139 4419 863 -5265 -6577 2214 6004 -4310
407 -4310 -7003 -808 4214 2734 -6009 -5070 3108 4733 -88 -6928 -2826 8187 3882 -5781 -5364
422e364Q997O553j0540r826J0200J0278l953j3283j849J7133M193j4422r044R362
436a565J7101o096k3113L743K3539K791k3285j0869K3551J5856k0959j7614J2267
449d653K1778m362k5483l03K2292O153j5685j5140J0529K0804n596k2079l204
462a4949K1962J2088k2800j5835J9092J5581j0146j7012J256J6677M216j0312
474a82j0592Q9J7822Q249k1304j6701J8383K8188j4495l8515J1259M1896l851
487B0246m0557p499L7494J8353l0768k5950J6783L4331O92m2832j6085M5478L2027
500D1713m1260m9533L5128O5649k8176p3568J7175P5704j897p5114j0413O8298
512B3706K0403n2109l0315L1373M1017j1923m5766p725M4125L0032m1562m7547
$$ plain form
422 -5364 3633 10186 -354 -10180 20 10298 6345 -6938 -8787 8346 12539 -1883 -10927 -1565
436 -1565 15536 9440 -13673 -9930 13609 16400 -6885 -17754 5797 21653 694 -16920 -4653
449 -4653 17125 12763 -12720 -13023 9269 15422 -263 -15403 -4874 15930 10334 -11745 -14949
462 -14949 7013 19101 -3699 -19534 -442 15139 4993 -12019 -10763 5914 10130 -182
474 -182 -10774 -10685 7137 15386 -5918 -22619 -4236 23952 9457 -29058 -17799 24097 20246
487 20246 -20311 -27810 9684 28037 -2731 -28681 -11898 22433 23125 -19707 -35792 9686 41713
500 41713 453 -49080 -13952 51697 23521 -50047 -32872 42832 40935 -34179 -44592 23706
512 23706 44109 -8000 -38315 -6942 34075 22152 -23614 -31339 12786 42818 1256 -46291
524d6291L7339N7931k8830o2735J7500O4693r048n9848M135M6763p42k8017l003
537a0153R910J298Q212N050k8108j0071M2793J3536m7890k0667M7031K7776m2397
550c680l1022L1300K8090j1933k3548j0158J4933L0479L1n1451j9088P1235L6523
563F1711q5850n1131Q9811O5476q5705p8694P7083Q3460n9276q1535L3336P5515
575D4201n283o4279k1711M6416M7494k2715p3088m4R2658K1973j03453m3128J07755
588B6796O0831j06364o9617R6668P0315p6791o7240N3757O0163l1824m5229R731
600a8804K5389J3996o877l2176r916M3158K6914m9300l9581N2548M3353m9895
612a191l8031M0466K8026k9219j2858J9063q187q808L1888j766n2250P370O9142
$$ plain form
524 -46291 -8952 48979 20149 -42586 -25086 39607 30559 -29289 -25154 21609 20867 -7150 -10153
537 -10153 -243 1055 9267 14317 -13791 -23862 18931 32467 -15423 -36090 10941 38717 -3680
550 -3680 -34702 -3402 24688 12755 -10793 -20951 -6018 24461 24492 -26959 -46047 25188 61711
563 61711 -24139 -75270 14541 80017 -5688 -84382 -7299 76161 16885 -64650 -31314 44201
575 44201 38918 -25361 -47072 -656 46838 24123 -48965 -49009 43649 65622 -37831 -80959 26796
588 26796 87627 -18737 -88354 8314 78629 1838 -65402 -11645 48518 16694 -28535 -18804
600 -18804 6585 20581 13704 -18472 -28388 14770 41684 -7616 -47197 5351 48704 -1191
612 -1191 -39222 1244 29270 51 -12807 6256 -1931 -10739 21149 19383 -32867 -25497 43645
625D3645n989q3587J060R2252M415q9749j4056P8160K5707o0594l6449L7285M2499
638C4599o464m7970k7652N2312N8014n1446q3930M3104J05892l1487j21605J9524
650e7109J24915m155j19065j3888J07686K8642q9434l9394O2940M7748l1732n5088
662c7934K530N6231K4437n1805m8999M5668O7298l8911p5799K9920P6229j8345
674C0520p2182R518O2338l586m6196JK6994K512j0218K04m554o100J8114J1920
688A9285k7193j5036K7730J9532k3222k3076J5876K3027m068j8505j1597J2145
700e102K7724m353l8784q055M7191K3420n3231l7588N5143M8465m9739n8677L8663
713a4923O7617k6309o9907J0252O6231J0090o0610k9929N2370M4580l8995n6012
$$ plain form
625 43645 37656 -45931 -44871 47381 51796 -37953 -52009 26151 51858 -8736 -45185 -7900 34599
638 34599 28135 -19835 -47487 4825 62839 11393 -72537 -29433 76459 44972 -76633 -57109
650 -57109 67806 63651 -55414 -69302 38384 67026 -22408 -61802 1138 48886 17154 -37934
662 -37934 -35404 20827 45264 -6541 -55540 -9872 57426 18515 -57284 -27364 48865 30520
674 30520 -41662 -32144 30194 26608 -19588 -19587 7407 9919 -299 -95 -4649 -10749 7365 19285
688 19285 -7908 -22944 4786 24318 1096 -21980 -6104 16923 12855 -5650 -17247 -5102
700 -5102 22622 18269 -20515 -28570 18621 42041 -11190 -48778 6365 54830 5091 -53586 -14923
713 -14923 52694 26385 -43522 -33270 32961 43051 -17559 -47488 4882 49462 10467 -45545
725d5545K1632O5841n937p0129r159O7603K3608o0298l7962N2043M5645m0597
737F745m8056K5030M8194j0174m5928j321L9078J0604k9680j9044K1192K3305
749A9945j3592k2372N190J8750K198j5228n700J0724N330m060l621j811K019L517
763A289K895l600r230M249J3593j727j5797n072J8578J2184j9719j7777J6833
776c301K4432j1450l0889O192L4854M1l4916q628L3684J7231l0709k3808K5204
789b063K8761j6277l2900O801L5831J143l4349r737L0342J9293k6718k5965K2260
802c578K8926j5088l0509O874L1641j044k9975l319K4484Q466j9128j2922J5046
815a26J3951j0339j2963L445J3140P40j2692l142J0537L650o968n627N782N787
$$ plain form
725 -45545 -23913 41928 35991 -34138 -43297 24306 47914 -12384 -50346 1697 47342 6745
737 6745 -41311 -16281 31913 21739 -24189 -25510 13568 24172 -5508 -24552 -3360 19945
749 19945 6353 -16019 -10829 7921 10119 -5109 -10809 -85 5245 1185 -2436 -4247 -2228 1289
763 1289 4184 584 -8646 -4397 9196 7469 -8328 -13400 5178 17362 -2357 -20134 -3301
776 -3301 21131 9681 -21208 -15016 19838 19879 -15037 -23665 10019 27250 -3459 -27267 -2063
789 -2063 26698 10421 -22479 -15678 20153 21296 -13053 -22790 7552 26845 127 -25838 -3578
802 -3578 25348 10260 -20249 -13375 18266 17222 -12753 -16072 8412 16878 -2250 -15172 -126
815 -126 13825 3486 -9477 -6032 7108 7848 -4844 -7986 2551 6201 -767 -6394 -612 5175
829E175n922l192M110J249k735j389M099P2o233K451O506l192o242J068P854M87
845D166r639p26Q907K826p583n878P071Q133o448q422L573R735j35j1745j582
860g747J1965L200j0064n296Q214Q087p776q161O159P725k819q584R11R057J08
875D979p823j285N766M093n822m296N324L782l173m125J360M841r80n141J260
890a240L647J74l070j330L466R45k860m43J197J214j120k198J972J411j561l69
906a65J71J055p32j671J841N18j774L23jJ051n81j751J818O07j582l23M53R14
924A71j03j951J028J201m79m65j036J215J306k188k44Q92P56L4j883Q11J454j260
942g41K7m67O20J124j077q7L42p34J532r6j271O64O1Q94o88j598J794J202j199
$$ plain form
829 5175 -747 -3939 171 1420 -1315 -2704 1395 1467 -4766 -2315 4191 999 -5243 -4175 3679 4166
845 4166 -5473 -6199 2708 5534 -2049 -7927 -856 7277 829 -7593 -4020 5715 5580 -6165 -7747
860 -7747 4218 7418 -2646 -7942 272 8359 583 -7578 -1419 6306 3487 -5097 -4186 4871 4979
875 4979 -2844 -4129 1637 5730 -92 -4388 936 4718 1545 -2580 -1220 3621 2641 -2500 -1240
890 -1240 2407 2581 -489 -1819 1647 2592 -268 -711 486 1700 580 -1618 354 1765 204 -165
906 -165 6 1061 329 -1342 499 1017 -757 -434 -435 616 35 -1716 102 709 -873 -1196 -743 171
924 171 68 -1883 -855 346 -133 -598 -1634 -419 887 -1301 -1545 -653 103 137 -1746 -935 519 -741
942 -741 -714 -1181 -561 563 -514 -601 -259 -993 539 443 -828 -164 -103 791 103 -1495 299 1501 302
961C02p01p53K543J169l172p89K133J905j059l754J345M224q78l629r92L991K530
978D415m740k516L353L253j142n513O43N872k32m501k071L814M350m146m593K354
994a400M303O36n460k423N808K992m206l755J288N647K5o714j213N101L643l929
1010C43n792L337N908j370n486k130N419M874m947o070K337P620O29r028k866
1025g222R284M532p332p328N131R899l795r361N49Q567L556p671o599N747Q445
1040F402k020r925j908J1470M811j1238o869Q685J0110o116j1801L922J0728K65
1054F516q802m555O710P286k855r072k038J0597P367j1863j0541J0426J2811o259
1068E728j6226L035J7819n11j5546l763J1400Q988p897j1732K631J2796M289j3727
$$ plain form
961 302 -399 -1152 1391 2560 -612 -1401 732 2637 1578 -2176 -831 3393 2515 -1114 -2106 1885 4415
978 4415 -325 -2841 512 3765 2623 -2890 -2247 3625 3393 -1108 -3179 635 4985 839 -3754 -1400
994 -1400 2903 3539 -1921 -4344 1464 4456 250 -3505 -2217 3430 3455 -3259 -4472 629 4272 343
1010 343 -5449 -2112 3796 2426 -3060 -5190 229 5103 156 -5914 -3577 4043 4672 -4356 -7222
1025 -7222 2062 6594 -738 -8066 -2935 6964 3169 -6192 -5643 2924 6480 -1191 -7790 -2043 6402
1040 6402 4382 -5543 -7451 4019 8830 -2408 -9277 -592 9518 3402 -8399 -4477 6251 6516
1054 6516 -2286 -6841 -131 7155 4300 -4772 -6810 3787 11154 -709 -11250 -824 11987 5728
1068 5728 -10498 -7463 10356 9845 -5701 -9464 1936 10924 3027 -8705 -6074 6722 11011 -2716
1082b716j1605J4687J6300j2782k0117Q588K3610m736k5207J189K2405L994j8303
1095d693r107J3403J1950o839j3754q65J4298R033j4570j5084J2218J9636p911
1108G715k3998M592K4812j514k1992k275J7444O073j2439p606O013P217K087o068
1122F1r847M900J4699r40j8548m070K2008P154k1568r289J7703J1937j2422j3034
1136a1256N980J2002J688q430j1158N269J8764j160k3369n470K7615J2119k9028
1149f434j7994K8510K1250k3445k4865J7382K5862r686k4077N07K0123R319j4762
1162A690j8262R025K4361j072k9081p346L2215J3308l1960j8020K7521K2960k2875
1175B464k4909J7130K3093j0201j8704J590J4013N382q026j0275L99J4019O464
$$ plain form
1082 -2716 -14321 366 16666 3884 -16233 -7645 15965 11229 -13978 -12789 9616 13610 -4693
1095 -4693 -13800 -397 11553 4714 -9040 -9905 4393 13426 -1144 -16228 -4010 15626 7715
1108 7715 -16283 -11691 13121 11607 -10385 -12660 4784 10857 -1582 -9188 -3175 4042 6129 61
1122 61 -9786 -4886 9813 8873 -9675 -13745 8263 15417 -6151 -15440 2263 14200 1778 -11256
1136 -11256 -5276 6726 8414 -16 -11174 -5905 12859 11699 -11670 -17140 10475 22594 -6434
1149 -6434 -24428 4082 25332 1887 -22978 -5596 20266 10580 -13497 -12990 7133 16452 1690
1162 1690 -16572 -7547 16814 15742 -13339 -20685 11530 24838 -7122 -25142 2379 25339 2464
1175 2464 -22445 -5315 17778 7577 -11127 -9537 4476 9858 1832 -8443 -8044 5975 12439
1188A2439j6655j1516J6433J4744j3327j7474R646J7662n849j4715J472R344L321
1201E525l041o681l701P300J2140p584j9370O981K4176l859k7143p23K8242N790
1215A8052k7276r729K1647J4833j4318j8933O680K0408K657k0010j1955J7453
1227d91K2025j5005k8239R856L2664l101l5677k515L5325Q003l1522j3251K5216
1240C288J8110j8632j9563J0158J9292j547j7663o885J5512J2843j1224j7349
1252a3660N437K1626j270k2745k112K0791N291j7142p955J3160Q250q970o116
1265e415K937M000J914j059n173l230O782Q086q379j1335P870J3130m969j4391
1279i232J440J4406J695j1993n359P178J0330k752j3508k451J4348R030j4448
$$ plain form
1188 12439 -4216 -15732 701 15445 2118 -15356 -5710 11952 6103 -8612 -7140 2204 5525
1201 5525 2484 -4197 -7898 -598 11542 3958 -15412 -8431 15745 11886 -15257 -15980 12262 18052
1215 18052 -9224 -18953 2694 17527 3209 -15724 -9044 11364 14021 -5989 -17944 -491
1227 -491 21534 6529 -21710 -11854 20810 17709 -17968 -20483 14842 22845 -8677 -21928 3288
1240 3288 21398 2766 -16797 -6639 12653 11106 -6557 -13442 2070 14913 3689 -13660
1252 -13660 -8223 13403 12133 -10612 -12724 8067 13358 -3784 -11739 1421 9671 701 -5415
1265 -5415 -2478 1522 3436 2377 -2796 -6026 756 8842 463 -10872 -3002 10128 5159 -9232
1279 -9232 -7792 6614 8309 -3684 -9043 -1865 8465 5713 -7795 -10246 4102 13132 -1316
1292a316j5596J3891K0131j1438k2964P079K5234k294k6038j340K3306O047j9086
1305d384j0443J4106J4063q669j5585K048J6023M914j5955j0007J4623J3703j1208
1318C229j7106Q151J8923n901j7879K865J5907L11j3295k468J0416K990o103l094
1332c054J382L546J970l317l749J615N498qo806q5N355J119l184k530J710K003
1348A465L8P1l499j561O134K493p080m814P831P091q199q658P420R043n357r976
1364g558K740J0518j42j0119j967P644N731o039q339M200R539j576j0098k378
1378g844J1632M319j1445n774R944P150p835q290N804R159m428q011J645P210
1392C236P97o399k286N282L068k990m568J585N475p79m854Q8L633J695l985j448
$$ plain form
1292 -1316 -16912 -3021 17110 5672 -17292 -10213 15021 12727 -13311 -14651 8655 14702 -4384
1305 -4384 -14827 -721 13342 4673 -10912 -8864 7159 12073 -3882 -13889 734 14437 3229
1318 3229 -13877 -5726 13197 7296 -10583 -7718 8189 8500 -4795 -7263 3153 6143 40 -3054
1332 -3054 -1672 1874 3844 527 -3222 -1607 3891 3883 -2923 -3008 2347 3466 282 -2248 -538 1465
1348 1465 1503 1574 -1925 -3486 2648 5141 -1939 -6753 1078 8169 -30 -8688 -1268 7775 2418 -7558
1364 -7558 -4818 5700 5558 -4561 -6528 1116 6847 808 -7531 -3331 6208 4632 -5466 -7844
1378 -7844 3788 8107 -3338 -9112 832 7982 147 -8143 -2339 6820 2392 -5619 -3974 3236
1392 3236 4033 -2366 -4652 630 3698 708 -3860 -2275 3200 2421 -2433 -2345 1288 2983 -1002 -2450
1408b450L773L99j871m52J026N50r18N2J270j440n03J282L62q94j319J155J940
1425A962j431j554M73K000M56k379j273L066R01k473j733J613L229j986l073J191
1441a011K911p8l558n99M123N44l358j224K436K127j772k963J566K834j023k760
1457a805K87K681M00l062k34J841J150j485j831J495J711j074j270LJ462M60j919
1474a190M3J385j12m20m87K04J160p46k53P2j77O60j18m38L42k14O19J62q54k
1494c64O21L84l68j044O23J160p66n74q7J071N03j301j92O99L92Pj385L27J452
1513A158k44j173l90R41J084j258n93P76L15J39q45l35J022K84p02m61p9Q21K90
1532G50j077l7P6J061j33j361K6J264j32l78j610Q64J572n27j568l67K163R59
$$ plain form
1408 -2450 1323 1722 -149 -601 425 975 57 109 1379 -61 -564 718 1080 186 -1133 22 1962
1425 1962 531 -1023 -550 1450 1906 -473 -1746 1320 2221 -252 -1985 -372 2857 871 -2202 -1011
1441 -1011 1900 1822 -1736 -2335 1788 2332 -1026 -2250 186 2313 541 -2422 -856 1978 955 -1805
1457 -1805 -1518 1163 1563 -1499 -1733 108 1258 -227 -2058 -563 1148 74 -1196 -1193 269 729 -1190
1474 -1190 -1147 238 126 -294 -781 -577 583 -163 -416 -344 -521 139 21 -417 -75 -289 330 492 -362 -364
1494 -364 257 641 273 -771 -148 1012 246 -328 -415 656 1159 -142 -334 365 757 764 -621 -294 1158
1513 1158 914 -259 -649 292 1376 118 -475 301 616 755 -90 -425 597 881 179 -282 -361 460 750
1532 750 -327 -364 -288 773 640 -721 -695 569 437 59 -1551 -687 885 358 -1210 -1577 586 1545
1550A545k410j440K375J683j291k740N61L066j18k799n45J931K164j920k893J826
1566a005L073o50l290o73L907R05l290j490K258K592j379l291Q97K739O00k265
1582c62k222K420K876j755k707J73K979J338l609j850L077K313j696k801M18L287
1598A879J90k190j852J071L912j029m288KM065J873m324l081M361L337k698m211
1614b983J169M609L75m392j799L015L685j755n368M11O193J030o113k921N700
1629H56M768n407n502M097N176j479o016k88N754J581l685l755J706N558n5n901
1645b592k503O219M777o097o716N536P132l679p076J424P123N58o180k035L647
1660d62M216j288n927q03O186L525n754o574N299Q613m384r313K902R220l79q935
$$ plain form
1550 1545 -865 -2305 70 1753 462 -2278 -1717 1349 1231 -1568 -2113 -182 1982 62 -2831 -1005
1566 -1005 2068 1418 -1872 -2545 1362 2267 -1023 -2513 -255 2337 958 -2333 -1436 1303 1903 -362
1582 -362 -2584 -164 2712 957 -1750 -1577 1402 2740 -869 -2719 358 2671 975 -1826 -1408 1879
1598 1879 2069 -121 -1973 -902 3010 1981 -2307 -2305 1760 3633 -691 -3772 589 3926 1228 -2983
1614 -2983 -1814 2795 3170 -1222 -3021 -6 3679 1924 -3444 -3033 3160 4190 -1923 -4844 856
1629 856 5624 217 -5285 -1188 3988 2509 -3507 -3795 1959 3540 -145 -3900 -2194 3364 3309 -2592
1645 -2592 -5095 1124 5901 -196 -6912 -1376 5756 2077 -4999 -3575 3548 4106 -2074 -4109 -462
1660 -462 3754 2466 -3461 -4264 1922 5447 -307 -6881 -1582 7031 2647 -6666 -3764 5456 5077 -3858
1676c858j303P246K747m086m620J233N821J708o208m517N231P965m853r549L413
1691c630J0546j494j0286j135J0086K068q020k943M617M179j133m943j787M151
1705B76M755k756q272K117R879m18j0450j589J0169L786r226n409P244N098l237
1720A967n561j75N087L089l300o560J426R660J94j1263k834J2019N135j1684p090
1735i890J0408Q082p647q230L956Q166q66p117k216M947N730k473q771j63J1030
1750D946K852j1707n409J1652P475j0820q283Q455Q675n262q381K448P316j96
1764C761m730k830K157M985R84o517l759P058O230p015p940O559Q198m639p925
1779e423K309P335n26n115j469K334L238O89m736l500M696O784l952r659L137
$$ plain form
1676 -3858 -5161 2085 4832 746 -3874 -2641 3180 4888 -1320 -5837 -606 7359 2506 -7043 -3630
1691 -3630 6916 5422 -4864 -5999 4087 6155 -1865 -4808 -191 3988 2855 -2088 -3875 276
1705 276 5031 2275 -5997 -3880 5999 5581 -4869 -6458 3711 7497 -1729 -7138 106 5204 1967
1720 1967 -3594 -3769 1318 4407 1107 -5453 -4027 5633 5827 -5436 -8270 3749 8884 -2800 -9890
1735 -9890 518 8600 953 -7277 -3321 4845 3979 -3138 -5354 -407 5323 2850 -5921 -6084 4946
1750 4946 7798 -3909 -9318 2334 9809 -1011 -9294 -839 7836 2574 -5807 -3359 3957 3761
1764 3761 -969 -3799 -1642 3343 4327 -2190 -5949 1109 7339 324 -7616 -1057 7141 2502 -5423
1779 -5423 -3114 4221 3695 -1420 -2889 -555 2683 3372 -1364 -4864 -168 6616 2664 -6995 -3858
1794c858J1399k334j1201j87J1077J912r529l406O706M705l292o157k79O846L416
1809E818o244o887M687J0664l862j2258K159J3000m84j2424j925J1649L360r626
1823b373m383O758M962l055n706N2N386K733m087n758L470P369j846q533O0Q825
1839C874J231q309k159P009K452m551k719K555K443p64r48j942nL910R46m547
1855a524k489N160L780m715m912M207M776k438m674M62M037J429l019k852J275
1870a497M008J346o054k433O407M025o070n903N657P345m664q056L274P295j103
1885C577p015p31O007K049m092l812K410N492p25o117j422N975L623n884m670
1900e335N022N184m077n298K732N115j256m825N75L474L15j801j758Q57K284j42
$$ plain form
1794 -3858 7541 5207 -5994 -6181 4896 6808 -2721 -6127 579 5284 1992 -4165 -4444 2402 5818
1809 5818 -426 -7313 -2626 8038 4176 -8082 -5923 7077 6593 -5831 -7756 3893 7253 -2373
1823 -2373 -6756 2 4964 1909 -3797 -3745 1641 4374 287 -5471 -2001 5368 3522 -5011 -4951 3874
1839 3874 5105 -3204 -5363 1646 4098 -453 -3172 -617 1826 1062 114 -1828 -1833 2077 3023 -1524
1855 -1524 -4013 1147 4927 212 -4700 -493 4283 1845 -2829 -2367 1670 3099 80 -2772 -1497
1870 -1497 2511 3857 -2197 -4630 1777 5802 -268 -6171 -514 6831 2167 -5889 -2615 4680 3577
1885 3577 -3438 -4169 1838 3887 -205 -4017 -1607 3885 3160 -2957 -4379 1596 5219 -665 -5335
1900 -5335 -313 4871 794 -4504 -1772 3343 2087 -2738 -2163 1311 1626 -175 -1933 -1076 1208 1066
1916A066j605j367J501K413j596k564J260J912j02j907j86J217M81j98n47j002
1932a224R22J476l57k489r5L229N73l369r46L022J916k715k577K434K720j681
1948H39k416J10L335N54k947j464K376K262j531l720J286L939p34l771l14L863
1964A667R34l429j566L105J728j991k265R60K734p52k411O6J713J243k149j218
1980a631J662J300r37j430K49J472M4j519R2J012j6k34n00L53J54k58R7j79R3
1999a76L86k05jK4l93L61l2k06j35k7P09l57j061O67P25O4n38n91J254J53j265
2020f44q9N42J098p50j106O40P80K22j103m80J232O54j198m72Q12Q92p43j221
2038i34O04J260k79j137j2O85P76j032n37J129J37l15n99j74J190k07p85J08M62
$$ plain form
1916 1066 -539 -1906 -405 2008 412 -2152 -892 1020 918 -989 -1175 42 523 325 -222 -1224
1932 -1224 -302 1174 817 -1672 -1767 1462 2035 -1334 -2280 742 2658 -57 -2634 -200 2520 839
1948 839 -1577 -1467 1868 2422 -525 -1989 387 2649 1118 -2602 -1316 2623 1889 -1882 -2196 1667
1964 1667 2601 -828 -2394 711 2439 448 -1817 -857 1877 1125 -1286 -1220 493 1736 -413 -1631
1980 -1631 31 1331 394 -1036 -787 685 729 -790 -698 314 298 64 -436 -83 71 -187 -90 -269 -176
1999 -176 210 5 4 28 -365 -4 -36 -242 -377 -404 305 -52 -1113 -446 279 343 -195 -786 468 621 -644
2020 -644 -733 -191 907 157 -949 -309 471 693 -410 -890 342 996 -202 -674 138 1030 287 -934
2038 -934 -330 930 651 -486 -498 187 963 -69 -606 523 660 345 -254 -428 762 555 -230 -122 340
2057C40M81q38l98N32K96l24j21j75M02q0O2o1m79L91L81m62k83J55L76K34p59
2078c30J00K43K5J42q89J84P58n0n54j12M63O33p75q56Q39P11j67p21k97J259
2098F06k04p77k2q3P98k02n86K1M09N21n83p99P05M90j38n11j14R35Oo30k99N67
2120A10J24R6n50m75J098J21n72p15N68J450n78j425J65J181M19r16j019J250
2138C32P38p82q53J35J176L86j375n74J001J090n30j877N74J482L47j934p93K087
2156F30O68j299j139O76J304J20j474n75J361Q89r97j564N09K222m28j841l44
2173a282J933O32j583j092J183J113o12j130j88J253P20r93j295P07J854M1k603
2190a342o09K638R55k034j303J192K106r71j849j4J943P43j385j735J132J961
$$ plain form
2057 340 821 -17 -415 117 413 89 -32 -207 195 115 177 116 -363 28 409 -53 -336 -181 195 429 -330
2078 -330 -230 13 38 180 -709 -525 233 183 -371 -483 -20 613 -162 -1018 -179 532 365 -356 -653 606
2098 606 402 -375 -397 -480 318 116 -470 -449 -40 481 -102 -901 -196 294 156 -355 -469 466 472 -158 -457 110
2120 110 234 330 -220 -695 403 524 -48 -763 -195 1255 677 -748 -583 598 1017 101 -918 332
2138 332 1070 288 -565 -430 746 1132 -243 -817 184 1274 744 -1133 -559 923 1270 -664 -1457 630
2156 630 1298 -1 -1140 -464 840 960 -514 -1089 272 1161 164 -1400 -891 1331 903 -938 -1282
2173 -1282 651 1283 -300 -1392 -209 904 292 -838 -1026 227 947 -46 -1341 -634 1220 1261 -1342
2190 -1342 -1951 687 1642 -392 -1695 -503 1603 632 -1217 -1231 712 1455 70 -1665 -533 1428
2206A428r4k520q32L312J086k791j985K581K576k200k627J163K380J9k247p98
2222a549J623J460o20k216l17K857R89l115j436K849K233k278l006J937K873j249
2238A035k616LK400R44j582j630M87K079P06k858j285K739K277k478l124J917
2254i86L554j130l988R83L040L51k405j280J474J678m10k017q87K316K407k875
2270a75k539J753L432r56m456P84M050K11l513r83L016J263j687j902N36J743
2286E77J266k168k143J803L212r69m045L91M294R0m162q07L610J647k866k012
2302b282J907J871j84k037r96J649K263j183l279J94M338N13m577q59M073J726
2318C137l589k398K925K580j779k613K89K404J055k009j832Q36K983p6l541j077
$$ plain form
2206 1428 1334 -1186 -2018 1294 2380 -411 -2396 185 2761 561 -2066 -903 1477 1496 -751 -1549
2222 -1549 74 1534 914 -1302 -1619 1238 2227 -888 -2324 525 2758 480 -2526 -589 2284 1035
2238 1035 -1581 -1578 822 1766 184 -1446 -959 1120 1826 -1032 -2317 422 2699 221 -2903 -986
2254 -986 2568 1438 -2550 -1567 1473 1824 -581 -1861 -387 1291 881 -1136 -2023 293 2700 -175
2270 -175 -2714 -961 2471 1515 -2941 -2157 1893 2104 -1409 -2392 624 1887 200 -1702 -1166 577
2286 577 1843 -325 -2468 -665 2547 1578 -2467 -2076 2218 2308 -1854 -2661 949 2596 -270 -2282
2302 -2282 -375 1496 1312 -725 -1721 -72 2191 1008 -2271 -2077 2261 2774 -1803 -2662 1411 3137
2318 3137 -452 -2850 75 2655 876 -1737 -1448 956 2011 2 -1830 -994 1989 1913 -1628 -2705
2334b705M138J676l970k562L680K945k870l055J709K839o68j956j010J766J682
2349A639r32k108m51K580J454k918k083L046K583k590k966J737L093r08k667J32
2365a359K001N40j062j222k59J962J125k207k038K422K618j641l651J476L738
2380B443q12l537K64K979O80k120j814J415K036l76j986j346K219K543k229k716
2396b357J508L592j233l841M19L778K34l223p48K499J554k208j455R60J544M16
2412A439j960j211J604K061r89k618M54K791j05k412o14K618O39k153p89J171
2428g4J302q36o89p61J218J185r85j528J70J899K31j890p56J828J015j206j420
2445a297P39J721p03j411J19J033J100p68j839N56J492O34k148j011K381J119
$$ plain form
2334 -2705 1433 3109 -861 -3423 257 3202 332 -2723 -1014 1825 1157 -799 -1809 -43 1639
2349 1639 707 -1401 -1852 728 2182 -736 -2819 227 2810 220 -2746 -1009 2084 1176 -1491 -1359
2365 -1359 642 1182 120 -1102 -1361 601 1726 -481 -2519 -97 2521 880 -2771 -1295 2443
2380 2443 1631 -1906 -1642 1337 2017 -103 -1917 -502 1534 1158 -828 -2174 45 2588 359 -2357
2396 -2357 -849 2743 1510 -2331 -1912 1866 2100 -1123 -1871 628 2182 -26 -1481 -521 1023 1439
2412 1439 -521 -1732 -128 1933 944 -1674 -1220 1571 1466 -946 -1560 1058 1697 -456 -1245 -74
2428 -74 1228 392 -297 -1058 160 1345 360 -1168 -998 901 1132 -758 -1514 314 1329 123 -1297
2445 -1297 -558 1163 460 -951 -832 201 1301 533 -1306 -750 742 1376 -772 -1783 598 1717
2461A717j727j829J207K345r94j975J95K025J49j528j042J488J232o71j673K93
2477g88J797J22j941m08J769J030j385j280J043J210o19j350L71J163L62j299
2493b03n98R89M18j78q34k2J201j03q60l02M59R57m73r55M65K74K99l24o79K70
2513a99L39j91j41m09O24Q17p31o20J38O43J56q77m15J053N23n21j009L64J280
2532H24l54j167Q2R18L03j002n00J120L82j83j217K69J304m44r31j9Q29L65q58
2551b79m76Q50N27n06p64K99P94k1r67Q0N27L00m40k48L62M65j84m81QP2L42j76
2573H4m18M16j34J34k20j48P59o97K49J70m15K44J40o0j32j57L27Lj36l2J54L7
2595A68R7k77J8M50l29l81k1N75j75l46k4K93K38j6o12K18L13j3n66J84N04K06
$$ plain form
2461 1717 -10 -1839 -632 1713 719 -1256 -1061 964 1113 -415 -1457 31 1263 592 -1081 -788
2477 -788 1009 1131 -810 -1218 551 1581 196 -1084 -41 1169 550 -800 -429 734 1096 -203
2493 -203 -801 188 606 428 -406 -428 773 670 -190 -492 -33 924 451 -504 -39 235 534 210 -469 -199
2513 -199 140 -51 -192 -601 23 840 109 -511 -373 270 426 -451 -866 187 710 189 -820 -456 824
2532 824 470 -697 -615 303 606 -396 -896 224 606 423 -794 -525 779 335 -596 -615 214 579 -279
2551 -279 -755 95 622 116 -648 -349 445 424 -543 -463 64 364 -76 -324 38 503 319 -162 -154 -82 260 84
2573 84 -334 82 -52 82 -138 -286 473 -224 25 195 -220 24 164 104 -28 -185 142 145 9 -23 131 168
2595 168 265 -12 6 456 127 -254 -275 300 125 -221 -245 48 286 270 -342 -124 189 176 -390 -206 298 504
2617E04n36m48L19M27n19q5J92L42j24l19j14L51K77j29n17K83L72p7j87m18N02
2638I6j21k19K00K15MJ34o57J98P9J34J29k80l58N48J38j76k14L8K49j57k23J04
2660a39M28J6l78K7J01L35j40m35j18N83K36m65j92k37P91m49k18O4P25k99m29
2681a93R5K77K81k80l30K03L59r0n85k04P86q0j18p33L59O35m03l96j67N63N50
2702E29p00o1nM93J26n99r9O37J33p23k38L34K78J08q28J39M55N86o20n46N63
2723c8M46m10l67L0K97O21o52p59O88O56j40q87qQ97J03n64m56O30K78k31l23
2744a89m6M25K84o24l13J38J107l47r42K00J078j87j037O0Q40K53m70p70N85M36
2764D81M3n26l46K89Q91m57j052K03P27P02j396k73J057L00p21l46L07P44k77
$$ plain form
2617 504 -32 -480 -161 266 -253 -338 -146 196 72 -247 -361 -10 267 138 -379 -96 276 199 12 -406 96
2638 96 -25 -244 -44 171 175 309 -348 -150 -71 63 192 -88 -446 102 240 64 -150 -112 137 -20 -243 -139
2660 -139 289 305 -73 -46 55 390 250 -185 -303 280 516 51 -141 -378 413 -36 -254 -190 535 236 -193
2681 -193 -98 179 460 180 -150 53 412 322 -263 -467 319 239 121 -612 -253 382 -21 -417 -584 -21 529
2702 529 -171 -232 -237 256 382 -217 -316 321 454 -269 -507 -173 105 213 -615 -476 -21 565 -55 -601 -38
2723 -38 408 -2 -369 -339 -42 579 -73 -832 -144 512 372 -515 -523 374 477 -87 -543 87 365 134 -189
2744 -189 -235 190 474 -150 -463 -325 782 435 -507 -307 771 584 -453 -393 447 700 230 -540 45 481
2764 481 524 -2 -348 -59 832 375 -677 -474 253 955 -441 -714 343 643 -78 -424 -117 627 350
2783C50o46m73R12J72l26n87M10J150k68j074p03J564N57j381l84M49J181m20
2801D83j215J95P22K21o43l60K9J205qj264r5J170Q26j833n66J054J046q76q12
2820g21M20R21k80o03j58L79O73l63q32K14N62O41j086r88J169J231r02j265O63
2839c25R05K55j544J83P60M59m73n39j92J098J08q97r42J314J042r55j312N21
2857e34J564l27j323r4J642j5j088n41P32O25o3j147K53M90N83m92j448P57J138
2876G12M5j760K32J620K03j779j82R33P74o55n16J66P54r8n51r97Q24J225l64
2895E86j452n5J613M51j801n46J318O10p11j090P78J126l98r31n3N30N49K63j709
2914i22L61J411O1j221q21J503Q59j528q01J247O79l42j133L51N30K88m06n79
$$ plain form
2783 350 -296 -769 143 315 -11 -598 -188 962 694 -380 -1083 481 1038 -343 -727 -278 903 483
2801 483 -732 -537 185 406 -237 -597 -568 637 629 -635 -730 440 1266 -567 -1133 -79 967 91 -721
2820 -721 -301 620 340 -263 -421 -42 631 268 -564 -350 212 853 -233 -1221 -52 1179 277 -988 -325
2839 -325 580 835 -709 -526 234 693 220 -319 -511 587 695 -202 -1144 170 1212 257 -1055 -534
2857 -534 1030 703 -620 -714 928 913 -175 -716 16 641 578 -569 -316 174 757 265 -1183 -426 712
2876 712 757 -1003 -771 849 1052 -727 -909 24 798 143 -373 -207 547 449 -102 -1099 -275 950 586
2895 586 -866 -921 692 1143 -658 -1204 114 724 13 -1077 -299 827 429 -502 -555 -25 524 787 -922
2914 -922 -561 850 911 -310 -1131 372 1231 -297 -1098 149 828 486 -647 -296 234 522 116 -463
2932d63L27R62j00j324r6J099P19j343o38J083P46r96o57L29Q83j2o45k61J04
2951b83Q51k69o60n29J105P92j102j020J024J122q69j151Q40Q85k88r43l47J036
2969A94J18j33o28r0Q58L53j003l91N90R72p82j060N36J155j47j188p7J229p1
2988D35n63l68L27N39m05l75j26O71K79p60n74P26J020o54p76M06N57L3p30k77
3008f15R22l4j83n34R8O61K7k14o21N52O69n37m67n4O66L30p60m10N99M51m26
3029A20m79J34O48k8j97o32L31N82m02o45K66P30l01n38l17P81L44l97n68K38
3049c30Q09j82p68J5P89J3m55l84L79N32J1q44L01M98M6m67m12P42o2l06l69J71
3071b73N81J25p54K00M29l7n03q7L47K52k18m47k0O18j77N7j48k27O35j29l41
$$ plain form
2932 -463 -136 826 726 -598 -694 405 1124 -219 -857 226 972 -24 -681 -352 531 519 -126 -387 -283
2951 -283 568 299 -361 -890 215 1007 -95 -1115 -91 1031 162 -989 -149 736 448 -495 -842 194
2969 194 312 179 -449 -539 319 672 -331 -722 -132 840 58 -1002 -466 689 542 -646 -723 506 435
2988 435 -128 -496 -169 370 -35 -410 -536 135 414 -346 -920 -194 826 172 -604 -198 359 392 -338 -615
3008 -615 307 273 90 -444 -346 315 342 128 -493 59 728 191 -276 -330 336 666 -94 -504 95 546 120
3029 120 -359 -225 423 395 198 -434 -103 479 77 -568 -302 428 127 -411 -728 53 397 0 -568 -330
3049 -330 479 297 -471 -456 333 346 -109 -493 -114 418 429 -415 -114 384 430 -37 -449 293 231 -75 -444 -273
3071 -273 308 433 -321 -121 308 271 -232 -319 28 280 62 -385 -405 213 36 93 -55 -282 353 224 -117
3092a17L0J38R4k71J49q4L33l56L1J93r6J9j04j94J79L54rn06k06P46J33o54j05
3115c03K14M91l57j65J52K87j13l64J8J23K01k43k22K93J03K48l55l35M22j9J87
3136B63o68L73L57l85k16K9N49Q1p37j3N00Rk67J92l78K42Q1K4M3k78J39L16m34
3159a78J10K55j32l5N5q3Kj87L1L8J37J86l60J00K05K3k27J14l07L94j35k09k4
3182b27J53L68Ll58QK04m3j16Q0j33K46P3l51k01O30j4l23j92K20J63k24j30J22
3205d2Q7k0m5j31L22j67J34j75Q8K39j95r2o4K59j41lk21J61J12j28j92L81k35
3228f8K31j85j64L06k10K54k23j16K04K3j21m6J51O0J4j01j22J59k30J99j34N8
3250f1O0Q3l23j6M09J09j67k70J58j2O2k16m0KL30k99Q5L1J59l0m47L57K46kj92
$$ plain form
3092 -117 -87 51 145 -126 23 -61 272 -84 -53 140 44 63 -41 -235 -56 298 289 -217 -423 323 456 -198 -303
3115 -303 -89 402 45 -120 32 319 206 -158 -140 -17 184 -59 -281 12 115 363 8 -327 95 76 263
3136 263 -405 -32 325 -60 -276 -247 302 383 -354 -367 133 142 -125 67 -311 -69 12 36 79 -199 -60 256 -178
3159 -178 -68 187 55 20 75 -8 -6 -193 -162 -124 13 199 -161 -61 144 167 -60 54 -253 141 6 -203 -227
3182 -227 -74 294 297 -61 -53 151 108 -8 72 -61 185 258 -93 -294 336 322 -1 -193 27 190 -34 -164 -42
3205 -42 45 25 -20 -151 171 4 138 -37 51 290 95 3 -61 198 57 54 -167 -6 106 -22 -214 167 -68
3228 -68 163 -22 -186 120 -90 164 -59 -175 29 52 -69 -115 36 96 110 9 -113 46 -184 15 -119 -61
3250 -61 -1 82 -241 -257 152 261 94 -176 -18 -30 32 -184 -224 -222 108 -191 -106 -75 84 54 -393 -36 210 208 16
3275A6k59K77j6o3j1R0K79j38m76L28J19k10J98m22J75L44j95o6p0J87J16k95
3297i2L3n9L92J21k79l82M24j4J10n02K83J62n8k73r8J81N24k43o64K47M55j28
3319A40l52J43K9L55k51l79L78L5J85m25j87N16m6j62j92K98K64j87m32O2M35
3340B27K30o42O3J04L05p9l56j20M06r6j18k80K26K18j00l49j34O11j5m83J66
3361b16K05K27k02k44k15M86K05j81m17K25O82l81m88M3N91K85o78j78P8N92m52
3382c3j13M1N69k09l60k40M88K36k62l50%P32m6m39l11M27M46o10l98O53K50l46
3404A25m29L8O23k74j45j54K58L38j36l85l08O40J12m48l53N60L50l56n40N5P15
3425B86m4j93k06J89J23J57p95L99K47J08q5k91Q8P40m54q18K56L37L52n60j31
$$ plain form
3275 16 -243 34 18 -45 -56 34 313 175 -301 27 146 -64 134 -288 -113 231 36 -30 -100 87 203 -92
3297 -92 -59 -118 274 395 116 -266 158 144 254 -248 35 197 139 -134 -232 -51 473 230 -434 -187 268 140
3319 140 -212 -69 -40 315 64 -315 63 98 283 -142 -329 187 141 -21 -213 85 349 162 -270 -208 227
3340 227 457 -185 -122 -18 287 208 -148 -268 138 42 -76 -356 -130 88 -12 -361 -495 116 101 -382 -216
3361 -216 -11 216 14 -230 -445 41 246 65 -352 -127 555 174 -314 -271 320 605 -73 -251 -173 419 -33
3382 -33 -146 -105 464 255 -105 -345 143 379 117 -233 -233 499 453 14 -297 130 576 -34 -432 221 471 125
3404 125 -304 -266 357 83 -62 -216 42 380 244 -141 -449 191 303 -145 -498 62 412 56 -484 -429 286
3425 286 242 49 -157 32 155 312 -483 -84 163 271 186 -105 -17 723 269 -549 -293 44 396 -164 -295
3446b95M05K47j42l75o0O18lo11j56N03L3J26o05L45L58l9l57l51O47n4n87K90
3468f3P3K02M4m74m8M08M37n85l69J78N42j75n73J19N82K26o74l30M88L24k07
3489A25m10P3N98j84j17k32J19K17N1o04K4Q03j52m36j79M34M12m80m68M37J71
3510B02J50n81R4L03j34K2m50N2N72J26o86J81K87K96p21Q7L09Q6r1j04k47L50
3532A03j64K3j28J46J44K62o23k09P88q3k00l95L86L74l86j86J25k3K59n17K51
3553e3M1L34k19l31o1N42o7q9j75J31qJ05o62N24N7L20n88o2M03R8m0m53K34J41
3577A22J12k92l35M61J87k85k72K80M54r4n86J63L83Ll84j45J98J54l9j66J12
3598C1Rk8R5k35O9K69k01R6m60N77K3k03m76L86M26m63j49J24K2J36k02j46J31
$$ plain form
3446 -295 110 357 215 -160 -220 398 395 -216 -372 131 164 290 -315 30 388 349 -8 -359 288 234 -353 -63
3468 -63 10 212 256 -218 -266 142 579 -6 -375 -197 345 170 -403 -284 298 524 -150 -480 8 332 125
3489 125 -285 -212 386 202 85 -147 -28 189 240 -364 -340 463 311 -125 -304 130 542 62 -406 31 202
3510 202 352 -229 -135 168 34 56 -394 -342 230 356 -330 -149 138 434 -287 -200 109 195 104 0 -247 103
3532 103 -61 -38 -166 -20 124 386 -237 -446 342 259 59 -336 50 424 38 -148 -23 -46 213 -304 -53
3553 -53 -12 322 103 -228 -289 253 186 97 -78 53 45 150 -512 12 69 389 -199 -261 142 240 200 -253 -19 122
3577 122 234 -58 -393 68 255 -30 -302 -22 432 338 -248 -85 298 301 -83 -228 -30 124 85 -81 31
3598 31 40 12 107 -128 -59 210 9 105 -355 222 245 42 -434 -48 378 -85 -234 -110 -88 48 -154 -300 -169
3621a69L52p3o1j67K82j22j18L4L30j84l30l9K47O1M7l8j34n1M9q2K26j40J73
3644I3j69J08o0J36j70p5k73K91O6m0N1j31J45J20l41r3M53L8j41j33J25K9q0
3667e1j9q9Q7K71l41k5K89K06l76mK1J58j17j24K42k95Q9J96j25N0j58M81n86
3690b20J50k69M19O3n2j87J71o0j66K70n9n8j0l27N1L38k9j20J19k82J82R6oj98
3714a84J16K17n22J21M63q2q4rmK96k01k12J75j67J54o0K4k65L95j47j04M0J65
3737A25O0j02j0l34L04J31k45K63j27L4qq7j07L75j38j73nP6p9q2k08K15L5L04
3761B17m67K09J89m3p1j40k02L45L9k0j11O1K75m68K31m28L48K25j12k12K45q4
3783B6K18k59qJ92k3j65K50l03j44J40j2O8J9k4P4k18K84n9l35J31J82j70K10
$$ plain form
3621 -169 183 110 49 -118 164 42 -76 -42 288 104 -226 -265 -18 43 90 52 -82 -133 -84 -166 60 -80 93
3644 93 -76 32 -28 108 -62 -137 -410 -119 -53 -93 -42 -173 -28 92 -249 -342 111 149 8 -125 0 29 -51
3667 -51 -70 -159 -72 199 -142 -167 122 328 -48 -52 -31 127 10 -114 128 -167 -78 118 -7 43 -115 366 -220
3690 -220 -70 -339 80 143 91 -96 75 15 -151 119 60 2 -8 -335 -284 54 25 -95 24 -258 -76 20 14 -184
3714 -184 -68 149 -373 -252 211 129 45 36 32 328 127 -85 90 -77 77 17 41 -224 171 24 -80 -40 125
3737 125 185 83 73 -261 43 174 -71 192 65 99 91 4 -103 272 134 -39 -44 32 -47 -129 -337 -122 -87 217
3761 217 -250 -41 148 105 34 -106 -308 37 76 56 -55 6 281 -187 44 -384 -36 189 77 -135 110 26
3783 26 244 -15 -23 169 146 -19 231 -72 -216 -76 -88 -20 -1 -25 49 -169 115 56 -279 -148 34 -136 74
3806G4j66M7K80j47p0J67m43L85k02j68J05J51J98n0K07k68j67j9K0K28j75K02
3828A89j34L7j37Q8k11J52o7K42k56L9N5q7L72j07j10qP7l6k84K1K62Kr8n4j8
3853g1L4J99j07j01J55k13K45k35k8K17n7j73J62J21O6O4n62L04J69P5k66J98
3875A96j25MLl81L61Kk83K36j25K3M2jo8K46l45N41j92L9j06l5K7r7K82K7j33
3900A38p5j29K43J24j95j98J09J74k3r3Ll6J29Qk40K17J23k88j1J00nN2J72n74
3924b75L52Q2Q9l26J69k12k19L86j34J91r3j63R8n0O0K20k32Nj00J13NM7p4q2
3948a43K31n0Q6N6q7j69j03L80n8Lk29j05L19K62m81O8n5M18j17n65K09L05r9
3971G6j73P4K01j28J90m17k6K38j6j82J84M8K3j01j32M32m6k04j51k2J52J21j42
$$ plain form
3806 74 -92 -45 235 88 18 185 -258 127 -75 -243 -138 13 211 161 368 100 -67 -86 -66 162 -13 189
3828 189 55 92 -45 43 -168 -16 -83 159 -97 -58 -3 -90 282 175 65 57 134 98 -186 -165 97 99 1 -53 -71
3853 -71 -37 162 55 -46 109 -104 141 -94 -122 95 38 -135 27 148 214 278 -284 20 189 264 -2 196
3875 196 71 75 78 -303 58 60 -223 13 -112 -89 -47 -48 -116 130 -215 326 134 173 67 32 59 -38 244 271 138
3900 138 63 -66 177 301 106 -92 17 191 168 75 78 42 171 179 -61 156 279 -9 -20 80 75 127 299 -275
3924 -275 77 159 248 -78 91 -121 -340 46 -88 103 10 -153 -55 -105 -45 175 -57 -52 -152 -39 -34 13 -61 -143
3948 -143 88 38 124 180 93 -76 -179 201 143 146 -83 -188 131 393 -88 -20 -75 343 226 -339 -130 175 76
3971 76 -97 -23 178 50 240 -177 -203 35 19 -163 21 69 92 -9 -141 291 245 41 -110 -132 20 141 -1
3994aO8j31K47j64j96k09M78q1j7r6R6K03m3k75l2K28M1k26J21MJ39M5k62PR3
4019C7L24k73m05K15K90j34j46Q0K0k7oj41p6L38q2n26L83J93J26k08j81L40k05
4042f4O9n3j59L28j23n7o3R0J66j63K09n4k8K67k87k80J73N3n0q7J79J41p8k6
4066A03j09m5Q3N0j93N2M1J91j28j47J8J82J0j04M5l6K38m11p1K65O1q3K6k05
4090a67M76m40p1j00L91L09m25J08j44L50j75j74j13Q6K73k05k47K36L60j58l12
4111a42K68J19k51o4R9j5Q7j66J74l51L18k59PJ01J79j6k46J04O5Q2j54j1Q4K90
4135C02l87J12j0k26K64J14j99J49k27Q0J4M7K2Q3p0q1j57M33n26J67K12p7Nm2
4159BM5O9j80N9j27j30J78L7J24J31k35N0m6O7q1K01O5l69J59j93J71L2%O8J39
$$ plain form
3994 -1 67 -64 183 19 -177 -386 92 11 -6 -102 -6 197 154 -121 -153 75 116 -110 11 15 154 199 -63 -56 37
4019 37 361 88 -317 -102 188 54 -92 -12 8 -19 -25 -166 -242 96 14 -512 -129 64 190 -18 -199 141 -64
4042 -64 5 -48 -207 121 -2 -59 -122 -32 134 -29 180 126 98 365 78 -202 -29 24 -26 -113 66 207 129 103
4066 103 -6 -51 32 82 -111 -59 -18 173 45 -102 -84 98 108 4 49 13 251 -160 -231 34 95 12 38 -167
4090 -167 309 -131 -202 -302 89 398 -27 81 -63 287 112 -62 -175 -89 184 -21 -268 -32 328 170 -142
4111 -142 126 245 -6 -70 29 14 101 -65 109 -242 76 -183 -176 -75 104 88 -158 -54 11 93 -61 -72 12 302
4135 302 -85 27 17 -209 55 169 -30 119 -108 -28 -14 33 55 138 68 -13 -170 263 -263 -96 116 39 44 2
4159 2 47 116 -64 -5 -132 -262 -84 -47 77 208 -27 23 -23 44 -37 164 229 -140 19 -174 -3 29 29 97 236
4184B36k03J40p8j02L1k05Q8j43M09j88o3J53k54J15N29l04j72L04n9o2k75Q0
4206b3l13O26j76m19K33J5P4m8J82p2l12L7O4J22l8J46j67K12m5J14r2p8m2J1
4230A1N6k38K03J81n81L60P7rJ11j86n9n0J78k73K49J05n7l2P9k23N67k16n49
4253b96K48K5J57k64l0K35k83L06k83J42J98J1k79K22j06k04L23j32m6o0j09K16
4275iQ9p4K11k85J39l33J93L02l67M2o7j81L60j86K00J02j62J66l82M00j92J58
4297A24k71O9%J51j44m2J60L4P9l16J39J03o4q6p7j14K20j35MK67O8j68J59j92
4321c2J56P0l20k28M56M3k21k23K35l3K56m57L26j23k3M25m98M51k68J91j0l99
4343b26K51o8K25j14L8r0k30K27k78L13k76J90O2L3j14K34Rl46J39L38l52J75
$$ plain form
4184 236 33 173 95 -7 24 -181 -93 -236 173 -15 -78 75 -179 -64 465 161 -11 293 234 172 -103 -23
4206 -23 -336 290 114 -305 -72 -57 17 -31 151 79 -233 -196 -132 -10 -48 98 -69 143 98 212 120 42 0 11
4230 11 67 -171 32 213 -368 -8 69 60 171 -15 -74 -124 54 -219 30 135 78 46 125 -98 469 253 -296
4253 -296 -48 -23 134 -130 -160 75 -208 98 -185 -43 155 166 -113 109 3 -201 122 -10 -56 -116 -225 -9
4275 -9 80 6 217 -68 71 -262 -69 233 -134 -92 -159 -340 20 -166 34 136 -26 140 -242 158 -34 124
4297 124 -147 -78 -78 73 -71 -113 47 81 160 -156 -17 86 22 -64 -141 -255 -35 -170 -166 101 169 1 160 -32
4321 -32 124 194 -126 -354 102 145 -76 -299 -64 -97 159 -298 28 -95 -118 307 -191 260 -8 183 173 -226
4343 -226 25 -43 182 68 106 16 -214 13 -265 48 -228 -38 24 57 -57 177 186 -160 -21 317 -35 140
4365A40m10K53M4J22l09P0J0J58L19k86j19j15K27j58K80k81J25j29N0o5P1J70
4387A67k05L6J83j29k08m6K07p2j9J17j76l0L8J32j55J20O6k99L48j69J41k34
4409a87O2J14J90m3j58M5j45L31j76r3M9L2N5N1j59j72J94K86k79j64K65l1m9
4432A8J22m49K45j30j8j42K70J00K5j36L42j35r3Q4J58j93j38J14j23J16j20M
4454g9K5J12L1j00K37k48j41K07M8k70o7L22j53J52l73M70k07%l4rM6j01r5MK21
4479bJ19k47J98J62k18J22m23L02Q6j45K12k73N1J09J74l66M9J11J24p4J5P0j29
4502B7J75l84P5k23N07n62K29J4J11K47k16M7l6M6M0r0p4j00J62j79P8L87j8K3
4526B86o30M13q5j83L24rm5L0j6k45J54R5j93j13J16L50k00k68N9J18J92j35R7
$$ plain form
4365 140 -270 -17 27 149 -160 -90 -80 78 397 111 -8 -123 104 -54 226 -55 70 -59 -9 -74 -3 167
4387 167 -38 -2 181 52 -156 -202 5 -67 -86 31 -145 -175 -137 -5 -160 -40 26 -273 75 -94 47 -187
4409 -187 -125 -11 179 136 -22 23 -122 209 33 -60 -11 21 76 127 -32 -204 -10 276 -3 -167 98 67 18
4432 18 140 -309 -64 -194 -212 -354 -84 16 41 -95 247 112 19 103 261 68 -70 44 -79 37 -83 -79
4454 -79 -54 58 89 -11 226 -22 -163 44 92 -178 -245 77 -76 76 -297 173 -34 -34 -68 -77 -31 -132 -227 -223 -2
4479 -2 117 -130 68 230 12 134 -289 13 99 -46 166 -107 -56 53 227 -139 -90 21 145 71 86 156 27
4502 27 202 -182 -107 -330 177 -385 -156 -142 -31 216 0 47 11 57 97 7 -67 -167 -5 -184 -106 281 263 286
4526 286 -344 69 -16 -199 125 116 71 101 85 -160 -6 89 -104 -217 -101 249 49 -219 -160 -42 150 15 112
4549A12j90M6Q1K7K9L7j35k4K6O2j35N1j3j21K20j8o5J81j48j14p4K54K0j70K78
4574B17k70J45k15K27K5n6Pj82K47j92l39L99K69K4m50k12M27o1k9j78j15L39
4596B7n2n3K71k52L84l09j77p8L1L98j77j4J71o2j56MJ52PJ81n54J51J07l1J40
4620A09j50m2L4J05q5J10k6R2m22QM29j29J28j18JK3j10R1k05J61J75k06J38l28
4644b17K55N3K1k92J71J24j66j46J38L5q1J78k25J97K98j51q5Q3M3p7j29j57Q0
4667e0M3J74k33K26j51M9m17L50k5J42j41r6R1J42Q4l18K0j33K60j31J69p4k01
4690b20L39j77R9J61p9l0J3j45l8m0L0J73o7m8k7r6J9L51j02j89L6J82K02m95
4714a48O4L0qP5J27P0j23k55J18L2K31q4J43k54k92O79k54j29p0Ok4nk18J28M81
$$ plain form
4549 112 -78 -32 49 76 105 142 7 -17 9 71 -64 -13 -26 -147 73 55 -10 171 23 -91 -165 89 109 -61 217
4574 217 -53 92 -123 104 129 73 80 -102 145 -47 -386 13 282 306 -144 -356 71 10 -19 -197 -312 27
4596 27 -25 -78 193 -59 325 16 -161 -239 -208 190 13 -1 170 108 -48 -44 108 115 296 -258 -107 0 -31 109
4620 109 -41 -83 -49 56 -29 81 55 147 -275 -267 162 33 161 43 44 67 -43 48 -157 4 179 -27 111 -217
4644 -217 38 91 112 -180 -9 115 -51 -197 -59 -24 -105 73 -152 45 343 192 107 190 233 156 27 -130 -50
4667 -50 -7 167 -66 160 9 58 -359 -9 -34 108 -33 -129 -38 104 188 -130 -110 -243 17 -114 55 -19 -220
4690 -220 119 -58 41 202 123 93 106 -39 -77 -117 -87 86 19 -29 -56 -152 -133 218 116 -73 -37 145 347 -148
4714 -148 -84 -54 -62 13 140 210 87 -168 -50 -18 213 129 272 18 -274 405 151 22 -48 -42 -66 -71 -289 -161 320
4739C20m49k0K74j73J80j22J3J95k74J42o9r2K30rJ42k45j93J33K3l20M15m9R3
4762A45j49k68K99J25p2n9n3J90l3l06M3J75j6O6j70j19K48k3Mm6Q9M0j46p8J95
4787H1k71K52k76L7J84J16j42j94K13O4r1k70L31p3P1J1q3M4J3M14m98k0K34n3
4811I4J6J0p6M0J16j43j29J44j71j18K31l9j90J39J00k04Q9J30r1M8q8J37J89
4834B34m4r6j08l8q3L87j38j81m9r6K03QN1ll31L70j20K07l90J49K38J9p1m1n1
4859B6PL26m91P1K6P9k1ON5N9j76j20M0P1n3Q5q6n1r3R7L77k74m3J73k00J76k92
4886b26K26Nl9P3J16j91j81J99nK00J54k82n7n0K7J00j64J97J88l91P3P1p9P7
4910D1j8J6p6jJ93k65K4m6Q2p4K56K6l01K30l42M38n5r4j77R6R7l0J47m16L67
$$ plain form
4739 320 -129 -149 125 -48 132 10 23 218 -56 86 17 -75 155 146 288 43 -150 -17 6 -314 101 52 145
4762 145 -4 -272 27 152 80 21 -32 158 125 -181 -138 37 21 87 -83 -202 46 23 27 -19 70 110 -36 -114 81
4787 81 -190 62 -214 -177 7 123 -19 -213 0 64 -27 -297 34 -39 32 43 -40 4 17 431 -67 -87 147 94
4811 94 110 120 44 84 200 57 -72 72 -99 -217 14 -25 -215 -76 24 -180 -91 39 -52 -4 -92 45 234
4834 234 190 94 -14 -52 -135 252 114 -67 -116 -212 -9 -1 50 47 -284 86 -34 173 -217 -68 170 189 118 77 26
4859 26 33 359 -132 -61 -35 44 23 29 84 143 -33 -153 -113 -42 -95 -10 -96 -147 -240 -143 234 -40 -83 90 -110 66 -226
4886 -226 0 5 -34 39 155 -36 -217 -18 -23 177 331 49 -8 -58 -31 69 -95 102 290 -101 -28 43 -36 41
4910 41 23 39 -37 -38 155 -110 -86 -132 -50 -124 132 158 -143 87 -255 183 128 34 -143 -47 50 20 167 -249 118
4935A18j89K21k91O0K44k08k0n9q7R3O0R5n8K10n3j60k26K54J07o2J81k58J32
4958A04L7kk88O5p7n2R7P2lk1j36J61J1M14l57k12K48j17K41J14j33k67O2n7k27
4983c23M68j39M4j95J17J92k65J21O0o5j03K3R4J55j94j26j46K22J5J35p4k4J10
5006A02qj10Ok13J10K70k12m7J14N9j58J61l23M37p0L0N8l48r4K94j38K15l57
5029b22K31J46L2j16N1p2qK24k82J89l2l18J61J00l3j45J45N2K47m07O9o3N5K01
5053B05l58J11Ol00K07o0O5K07q6j01pJ98P0n07M97l08J40K9j77m8P8K49j09j4
5077a3LP4n2K83m72J76J29k25R1j75J00k49N58j19O8K5n18J67J35J05J0j99J01
5100Cj50K41k07n2J04j77J58J61k96K18J95n64L87J00kk24k1J86L7q8J0k32M12
$$ plain form
4935 118 -71 150 -141 -81 163 -45 -65 -124 -211 -118 -58 37 -21 189 136 -24 -250 4 111 49 230 -28 104
4958 104 141 139 -149 -84 -161 -213 -116 -44 -47 -68 -204 -43 -32 382 25 -187 61 -56 185 299 166 -101 -39 -96 -323
4983 -323 145 6 50 -145 -28 164 -101 20 80 15 -88 -65 29 184 -10 -136 -282 -60 -45 90 16 -8 102
5006 102 94 -16 -10 -223 -113 157 -55 -102 12 71 -87 74 -249 188 118 148 206 -142 -236 58 -80 135 -222
5029 -222 9 155 187 71 122 50 42 266 -16 173 141 -177 -16 84 51 -94 51 103 350 -57 12 -51 4 205
5053 205 -153 -42 -36 -336 -129 -189 -124 83 -3 -104 -111 87 157 -350 147 -161 -21 8 -169 -217 -139 110 1 -13
5077 -13 -10 64 12 295 -177 -1 128 -97 -6 -181 -81 -330 228 109 177 202 -316 -149 -14 91 101 -98 3
5100 3 -147 94 -113 -165 -61 -238 -80 81 -215 3 198 -366 21 121 119 -105 -126 60 97 9 19 -213 199
5123A99r0j68o0K16j2p5j59N4M6l0K0p4J50M9J91m09L24j65O4lk46K04K08m61
5147b27J04J75M2k04L07j42j55O4J78k11J92j89K12j32j81m0J50J20q7k33L11
5168E4l0j28J45j75O6k2L9k5J09j98L59m28M46j56Q7P4k12K66p0k51o0K01J32
5191B23M0n05J19Q3J27J55k69j48J32K31k20l6r8j23m9L56J10O2k14j88N30l83
5213f5Q9j77O6O0K06k48K9l2l0L45m36L5J27M7J37q2L3J71l17j17J12P2q2M5p6
5238h8j85K69O6k6N9n5o7K1m2J39K4j98J06j89L08l42n1L9M84l3j71l13L28m9
5262C4Q8%j89q9M20k13k97O9M15k55k28K62j18L27K9n1l23J03J11k3k51K00k8
5285gp7k1J91j21J68K5k4j43j51J42M5J25k0j12j82l2K88r3k94JK32L0qq1Q8J97
$$ plain form
5123 199 109 -59 -119 97 85 10 -149 -95 -49 -79 -59 -133 17 66 257 -152 172 7 71 68 -178 26 234 -227
5147 -227 -123 52 94 -110 197 55 -100 -36 142 -69 123 -66 146 14 -167 -207 -57 63 -24 -257 54
5168 54 24 -104 41 -134 -68 -90 -51 -76 33 -165 194 -234 212 56 143 217 5 271 201 -50 -110 91 223
5191 223 263 -242 -123 -40 87 242 -27 -175 -43 188 -32 -68 -166 -289 -338 18 128 190 -24 -212 318 -65
5213 -65 24 -153 -87 -27 179 -69 -40 -72 -102 243 -193 -158 -31 16 153 71 104 275 -42 -159 -47 25 -57 -12 -88
5238 -88 -273 -4 62 36 95 40 -27 -6 -48 91 115 -83 23 -166 142 -200 -251 -212 272 239 68 -245 83 34
5262 34 122 122 -67 -156 264 51 -246 -177 238 -17 -245 17 -101 226 255 204 -119 -16 95 72 -179 21 -7
5285 -7 -84 -105 86 -35 133 158 134 -9 -160 -18 27 152 132 20 -162 -194 94 1 -293 -292 -60 -30 -38 -119 -31 166
5311A66k94n1J55L5L3j28k18L60j33J42k04j75L13N8j42r5J70K07j95k57N9K08
5333A4p5r9J46K18Kk54j09K69Lk05O2n6j87QM6L24r3J14Rk86j28K05J62k05J11
5358do2K12Nl56N68l74Q0L1l5j77J76l2q7P9m2j8K72j30n3L5Qj54nJ68k14q3K52
5385F0n6j34Q1N6l9L6m0J33j70r9N3J60j81J30k41J68P3l5q6K99k51J87l73O7
5409b02J84j21J83Q5k81K21qj55r7K37k24J23l0J14j23m0L24j69J11j76N4o1q
5432e9J51p4m8o7n0J17N2j79P2O1k9J74j84J78kk78J46M7P6L0l30K39J93r0j57
5457a1L6K46m3l54P9K55m73J37J20pn1J3r3Q0K58l73M3OJL68l21K5p3Q6j13k4
5483a83L16k52J11p6oJ46j1r8k60M77n68M67O3l1l46L16m3l02M22L9r4k21L69
$$ plain form
5311 166 -128 -179 -24 11 44 -84 -302 58 -75 67 -137 -312 1 59 -83 -178 -8 199 4 -253 -194 14
5333 14 -61 -160 -14 204 206 -48 -157 112 115 -90 -28 -84 -271 -263 -217 107 14 128 137 -149 -277 -72 90 -115 -4
5358 -4 -66 146 151 -205 363 -11 69 100 65 -112 64 32 -55 24 -18 -36 236 106 53 88 96 -58 -63 105 -109 -192 60
5385 60 4 -130 -49 7 -32 4 -36 97 -73 -172 -119 41 -140 -10 -251 -83 -10 -45 -131 168 -83 104 -269 -202
5409 -202 -18 -139 44 129 -152 69 61 -94 -191 46 -178 -55 -85 29 -94 -134 190 21 132 -44 10 -51 -59
5432 -59 92 18 -30 -97 -147 -30 22 -157 -85 -24 -53 121 -63 115 113 -165 -19 28 104 134 -196 43 236 146 -11
5457 -11 25 271 228 -126 -47 208 -265 -128 -8 -15 -66 -53 -146 -66 192 -181 -138 -132 -131 237 -84 -59 -132 -46 -159 -183
5483 -183 133 -119 -8 -84 -90 56 45 -53 -313 164 -404 63 126 95 -251 65 22 -280 142 181 87 -134 235
5506B35r8r3j89O2K56j78J54k04j8k14L25M9m4q9pJ97o9k30Q9N2n5J56k42K77
5530A22k58J55k84L42j90j50L17j44j09J55K8J06M1k03P5j80M0M26k87j31J05
5551b4N9j91J70J48r9j73p8J15L1n4O5l37Q6M62k23J88k98J59k2oK01j27k95R7
5575a46L6R5M2K7p1J47k19J3J75k10l1O0K70o5R5k47J40r1j39L06j72J51k77l3
5599a44J76R1k07R7n0J87k38J11k22M79j65k41l2L7Q8J68k86J25qM00l02n3K35
5622B46l68L25j65K4j86M9k74M73l77L70k37K33q1l32K43J29Q1k81K31lk46K03
5644E7rl6J78k22O6O0O7k05j44J25k3K62j36j03J93j18%K4j11K31l1k50J76q4
5668c3J93k93J00m0L7j5J08k21L1oP4j89K86O0qk11J60R8Ol12L21l06K35p9l21
$$ plain form
5506 235 137 44 -145 -83 173 -5 149 -55 -73 -287 38 87 43 -46 -53 144 75 -155 -66 -14 -69 87 -155 122
5530 122 -136 19 -265 77 -113 -263 54 -90 -199 -44 -16 90 131 -72 3 -177 -137 289 2 -129 -24
5551 -24 35 -156 14 162 63 -110 -188 -73 -42 -96 -31 -368 -282 180 -43 145 -153 6 -16 -22 179 52 -243 -146
5575 -146 -110 -15 27 54 -17 130 -89 -76 99 -111 -142 -82 188 123 218 -29 111 20 -119 187 15 166 -111 -144
5599 -144 32 123 -84 13 -37 150 -88 23 -199 280 115 -126 -158 -121 -33 135 -151 -26 -34 366 64 11 246
5622 246 -122 203 38 62 -124 -75 -349 124 -253 117 -120 113 32 -300 -57 72 153 -128 103 100 -146 57
5644 57 48 12 190 -32 34 94 161 -44 -188 -63 -86 176 40 -63 130 12 12 36 -75 156 125 -125 51 -33
5668 -33 160 -133 -33 -73 -36 -51 57 -164 -133 -139 -65 -254 32 92 84 -127 33 131 137 -175 146 -160 75 -4 -325
5693c25K04J78P9j49j82M24k25J30j88j56L68q4k34J22L3j87O2M6K0o1L76k39
5715A2k7O9o8j21J69j23j85M71m32K04L1J09q6k6r3K05N7o1m8j75r7K57j65J88
5739F5O7k48J15k06J81J08j63K11mj2j78L9p0L6J97j67J66p9M5M5k56j50L08J20
5763A70j83M3p1J10J9Q4j23J98j47m23M33j41J0O6p0J63%j01n3j48K78J3k02k32
5787c07O4J98q2QJP5K35j3j76Rp9K28l39K95j07Jk82K34M14k33j28k4K7K18k70
5812c3L45m19J29p7M8J39j86r4J9O7k04O03o20M29n9k50O5Q5M7J17p4J41k96q5
5836a63K58l03J51J61l4j69K0J73q4J27l61J79L3J0J63q3j43k05L56j30K14k66
5858i6N5K87l79J5k9N4K2QN2n3J09k06J49r4M07j00Q2m57R5J47j51q3K95Ok11
$$ plain form
5693 -325 -121 57 136 -13 -195 229 4 134 -54 -210 158 74 -160 -38 -5 -192 -130 -84 -64 -125 251 12
5715 12 -15 54 -14 -135 34 -89 -274 197 -235 -31 0 109 23 -3 -96 109 166 105 57 -118 -215 42 -123 65
5739 65 132 -116 -1 -207 -26 82 -81 130 126 114 -64 -25 -95 -59 138 -29 137 58 103 148 -108 -258 50 170
5763 170 -13 30 -41 69 88 172 49 247 100 -323 110 -31 -21 45 -25 138 138 37 -16 -164 114 127 -75 -307
5787 -307 -243 -45 -127 -119 -118 -43 192 179 3 12 -67 161 -178 117 10 11 -271 -37 377 144 16 -8 19 237 -33
5812 -33 312 -107 22 -55 -7 132 -54 -148 -129 -62 -266 337 -283 146 87 -163 -98 -13 34 151 77 218 -78 -163
5836 -163 95 -208 -57 104 70 -99 -79 94 10 137 -224 -45 -12 -2 161 78 -65 -270 86 -44 170 -96
5858 -96 -41 246 -133 -118 -147 -93 -71 -63 -11 -64 45 -161 -12 -106 301 201 283 -174 -79 68 -83 -166 129 135 -76
5883g6L11l34J87k39K15o3m5J61p2o8O9j68K35jj53k30J05L69l96M3NK58L5k57
5907a09N2K69j23j99K90k21K20q6j67j84L96K6j93l19L92l8J24M4j33P6m9K05
5929B73l84Q1K35j58k84L72k63K3K92L8m44M2J6M00k83j90K87J91k63r7K25j09
5951@j08J6K99j73m6P3K4j5q8K55n75L58j65l2L34j32L9k00j66J75K60l74K26
5974a5J11j75R9R1JJ67l35J24j68N3m8P1J31k17R5J34o7Q8j65L1J06m40K32Q8
5998hNR6j95j4P4K0k65K88P6n4R7k62J78r5J2J25L3j19P5ml62K36K71j48n7m0
6024c7K87n6k1k44k1R4J87j32J0J00k12p0l2J48q5M1j32J52q8rPl3j02J72j81
6049b57K28P4j27p5k7J67N4n0n4J33l3j50M6J29Pl27N8J45J4K39j40j71k5j5M03
$$ plain form
5883 -76 235 -99 88 -151 64 1 -44 117 45 -23 46 -122 113 112 -41 -271 -166 203 -193 -150 -145 113 148 -109
5907 -109 -57 212 89 -110 180 -41 179 93 -74 -258 138 164 -29 -348 44 6 130 174 41 117 68 273
5929 273 -111 -30 205 47 -237 135 -128 -105 187 225 -219 -177 -161 239 -44 -234 53 244 -19 -116 109 0
5951 0 -108 -92 207 34 -12 61 85 70 -18 237 -338 20 -145 -177 157 25 64 -136 -302 -127 133 -241 -15
5974 -15 96 -79 20 111 112 279 -56 68 -100 -47 -95 -24 107 -110 -15 119 52 140 -25 6 112 -328 -96 -8
5998 -8 -3 93 -102 -116 -42 -22 -287 1 77 23 120 -142 36 -59 -47 78 111 -8 67 63 -299 -63 208 60 3 -37
6024 -37 250 194 173 -71 -92 2 189 57 67 167 -45 -115 -147 1 -84 -43 -175 -23 -111 -120 -113 -146 -248 -76 -257
6049 -257 -29 45 -82 -157 -184 -17 37 -13 -67 66 33 -117 -71 58 65 -262 -204 -59 -45 194 54 -117 -142 -157 246
6074B46J5j89j27l4J89n1J03o3L2k74K46j24L6R0J9j32k14L78j79L20n40R8J53
6097bk45J94n4R5k11J39P2M7J40k36J07k18J70k31J43R1K0N4j43K27o4k83M90
6120C02l17N3N1L0j35R8j2j28J21j04j87l5L53oj22l5J6L07k80n0J89q1JR7k30
6145a04K65J96k44j79j05K99j94J07j05N9N2r8K05o0N1k45L1K16k69J13j1O6l8
6168HMm0N2k78J98L7j76O3K30J40k67j01K59j36O1Kj50j27K50l7O0o4j74L91k50
6193d5J02J29p9k03M9K4K02l6k06p6M00j1j84j01j29K94j23k19K08j39P0N2Q4
6216F3n7N5pl7o6K01M4k66n8LM5j98N0j02M51J0K8k72%K17qL9o5j17J05k92Q8
6243a46J89M3L1k15r8K13j61K83l09J99j7k8O4K87l84J81O5l6k9q3k8j73L1J03
$$ plain form
6074 246 261 72 -55 -89 100 49 152 89 121 -153 93 -31 5 95 114 -18 -232 146 -33 287 -253 -155 -2
6097 -2 -247 -53 -107 -12 -223 -84 -12 35 175 -61 46 -172 -2 -233 -90 1 21 75 -68 159 95 -188 302
6120 302 -15 38 89 119 -16 82 70 -58 63 -41 -228 -263 90 84 -38 -73 -57 250 -30 -80 109 28 29 126 -104
6145 -104 161 357 113 -66 -171 128 -66 41 -64 -5 47 -51 154 94 145 -100 -69 147 -122 -9 -20 46 8
6168 8 12 -28 24 -254 -56 -19 -195 -132 98 238 -29 -130 129 -7 54 56 -94 -221 29 -8 52 -12 -186 205 -45
6193 -45 57 186 107 -96 -47 -23 179 143 -63 -139 261 250 66 -35 -164 130 7 -212 -4 -143 -73 -21 63
6216 63 6 61 54 17 -49 152 196 -70 -128 -125 -80 -278 -228 -330 121 131 159 -113 -113 104 96 135 70 -47 58 -234 -146
6243 -146 43 86 117 -98 -196 17 -144 139 -170 29 12 -16 48 335 -49 132 197 161 132 49 21 -152 -121 -18
6267a8J91p3J14k50q0M8M8k3O8k61J36O2m4kJ67M0k69K19k77M34j40k90L52o6
6291H6J11q1j50J51m21M22k59K85l08K0J56q5O5K43j98jK6l5j10o5K76j55k40
6314b67k05M77K39k09N7N7k67P2J35j11n9J80j43j00O4j02L3P1K5K48k55K3J7
6337b0r9K95r4k51r5K04L11j85l12l0K34J37K53j14k04k72L42j28n4L22k96l3
6359h9K05mj02l49L28K46k61m6OL4j3j5K74j33n3m4j1k60L61k07J53m9k09N2O9
6384a17K10J00k27J47J11l41P0P8KR6j47J6n1K2J55j41l5o5j20J44K65l54J86
6407DP4j50O8J66j74k61J57l4J87k28j06M76k57J25Rj18J55n0Oj56j6K14j6k19
6431a44L50j71j35R1J25K6k17K72j43j30J1P9m8L6rO3J5k31L52j40j18O9R0q0
$$ plain form
6267 -18 173 100 214 -36 -116 -68 -20 -43 25 -236 -100 -38 -82 -84 83 123 -146 73 -204 230 90 -200 152 86
6291 86 197 116 -34 117 -304 118 -141 144 -164 -144 12 -73 -8 235 37 36 62 27 -83 -148 128 -27 -267
6314 -267 -472 5 244 35 92 149 -118 -46 89 -22 -81 99 -44 -144 -80 -182 -149 -78 -53 195 -60 -37 -20
6337 -20 -119 176 82 -169 -264 -60 251 66 -246 -276 -42 95 348 234 30 -242 100 -28 -82 240 -56 -89
6359 -89 116 112 10 -339 -11 235 -26 -72 -66 -32 -45 -60 214 81 28 -16 -27 -287 74 -133 20 -29 -238 -186 -117
6384 -117 93 193 -34 113 224 -117 -47 31 33 129 -18 -2 -53 -31 124 -17 -52 -117 -237 -93 172 -182 4
6407 4 78 -72 -4 162 -12 -273 -116 -150 37 -191 -297 179 -78 47 56 -62 93 43 49 -107 -123 91 75 -144
6431 -144 206 35 -100 -9 116 142 -75 197 54 -76 -65 14 -34 2 -7 56 71 -160 192 52 -66 3 93 13
6455A3L1q0j7J78j52L17m24N6K34k89J78j80kJ95N5j73K01p9k3j74K26j81O7k3
6479d6J73n3k1J32l02k4K66k35R0n3l2K12L5o4k92J12J58j51J03m9R0j05J31J08
6503A83j58pk89K45l7J44l09J78o6L8j77K28k1J28q9P0Nq5J02k21j34L43m4NL7
6528F9l49K59K0q8n6m8M24l30M7o9O3J10O4K3j61Q3k28Q0J69r9k00J44J61o8j17
6553i7K58l11J39n0o3J07j5K4J27j91l03N51k01L1o3k85M99k30o5j6L3J89m4R9
6577A23k06L21j26j95M1N2Lj38J30k9J02j6j95L63j26k5j52m5K03k55Q9J09k5
6600CJ83k18N3j72k4r6M7J32l4L52l17P4O7k54L69k95J45j44J55j87J84k5j13
6623a15K51rj70j4K43l66J74j16o8M5m5K66j99N2r7K41n5j44O8K21j32l0l4J75
$$ plain form
6455 13 44 -36 -53 125 -27 290 -134 -78 156 -133 45 -135 -137 58 113 -60 141 62 39 -135 91 -90 -23 -46
6479 -46 127 74 53 185 -117 -141 125 -110 -20 -73 -105 107 142 78 -214 -102 56 -95 8 -41 49 -56 75 183
6503 183 25 18 -271 -26 -63 81 -228 -50 -116 -78 -255 -27 -48 80 -9 61 66 -19 83 -138 -272 71 27 32 69
6528 69 -280 -21 -1 -89 -145 -193 231 -99 -52 -121 -58 52 116 139 -22 61 -167 -87 82 -17 -217 -73 88 20 -97
6553 -97 161 -150 -11 -61 -124 -17 -32 -8 119 -72 -375 176 -25 6 -57 -342 157 -73 -138 -154 -121 68 24 123
6577 123 -83 238 112 -83 -42 10 13 -125 5 -24 78 62 -133 230 104 79 -73 -118 85 -170 -81 28 3
6600 3 186 -32 21 -151 -175 -271 -224 -92 -126 226 -91 -17 50 -204 165 -130 15 -129 26 -161 23 -2 -115
6623 -115 136 127 -43 -57 186 -180 -6 -122 -190 -145 -190 76 -123 -71 -168 73 18 -126 -58 163 31 1 -33 142
6647A42j62J56Kj49k60L65k9l5Pj51J76o1j36K84q6j52J1J1R7j30M6K71k53l05
6671c41L53J55j52N8R4j22K9j36J4JkJ01j73J15j23k9J97J39j57M5J90k94j03
6694a41N0l31J68M2l3K39l7J81l03K89j37j3k39M83j80j89J85K1p8p7J2J01k25
6717b12K84M4k34r1K89J07j16M6o9K76j8k06k9L6j8j96K96k27j90J62PJ4K18j00
6741G3l30K87J53l37J0o5K73P7k15O2o3J70J54j34j91j03K50j1J94k56J01J86
6763B85k01o7K22o8j40M9k03LN8N7n38M82Q9m7j9K0j79M97j25k2l22J30k4J25
6787F2mj5k03J70j9j99J05K07M1l54M12j99K01k39J27j04l7J7j5K7J2n7j63P8
6811a49J04J1N1j23Q3Ok38L17k99J63O6j6KM6J18j77J9J11r0M4j63r3L81m49J74
$$ plain form
6647 142 -20 136 138 -11 -271 94 65 30 37 -114 62 1 -135 149 63 -89 -78 -67 30 -100 -54 217 -36 -341
6671 -341 12 167 15 73 167 45 74 -62 -48 -47 -49 52 -121 -6 -129 -158 39 178 21 66 256 -38 -141
6694 -141 -91 -422 -254 -212 -245 -6 -43 138 -165 124 -13 -26 -265 218 38 -151 34 55 -23 -100 -88 13 -212
6717 -212 72 116 -118 -209 80 187 71 117 48 324 306 100 71 107 89 -107 189 -38 -228 -66 -59 -45 173 73
6741 73 -257 30 183 -154 -144 -209 64 141 -74 -12 -75 95 249 115 -76 -179 71 60 254 -2 99 285
6763 285 84 17 239 171 31 80 -123 -120 -62 -5 -543 -61 28 -19 -38 -18 -197 300 175 153 -169 -39 -63 62
6787 62 58 43 -160 10 -9 -208 -103 104 145 -209 203 4 205 -34 93 -11 -48 -31 -46 -19 -7 -64 -227 -149
6811 -149 -45 -34 17 -106 -23 -17 -255 62 -237 -74 -8 -24 -22 24 142 -35 -16 95 5 49 -114 -207 174 -275 -101
6836a01K63k61J49J73r3j95q9k5J19j82M34j04L6J42k61j06K8j1k42M52Qj77R2
6859D9k1j19K56j16n8K69n27L85j3k82K71l15K29O8K09n71L89j83j9K51k54L14
6881B12j44k43P9rR5K0n5K6K74m30J49Q8M8K2l1j38j30L9j38L78k34J16k98L16
6905A2K03m80M74j14j29j2q6N8L0K30n2J45l71K1J21k60K05l17L51M8j18n0O9
6928b2J30N4j80J47j38j04K55L6k41J12Rj22J51j44m9J15J04j73o0N7oKK0L9n1
6953e9Q5m5J74k37j14K66k5L9M9k99l6L68m77K11L55k38J57l60J37J45m8k61M15
6976B02l37L50k63M97n03J3O9k23J67N11k37l54j57J82j42K10l5m6K09j73J8K33
6998A91k14J28l17Q7J40J60l25K98j72l8J25j07M0l43J13P3J13J51nj77K10K3
$$ plain form
6836 -101 162 -99 50 223 130 -65 -154 -179 -60 -242 192 88 124 266 5 -101 -73 -84 -326 126 134 -43 49
6859 49 28 -91 165 49 -9 260 -267 118 105 -177 94 -221 8 76 285 -286 103 -80 -99 152 -102 212
6881 212 68 -175 -96 -105 -10 10 -45 -19 255 -175 -26 62 110 132 101 -37 -167 -128 -266 112 -122 -6 -304 12
6905 12 215 -265 209 95 -34 -46 -132 -74 -44 186 134 279 -92 -71 50 -210 -5 -322 29 77 -41 -91 -22
6928 -22 108 162 -18 129 -9 -113 142 178 -63 49 58 -64 87 -57 -106 9 113 -60 -120 -63 -69 -67 -47 -8 -59
6953 -59 26 -19 155 -82 -196 70 45 84 133 -166 -202 166 -311 -100 255 17 174 -186 -49 96 48 -213 202
6976 202 -135 215 -48 449 -54 -41 28 -195 -28 483 246 -108 -265 -83 -225 -15 -50 -96 113 -60 -42 191
6998 191 -23 105 -212 -125 15 175 -150 148 -24 -62 63 -44 -4 -347 -234 -161 -48 103 98 -79 131 154
7020A54j53O6k00J25k42L86l22L1%M81l74j1j17K33k5r6k7l8K18qJ07j28K0KP9
7045A61l17RJ63j31J79k06L61l49K38l94N74k73j27J17Q8j94K11Lk62K82j31j21
7067a19L6n1l2J63J20n7j53qK05j3j57J55n2l4l36L51l22M12k26j9J66J01j98
7090f8J88j43j6j7K39k45j42L71l10K25q8J37j36j19K84r7J05k02L9L7Or7J77
7113A28k06K06j29j69PL25j37m5p7j2m9K1K27j62J21R3n6j45%J59j8p0n6qN9J20
7139A27j68k10L57j44K67l66M9JJ66j97O0j56M90l65j21L42j57j34j04M6M55l51
7161a13R0K8j49L0j7m9M88k93o0K1j8j15K83j40Qk94r3N20k57j20L16M4j70j5
7185g5L20j50j20L4j10M3o4M5M3j43M23k64K9R2k10M64l36q0r9J00K55J16m09
$$ plain form
7020 154 1 67 -133 -8 -250 136 -186 -155 -155 326 -48 -59 -176 57 32 -64 -91 -129 89 81 188 60 80 82 161
7045 161 -156 -147 16 -115 64 -142 219 -130 108 -286 288 15 -112 5 93 -101 110 113 -149 133 2 -119
7067 -119 -83 -134 -166 -3 117 60 -93 -101 104 91 -66 89 37 3 -333 18 -304 108 -118 -137 29 130 -68
7090 -68 120 -23 -39 -56 183 -62 -204 167 -143 82 -6 131 -5 -124 160 63 168 -34 5 42 48 -49 128
7113 128 -78 128 -1 -170 -163 162 25 -20 -97 -109 -158 -137 90 -72 49 142 86 -59 -59 100 82 12 -44 -52 7 127
7139 127 -41 -251 106 -38 229 -137 -88 -87 79 -118 -58 -214 276 -89 -210 132 -25 -159 -263 -217 238 -113
7161 -113 -23 5 -144 -114 -131 -180 308 15 -45 -24 -42 -157 126 -14 -6 -300 -393 127 -130 -250 66 110 -60 -75
7185 -75 245 95 -25 9 -101 -58 -122 -77 -34 -177 246 -18 11 103 -107 357 21 -59 -158 -58 197 313 -96
7208i6L3L07m19J54J31n86K42K8K64qj17N6P7l67J09J33J70n6k29L95k55j4R2
7231D4K73l34O6k10K48j85O3J20j76k0K4J86j96r1J8K40j93J42O2j00J64j86J53
7254A12N1j53J2j2k9k8K05k2j56r5rj1J00K98k22J26L6j55j86J09J4K8nj5R2k32
7280a47j31K27Q7l17P3K43l9m0K11j59J50j86M5J49j88n6j14j42M01m0J13j48
7302hj75Q7K84k19J55j41m0K6K0K09k06p1L0j33J44j30J07R2j33j2r6J40J28p0
7326a2K15l37K8J20m4l7jj36K62R5N4j95kJ91j73J57j71k90L45q2L89l85L00l13
7350b2J1j39O7o7q5L39j07J98l55K24r1Nj47J49J57j81l0J40j68R8r3j13J13J74
7374G7K0p3j0j42k2P4k9R9J46j51J41r8n7o2K51k10J70q2r2n5L35j93k89J19J98
$$ plain form
7208 -96 -63 244 -175 -21 110 -476 -234 -206 58 50 -67 -11 66 -301 -192 -59 111 55 -174 221 -34 -48 44
7231 44 317 -17 49 -161 87 -98 -35 85 -91 -111 -87 99 -97 -188 -170 70 -123 19 81 -19 145 -41 112
7254 112 163 10 22 10 -19 -47 158 136 -20 -115 -124 -135 -35 263 41 167 203 48 -138 -29 -15 13 8 -7 85 -147
7280 -147 -278 -51 36 -281 -208 35 -4 -44 167 8 158 -28 17 166 -22 -78 -192 -334 67 27 140 -8
7302 -8 -183 -96 188 -31 124 -17 -57 -31 -11 198 -8 -79 -49 -182 -38 -168 -61 31 -102 -114 -210 -70 58 -12
7326 -12 203 -134 -106 14 -30 -67 -68 -204 58 153 207 12 10 201 28 185 14 -276 69 -13 376 -9 291 -22
7350 -22 -11 -150 -83 -150 -235 104 -3 195 -160 64 -27 -22 -169 -20 137 -44 -74 66 -102 -4 -97 -210 -97 77
7374 77 97 24 14 -128 -150 -76 -105 -6 140 -11 130 32 -25 -87 164 -46 124 42 -50 -105 230 37 -252 -133 65
7399F5J53k62j10L97l65K18j99j0r4J52M6J46j06L1J9j46j5R8j42J60R9r0q4J00
7423F1m4l1O4J47k50k72M97l73Mp6J96k71J76L41j19l63J26R2J55j27J26j57J45
7446D7j78K06k78n6M69l27j91K47J86l12q7L89o8%K16l06O8J85j93J36k22k42
7468c11K24J97J10j34k8l9j64J69j06J09J01k50k4K64j46m4Kj6K2J02p2o5m6J34
7492a1J6n3P4l60M38j94R6j9k9J56k03J57J81n65M13m58K68J77j32j4J19j17j24
7515a84k6L71k75K6N6L0J23j18K1m9N5N0r4Lm5r4M9J64k87r5N11k95j29K14rL2
7541Ek00K87k51K10j35k74L98m3J80k28p1J47j59L03k09NM0K4j39K00k07o4M50
7564B69j15m3K4j92J29k65M6l7K08M9N1R9k35r1N8R7K12j96r3k3p4k3J71j12p6
$$ plain form
7399 65 218 -44 -154 243 -122 96 -103 -113 -207 -55 -9 137 31 62 81 -65 -80 18 -124 36 135 45 -39 61
7423 61 17 -14 50 197 -53 -325 172 -201 -197 -273 -77 -348 -172 169 50 -313 -187 -95 60 -67 59 -98 47
7446 47 -131 75 -203 -259 210 -117 -308 -61 125 -187 -274 115 47 47 263 -43 25 210 17 153 -69 -311
7468 -311 -87 110 220 86 58 19 -145 24 -82 27 128 -122 -146 118 -28 -72 -70 -86 -64 38 -34 -99 -145 -11
7492 -11 5 -48 26 -334 104 -90 6 -13 -42 114 -89 68 249 -316 97 -361 -93 84 -48 -62 57 -60 -184
7515 -184 -210 161 -114 -88 -32 -2 121 3 24 -25 30 80 -14 -11 -56 -150 -101 63 -224 -319 192 -103 -232 -18 -27 5
7541 5 -195 92 -159 51 -84 -358 40 -3 177 -51 -122 25 -134 169 -40 -35 5 29 -110 90 -117 -181 269
7564 269 154 111 135 -57 72 -193 -147 -184 24 73 124 223 -12 -103 -45 52 264 68 -25 -48 -122 -145 26 -86 -162
7589a62o2J81M1l09L74j35J20oj90J09k9Pr4K53o8o4R7j29M0j5J33J44j50j37
7613e1o3J65J66j36K07l91j76J05k2K45j11J4n4J03K4pQ2Q6k76R9j23l9L56m24
7637b21K95n3J55%j87k22J69R7j1j38L1j21J19N0J67lJ9m5j49P8Q3j91j8R0j48
7662a54K33k50O9P4j80L27Q2j39N3R3n4k18k48L99n1L0j12J21Nj00L4o9K3J47
7686A15k50J42j7l9q2K23k70R0l3P2KP3J86q6m0j1m2N4p1m2L03m96J04L5o5M5
7712a00O3ol0K78M1l31M89n98K22Q5k54J72k56K24j49M25l21j73O1K66k04j09
7734b05M44k96M5j13j07K57Q7k48q6J30K51k07mj59J94k47J18K64l31L49K30l76
7756a0r6q3J52R1J26k82L6J37j4j62L9J11l3q2K34Q4k24P1j10J97j97J38j52J31
$$ plain form
7589 -162 -224 -43 -2 -311 63 -72 48 42 -148 -39 -68 -61 -155 98 30 -34 63 -66 -26 -41 92 236 86 -51
7613 -51 -114 51 217 81 288 -103 -279 -174 -196 49 -62 -48 -102 1 25 18 100 186 -90 9 -114 -153 203 -221
7637 -221 74 21 176 176 -11 -233 -64 33 22 -116 -85 -206 -87 -37 130 127 146 101 -48 30 113 -78 -96 -6 -154
7662 -154 79 -171 -102 -28 -208 119 201 62 115 208 154 -64 -312 87 36 66 -46 75 80 -20 14 -55 -32 115
7686 115 -135 7 -10 -49 -131 92 -178 -88 -121 -49 -47 26 212 126 86 75 33 87 16 -26 277 -219 -115 -80 -145 -100
7712 -100 -37 -43 -73 205 246 -85 404 -194 28 113 -141 31 -225 -1 -150 275 -46 -219 -158 108 -96 -205
7734 -205 239 -57 -12 -125 -232 25 112 -136 -222 -92 159 -48 -52 -211 -17 -264 -146 118 -213 136 366 -10
7756 -10 -106 -189 -37 54 180 -102 -66 71 57 -105 -66 45 12 -70 164 248 24 95 -15 182 -15 123 -29 102
7780A02K5k55K41k92n4K37MJ18j50j56K05j73J62OK98l63q4K08k76J85j32K36
7802I2j54J65J6r1k08M14l99L7n1K53L1j03J20j92L7j2J5Q5k51K54J01l39k1J98
7826cJ02j06m43K79K28j37J78J14j18j09M8r4j45M04p9k08O0N8Q2q1j3j28J26
7849A5k73K43j19L05k14m3J95O6j73O4L4L3k87L93k50L18k75q9N1k07L00Qj23
7872b8K1R9j03oo9M2R1j30K1J47J12k82pM9K00j99J53j61j97M00j34k42L90j79
7896a2k16M92m28J41J86j87L3M3j6j96J74J23Q8m45J79o8L51j77j83J03q7O4j25
7919a63J13n0j58J25O3oJj66J1K28nJ77m94q7M34R5m65N47l29K94oj23r6P1K36
7944B47k10k74J65J53Np3N0K00m18J57nkQ6l3J49l03K04k1J86m36P3J99l70L57
$$ plain form
7780 102 127 -128 113 -179 -233 4 8 126 -24 -180 25 -148 14 20 318 -45 -129 79 -197 -12 -144 92
7802 92 -62 103 119 28 -180 234 -165 -128 -179 74 105 2 122 -70 -33 -45 -30 55 -196 58 159 -180 -201 -3
7826 -3 99 -7 -450 -171 57 -80 98 212 94 -15 33 -61 -206 198 119 -89 -29 29 111 30 17 -111 15
7849 15 -258 -15 -134 171 -43 -86 109 175 2 66 100 133 -154 239 -11 307 32 -57 -6 -213 87 95 -28
7872 -28 -7 92 -11 -17 -86 -44 47 -83 -62 85 197 -85 -92 -43 157 -42 111 -50 -247 153 19 -223 167 -12
7896 -12 -228 264 -164 -23 163 -24 9 52 36 -160 14 137 225 -220 -41 -109 242 65 -118 -15 -102 -38 -163
7919 -163 -50 -100 -258 -133 -70 -76 -75 -241 -230 -2 -7 170 -324 -411 23 118 -347 200 -129 165 159 36 -60 11 247
7944 247 37 -237 -72 81 86 13 63 263 -155 2 -3 -5 81 48 197 -106 98 77 263 -173 -100 99 -271 86
7968H6l8J5k50J83l4K92l48M7P9l2J81k38PP2n7j7k8J74L4k43L56p5j83J12j75
7993h0J16n2m1n8K32pJ3k47J31J93k98K15Jk93K25P5j93q5J01O4J27k21k4Q3J17
8018I4q4J18k76K49n8l84N31m36K99o1J69O4m16K86k37J32k80L51J8Q1j21n1L9
8041B7R6M7j27K20j91J95j74k64J54j97K17M10k89j84r7jM8J47k47K6J65P9j77
8064a17J01K00n23M13j88J64j09j42M7J83j2oj03J16jk6oJ48k44q5K03j83L24
8087A54p0J0m25K59jP5r4n2K49J52k77N2J12k17K40o5q7j92Q1J99l07k3K88k11
8111a50J26J05j9J1j50l5K54o6r6k14K63j63P8J94O2j93J%r7k7Q9J0J03q8K53
8136B51l73J58L34m56J18j15Nj61K88q1l3J14j5j2j20KJ25l05K71j33M3J72j45
$$ plain form
7968 86 48 63 -187 -4 -38 254 -94 -47 32 0 181 -57 -50 22 -35 -52 -80 94 128 -115 241 166 -17 95 -80
7993 -80 36 -16 -57 -115 117 110 123 -124 7 200 -98 117 118 -175 50 125 -68 -153 -52 12 139 -82 -106 -23 94
8018 94 10 128 -148 101 43 -341 190 -246 53 -8 161 225 -191 95 -142 -10 -290 61 79 160 39 -12 27
8041 27 123 170 43 263 72 267 93 -171 -17 -214 3 413 124 -60 -157 -158 -110 37 -210 -184 -19 60 -117
8064 -117 -16 184 -339 74 -114 50 -59 -201 -154 29 17 11 -92 24 23 -3 -9 139 -105 -190 13 -170 154
8087 154 84 94 -331 -72 -73 2 -92 -144 105 257 -20 32 144 -73 167 102 15 -177 -96 103 -204 -227 61 -150
8111 -150 -24 81 62 73 -77 -112 142 76 -20 -234 29 -134 -56 138 200 7 8 8 -89 -116 -27 -17 86 -2 251
8136 251 -122 36 370 -86 32 -83 -78 -239 49 -32 -65 49 34 22 -98 -96 29 -276 -5 -138 -95 77 -68
8159f8r7K15j09k1K96j53k37K65j44l5K99l03KR4r6j17K94j32K95j83l0k57J89
8182c3k09K06k44K11j37%J35M4J2
$$ plain form
8159 -68 -165 50 -59 -80 216 63 -174 91 -53 -88 211 -92 -90 4 -92 -209 85 -47 248 65 35 -222 -33
8182 -33 -242 -36 -280 -69 -206 -206 -71 -27 -15
8191a5
$$ Imaginary data points
##PAGE= N=2
##DATA TABLE= (X++(I..I)), XYDATA
0@%%%%%%%%%%qJ6j6J7k5M0m8N6p2Q8j04J23j47J74k04K40k82L26l75M32m97N68
32C02o46P35q33R40j057J186j330J487j656J842k046K270k515K780l071L390l736
49a958M114m533M995n503O068o698P402q198R106j0148J1363j2806J4543j6678
63h931J9384k2950K7882l5190M7268p1780K05390n18236k05065R44565R3173p16623
75b41113j94191N99311J60853l61874j90769J71054J61200N7534j72160k16317
85b26472J30104L78508j16337m81358R5803N50893j13101n42424J18000N04897
95B98513j41690m26795J64927L27822j99040j98074K10799P9664k19188K1710
105h1352K25579r9249k29673J58741K10486j80596j73569J66262J26581j26692
$$ plain form
0 0 0 0 0 0 0 0 0 0 0 0 -8 8 -8 9 -16 24 -24 32 -40 48 -56 67 -80 94 -110 130 -152 174 -201 231 -266 302
32 302 -344 391 -442 498 -559 627 -703 784 -872 970 -1076 1194 -1321 1459 -1612 1778 -1958
49 -1958 2156 -2377 2618 -2885 3183 -3515 3887 -4311 4795 -5353 6010 -6796 7747 -8931
63 -8931 10453 -12497 15385 -19805 27463 -44317 161073 -357163 -562228 382337 475510 -241113
75 -241113 -435304 164007 324860 -37014 -227783 -56729 104471 162005 -10155 -226472
85 -226472 -96368 282140 165803 -315555 -219752 331141 218040 -324384 -206384 298513
95 298513 156823 -269972 -105045 222777 23737 -174337 36462 116126 -103062 -81352
105 -81352 144227 44978 -184695 -25954 184532 3936 -169633 -3371 123210 -3482
115c482o5454P2621j9049O842J14297j03736k00926J94757K79118k59876l52746
126c37634L02021M12346l17476m40228K95521M43243k37381m27792J62103L89160
136B43883p8301l17405j7964K24235J22415j25984k13029K6529K81364P4034l31900
147a12123j59451L63073K15677l64393k47421L34220K64981k88787k63536K35128
157b2632K36626j69673j95193R7431J49844l5876r9999j3045M3351N6421O300
168E3555r6019l6525J17960N0765j22888n6730J18546M8582j10765k1318R0329
179C5492j3472o5694M4259N0685p6147m7942J10750M6364j37851m6566J47085
190D6963N6897j42648p5131J29746R0664j02827r9822N5097J11940p14j22387
$$ plain form
115 -3482 -68936 3685 -15364 -8522 105775 2039 -198887 -4130 274988 15112 -337634
126 -337634 -35613 376733 59257 -380971 -85450 357793 120412 -307380 -145277 243883
136 243883 165582 -151823 -169787 54448 176863 50879 -162150 -135621 145743 219777 -112123
147 -112123 -271574 91499 307176 -57217 -304638 29582 294563 5776 -257760 -22632
157 -22632 213994 44321 -150872 -53441 96403 60527 -39472 -52517 -9166 47255 53555
168 53555 -42464 -78989 38971 89736 -33152 -89882 28664 77246 -33519 -54837 35492
179 35492 22020 -43674 585 51270 -24877 -72819 37931 84295 -53556 -100122 46963
190 46963 103860 -38788 -113919 15827 106491 3664 -96158 -41061 70879 70165 -52222
201e2222m8346J20016R5190j04792j39880Q6724J73743o4539j89007L2761J93044
212A02692N961j90934l6233J75925N9131j43842q0300J05879R8698o9103j05865
223g7991L2638J03613P616j01137l9040R6249N7453q0822o8907N9136P9330m1550
235B6588q1789K8398P2805j3007o1103j346N2154O300l9821n438K1323P283p575
248D772r658L204M742j943L207n22o609k943N581J3700q136k3823J0071K6978
262A8621l978l1445q090L8578J6546m1788k3022L5361L3732k9164m3928K3929
274a4648M6284j4396m3978j378M4040J4520m4347k0560L6730K6669k5962l4680
286c1706J8665L7932j2660l4360K704L1438Q184l1626j1335K8288J1982j9455
$$ plain form
201 -52222 -100568 19448 114638 9846 -130034 -43310 130433 65894 -123113 -90352 102692
212 102692 108653 -82281 -118514 57411 116542 -27300 -107600 -1721 96977 27874 -77991
223 -77991 -45353 58260 65876 -35261 -74301 21948 79401 -1421 -70328 -11192 68138 26588
235 26588 -55201 -26803 46002 32995 -28108 -29454 22700 29000 -10821 -16259 5064 12347 4772
248 4772 -4886 -1682 3060 1117 4324 3802 -2807 -5750 -169 13531 5395 -18428 -8357 18621
262 18621 14643 -16802 -24892 13686 30232 -11556 -34578 783 34515 5351 -38577 -14648
274 -14648 31636 17240 -26738 -28116 15924 30444 -13903 -34463 2267 28936 2974 -31706
286 -31706 -13041 24891 12231 -22129 -19425 12013 20197 -11429 -22764 5524 17506 -1949
298a949j5063J2639J9287j0630j7102O855J3595O22j3945l649J5434J974j0551
311b483j951N059N701m051o189N183K959j878j509j674M237o63l140L553j463
326A691j652L099r98n0j135j109M597k104k652J716Q7K516l650k821O139p44l837
343i07R49K45K426k108l123L906J34k396l40N9L667k914m053N209O04k960o90
360b292l26M587j656n447L400K805j059l534j517O934q12o374K043L248J005l317
376b312l799O267K848o439j574L761N036l888p655O875N764m664m818J86P994
391C582J631j0334l20Q380K383n474o652O539Q146n979o104J335P041L487j0061
406b400k995Q356L271l256o997J098R025N1o415m089L840J0004m616j0886K993
$$ plain form
298 -1949 -17012 -4373 14914 4284 -12818 -5963 7632 8254 -5691 -9340 6094 8068 -2483
311 -2483 -4434 625 6326 2275 -3914 1269 4228 2350 841 -833 3404 2741 -399 3154 1691
326 1691 39 3138 2140 2090 955 -154 4443 2339 -313 1403 1490 4006 356 -2465 3674 2930 -907
343 -907 42 287 2713 605 -2518 1388 1522 -874 -1214 -1155 2512 -402 -4455 754 1358 -1602 -2292
360 -2292 -2618 1969 313 -5134 -1734 1071 12 -3522 -5039 1895 1083 -5291 -3248 0 1005 -2312
376 -2312 -6111 156 3004 -3435 -5009 -1248 3788 -100 -7755 -880 4884 220 -4598 -4412 3582
391 3582 5213 -5121 -5441 2939 5322 -152 -6804 -265 7881 1902 -4202 -2867 4174 7661 -2400
406 -2400 -5395 2961 6232 2976 -4021 -2923 6102 6153 -262 -4351 -511 9493 4877 -6009 -3016
421c016Q939L027r594q406J0804R608p277j1481M19J5338L572j6948o411J2280
435H54J2643p180k1022N063K3780j159k3228p058K3313J3760k2996j6803J7025
448c008J9203q238k4079K089K4181K816j9081j0477J2683J8691q284k1829J377
461a3956K2205P873k2719j4599K1635J5856j4708j6199N270J7027K016j3860p354
474a1513N383J4280M497k0173j1853K0098K1881j5902l3881J3371M1304q369m1612
487b2489j121L9210J3085l4803k2551K5133L0217q408l8690q665M5347K3596m3934
500d073m0536L8166N8539l1730p0620K3314P5319r939p6079m560P2697J5511o1233
513a5224k5298M1646L6589k1602m4616J990M5875J8472m2838l9799L9908N3728
$$ plain form
421 -3016 5923 8950 -644 -9050 1754 11362 4085 -7396 -6977 8361 11933 -5015 -11426 854
435 854 13497 6317 -14705 -9642 14138 12979 -10249 -17307 6006 19766 -3230 -20033 -3008
448 -3008 16195 7957 -16122 -14033 10148 12964 -6117 -16594 -3911 14780 6496 -15333 -13956
461 -13956 8249 16122 -6597 -21196 439 16295 1587 -14612 -9342 7685 9701 -4159 -11513
474 -11513 -6130 8150 12647 -7526 -19379 719 22600 6698 -27183 -13812 27492 19123 -22489
487 -22489 -23610 15600 28685 -6118 -28669 -3536 26681 18273 -20417 -29082 16265 39861 -4073
500 -4073 -44609 -6443 52096 20366 -50254 -26940 48379 38440 -37639 -42199 30498 46009 -15224
513 -15224 -40522 1124 37713 16111 -28505 -26515 19360 37832 -5006 -44805 -4897 48831
525D8831l3994o0821K3337O4030j2938o3442O438N4380k942l7316j883J9013K730
538E423r11J194j8154p887L5915J1996m6163j7124M7975K4861m5468l0220L7860
551g03K9594k2448k5074P07J9509K0923q588m0883r280O1446K8271p9372m3753
564f9651Q8704N8496q8571p2435Q2300Q2011o9198q3128M7307P8909j8801p1032
576c5089q814N7088L4482l4922o0185J0956Q4147J1068r9651l2128J06435N2630
588H6017j07916o6384J02723P1127q7582o9483O5295O4593m3011n3309K0945L5459
600A8474K364j5956k3714j706L8601J8313m6688l4119N1507M2459n2097m1342
612d3904M5609L3123l4650k1290K3627L656j4062J9151L793m2983N542O1058p508
$$ plain form
525 48831 14837 -45984 -22647 41383 28445 -34997 -28559 25821 22879 -14437 -16320 2693 5423
538 5423 4512 5706 -12448 -20335 15580 27576 -18587 -35711 12264 37125 -8343 -38563 -703
551 -703 28891 6443 -18631 -17924 1585 22508 13920 -26963 -36243 25203 53474 -25898 -69651
564 -69651 19053 77549 -11022 -83457 -1157 80854 11656 -71472 -24165 54744 35943 -35089
576 -35089 -43903 13185 47667 12745 -47440 -36484 47663 58731 -40920 -73048 33387 86017
588 86017 -21899 -88283 14440 85567 -2015 -71498 -6203 58390 15379 -37930 -16985 18474
600 18474 20838 4882 -18832 -20538 18063 36376 -10312 -44431 7076 49535 -2562 -43904
612 -43904 1705 34828 178 -21112 2515 6171 -7891 11260 15053 -27930 -22388 38670 31162
625C1162p6833L446Q9000J770r2545q684Q4764J9683p0067l1480M9651M0002k2800
638A7069m5430j0717N0883M3301n3221p1070M7880R5469l7439j15191K6091J24632
650G2257j2007j23087m857J14318K1872r9636l4589P7023M4247m7554n1878J6695
662b7196N6521J1377n4293l7368M8847N9544m2575p2971L5283P6619k4209p4393
674d4814J3371O8409o262n5023K001L6489J322j8181j767L009k971J1313R575
687A6471k3152j4046K8507J6974k5827k1465J9311K3770j0275k1377l186J5254
699I59J9857q745l3680j198M3047J5331n0543l0816N4975M3064n3014n3608M4104
712a0267O3668l2938o9521J8544O8941l22o3915k0276N6679L7677m6214n0644
$$ plain form
625 31162 -45671 -42225 46775 48545 -44000 -52684 32080 51763 -18304 -49784 -133 39869 17069
638 17069 -28361 -39078 11805 55106 1885 -69185 -21305 74164 36725 -78466 -52375 72257
650 72257 60250 -62837 -67694 46624 68496 -31140 -65729 11294 55541 7987 -43891 -27196
662 -27196 29325 40702 -13591 -50959 -2112 57432 14857 -58114 -22831 53788 29579 -44814
674 -44814 -31443 36966 30704 -24319 -22318 14171 15493 -2688 -4455 -1446 -4417 6896 16471
687 16471 -6681 -20727 7780 24754 -1073 -22538 -3227 20543 10268 -11109 -14295 959
699 959 20816 12071 -21609 -22807 20240 35571 -14972 -45788 9187 52251 -763 -54371 -10267
712 -10267 53401 20463 -49058 -30514 38427 38105 -25810 -46086 10593 48270 2056 -48588
724d8588L0032O2054j3801o8883j713O9398J6573o4128l1170N6373M2458m6708
736A897m7270L2810M8538j7423m7084L815M3258O145l4933j4715K5208K2050j7446
749D850k3299R906K0456j324j6849m429J3429N377p125m389M75L631K621J52l557
764g5n925M102J1709l306j5008j065J6847Q724j9124j5078J8517K0737j3918k7227
778b0090P985L3443k614l5784m090L4381J2877l2105k1093K8659K6278k1596l0501
791b4250J1546L4418k828l5647n226L2374J4461k8268k3051K4327K7815j9213
803F458k9429J0507L1327l525l1180j027K6610O044k1474j0742J6456J4169j2814
816A380j3510O737J2729r83j2886k150J1871L295q505m921O118N997n661m607
$$ plain form
724 -48588 -18556 43498 29697 -39186 -40899 28499 45072 -19056 -50226 6147 48605 1897
736 1897 -45373 -12563 35975 18552 -28532 -24717 18541 24686 -10247 -24962 246 22296 4850
749 4850 -18449 -8543 11913 10589 -6260 -10689 2740 8117 992 -3397 -2922 709 3330 3482 -75
764 -75 -6000 -1898 9811 6505 -8503 -9568 7279 16003 -3121 -18199 318 21055 7137 -20090
778 -20090 -12105 21338 18724 -17060 -21150 13231 26108 -5997 -27090 1569 27847 6251 -24250
791 -24250 -12704 21714 18886 -16761 -21987 10387 24848 -3420 -26471 -2144 25671 6458
803 6458 -22971 -12464 18863 15338 -15842 -16869 9741 15785 -5689 -16431 25 14194 1380
816 1380 -12130 -5393 7336 6353 -6533 -8683 3188 6483 -2022 -6943 -825 5172 -489 -5096
830e096N046K102l178j023K965J026n455J364O743l021o326K102P066j68r278
845e131j46R894J232q085l759O796P335o934q411N285Q846j545j0691p38J1958
860E906J971j0609m097Q798P265q270q775P525Q055m538q176J446Q992k58q801
875c566k86O653K544n483m641N591L879m190l799K011M596q21n633J304M197p35
891A621k864j125K924J528l541n12J845Q26n76k231J380J875j917o53P90O91k33
908a72j736J053J752k044l32J172r6m7j159R83J416j893RQ85O15k32j536N75J389
927F02o48k84n94Q82J310j647q41J748L27n99j115L14K324j544m70N71J48R14
945A398j228l45J009o54M93N20j513P29M76M44n89j527J328J440j570o71j85K003
$$ plain form
830 -5096 -50 2052 -1126 -2149 816 1842 -3613 -2249 4494 1473 -4853 -2751 4315 4147 -5131
845 -5131 -5277 4617 5849 -2236 -5995 801 8136 1202 -7209 -1924 6922 5377 -5314 -6052 5906
860 5906 7877 -2732 -6829 1969 9234 964 -7811 -286 7769 3231 -4945 -3499 5493 5235 -3566
875 -3566 -3852 2801 5345 -138 -4779 812 4691 501 -3298 -1287 3309 2488 -3145 -1841 2356 1621
891 1621 -1243 -2368 556 2084 -1457 -1969 -124 702 126 -2105 -725 1150 -767 -1420 -630 61 -172
908 -172 -1908 -855 897 -1147 -1479 -307 -403 -450 -1609 -626 790 -1103 -1094 -209 406 174 -1362 -787 602
927 602 -46 -330 -924 -42 1268 -379 -1220 528 855 256 -859 -545 1779 235 -235 336 484 1398
945 1398 170 -175 834 180 673 1193 -320 409 885 1329 740 -787 541 1981 411 -260 -445 1558
963A558P87l086n51K521R73j148k990O00M616j675l687R5L533J867m426k940M690
980G37K636k563m217P41N889o61n549p14M128K894l217n146L273M924j358m600
996b803j994N985K474m789l306K352N171l69o726m12N794K305m129n089L846O220
1012D530k500n654m00N162M169n635n347L933O556p29q140k085R588L620q211
1027a143n937N912R112m754r643K394R079J427p699n668P060P741m222r093r1
1042e525J0967L519j1768n895R936Q649p181j1529N030J1827k245r541k225P130
1056A149O671n442q336P06R683M828j1414r072J1197J2006q517j5068M930J7101
1070A0422j807j6753j663J3325O617r819j0936N899J2332M93j3315q260J4733
$$ plain form
963 1558 2345 -741 -1292 1229 2202 1054 -1936 -1336 3280 1605 -2082 -1987 1546 3413 -1013 -3953 737
980 737 3373 810 -3407 -2666 3223 2562 -2987 -3701 427 3321 104 -5042 -1769 3155 1797 -2803
996 -2803 -4797 1188 3662 -1127 -4433 -2081 3090 2721 -4005 -4417 1377 3682 -447 -5536 -1690 4530
1012 4530 2030 -3624 -4024 1138 5307 -328 -5675 -1742 4814 4085 -4055 -6140 3448 7068 -1143
1027 -1143 -7080 -1168 7944 3190 -6453 -4059 5020 6447 -1252 -6920 140 7881 3659 -5434 -5525
1042 -5525 5442 8961 -2807 -8702 1234 9883 2702 -8827 -3797 8030 5785 -3756 -5981 1149
1056 1149 7820 2378 -5958 -5252 4431 9259 -2155 -11227 -30 11976 3459 -11609 -6679 10422
1070 10422 8615 -8138 -9801 3524 10141 322 -10614 -4715 7617 8110 -5205 -13465 1268
1083A268J4059j4085j8227J0785K1871o254k5034K965K4033J567k0236o988J5605
1096A329J1735j1057j2977L230J3940N400j4625j2134J3392J7754j0045k2145
1108a6203N913K5106l278k3631j98K0066M313j5083p221R433P621j715o925o415
1122h217N902J2754l116j7101j314K0867N598k2273q408K0059J0488j4835j2811
1135a2407R069J3037k453j0246o494P156J4984l225k2018k051K5858R295k8735
1148h230j5653K9489J9927k6397k3148K0219K5981j3922k5511N532K2205M442
1160A4934j7870j3987J1712K2241n313k7197l377L1419J0314l2651j5695L0076
1172D606K0399k5251k4117K0200K4046j3553k0881N274J6426K539j1193q664M968
$$ plain form
1083 1268 15327 1242 -16985 -6200 15671 9417 -15617 -12652 11381 12948 -7288 -14276 1329
1096 1329 13064 2007 -10970 -7740 6200 11600 -3025 -15159 -1767 15987 5942 -16203
1108 -16203 -10290 14816 11538 -12093 -12291 7775 12088 -2995 -10216 -783 6838 5123 -1802 -8217
1122 -8217 -2315 10439 7323 -9778 -11092 9775 15373 -6900 -15308 4751 15239 404 -12407
1135 -12407 -3338 9699 7246 -3000 -9494 -2338 12646 9421 -12597 -14648 11210 20505 -8230
1148 -8230 -23883 5606 25533 -864 -24012 -3793 22188 8266 -17245 -11713 10492 14934
1160 14934 -2936 -16923 -5211 17030 11717 -15480 -18857 12562 22876 -9775 -25470 4606
1172 4606 25005 -246 -24363 -4163 19883 6330 -14551 -9277 7149 9688 -1505 -10169 -5201
1185e201J2291K835j5440r345J7327J3156j5129j6100J1170J8053p687j6570L869
1198f771J2010R41n868n331p9P147P583p374j5769P440K2485o120k5717J787K7807
1213A4171L554k7962p840K4317J2408j7948j6989J0499K0094k450k0078p477J8749
1226C048J7117j6259k5560J2647L0810o717l4030l04L6079N718l4222j0788K8380
1239E919J6011k2229j8941J4826J9547o224j8693k641J6683J0117j3593j5276
1251a4494Q051J9762l172k2493p64K2472L786j9414o718J5186Q406j1244p176
1264g812N843M964k59k684l997l12N878N430p497j0096Q210J2726o555j3859L032
1279f988J4738L66j3652l360R965P531m965j1911J57J4449N243j4381j2368J4448
$$ plain form
1185 -5201 7090 9925 -5515 -14860 2467 15623 494 -15606 -4436 13617 5930 -10640 -6771
1198 -6771 5239 6180 312 -5019 -5098 2049 9632 2258 -13511 -6071 16414 10294 -15423 -13636 14171
1213 14171 17725 -10237 -18077 6240 18648 700 -16289 -5790 14304 11854 -8224 -15701 3048
1226 3048 20165 3906 -21654 -9007 21803 15086 -18944 -19248 16831 22549 -11673 -22461 5919
1239 5919 21930 -299 -19240 -4414 15133 8909 -9784 -12425 4258 14375 782 -14494
1251 -14494 -6443 13319 10147 -12346 -13110 9362 13148 -6266 -12984 2202 10608 -636 -7812
1264 -7812 -1969 2995 2736 52 -3945 -4257 1621 7051 -446 -10542 -2332 10394 3839 -10020 -6988
1279 -6988 7750 8116 -5536 -8896 1069 8600 3635 -8276 -8119 6330 11573 -2808 -15176 -728
1293g28J8004j3021k1441R451K4164m627k5934O59K5044L643k1388q315J6421
1306A932J2663j1545j4823N292J5713J735j6163p581J5761J1612j3479j4882R839
1319c926J7999o882j9110M807J6998j417j4723j802J2009L038q395k878L222L892
1333B832L41l929k777K597M479q41o170k14O199M33m320j634K222K694j220r92
1349c00j607n70M447J949o730l563P669N638p571q415Q067R344o788r807L949
1364d288J0756j331j0856q76R361L748p227o714N113R165k890r847m19J0912L572
1379H179j1762n151J1169O263r028p520O818Q881n578q260L013P613k63p067j525
1394d218N881K941m346l352J755N223j322n157Q34M075P03m056j212L491J147
$$ plain form
1293 -728 17276 4255 -17186 -7735 16429 11802 -14132 -13473 11571 15214 -6174 -14489 1932
1306 1932 14595 3050 -11773 -6481 9232 10967 -5196 -12777 2984 14596 1117 -13765 -3926
1319 -3926 14073 7191 -11919 -7112 9886 8469 -6254 -8056 3953 6991 -1404 -4282 -1060 2832
1333 2832 3173 -756 -3533 -936 3543 2702 -3468 -3682 2517 2950 -1370 -3004 -782 1912 692 -300
1349 -300 -1907 -2477 1970 3919 -2811 -6374 1295 6933 -638 -9053 -986 8358 1570 -8237 -4288
1364 -4288 6468 5137 -5719 -6595 2766 6514 -713 -7427 -2314 6851 3961 -5886 -6305 4607 8179
1379 8179 -3583 -8734 2435 8698 -330 -7850 -1032 7849 2271 -5989 -2976 4637 4374 -2693 -4218
1394 -4218 1663 4604 258 -3094 -1339 3884 2562 -2595 -1761 2314 3017 -1039 -2251 1240 2387
1409B387k608o35J251O00q79m59R73k88j066J431J40p38j158Q09K015j444j840
1426a509J168J772m50j955r95K653J091k540j376J999K450j890l407J660L311
1441A982r24k998l71L248J227l790r28K706J594k025k225J429K891j404k061k12
1457a861K777P27l093m15K533Q03j497j490R61K170j423j302O69J044L35j502
1473e64k39J516J19r08k05K14J218p29o20M44K11M6j91l63M11Kr8M44j107L27
1493g2O43L22m76q92N63J083p70o31J32L87Q69j444k6P40k0pr33N0J398n21j317
1514i22K18R13O72j125r33J162N16n58k24l29P67L49r50j14k17Q51L41j086o5
1533g34L32P64l01j072R1J315qj020m00L02J673n30j780K29J876O59j936j667
$$ plain form
1409 2387 -221 -856 395 995 116 -343 630 342 -724 707 847 109 -1049 -240 1775 331 -1509
1426 -1509 -341 1431 981 -974 -1969 684 1775 -765 -2141 -142 2308 418 -2989 -1329 1982
1441 1982 1058 -1940 -2311 937 2164 -1626 -2554 152 1746 -279 -2504 -1075 1816 412 -1649 -1861
1457 -1861 916 1643 -1450 -1865 668 1471 -26 -1516 -555 1615 192 -1110 -441 603 938 -564
1473 -564 -803 713 832 -76 -281 -67 1151 422 -198 246 457 503 312 -51 360 362 264 708 -399 -72
1493 -72 571 893 417 -475 88 1171 401 -230 -98 289 1158 -286 -312 428 408 401 -532 -482 916 395 -922
1514 -922 -704 209 881 -244 -1177 -15 501 -57 -281 -610 157 506 -444 -558 -775 76 417 -669 -734
1533 -734 -402 362 61 -1011 -920 395 387 -633 -1033 -731 942 412 -1368 -1139 737 1396 -540 -2207
1551b207K392J669j769j863N32L228l10l392Q1K313J458k272k465K212K837j076
1567A368k900m43L651J312l997j125K945J798j419l202J128L117n59k346j277
1582a949K264K462k132k818J499K712N02l703j287L485J759k316k716P73L320
1597A855l2k880q99J629L038j320m280O18M543P93m153k830M143L707l671m092
1613c831J935M739m62m759r32M149K252k431m604J159N941J02o055k154O212M010
1629E271n943n018M669N732k848n775P49N854Q86m676k839K597N144j175n933
1644c305j212O700L146n757n941N943O544m287o978K272P156m21o708r27M656
1659H81L081k102n430K97O082K209n716n191N485P747n145q990L980R121j604
$$ plain form
1551 -2207 185 1854 85 -1778 -1246 1982 1672 -1720 -1639 674 2132 -140 -2605 -393 2444 1368
1567 1368 -1532 -1975 1676 2988 -1009 -2134 811 2609 1190 -2012 -884 2233 1674 -672 -1949
1582 -1949 315 2777 645 -2173 -674 2038 2540 -1163 -2450 1035 2794 478 -2238 -1465 1855
1597 1855 1823 -1057 -1956 -327 2711 1391 -2889 -2271 2272 3065 -1088 -3918 225 3932 261 -3831
1613 -3831 -1896 2843 2381 -2378 -3310 839 3091 660 -3944 -2785 3156 3258 -2797 -4951 1261 5271
1629 5271 -672 -5690 -1021 4711 1863 -3912 -3163 2691 3577 -1099 -3938 -1341 3803 2628 -3305
1644 -3305 -4517 2183 5329 -428 -6369 -426 6118 1831 -5147 -2875 4281 3860 -2848 -3775 881
1659 881 3962 1860 -3570 -3273 2809 5018 -698 -5889 -404 7343 2198 -6792 -2812 6309 4705
1674D705r097m45Q221J824n683l743K601N120L31o097k748N502O070m897q866
1689g202M322R795k307j0801O98J0256J398r154k814O584L513k690m775k56M704
1704A271L168l515o842K501R317j351j0597j48J0445K704j0157m285Q446N004
1718E961n484n359J782N591J214m333m681K093Q576k22j1034j375J1798L963j1743
1733c253o039J0748P885r163q102N671Q487k421p634j057O337L881l432p504J111
1748d485R899J420j1143m016J1704O449j0916q622R917Q467o975q263L871P644
1762D951j162o175j286L448M200o48n903k441O899N058p035p487O747Q484n613
1777B037q551L357Q011j401o601n12M349J988q71l876k012M697N136m483q353
$$ plain form
1674 4705 -4392 -4837 3384 5208 -475 -4218 -1617 3503 3834 -2263 -5011 491 6561 1664 -7202
1689 -7202 -2880 6915 4608 -6193 -5495 4761 6159 -2995 -5809 775 4288 1598 -3177 -3433 1271
1704 1271 4439 924 -5918 -3417 5900 4549 -6048 -6196 4249 6953 -3204 -7489 957 5961
1718 5961 477 -4882 -3100 2491 3705 -628 -5309 -3216 5360 5138 -5896 -7271 4527 8490 -3253
1733 -3253 -9292 1456 9341 178 -7924 -2253 6234 3813 -3821 -4878 1459 5340 1908 -5596 -4485
1748 -4485 5414 6834 -4309 -8325 3379 9828 -1088 -9710 207 8674 1699 -6564 -2693 4951
1762 4951 3789 -2386 -3672 -224 3976 3328 -2575 -5016 1883 6941 -94 -7581 -834 7650 2037
1777 2037 -6514 -3157 4854 3453 -3148 -3660 689 2677 1806 -2070 -4082 615 5751 1268 -7085
1792g085L636J0527k799j1209J006J1278P22j0301k798Q608M124m990n619J393
1806c507O713K135o759n724N981Q485m289j1241L237J2463j526j2403j145J2498
1820D918K615j0928l693Q239M857m813n599J472N740J379m941l974L304O752k140
1835C188q246P95Q825P14q741j620P669K014n552k582L717K335j173j832o80J25
1851a044L412K23m117j917M905L138m757m662M768M854l699m449J184M362Q32
1866C033l899k333K551L147K82n418j599O050L548o324n448O010P051n515p950
1881f814M613P369k004p228j14O557J702n295k951L264M507j283n743m50N847
1896A977K514n639m192N148N340m684n370L369N210j865m897P87M086r6k481j112
$$ plain form
1792 -7085 -3449 7078 4279 -6930 -5924 5354 6076 -4225 -7023 1585 5709 719 -4900 -3507
1806 -3507 3206 5341 -1418 -7142 -1161 7324 3035 -8206 -4969 7494 5968 -6435 -7580 4918
1820 4918 7533 -3395 -7088 1151 6008 1195 -4404 -2932 2808 4187 -754 -4728 -1424 5328 3188
1835 3188 -5058 -4263 4562 5276 -3465 -5085 2584 4598 -954 -3536 181 2516 1343 -489 -1169 -1044
1851 -1044 2368 2591 -1526 -3443 1462 4600 -157 -4819 -51 4803 1104 -3345 -2161 2201 3033
1866 3033 -866 -3199 -648 2499 2781 -2637 -4236 1814 5362 -962 -6410 -400 6651 1136 -6814
1881 -6814 -2201 5168 3164 -4064 -4178 2379 4081 -1214 -4165 -901 3606 2323 -3420 -3870 1977
1896 1977 4491 -1148 -5340 -192 5148 464 -4906 -1537 3673 1808 -3089 -2302 1784 1688 -793 -1905
1912a905J792J645p31j411r56J729J893j857k190J459K247q03j819j31J727J71
1928H60q66n0m02N16J342p15k076N05K538M31l330o67L180J234k863k025K329
1945e9K945k202k691J103K555N30k935j385K709K169k386k767J128L852j196l613
1961b243J44L669N83l024j825L220J837k482j904J282K633p83k816N07J954L47
1977A099j226j748J723J603j713j017O68J554j94j793K90J314k49m35n66O52L94
1994C56l99l37M37m16L17J37l68K63m16P27L6l72k06L3O58j02q05L52P13j73o14
2015a79m35J086N39j390l91J275M13n60j061N59J264n60j075j31J218P41j656
2032c43n70J125Q54p34r99L11J383m47j172J09J281K1r61l42O39L01k64o55K0
$$ plain form
1912 -1905 -113 1532 801 -610 -1566 163 2056 199 -1991 -532 1715 912 -907 -1038 689 860
1928 860 -6 -56 -458 58 1400 685 -1391 -886 1652 2083 -1247 -1914 1266 2500 -363 -2388 -59
1945 -59 2886 684 -2007 -904 1651 2181 -754 -2139 570 2739 353 -2414 -1286 2566 1370 -2243
1961 -2243 -2099 1570 2153 -871 -2696 524 2361 -121 -2025 -743 1890 1107 -1709 -1202 752 1099
1977 1099 -127 -1875 -152 1451 -262 -1279 -611 943 749 -1044 -754 560 311 -124 -690 -38 356
1994 356 -43 -380 57 -359 -42 95 -273 -10 -426 301 337 -35 -241 -208 450 348 -457 -105 608 435 -179
2015 -179 -614 472 1011 -379 -770 505 918 358 -703 -144 1120 560 -515 -646 572 1313 -343
2032 -343 -913 212 1066 332 -667 -356 1027 580 -592 -483 798 819 -142 -484 155 456 192 -463 -443
2051d43J066m30q07J71M95P7k41p92Q00K14r6l41K7M96L1q32N20k23J23N40l56
2072am75J73L11K86o38l44Q78K8k04n17J77M66J93q61J10L08N99n25n53N29P98
2093G38n58l90m34J019L87r94m65Q59M71k81r93N14O81j88l95l82K46J163p91
2112B07n84J65P03L22j045j60Q25J43l92o28JJ200J12j079j46L12Q36l65j466
2131a039L30J180M18j193o90J186Q13p87r48J30J274L26j705n26J352J081j033
2148A69j519N34J647r1j677k80J611Q82j734j110J499J115q95j126k53J496O87
2165I55r86j163K57K159l09k211Q8J710P14j577j171J590J084q44j055L5J046
2182C22R58j207j192P74J716o0k749p1K671O28k207j491K164J660j315k232J141
$$ plain form
2051 -443 623 193 -614 -443 52 129 -112 -904 -104 110 14 -327 -300 196 227 -605 -85 -308 -185 355 -1
2072 -1 -476 -303 8 294 -344 -688 190 218 14 -503 -326 140 333 -528 -418 -110 489 -36 -589 -60 738
2093 738 180 -210 -644 375 762 -232 -697 162 633 352 -641 -127 554 366 -29 -411 -165 998 207
2112 207 -377 -212 491 813 -232 -392 433 576 184 -444 -443 757 869 -210 -356 -44 792 427 -1039
2131 -1039 -709 471 889 -304 -994 192 1005 218 -730 -600 674 1000 -705 -1231 121 1202 169
2148 169 -1350 -816 831 740 -937 -1217 394 1276 -458 -1568 -69 1046 151 -975 -1228 268 955
2165 955 -31 -1194 -937 1222 913 -1298 -1210 500 1214 -363 -1534 56 1140 296 -759 -724 322
2182 322 1280 73 -1119 -345 1371 1311 -1438 -1509 1162 1790 -417 -1908 256 1916 601 -1631 -490
2199d90J473M24j606j247J245K001o19k489l62K971P63k907j176K242K330k300
2215B53k624J752K471n56k321n36J735J604j461j826K62K606M51k872j124L036
2231H50J526k237l080K384K876j252l207Q70K582L31j943j713J628J562R7k525
2247a251j133K882J968k523k672K016L489j842l578J056L287K7k773r55K312J583
2263A893j348j715l89K368J395k520k341K208K990j331m136J109M165r5m042l00
2279b089L078J304k152j874J320J717L54j996k004K363K648j430l737J012M115
2294B629l56m263m79M144O78k598k132K544J623r73j696n62J884J903j986k314
$$ plain form
2199 -490 983 1407 -199 -1446 -201 1800 1181 -1308 -1670 1301 2064 -843 -2019 223 2553 253
2215 253 -2371 -619 1852 1296 -1025 -1561 174 1778 317 -1509 -1247 1359 1810 -1062 -2186 850
2231 850 2376 139 -2941 -557 2319 1067 -2140 -1270 1312 1643 -300 -2013 -385 1177 1274 -1251
2247 -1251 -2384 498 2466 -57 -2729 -713 2776 934 -2644 -1588 1699 1726 -1047 -2002 310 1893
2263 1893 545 -1170 -1559 809 2204 -316 -2657 -449 2541 1210 -2926 -1817 2348 2253 -1789 -2089
2279 -2089 989 2293 141 -1733 -413 1304 1658 -338 -2342 21 2669 1239 -2498 -1486 2629
2294 2629 2273 -1990 -2469 1675 2353 -245 -2377 167 1790 817 -879 -1441 443 2346 360 -1954
$$ [...]
8191A30
##END NTUPLES=NMR FID
##END=
