##TITLE=1H_Pr Glu-Cl
 CDCl3, 8 sc, 
 9.06.2021
##JCAMPDX= 6.0         $$ Bruker NMR JCAMP-DX V2.0
##DATA TYPE= NMR FID
##DATA CLASS= NTUPLES
##ORIGIN= UXNMR, Bruker Analytische Messtechnik GmbH
##OWNER= root
$$ XWIN-NMR		Version 3.5
$$ Wed Jun  9 11:58:27 2021 Russian Standard Time (UT+4h)  she@DPX200
##.OBSERVE FREQUENCY= 200.131506
##.OBSERVE NUCLEUS= ^1H
##.DELAY= (6, 6)
##.ACQUISITION MODE= SIMULTANEOUS
##.ACQUISITION SCHEME= undefined
##.AVERAGES= 8
##.DIGITISER RES= 18
##SPECTROMETER/DATA SYSTEM= spect
##.PULSE SEQUENCE= zg30
##.SOLVENT NAME= CDCl3
##.SHIFT REFERENCE= (INTERNAL, CDCl3, 0, 15.7039)
##AUDIT TRAIL= $$ (NUMBER, WHEN, WHO, WHERE, WHAT)
$$ ##TITLE= Audit trail, XWIN-NMR		Version 3.5
$$ ##JCAMPDX= 5.01
$$ ##ORIGIN= Bruker BioSpin GmbH
$$ ##OWNER= she
$$ F:/spectra/data/she/nmr/H-F/1/audita.txt
$$ ##AUDIT TRAIL=  $$ (NUMBER, WHEN, WHO, WHERE, WHAT)
(   1,<2021-06-09 11:56:59.35 +0400>,<she>,<DPX200>,
      <created by zg, POWCHK disabled, PULCHK disabled
       configuration hash MD5:
       00 E9 B6 7A A2 85 ED C7 34 08 36 98 17 FE 4E 26
       data hash MD5: 16K
       36 10 13 21 9A 64 60 3A 1C B8 DE BA C2 12 81 BE>)
$$ ##END=
$$ 
$$ hash MD5
$$ D2 94 F4 B3 A2 23 A8 5B F9 13 07 4D A4 26 DB 89
##$RELAX= 
##$RELAX= 
##$RELAX= 
##$RELAX= 
##$RELAX= 
##$RELAX= 
$$ Bruker specific parameters
$$ --------------------------
##$DU= <F:/spectra>
##$EXPNO= 1
##$NAME= <H-F>
##$PROCNO= 1
##$TYPE= <nmr>
##$USER= <she>
##$AMP= (0..31)
100 100 100 100 100 100 100 100 100 100 100 100 100 100 100 100 100 100 
100 100 100 100 100 100 100 100 100 100 100 100 100 100 
##$AQSEQ= 0
##$AQ_mod= 1
##$AUNM= <au_zg>
##$AUTOPOS= <>
##$BF1= 200.13
##$BF2= 200.13
##$BF3= 200.13
##$BF4= 200.13
##$BF5= 200.13
##$BF6= 200.13
##$BF7= 200.13
##$BF8= 200.13
##$BYTORDA= 1
##$CFDGTYP= 0
##$CFRGTYP= 5
##$CHEMSTR= <none>
##$CNST= (0..31)
1 1 145 1 1 1 1 1 1 1 1 1 1 1 1 1 1 1 1 1 1 1 1 1 1 1 1 1 1 1 1 1 
##$CPDPRG= <>
##$CPDPRG1= <>
##$CPDPRG2= <>
##$CPDPRG3= <>
##$CPDPRG4= <mlev>
##$CPDPRG5= <mlev>
##$CPDPRG6= <mlev>
##$CPDPRG7= <mlev>
##$CPDPRG8= <mlev>
##$CPDPRGB= <>
##$CPDPRGT= <>
##$D= (0..31)
0 1.2 0 0 0 0 0 0 0 0.06 0 0.03 0 0 0 0 0.0002 0 0 0 0 0 0 0 0 0 0 0 0 
0 0 0 
##$DATE= 1623225418
##$DBL= (0..7)
120 120 120 120 120 120 120 120 
##$DBP= (0..7)
150 150 150 150 150 150 150 150 
##$DBP07= 0
##$DBPNAM0= <>
##$DBPNAM1= <>
##$DBPNAM2= <>
##$DBPNAM3= <>
##$DBPNAM4= <>
##$DBPNAM5= <>
##$DBPNAM6= <>
##$DBPNAM7= <>
##$DBPOAL= (0..7)
0.5 0.5 0.5 0.5 0.5 0.5 0.5 0.5 
##$DBPOFFS= (0..7)
0 0 0 0 0 0 0 0 
##$DE= 6
##$DECBNUC= <off>
##$DECIM= 32
##$DECNUC= <off>
##$DECSTAT= 4
##$DIGMOD= 1
##$DIGTYP= 9
##$DL= (0..7)
0 120 120 120 120 120 120 120 
##$DP= (0..7)
150 150 150 150 150 150 150 150 
##$DP07= 0
##$DPNAME0= <>
##$DPNAME1= <>
##$DPNAME2= <>
##$DPNAME3= <>
##$DPNAME4= <>
##$DPNAME5= <>
##$DPNAME6= <>
##$DPNAME7= <>
##$DPOAL= (0..7)
0.5 0.5 0.5 0.5 0.5 0.5 0.5 0.5 
##$DPOFFS= (0..7)
0 0 0 0 0 0 0 0 
##$DQDMODE= 0
##$DR= 18
##$DS= 0
##$DSLIST= <SSSSSSSSSSSSSSS>
$$ [...]
##$SUBNAM2= <"">
##$SUBNAM3= <"">
##$SUBNAM4= <"">
##$SUBNAM5= <"">
##$SUBNAM6= <"">
##$SUBNAM7= <"">
##$SUBNAM8= <"">
##$SUBNAM9= <"">
##$SW= 20.0188882624521
##$SWIBOX= (0..15)
0 0 2 0 0 0 0 0 0 0 0 0 0 0 0 0 
##$SW_h= 4006.41025641026
##$TD= 16384
##$TD0= 1
##$TE= 0
##$TE2= 300
##$TE3= 300
##$TEG= 300
##$TL= (0..7)
0 120 120 120 120 120 120 120 
##$TP= (0..7)
150 150 150 150 150 150 150 150 
##$TP07= 0
##$TPNAME0= <>
##$TPNAME1= <>
##$TPNAME2= <>
##$TPNAME3= <>
##$TPNAME4= <>
##$TPNAME5= <>
##$TPNAME6= <>
##$TPNAME7= <>
##$TPOAL= (0..7)
0.5 0.5 0.5 0.5 0.5 0.5 0.5 0.5 
##$TPOFFS= (0..7)
0 0 0 0 0 0 0 0 
##$TUNHIN= 0
##$TUNHOUT= 0
##$TUNXOUT= 0
##$USERA1= <user>
##$USERA2= <user>
##$USERA3= <user>
##$USERA4= <user>
##$USERA5= <user>
##$V9= 5
##$VALIST= <valist>
##$VCLIST= <CCCCCCCCCCCCCCC>
##$VD= 0
##$VDLIST= <DDDDDDDDDDDDDDD>
##$VPLIST= <PPPPPPPPPPPPPPP>
##$VTLIST= <TTTTTTTTTTTTTTT>
##$WBST= 1024
##$WBSW= 4
##$XGAIN= (0..3)
0 0 0 0 
##$XL= 0
##$YL= 0
##$YMAX_a= 576038
##$YMIN_a= -523565
##$ZGOPTNS= <>
##$ZL1= 120
##$ZL2= 120
##$ZL3= 120
##$ZL4= 120
##$ABSF1= 10
##$ABSF2= 0
##$ABSG= 5
##$ABSL= 3
##$ALPHA= 0
##$AQORDER= 0
##$ASSFAC= 0
##$ASSFACI= 0
##$ASSFACX= 0
##$ASSWID= 0
##$AUNMP= <proc_1d>
##$AZFE= 0.1
##$AZFW= 0.1
##$BCFW= 1
##$BC_mod= 2
##$BYTORDP= 1
##$COROFFS= 0
##$CY= 11.3945322036743
##$DATMOD= 1
##$DC= 2
##$DFILT= <>
##$DTYPP= 0
##$F1P= 15.9154993809931
##$F2P= -4.1035820241983
##$FCOR= 0.5
##$FTSIZE= 0
##$FT_mod= 4
##$GAMMA= 1
##$GB= 0.15
##$INTBC= 1
##$INTSCL= 1
##$ISEN= 128
##$LB= 0.24
##$LEV0= 0
##$LPBIN= 0
##$MAXI= 10000
##$MC2= 0
##$MEAN= 0
##$ME_mod= 0
##$MI= 1.114404
##$NCOEF= 0
##$NC_proc= 0
##$NLEV= 6
##$NOISF1= 3.799351
##$NOISF2= 2.8
##$NSP= 1
##$NTH_PI= 0
##$NZP= 0
##$OFFSET= 15.70392
##$PC= 1
##$PHC0= -11488.33
##$PHC1= 16.60101
##$PH_mod= 1
##$PKNL= yes
##$PPARMOD= 0
##$PSCAL= 0
##$PSIGN= 0
##$REVERSE= no
##$SF= 200.130013532006
##$SI= 16384
##$SIGF1= 3
##$SIGF2= 2
##$SINO= 400
##$SIOLD= 16384
##$SREGLST= <1H.CDCl3>
##$SSB= 0
##$STSI= 0
##$STSR= 0
##$SW_p= 3612.71676300578
##$SYMM= 0
##$S_DEV= 0
##$TDeff= 0
##$TDoff= 0
##$TI= <>
##$TILT= no
##$TM1= 0
##$TM2= 0
##$TOPLEV= 0
##$USERP1= <user>
##$USERP2= <user>
##$USERP3= <user>
##$USERP4= <user>
##$USERP5= <user>
##$WDW= 1
##$XDIM= 8192
##$YMAX_p= 0
##$YMIN_p= 0
$$ End of Bruker specific parameters
$$ ---------------------------------
##NTUPLES= NMR FID
##VAR_NAME=  TIME,          FID/REAL,        FID/IMAG
##SYMBOL=    X,             R,               I
##VAR_TYPE=  INDEPENDENT,   DEPENDENT,       DEPENDENT
##VAR_FORM=  AFFN,          ASDF,            ASDF
##VAR_DIM=   8192,          8192,            8192
##UNITS=     SECONDS,       ARBITRARY UNITS, ARBITRARY UNITS
##FACTOR=    0.0002496,     1,               1
##FIRST=     0,             0,               0
##LAST=      2.0444736,     0,               0
##MIN=       0,             -523565,         0
##MAX=       2.0444736,     576038,          0
$$ Real data points
##PAGE= N=1
##DATA TABLE= (X++(R..R)), XYDATA
$$ [...]
$$ plain form
2011 384 1720 -97 -1646 74 1566 218 -1376 -418 1079 889 -1108 -926 975 1178 -649 -1281
2027 -1281 687 1500 -517 -1562 470 1512 47 -1408 249 1184 103 -1011 113 953 500 -656
2043 -656 -324 829 535 -426 -699 616 1011 -550 -976 575 793 -185 -972 278 1054 -214 -952 193
2061 193 857 121 -848 -161 782 -53 -601 -75 237 383 -152 -225 145 118 -303 -240 -253 347 18 -542 -91
2082 -91 59 23 -304 -309 125 13 -366 53 -59 -230 -131 63 -186 -334 -37 387 -422 -421 98 216 40 -288
2104 -288 115 338 -203 -33 11 213 56 39 -242 -98 133 151 -154 -441 528 298 -459 -135 422 396 -241
2125 -241 -301 604 321 -459 -126 341 436 -462 -212 516 245 -189 -129 261 251 -198 -452 326 453 -236 -332 38
2147 38 462 45 -675 -53 597 137 -861 -469 1095 440 -1143 -492 985 697 -1085 -771 823 755 -940
$$ packed form
2011C84J336j817j549J720J492j348j594R58J497j90j997J82J901K03j827o32
2027a281J968Q13k017j045K032J042j465j455J657R35j081j114J124Q40m53j156
2043f56L32J153k94r61k73J315L95j561m26J551K18r78p87J250P76j268p38J145
2061A93O64p36r69O87R43q35n48N26L12J46n35p3L70k7m21O3j3O00l29n60M51
2082i1J50l6l27nM34j12l79M19j12j71R9J94k49j48K97M24q09JN19J18j76l28
2104b88M03K23n41J70M4K02j57j7k81J44K31J8l05k87R69k30p57L24N57k6o37
2125b41o0R05k83p80L33M67R5q98K50P28k71m34O0L90j0m49k54P78J27o89r6L70
2147C8M24m17p20O22O50m60r98L92J564o55j583O51J477k88j782L14J594o8j695
$$ plain form
2166 -940 -906 340 729 -439 -956 66 824 34 -680 -523 598 348 -769 -742 412 867 -474 -1061
2184 -1061 267 916 -212 -723 -101 728 -25 -680 -80 553 158 -387 -250 247 53 -371 -226 227 155
2203 155 160 -94 232 413 -66 -353 293 559 -257 -676 499 834 -447 -665 379 1143 -199 -1115 496
2222 496 1233 -419 -1059 215 1172 163 -1218 -1 1018 227 -727 -461 598 636 -362 -768 279 684
2240 684 70 -771 -91 820 86 -681 -262 551 412 -598 -413 316 60 -222 -120 -42 -52 -42 -6 -103 -407
2261 -407 18 313 -224 -470 -185 558 -45 -683 -40 176 109 -385 -381 131 194 136 -453 -493 354 892 -344 -1084
2283 -1084 177 872 -67 -1246 86 1433 183 -1202 -304 1252 649 -987 -533 865 810 -587 -519
2300 -519 495 764 -57 -808 120 997 139 -803 -214 978 158 -592 54 564 23 -649 144 666 23
$$ packed form
2166i40L4J246L89j168n17J022P58p90p14J57J121k50j117K7J154M55j341n87
2184a061J328O49j128n11O22Q29p53o55O00O33l95n45J37M97j94m24J45M53p2
2203A55Nk54L26J81m79k87O46K66q16m19J175L35j281k18J044P64j342r16J611
2222D96P37j652o40J274R57j009j381J217J019p91r54K66J059L8r98m06J047M05
2240F84o14q41O80R11p34p67M19Q13j39j010J85P29k56k82J02P8j0J0L6r7l04
2261d07M25K95n37k46K85P43o03o38O43K16o7m94MN12O3n8n89m0Q47N38j236p40
2283a084J261O95r39j179J332J347j250j385Q98J556o03j636M54J398n5j397O8
2300e19J014K69q21p51R28Q77q58r42N89J192q20p50O46N10n41o72P93N22o43
$$ plain form
2319 23 -842 386 715 -236 -979 297 1195 -415 -1147 274 890 -121 -1123 -114 1179 317 -1034
2336 -1034 -615 775 784 -610 -1297 389 1375 -198 -1757 -404 1811 452 -2038 -964 1480 1181 -1610
2353 -1610 -1563 1487 1363 -1086 -1741 656 1847 -644 -1813 77 1851 239 -1534 -570 1474 795
2369 795 -1513 -866 1172 1349 -1117 -1359 1105 1145 -915 -1321 1054 1579 -855 -1391 1067 1501 -809
2386 -809 -1422 743 1600 -739 -1361 738 1559 -239 -1447 103 1713 290 -1569 -511 1680 886
2402 886 -1478 -1404 1397 1599 -1224 -2074 995 2220 -811 -2646 361 2577 -197 -2725 -134 2720
2418 2720 862 -2398 -1013 2289 1252 -1769 -1819 1358 1820 -964 -2096 349 2274 38 -2672 -427
2434 -427 2389 581 -2467 -1257 2203 967 -2441 -1148 2175 1106 -1953 -1263 1452 1246 -1529 -1279
$$ packed form
2319B3q65J228L29r51p43J276Q98j610p32J421O16j011j002J009J293q62j351
2336a034M19J390Rj394o87J686R86j573j559J353K215j359k490J074K444k99k791
2353a610M7L050j24k449o55K397J191k491j169J890J774j612j773R64K044o79
2369G95k308O47K038J77k466k42K464M0k060m06K375N25k434n36K458M34k310
2386h09o13K165Q57k339o22K099Q21j798j208J550J610j423j859J058K191p94
2402H86k364P4K801K02k823q50L069J225l031j835L007K216k774k528K591K854
2418B720j858l260J385L302j037l021n0L177M62k784j132K445J925k236k710K245
2434d27K816j808l048J210L460j236l408J293L323j069l059O90K715k06k775K50
$$ plain form
2450 -1279 1071 1253 -762 -1413 524 1518 -437 -1469 -23 1611 387 -1692 -523 2067 598 -1920
2466 -1920 -852 1891 1388 -1870 -1286 2177 1817 -1746 -1666 1505 1808 -1250 -2050 631 1903 -248 -1873
2483 -1873 -33 1940 605 -1966 -1111 1730 1501 -1880 -1933 1854 2087 -1390 -2086 1071 2282 -837
2499 -837 -2593 634 2554 -589 -1885 -139 2182 208 -1958 -566 1470 934 -1424 -1031 1363 1221
2515 1221 -881 -1214 632 1966 -816 -1750 687 1566 -903 -1914 422 1953 -353 -2005 293 1765
2531 1765 320 -1459 -212 1355 554 -1280 -448 973 920 -895 -1422 600 1439 -232 -1580 287
2547 287 1896 -217 -1522 298 1666 190 -1938 -257 1725 458 -1253 -593 1374 692 -1037 -903
2563 -903 847 1142 -731 -1455 504 1452 257 -1452 22 1368 316 -1188 -671 1577 593 -1207
$$ packed form
2450a279K350J82k015o51J937R94j955j032J446J634j224k079J169K590j469k518
2466a920J068K743n03l258N84L463l60l563Q0L171L03l058q00K681J272k151j625
2483a873J840J973j335k571Q55K841k29l381n3L787K33l477o96L157J211l119
2499h37j756L227J920l143j296J746K321j974k166J392K036n36k358L93K394j42
2515A221k102l33J846J334k782r34K437Q79k469j011K336J531k306j652K298J472
2531A765j445j779J247J567q01j834Q32J421n3j815n27K022Q39j671j348J867
2547B87J609k113j305J820J368j476k128J681J982j267j711O60J967o82j729J34
2563i03J750K95j873p24J959R48j195j709J474J346j052j504N17K248r84j800
$$ plain form
2579 -1207 -566 1219 848 -738 -797 902 787 -876 -692 426 820 -157 -856 204 1082 -24 -419 0
2597 0 597 355 -960 -187 945 267 -940 -520 859 328 -617 -522 564 604 -665 -711 356 647 -121
2616 -121 -849 -58 566 100 -410 -75 505 113 -917 -169 357 403 -832 -967 703 43 -538 -376 220
2635 220 419 102 -479 184 440 -10 -424 -613 470 151 -338 28 3 232 226 24 -50 345 152 -43 143
2656 143 482 496 -446 206 200 150 271 32 -157 -309 -505 704 215 209 -175 33 241 25 16 134 -268 -424
2678 -424 -111 377 390 81 -427 -297 -238 100 95 -366 5 -66 -59 -294 -192 204 -133 -501 87 95 -189 -39 -133
2701 -133 84 92 -162 -82 -556 85 97 -157 -279 13 103 43 -367 -45 244 223 -140 -118 6 233 220 -167 -290
2724 -290 -75 379 -18 -314 53 459 -192 -407 -109 493 118 -345 -165 379 342 -277 -330 383 369 -24 -300
$$ packed form
2579a207O41J785l71j586n9J699j15j663J84J118L94r77o99J060Q78j106l95M19
2597@N97k42j315P73J132o78j207M20J379n31r45R5J086M0j269m6J067K91p68
2616a21p28P91O24m66n10L35N80l92j030P48N26M6j235j35J670o60n81J62N96
2635B20J99l17n81O63K56m50m14j89J083l19m89L66k5K29ok02p4L95j93j95J86
2656A43L39J4r42O52on0J21k39j89j52j96J209m89ol84K08K08k16rJ18m02j56
2678d24L13M88J3l09n08J30N9L38nm61L71p1Pk35J02L96l37l68N88Qk84J50r4
2701a33K17Qk54Q0m74O41J2k54j22K92R0o0m10L22K89k1l63K2J24K27j3l87j23
2724b90K15M54l97k96L67M06o51k15K98O02l75m63J80N44l7o19n3P13j4l93k76
$$ plain form
2745 -300 -113 437 289 -303 -207 311 323 -221 -170 217 187 -299 -264 259 242 -14 -232 134 13 -289 33 29 -85
2768 -85 -16 155 102 -149 -373 197 62 -61 -316 -52 33 82 -210 -112 -26 214 -93 -475 25 391 187 -378
2790 -378 -152 425 270 -429 -334 348 335 -470 -448 209 307 -24 -607 -98 337 319 -352 -564 396 567 -209 -709
2812 -709 153 648 -20 -724 14 600 285 -515 -236 443 158 -190 -129 -53 162 340 -56 -241 25 365 12
2833 12 -234 76 134 215 -280 -323 108 274 54 -226 -160 410 357 -118 -404 93 596 28 -688 -230 656 250
2855 250 -373 -359 327 386 -305 -479 63 304 113 -414 -325 374 382 -200 -472 -3 571 87 -495 -203 438 253
2877 253 -561 -436 228 289 -42 -335 -45 281 44 -324 -342 -102 188 4 -357 -224 230 300 -118 -368 105
2898 105 294 -214 -331 -88 426 393 -302 -455 210 490 47 -688 -78 598 337 -697 -388 469 504 -328
$$ packed form
2745c00J87N50j48n92R6N18J2n44N1L87l0m86L5N23j7k56k18L66j21l02L22mj14
2768h5O9J71n3k51k24N70j35j23k55K64Q5M9k92R8Q6K40l07l82N00L66k04n65
2790c78K26N77j55o99R5O82j3q05K2O57R8l31n83N09M35j8o71k12R60J71p76n00
2812g09Q62M95o68p04P38N86l15q00K79O79k85l48O1P6K15J78l96j85K66L40l53
2833A2k46L10N8Q1m95m3M31J66k20k80O6N70n3m75k86M97N03n68p16M58Q86m06
2855B50o23J4O86N9o91j74N42K41j91n27Q9O99Qn82k72M69N74m84n82K92O41j85
2877B53q14J25O64O1l31k93K90L26k37l68j8K40K90j84l61J33M54P0m18k50M73
2898A05J89n08j17K43N14l3o95j53O65K80m43p35O10O76k61j034L09Q57L5q32
$$ plain form
2918 -328 -422 426 501 -90 -675 -51 649 207 -325 -315 408 419 -109 -596 380 407 -12 -554 -131 358 133 -386
2940 -386 -228 220 -12 -54 -170 102 70 1 -40 -18 -13 155 82 -239 -238 -115 252 119 -208 -335 110 170 -27 -317
2964 -317 -45 430 147 -644 -352 471 237 -476 -458 344 445 -388 -494 371 738 128 -739 -143 376 256
2984 256 -766 -491 459 501 -363 -746 358 911 -209 -450 -12 786 30 -523 -212 375 215 -400 -318 380
3004 380 439 -165 -192 87 304 115 -195 -150 214 73 -145 -39 175 85 -263 152 176 12 -40 115 134 -173
3026 -173 -97 10 252 -15 -300 51 418 -22 -383 -280 198 170 -571 -246 466 374 -446 -280 287 616 -140
3047 -140 -673 130 570 3 -497 12 589 242 -534 -462 320 452 -249 -498 104 507 14 -427 -89 249
3067 249 -114 -466 -198 431 270 -424 -271 290 351 -343 -351 105 327 -13 -109 127 -82 -18 -143 11 175 125
$$ packed form
2918c28r4Q48P5n91n85O24P00m42n32J0P23J1n28m87R76K7m19n42M23M89k25n19
2940c86J58M48k32m2j16K72l2o9m1K2NJ68p3l21JJ23L67j33l27j27M45O0j97k90
2964c17K72M75k83p91K92Q23k34p13J8Q02J01q33j06Q65L67o10q67N96N19j20
2984B56j022K75R50M2q64l83J104N53j120k41M38P98p56n53L11N87j60o15Q2O98
3004C80N9o04k7K79K17j89l10M5L64j41k18J06K14r0l48M15K4j64n2J55J9l07
3026a73P6J07K42k67k85L51L67m40l61J03M78k8p41L25P12r2q20J66N67L29p56
3047a40n33Q03M40n67n00N09N77l47p76P2P82J32p01k49O02M03m93m41L38L38
3067B49l63l52K68O29j61o94J53N61O1o94qM56K22l40r6K36k09O4j25J54J64n0
$$ plain form
3089 125 63 -7 173 -17 -4 160 220 86 -63 31 145 40 -259 26 437 -20 -228 -62 349 134 -446 -208
3111 -208 226 135 -238 -377 98 306 -101 -287 26 391 49 -293 -119 234 77 -407 -267 409 117 -309
3131 -309 -206 220 389 -60 -138 25 233 52 -277 -178 92 66 -281 -119 59 115 -149 -316 125 114 19 -302
3153 -302 -21 79 -83 -88 136 33 -153 -32 116 -84 -75 -48 -61 128 -113 -28 156 80 -73 -317 -209 72 38
3176 38 -56 30 216 -48 -227 -74 135 200 -264 -149 36 99 -76 -225 -21 179 41 -351 122 316 -59 -238
3198 -238 -152 213 130 -121 -190 29 346 27 -11 -1 105 17 -25 -136 79 86 -1 -139 34 99 -144 37 -36 -17
3222 -17 60 -53 57 -62 19 -123 -35 -102 4 -37 9 -9 30 -131 159 28 -203 -64 180 260 -184 -93 305 124
3246 124 -108 -8 49 -13 18 -9 -37 -26 134 -70 -203 64 276 -54 -139 59 -63 -26 -86 43 148 202 -89
$$ packed form
3089A25o2p0J80j90J3J64O0j34j49R4J14j05k99K85M11m57k08J66M11k15n80K38
3111b08M34r1l73j39M75K08m07j86L13L65l42l42J74L53j57m84J40O76k92m26
3131c09J03M26J69m49p8J63K08j81l29R9K70k6l47J62J78N6k64j67M41j1r5l21
3153c02K81J00j62nK24j03j86J21J48k00RK7j3J89k41Q5J84p6j53k44J08K81l4
3176C8r4Q6J86k64j79J53K09O5m64J15J85O3j75j49K04K00j38l92M73J94l75j79
3198b38Q6L65q3k51o9K19L17l19l8J0J06q8m2j11K15Pq7j38J73O5k43J81p3J9
3222a7P7j13J10j19Q1j42Q8o7J06m1M6j8L9j61K90j31k31J39K44Q0m44R1L98j81
3246A24k32J00N7o2L1k7k8J1J60k04j33K67K12l30q5J98j22L7o0J29J05N4k91
$$ plain form
3269 -89 -116 -118 203 273 -257 -84 72 219 -111 128 -13 166 36 -139 -121 49 230 52 -120 9 119 -18
3291 -18 -61 -160 -12 112 34 -141 -60 100 134 -10 -79 145 38 -95 6 107 111 50 -251 -53 67 199 -64
3314 -64 -226 72 123 -115 -224 -61 211 62 -108 27 50 61 -80 -106 -34 123 -42 -183 -76 150 1 68
3336 68 -139 -148 202 -31 -112 -45 230 71 -93 -198 -45 221 123 -217 -57 149 261 -215 -216 207 118 146 -288
3359 -288 7 281 145 -101 -115 273 275 -161 -102 83 260 13 -84 49 129 135 -206 -137 -85 155 47 -159 -81 -68
3383 -68 43 66 -65 -120 126 99 -388 -159 98 74 -194 -64 130 139 -75 -211 -164 155 77 -208 -305 34 379
3406 379 65 -195 -170 168 121 -324 -327 80 -24 -66 -178 237 298 -24 -150 -55 270 -113 -178 -177 44 341 135
3429 135 -201 -42 207 200 -213 -221 114 263 -2 -117 -257 342 102 -346 -180 125 232 67 -225 64 162 263
$$ packed form
3269h9k7kL21P0n30J73J56J47l30K39j41J79j30j75J8J70J81j78j72J29J10j37
3291a8m3r9J48J24p8j75Q1J60L4j44o9K24j07j33J01J01Mo1l01J98J20J32k63
3314f4j62K98N1k38j09J63K72j49j70J35K3J1j41k6P2J57j65j41J07K26j49O7
3336F8k07rL50k33q1O7K75j59j64j05J53K66r8l40J60K06J12m76jM23q9K8m34
3359b88K95K74j36k46j4L88Km36N9J85J77k47r7J33Q0Ol41O9N2K40j08k06P8J3
3383f8J11K3j31n5K46k7m87K29K57k4k68J30J94Rk14j36M7L19p8k85r7L39L45
3406C79l14k60K5L38m7m45lM07j04m2j12M15O1l22j26R5L25l83o5JK21K97k06
3429A35l36J59K49pm13qL35J49k65j15j40N99k40m48J66L05J07j65k92K89R8J01
$$ plain form
3451 263 -101 -203 274 182 -46 18 -98 221 219 -237 -68 94 124 -91 -28 71 258 -28 -115 -231 8 270 -198
3474 -198 -367 283 193 58 -235 42 117 -55 -86 -107 -1 177 -147 -239 -94 139 71 -433 -73 211 -58 -312
3496 -312 -119 32 267 5 -198 15 -43 9 67 -96 -63 163 120 -12 -308 30 170 -41 -371 -66 268 7
3518 7 -294 -215 254 248 -67 -83 55 280 -87 -116 40 36 95 -123 -364 269 192 -198 -351 81 478 -41 -227 -168
3542 -168 194 54 -106 -33 70 228 1 33 197 263 70 -237 -116 165 147 -126 -122 280 167 -245 -7 168
3564 168 52 -163 120 183 -72 -272 -43 -33 -79 -88 131 31 59 -202 71 35 -120 -288 -42 132 24 -175
3586 -175 4 113 203 -84 -287 49 171 -79 -322 -54 327 -80 -366 31 316 113 -376 -179 256 146
3606 146 -243 -246 216 317 -55 -314 67 301 112 -263 -168 321 204 -238 -108 331 147 -101 -268 243 258
$$ packed form
3451B63l64j02M77r2k28O4j16L19km56J69J62L0k15O3R9J87k86q7j16K39K62m68
3474a98j69O50r0j35k93K77P5j72l1k1J06J78l24r2J45K33o8n04L60K84k69k54
3496c12J93J51K35k62k03K13n8N2N8j63L3K26m3j32k96L38J40k11l30L05L34k61
3518Gl01P9M69ol15j6J38K25l67k9J56mN9k18k41O33p7l90j53M32L97n19j86N9
3542a68L62j40j60P3J03J58k27L2J64O6j93l07J21K81j8k73MM02j13m12K38J75
3564A68j16k15K83O3k55k00K29J0m6rK19j00K8k61K73l6j55j68K46J74j08j99
3586a75J79J09R0k87k03L36J22k50k43K68L81m07k86L97K85k03m89J97M35j10
3606A46l89lM62J01l72k59L81K34j89l75R5M89j17m42J30M39j84k48j67N11J5
$$ plain form
3627 258 -235 -268 106 82 78 -154 138 160 -159 -176 182 358 65 -255 21 180 -104 -256 -56 72 49 -191
3649 -191 -48 354 95 -218 -167 198 189 -257 -191 310 179 -153 -375 15 226 -103 -174 -85 286 106 -272 -108
3671 -108 249 102 -242 -260 295 345 -366 -321 136 216 -262 -257 9 170 107 -392 -15 263 -51 -214 -95 347
3693 347 194 -240 -138 108 423 -168 -131 149 241 38 -336 126 390 113 -231 -32 354 93 -222 16 252
3714 252 31 -201 -86 308 155 -225 -14 284 69 -113 -284 359 214 -106 -309 161 297 -119 -372 103
3734 103 281 -147 -254 -85 194 66 -240 -89 231 158 -307 -272 206 126 -250 -225 100 229 -180 -357 -61
3755 -61 353 53 -190 -233 268 -65 -273 -61 202 89 -472 -120 264 130 -125 -111 138 256 110 -80 23
3776 23 206 -76 -376 -74 272 31 32 -101 177 -13 -287 -16 244 4 -179 -52 251 216 -48 44 -30 176
$$ packed form
3627B58m93l3L74k4mk32K92K2l19j7L58J76k93l20K76J59k84j52K00J28k3k40
3649a91J43M02k59l13N1L65rm46O6N01j31l32k22L90K11l29p1Q9L71j80l78J64
3671a08L57j47l44j8N55N0p11M5M57Q0m78NK66J61o3m99L77K78l14j63J19M42
3693C47j53m34J02K46L15n91L7K80R2k03l74M62K64k77l44J99L86k61l15K38K36
3714B52k21k32J15L94j53l80K11K98k15j82j71O43j45l20k03M70J36m16k53M75
3734A03J78m28j07J69K79j28l06J51L20p3m65L5M78q0l76K5L25J29m09j77K96
3755f1M14l00k43m3N01l33k08K12K63j13n61L52L84j34k55J4K49J18j46j90J03
3776B3J83k82l00L02L46k41Jj33K78j90k74K71K60k40j83J27L03l5k64R2p4K06
$$ plain form
3798 176 -54 -107 114 128 -38 -62 92 138 27 -298 -277 250 7 -148 -177 121 160 -167 -222 -31 87 -113 -227
3821 -227 212 156 -242 -253 -27 123 123 -112 -32 194 93 -44 -48 -42 248 -109 -63 -95 -155 -109 0 -67 31 -186 -137
3846 -137 -29 -82 -34 42 -13 169 -74 98 -29 -124 17 -102 -3 50 -43 -6 -20 225 -44 -130 -24 160 29 -171
3870 -171 -1 82 164 -96 -148 80 167 -66 -14 354 248 8 -111 11 -17 150 -11 -36 143 -7 -161 -85 -122
3893 -122 231 76 -155 96 21 137 -11 86 6 -45 156 -144 -95 58 45 27 -203 -55 242 -64 -111 -85 -31
3916 -31 67 -108 48 21 247 23 59 -205 -9 97 -28 -87 41 358 16 -168 -303 52 122 -43 -196 36
3938 36 -28 -145 -60 106 80 105 -8 -19 61 75 31 -129 -50 80 103 80 -41 42 50 -189 -178 -5 19 -69 -69 -160 -148
3965 -148 96 16 -340 18 135 225 -120 111 208 -42 103 141 -135 135 207 0 48 52 143 -19 86 78 335 -18
$$ packed form
3798A76k30n3K21J4j66k4J54M6j11l25K1N27k43j55k9K98L9l27n5J91J18k00j14
3821b27M39n6l98j1K26J50%k35Q0K26j01j37mOK90l57M6l2o0M6J09o7R8k17M9
3846a37J08n3M8P6n5J82k43J72j27r5J41j19R9N3r3L7j4K45k69q6J06J84j31k00
3870a71J70Q3Q2k60n2K28Q7k33N2L68j06k40j19J22k8J67j61k5J79j50j54P6l7
3893a22L53j55k31K51p5J16j48R7q0n1K01l00M9J53j3j8k30J48K97l06m7K6N4
3916c1R8j75J56k7K26k24L6k64J96J06j25n9J28L17l42j84j35L55P0j65j53K32
3938C6o4j17Q5J66k6K5j13j1Q0J4m4j60P9J30K3k3j21Q3Qk39J1J73K4q8%r1J2
3965a48K44q0l56L58J17R0l45K31R7k50J45L8k76K70P2k07M8MR1j62J05qK57l53
$$ plain form
3989 -18 -83 86 -57 160 14 -15 225 56 -54 -250 143 75 -166 -114 -62 -76 126 -33 -101 -55 14 -43 -206 -18
4013 -18 224 -65 -116 -105 164 -20 -145 -11 8 -66 61 77 94 -244 82 244 -198 -169 45 124 15 -55 88
4036 88 209 92 125 61 118 -136 -224 -73 117 159 116 -221 14 78 144 -255 51 172 -90 -164 -249 138 199 -152
4060 -152 -266 -80 73 149 -132 -301 -298 27 191 184 24 95 -154 -249 -41 231 -29 -167 -154 406 63 -5 57
4083 57 32 222 87 -131 67 79 173 -98 -17 -197 221 55 -199 2 -168 155 37 35 -33 37 96 -5 -55 50
4107 50 176 -71 -23 -153 114 12 -185 -88 -11 44 -188 -50 139 -79 -52 -5 -39 -30 118 -88 26 -4 96 -174
4131 -174 -112 -41 5 -88 -357 -127 246 139 -62 -90 118 182 7 39 -101 -47 196 -60 59 -6 34 -46 -54 -22 47
4156 47 38 -133 -245 35 81 108 -188 -249 -240 183 325 -97 232 -38 85 62 70 98 309 -39 213 124 236 70
$$ packed form
3989a8o5J69j43K17j46k9K40j69j10j96L93o8k41N2N2j4K02j59o8M6O9n7j63J88
4013a8K42k89n1J1K69j84j25J34J9p4J27J6J7l38L26J62m42K9K14P9j09p0J43
4036H8J21j17L3o4N7k54q8J51J90M2m3l37K35O4O6l99L06J21k62p4q5L87O1l51
4060a52j14J86J53P6k81j69LL25J64pj60P1k49r5K08K72k60j38J3N60l43o8O2
4083E7k5J90j35k18J98J2R4k71Q1j80M18j66k54K01j70L23j18ko8P0N9j01n0J05
4107E0J26k47M8j30K67j02j97R7P7N5k32J38J89k18K7M7l4RJ48k06J14l0J00k70
4131a74O2P1M6r3k69K30L73j07k01k8K08O4j75L2j40N4K43k56J19o5M0q0qL2O9
4156D7rj71j12K80M6K7k96o1RM23J42m22L29k70J23k3QK8K11l48K52q9J12j66
$$ plain form
4180 70 -345 117 62 -80 -155 4 155 211 187 123 -42 189 -102 -215 54 317 -182 -94 -137 -14 -62 -243 -220
4203 -220 101 -39 -61 -62 38 64 -76 -207 -66 -26 -121 -47 152 52 11 -44 -87 297 -265 104 -39 82 44 -182
4227 -182 25 48 -41 -339 -26 186 -102 -74 9 52 -56 -197 -19 97 244 101 -66 -62 126 36 -93 -74 60
4250 60 71 -11 7 3 72 -109 -95 177 191 145 47 71 54 -271 -18 92 -81 -53 -125 -61 23 -117 -238 -118 210 -64
4276 -64 -237 -216 0 -19 -95 -21 18 40 -122 -52 -57 103 -136 -129 -60 -152 4 -89 36 22 -70 -12 -182 23 -142 -194
4302 -194 27 -39 85 -12 -184 -68 90 37 -207 122 54 1 125 12 72 -216 -64 -37 198 -130 21 104 107
4325 107 22 -152 -112 127 78 76 -50 10 115 -215 71 -110 211 -64 -184 -37 -22 210 -21 -193 264 191 -51
4348 -51 -70 63 129 36 52 44 138 29 -99 -194 15 142 -75 -110 -149 48 96 -489 -80 -105 30 -106 -141 -57 -5
$$ packed form
4180G0m15M62n5j42p5J59J51N6k4o4j65K31k91j13K69K63m99Q8m3J23m8j81K3
4203b20L21j40k2jJ00K6j40j31J41M0r5P4J99j00m1n5m3L84n62L69j43J21l8k26
4227a82K07K3q9k98L13K12k88K8Q3M3j08j41J78J16J47j43j67MJ88r0j29J9J34
4250F0J1q2J8mO9j81J4K72J4m6r8K4j7l25K53J10j73K8p2O4Q4j40j21J20L28k74
4276f4j73K1K16j9p6P4L9K2j62P0nJ60k39PO9r2J56r3J25j4r2N8j70K05j65n2
4302a94K21o6J24r7j72J16J58n3k44L29o8n3J24j13O0k88J52K7K35l28J51Q3L
4325A07q5j74M0K39m9kj26O0J05l30K86j81L21k75j20J47J5K32k31j72M57p3k42
4348e1j9J33O6r3J6qR4j09j28r5K09J27k17l5l9J97M8n85M09k5J35j36l5Q4N2
$$ plain form
4373 -5 -201 118 -66 168 -203 131 79 103 59 8 -94 28 -116 84 -92 -171 -119 106 352 -62 -129 39 -70
4396 -70 137 -87 34 -134 -9 111 -72 -115 -89 63 -192 -167 -17 159 -145 -132 -292 184 -284 -263 -127 -86
4418 -86 -155 -69 -265 151 -97 -5 56 218 -35 402 -206 -1 59 -185 1 165 292 164 -514 9 21 203
4440 203 -81 137 -180 -97 418 -136 136 -387 488 -524 265 79 55 566 -570 -123 -246 -9 45 277
4460 277 -247 430 249 201 -25 -35 76 -455 -164 68 392 80 176 209 98 22 262 260 -91 -97 240 -540 145
4483 145 104 127 207 73 -97 587 -119 123 10 -267 470 276 -359 -214 480 37 49 -113 236 -197 -69
4504 -69 -205 -266 622 -146 483 271 345 -133 -244 627 255 -116 442 -137 -137 230 344 -460 139 -501 -258 810
4526 810 423 52 -341 -113 -205 -468 -17 -75 -263 -255 -109 -114 -165 -20 517 441 -48 -95 -12 -59 65 765 -405
$$ packed form
4373ej96L19j84K34l71L34n2K4m4n1j02J22j44K00j76p9N2K25K46m14o7J68j09
4396g0K07k24J21j68J25J20j83m3K6J52k55K5J50J76l04J3j60M76m68K1J36M1
4418h6o9Q6j96M16k48R2O1J62k53M37o08K05O0k44J86J64J27j28o78N23J2J82
4440B03k84K18l17Q3N15n54K72n23Q75j012P89j86k4N11j136M47j23K37N4K32
4460B77n24O77j81m8k26j0J11n31K91K32L24l12R6L3j11p6K40kl51oL37p80O85
4483A45m1K3Q0j34j70O84p06K42j13k77P37j94o35J45O94m43J2j62L49m33J28
4504f9j36o1Q88p68O29k12P4m78j11Q71l72l71N58n79%L67J14q04N99o40K43J068
4526H10l87l71l93K28r2k63M51n8j88QJ46nn1J45N37p6m89m7Q3m7J24P00j170
$$ plain form
4549 -405 -52 -348 -80 334 -107 -147 824 5 -721 -215 163 -65 -642 -346 351 13 -201 53 -339 438
4569 438 -53 209 215 416 -82 401 -286 142 192 173 62 -91 301 375 9 -185 190 131 -133 311 -430 -25
4591 -25 -232 -246 -274 -183 345 198 50 -63 -252 270 790 -197 -138 4 21 1089 131 303 704 -41 -396 -173
4613 -173 238 -264 234 -70 -702 -519 32 -48 -172 70 -282 426 456 -121 101 -150 -45 826 50 -20 206
4634 206 232 -312 -36 348 -487 17 -155 -74 -140 -218 -651 113 -153 -154 224 -733 76 -134 980 28 353 -331
4656 -331 -191 124 -316 -331 17 62 -294 -282 311 46 -643 -52 -295 340 -464 514 414 -1163 314 177
4676 177 -314 153 166 -100 -238 221 274 -288 -372 43 -449 -166 18 19 -313 134 -420 -328 -247 -565 -856 112
4698 112 -96 124 266 -351 46 -274 -261 -473 92 1130 -59 -418 527 257 184 -242 323 -295 191 -186
$$ packed form
4549d05L53k96K68M14m41m0R71q19p26N06L78k28n77K96O97l38k14K54l92P77
4569D38m91K62OK01m98M83o87M28N0j9j11j53L92P4l66j94L75n9k64M44p41M05
4591b5k07j4k8R1N28j47j48j13j89N22N20r87N9J42J7J068r58J72M01p45l55K23
4613a73M11n02M98l04o32J83N51q0j24K42l52P08L0n77K22k51J05Q71p76p0K26
4634B06K6n44K76L84q35N04j72Q1o6p8m33P64k66jL78r57Q09k10J114r52L25o84
4656c31J40L15m40j5L48M5l56J2N93k65o89N91k43O35q04R78j00j577J477j37
4676A77m91M67J3k66j38M59N3n62q4M15m92K83J84Jl32M47n54R2Q1l18k91R68
4698A12k08K20J42o17L97l20J3k12N65J038j189l59R45k70p3m26N65o18M86l77
$$ plain form
4718 -186 138 27 225 -224 -268 182 -833 261 0 -267 399 368 -576 -93 199 93 -44 567 -336 370
4738 370 289 -106 -251 54 -29 -363 675 304 -257 -471 -447 -300 47 -14 -251 -64 1021 57 -836 22 103
4759 103 -86 270 6 -229 191 -63 164 -85 616 30 -429 490 32 773 -127 -72 -476 -120 -459 88
4779 88 -452 137 -63 -309 -412 -30 -139 163 68 -444 -332 350 133 490 290 136 -515 -691 142 -154 130
4800 130 797 492 -527 546 -507 205 -46 535 -132 -233 -81 -208 664 520 -344 90 89 200 -301 264
4820 264 168 55 -279 -3 -96 401 88 -623 -291 680 -112 -496 161 -2 -173 -381 468 -446 -291 149 557
4841 557 -376 295 -42 128 222 -325 212 185 -279 229 -184 187 335 -203 699 -225 4 -415 -243 760
4861 760 392 241 -174 -336 270 259 -97 122 -254 339 478 -217 549 -469 111 -99 55 692 610 -355
$$ packed form
4718a86L24j11J98m49m4M50j015J094k61k67O66l1r44M83K92j06j37O11r03P06
4738C70q1l95j45L05q3l34J038l71n61k14K4J47L47o1k37J87J085r64q93Q58Q1
4759A03j89L56k64k35M20k54K27k49P01n86m59R19m58P41r00N5m04L56l39N47
4779H8n40N89k00k46j03L82j09L02r5n12J12O82k17L57k00j54o51j76Q33k96K84
4800A30O67l05j019J073j053P12k51N81o67j01J52j27Q72j44q64M34jJ11n01N65
4820B64r6j13l34K76r3M97l13p11L32R71p92l84O57j63j71k08Q49r14J55M40M08
4841E57r33O71l37J70R4n47N37k7m64N08m13L71J48n38R02r24K29m19J72J003
4861G60l68j51m15j62O06j1l56K19l76N93J39o95P66j018N80k10J54O37q2r65
$$ plain form
4881 -355 473 -168 613 -165 -328 611 -31 -101 -421 409 -54 -277 485 867 -622 109 33 -427 6 128
4901 128 185 284 609 -316 -412 -191 98 -247 -133 -37 -429 -82 -708 -206 761 -101 -346 -162 -87 131 -337 -245
4923 -245 304 -75 -759 -64 411 486 86 -252 111 236 -395 109 -318 166 10 40 465 -404 -156 296 -71
4944 -71 17 251 85 89 -89 169 264 215 -45 -574 34 73 351 -512 -121 806 377 20 420 25 357 -37
4966 -37 50 -94 -818 784 -472 -100 -244 709 252 86 -270 3 -396 463 -16 41 -9 -24 -58 -104 417 -208
4988 -208 -506 -373 6 -52 -381 -393 -192 197 484 -194 -109 659 -575 -83 -174 401 -252 -162 469 -468 -121
5009 -121 192 299 -119 75 36 319 -660 -126 95 229 -254 334 -19 218 255 -128 76 252 -592 -647 640
5030 640 -388 54 -56 70 325 -495 222 -92 -231 86 165 471 -13 194 -117 417 -346 154 204 37
$$ packed form
4881c55Q28o41P81p78j63R39o42p0l20Q30m63k23P62L82j489P31p6m60M33J22
4901A28N7R9L25r25r6K21K89l45J14R6l92L47o26N02R67q62k45J84P5K18m68R2
4923b45N49l79o84O95M75P5m00l38L63J25o31N04m27M84j56L0M25q69K48M52l67
4944g1Q8K34j66Mj78K58R5m9k60n29O08L9K78q63L91R27m29l57M00l95L32l94
4966c7Q7j44p24J602j256L72j44R53m57j66l56K73l99Q59m79N7n0j5l4m6N21o25
4988b08k98J33L79n8l29j2K01L89K87o78Q5P68j234M92r1N75o53R0O31r37L47
5009a21L13J07m18J94l9K83r79N34K21J34m83N88l53K37L7l83K04J76q44n5J287
5030F40j028M42j10J26K55q20P17l14j39L17P9L06m84K07l11N34p63N00N0j67
$$ plain form
5050 37 285 -202 67 72 93 -153 -303 -226 104 -192 -294 -8 97 441 150 -415 236 134 122 -347 66 -60
5072 -60 174 288 115 160 426 154 123 -378 -261 47 -185 -63 40 174 -74 265 153 -126 -327 296 2
5093 2 -297 -118 -225 461 -85 302 49 319 -393 -327 -15 287 -142 168 -378 165 -83 225 -357 86 99
5114 99 -190 -261 385 365 -177 402 -135 119 -133 110 63 10 393 -261 -11 86 -355 -198 -19 -7 108 90 284
5137 284 287 32 202 -201 -235 63 36 -379 -117 123 148 -117 219 -106 -161 -520 -272 4 468 158 -14 -239
5159 -239 -180 -325 -393 -247 -467 46 60 43 -144 -5 53 130 -336 278 -4 -181 -52 25 396 253 134 -112
5181 -112 316 338 21 -369 36 541 134 22 -20 -160 -12 -262 44 -185 182 -161 59 -68 190 48 59
5202 59 300 89 -71 -211 -421 200 130 186 -270 -130 18 -348 -137 -11 244 -83 224 57 -270 -136 129
$$ packed form
5050C7K48m87K69NK1k46j50P7L30k96j02K86J05L44k91n65O51j02j2m69M13j26
5072f0K34J14j73M5K66k72l1n01J17L08k32J22J03J34k48L39j12k79k01O23k94
5093Bk99J79j07O86n46L87k53K70p12O6L12L02m29L10n46N43k48L08n82M43J3
5114I9k89p1O46k0n42N79n37K54k52K43m7n3L83o54K50R7m41J57J79J2J15j8J94
5137B84Lk55J70m03l4K98k7m15K62K40K5k65L36l25n5l59K48K76M64l10j72k25
5159b39N9j45o8J46k20N13J4j7j87J39N8P7m66O14k82j77J29P7L71j43j19k46
5181a12M28K2l17l90M05N05m07j12m2j40J48k50L06k29L67l43K20j27K58j42J1
5202E9K41k11j60j40k10O21p0N6m56J40J48l66K11J26K55l27L07j67l27J34K65
$$ plain form
5223 129 327 -63 380 -60 10 -266 151 38 -74 129 260 20 134 144 69 152 -17 -137 117 -15 -123
5244 -123 12 -155 39 -169 187 -63 34 -33 -152 246 6 205 211 164 83 -189 -361 -36 -87 127 196 -94 6
5267 6 472 22 -104 254 287 -88 -64 -171 34 337 357 104 -66 -543 17 -158 14 378 -41 -172 -158 -25
5289 -25 117 -142 281 -233 -161 -68 61 -46 -109 115 -154 -491 71 -186 -25 273 38 -310 -178 -107 -259 -33
5311 -33 -17 87 128 -487 -59 227 -491 -157 214 125 78 -475 -178 91 113 42 115 -244 -30 -32 30 -39 145 -30
5335 -30 -206 -254 -300 123 43 -149 -55 145 250 146 382 322 -19 46 2 288 234 -158 -20 -109 119 -21 -131
5358 -131 52 -5 -48 185 -19 -109 -17 107 -357 -46 92 9 146 -427 -83 -98 -11 29 253 99 -292 230 96
5381 96 367 77 84 34 -68 -156 290 -343 35 274 134 -74 205 299 -129 59 54 -34 132 -100 -325 -127 -252
$$ packed form
5223A29J98l90M43m40P0k76M17j13j12K03J31k40J14J0p5Q3j69j20K54j32j08
5244a23J35j67J94k08L56k50R7o7j19L98k40J99Om7q1k72j72L25n1K14O9k90J00
5267FM66m50j26L58L3l75K4j07K05L03K0k53j70m77N60j75J72L64m19j31J4J33
5289b5J42k59M23n14P2R3J29j07o3K24k69l37N62k57J61K98k35l48J32P1j52K26
5311c3J6J04M1o15M28K86p18L34L71q9m7n53K97K69K2p1P3l59K14kO2o9J84j75
5335c0j76m8m6M23q0j92R4K00J05j04K36o0l41O5m4K86n4l92J38q9K28j40j10
5358a31J83n7m3K33k04r0R2J24m64L11J38q3J37n73L44j5Q7M0K24j54l91N22j34
5381I6K71k90Pn0j02q8M46o33L78K39j40k08K79R4m28J88nq8J66k32k25J98j25
$$ plain form
5404 -252 -315 -253 117 289 78 -45 85 -178 -168 116 166 -5 15 -33 277 80 235 -100 21 135 92 -107
5426 -107 268 -18 -20 129 -286 -131 510 -154 -216 -42 322 63 -120 153 -49 107 127 64 -88 -43 -406 -239
5448 -239 -63 178 -114 -380 544 -97 265 468 52 273 -61 107 -120 -54 -228 167 -60 123 240 565
5468 565 284 97 33 490 15 -525 -25 501 -10 107 192 -455 99 -203 -202 -40 134 25 -193 -199 -92 384
5490 384 -323 294 -262 -262 105 72 510 144 -1 -383 -400 55 129 124 75 -39 11 -102 572 3 260 -203 44
5513 44 45 -216 403 206 -243 204 3 316 234 389 -46 -401 21 175 -44 -157 -31 28 107 43 234 309 -118
5536 -118 -30 -238 -299 -105 408 -42 87 -309 76 -234 43 54 -64 37 152 135 70 -11 -54 153 174 72 23
5559 23 -103 606 449 -153 -168 314 -277 477 248 -184 53 129 -208 384 343 -122 331 -97 -70 57 -237 -465
$$ packed form
5404b52o3O2L70J72k11j23J30k63J0K84N0j71K0m8L10j97J55l35J21J14m3j99
5426a07L75k86kJ49m15J55O41o64o2J74L64k59j83K73k02J56K0o3j52M5l63J67
5448b39J76K41k92k66R24o41L62K03m16K21l34J68k27O6j74L95k27J83J17L25
5468E65k81j87o4M57m75n40N00N26n11J17Q5o47N54l02JJ62J74j09k18oJ07M76
5490C84p07O17n56%L67l3M38l66j45l82j7M55P4nm9j14N0j13O74n69K57m63K47
5513D4Jk61O19j97m49M47k01L13q2J55m35l55M22J54k19j13J26N9P9o4J91P5m27
5536a18Q8k08o1J94N13m50J29l96L85l10K77J1j18J01J15j7o5q1m3K07K1j02m9
5559B3j26P09j57o02j5M82n91P54k29m32K37P6l37N92m1m65M53m28K7J27k94k28
$$ plain form
5581 -465 -66 456 -122 177 -154 263 201 -106 70 272 -271 -163 -609 -460 -339 -99 463 118 -142 -100 -51
5602 -51 446 37 -342 -17 212 16 -479 17 85 362 -350 378 -526 -133 328 -106 104 -161 182 -201 -488
5623 -488 42 -100 8 521 151 127 -176 82 82 366 196 -540 189 492 126 238 -21 -156 278 121 23
5644 23 53 -68 -250 188 7 16 -115 -92 -8 385 -195 172 335 50 4 46 35 -161 -366 190 189 -32 267 -123
5668 -123 -25 -47 110 -173 33 261 148 606 -47 -31 458 215 57 -461 -221 162 68 497 302 -94 -192 -214
5690 -214 -11 -121 85 13 335 424 92 347 63 7 -96 -66 -144 419 475 -101 257 -274 -385 227 460 -214
5712 -214 225 67 -370 213 54 -292 -135 59 51 -217 120 269 -262 206 104 253 -230 40 239 -45 -39
5733 -39 -604 -415 -464 -158 -31 244 -251 -52 -249 163 -18 136 -23 -327 200 206 -226 -110 -130 164 49 87
$$ packed form
5581d65L99N22n78K99l31M17o2l07J76K02n43J08m46J49J21K40N62l45k60M2M9
5602e1M97m09l79L25K29j96m95M96O8K77p12P28r04L93M61m34K10k65L43l83k87
5623d88N30j42J08N13l70k4l03K58%K84j70p36P29L03l66J12k59j35M34j57r8
5644B3L0j21j82M38j81Rj31K3Q4L93n80L67J63k85m6M2j1j96k05N56jk21K99l90
5668a23R8k2J57k83K06K28j13M58o53J6M89k43j58n18K40L83r4M29j95l96r8k2
5690b14K03j10K06p2L22Q9l32K55k84n6j03L0p8N63N6n76L58n31j11O12K33o74
5712b14M39j58m37N83j59l46J57J94qk68L37J49n31M68j02J49m83K70J99k84O
5733c9n65J89m9L06J27K75m95J99j97M12j81J54j59l04N27Om32J16k0K94j15L8
$$ plain form
5755 87 -226 278 -317 126 -455 70 -291 86 21 -305 -249 235 114 74 50 -77 -85 -470 155 -265 -25 149
5777 149 131 177 -348 268 -100 401 450 -167 204 89 67 -240 -619 576 7 -187 250 11 51 305 -428
5798 -428 12 752 181 168 183 -441 -217 154 101 -208 -201 -311 -527 157 274 414 -285 -147 95 284 -324 414
5820 414 454 -107 268 -216 -200 -6 -270 60 -418 -73 341 561 124 -11 -181 9 221 -107 -189 112 362
5841 362 156 427 -339 -111 625 342 480 335 -205 -421 -222 63 235 -138 -130 -540 -229 -138 216 219 36 -193
5863 -193 297 336 270 -406 -223 420 277 296 171 99 -148 441 156 -44 67 377 160 28 21 89 40 298 104
5886 104 45 306 66 221 171 -79 564 91 -297 104 -570 76 0 283 172 -191 -219 -153 273 321 -164 -273
5908 -273 35 -186 -521 -153 -162 -96 -44 40 -204 -140 276 8 -180 205 -51 159 136 90 100 37 359 -237 -17
$$ packed form
5755H7l13N04n95M43n81N25l61L77o5l26N6M84j21m0k4j27ql85O25m20K40J74
5777A49j8M6n25O16l68N01M9o17L71j15k2l07l79J195n69j94M37k39M0K54p33
5798d28M40P40n71j3J5o24K24L71n3l09Pj10k16O84J17J40o99J38K42J89o08P38
5820D14M0n61L75m84J6J94k64L30m78L45M14K20m37j35j70J90K12l28q2L01K50
5841C62k06K71p66K28P36k83J38j45n40k16J99K85J72l73Qm10L11R1L54Lj83k29
5863a93M90L9o6o76J83O43j43J9j25p2k47N89k85k00J11L10k17j32pO8m9K58j94
5886A04n9K61k40J55n0k50O43m73l88M01o74O46p6K83j11l63k8O6M26M8m85j09
5908b73L08k21l35L68rO6N2Q4k44O4M16k68j88L85k56K10k3m6J0o3L22n96K20
$$ plain form
5931 -17 142 140 -141 247 -162 -150 120 103 139 86 263 -191 -125 203 -101 -288 187 190 -435 -141 217 137 193 -4
5955 -4 175 388 296 -327 85 22 -177 80 -23 89 390 -53 -248 -60 -179 -40 199 95 85 -114 -63 16
5977 16 -33 -133 124 -592 -420 -32 -286 -234 -29 445 -329 -345 140 -126 21 159 -163 71 -19 -66 73 141
5999 141 -41 -110 42 -51 -101 -246 -136 -207 -272 64 -105 247 -350 119 -292 -187 -41 37 -110 426 -80 -52
6021 -52 540 -60 -198 -146 114 232 104 15 -345 217 -95 398 58 -100 540 -13 118 -460 169 375 -606
6042 -606 -131 -537 -353 447 -4 318 -262 275 360 -327 421 -280 -121 -402 -37 -144 -127 213 -225 128 187
6063 187 100 -342 304 297 19 213 284 -18 -238 237 -121 200 159 191 35 304 -204 -327 150 19 -175 124
6085 124 8 45 246 -279 -58 71 76 32 96 -66 107 146 -7 125 160 67 126 70 8 -18 37 -19 85 -4 -106
$$ packed form
5931a7J59kk81L88m09J2K70j7L6n3J77m54O6L28l04j87M75Lo25K94L58q0N6j97
5955dJ79K13r2o23M12o3j99K57j03J12L01m43j95J88j19J39K39j04j0j99N1P9
5977A6m9j00K57p16J72L88k54N2K05M74p74j6M85k66J47J38l22K34r0m7J39O8
5999A41j82o9J52r3n0j45J10p1o5L36j69L52n97M69m11J05J46P8j47N36n06K8
6021e2N92o00j38N2K60J18j28q9l60N62l12M93l40j58O40n53J31n78O29K06r81
6042f06M75m06J84Q00m51L22n80N37Q5o87P48p01J59k81L65j07J7L40m38L53N9
6063A87q7m42O46pk78J94P1l02k20M75l58L21m1L2j56K69n08j23M77j31j94K99
6085A24j16L7K01n25K21J29Nm4O4j62J73L9j53J32L5r3N9n6o2k6N5n6J04q9j02
$$ plain form
6110 -106 28 176 131 -61 126 182 140 -28 68 -6 -97 -73 -201 19 -129 -38 -23 188 45 -276 -151 56 45
6133 45 10 0 71 95 -28 -37 177 89 169 -145 -119 41 64 -42 -87 71 20 93 -94 -155 203 88 -36 99 -54
6158 -54 -35 56 -4 168 -64 -88 30 52 -230 72 -34 75 75 -46 109 97 -78 -75 122 -105 -51 1 -111 4
6182 4 -42 -77 -160 -88 63 -77 167 13 54 -98 3 -63 125 -126 -89 -14 151 -46 11 -57 53 74 -146 87
6206 87 29 -21 -53 -13 -59 -3 -110 117 -85 210 -68 256 130 -232 -65 193 103 -27 55 336 51 55 -58 186
6230 186 -264 76 181 -97 11 297 101 159 -52 224 -25 -42 177 -324 -35 222 -83 -11 -5 114 161 310
6252 310 -109 66 -3 -254 57 18 267 114 212 2 83 300 -138 -137 -46 -296 343 177 -340 398 445 237 -113
6275 -113 5 15 -165 97 -196 -331 -248 64 206 126 102 66 213 41 -229 -252 38 18 300 160 35 137
$$ packed form
6110a06J34J48m5j92J87N6m2j68R6p4r1K4j28K20j48R1J5K11j43l21J25K07j1
6133D5l5j0P1K4j23rK14q8Q0l14K6J60K3j06m5J58n1P3j87o1L58j15j24J35j53
6158e4J9R1o0J72k32k4J18K2k82L02j06J09%j21J55j2j75LJ97k27N4N2j12J15
6182Dm6l5q3P2J51j40K44j54M1j52J01o6J88k51L7P5J65j97N7o8J10K1k20K33
6206H7n8n0l2M0m6N6j07K27k02K95k78L24j26l62J67K58r0j30Q2K81k85Mj13K44
6230A86m50L40J05k78J08K86j96N8k11K76k49j7K19n01K89K57l05P2OJ19M7J49
6252C10m19J75o9k51L11l9K49j53R8k10Q1K17m38JR1k50O39j66n17P38M7k08l50
6275a13J18J0j80K62k93j35Q3L12J42q0k4l6J47j72k70k3K90k0K82j40j25J02
$$ plain form
6297 137 -379 212 275 134 -356 -289 129 -221 -523 -31 14 224 -372 163 216 -99 91 244 326 373 -40 46
6319 46 326 -79 47 233 411 427 607 297 -176 273 235 440 -526 -132 324 -26 -95 -243 -113 628 147
6340 147 -277 449 -183 92 -181 -254 -100 -63 344 -207 511 88 345 148 -300 -301 -40 490 426 76 -274 211
6362 211 67 56 -131 -94 525 115 -89 50 13 30 -230 -414 23 138 150 -417 251 434 -359 -216 -263 431
6384 431 223 -88 81 16 124 310 122 -121 60 -40 24 -36 170 -169 200 -35 95 273 -5 -408 181
6405 181 -415 -140 296 274 -200 112 204 -14 -177 -339 232 477 -155 -71 -40 -240 113 54 116 107 74 -249 34
6428 34 -128 221 408 -325 -107 147 -76 -99 174 277 432 -156 253 -153 -118 -124 -157 243 0 20 299 26
6450 26 -383 297 95 272 -195 398 -310 -64 -66 -80 -291 8 -109 -419 -343 -396 -45 -25 -135 240 -399 12
$$ packed form
6297A37n16N91O3j41m90O7M18l50l02M92M5K10n96N35N3l15J90J53Q2M7m13Q6
6319D6K80m05J26J86J78J6J80l10m73M49l8K05r66L94M56l50o9j48J30P41m81
6340A47m24P26o32K75k73p3J54L7M07n51P18m23K57j97m48jK61N30o4l50l50M85
6362B11j44j1j87L7O19m10k04J39l7J7k60j84M37J15J2n67O68J83p93J43m7O94
6384D31k08l11J69o5J08J86j88k43J81j00O4o0K06l39L69k35J30J78k78m03N89
6405A81n96K75M36k2m74L12R2k18j63j62N71K45o32Q4L1k00L53n9O2rl3l23K83
6428C4j62L49J87p33K18K54k23k3K73J03J55n88M09m06L5ol3M00k43K0K79k73
6450B6m09O80k02J77m67N93p08K46kj4k11K99j17l10P6n3L51K0j10L75o39M11
$$ plain form
6472 12 244 57 -548 -320 155 -29 18 -222 -232 256 74 -333 -79 2 -78 -16 342 -253 -125 387 -319 225
6494 225 144 -223 106 288 413 183 29 27 53 -427 40 -62 -149 19 -117 -54 -273 602 91 214 468 221
6516 221 264 363 111 -69 -70 107 54 390 -56 -136 -24 110 -100 -94 151 139 126 21 165 155 -64 313 68 81
6540 81 -16 -219 -363 -212 21 33 -192 344 88 -86 126 292 -248 28 -166 132 -27 -54 -4 40 -288 -196
6562 -196 -180 -123 -363 -77 79 4 135 -79 -172 146 81 153 -11 -123 216 109 -19 -147 207 -453 -39 113
6584 113 148 -427 215 -2 -315 -280 -497 -136 294 43 -98 -44 39 -186 197 298 184 -44 -427 296 104
6605 104 48 -1 -88 -148 -396 -236 42 172 234 -161 -339 -163 62 -117 -151 3 111 186 -155 -279 97 -204
6627 -204 -67 180 -132 80 -54 36 -63 157 102 40 -159 -359 91 -9 -127 0 -101 240 386 11 -98
$$ packed form
6472A2K32j87o05K28M75j84M7k40j0M88j82m07K54Q1q0O2L58n95J28N12p06N44
6494B25q1l67L29J82J25k30j54kK6m80M67j02q7J68j36O3k19Q75n11J23K54k47
6516B21M3R9k52j80jJ77n3L36m46q0J12J34k10OK45j2j3j05J44j0k19L77k45J3
6540H1r7k03j44J51K33J2k25N36k56j74K12J66n40K76j94K98j59k7N0M4l28R2
6562a96J6N7k40K86J56p5J31k14r3L18o5P2j64j12L39j07j28j28L54o60M14J52
6584A13L5n75O42k17l13L5k17L61M30k51j41N4Q3k25L83J01j14k28l83P23j92
6605A04n6m9q7o0k48J60K78J30O2l95j78J76K25j79l4J54J08P5l41j24L76l01
6627b04J37K47l12K12j34R0r9K20n5o2j99k00M50j00j18J27j01L41J46l75j09
$$ plain form
6648 -98 -217 82 225 34 360 -146 80 56 -11 41 168 213 80 19 -71 366 55 24 110 103 -37 21 86 118 -152
6673 -152 -71 37 358 181 -71 213 -219 -53 351 46 -79 79 294 -7 82 237 -44 -45 -68 37 34 -309
6695 -309 141 97 43 -45 -253 20 58 -61 -84 125 175 93 -19 -50 87 42 24 -38 -89 -133 2 -98 107 155 119
6720 119 149 -187 -9 24 -95 -61 40 -36 -24 -109 -128 -350 -34 55 -13 18 64 -149 15 -82 -28 -5 97 154 47
6745 47 75 125 141 -111 41 88 38 -126 215 -20 -39 29 -71 -38 -12 -77 -106 -64 -94 -109 107 144 59 -96 -32 43
6771 43 38 -84 -6 0 -60 -33 -196 3 61 -60 -82 51 -39 43 23 -9 17 15 66 -35 65 67 -11 3 -64 -159 85 -48
6799 -48 69 120 -116 30 22 -82 -179 -178 -8 78 12 19 -102 -103 46 -166 -60 -83 -27 -14 -82 -64 -76 -139 -34 38 162
6826 162 50 -114 119 4 82 -118 -119 -75 -62 -129 5 262 107 151 83 102 -201 53 -45 -202 -18 188 28
$$ packed form
6648i8j19K99J43j91L26n06K26k4o7N2J27M5j33o1r0M37l11l1Q6pj40N8O5L2k70
6673a52Q1J08L21j77k52K84m32J66M04l05j25J58K15l01Q9J55k81jk3J05ll43
6695c09M50m4n4q8k08K73L8j19k3K09N0q2j12l1J37m5j8o2n1m4J35j00K05M8l6
6720A19L0l36J78L3j19L4J01p6J2q5j9k22L16Q9o8L1M6k13J64r7N4K3J02N7j07
6745D7K8N0J6k52J52M7n0j64L41k35j9O8j00L3K6o5k9M2l0j5K16L7q5j55O4P5
6771D3nj22P8Oo0K7j63J99N8j21k2J33r0Q2k0l2K6kN1j01J00Kp8J4o7r5K44j33
6799d8J17N1k36J46qj04r7JJ70Q6o6Pj21jJ49k12J06k3N6J3o8J8j2o3J05P2J24
6826A62j12j64K33j15P8k00jM4J3o7J34K57j55M4o8J9l03K54r8j57J84K06j60
$$ plain form
6849 28 55 11 122 136 -40 4 162 119 -51 -83 148 54 -52 -2 134 29 120 -41 -41 -25 35 -16 -24 103 122 -165
6875 -165 -90 74 55 26 16 10 -3 -38 -110 -165 198 -41 27 29 -59 -41 45 -38 -57 -88 -96 64 44 -3 -92 -38 106 57 6
6904 6 28 32 -115 134 -37 -181 68 112 140 49 -168 27 -34 130 -62 -13 57 12 -54 -169 -56 131 147 -138 142
6929 142 103 84 185 131 -64 -44 -57 -40 -21 -91 46 -110 -42 -6 50 94 -53 -83 -38 9 -14 59 -2 93 9 -36 -162
6956 -162 -72 51 109 -137 142 -20 56 -36 7 -37 -128 76 125 -41 46 43 -165 -77 -88 -46 -91 206 -75 75 5
6981 5 -40 -134 -98 43 -178 29 60 18 -65 -89 -212 -54 49 -23 -70 -59 -45 -13 -99 -59 24 41 60 -35 21 -126 136
7008 136 165 3 -114 78 49 35 -109 108 29 -25 -36 -104 54 34 14 -184 106 -60 -7 141 162 -41 -137 17
7032 17 -149 -71 90 115 -88 -44 -39 -92 -27 139 79 -79 -103 -55 -109 60 -225 115 -132 -44 -86 -4 101 49 -26 82
$$ packed form
6849B8K7m4J11J4j76M4J58m3j70l2K31r4j06N0J36j05R1j61%J6O0n1qJ27J9k87
6875a65P5J64j9k9j0oj3l5p2n5L63k39O8Kq8J8Q6q3j9l1qJ60k0m7q9N4J44m9n1
6904FK2Mj47K49j71j44K49M4K8r1k17J95o1J64j92M9P0m5o6j15J13J87J6k85K80
6929A42l9j9J01n4j95K0j3J7J9p0J37j56O8L6N6M4j47l0M5M7k3P3o1R5q4m5j26
6956a62R0J23N8k46K79j62P6r2M3m4r1K04M9j66Q7lk08Q8j1M2m5K97k81J50p0
6981Em5r4L6J41k21K07L1m2q3k4j23J58J03p2m7J1J4L2q6M0Q3J7J9r5N6j47K62
7008A36K9j62j17J92k9j4j44K17p9n4j1o8J58k0k0j98K90j66N3J48K1k03r6J54
7032A7j66P8J61K5k03M4Nn3O5J66o0j58k4M8n4J69k85L40k47Q8m2Q2J05n2p5J08
$$ plain form
7058 82 -85 109 48 -30 -144 -177 -38 36 31 61 -146 -77 80 1 77 -58 32 -90 -8 -84 81 167 -53 -136 -122 -160
7084 -160 -180 6 -67 75 -182 -100 35 108 117 -88 114 53 9 -50 -4 93 71 64 -111 -18 183 101 57 100 86 -20
7110 -20 -34 -53 -184 12 -59 29 2 87 98 -78 16 46 -193 45 -19 -64 10 120 77 49 54 185 -154 37 41 34 -3
7137 -3 137 13 -36 30 39 -133 -101 -205 -48 -112 30 -11 -74 -131 26 -198 16 -114 -166 -72 -107 -40 -5 35 61 -33
7163 -33 13 132 -25 41 13 165 -18 22 -32 17 158 -45 100 40 -37 76 87 -63 -100 45 -121 140 39 103
7187 103 -72 -210 76 145 16 -137 -134 -19 -14 15 64 54 -140 24 34 134 -28 -52 131 22 74 49 48 -55 -180
7212 -180 69 41 -51 -16 -176 89 -25 189 40 50 61 -35 -32 36 21 44 8 62 -22 -7 -34 -157 37 172 -119
7237 -119 -27 112 -6 -70 -112 51 -33 -154 60 -48 -24 136 -41 25 51 -49 57 39 -2 81 -76 42 -87
$$ packed form
7058H2j67J94o1p8j14l3J39P4nL0k07O9J57p9P6j35R0j22Q2p6J65Q6k20q3J4l8
7084a60k0J86p3J42k57Q2J35P3Rk05K02o1m4n9M6R7k2pj75R3K01q2m4M3j4j06
7110b0j4j9j31J96p1Q8k7Q5J1j76R4L0k39K38o4m5P4J10m3k8NJ31l39J91Mpl7
7137cJ40j24m9O6Rj72L2j04J57o4J42m1o3n7J57k24K14j30n2R4l5O7L5M0K6r4
7163c3M6J19j57O6k8J52j83M0n4M9J41k03J45o0p7J13J1j50l7J45j66K61j01O4
7187A03j75j38K86O9j29j53LJ15NK9M9j0j94J64J0J00j62k4J83j09N2k5jj03j25
7212a80K49k8r2L5j60K65j14K14j49J0J1r6LO8j5K3l6N4q4J5k7j23J94J35k91
7237a19R2J39j18o4m2J63q4j21K14j08K4J60j77O6K6j00J06j8m1Q3j57J18j29
$$ plain form
7260 -87 -50 169 4 -138 14 5 9 2 -56 100 2 70 -101 -90 29 0 4 93 -5 -73 8 -4 150 -8 -93 -40 27 95
7288 95 -135 -99 157 -54 1 126 37 39 202 21 24 -11 60 7 100 144 167 35 46 -234 31 126 91 -76 34 -100
7314 -100 -3 182 99 -136 -35 -64 -77 23 230 -4 -149 -157 -48 16 -168 182 70 72 -21 37 -38 98 42 56 -163
7339 -163 102 128 15 -203 63 129 9 -14 38 -94 -5 4 -81 59 115 1 -186 -74 14 -54 -94 -76 93 -77
7363 -77 -100 115 -78 30 5 32 134 -128 -19 -38 23 105 138 61 86 108 177 8 37 194 -21 49 39 21 -205
7388 -205 -26 10 44 121 46 74 68 79 39 27 49 90 -133 -109 -21 25 -31 -150 -2 -82 -89 -114 73 80 88 -21 -119 129
7416 129 70 -62 -140 109 -120 -164 -36 -19 25 179 28 -35 -29 -7 22 -100 177 -65 74 -23 49 -15 -59 48 -21
7441 -21 29 -89 -48 -4 -167 -112 141 -51 -84 -34 -10 232 -123 124 68 -26 -45 -71 -73 99 46 94 53 -13 -46 26 -50
$$ packed form
7260h7L7K19j65j42J52rMpn8J56r8O8j71J1J19k9MQ9r8o8Q1j2J54j58q5N3O7O8
7288I5k30L6K56k11N5J25q9KJ63j81Ll5P1n3R3M4K3j32J1k80K65R5l5j67J10j34
7314a00R7J85q3k35J01k9j3J00K07k34j45qJ09O4j84L50j12Kr3N8p5J36n6J4k19
7339a63K65K6j13k18K66O6j20k3N2j32Q9Rq5J40N6j14j87J12Q8o8m0J8J69j70
7363g7k3K15j93J08k5K7J02k62J09j9O1Q2L3p7K5K2O9j69K9J57k15P0j0j8k26
7388b05J79L6L4P7p5K8oJ1m0j2K2M1k23K4Q8M6n6j19J48q0pk5J87PQj09r8K48
7416A29n9j32p8K49k29m4J28J7M4J54j51o3OK2K9j22K77k42J39r7P2o4m4J07o9
7441b1N0j18M1M4j63N5K53j92l3N0K4K42l55K47n6r4j9k6kJ72n3M8m1o6l3P2p6
$$ plain form
7468 -50 76 12 -11 -90 18 -236 -124 141 -65 -90 13 0 -150 14 -71 120 -46 20 -32 18 -118 152 -75
7491 -75 -136 115 -136 -63 144 8 -153 -9 62 -74 136 -80 -17 2 100 -17 191 -189 93 -25 -100 -38 43
7514 43 6 -131 18 -20 -87 -46 44 114 -87 26 -26 4 32 -20 -56 25 -73 -63 74 170 16 62 -23 93 -2 89 38
7541 38 -103 107 13 -3 142 -139 -134 -87 104 163 15 46 -16 -53 -87 62 -50 -8 45 7 30 81 -6 142 -134 188
7567 188 56 51 154 -27 -22 27 -50 -120 -78 23 -106 -42 83 -17 -145 -27 -20 -20 -11 33 -339 155 166 -83 52 -38
7593 -38 -179 -65 -97 -45 283 107 -158 -84 104 -57 106 -49 105 286 415 241 -132 -59 -112 -16 128 58 -30
7616 -30 -23 -247 -186 -136 -120 -86 10 -50 -205 -290 126 -139 -68 -69 -148 -154 12 88 21 336 148 174 -29 -162 95 -244
7642 -244 -276 96 108 197 -1 14 98 -113 189 112 324 410 28 135 203 -256 -83 26 45 68 253 202 2 -43
$$ packed form
7468e0J26o4k3p9J08k54J12K65k06k5J03j3j50J64q5J91j66O6n2N0j36K70k27
7491g5o1K51k51P3K07j36j61J44P1j36K10k16O3J9R8j17K08l80K82j18p5O2Q1
7514D3l7j37J49l8o7M1R0P0k01J13n2L0K8n2l6Q1r8J0J37R6j54M6q5J16r5R1n1
7541C8j41K10r4j6J45k81NM7J91N9j48L1o2l7l4J49j12M2N3l8K3N1q7J48k76L22
7567A88j32nJ03j81NM9p7p0M2J01j29O4J25j00j28J18P%RM4l72M94J1k49J35r0
7593c8j41J14l2N2L28j76k65P4J88j61J63j55J54J81J29j74l73P3n3R6J44p0q8
7616c0Pk24O1N0J6L4R6o0j55q5M16k65P1jp9oJ66P6o7L15j88K6k03j33K57l39
7642b44l2L72J2Q9j98J5Q4k11L02p7K12Q6l82J07O8m59J73J09J9K3J85n1k00m5
$$ plain form
7666 -43 -40 36 -288 -136 156 236 -24 146 52 37 60 26 -220 -91 -172 342 -205 -7 -10 -33 88 330 -116 267
7690 267 -188 -47 185 16 -2 -309 182 -102 -88 115 -2 40 35 134 20 -188 136 72 66 69 -109 38 -14 -54
7714 -54 -69 -107 -196 -67 -28 261 56 -6 1 -108 64 -12 -8 40 -28 -43 -69 -33 64 119 -52 -3 103 11 58 58 36 -175
7742 -175 61 -134 -164 136 21 -74 140 88 30 -15 -95 136 6 12 -62 -144 76 26 -122 39 98 -54 -15 75 -33
7767 -33 18 68 -79 -88 -131 221 9 15 -113 -215 162 -115 -13 9 14 143 -60 -207 147 -140 12 50 -140 -55
7791 -55 115 -119 -99 -40 -12 116 -65 -7 -5 56 -4 -131 -37 35 -43 273 -61 -138 46 14 300 138 54 128 -75
7816 -75 25 37 -30 -163 -4 17 -60 -34 -35 188 -40 120 25 -14 52 5 -13 -58 175 13 30 -46 -19 -45 53 26 33
7843 33 84 55 74 -27 37 -188 35 -119 -121 83 -85 13 83 84 -79 94 -35 -9 86 66 -156 10 -39 -37 76 -136
$$ packed form
7666d3LP6l24J52K92Q0k60J70r4j5K3l4k46J29q1N14n47J98lk3J21K42m46L83
7690B67m55J41K32j69j8l07M91k84J4K03j17M2nR9j14k08L24o4oLj78J47n2m0
7714e4j5l8q9J29L9K89k05o2Pj09J72p6MM8o8j5k6L6R7N5j71M9J06r2M7%k2k11
7742a75K36j95l0L00j15r5K14n2n8m5q0K31j30Op4q2K20n0j48J61N9j52L9R0j08
7767c3N1N0j47rm3L52k12Oj28j02L77k77J02K2NJ29k03j47L54k87J52L8j90Q5
7791e5J70k34K0N9K8J28j81N8KO1o0j27R4P2p8L16l34p7J84l2K86j62q4P4k03
7816g5J00J2o7j33J59K1p7K6jK23k28J60r5l9O6m7j8m5K33j62J7p6K7k6R8k7P
7843C3N1k9J9j01O4k25K23j54kK04j68R8P0Jj63J73j29K6R5k0k22J66m9KJ13k12
$$ plain form
7869 -136 -31 32 -152 13 -40 -12 -131 1 1 128 -24 -2 -68 -25 -29 64 -10 95 -64 63 82 119 140 -28 -155
7894 -155 -31 -162 -7 -104 -10 108 190 -6 -103 32 116 27 -92 111 -11 18 80 -20 136 54 -83 99 35
7917 35 92 -48 -5 -36 70 -24 -83 -17 100 -78 23 -103 -166 -48 17 -46 5 -82 -213 25 84 -105 114 40 94
7942 94 -13 -140 -2 -24 33 -31 47 10 41 -45 133 -64 23 39 80 -69 -18 -49 -197 -129 86 -10 61 -11 75 -146
7968 -146 -7 -63 49 179 -22 -32 38 -21 146 97 -49 72 -109 -32 -26 -14 -291 49 -92 -11 75 11 -9 33 114
7993 114 69 130 34 44 -50 -188 42 -91 43 -47 -138 -37 -3 121 -85 -71 116 -62 -3 180 15 39 -92 20
8017 20 -43 48 61 44 58 51 -89 -61 -79 1 72 47 -8 0 -60 -50 87 -86 -52 -31 -74 -2 32 129 7 75 147 92 170
8046 170 -58 15 96 -112 -34 -92 -41 123 142 -142 -125 -125 -59 56 26 -130 9 -54 11 -83 -26 -11 -84 -43 -52 -37 -85
$$ packed form
7869a36J05O3j84J65n3K8j19J32%J27j52K2o6M3mR3p4J05j59J27J9L7K1j68j27
7894a55J24j31J55r7R4J18Q2j96r7J35Q4q9j19K03j22K9O2j00J56q2j37J82o4
7917C5N7j40M3l1J06r4n9O6J17j78J01j26o3J18O5o3N1q7j31K38N9j89K19p4N4
7942I4j07j27J38k2N7o4P8l7L1q6J78j97Q7J6M1j49N1l1j48O8K15r6P1p2Q6k21
7968a46J39n6J12J30k01j0P0n9J67m9j46J21j81P7OJ2k77L40j41Q1Q6o4k0M2Q1
7993A14m5O1r6J0r4j38K30j33J34r0r1J01L4J24k06J4J87j78N9J83j65K4j31J12
8017B0o3R1J3j7J4pj40K8j8Q0P1k5n5Qo0J0J37j73L4K1m3P2L4R7j22O8P2n5P8
8046A70k28P3Q1k08P8n8N1J64J9k84J7%O6J15l0j56J39o3O5r4N7J5p3M1rJ5m8
$$ plain form
8073 -85 63 36 22 143 -204 -83 -14 79 1 63 22 -154 48 -84 36 -72 169 4 -53 -118 -46 37 -2 -6 4
8098 4 -2 24 139 -68 44 -23 59 34 -168 -214 179 -74 -16 28 -10 -66 66 73 87 46 -83 33 85 -57 -45 101
8124 101 -27 -170 120 -41 58 -37 -22 -98 -85 -23 -19 173 59 -10 29 115 34 -77 -39 101 33 -34 70 -41 52
8149 52 176 82 84 -155 101 -157 41 217 -92 74 -48 89 142 -15 -63 87 -3 71 -32 24 -138 -30 -28 -392
8173 -392 -110 -24 79 175 99 -103 -65 -190 -221 60 -4 74 25 18 32 154 128 130
$$ packed form
8073h5J48k7j4J21l47J21O9R3p8O2m1j76K02j32J20j08K41j65n7o5P2Q3l9mJ0
8098DoK6J15k07J12o7Q2k5k02m6L93k53N8M4l8n6J32PJ4m1j29J16N2j42J2J46
8124A01j28j43K90j61R9r5J5p6J3O2MJ92j14o9L9Q6q1j11L8J40o8o7J04j11R3
8149E2J24r4Kk39K56k58J98J76l09J66j22J37N3j57m8J50r0P4j03N6j62J08Kl64
8173c92K82Q6J03R6p6k02L8j25l1K81o4P8m9pJ4J22k6K
8191A30
$$ Imaginary data points
##PAGE= N=2
##DATA TABLE= (X++(I..I)), XYDATA
$$ plain form
0 0 0 0 0 0 0 0 0 0 0 0 -8 8 -8 13 -16 24 -24 32 -40 48 -56 72 -84 96 -114 136 -158 182 -210 243 -277 316
32 316 -357 407 -463 520 -583 654 -734 818 -911 1012 -1124 1245 -1377 1521 -1680 1853 -2042
49 -2042 2249 -2479 2731 -3010 3323 -3666 4054 -4497 5003 -5585 6266 -7084 8076 -9305
63 -9305 10890 -13008 16001 -20563 28436 -45614 161446 -380378 -523565 491785 444534
74 444534 -392189 -436097 305936 304773 -218531 -253164 133252 209195 31989 -144424 -125014
85 -125014 89355 211161 -98934 -320707 76084 391951 -85879 -408354 118824 428182
95 428182 -148841 -425457 158230 378504 -188496 -324207 184607 259056 -168586 -198137
105 -198137 132489 135375 -90867 -81888 25193 42065 48695 -25610 -138358 2366 207787
$$ packed form
0@%%%%%%%%%%qJ6j6K1k9M0m8N6p2Q8j04J28j56J80k10K50k94L40l92M53n20N93
32C16o73P64q70R83j103J237j388J552j729J923k136K369k622K898l201L533l895
49b042M291m728N210n741O333o989P720q551R500j0588J1851j3350J5160j7381
63i305K0195k3898K9009l6564M8999p4050K07060n41824j43187J015350m7251
74D44534q36723m3908P42033j163n23304l4633L86416P5943j77206j76413J9410
85a25014K14369J21806l10095k21773L96791L15867m77830l22475N27178L09358
95D28182n77023k76616N83687K20274n67000j35711N08814P4449m27642k9551
105a98137L30626K886k26242Q979J07081J6872O630p4305j12748J40724K05421
$$ plain form
116 207787 -1957 -284048 18134 360045 -31898 -404763 47333 421418 -71542 -441791
126 -441791 71587 432250 -58802 -385001 50413 342901 -12034 -291781 -39038 222390
136 222390 81616 -155186 -130579 101692 201507 -37021 -245583 -7335 283339 43459
146 43459 -315568 -69141 336840 85199 -326969 -79618 314308 84718 -282131 -80049
156 -80049 244094 72966 -192234 -65525 138531 67531 -84304 -66011 39968 70749 8478
167 8478 -76919 -47737 91418 72872 -110694 -93775 121968 105892 -133144 -108380 147790
178 147790 104756 -154654 -101673 144142 91100 -141859 -92836 128846 90233 -106223 -87630
189 -87630 77155 88972 -54020 -103546 17780 102916 10704 -111310 -43696 123214 71619
$$ packed form
116B07787k09744k82091L02182L41911l91943l72865M52096L74085m92960l70249
126d41791N13378L60663m91052l26199M35414K92488l54935k79747K52743K61428
136B22390j40774k36802K4607K32271R9815k38528k08562K38248K90674k39880
146D3459l59027K46427M05981k51641m12168K47351L93926k29590l66849K02082
156h0049L24143j71128k65200J26709K04056p1000j51835J8293J05979L0781o2271
167H478q5397K9182J39155j8546j83566J6919K15743j6076k39036K4764K56170
178A47790m3034k59410N2981K45815n3042k32959M9023K21682l8613j96456J8593
189h7630J64785J1817j42992m9526J21326Q5136r2212j22014O7614J66910n1595
$$ plain form
200 71619 -132046 -95306 127713 107767 -129856 -126084 122194 131005 -110290 -128457 92793
211 92793 127020 -72536 -124479 49925 111897 -29087 -98739 3973 87903 21613 -73819
222 -73819 -36274 63188 54297 -49256 -68543 41323 77917 -33543 -77653 28051 81419
233 81419 -14883 -75834 13616 73375 -8353 -63734 2045 57268 6443 -48585 -6391 46027
245 46027 15228 -33428 -20665 28290 27821 -26212 -32590 23175 38731 -15498 -42145 15769 48775
258 48775 -14579 -50646 9258 48933 -4942 -51504 1182 51454 1587 -47638 -7787 41794
270 41794 12296 -41325 -18744 34491 18719 -29143 -25727 19951 27988 -18255 -30664 11579
282 11579 27954 -6782 -31055 -1467 27673 90 -27409 -5347 21899 9235 -20058 -11579
$$ packed form
200G1619k03665L6740K23019j9946k37623L772K48278Q811k41295j8167K21250
211I2793L4227j99556n1943J74404O1972j40984o9652J02712Q3930o6290r5432
222g3819L7545R9462q891j03553j9287J09866L6594j11460m4110J05704N3368
233H1419r6302o0951Q9450N9759q1728n5381O5779N5223n0825n5028M2194N2418
245D6027l0799m8656J2763M8955m69n4033o378N5765J5556n4229k6647N7914L3006
258D8775o3354l6067N9904L9675n3875m6562N2686N0272m9867m9225L9851M9581
270D1794k9498n3621K2581N3235j5772m7862L416M5678Q037m6243j2409M2243
282A1579J6375l4736k4273K9588K9140k7583k7499K2062K7246j2664k9293Q479
$$ plain form
294 -11579 16941 8765 -15466 -12622 8031 12286 -6718 -11288 7081 10646 -2272 -9833 -1301
307 -1301 9433 -509 -9211 1062 8073 3460 -4296 -1911 7265 1916 -5866 -1054 3777 3350 -1793
322 -1793 -1430 6242 3187 -2592 511 2531 2281 -1352 -932 4809 1655 -1857 1573 2577 1839 -1711
338 -1711 -639 4840 385 -2839 1482 2612 810 -3472 -1190 5391 489 -3742 134 3410 2057
353 2057 -4903 -4099 4635 1195 -5007 -2819 2885 4310 -3854 -5762 3086 2594 -4106 -5995 9 5661
369 5661 -1959 -7213 1191 4283 -1200 -7074 -3102 5832 -79 -7821 -1658 4747 2473 -6197 -5125
384 -5125 5673 2625 -6034 -4023 2972 4876 -3217 -5902 3508 4463 -2101 -3960 398 4965 26
399 26 -4076 1145 2869 698 -944 -964 2375 1386 -468 1832 449 271 2072 1168 445 -1548 1173
$$ packed form
294a1579K8520q176k4231K844K0653M255j9004m570J8369L565j2918p561Q532
307a301J0734r942q702J0273P011m613p756K385R176n349p782M812M831m27n143
322a793L63P672l055n779L103K020k50l633M20N741l154l512L430J004p38l550
338a711J072N479m455l224M321J130j802m282K282O581m902m231L876L276j353
353B057o960Q04Q734l440o202K188N704J425q164j908Q848m92o700j889O004N652
369E661p620n254Q404L092n483n874L972Q934n911p742O163O405k274q670J072
384e125J0798l048q659K011O995J904q093k685R410R55o564j859M358M567m939
399B6m102N221J724k171j642k0L339r89j854K300j383j78J801r04p23j993K721
$$ plain form
416 1173 4920 -264 -2229 1740 3905 2490 -3195 -1921 4858 3134 -2136 -3225 2225 7039 -101
431 -101 -6022 59 5784 2985 -6280 -5244 7365 6488 -5928 -6729 4344 8603 -3822 -10854 2145
446 2145 8525 -1001 -9280 -2353 9443 2192 -10346 -3403 6976 2751 -8256 -6155 6994 4091
460 4091 -8913 -5107 6786 4355 -9098 -7267 9902 5201 -13285 -6722 12524 7423 -15225
473 -15225 -10983 16414 11675 -17430 -14238 15822 17105 -15583 -21135 14169 22532 -10916 -23389
486 -23389 5922 26192 88 -26424 -4753 25469 11891 -22691 -18021 22213 24686 -17460
498 -17460 -26758 13856 32134 -7137 -34252 3961 35691 2461 -32007 -6267 31287 12846
510 12846 -26146 -14349 21521 18777 -13788 -21445 9260 25612 -3095 -25437 -1455 27641
$$ packed form
416A173L747n184j965L969K165j415n685J274O779j724n270j089N450M814p140
431a01n921O081N725k799r265J036J2609q77j2416q01J1073M259j2425p032J2999
446B145O380r526q279O927J1796p251j2538O943J0379m225j1007K101J3149k903
460D091j3004L806J1893k431j3453J831J7169m701j8486O563J9246n101k2648
473a5225M242K7397m739k9105L192L0060J283l2688n552L5304Q363l3448j2473
486b3389K9311K0270k6104k6512K1671L0222j3578l4582M670M0234K473m2146
498a7460r298M0614J8278l9271k7115L8213L1730l3230l4468K5740L7554j8441
510A2846l8992J1797L5870k744l2565p657L0705J6352k8707k2342K3982K9096
$$ plain form
522 27641 6946 -29002 -8799 30457 10156 -30602 -11310 31623 11741 -33842 -10315 34272
534 34272 7968 -34302 -7828 33016 6859 -33714 -8183 30196 8619 -27374 -14535 22616
546 22616 19294 -19964 -26508 12328 31055 -7299 -40610 -552 46537 5422 -52465 -13228
558 -13228 54657 18472 -58354 -24606 55599 26761 -50441 -30317 41802 32473 -32548 -33676
570 -33676 19796 33049 -5850 -33683 -8204 33605 21175 -31165 -32634 29428 43965 -27394
582 -27394 -50717 27193 55057 -24322 -55176 23499 55494 -20242 -49777 19122 44053 -13533
594 -13533 -35777 9599 30701 -2893 -23138 -1056 19137 9873 -14835 -16197 15608 24028 -15237
607 -15237 -30117 17987 38345 -20831 -43497 26944 48252 -30518 -50668 32646 52297 -33921
$$ packed form
522B7641k0695l5948K0203L9256k0301m0758J9292M2933j9882m5583K3527M4587
534C4272k6304m2270K6474M0844k6157m0573K5531L8379k1577l5993J2839L7151
546B2616l322l9258o544L8836J8727l8354l3311M0058M7089m1115n7887L9237
558a3228O7885l6185p6826L3748Q0205k8838p7202K0124P2119r329o5021j128
570c3676N3472J3253l8899k7833K5479M1809j2430n2340j469O2062J4537p1359
582b7394k3323P7910K7864p9379l0854P8675L1995p5736k9535O8899K4931n7586
594a3533k2244M5376K1102l3594k0245K2082K0193r264k4708j362L1805Q420l9265
607a5237j4880M8104K0358n9176k2666P0441K1308p8770k0150Q3314J9651q6218
$$ plain form
619 -33921 -52164 32251 49438 -27198 -45799 18793 41299 -9985 -37362 -2230 29721 14418
631 14418 -24261 -29031 17730 40310 -12981 -52075 5324 59452 -2180 -66537 -2395 66464
643 66464 4727 -65142 -10028 58718 12113 -52031 -15723 39918 18172 -28571 -23111 16000
655 16000 25729 -5384 -29343 -5812 32981 14454 -37300 -20182 40527 23513 -42774 -24880
667 -24880 44770 24470 -45063 -20383 44762 17480 -41550 -14018 38895 12418 -33803 -9228
679 -9228 29312 10275 -21178 -10699 15922 14971 -8261 -17885 2198 24225 6095 -29075 -10341
692 -10341 36056 15891 -38867 -19704 42012 23595 -42533 -24630 41544 26307 -36383 -26660
704 -26660 30314 27546 -22966 -26728 13469 25843 -2965 -25111 -7333 24116 16093 -23173 -25224
$$ packed form
619c3921j8243Q4415J7187p6636j8601O4592K2506n1284k7377L5132L1951j5303
631A4418l8679m770M6761K2580n3291l9094N7399N4128o1632o4357O4142O8859
643F6464o1737o9869N5114O8746m6605o4144L6308N5641k1746m6743N460L9111
655A6000R729l1113k3959K3531L8793j8527n1754J7118O0709j7014o6287J7894
667b4880O9650k0300o9533K4680O5145k7282n9030K7532N2913k6477m6221K4575
679i228L8540j9037l1453J0479K6621r51k3232r624K0083K2027j8130l5170J8734
692a0341M6397k0165n4758J9163O1716j8417o6128J7903O6174j5237o2690R723
704b6660N6974k768n0512l762M0197J2374k8808k2146J7778L1449q023l9266k051
$$ plain form
717 -25224 21330 31710 -21209 -37283 19066 38126 -17834 -39588 14230 37137 -12963 -35067
729 -35067 9123 29363 -6276 -26042 1120 20584 1268 -16940 -5677 12041 9262 -9998
741 -9998 -13839 7696 15908 -7633 -19153 6913 21347 -7600 -23227 8726 23218 -8872 -23519
754 -23519 8739 23230 -8093 -21545 7793 20547 -4509 -18068 1875 16802 2097 -13769
766 -13769 -4981 12027 10922 -8255 -14046 7640 18376 -4268 -20180 2559 23313 217 -23322
779 -23322 -556 23730 3617 -21508 -4935 20360 7217 -16843 -7775 13810 9754 -9269
791 -9269 -11081 6429 12392 -3013 -12730 -149 13381 2841 -13990 -4690 13208 5416 -12961
804 -12961 -6701 11971 6711 -11780 -6837 9926 5751 -9239 -6811 6917 5721 -6615 -5667 4116
$$ packed form
717b5224M6554J0380n2919j6074N6349J9060n5960k1754N3818K2907n0100k2104
729c5067M4190K0240l5639j9766K7162J9464j9316j8208J1263J7718k779j9260
741i998l841K1535Q212k3541j1520K6066J4434k8947j5627L1953J4492l2090j4647
754b3519L2258J4491l1323j3452K9338J2754k5056j3559J9943J4927j4705j5866
766a3769Q788J7008j105j9177n791K1686J0736k2644j5912K2739K0754k3096k3539
779b3322K2766K4286k0113k5125J6573K5295j3143k4060R068K1585m056j9023
791i269j812J7510N963j5405r717J2581J3530j0540j6831R300J7898p792j8377
804a2961O260J8672n260j8491M943J6763m175j4990K428J3728j196j2336R48R783
$$ plain form
818 4116 4915 -3296 -6444 943 5492 -1076 -6736 -935 6305 1677 -7558 -2808 6927 2736 -7434
833 -7434 -4193 6583 4469 -6619 -5031 5864 5111 -4395 -5554 3576 6021 -2423 -5637 1478 5830
848 5830 581 -5304 -976 5797 2442 -4401 -2423 4552 4096 -3573 -3640 3866 4520 -1918 -3747 2567
864 2567 4868 -1098 -3609 1255 3694 223 -2858 -139 3629 1243 -2383 -605 2518 1532 -2004
879 -2004 -1533 1987 1485 -1291 -1375 1282 1412 -987 -1412 912 1105 -451 -1373 63 1097 -330 -1456
896 -1456 -275 595 -97 -1378 -861 642 -1 -1467 -847 262 139 -1279 -1028 452 -277 -912 -468 -114
914 -114 34 -536 -733 38 -77 -494 -226 -182 -43 -455 -347 -87 -107 156 -40 -87 168 129 -124 274 528 182
936 182 -72 44 642 86 42 789 661 22 156 851 1045 -145 -124 964 746 43 -89 726 1299 478
$$ packed form
818D116P99q211l148P387M549o568n660N801P240m628r235M750R735m191j0170
833g434L241J0776k114j1088J588J0895p53r506j159R130K445q444l214P115M352
848E830n249n885M328O773l355o843J978O975m56p669o7P506O54o438j829O314
864B567K301n966k511M864K439l471l081K719L768k386l626J778L123r86l536
879b004M71L520n02k776q4K657J30k399m25K324J93j556r22J436J034j427j126
896a456J181Q70o92j281N17J503o43j466O20J109j23j418K51J480p29o35M44L54
914a14J48n70j97P71j15m17K68M4J39m12J08K60k0K63j96m7K55l9k53L98K54l46
936A82k54J16N98n56m4P47j28o39J34O95J94j190K1J088k18p03j32Q15N73q21
$$ plain form
956 478 -282 445 1033 476 -361 -218 1345 862 -366 -291 722 1123 -175 -761 806 1006 -344 -1076 81
975 81 939 -350 -935 -212 355 84 -473 -510 100 118 -325 -634 -210 -186 64 -754 -197 -278 -290 -330 -631 -645 -241
998 -241 129 -12 -942 -784 381 85 -746 -967 -386 411 -218 -1198 -343 474 350 -875 -881 388 657 -388
1018 -388 -1007 48 1063 472 -919 -540 703 847 -576 -729 665 1355 346 -697 251 1528 975
1035 975 -518 -215 742 1206 309 -506 25 1111 886 -321 -366 786 1204 162 -291 -65 1000 1116
1053 1116 -392 -735 1049 1177 131 -1422 -288 1694 818 -1695 -1382 935 1699 -846 -2190 431
1069 431 2111 153 -2241 -1155 1892 996 -2239 -1921 793 1914 -1168 -2514 259 1756 -584 -2234
1085 -2234 -823 1316 578 -1716 -1302 468 1149 -428 -1624 -124 1005 13 -1232 -861 376 775
$$ packed form
956D78p60P27N88n57q37J43J563m83j228P5J013M01j298n86J567K00j350p32J157
975H1Q58j289n85P23N67k71n57l7O10J8m43l09M24K4K50q18N57q1j2m0l01j4M04
998b41L70j41r30J58J165k96q31k21N81P97o29r80Q55Q17j24j225oJ269K69j045
1018c88o19J055J015n91j391L79J243J44j423j53J394O90j009j043R48J277n53
1035I75j493L03R57M64q97q15N31J086k25j207m5J152M18j042m53K26J065J16
1053A116j508l43J784J28j046j553J134J982q76k513L13K317P64k545j344K621
1069D31J680j958k394J086L047q96l235L18K714J121l082j346K773J497k340j650
1085b234J411K139p38k294M14J770O81j577j196J500J129r92j245L71J237L99
$$ plain form
1101 775 -551 -1009 -15 480 338 -187 -496 -191 462 529 -380 -719 446 1400 177 -1071 -147 1791 857
1120 857 -969 -893 1249 1896 -155 -1755 388 2377 840 -2058 -1146 2547 2061 -1666 -2056 1871 2813
1137 2813 -594 -2504 621 3199 494 -2437 -584 2777 1675 -1771 -1518 1495 1921 -761 -2285
1152 -2285 360 2319 257 -2241 -898 1894 1037 -1828 -1311 929 758 -793 -1243 -77 449 -463
1168 -463 -489 -777 -442 325 256 -557 -940 28 187 -202 -806 -473 275 557 -393 -1485 -279 1267 332 -1904
1188 -1904 -1079 1777 1534 -1727 -1966 1241 2080 -1172 -2271 479 2545 11 -2153 -638 2205 1368
1204 1368 -1362 -1656 1571 2417 -448 -2252 571 3166 405 -2272 -455 2923 1166 -1868 -779
1219 -779 2183 1562 -881 -970 965 1313 -63 -830 14 941 794 -428 -566 652 1014 -98 -667 329
$$ packed form
1101G75j326m58R94M95j42n25l09L05O53O7r09l39J165R54j223j248R24J938r34
1120H57j826P6K142O47k051j600K143J989j537k898R12L693m86l727l90L927R42
1137B813l407j910L125K578k705k931J853L361j102l446K53L013M26k682j524
1152b285K645J959k062k498J343K792q57k865N17K240j71j551m50J166N26r12
1168d63k6k88L35P67o9q13l83R68J59l89o04L33P48K82r50j092J206J546r35k236
1188a904Q25K856k43l261k39L207Q39l252j099K750K066k534k164J515K843q37
1204A368k730k94L227Q46k865j804K823K595k761k677J817L378j757l034J089
1219g79K962o21k443q9J935L48j376p67Q44R27j47j222j38J218L62j112n69R96
$$ plain form
1237 329 508 -109 -43 167 -178 -475 471 399 -875 -818 912 744 -1091 -1392 777 1269 -900 -1736 -62
1256 -62 1252 -138 -1727 -840 979 773 -1332 -1938 746 1892 -1163 -2761 13 2436 -288 -2702
1272 -2702 -412 2221 422 -2509 -979 1637 1044 -1678 -1223 714 1338 -377 -1315 114 1594 356
1288 356 -1521 -533 1406 1061 -999 -636 1619 953 -1060 -529 1192 858 -802 -45 894 114 -508 44
1306 44 893 303 -590 297 843 640 -260 -133 653 781 -179 -695 222 1641 44 -1237 312 1843 451
1325 451 -1822 -431 2001 468 -2081 -713 1723 808 -1539 -1096 1137 1247 -924 -1606 199 1276
1341 1276 -350 -1794 -641 1416 549 -1768 -1223 1267 1019 -1758 -1590 1083 1184 -1390 -1607 490
1357 490 1046 -809 -1420 225 799 -365 -1110 -258 650 171 -838 -508 684 692 -813 -863 761 664 -624
$$ packed form
1237C29J79o17O6K10l45k97R46p2j274N7J730j68j835l01K169M92k169q36J674
1256f2J314j390j589Q87J819k06k105o06K684J146l055j598K774K423k724k414
1272b702K290K633j799k931J530K616n93k722M55J937O24j715r38J429J480j238
1288C56j877R88J939l45k060L63K255o66k013N31J721l34j660P57R39p80o22N52
1306D4Q49n90q93Q87N46k03r00J27P86J28r60n16R17J419j597j281J549J531j392
1325D51k273J391K432j533k549J368K436r15k347M43K233J10k171o82J805J077
1341A276j626j444J153K057q67k317N45K490k48k777J68K673J01k574k17K097
1357D90N56j855o11J645N74j164p45Q52R08m79j009L30J192Qj505n0J624r7j288
$$ plain form
1376 -624 -849 712 1161 -482 -764 859 1200 -581 -747 805 1165 -192 -660 608 1167 6 -682
1393 -682 54 1159 359 -580 -322 1202 1035 -689 -723 951 1092 -417 -1021 835 1420 -220 -1148 417
1411 417 1231 84 -1203 -2 1154 380 -673 -429 636 589 -500 -725 527 627 -542 -1020 92
1428 92 784 -269 -952 -149 470 -68 -995 -527 521 -238 -908 -609 190 65 -667 -515 199 174 -520 -670
1448 -670 84 326 -360 -724 -38 533 -196 -384 104 497 -68 -708 -106 552 100 -404 -114 482 246 -302
1468 -302 97 342 471 -12 -42 189 448 -82 -218 208 472 121 -286 202 592 224 -92 115 546 423
1488 423 -47 183 257 168 282 119 193 309 47 347 202 127 214 190 -100 -126 95 121 -64 29 105 -46 58
1511 58 -179 -257 -20 -12 -209 -304 -248 293 -298 -418 94 6 -104 -618 -375 166 -316 -509 -236 -40 2 -349 -393
$$ packed form
1376f24k25J561M49j643k82J623L41j781j66J552L60j357m68J268N59j161o88
1393f82P36J105q00r39K58J524j67j724l4J674J41j509o04J856N85j640r28J565
1411D17Q14j147j287J201J156p74j053K44J065m7j089k25J252J00j169m78J112
1428I2O92j053o83Q03O19n38r27M68J048p59o70K99P99j25p32J52P14k5o94j50
1448f70P54K42o86l64O86N71p29j88M88L93n65o40O02O58m52n04K90N96k36n48
1468c02L99K45J29m83l0K31K59n30j36M26K64l51m07M88L90l68l16K07M31j23
1488D23m70K30P4q9J14j63P4J16k62L00j45p5Q7k4k90k6K21K6j85R3P6j51J04
1511E8k37p8K37Qj97r5N6N41n91j20N12q8j10n14K43N41m82j93K73J96M2l51m4
$$ plain form
1534 -393 -157 82 -244 -414 -44 250 -51 -560 -108 106 28 -500 -467 403 177 -601 -94 400 288 -321 -183
1555 -183 356 181 -51 -146 295 446 -24 -96 436 373 8 -12 237 687 213 -47 412 664 143 -198 154
1576 154 675 230 -245 47 515 495 -305 -201 598 614 -258 -428 384 639 35 -544 16 620 139 -497 -303
1597 -303 730 419 -642 -648 420 613 -354 -944 190 715 -310 -670 -234 325 -94 -749 -596 331 223
1616 223 -411 -614 91 103 -432 -468 -22 21 -172 -281 -188 -67 -370 48 -52 -493 -177 18 87 -242 -308 125
1638 125 391 -163 -367 -38 269 159 -423 -389 485 517 12 -507 275 1033 -91 -623 393 903 197 -573
1658 -573 64 1025 203 -366 24 451 280 10 183 5 270 553 31 -362 315 700 123 -440 121 447
1678 447 23 -156 342 7 -97 248 358 -265 -448 457 468 -852 -647 737 528 -875 -1102 574 768
$$ packed form
1534c93K36K39l26j70L70K94l01n09M52K14p8n28L3Q70k26p78N07M94j12o09J38
1555a83N39j75k32r5M41J51m70p2N32o3l65k0K49M50m74k60M59K52n21l41L52
1576A54N21m45m75K92M68k0q00J04P99J6q72j70Q12K55o04n79N60O04m81o36J94
1597c03J033l11j061oJ068J93r67n90J134N25j025l60M36N59m19o55J53R27j08
1616B23o34k03P05J2n35l6M46M3j93j09R3J21l03M18j00m41L16J95O9l29o6M33
1638A25K66n54k04L29L07j10n82L4Q74L2n05n19P82P58j124n32J016N10p06p70
1658e73O37R61q22n69L90M27j71k70J73j78K65K83n22l93O77L85n77n63N61L26
1678D47m24j79M98l35j04L45J10o23j83R05J1j320K05J384k09j403k27J676J94
$$ plain form
1697 768 -701 -1108 40 866 129 -1414 -653 877 837 -1078 -1673 668 1581 -959 -2174 477 2029
1714 2029 -344 -2576 -93 2090 38 -2261 -496 1630 374 -1653 -738 1311 826 -978 -874 492
1730 492 854 -163 -1126 38 1209 201 -1042 -235 1358 391 -1079 -264 1407 433 -1273 -408 1591
1747 1591 403 -1380 -119 1627 786 -1481 -352 1563 990 -1066 -795 1032 1730 -649 -1698 823
1763 823 2029 -220 -2443 -105 3049 612 -3067 -916 2995 1528 -2975 -1973 2900 2108 -2425
1778 -2425 -2602 1968 2843 -1540 -3368 666 3378 -444 -3402 -521 3085 632 -3254 -1234 2629
1793 2629 1509 -2571 -2273 2006 2033 -1997 -2359 886 2285 -824 -2681 316 2661 -152 -2598 -440
1809 -440 2484 374 -2729 -682 2426 865 -2590 -1097 2451 1466 -2365 -1655 2217 1709 -2050 -2055 1848
$$ packed form
1697G68j469m07J148Q26p37j543P61J530m0j915n95K341R13k540j215K651J552
1714B029k373k232K483K183k052k299J765K126j256k027R15K049m85j804J04J366
1730D92L62j017r63J164J171j008j243Q07J593r67j470Q15J671r74j706Q65J999
1747A591j188j783J261J746q41k267J129J915n73k056K71J827O98k379j049K521
1763H23J206k249k223K338L154k437l679K151L911j467m503J002M873p92m533
1778b425j77M570Q75m383j828M034K712l822k958K881L606k453l886K020L863
1793B629j120m080K98M279K7m030l62L245J399l109j857K997K345k813k446K158
1809d40K924k110l103K047L108j561l455J493L548r85l831P10L872n08l759nL903
$$ plain form
1826 1848 2473 -1353 -2368 1018 3023 -307 -3180 -43 3793 913 -3600 -1227 4006 2023 -3742
1841 -3742 -2162 3947 2906 -3247 -3051 3257 3596 -2616 -3567 2041 3557 -950 -3534 248 3796 543
1857 543 -3277 -1358 3099 2326 -3038 -2816 2784 3193 -2388 -3597 2054 3919 -2146 -3963 1653 3661
1873 3661 -1316 -3703 610 3343 -576 -3085 64 2481 451 -2337 -1263 1647 1422 -1848 -2251
1888 -2251 1522 2634 -1559 -3450 1189 3547 -1207 -3901 953 4073 -1014 -4367 695 3988 -444
1903 -444 -3817 -145 3744 464 -3255 -911 2634 1767 -2276 -2438 1914 3035 -1172 -3344 818 4004
1919 4004 -160 -4281 85 4559 561 -4334 -652 4547 1275 -3947 -1219 3726 1758 -2842 -1798
1934 -1798 2545 2072 -1531 -1965 1111 2492 -58 -2727 -249 2941 804 -2968 -1235 2822 1646
$$ packed form
1826A848O25l826j015L386K005l330k873L137L836k880m513K373N233j983n765
1841c742J580O109j041o153J96O308L39o212r51N608J516m507k584L782L548l253
1857E43l820J919M457p73n364K22N600M09n581j209N651J865o065j817N616K008
1873C661m977k387M313K733l919k509L149K417k030k788J074K910k25l270m03
1888b251L773J112m193j891M639K358m754k694M854L120n087l353N062L293m432
1903d44l373L672L889l280l719K344L545q67m043j62M352J121m207k172M162L186
1919D004m164m121M366M474l998m895L682N199l272n222K728M945j968m600J044
1934a798M343m73l603m34L076J381k550k669K478L190k137l772J733M057j176
$$ plain form
1949 1646 -3138 -1583 3027 1591 -2795 -1991 2489 2033 -2437 -2035 1905 1876 -1371 -2225 715 2095
1965 2095 -560 -2164 20 2133 520 -2496 -1062 2314 1310 -2552 -1856 1986 2004 -2337 -2088 2069
1981 2069 2098 -1779 -2283 1390 2271 -1135 -2290 587 2039 -331 -2263 -190 2105 520 -1827 -1044
1997 -1044 1651 1669 -1643 -1739 1674 1842 -1185 -1934 1141 2257 -809 -1859 675 1822 -223 -1578
2013 -1578 158 1700 171 -1256 -189 1212 879 -861 -927 1027 1292 -650 -1308 691 1322 -411
2029 -411 -1447 772 1564 -257 -1247 264 1415 -494 -1182 53 1034 149 -925 -364 879 616 -755
2046 -755 -505 440 527 -451 -1007 432 979 -177 -1069 158 997 -142 -1363 -86 994 -111 -894 -195
2064 -195 765 12 -749 -154 395 128 -467 -409 174 230 -69 -248 -79 165 3 -445 -17 355 112 -156 -156
$$ packed form
1949A646m784J555M610j436m386Q04M480m56m470M02L940k9l247q54K940J380
1965B095k655j604K184K113j613l016J434L376j004l862O96L842J8m341K49M157
1981B069K9l877n04L673Q81l406j155K877J452k370j932K073K295j585k347P83
1997a044K695J8l312r6L413J68l027p49L075J116l066j050K534J147k045j355
2013a578J736J542j529j427J067J401l33j740o6J954K65j942o58J999O31j733
2029d11j036K219P92j821r90J511J151j909o88J235R81q85j074N61J243k63j371
2046g55K50R45Q7r78n56J439N47j156q92J227Q39j139j221J277J080j105p83O99
2064a95R60p53p61N95N49k67n95N8N83N6k99j79J69K44j62m48M28L72k43k68%
$$ plain form
2085 -156 28 157 -316 -2 109 28 125 85 50 -119 196 460 -155 -322 141 479 89 -213 317 380 -35 -269
2107 -269 252 134 175 -9 -81 306 67 207 -94 -91 286 256 -440 -117 323 388 -396 -325 403 328 -348 -144 285
2130 285 122 -390 -360 512 115 -434 -75 219 255 -259 -522 314 234 -294 -514 12 306 -47 -766 -167 534
2151 534 114 -679 -531 897 335 -1060 -644 901 404 -1009 -932 979 739 -836 -809 696 901 -548
2169 -548 -996 245 922 -153 -650 -241 675 462 -709 -382 535 728 -340 -814 408 1041 -137 -782
2187 -782 103 692 215 -732 -64 753 95 -322 -107 337 287 -320 -169 303 44 12 -32 0 266 -216 -252 227
2209 227 479 -10 -423 222 692 -408 -740 453 835 -431 -1010 422 929 -226 -1071 25 1105 80
2227 80 -1087 -20 1022 232 -885 -334 539 439 -518 -715 377 681 -169 -695 -70 798 108 -594 -309
$$ packed form
2085a56J84J29m73L14J11q1R7m0l5j69L15K64o15j67M63L38l90l02N30O3m15k34
2107b69N21j18M1j84p2L87k39J40l01LL77l0o96L23M40O5p84P1P28p5o76K04M29
2130B85j63n12L0Q72l97n49L59K94L6n14k63Q36q0n28k20N26K94l53p19N99P01
2151E34m20p93J48J428n62j395M16J545m97j413P7J911k40j575K7J505K05j449
2169e48m48J241O77j075m97M09R16k13j171L27R17J93j068m74J222O33j178o45
2187g82Q85N89m77r47O68Q17o58m17K15M44n0o07J51M72k59l2m4L2K66m82l6M79
2209B27K52m89m13O45M70j100l32J193L82j266n79J432N07j155q45J096J080j025
2227H0j167J067J042p90j117N51Q73j00r57j97J092L04q50n26O25Q68o90p02K85
$$ plain form
2246 -309 484 532 -705 -440 305 182 -240 -226 35 115 105 98 176 -181 241 359 -400 -320 89 462 15 -596
2268 -596 42 402 86 -345 -148 113 369 -145 -263 -176 325 761 -282 -782 463 1094 0 -962 116
2287 116 1368 1 -1232 -88 1132 567 -1017 -517 1011 613 -692 -452 587 664 -243 -720 252
2304 252 763 150 -817 -256 672 41 -818 -31 634 12 -686 -63 438 -338 -946 338 848 -442 -886
2323 -886 211 1033 -475 -1288 364 1079 -292 -1179 -32 1233 101 -1233 -627 802 796 -809 -1205
2340 -1205 837 1322 -242 -1527 -66 1810 376 -1859 -693 1693 1003 -1747 -1188 1730 1543 -1184
2356 -1184 -1548 873 1986 -711 -1824 303 2081 31 -1502 -427 1666 815 -1547 -712 1425 1181
2372 1181 -1057 -1416 1125 1309 -882 -1198 1116 1433 -975 -1288 831 1494 -854 -1467 723 1327 -492
$$ packed form
2246c09P93M8j237K65P45j23m22J4K61Q0j0pP8l57M22J18p59Q0M09L73m47o11
2268e96O38L60l16m31J97K61K56n14j18Q7N01M36j043n00J245O31j094r62J078
2287A16J252j367j233J144J220n65j584N00J528l98j305K40J039P7r07m77R72
2304B52N11o13r67N61R28o31q59P87O65o22o98O23N01p76o08J284N10j290m44
2323h86J097Q22j508q13J652P15j371q87J147J265j132j334O06J429oj605l96
2340a205K042M85j564j285J461J876j434k235J166K386o90k750N59K918j87k727
2356a184l64K421J113k697j113K127J778k050j533J075K093q51k362Q35K137k44
2372A181k238l59K541J84k191l16K314L17k408l13K119O63k348o13K190O04j819
$$ plain form
2389 -492 -1561 671 1374 -534 -1538 387 1424 42 -1845 -201 1662 624 -1685 -1232 1470 1330
2405 1330 -1366 -1901 1222 2146 -843 -2573 590 2513 -475 -2681 -95 2525 373 -2638 -800
2420 -800 2238 1049 -1981 -1572 1261 1868 -1180 -2115 602 2017 -86 -2472 -33 2499 563 -2538
2436 -2538 -761 2282 1110 -2275 -1301 2237 1271 -2025 -1330 1824 1391 -1333 -1234 1466 1298 -745 -1199
2453 -1199 960 1390 -562 -1238 207 1737 -38 -1759 -437 1933 638 -1973 -683 2173 1186 -2268
2469 -2268 -1298 2137 1509 -1767 -1647 1694 1700 -1510 -1898 1058 1602 -690 -1965 99 2020 555 -2030
2486 -2030 -694 1944 1295 -1816 -1777 1886 2048 -1511 -2296 1292 2364 -1297 -2420 774 2183 -554
2502 -554 -2337 -31 1948 70 -2117 -678 1460 552 -1472 -1266 1145 1441 -1080 -1319 872 1360
$$ packed form
2389d92j069K232P03j908j004J925J037j382j887J644J863j038k309M53K702j40
2405A330k696n35L123R24k989j730L163J923k988k206K586K620k152l011J838
2420h00L038j189l030M09K833O07l048r35K717J415k103k386K439K532j936l101
2436b538J777L043j172l385R74L538r66l296O95L154m33k724R9K700j68k043m54
2453a199K159M30j952o76J445J530j775j721J322K370j295k611J290K856r87l454
2469b268R70L435o28l276J20L341Ol210l88K956N44k292j275K064J921j465k585
2486b030J336K638o49l111L9L663J62l559p85L588J072l661j123L194J409k737
2502e54j783K306J979j878k187J439K138r08k024K06K411K96k521k39K191M88
$$ plain form
2518 1360 -796 -1641 811 1978 -420 -1922 568 1414 -545 -1378 291 1601 -94 -1196 -464 1605
2534 1605 603 -1224 -636 1150 1085 -875 -837 899 1308 -1139 -1016 109 1678 69 -1493 161 1652
2551 1652 188 -1704 -151 1691 830 -1653 -563 1413 821 -1026 -699 998 986 -572 -1371 323
2567 323 1251 -174 -1174 -171 1515 12 -1672 -697 1179 513 -1491 -694 1280 623 -1276 -588 770
2584 770 743 -804 -876 799 990 66 -756 313 599 91 -873 109 1056 275 -804 -687 1079 93 -702
2603 -702 -515 426 617 -760 -847 566 336 -697 -875 242 605 -535 -921 11 494 -152 -242 -105 841
2622 841 623 -150 -278 539 392 -520 -507 703 544 -354 -190 630 550 -196 -249 313 918 78 242 -480 656
2643 656 534 -200 -232 63 263 82 37 170 365 39 14 651 506 -251 -771 -117 758 -152 477 525 30
$$ packed form
2518A360k156q45K452J167k398j502K490Q46j959q33J669J310j695j102P32K069
2534A605j002j827N88J786o5j960L8J736M09k447J23J125J569j609j562J654J491
2551A652j464j892J553J842q61k483J090J976n92j847L27J697j2j558p99J694
2567C23R28j425j000J003J686j503j684R75J876o66k004P97J974o57j899O88J358
2584G70k7j547p2J675J91r24q22J069K86n08r64R82R47p81j079J17J766r86p95
2603g02J87R41J91j377q7J413k30j033j78J117L63j140l86R32M83o46r0J37R46
2622H41k18p73j28Q17j47r12J3J210j59q98J64Q20q0p46n3N62O05q40J64p22J136
2643F56j22p34l2K95K00j81m5J33J95l26k5O37j45p57n20O54Q75r10O29M8m95
$$ plain form
2664 30 -390 274 736 -147 -575 26 163 505 -261 -57 163 140 -95 227 -120 -177 -296 -159 -227 -122 263
2685 263 -102 -335 296 127 -27 -184 -106 248 -1 -111 35 58 198 -106 127 95 -287 -33 180 -298 -65
2706 -65 83 130 -307 53 240 108 -127 -295 218 214 -52 -34 -44 206 112 -125 -190 43 174 -28 -312 105 398
2729 398 3 -346 -171 598 106 -558 -40 356 249 -331 -402 238 400 -367 -375 -46 208 124 -495 8 296
2750 296 118 -354 -288 280 322 -229 -497 -27 155 -216 -419 37 122 -412 1 106 5 -109 -70 25 -66 -285
2772 -285 135 229 -229 -147 127 -17 27 -33 -55 54 205 -58 -247 107 475 -22 -487 -24 485 110 -473 -319
2794 -319 479 514 -343 -576 310 658 -216 -504 50 637 318 -434 -500 509 621 -200 -573 336 815 32
2814 32 -655 40 684 334 -477 -226 383 216 -267 -295 120 200 108 -55 -113 38 303 -78 -282 -157 214 109
$$ packed form
2664C0m20O64M62q83m28O01J37L42p66K04K20k3k35L22l47n7j19J37o8J05L85
2685B63l65k33O31j69j54j57P8L54k49j10J46K3J40l04K33l2l82K54K13m78K33
2706f5J48M7m37L60J87j32k35j68N13mk66J8j0K50r4k37o5K33J31k02k84M17K93
2729C98l95l49J75P69m92o64N18L96j07n80p1O40J62p67qL29K54q4o19N03K88
2750B96j78m72O6N68M2n51k68M70J82l71k03M56Q5n34M13J05j01j14L9R5r1k19
2772b85M20R4m58Q2K74j44M4o0k2J09J51k63j89L54L68m97m65M63N09l75n83J54
2794c19P98L5q57k33Q86L48q74k88N54N87l19p52o6J009J12q21l73R09M79p83
2814C2o87O95O44l50q11K51O09j67m83k8M15Q0r2j63n8J51K65l81k04J25L71j05
$$ plain form
2836 109 -203 -76 206 171 -134 -203 -59 309 190 -235 -467 88 445 -89 -555 -33 463 31 -498 -466 350
2857 350 428 -367 -338 134 438 105 -497 -123 296 252 -395 -449 153 461 -30 -463 -141 504 112 -471 -283
2878 -283 260 240 -54 -269 114 475 114 -258 -114 155 286 -8 -446 -73 266 220 -321 -311 173 343 -130
2899 -130 -332 56 337 316 -363 -308 256 439 -20 -747 17 795 83 -478 -219 627 462 -509 -613 641
2919 641 416 -202 -649 73 805 -18 -563 -213 421 462 -276 -439 236 505 -204 -604 57 308 138 -487
2939 -487 -260 267 120 -55 -53 61 24 18 -187 -324 -89 274 153 0 -207 -38 78 28 -217 -150 214 220 -201
2962 -201 -272 125 437 20 -469 -200 612 201 -495 -471 570 385 -460 -487 271 618 -197 -699 -9 787 326
2983 326 -653 -190 714 460 -460 -559 475 818 -187 -801 189 816 84 -539 -132 576 323 -334 -281 244
$$ packed form
2836A09l12J27K82l5l05o9J44L68j19m25k32N55L57n34m66N22M96m32n29L2Q16
2857C50P8p95K9M72L04l33o02L74M19m4o47n4O02L08m91m33L22O45l92n83J88
2878b83N43k0k94k15L83L61l61l72J44K69J31k94m38L73L39m6n41J0M84J70m73
2899a30k02L88K81k1o79N5N64J83m59p27P64P78p12n61K59Q46j65r71j04J254
2919F41k25o18m47P22P32q23n45L50O34M1p38j63O75K69p09m00O61K51j70o25
2939d87K27N27j47j75KJ14l7ok05j37K35L63j21j53k07J69J16n0k45O7L64Om21
2962b01p1L97L12m17m89K69Q12m11o96K4J041j85q45k7P58L47q15n02O90P96m61
2983C26r79M63R04k54r20r9J034L43j005o14R90O27p32o23M07P08k53o57N3N25
$$ plain form
3003 244 516 -105 -403 307 363 -76 -539 -125 348 31 -224 30 -11 162 -130 -82 -5 109 -209 -2 163
3024 163 -69 -191 130 23 -140 -453 160 246 -113 -356 -82 481 178 -410 -276 420 300 -420 -410 359 467
3045 467 -66 -469 242 385 -348 -514 31 645 176 -574 -199 468 335 -464 -493 441 428 -192 -468 27 460
3066 460 104 -524 -107 436 264 -439 -407 431 211 -245 -207 298 162 -8 -163 121 232 -91 -176 -19 95
3087 95 32 -215 -29 296 -146 -63 -141 60 73 -33 72 292 8 -201 150 217 41 -356 -185 414 53 -251
3109 -251 -258 190 235 -143 -69 194 375 -257 -304 -46 288 -3 -482 -19 232 113 -497 -139 267 123 -204 -320
3131 -320 282 317 -130 -313 86 186 52 -256 -37 246 62 -231 -80 168 153 -143 62 44 -5 -167 -202 154
3153 154 53 -303 -22 184 160 85 -67 171 99 -135 -43 150 -70 44 -102 27 159 -31 -148 -27 101
$$ packed form
3003B44K72o21k98P10N6m39m63M14M73l17k55K54m1J73k92M8P7J14l18K07J65
3024A63k32j22L21j07j63l13O13Q6l59k43K74N63l03n88J34O96j20p20J0P69J08
3045D67n33m03P11J43p33j66N45O14m69p50L75O67j33p99k9R34j3o20k76M95M33
3066D60l56o28M17N43j72p03L2Q38k20m56L8N05j36j70j55K84J11l23q5J57J14
3087I5o3k47J86L25m42Q3p8K01J3j06J05K20k84k09L51O7j76l97J71N99l61l04
3109b51pM48M5l78P4K63J81o32m7K58L34k91m79M63K51j19o10L58M06j44l27j16
3131c20O02L5m47j83L99J00j34l08K19K83j84k93J51K48j5k96K05j8m9j62l5L56
3153A54j01l56K81K06k4p5j52K38p2k34R2J93k20J14j46J29J32j90j17J21J28
$$ plain form
3174 101 55 -100 -35 164 124 -263 -102 24 3 -47 -111 184 88 -167 -183 153 182 -145 -108 -18 88 150 -208 -171
3198 -171 123 173 67 -8 44 82 -5 -277 -128 96 -69 -85 -146 167 101 -60 34 -69 -126 142 -17 -44 16 -60
3222 -60 -30 -219 13 70 96 -102 -49 -108 -21 143 15 -164 26 234 -81 -198 -16 55 194 117 145 201 168 48
3246 48 -164 309 143 33 -69 -84 138 73 -97 -218 34 167 -28 23 70 67 106 -101 -170 123 34 109 -2 37
3270 37 159 157 13 -119 29 192 -91 -57 104 53 -5 -128 132 91 164 -89 -119 79 40 166 -178 -14 113
3293 113 -55 -266 -60 -139 135 -9 -338 -95 117 74 -60 -396 -38 36 -63 -335 -9 68 69 -157 -27 41 211
3316 211 -180 -305 -22 190 3 -179 -43 106 143 38 -150 33 123 30 -32 71 92 154 8 -240 161 133
3338 133 101 -289 -13 242 329 -47 -148 140 267 128 -193 24 87 116 -57 -268 53 92 -136 -91 11 172
$$ packed form
3174A01m6j55O5J99m0l87J61J26k1n0o4K95r6k55j6L36K9l27L7R0J06O2l58L7
3198a71K94N0j06p5N2L8q7k72J49K24j65j6o1L13o6j61R4j03n7K68j59k7O0p6
3222f0L0j89K32N7K6j98N3n9Q7J64j28j79J90K08l15j17J82P1J39p7K8N6l3j20
3246D8k12M73j66j10j02j5K22o5j70j21K52J33j95N1M7lL9k07o9K93q9P5j11L9
3270C7J22kj44j32J48J63k83L4J61n1n8j23K60m1P3k53l0J98l9J26l44J64J27
3293A13j68k11K06p9K74j44l29K43K12m3j34l36L58P4r9k72L26P7Jk26J30O8J70
3316B11l91j25K83K12j87j82J36J49L7j05j88J83R0r3o2J03K1O2j46k48M01k8
3338A33l2l90K76K55Q7l76j01K88J27j39l21K17O3K9j73k11L21L9k28M5J02J61
$$ plain form
3360 172 109 -147 9 228 -6 -163 -180 27 265 12 -325 -56 186 142 -109 -269 46 213 35 -76 -6
3381 -6 229 -6 -73 -275 -109 79 -53 -145 -183 90 189 -128 -20 80 93 -174 -147 -51 147 51 -8 -130 -58 85
3405 85 -13 -143 -4 196 284 -405 -158 194 394 -73 -392 -109 430 204 -33 56 370 169 -208 -70 238
3426 238 159 21 -157 -3 221 213 -176 -94 145 311 -230 -320 99 210 117 -154 -79 168 83 -33 -55 41 55 188
3450 188 -36 -136 141 145 -179 -296 77 336 -16 -271 -18 103 81 -107 -91 -5 -16 -20 -255 153 155 252 -193 -269
3474 -269 375 241 1 -270 101 183 53 -266 -79 124 266 -285 -209 -153 -1 -215 -375 -252 160 237 -124
3495 -124 -275 68 -8 65 -238 -18 60 141 -57 2 85 114 -31 -17 -215 293 92 14 -157 223 174 353 -214
3518 -214 -54 199 104 -81 -238 208 157 -181 -40 89 176 98 -123 -113 255 191 -206 -253 -3 365 -66 -318
$$ packed form
3360A72o3k56J56K19k34j57j7K07K38k53l37K69K42m4k51j60L15J67j78j11P0
3381fK35k35o7k02J66J88j32r2l8K73R9l17J08J00J3k67K7R6J98r6n9j22P2J43
3405H5r8j30J39K00Q8o89K47L52K00m67l19K83N39k26k37Q9L14k01l77J38L08
3426B38p9j38j78J54K24ql89Q2K39J66n41r0M19J11r3k71P5K47q5j16k2R6J4J33
3450A88k24j00K77Ml24j17L73K59l52k55K53J21k2j88J6Q6j1mk35M08KR7m45p6
3474b69O44j34k40k71L71Q2j30l19J87K03J42n51P6N6J52k14j60J23M12P7l61
3495a24j51L43p6P3l03K20P8Q1j98N9Q3K9j45J4j98N08k01p8j71L80m9J79n67
3518b14J60K53r5j85j57M46n1l38J41J29Q7p8k21J0L68o4l97m7K50L68m31k52
$$ plain form
3540 -318 30 209 159 -286 -162 260 182 -221 0 -73 76 -87 -174 -79 154 37 -95 -48 270 -12 -232 -231 124
3563 124 -20 -127 75 -2 -73 -172 146 -136 -43 -11 -13 158 -189 -195 56 201 109 -152 -78 82 108 -327 -43 137
3587 137 211 -240 -273 265 147 -129 -397 -13 363 94 -374 57 462 -71 -235 -23 336 110 -106 -108 206
3608 206 251 115 -260 -16 273 86 -163 -167 436 223 -274 -171 136 364 -216 -92 242 175 -315 -285 151 162
3630 162 -94 -147 -76 233 -9 -104 86 134 -3 -155 -185 129 57 -221 -13 130 76 -265 -229 279 40 -171 -129
3653 -129 264 162 -167 -141 288 246 -204 -247 102 353 -171 -162 13 290 199 -231 -114 352 198 -327 -78 400
3675 400 300 -225 -354 271 257 -173 -269 45 258 -82 -362 28 357 130 -158 60 212 255 -187 -278 269
3696 269 330 -138 -269 239 178 -259 -74 73 296 -78 -269 276 162 -49 -262 80 198 151 -315 -62 281
$$ packed form
3540c18L48J79n0m45J24M22p8m03K21p3J49j63q7R5K33j17j32M7L18k82k20JL55
3563A24j44j07K02p7p1r9L18k82R3L2kJ71l47oK51J45r2k61P4J60K6m35K84J80
3587A37P4m51l3N38j18k76k68L84L76k69m68M31M05n33j64K12L59k26k16kL14
3608B06M5j36l75K44K89j87k49mO03k13m97J03L07K28n80J24L34o7m90L0M36J1
3630A62k56n3P1L09k42r5J90M8j37j52l0L14p2k78K08J43n4l41L6N08k39k11M2
3653a29L93j02l29K6M29m2m50m3L49K51n24RJ75K77r1m30J17M66j54n25K49M78
3675D00j00n25j29O25j4m30r6L14K13l40k80L90L29k27k88K18J52M3m42r1N47
3696B69O1m68j31N08o1m37J85J47K23l74j91N45j14k11k13L42J18m7m66K53L43
$$ plain form
3717 281 -74 -159 -8 248 180 -101 -198 237 111 -190 -280 -34 370 -90 -389 -6 204 -97 -220 -8 72 -50
3739 -50 -111 -27 358 186 -474 -124 211 292 -125 -219 51 151 -114 -156 -34 275 273 -282 -95 193 108 -373 -93
3762 -93 289 213 -96 -97 262 167 -10 -243 248 46 -72 -14 -1 272 109 -221 0 155 105 -10 -28 241 139
3785 139 -128 -143 142 96 -178 67 162 238 -121 -37 300 161 -103 -246 65 168 -243 -210 56 354 -137 -142 51
3808 51 175 51 -273 -171 -67 271 -195 -206 129 140 -161 -293 97 59 -95 -28 -2 -97 -104 -131 3 -110 92
3831 92 -92 -40 44 -91 -237 -66 -128 90 2 -52 -30 158 -76 -19 21 178 61 48 130 95 69 -62 92 -110
3855 -110 149 -49 184 -83 -43 -125 106 81 -65 79 -150 238 111 -169 -172 134 155 2 -54 106 2 -47 -153
3878 -153 104 151 76 -204 -89 -66 35 -60 -182 106 236 97 -236 33 95 260 -167 -164 207 100 -34 -96 60
$$ packed form
3717B81l55q5J51K56o8k81r7M35j26l01r0K46M04m60k99L83K10l01j23K12Q0j22
3739e0o1Q4L85j72o60L50L35Q1m17r4K70J00k65m2J22L09kn55J87K88q5m81K80
3762i3L82p6l09jL59r5j77k33M91k02j18N8J3K73j63l30K21J55n0j15j8K69j02
3785A39k67j5K85m6k74K45R5P6l59Q4L37j39k64j43L11J03m11L3K66K98m91nJ93
3808E1J24j24l24J02J04L38m66j1L35J1l01j32L90l8j54O7K6r5pk7J34j13K02
3831I2j84N2Q4j35j46J71o2K18q8n4K2J88k34N7M0J57j17j3Q2l5k6j31J54k02
3855a10K59j98K33k67M0q2K31k5j46J44k29L88j27k80lL06K1j53n6J60j04m9j06
3878a53K57M7p5k80J15K3J01r5j22K88J30j39l33K69O2J65m27LL71j07j34o2J56
$$ plain form
3901 60 -99 108 -84 41 -134 47 -43 -114 114 94 -72 -48 -88 64 -27 5 -33 -123 62 -33 -75 -114 -44 59 -51
3926 -51 -194 148 153 31 -217 -249 277 -23 -215 -54 103 4 -53 36 88 16 56 -167 -123 -69 131 49 -77 13 88
3951 88 2 -131 -78 213 -224 -55 15 22 119 8 -18 -107 138 147 -48 -117 91 -36 213 -156 22 176 184 -132 2
3976 2 267 8 13 -11 -31 -73 74 -46 -217 81 241 -66 -243 -176 97 58 -147 -104 169 274 -92 -106 224 199
4000 199 -137 61 -25 -82 -14 -127 -160 55 -45 -305 -150 -219 49 -45 -239 121 75 124 -164 -58 -113 47 -161
4023 -161 19 135 -120 71 16 -214 75 217 163 -97 35 25 35 3 -40 -73 73 -400 147 -39 -136 140 -199
4046 -199 -77 -74 292 252 -165 -42 242 25 -189 -33 125 3 -281 30 189 -149 -20 84 129 -90 84
4067 84 -97 107 -395 230 11 33 126 211 127 -26 -53 290 222 -143 -102 -117 -15 -125 -59 -74 225 120 112 -172
$$ packed form
3901F0j59K07j92J25j75J81r0p1K28k0j66K4m0J52r1L2l8r0J85r5m2l9P0J03j10
3926e1j43L42Nj22k48l2N26l00j92J61J57r9n7Q9N2p2M0k23M4N4K00q2j26R0P5
3951H8q6j33N3K91m37J69P0PR7j11k6q9K45Rj95o9K08j27K49l69J78J54Ql16J34
3976BK65k59Nk4k0m2J47j20j71K98J60l07j77O7K73l9k05M3K73J05l66j4L30k5
4000A99l36J98q6n7O8j13l3K15j00k60J55o9K68r4j94L60m6M9k88J06n5J60k08
4023a61J80J16k55J91n5k30K89J42n4k60J32j0J0l2m3l3J46m73N47j86r7K76l39
4046a99J22LL66m0m17J23K84k17k14J56J58j22k84L11J59l38J29J04M5k19J74
4067H4j81K04n02O25k19K2R3Q5q4j53k7L43o8l65M1j5J02j10O6j5K99j05qk84
$$ plain form
4091 -172 45 131 54 -185 -49 43 36 152 -97 119 -105 -44 91 -42 40 -57 39 -53 -63 280 -119 -129 -158 113
4115 113 106 -286 24 230 154 -121 3 -185 57 161 -144 41 -57 -141 -131 -59 62 80 -34 79 107 215 -39
4138 -39 -109 7 35 -67 -40 16 178 111 -269 75 -55 37 -10 -301 41 136 -128 8 128 -20 -192 10 222
4161 222 -105 -196 -117 79 53 -72 -41 151 92 -65 53 98 191 -57 -181 161 106 70 -263 33 -184 -44 59
4184 59 -205 141 140 -148 -412 -180 17 45 -194 209 84 153 -140 -89 42 -121 -112 -88 3 -15 -59 1 63 -194 -222
4209 -222 -286 17 43 -95 121 -39 -17 153 -2 -47 -43 10 -93 42 134 -59 9 -124 30 118 -366 91 207
4232 207 33 -158 18 216 -150 -78 30 123 -13 -136 4 162 122 -120 -48 93 50 89 -108 145 -119 215
4254 215 25 173 97 151 -191 -164 84 251 -83 -144 44 102 59 49 151 204 106 -126 -78 115 60 -181 -164 101
$$ packed form
4091a72K17Q6p7k39J36R2pJ16k49K16k24O1J35j33Q2r7R6r2j0L43l99j0k9K71
4115A13pl92L10K06p6k75J24j88K42J04l05J85r8q4J0P2J21J8j14J13K8J08k54
4138c9p0J16K8j02K7N6J62o7l80L44j30R2m7k91L42R5k64J36J20j48j72K02K12
4161B22l27r1P9J96k6j25L1J92n9j57J18M5R3k48j24L42n5l6l33K96k17J40J03
4184E9k64L46jk88k64K32J97K8k39M03j25O9k93N1J31j63RK4R1j8m4O0O2k57k8
4209b22o4L03K6j38K16j60K2J70j55m5MN3j03J35R2j93O8j33J54Q8m84M57J16
4232B07j74j91J76J98l66P2J08R3j36j23J40J58m0k42P2J41m3L9j97K53k64L34
4254B15j90J48p6N4l42K7K48J67l34o1J88N8m3j0J02N3r8k32M8J93n5k41J7K65
$$ plain form
4278 101 11 31 -195 -39 105 -217 -159 68 73 -3 98 39 196 46 23 34 -179 -120 -160 -189 173 -58 -154 62
4302 62 20 85 16 57 -43 164 4 -32 37 371 -43 -112 36 60 -28 33 67 71 -167 -9 30 37 183 -52 -28 72
4328 72 14 -20 -75 146 198 -174 -59 210 71 95 20 10 26 180 -106 -98 91 174 -71 -158 -3 -41 39 2 -198
4353 -198 169 -116 -89 -90 43 -21 148 35 148 190 91 60 37 97 -222 -13 -13 -104 -34 -118 -65 -29 167 62 199
4378 199 120 -118 -150 -386 204 250 -128 134 -207 -149 -27 19 25 10 119 -79 65 -38 -86 26 125 82 -138 103
4402 103 -35 -94 -50 56 -76 -107 248 73 -151 142 -77 -42 216 14 196 -15 -23 -146 -253 310 -171 -422
4424 -422 -21 -36 113 -610 -431 127 -97 125 242 -8 -54 -66 -41 20 123 -292 12 -127 328 -200 -179 -103
4446 -103 -242 118 360 -250 -365 -185 -100 295 4 -616 2 -89 -494 -62 -289 121 34 -244 3 25 -17 -149
$$ packed form
4278A01r0K0k26J56J44l22N8K27Np6J01n9J57j50k3J1k13N9m0k9L62k31r6K16
4302F2m2O5o9M1j00K07j60l6O9L34m14o9J48K4q8O1L4Mk38J58L9PJ46k35K4J00
4328G2n8l4n5K21N2l72J15K69j39K4p5j0J6J54k86QJ89Q3k45q7J55l8Q0l7k00
4353a98L67k85K7jJ33o4J69j13J13M2r9l1k3O0l19K09%r1P0q4N3L6J96j05J37
4378A99p9k38l2k36N90M6l78K62l41N8J22M6Oj5J09j98J44j03m8J12R9m3k20K41
4402A03j38n9M4J06j32l1L55j75k24K93k19L5K58k02J82k11qj23j07N63m81k51
4424d22M01j5J49p23J79N58k24K22J17k50m6j2K5O1J03m15L04j39M55n28K1P6
4446a03j39L60K42o10j15J80Q5L95k91o20O18r1m05M32k27M10q7k78K47K2m2j32
$$ plain form
4468 -149 -346 -390 108 -72 -79 114 467 42 -813 151 -5 197 -65 -104 -552 -402 -456 -61 -57 -390 105 -131
4490 -131 787 72 198 -330 0 861 360 90 -606 -134 479 105 193 -329 -153 -172 -537 26 -45 371 321
4511 321 -132 -27 -333 -23 154 -463 115 122 777 166 -33 502 -175 314 -869 -85 47 717 193 390
4531 390 130 -21 472 -43 -55 351 424 -698 193 502 -495 -165 -157 176 46 190 -576 -244 -444 549 -305
4552 -305 -308 -42 32 860 -316 266 -174 328 -345 -361 47 350 -188 -349 -233 211 -288 256 -99 -266 421
4573 421 35 -587 8 287 -334 -792 222 64 -74 184 82 334 141 409 26 -91 189 244 -101 9
4593 9 -592 294 -353 -363 71 -179 -673 891 244 -508 264 51 -388 -365 747 -86 -192 -460 49 79 724
4614 724 56 -230 -376 -83 313 508 68 -95 -2 578 -305 -186 110 16 167 220 415 439 69 685 599 -468
$$ packed form
4468a49j97m4M98j80pJ93L53m25q55R64j56K02k62l9m48J50n4L95Ml33M95k36
4490a31R18p15J26n28L30Q61n01k70o96M72O13l74Q8n22J76j9l65N63p1M16n0
4511C21m53J05l06L10J77o17N78PO55o11j99N35o77M89j183P84J32O70n24J97
4531C90k60j51M93n15j2M06P3j122Q91L09r97L30QL33j30J44p66L32k00R93q54
4552c05lK66P4Q28j176N82m40N02o73j6M08L03n38j61J16M44m99N44l55j67O87
4573D21l86o22N95K79o21m58J014j58j38K58j02K52j93K68l83j17K80N5l45J10
4593Io01Q86o47j0M34k50m94J564o47p52P72k13m39K3J112q33j06k68N09L0O45
4614G24o68k86j46K93L96J95m40j63R3N80q83J19K96r4J51N3J95K4l70O16q6j067
$$ plain form
4636 -468 101 -331 435 15 -105 511 -86 137 270 -595 -74 40 686 -230 -489 -281 375 448 -508 246
4656 246 565 -242 -470 124 -441 78 187 -636 -358 -211 530 29 -207 151 -67 -380 -417 60 -129 -88 -107
4677 -107 -190 460 646 -166 -78 -179 175 -14 -94 -271 -204 -995 -168 9 110 322 49 -57 -83 330 -18 596
4699 596 -318 -116 857 240 -191 35 279 -151 480 246 -211 436 -1 8 -317 431 38 370 -513 -87 646
4720 646 -157 -825 -353 204 60 206 198 -461 131 469 383 -735 -143 -548 181 239 387 -450 629 200 -161
4741 -161 332 201 296 -663 199 -81 -90 724 -179 -83 -326 -419 446 643 146 649 79 -75 -94 -112 -428 270
4763 270 -138 190 -156 -383 130 287 485 105 371 -449 -37 -532 367 347 32 363 368 207 91 465 -19
4784 -19 695 -52 -332 -908 -176 707 -165 -103 764 -375 745 -383 -400 556 380 -58 5 133 7 -67 -154
$$ packed form
4636d68N69m32P66m20j20O16n97K23J33q65N21J14O46r16k59K08O56P3r56P54
4656B46L19q07k28N94n65N19J09q23K78J47P41n01k36L58k18l13l7M77j89M1j9
4677a07q3O50J86q12Q8j01L54j89q0j77O7p91Q27J77J01K12k73j06k6M13l48O14
4699E96r14K02R73o17m31K26K44m30O31k34m57O47m37Rl25P48l93L32q83M26P33
4720F46q03o68M72N57j44J46qo59N92L38q6j118N92m05P29N8J48q37J079m29l61
4741a61M93j31R5r59Q62k80rQ14r03R6k43r3Q65J97m97N03n70j54j9j8l16O98
4763B70m08L28l46k27N13J57J98l80K66q20M12m95Q99k0l15L31Nj61j16L74m84
4784a9P14p47k80n76P32Q83q72O2Q67j139J120j128j7R56j76m38O3J28j26p4q7
$$ plain form
4805 -154 535 -359 446 253 -99 -775 209 -312 -172 -40 206 -321 486 -475 -296 532 -59 -161 264 184
4825 184 -31 192 -614 252 -9 -370 282 -230 -304 -56 -269 -103 486 360 5 -165 -316 173 -233 68
4845 68 -208 -4 -69 362 544 -126 -32 248 299 701 10 -279 53 -394 -259 152 429 362 184 -116 38 -329
4867 -329 396 399 222 240 -121 888 -1273 124 372 -740 206 -256 433 43 -5 -390 -334 70 -264 3
4887 3 257 -1083 7 30 -158 416 -256 195 296 83 -252 9 -421 599 -137 -288 -238 189 -140 -92 144
4908 144 361 411 -263 398 -144 28 -265 314 -333 483 -62 -686 -267 142 298 -503 -484 290 -106 -295 -96
4929 -96 -45 58 468 -206 -355 -371 243 -487 339 548 308 103 564 -403 401 258 42 350 -192 6 425
4950 425 405 -704 -249 -183 -194 251 -235 -231 -412 -223 -308 25 -134 -357 121 546 4 -204 -362 -502 93 -679
$$ packed form
4805a54O89q94Q05j93l52o76R84n21J40J32K46n27Q07r61J79Q28n91j02M25q0
4825A84k15K23q06Q66k61l61O52n12p4K48k13J66N89j26l55j70j51M89m06L01
4845F8k76K04o5M31J82o70R4K80N1M02o91k89L32m47J35M11K77o7j78l00J54l67
4867c29P25Lj77J8l61J009k161J397K48j112R46m62O89l90m8l85N6M04l34K67
4887CK54j340J090K3j88N74o72M51J01k13l35K61m30J020p36j51N0M27l29M8K36
4908A44K17N0o74O61n42J72k93N79o47Q16n45o24M19M09J56q01J9P74l96j89J99
4929i6N1J03M10o74j49j6O14p30Q26K09k40k05M61r67Q04j43k16L08n42J98M19
4950D25k0j109M55O6j1M45m86Mj81J89q5L33j59k23M78M25n42k08j58j40N95p72
$$ plain form
4972 -679 523 -181 -283 -166 77 -245 -34 -390 27 -374 167 -109 -389 -180 -295 -136 -156 22 -144 46
4992 46 -181 184 -220 -620 -34 -70 165 336 76 109 -367 -233 132 -241 -424 45 96 92 149 -49 100 236
5014 236 -266 -307 490 369 159 306 -664 167 126 191 -68 809 281 161 -171 -282 755 -6 130 -236 558
5035 558 -55 138 86 -241 -182 94 -492 502 -107 -266 125 100 -424 482 -40 -282 83 37 -19 112 16 138
5057 138 -514 -367 -124 286 502 -254 -295 -194 290 -66 32 -95 220 229 53 162 -455 -77 -52 154 34 -139
5079 -139 141 -145 162 -409 -267 128 -61 118 -24 -130 -265 -41 -323 50 -465 -83 174 -415 -69 217
5099 217 269 59 69 -248 -187 33 -18 -125 508 -78 266 -74 316 -84 496 121 -24 -10 84 -53 225 -74
5121 -74 322 35 160 77 59 -187 -484 320 -328 -118 375 310 403 -6 -13 93 -28 -376 62 -107 65 -206
$$ packed form
4972f79J202p04j02J17K43l22K11l56M17m01N41k76k80K09j15J59k0J78j66J90
4992D6k27L65m04m00N86l6K35J71k60L3m76J34L65l73j83M69N1mN7j98J49J36
5014B36n02m1P97j21k10J47r70Q31m1O5k59Q77n28j20l32j11J037p61J36l66P94
5035E58o13J93n2l27N9K76n86R94o09j59L91k5n24R06n22k42L65m6n6J31r6J22
5057A38o52J47K43M10K16p56m1J01M84l56R8j27L15Rj76J09o17L78K5K06j20j73
5079a39K80k86L07n71J42L95j89J79j42j06j35K24k82L73n15L82K57n89L46K86
5099B17N2k10J0l17O1K20n1j07O33n86L44l40L90m00N80l75j45J4R4j37K78k99
5121g4L96k87J25q3j8k46k97Q04o48K10M93o5R3m09pJ06j21l48M38j69J72k71
$$ plain form
5143 -206 101 214 -8 -177 260 -115 99 188 -326 -239 217 135 -212 -255 322 -22 393 -246 -21 -247 -59
5164 -59 81 -259 -446 390 37 -127 -232 -79 -242 -255 45 246 83 -34 -312 -454 -67 110 490 51 60
5185 60 106 168 69 66 -141 112 260 146 266 -196 96 -219 -354 -63 -99 -125 -148 -37 183 -37 404 174 -192
5208 -192 335 357 4 -149 33 137 244 -89 -17 20 115 263 85 -235 480 -21 77 215 -157 -200 63 247
5230 247 242 -134 375 -264 161 543 99 -402 -53 103 2 111 -140 -150 168 49 -16 317 -296 260 -477
5251 -477 39 50 -133 -271 -13 200 -71 -153 20 -180 -109 -176 -109 96 -162 -138 -243 103 -131 -53 129 126 -74
5274 -74 184 54 -110 103 -86 -6 -148 -280 576 42 129 -144 166 -60 7 -237 -367 40 206 0 17 -312
5296 -312 259 57 86 -57 -24 -367 309 -153 -189 -274 11 -38 -174 86 89 189 -291 431 106 540 -296 -237 -185
$$ packed form
5143b06L07J13k22j69M37l75K14Q9n14Q7M56q2l47m3N77l44M15o39K25k26J88
5164e9J40l40j87Q36l53j64j05J53j63j3L00K01j63j17k78j42L87J77L80m39R
5185F0M6O2r9lk07K53J48j14J20m62K92l15j35K91l6k6k3J11K20k20M41k30l66
5208a92N27K2l53j53J82J04J07l33P2L7R5J48j78l20P15n01R8J38l72m3K63J84
5230B47nl76N09o39M25L82m44n01L49J56j01J09k51j0L18j19o5L33o13N56p37
5251d77N16J1j83j38K58K13k71q2J73k00P1o7O7K05k58K4j05L46k34P8J82lk00
5274g4K58j30j64K13j89Q0j42j32Q56n34Q7k73L10k26O7k44j30M07J66k06J7l29
5296c12N71k02K9j43L3l43O76m62l6q5K85m9j36K60LJ00m80P22l25M34q36N9N2
$$ plain form
5319 -185 59 81 -212 -112 144 -118 61 -1 103 -67 -202 100 12 100 -76 -106 -98 -36 -247 114 -137 117 83
5342 83 -17 -223 -512 -395 59 275 103 236 82 -16 50 -165 -44 -120 -43 -222 72 105 17 -325 5 246
5364 246 151 249 -101 182 179 72 -205 228 239 -147 206 -268 1 297 146 328 -332 95 -57 131 -121 -149
$$ packed form
5319a85K44K2k93J00K56k62J79o2J04j70j35L02q8Q8j76l0QO2k11L61k51K54l4
5342H3j00k06k89J17M54K16j72J33j54r8O6k15J21p6P7j79K94L3q8l42L30K41
5364B46r5R8l50K83lj07k77M33J1l86L53m74K69K96j51J82o60M27j52J88k52k8
$$ [...]
8191d2
##END NTUPLES=NMR FID
##END=
