##TITLE=1H_Pr Glu Cl22
 CCl4, 8 sc, 
 23.9.2020
##JCAMPDX= 6.0         $$ Bruker NMR JCAMP-DX V2.0
##DATA TYPE= NMR FID
##DATA CLASS= NTUPLES
##ORIGIN= UXNMR, Bruker Analytische Messtechnik GmbH
##OWNER= root
$$ XWIN-NMR		Version 3.5
$$ Wed Sep 23 09:48:31 2020 Russian Standard Time (UT+4h)  she@DPX200
##.OBSERVE FREQUENCY= 200.1315066352
##.OBSERVE NUCLEUS= ^1H
##.DELAY= (6, 6)
##.ACQUISITION MODE= SIMULTANEOUS
##.ACQUISITION SCHEME= undefined
##.AVERAGES= 8
##.DIGITISER RES= 18
##SPECTROMETER/DATA SYSTEM= spect
##.PULSE SEQUENCE= zg30
##.SOLVENT NAME= CDCl3
##.SHIFT REFERENCE= (INTERNAL, CDCl3, 0, 15.7039)
##AUDIT TRAIL= $$ (NUMBER, WHEN, WHO, WHERE, WHAT)
$$ ##TITLE= Audit trail, XWIN-NMR		Version 3.5
$$ ##JCAMPDX= 5.01
$$ ##ORIGIN= Bruker BioSpin GmbH
$$ ##OWNER= she
$$ F:/spectra/data/she/nmr/H-F/1/audita.txt
$$ ##AUDIT TRAIL=  $$ (NUMBER, WHEN, WHO, WHERE, WHAT)
(   1,<2020-09-23 09:47:31.96 +0400>,<she>,<DPX200>,
      <created by zg, POWCHK disabled, PULCHK disabled
       configuration hash MD5:
       00 E9 B6 7A A2 85 ED C7 34 08 36 98 17 FE 4E 26
       data hash MD5: 16K
       C7 09 5F 6B 81 81 FB 33 43 93 3C E3 3F C9 93 8A>)
$$ ##END=
$$ 
$$ hash MD5
$$ 0B A7 7C EC 81 68 FE 11 03 8E 7D 75 AF 94 92 61
##$RELAX= 
##$RELAX= 
##$RELAX= 
##$RELAX= 
##$RELAX= 
##$RELAX= 
$$ Bruker specific parameters
$$ --------------------------
##$DU= <F:/spectra>
##$EXPNO= 1
##$NAME= <H-F>
##$PROCNO= 1
##$TYPE= <nmr>
##$USER= <she>
##$AMP= (0..31)
100 100 100 100 100 100 100 100 100 100 100 100 100 100 100 100 100 100 
100 100 100 100 100 100 100 100 100 100 100 100 100 100 
##$AQSEQ= 0
##$AQ_mod= 1
##$AUNM= <au_zg>
##$AUTOPOS= <>
##$BF1= 200.13
##$BF2= 200.13
##$BF3= 200.13
##$BF4= 200.13
##$BF5= 200.13
##$BF6= 200.13
##$BF7= 200.13
##$BF8= 200.13
##$BYTORDA= 1
##$CFDGTYP= 0
##$CFRGTYP= 5
##$CHEMSTR= <none>
##$CNST= (0..31)
1 1 145 1 1 1 1 1 1 1 1 1 1 1 1 1 1 1 1 1 1 1 1 1 1 1 1 1 1 1 1 1 
##$CPDPRG= <>
##$CPDPRG1= <>
##$CPDPRG2= <>
##$CPDPRG3= <>
##$CPDPRG4= <mlev>
##$CPDPRG5= <mlev>
##$CPDPRG6= <mlev>
##$CPDPRG7= <mlev>
##$CPDPRG8= <mlev>
##$CPDPRGB= <>
##$CPDPRGT= <>
##$D= (0..31)
0 1.2 0 0 0 0 0 0 0 0.06 0 0.03 0 0 0 0 0.0002 0 0 0 0 0 0 0 0 0 0 0 0 
0 0 0 
##$DATE= 1600840051
##$DBL= (0..7)
120 120 120 120 120 120 120 120 
##$DBP= (0..7)
150 150 150 150 150 150 150 150 
##$DBP07= 0
##$DBPNAM0= <>
##$DBPNAM1= <>
##$DBPNAM2= <>
##$DBPNAM3= <>
##$DBPNAM4= <>
##$DBPNAM5= <>
##$DBPNAM6= <>
##$DBPNAM7= <>
##$DBPOAL= (0..7)
0.5 0.5 0.5 0.5 0.5 0.5 0.5 0.5 
##$DBPOFFS= (0..7)
0 0 0 0 0 0 0 0 
##$DE= 6
##$DECBNUC= <off>
##$DECIM= 32
##$DECNUC= <off>
##$DECSTAT= 4
##$DIGMOD= 1
##$DIGTYP= 9
##$DL= (0..7)
0 120 120 120 120 120 120 120 
##$DP= (0..7)
150 150 150 150 150 150 150 150 
##$DP07= 0
##$DPNAME0= <>
##$DPNAME1= <>
##$DPNAME2= <>
##$DPNAME3= <>
##$DPNAME4= <>
##$DPNAME5= <>
##$DPNAME6= <>
##$DPNAME7= <>
##$DPOAL= (0..7)
0.5 0.5 0.5 0.5 0.5 0.5 0.5 0.5 
##$DPOFFS= (0..7)
0 0 0 0 0 0 0 0 
##$DQDMODE= 0
##$DR= 18
##$DS= 0
##$DSLIST= <SSSSSSSSSSSSSSS>
$$ [...]
##$SUBNAM2= <"">
##$SUBNAM3= <"">
##$SUBNAM4= <"">
##$SUBNAM5= <"">
##$SUBNAM6= <"">
##$SUBNAM7= <"">
##$SUBNAM8= <"">
##$SUBNAM9= <"">
##$SW= 16.880792210976
##$SWIBOX= (0..15)
0 0 2 0 0 0 0 0 0 0 0 0 0 0 0 0 
##$SW_h= 3378.37837837838
##$TD= 16384
##$TD0= 1
##$TE= 0
##$TE2= 300
##$TE3= 300
##$TEG= 300
##$TL= (0..7)
0 120 120 120 120 120 120 120 
##$TP= (0..7)
150 150 150 150 150 150 150 150 
##$TP07= 0
##$TPNAME0= <>
##$TPNAME1= <>
##$TPNAME2= <>
##$TPNAME3= <>
##$TPNAME4= <>
##$TPNAME5= <>
##$TPNAME6= <>
##$TPNAME7= <>
##$TPOAL= (0..7)
0.5 0.5 0.5 0.5 0.5 0.5 0.5 0.5 
##$TPOFFS= (0..7)
0 0 0 0 0 0 0 0 
##$TUNHIN= 0
##$TUNHOUT= 0
##$TUNXOUT= 0
##$USERA1= <user>
##$USERA2= <user>
##$USERA3= <user>
##$USERA4= <user>
##$USERA5= <user>
##$V9= 5
##$VALIST= <valist>
##$VCLIST= <CCCCCCCCCCCCCCC>
##$VD= 0
##$VDLIST= <DDDDDDDDDDDDDDD>
##$VPLIST= <PPPPPPPPPPPPPPP>
##$VTLIST= <TTTTTTTTTTTTTTT>
##$WBST= 1024
##$WBSW= 4
##$XGAIN= (0..3)
0 0 0 0 
##$XL= 0
##$YL= 0
##$YMAX_a= 222607
##$YMIN_a= -203056
##$ZGOPTNS= <>
##$ZL1= 120
##$ZL2= 120
##$ZL3= 120
##$ZL4= 120
##$ABSF1= 10
##$ABSF2= 0
##$ABSG= 5
##$ABSL= 3
##$ALPHA= 0
##$AQORDER= 0
##$ASSFAC= 0
##$ASSFACI= 0
##$ASSFACX= 0
##$ASSWID= 0
##$AUNMP= <proc_1d>
##$AZFE= 0.1
##$AZFW= 0.1
##$BCFW= 1
##$BC_mod= 2
##$BYTORDP= 1
##$COROFFS= 0
##$CY= 11.3945322036743
##$DATMOD= 1
##$DC= 2
##$DFILT= <>
##$DTYPP= 0
##$F1P= 16.9975609425685
##$F2P= -3.02152046262296
##$FCOR= 0.5
##$FTSIZE= 0
##$FT_mod= 4
##$GAMMA= 1
##$GB= 0.15
##$INTBC= 1
##$INTSCL= 1
##$ISEN= 128
##$LB= 0.24
##$LEV0= 0
##$LPBIN= 0
##$MAXI= 10000
##$MC2= 0
##$MEAN= 0
##$ME_mod= 0
##$MI= 1.114404
##$NCOEF= 0
##$NC_proc= 0
##$NLEV= 6
##$NOISF1= 3.799351
##$NOISF2= 2.8
##$NSP= 1
##$NTH_PI= 0
##$NZP= 0
##$OFFSET= 15.70392
##$PC= 1
##$PHC0= -9974.427
##$PHC1= 17.4009
##$PH_mod= 1
##$PKNL= yes
##$PPARMOD= 0
##$PSCAL= 0
##$PSIGN= 0
##$REVERSE= no
##$SF= 200.130013532006
##$SI= 16384
##$SIGF1= 3
##$SIGF2= 2
##$SINO= 400
##$SIOLD= 16384
##$SREGLST= <1H.CDCl3>
##$SSB= 0
##$STSI= 0
##$STSR= 0
##$SW_p= 3612.71676300578
##$SYMM= 0
##$S_DEV= 0
##$TDeff= 0
##$TDoff= 0
##$TI= <>
##$TILT= no
##$TM1= 0
##$TM2= 0
##$TOPLEV= 0
##$USERP1= <user>
##$USERP2= <user>
##$USERP3= <user>
##$USERP4= <user>
##$USERP5= <user>
##$WDW= 1
##$XDIM= 8192
##$YMAX_p= 0
##$YMIN_p= 0
$$ End of Bruker specific parameters
$$ ---------------------------------
##NTUPLES= NMR FID
##VAR_NAME=  TIME,          FID/REAL,        FID/IMAG
##SYMBOL=    X,             R,               I
##VAR_TYPE=  INDEPENDENT,   DEPENDENT,       DEPENDENT
##VAR_FORM=  AFFN,          ASDF,            ASDF
##VAR_DIM=   8192,          8192,            8192
##UNITS=     SECONDS,       ARBITRARY UNITS, ARBITRARY UNITS
##FACTOR=    0.000296,      1,               1
##FIRST=     0,             0,               0
##LAST=      2.424536,      0,               0
##MIN=       0,             -203056,         0
##MAX=       2.424536,      222607,          0
$$ Real data points
##PAGE= N=1
##DATA TABLE= (X++(R..R)), XYDATA
$$ [...]
1723f1q5M09l68N9j52R5K56j17J25Ql92L99J68k80O0j75j95M00j77j83L03j69
1745g2J18K6k2J45k32n5K12k48R0k9J01j46J23p6K20j27j44K50k05K23K41m41
1767d8Rl4k33J84o9J89l2K8j23M04k79J1J27l12J60J5q0N7r9j59n3M28j14J36
1791A13k81J03J42j74J69K32n01L42o2n5K23l75J98k7K0J75k39k72L31j11j79
1812b28M38k72O7R9l75M05n5k79L29k90O8M3J24p6J64l78J88Q7k16K37l49J90
1834g9R2m6J5J56k89o1M37j88Q0J15j20J0j71J00N4m62L99P4j81J48K1j25J44
1857A23l84L03r0j62K92J16k61l7L85m55M89k06j74K75l38J77K8j47K00j40j70
1878a76L08n8n19O40m51K5N67m50K2K49j23Q5p9l31N02m27o3N51l68j45N71o21
$$ plain form
1723 -61 -146 263 -105 -46 -198 -103 153 36 161 169 -223 176 344 64 124 -51 -246 154 -23 -206 97 -72
1745 -72 46 72 50 195 -37 -92 120 -128 -38 -67 34 -112 11 -65 155 28 -116 134 -71 152 393 -48
1767 -48 -39 -73 -306 -122 -191 -2 -34 -6 -129 275 -4 7 134 -178 -18 -3 -83 -26 -125 -284 -337 91 -23 113
1791 113 -168 -65 77 -97 72 304 -197 145 83 28 251 -124 74 47 67 242 3 -269 62 -49 -228
1812 -228 210 -62 5 104 -271 134 79 -200 129 -161 -93 -50 74 -2 162 -216 -28 59 -157 80 -269 -79
1834 -79 13 -33 -18 138 -151 -212 225 37 117 232 112 122 -49 51 105 -357 42 116 -65 83 104 -21 123
1857 123 -261 42 -48 -210 82 198 -63 -100 285 -170 319 113 -61 214 -124 53 81 -66 134 -6 -176
1878 -176 132 74 -445 195 -256 -231 336 -114 -92 157 34 119 40 -291 211 -216 -279 272 -96 -241 330 -291
1900b91K66J94m40Q34o19J44m3m22L78J58m88M07J58j21K09k84k66N73o02P3M25
1921B43m59N86k07m36K03p3O9K72l21NL08k12J01Q0l47L64L6q02P48m33K63K60
1943B48n92M90K4l08J0K76n84O60k54l18O31o84L75L66p11N69j29j41L55l42j91
1964b50L35l81K85L08m48L63j5n07M74m49l0P37l2k65J01l08K05O3k50m0K36l01
1986a69J10K29r8O2m51O64Q6n38O29l22l30K94p4o9L81n54K04J71o71P73l13l30
2008c16Q42n98j58L55k83J42J04j76L96l23k02J76K3q3L30j74k48M27n29M71j37
2029C9l30O73m85J55J89k52j53J07L5J06Q2m91N68j71k56L78o05M43K24n32J90
2050h6J16l2P6n24P6P35m45r0M55m17J86J11l33K71q4k17N46m35R9Q0l65J58K13
$$ plain form
1900 -291 -25 169 -271 563 -56 88 45 -377 1 159 -329 78 236 115 324 40 -226 347 -255 -182 243
1921 243 -216 370 163 -273 -70 -143 -74 198 -123 -118 190 -22 79 159 -188 176 212 -590 158 -275 -12 248
1943 248 -344 146 170 -138 -128 148 -436 224 -30 -348 283 -401 -26 340 -371 198 69 -72 283 -59 -250
1964 -250 85 -296 -11 297 -151 212 197 -310 164 -285 -315 422 390 125 226 -82 123 186 -64 -104 132 -169
1986 -169 -59 170 72 134 -317 347 433 -105 524 202 -128 166 92 23 404 -150 54 225 -446 327 14 -316
2008 -316 526 -72 -230 125 -158 -16 88 -88 308 -15 -217 -41 -18 -101 229 55 -193 234 -295 176 39
2029 39 -291 382 -103 52 241 -11 -164 -57 -22 84 166 -325 243 72 -184 194 -411 32 256 -276 -86
2050 -86 30 -2 74 -450 -374 361 -84 -174 281 -136 50 161 -172 99 15 -202 344 -91 8 88 -277 -119 94
2073I4k21L88o2m00K10Oo0K17k71K00J84m24K02p9K5q6K6n7L21j78k54L22j68
2096f5J12j8J0J04l30K4M60j79p3J01m55M43l02L35L9j90l78K46J11j27K91m13
2118b54M02p5j74Q0j13PL1j22J75J7k39J30K45k41K86lk12L21k76rJ05p8m4k7
2142f8J46RN7j07j41O7P7j31J15k9p5k06L25j76j43L38k07n2L80j18l6o0J01k02
2166a36J60j33K19j47J0j3K68k1k44L11J17P37r05K28o54M82l96o7M86M07j168
2187d59O29o36L88m84L91J25K20o31M79P1j65J48l04K49J42j04M87k21K92q80
2207b63N65l95K92j8K96k43n23N26L88p93j35L1o4L21L78j60o79M48K86n44O65
2228C79k63k38N5M59l99O2L43j09j56j86oJ21m6l68K18L8r3J43L2j97L1K83p0
$$ plain form
2073 94 -127 261 199 -201 9 15 -45 172 -99 101 285 -139 63 -16 9 -77 -51 -108 213 35 -219 103 -65
2096 -65 47 29 39 143 -187 -163 297 118 45 146 -309 134 -168 167 206 16 -362 -116 -5 -132 159 -254
2118 -254 148 73 -101 -21 -134 -127 -96 -218 -43 -26 -265 -135 110 -131 155 152 -60 261 -15 -24 81 3 -41 -68
2142 -68 78 87 144 37 -104 -37 40 -91 24 -5 -80 -286 39 -137 -280 58 -149 -201 179 61 25 -35 66 -136
2166 -136 24 -109 110 -37 -27 -40 228 207 -37 274 391 1128 223 451 -203 279 -117 -184 302 709 -459
2187 -459 170 -466 -78 -562 -171 -46 174 -457 22 93 -72 76 -228 21 163 59 546 325 617 -263
2207 -263 302 -93 199 181 477 234 -289 237 625 -168 -303 -272 -336 -15 363 203 -476 -28 258 -286 379
2228 379 116 -122 -67 392 -7 55 398 289 133 -53 -59 62 16 -352 -134 -96 -189 -46 -14 -211 -180 103 33
2251C3O5k12M52m43N2k2K10Q86j157J54q1J49j06J58Jl77K33R9j04K8Q6j44J26
2274H6j4R9m8n9lJ96j65k1Qp6M5j03J87l29K9K2M36j63n0k79K42l4q8J69m3k63
2300b19J90L49l35pJ54l85K37P2K4J08j02J24n34J49M09n31K29Q4n8r4K07J4K4
2323A09K0q1j49L7J70k56J13J0P3M2p9j6k51K66M4J09k38J47k24L15J55l80J53
2346H9n5k55Q4j75J78K71k53L70o1k93j95L57m1L44l85J84o2k07n3L55k97K91
2368A91j62j44J07rj60J35j29J66K7NJ17j73J80m9l78K07o0R0J48n3L9j85K00
2391A10l38K3L30K6k22q6J92K20k08k35J56J8q4J4K04k0j76J99J3l5j04J58k95
2414a40Q4N2r5J51L2j74J16O4R1n0j45K15j43J13q5o4P2l22k4L09k51J45o5pR3
$$ plain form
2251 33 98 -114 338 -105 -53 -75 135 1021 -136 18 -63 86 -20 138 139 -238 -5 94 -10 18 104 -40 86
2274 86 72 171 123 64 61 257 92 71 79 3 48 -55 132 -197 -168 -146 290 127 77 -202 40 6 -82 87 44 -219
2300 -219 -29 320 -15 -22 132 -253 -16 56 80 188 86 210 -324 -175 234 -297 -68 16 -42 -136 71 85 109
2323 109 129 48 -101 -64 106 -150 -37 -27 46 88 9 -7 -258 8 52 161 -77 70 -154 161 316 -64 89
2346 89 34 -221 -137 -312 -134 137 -116 254 193 -100 -295 62 21 365 -20 164 102 -105 -158 197 -100 191
2368 191 29 -115 -8 -17 -177 -42 -171 -5 22 27 144 -29 151 102 -276 -69 -129 -39 109 56 95 -90 110
2391 110 -228 -205 125 151 -71 -157 35 255 47 -188 -32 -14 -98 -84 120 100 -76 123 136 101 -3 155 -140
2414 -140 -56 -4 -99 52 84 -90 26 90 181 131 -14 201 58 171 86 22 94 -228 -252 57 -194 -49 -114 -121 -28
2439b8R0n0j57J36j65R2K76j6L7l15J78J10j90J16j25p0k19M93l15K60o2j45k9
2462i8l9J55o0J49j58M0K28k77K04j62O3n2k30K70k0j93j2K18k41J85k0K97k05
2485D2K35o1j21l7p3J42q9k9O9j01P6k13K16k30L01j45j50JJ59J58j05o8nj71
2509a99J30N5J11j39J83k9p1j16J1N2n8NJ22J27k05n3K4J57j17j13O5K21k33L5
2533c5J31j83Q2%q6K33o0j35K30k20r8n2J32K74k86Mn4J46K53k65K3l9J01j5l83
2558c02J96R2N9l80L17k1J21j01J19j96K89k71J47k0j49J10m7J26r9K2j98M55
2580B69l96J87j46J04Q9k57J74R3j66K31K7o8j15kj34M5O6K3r2k21r2N79j35p8
2604a5q9O5J7J76j94J69l1k9M0j65P7Q6j42J40J05k77k0J84m3j46J59j40J63k61
$$ plain form
2439 -28 62 12 -145 -9 -174 -82 194 178 215 -100 78 188 -2 114 -11 -81 -300 193 -122 138 76 -69 -98
2462 -98 -137 18 -42 107 -51 -11 217 -60 144 -18 45 -7 -237 33 13 -180 -192 26 -215 -30 -50 247 42
2485 42 277 216 95 58 -15 127 38 9 78 -23 53 -160 56 -174 127 -18 -168 -167 -8 150 45 -23 -28 -199
2509 -199 -69 -14 97 -42 141 112 41 -75 -64 -12 -70 -65 57 184 -21 -74 -50 107 -10 -123 -58 163 -70 -35
2533 -35 96 -87 -5 -5 -91 142 82 -53 177 -43 -141 -193 -61 213 -73 -69 -123 23 276 11 34 -5 96 81 -302
2558 -302 -106 -14 45 -335 -18 -39 82 -19 100 -96 193 -78 69 49 -100 10 -37 89 -10 12 -186 269
2580 269 -127 60 -86 18 107 -150 24 117 -49 182 209 141 26 24 -110 -65 1 24 -68 -289 -381 198 63 -15
2604 -15 -104 -39 -22 154 -40 129 98 69 109 -56 21 107 -35 105 210 -67 -87 97 54 -92 67 -73 90 -171
2628a71J77J37j75J10K4j82j2j5P5J68l5L1j89J02l1j04J10J72j62R5l10K13n3
2651b5l36L43k9J11p2J29J10l84J29ok18J74Q0l7p0k9l7j95J81K7P9J7J87k43
2675a14J63j19J61j09k2J56j0k40K71O8k38N4j66K02m11O61j37j31N5p6lK18k86
2698e3O4J39j9j82o5K26j15N4N6j99jL0K3J6o3N1K82j18m2L22l11k16n3J82J63
2723A71o5O9j41k85K82J56k54K06N5j17Pr0N2j82J13R6k11J71q8R1o1L49m65J13
2747b8lJ8o7J25K45l49J41l11J91n6J06OJ12k29J34R0l98J88J34l3J75j6j89j20
2771a34K52J4k07L5L4Pl5J52j51L0J51n2l63J25J87J72k48lR9k36K06Jj77K57
2795A16M3k26K20k01lM3j21OJ78Q1k06L02o9k44R0J29j05j1K17l41J78k5kl23
$$ plain form
2628 -171 6 143 -32 78 102 -80 -92 -107 -32 136 101 132 -57 45 14 -90 20 192 30 125 -185 28 -25
2651 -25 -361 -18 -47 64 -8 121 231 -153 -24 -30 -248 -74 6 -31 -101 -130 -167 -362 -181 -154 -75 -58 129 -114
2675 -114 49 -70 91 -18 -40 116 106 -134 137 205 -33 21 -145 57 -354 307 170 39 94 18 15 233 -53
2698 -53 11 150 131 -51 -116 110 -5 49 105 -94 -95 -65 -42 -26 -89 -38 244 126 84 406 95 -121 -174 8 171
2723 171 106 175 34 -251 31 187 -67 139 194 77 84 -6 46 -136 -23 73 -138 33 -55 36 -25 324 -141 -28
2747 -28 -31 -13 -80 45 290 -59 82 -229 -38 -94 12 18 130 -99 35 125 -273 -85 49 16 191 175 -14 -134
2771 -134 118 132 -75 -40 -6 1 -34 118 -33 -3 148 96 -267 -142 45 217 -31 -34 65 -171 35 36 -141 116
2795 116 159 -67 153 -48 -51 -8 -129 -123 55 136 -70 232 163 -81 9 138 33 22 239 -102 76 51 49 -274
2819b74K68k5O6k9j25J69j09L4K93j43n6k05K70l13K13k50J26l8J87p5j72J46
2841d2R7j86K01k64K12j40N0J04K2J43j1o9l26P4K72o9n8MM9K3J39m19P9p3N3
2866a35N9P9J24r6J92Q9j43k60K73Pk49J59j58J7qm3K84Q9l83K98p1k28J95r2
2890aO3Q0l27K01J95j34Q4K2l86L30j47m6R6N8j35K6Q2L2k23j77M59j25RL8nL5
2916A04r2J80l45J03K4N0L6N6k83M14k89J12l7p7K88l75K81j78M4j46J06L7L05
2939C18n66M86l82J93j12J28q6J50L8j96n4J18j92K41k0k60L54j18j3j58J38Q6
2961I3p6k2j83j59O05n22K09J33j30K9J92k02K00M8l79J76J44j08j08j1k9L6K4
2984d0m2j23j60K74K42k40K18m24K41O3k9J47m9N8n4J53k36N0j31J8K26k97r7
$$ plain form
2819 -274 -6 -31 35 6 -119 50 -59 -25 268 125 69 -136 134 -179 34 -216 -90 -128 59 -16 -188 -42
2841 -42 55 -131 70 -194 18 -122 -72 32 54 197 186 117 -209 -135 137 68 10 14 63 86 225 -194 -115 -188 -135
2866 -135 -76 3 127 31 223 312 169 -91 182 189 -60 99 -59 -42 -50 -93 191 280 -103 195 124 -104 91 -1
2890 -1 62 142 -185 16 211 77 161 183 -203 127 -20 -66 30 88 -47 -21 61 93 -130 -307 152 27 36 74 69 104
2916 104 12 192 -153 -50 -26 24 60 116 -167 247 -42 70 33 -44 244 -131 150 -28 16 -130 -24 13 318
2939 318 -248 238 -144 49 -63 65 -21 129 167 -29 -83 35 -157 84 64 -196 158 40 27 -131 7 93
2961 93 17 -5 -188 -347 258 -264 -55 78 -52 -23 169 -33 167 215 -164 12 156 48 -60 -71 -100 -64 -40
2984 -40 -82 -205 -365 -91 151 -89 129 -295 -54 9 -20 127 78 136 82 235 -1 49 -82 -64 162 -135 -232
3007b32K30J42j99J00L0L3kk72K17L3Jj47K37p5Lj38l5J23Q2o9J29j67m5Q6j33
3032f8K31k91K9K7l2K39r4k40L72j37o7j13J29j8L61k85j11L9j15J48j31Q2K7
3055a8k28K71m3k8o3j38M5R1j8P3J8k85K60j21K33Q6j58j16K30K62l24J13l19
3078a77K33Ok1k8J79k6j68j79L58P9m25q1N6N12J97q52M92q83O21n00q8R74k33
3101D6j21K8j58K67Q9n4q5q5K44k02r1J75lk4k2k62K22lK26K6n5m22K97j03J2
3126e8M2p0J07OJ9p2k2l4J74o0j44MpK76m7j99J74k86K75%p1p8K6J36k75K50P0
3153A36n1J27j10l0m2l5K05j96p2J15mJ0nO9o1M4M9r7k8J88l50n6J45mk7O8Q8
3180G6J68q0k36J26R8j1k37k9J42n0m2J43j15k34L38K50k57j74J06o0P1j11R1
$$ plain form
3007 -232 -2 140 -59 41 71 104 102 -170 47 80 81 -66 171 96 99 -39 -74 49 131 62 191 24 -21 65 -68
3032 -68 163 -128 -99 -72 -104 135 41 -199 173 36 -31 -144 -15 -33 328 43 -68 -29 -144 4 -127 -45 -18
3055 -18 -246 25 -18 -46 -109 -247 -202 -111 -129 -56 -38 -323 -63 -184 49 135 -23 -139 91 353 29 142 -177
3078 -177 56 62 41 13 192 166 -2 -181 177 256 -169 -250 -194 318 515 -337 155 -728 -107 -607 -695 279 46
3101 46 -75 -47 -205 62 151 97 12 -73 171 -31 -122 53 50 26 4 -258 -36 -39 187 213 158 -264 33 -70 -58
3126 -58 -16 -86 21 27 46 -26 -48 -82 92 32 -112 -108 -115 161 114 -85 89 -197 78 78 7 -71 -45 91 -184 66 136
3153 136 85 212 102 72 30 -5 200 4 -68 47 43 53 48 117 56 100 149 52 24 212 -138 -194 -49 -53 -80 -12 76
3180 76 244 164 -72 54 152 141 -96 -125 17 -33 -75 68 -47 -281 57 307 50 -124 -18 -78 -7 -118 -27
3203b7P0r1k8N0K8j57K2O5Q0k5K2n5J60m09K60k36O0J28l8K69j21MK1o5P9o5l32
3230c31L50j80l0K94k60m5J64k1K7n2L46p7o0k47J58n0P7j7k7j55L25l12k95K59
3254a59JJ43j47J81j36K42q0R3l44K46M5k82M15o30M50k1K19k25k68L55N3l08
3276a57L50l43oO2J61j97m7K76k34m7j64L40p1n5j24L83j36l5L8J86j31J28k56
3299g9m9K65j29J73m00L23j58KJ28j75K26k65L02p0K72l08K6l1m2K06j86M4J93
3322B68k12k97K71o5O5K71j52k19K06Oj96O0J48j75O7k52J25P5n9K8m8K63m6k35
3346a03R6%J08j81p2P1J06M9j28K1j65K61j09p4%J7J6J14j45j1mK89j96l9j05
3371a84K45k20J23R8p2P9j58N1J70j49k20L42Pj29j03L17l96N74l06k05K7r1L55
$$ plain form
3203 -27 43 -48 -76 -26 2 -155 -133 -68 12 -13 9 -46 114 -295 -35 -271 -211 -83 -121 148 27 31 52 -13 66 1 -331
3230 -331 19 -161 -191 103 -157 -202 -38 -59 -32 -84 262 185 125 -122 36 -14 63 46 19 -136 189 -123 -418 -159
3254 -159 -158 -15 -162 19 -117 125 45 138 -206 40 85 -197 218 -412 38 17 236 11 -257 98 151 -157
3276 -157 193 -150 -156 -94 67 -130 -177 99 -135 -182 -346 -6 -77 -132 -256 127 -9 -44 -6 180 49 177 -79
3299 -79 -128 137 8 181 -219 104 -54 -52 76 -99 127 -138 164 94 366 58 84 53 11 217 31 75 268
3322 268 56 -241 30 -35 30 301 149 -70 136 142 -54 6 154 -21 46 -206 -81 -6 -65 -37 -85 178 132 -103
3346 -103 -7 -7 101 -80 -152 -81 25 74 -54 -33 -198 63 -46 -120 -120 -103 -87 27 -118 -129 -133 156 -40 -79 -184
3371 -184 61 -159 -36 62 -10 69 -89 -38 132 -17 -237 105 112 -17 -120 197 -199 375 69 -136 -109 -200 155
3394A55l21P1n2P4J34N3l72M3Q5O6k2K33k51Q7R1j35o3k85N73r3R2j28k4n7K04
3419A58k27J62M5O7l44o2K36j36K47k76J54K88m02N0j72J30r8K01M1j7k16L88
3441B17j84j99P9L2R9k91J56M8K14P2l46K77l38R1J7Q3j37K50j67K02j53Q7j77
3464f8r2J84K8j46J03j63J26OM5J97j78q8J42l3J8J11m01J38k7K84k29k1K48q1
3488A03m7m3k40Q4J34j01K8o1LQ3J26n7j19J34k4Q6j9n5j23J46K63k95K8R1j12
3513A3l3J75o8k35M5Q9J20j6K5j03K25k65J62J49j63l32K87j2O7l43J92L70k45
3536A04k19J17j70J70J32l29J27L61k68q5J36j80M5Q7k25J78k35L48mk23j93R9
3558b27L05K2ppJ19j4j36o0M1J59k48O1JM3L55m82K26k26N9k38J15K30j36J14
$$ plain form
3394 155 -166 -95 -147 -73 61 114 -258 -215 -130 -64 -86 147 -104 -17 74 -61 -124 -409 164 71 163 35 11 -46 158
3419 158 -69 93 138 205 -139 -201 35 -101 146 -130 24 312 -90 -40 -212 -82 -180 21 62 45 -171 217
3441 217 33 -166 -87 -55 44 -247 -91 -43 171 243 -103 174 -164 -73 -56 27 -110 140 -27 175 22 109 -68
3464 -68 -160 24 52 -94 9 -154 -28 -22 23 220 42 -46 96 63 81 192 -209 -71 -98 186 -43 -64 184 103
3488 103 56 13 -227 -143 -9 -110 -82 -143 -140 -57 69 12 -107 27 3 89 70 15 -108 38 301 6 34 125 13
3513 13 -20 155 87 -148 -103 -14 106 90 115 12 237 -28 134 283 120 -212 75 63 130 -213 -21 349 104
3536 104 -115 2 -168 2 134 -195 -68 293 25 -60 76 -104 -59 28 -197 -19 -254 94 90 -133 -326 -227
3558 -227 78 100 93 86 205 191 55 -5 36 195 -53 8 9 52 407 -75 151 -75 -16 -254 -139 91 -45 69
3582F9k2k21M00r6n4M0k01k29K13J30k13P9K40p9rk2o0J43m7J34j46j33K17j56
3606b3j08J21k05J38lp7K97k74M1k9o3K76j58J57l05K07j3Q9L18m29J82k34K14
3629A19j36j66L83p6j31J2O1p6Q6N7l85K79n1L7J2k21Q4J69n7%O1k0JK04k49k61
3655b64J62%J84M6k28J50r0j68L46k28J65K6j25J91k59O4P0k50J85J54k16J01
3677A6o1K10k79R4J51l96L13j61K43k2J9k06p6O8J75J7k08Kq7J46K98j06k15k7
3701i2J67J63j61L7q2O6j65N8m6L05j47n2k82L24k7k6J31j77Kk0K20j64nl9R5
3726H3l32P7N1J50m9Q6j09J92j5k9K07l60P7K01j12l44P18l04m44K00M96m96R1
3749C5n3J07k52P7K23Lr8r14J174p30J60j87P49m06l86M36J59l17L21j9j25K87
$$ plain form
3582 69 47 -174 226 130 76 116 -85 -314 -101 29 -184 -105 135 56 47 25 -35 108 61 195 49 -84 133 -23
3606 -23 -131 -10 -215 -77 -80 -157 140 -134 -93 -122 -185 91 -67 90 -215 -8 -21 68 386 -43 139 -95 119
3629 119 -17 -183 200 124 -7 5 66 -10 76 133 -252 27 -24 13 25 -196 -112 57 0 0 61 41 42 246 -3 -264
3655 -264 -102 -102 82 128 -100 50 -40 -208 138 -90 75 101 -24 167 -92 -28 42 -208 -23 131 -85 16
3677 16 -45 165 -114 -20 131 -265 48 -113 130 108 127 -79 -155 -87 88 105 -103 -101 -188 -42 256 150 -65 -92
3701 -92 75 238 77 114 32 98 -67 -9 -55 250 103 51 -231 93 66 40 171 -6 -4 -24 196 32 27 -12 83
3726 83 -249 -172 -121 29 -20 66 -43 149 134 105 312 -48 29 230 118 -226 492 188 -256 -56 440 -56 35
3749 35 -18 89 -163 -86 137 140 42 -872 302 -428 -268 -455 294 -112 -498 -62 97 -220 101 82 -43 244
3771B44l63J79O6j07J8j17K72l38pL4J61J74l10K2j7N5R2k66J00K07p6q2K63l35
3795a31O8n47N28k19K03l74K64P3K49j47r4o88P23M12j89L03k09j75K07r6l02
3816a41J05K09l47Q7O0J14l9J45j39k67J27K28j52J18j69J64k1j86J23r7j09J98
3838A1p2p1P6O7J78l06jM9L65l81J37J19p0L4rJ45m41J93k2K74j09q0q6o6K35
3863A69n0j48Pk7j02R5n7J13K87l87M02r4l00P3M5j19P0pR6o2R1j3j05q9J5J02
3889Ej06J43N2j27m3J38J48j54k37K66j74J34r1K04N4k95R4j89L51j82J12k60
3911a57R2J23j66L3K66j07K0o5j76Q8j4m2J70j21K18q4k3K0j95Q5l5q6N7K48j69
3936b0j70K44lj35J48P9l94L18k5J51l54M6L71k12P1n5J49k45qj%L6n1kJ51P4
$$ plain form
3771 244 -119 60 126 19 37 -80 192 -146 -153 -119 42 216 -94 -72 -89 -34 58 -208 -108 99 23 -59 204 -131
3795 -131 -63 -610 -82 -301 -98 -472 -208 -135 114 -33 -127 -815 -92 320 131 434 225 50 257 161 -141
3816 -141 -36 173 -174 -87 -27 87 48 193 54 -213 -86 142 -10 108 -61 103 82 -104 19 -78 -187 11
3838 11 -61 -132 -56 11 189 -117 -118 -69 296 -85 52 171 101 135 126 271 -170 23 1 275 166 86 0 -66 169
3863 169 119 -29 -22 -49 -151 -56 -113 0 287 -100 302 208 -92 -19 26 -93 -23 -30 66 4 95 82 -23 -112 -97 5
3889 5 -101 42 94 -33 -76 62 210 56 -181 85 -89 45 -46 158 212 -83 11 -178 173 -9 103 -157
3911 -157 -65 58 -108 -75 191 84 104 39 -137 -49 -63 -105 65 -56 162 78 55 75 -120 -35 -70 -156 -99 149 -20
3936 -20 -190 54 51 -84 64 143 -251 67 42 193 -161 -115 256 44 115 60 209 -36 -44 -45 -45 -9 -60 -62 89 163
3962A63k76o7K04j55K19l7P1k25J21j99K11j6j35J03J13lj2q1o2l0M35l70oJ5
3986a9K4J67k85Q5J04Rlj00j33N7K33m3J81k12R6P4n43J86R3J38j14P0k87K48
4010B6r8K10m2j50J12L3j69m2J22q8O8J40J4K3j08j0M8k8J58j84k14J91K10j00
4034A22K6m5r0n6R6M8j72K03q7M5J2k10p9J64K4Pm6%J98r8j13J81j90K09j81K36
4060B04j06J92j67mk63k0K74j63K11q7r5n3Q6L7J57k73P6j37K25k03J16j35j3
4083a41Q0q4K19m07N26j00r2p3N2J10P0j38J29l22j48M42J33j11r7j49K60l4j2
4106A13l2j46j02K19j24j1J42p3Kp8K00q7J08k21J01P0K5Ok37N6j8J39L1p6o9
4131f2J17j32L3J16J86k31k58J61J47j21J34l50J84j3J51j55O9p1P6P5J2j13M9
$$ plain form
3962 163 -113 -180 24 -131 88 51 122 -103 18 -181 30 14 -121 -18 95 92 80 -1 -63 -93 342 -28 -34 -19
3986 -19 5 172 -113 -28 76 85 82 -18 -151 -94 139 96 277 65 161 235 -308 -122 -29 109 -5 65 -222 26
4010 26 -72 138 96 -54 58 91 -78 -120 2 -86 -18 122 136 159 51 41 89 61 219 35 -179 12 222 122
4034 122 148 103 13 -43 53 101 -71 132 45 90 102 -108 -187 -23 1 8 -38 -38 160 62 -51 130 -60 149 -32 204
4060 204 98 290 123 119 -144 -164 110 -53 158 71 -24 -77 9 46 203 -70 6 -131 94 -109 7 -128 -141
4083 -141 -61 -145 74 -333 193 93 1 -72 -20 90 160 22 151 -171 -319 123 256 145 48 -101 159 125 113
4106 113 81 -65 -167 52 -72 -83 59 -14 -12 -90 110 23 131 -90 11 81 106 112 -125 -69 -87 52 83 7 -62
4131 -62 55 -77 -44 72 258 27 -231 -70 77 -44 90 -260 -76 -89 62 -93 -24 -95 -19 56 68 -45 4
4154Dl0j22L13j88J31j98J04j30J73j3P8j99J28j40J84K1k88R7P5k72M80m24K13
4177cK1j14K24j23J5R1j13MJ46k4k34P7J43pj36l3j76L4J86r7J26l25j5J91m2
4202a84P54p83P99o43K51q2j22J06q4K7J20Nk50j04M84j16l40J64K53l16j51J18
4224i4N7j39J95Jk07J19J32k92K20j6K7J9Q1l5M0o7j12P3k0n5P8K01l72K88R1
4249B13r8M4j60J6O6k56M19j71l34L61J27l0j43j02Rr4K22l8l84L60J69p9j46
4272b9K46Lj28j23K2K08l84J42p5N4m7j23J23O3J29j47J56j51L2j74K10N1R0j66
4296a8j64m8j2L75k92L89k02J39k36k24M07K7k11K37L9k36J0O2O5k00j0j4L27
4319B10L7l10j31K93J34n06L03J1M3J08l3l52M19j66k42J77R1j78j43M61j78k8
$$ plain form
4154 4 -26 -148 165 -23 108 -90 14 -116 57 44 122 -77 51 -89 95 116 -172 -75 0 -272 208 -216 -3
4177 -3 18 -96 128 5 20 111 -2 2 148 124 -110 -33 110 103 -33 -66 -242 -208 -22 -119 7 -318 -333 -142 -184
4202 -184 570 -213 586 -57 194 112 -10 96 12 39 159 164 -86 -190 294 178 -162 2 255 -61 -212 -94
4224 -94 -37 -176 19 20 -187 -68 64 -228 -8 -24 3 22 103 68 108 41 -71 2 -18 -73 5 206 -166 122 213
4249 213 115 159 -1 15 81 -175 244 73 -261 100 227 197 54 -48 -39 -133 89 51 -333 27 196 117 -29
4272 -29 217 220 92 -31 -9 199 -185 -43 -118 -64 -111 -234 -111 -48 81 -66 90 -61 -29 -203 7 58 148 -18
4296 -18 -182 -230 -242 133 -159 230 28 167 -69 -293 114 141 -70 167 206 -30 -20 42 107 -93 -103 -117 210
4319 210 247 -63 -194 99 233 -273 30 41 84 192 159 -193 226 60 -182 -5 86 -92 -235 226 48 20
4341B0n6j25J02J29j51J97j38J18j61j38K36r8KJ89j00O4k17K71k88J51L7J00
4363A44m7j96K45k63K93k74O1L1j14K35L9k53J47K20l03J54j57j48K53J38o4J42
4385B83l71Q1J49k5k11l5K75l34J69J64Rj89p7K24j61Q3M2k33K36J1r3L1j06J52
4409G4q4K21l06L6J12m1J30r4qJ18j26M4k2j58M5K04l9q6L4j17N0j7Q3j19J48
4434H2j99J55n8P2lL0J42j93J59P0l69R4O7j52RR5l12N20q2J5l45J95k17J86J43
4459A04R0j67J56k57n2J19l38N09k52P2J17K1p1j74J73q2j11K56l2j42J84Lj05
4482B1r8R9rk7J1L6J12J71l73P7O2l40L02R7j19L22j03k46J61j74R1j79J56lM7
4507I4j57P5n0J01k66Q9K80j78K4j43kJ39L7r3J5J45Nj18j45L52o1N2k9J50o38
$$ plain form
4341 20 -36 -161 -59 70 -81 116 -22 96 -65 -203 33 -65 -63 126 26 90 -127 144 -144 7 44 144
4363 144 97 -99 146 -117 176 -98 -37 -6 -120 115 154 -99 48 268 -35 119 -38 -186 67 205 141 283
4385 283 -88 -7 142 117 -94 -129 146 -188 -19 145 154 -35 -112 112 -49 34 76 -157 79 90 -3 28 -78 74
4409 74 -10 211 -95 -59 53 12 142 48 40 158 32 76 54 -104 -59 145 106 20 54 -63 -13 -30 53 -66 82
4434 82 -117 38 -20 52 49 79 221 28 187 257 -112 -18 49 -103 -94 1 -311 209 127 142 -203 -8 -225 -39 104
4459 104 194 27 183 -74 -126 -7 -345 164 -88 -16 101 122 51 -123 50 -32 -143 113 81 -61 123 126 21
4482 21 -77 22 13 -14 -3 33 145 316 -57 20 82 -258 44 141 22 344 241 -5 156 -18 73 -106 50 47 94
4507 94 -63 12 -38 63 -203 -114 166 -12 12 -131 -133 6 43 -50 -35 110 115 -3 -148 204 143 195 166 316 -322
4532c22M09q0J19k03K11k56L47k71mp2J33k4J6k34n3K96k01L12r4p0K15k78o4
4555a68L31j22n2j40J18Q3N1J0j24J80j24n1O8J16k47K44j19Q1k31n6L92l71J42
4578A1r4J71j58J68m3o2j47K35j63K9J06N7j29R5j37O3j92K75L44l50P8m63L23
4601A7J05r5jj78j43K48K12k6k97M87l60r8J06J72o1O7jj25m2k41K84n1N4j80
4625a47K31k23K19j18J39k56J07J15p5k5l9K7O4j62R7J85j58k6j87J74n9J63O8
4648A14l88M21l15J31jj32K68m8n3k08M16k82K27j22j56L16j48j54J79Lk25K09
4670E2j5r0j01J76J23q0j06j05J18q9N9K38k25n5Q3R6m5k76J85l9K0k1L3K01k19
4695h2j29K89j47NJ81j78J46j96J50J40j58M1k17J52L1j0j62J69q0j65l0J95J02
$$ plain form
4532 -322 87 7 126 -77 134 -122 225 -46 -50 -122 11 -13 3 -231 -284 12 -189 123 29 -41 174 -104 -168
4555 -168 163 41 -11 -151 -33 50 101 111 -13 167 43 -8 60 176 -71 173 54 135 -96 -152 240 -131 11
4578 11 -83 88 -70 98 55 -7 -154 81 -82 -53 53 110 -19 76 -61 2 -190 85 429 79 157 -306 17
4601 17 122 27 26 -152 -295 -47 165 139 -158 329 -31 -129 -23 149 88 155 154 29 -13 -254 30 -21 33 -147
4625 -147 84 -139 80 -38 101 -155 -48 67 -8 -33 -72 -45 19 -143 -46 139 -19 -45 -232 -58 -117 46 114
4648 114 -274 147 -168 -37 -38 -170 98 50 -3 -211 205 -77 150 28 -128 188 40 -114 65 68 -157 52
4670 52 37 -53 -154 22 145 65 -41 -146 -28 -117 -58 180 -45 -100 -17 79 34 -242 -57 -96 -76 -97 -64 137 -82
4695 -82 -211 78 -69 -64 117 -61 85 -111 39 179 21 62 -155 -3 28 18 -144 25 -55 -220 -250 -55 47
4718D7M5k62J97j53J63l3MO7l3p0q1K15j24Q5m4p1kK85l27K35k56P0J69P4k19
4743a9jP7k41J63o6J89k17K97l17K29nN3p3o4J90j87O6j50j02J45l7P7n2p9J11
4768a3l7p5L1J84k36L39k36ol9L4N2p5K19j91J01j25j09J31J15j14RJ68r6J02
4792A33j44j52P4k9K95k48J69J08j23L6P0r7J0K4l66K71L5l25N1J87J57k99K89
4815A26m3J05k87R9p1l5K29l04J83J99k57j32J82LQ9k48K22j40j13L75j45K6r3
4838c0O5L59p21M49n9j48J14P9j53j52M27j72K2N1j59%J44j59j62L62j59k0j87
4861b09J38P9J94k02l9r5K33j18k07J59L19m00M8J93J7q7k21J67m6l9K19j70K19
4884A52k08j94L22j02j03K28j32q4P4r5N5L5O5l41L48k3mK9o8n2J37j3N3k22L4
$$ plain form
4718 47 92 -170 27 -126 37 4 8 75 42 -28 -109 106 -18 67 23 -48 -50 235 -92 143 -113 -43 126 200 -19
4743 -19 -20 57 -184 -21 -87 102 -115 182 -135 94 89 142 69 5 195 8 74 -76 -178 -33 -70 7 -45 -124 -13
4768 -13 -50 -125 -94 90 -146 193 -43 -49 -88 -54 -2 -77 142 -49 52 -73 -182 -51 64 -50 -41 127 31 133
4792 133 -11 -163 -89 -118 177 -71 98 206 83 119 189 92 102 126 -240 31 66 -259 -208 -21 136 -163 126
4815 126 83 188 -99 0 -71 -106 123 -181 2 201 -56 -188 -6 -3 86 -162 60 -80 -193 182 37 63 -30
4838 -30 35 394 -327 122 63 -85 29 108 -45 -197 230 58 80 131 -28 -28 116 -43 -205 157 -2 -22 -209
4861 -209 -71 8 202 0 -39 -134 99 -19 -226 -67 252 -148 -100 93 110 23 -198 -31 -77 -116 103 -67 152
4884 152 -56 -250 72 -30 -133 95 -37 -121 -47 -142 -87 -52 13 -328 20 -3 -7 22 -46 -98 39 26 79 -143 -109
4909a09n4K0J25M5j0kR6k95L90L32n39J32j53K66j98l53M68j87r2p2J45K88l85
4932a42J06o1m0J08l7M3J81j29p0j02o8K51j57j6J80j60m2M81l05J34k04Q7j27
4955h9j59L56j53J9o0K76l94J95Q7k9q9K56k42l7K39k33l6M6m7l1K06K0p9l0L6
4980B8l1m4J92j14j6j78M91l08K45k57j16N8qR5j40K37k00k3K66p3l21L86k7k4
5004A18j32J39q9j60J18O9M5r9j68R6K93j83j02P5j66J50j6PK04j54J01j52n1
5027e7R9N7r7j87K38N2J91m43J53k08Q1J20q9Q8j6K8m5pq6j8K23j40OL6nJ07k7
5054E4Q3l23J40R3j0L4j3j03L5OL3m9K08k95rJ97k17J73j28J3L3K03k6J9J01l83
5080a31j17L94n2p0mj06q0J96l9L11o55N41l3k24L4J7j09m7J95l3j93N5L12n23
$$ plain form
4909 -109 -163 -143 -18 27 17 15 111 -184 206 538 -1 131 -22 244 46 -307 161 -26 -118 -190 -45 243 -142
4932 -142 -36 -97 -137 -29 -66 -23 158 29 -41 -143 -211 40 -117 -133 47 -113 -155 326 21 155 -49 38 -89
4955 -89 -248 108 -45 -26 -86 190 -204 -9 78 49 -40 216 -26 -63 176 -57 -93 -47 -94 -125 81 101 22 -8 28
4980 28 -3 -47 145 31 15 -163 328 20 265 8 -108 -50 -58 37 -103 134 -66 -89 177 104 -217 169 142 118
5004 118 -14 125 36 -124 -6 63 108 9 -159 -63 230 47 -55 20 -146 4 -12 -5 199 45 146 -6 -57
5027 -57 42 99 2 -185 53 105 296 -147 6 -202 -121 -1 -90 -2 -18 10 -35 -42 -128 -146 77 -63 -57 -21 -26 81 54
5054 54 137 -186 -46 47 37 71 58 -45 -10 -4 29 -20 188 -107 -116 81 -136 37 -91 -78 -45 158 132 151 252 -131
5080 -131 -248 146 94 24 20 -86 -166 30 -9 302 -353 188 155 -69 -35 -18 -127 -174 21 -12 -205 -150 162 -361
5104c61M35K59k85j08J12j74K13j95o3J88j67N3J34j07k57K23O2l31M30j35O9
5125eO5j66J63k19L09j94Q4j24j0L35k81j85K63k1r2R6M1O5k24l6J60J8P0M8j7
5150A43l71L29j35L9O4Q0k46K31k26J85j50J54J62k04j9j82M60k54K4j28p2k6
5172a42rj14K33J8j99M50k10J06L8j05j98L16j04J70l9k28J47k28Q2p0K26j32
5194Hr8K33j82j90K17k9o8n5K72j9l6ok54J16J68j91j13L50j86N6p0J52j11J82
5218A46j85Q7J11l61J26J0n6J18k64L81l96K59p6J68K9L4K5k84J10J36j31j14
5240a27P8Q7j21mK1p7J98m13N08j17j14K5q5J32Q1l6j55n8J60L72l11K8j69J71
5264G4K21j16Jj26j9p9m5Q8k17L02j02j22J66M6j97Q5o6P7j95K41J24j52j03J12
$$ plain form
5104 -361 74 333 48 -60 52 -122 91 -104 -167 21 -146 -93 41 -66 -323 -100 -38 -369 61 -74 -5
5125 -5 60 -106 57 -162 147 -47 37 -87 -97 238 -43 -228 35 14 -78 18 59 124 -100 -136 24 42 112 160 143
5150 143 -228 101 -34 5 69 149 -97 134 -92 93 -57 97 259 55 36 -146 314 60 84 -44 -116 -142
5172 -142 -151 -265 -32 -14 -213 237 27 133 171 66 -132 184 80 250 211 -17 130 -98 -16 -86 140 8
5194 8 -90 143 -39 -229 -12 -41 -109 -164 108 89 53 47 -207 -91 77 -114 -227 123 -63 -7 -77 75 -36 146
5218 146 -39 48 159 -202 -76 -66 -122 -4 -268 113 -283 -24 -100 68 97 131 156 -128 -18 118 -13 -127
5240 -127 -49 38 -83 -87 -66 -143 55 -358 150 33 -81 -56 -141 -9 72 36 -119 -177 -17 355 44 72 -97 74
5264 74 295 179 180 54 35 -44 -89 -1 -218 84 -18 -140 26 72 -125 -40 -106 -29 -224 17 141 -11 -114 -2
5288bN6O1r5M0j74P9N5J1k77K64k01J03L37L4k84J52j89K06l65J55j35L98k05
5311B4L8J43k45j7Jj18K14k2k7l5q1J26o6J32j83N2o4J41p5o8P8P0K80j0l67J23
5337D4m2K9J0k17J28P7O3k20K3%J36p6J40o4m6k8L3j48M8J61m2J8K09j70o6r5
5363i5J35l93N28j16o6L09k05K72m24K17k15k7o8J22J34P4k71L07l17K45j38j19
5385a11Q7K23K5j18j7j24J26k16L13j24J5q1O6p4O1O3l27j62M23q8j7J69j88n3
5409a29J70K85j7m83N21l87O1M8k48J51J44l4k7k67L4M14m75J15K25J77k44L22
5431C56J71r49M24M4k13J96J54j28M9l25L98k45K02k5k37J92r3j95M45k45k52
5452b76K42J34j09k8J21m63M16J02O7M8k46Q2k33o8R4K74j65K6q3oN7J20p3l1
$$ plain form
5288 -2 54 115 20 60 -114 -35 20 31 -246 18 -183 -80 257 291 7 159 -30 176 -189 -34 -169 229 24
5311 24 62 205 -40 -57 -56 -174 40 18 -9 -44 -125 1 -65 67 -116 -64 -128 13 -62 -130 -52 18 298 288 -79 44
5337 44 2 31 41 -176 -48 29 92 -128 -105 -105 31 -45 95 31 -15 -43 -10 -158 -110 51 9 27 236 66 0 -95
5363 -95 40 -353 175 59 -7 302 97 369 -55 162 -53 -80 -148 -26 108 182 -89 218 -99 146 8 -111
5385 -111 -24 199 224 106 89 -35 91 -125 188 64 79 -2 64 -10 51 114 -213 -375 48 -40 -57 112 -76 -129
5409 -129 41 326 309 -174 347 -40 21 69 -179 -28 116 82 55 -212 -178 236 -239 -124 101 278 34 356
5431 356 527 -422 2 46 -167 29 183 55 104 -221 177 -68 134 109 -128 64 -29 -224 221 -24 -276
5452 -276 -34 100 -9 -37 84 -379 37 139 206 254 8 90 -143 -211 -117 157 -8 18 -65 -71 -14 106 33 2
5476Bo2j6J96k02J33p7N8k81O8J38R3k6j45J57j82K00P4j4j89K63m2m81L29k59
5500b65Q4K15l0j46L3M6J68Q7k80L0J30j69M7L06j81k26j26J07K06o9l6K4k2l9
5524a06K64l6o6M2p2j3k45O5K74p0K3k28K59L3j88J40n4k35K22j6n5L50l60J89
5548A17k05J01j9r6J84k28J13J48m67K94k01K25J3Q7k04J19J36k49J97l09O0P2
5570a12p2RJ22%M0K55l85O3J84m2o2p4K47k49Q4O0J42K6k67j70K02q8j52N9J77
5595cj40K57k36K15k31K0K87k70K72q2m8O58j89n87J21J45m67K86j94j51J32j80
5617c85l98J532J54r85P1o2J10k36J25j8K43j02J84m31K63j69J08L6q2RQ4J1j34
5640g2Jl0K30k21J94pQj71J98j06k9j66K06j25K1J1K45k80J24j0K5j72J36L1P0
$$ plain form
5476 2 -60 -76 120 -82 51 -26 32 -249 -181 -43 50 24 -121 36 -146 54 128 114 -75 188 146 -335 -6 -265
5500 -265 -181 34 4 -142 -109 -63 105 192 -88 -58 72 -97 -50 256 75 -151 -277 -170 36 -33 -69 -45 -67 -106
5524 -106 158 122 56 98 26 13 -232 -167 107 37 60 -168 91 124 -64 76 22 -213 9 -7 -62 288 -72 117
5548 117 -88 13 -6 -102 82 -146 -33 115 -352 -58 -259 -34 -21 66 -138 -19 117 -132 65 -244 -184 -112
5570 -112 -184 -175 -53 -53 -13 242 -143 -80 104 62 0 -74 173 -76 8 68 210 236 -31 -201 1 -87 -239 -180 -3
5595 -3 -143 114 -122 93 -138 -118 169 -101 171 89 41 699 510 -77 44 189 -278 8 -186 -337 -205 -385
5617 -385 -783 749 903 -82 -11 -73 37 -199 -74 -92 151 49 233 -198 65 -104 4 40 -42 -33 51 62 -72
5640 -72 -71 -101 129 -92 102 95 103 -68 130 24 -5 -171 35 -90 -69 -58 187 -93 31 21 46 -126 10 41 111
5665A11j01J47j17j21R9r7M4K71l39k1K31j87J43m0m2J7L65l58M2J44l84N7K7
5688a09K1K37lk36J43L61k55p6n7j14L11l49P4J53l67J79M3j39L04ko4O7q1K1
5712F2J48p1p7j9nm6PO6p1k58K39k11O2P1K13k46N6n6J44O5j89J40j66J49J12
5737A19J58k79L07k35k49J42K01j18m5J12k85L7J32K3j16L10k66J5j0o1L33j58
5759F7k0k15o8J87k0O8R1q0Qj66L24k20Q7j55k9L13k79K3M9m6q0K46j67J51q8
5784a9j28Q5k63J28pL29k51P2P6j62L32p7k11p3Q3J7J47j17R5l1j15J0K04k91
5808a67K97m5pk7l39J72J69n1J56j3K8k15j12L40m16K92j34n9K07l8o5J38N6j82
5832a5j45J23L74k26j91R4j30N6J09kk46jL17q5R2R3j44j52Qk6J68j38J11rn7
$$ plain form
5665 111 10 157 40 -81 18 -79 -35 236 -103 -124 107 -80 63 23 -19 -2 363 5 47 191 -193 -136 -109
5688 -109 -88 149 146 -90 53 414 159 83 26 -88 223 -126 -52 101 -266 -87 -44 -183 121 119 55 122 41 62
5712 62 210 139 62 43 38 -8 -1 65 -6 -264 -25 -236 -174 -103 110 -136 -80 -136 8 73 -116 24 -142 7 119
5737 119 277 -2 305 70 -179 -37 164 46 1 113 -172 -135 -3 20 -96 214 -52 -37 -47 -108 225 67
5759 67 47 -168 -236 -49 -69 -1 90 10 18 -148 176 -44 43 -112 -141 172 -107 -84 -35 -81 -161 85 -82 69 -19
5784 -19 -147 -62 -325 -197 -204 125 -126 -54 22 -140 192 115 -96 -169 -86 -69 78 -39 56 25 -90 -80 124 -167
5808 -167 130 85 78 51 -288 -116 53 2 158 145 173 -42 -154 186 -230 62 -72 -131 76 38 -27 111 167 -15
5832 -15 -160 -37 337 111 -80 14 -116 -60 49 47 -199 -200 117 32 124 217 73 -79 -71 -97 71 -67 44 35 -22
5857b2L81k43l62K51N3j20l1K10j49J78n1j11J70k45J08P8K4k52J69o9Q6k3q7
5880e7K09J19j07j20j07J08J4o8n7K14j22j1k08K75J26j89M4k47M58Ml41J41j40
5903f2J30k12K33m5p5Ok69K99K30j58j12nJ42q0N3K3q7r7J31J50k36K36k25p1
5927a01rJ89m5k27K77k50J59RJ38j80j39L34l11K97j28J91l79J01J1O8q8j58K72
5950C1P3j14L1K4o5J41j91K2p4K87k08j12Q7LJ1p8L68k31p2P4l8l3P9L0j82K44
5976A07M6m20M8J74o9R2J41j07j30O6Q4P9j79J81J16k05k96K92J06l01J64j26
5998a37J52n5P3J97j46Q6n86M79j05j65L73n1M2k63K6K06k07K09J1j13J95k95
6020g4L5J82Q6n5k5p4p3J29p5j19o8J66l1qK0J10Lj97J21K92l88J61q7j24N8J48
$$ plain form
5857 -22 359 116 -246 5 58 -62 -93 117 -32 146 95 -16 154 -91 17 95 119 -133 36 -33 53 30 -57
5880 -57 152 271 164 44 -63 45 59 -9 -66 148 26 15 -193 82 208 19 63 -184 274 278 -63 78 -62
5903 -62 68 -144 89 44 -31 -25 -294 5 235 77 -35 -40 102 22 75 98 11 -86 45 195 -41 195 -30 -101
5927 -101 -110 79 34 -193 84 -166 -7 2 140 -40 -179 155 -156 141 13 204 -175 -74 -63 5 -83 -241 31
5950 31 104 -10 21 45 -20 121 -70 -48 -122 165 -43 -155 -68 -65 -54 -132 236 5 -67 7 -31 -64 15 45 -137 107
5976 107 153 -267 -219 -45 -114 -22 119 12 -118 -52 32 111 -68 113 229 24 -272 20 126 -175 -11 -137
5998 -137 15 -40 33 230 84 170 -416 63 -42 -207 166 115 157 -106 -80 126 -81 128 139 26 221 -74
6020 -74 -39 143 229 174 149 75 2 131 56 -63 -131 35 4 -4 16 126 129 -68 53 345 -43 118 31 -93 -35 113
6046A13j39J6j2J23O5j14J14q2j26J05K16k75l2K03p0p8k68J96Q3n5M4K8o4J39
6070A30K0n2k06m0K32rJ52k50J65K4j19j30K60l53K22l3j2j17J10j35J74m5p3
6093h5J55j65R6J15n7k8J36m14R9r2M1N2J4J15k21N6j1J33q3L72j22k7j29O5N
6118B0k0j00O8N1%N1n5J04J6n9j94L23k44K52k25J61j87j05L01j12o4l3o2k7q6
6143b26K78J25k63J82k07r6J44O8L8%k07J00j12J48l2r6J86J87m1l05J93j32K5
6166d3O3J7k32J97M11l51k9k0J19j53J05q3j03l8J84k60J84J81j1k61J28j0Q2
6189G7o6K18l26N9q4K47k33m4K79k23K8j27n5L12Oj92K21r3J22j23L25l99J68
6212I7n3k5q0M12j75p4j67j00J03Q7k03K63j82K02N0l74L80n57L24R4L8j8j64
$$ plain form
6046 113 -26 -10 -22 101 166 52 166 84 -42 63 279 4 -28 175 105 27 -241 -45 38 -17 27 55 -9 130
6070 130 150 98 -108 -148 84 75 227 -23 142 166 47 -83 177 -176 46 13 1 -116 -6 -141 33 -12 -85
6093 -85 70 -95 1 116 59 31 167 -247 -148 -240 -199 -147 -133 -18 -239 -183 -194 -61 -144 228 106 79 -50 15 20
6118 20 0 -100 -32 19 19 70 15 119 135 76 -118 205 -39 213 -12 149 -38 -143 158 46 -18 -51 -113 -140 -226
6143 -226 52 177 -86 96 -111 -207 -63 5 43 43 -164 -64 -176 -28 -60 -156 30 217 176 -129 64 -68 -43
6166 -43 20 37 -195 2 413 62 33 13 132 -21 84 1 -102 -140 44 -216 -32 149 138 -123 5 -5 77
6189 77 11 229 -97 -38 -122 125 -108 -152 127 -96 -68 -195 -250 62 68 -124 97 4 126 3 328 -71 97
6212 97 44 19 -61 351 176 102 -65 -165 -62 25 -178 85 -97 105 155 -219 161 -396 -72 22 60 42 -122
6235a22N8M8P1L4O1K0j84N3j47J31J99j65M1L4k78J27QJ59l15L63J53k86n3j17
6259a07O6q4R0J13j98J66m2J26k7k00j07J0J48J07L6J66k08j38J49k07j54L49
6281E4j78Q3P0j85M9K30j20J4l9j32J97j16J4o8J37o3pl1o0P0J98p4L6O9l62L63
6307A49j3j88Q9j21j46J67J26l56J59K16J20k02K49l32nK98l41q6J92j42Lj16
6329b80P4J77K07j77k43K94l2o0m8P4r4J48j55q7J05J13n9m7J81n9l6mK20m6j62
6354Dj78P6J97j76J16P2j44J45j21N4j87J93k46L79j53L3P3j26N6M9m4l07L52
6377A17j91K8PR5M4pm9q8j15jL0o2M71l07j2K16m07K52o5j13K0L48l65K26N8m0
6403I0k16J23M4j96J16j42J18P5N2j54k37J56J35P0P1j57j20J98K31l41J47L3
$$ plain form
6235 -122 -64 -16 55 89 150 170 -14 39 -108 23 222 57 98 132 -146 -19 -11 148 -167 196 349 63 10 -107
6259 -107 -41 -125 -35 78 -120 46 4 130 103 -97 -204 -194 -46 61 97 263 55 -83 66 -141 -295 54
6281 54 -124 -41 29 -156 -107 123 3 17 -22 -154 43 -73 -59 -127 10 -53 -60 -91 -151 -81 117 43 79 148 -214 149
6307 149 136 -52 37 -84 -230 -63 63 -293 -134 82 202 0 249 -83 -88 210 -131 -217 -25 -167 -164 -280
6329 -280 -206 -29 178 1 -242 52 20 -40 -88 -14 -108 40 -115 -202 -97 16 -43 -90 91 32 -4 -8 212 166 4
6354 4 -174 -98 99 -77 39 111 -33 112 -9 45 -142 51 -195 184 31 64 137 11 67 116 72 -235 117
6377 117 -74 -46 -39 56 100 93 44 -44 -159 -160 -130 -192 279 -28 -40 176 -231 21 -44 -157 -137 211 -154 72 130 90
6403 90 -126 -3 41 -155 -39 -181 -63 12 64 -90 -327 -171 -36 34 105 -52 -172 26 257 -84 63 96
6425I6k72J16R3j42J03J77j99M8k1J8OO3j44M87m22R9p8K07k02K13n81J89r4L13
6449G3j36L36k79j56K68j01Q7P4k74P8q6K80k9k61K16M9j22o6p7J46J11k48J85
6472F8M1J34j25J41m13J47J2j05Kj3M31m04m0O0L11m15K73J29k90O0K5k77K19
6495b9J30j1o9R7l95L24q2R3j8j24L92r9p2r9J70k58K33l47J28rJ7J21k01L8J34
6520F4N2j30j00K28J41k12R6mJ1k27o4P4O2L30m40K08N6j97M4Q5J55o0j21O8q4
6545C5oL9j5N3j93Qj23J84o8K33j60j86m6K47l1K40l18nJ00lL5m9P4Jj49m8J90
6572C9j54K13oj38J61l00K74l53N0M44l50KJ7K12k73J28N9J67l61N52p03K71j73
6595b22K97k1J31j56N2l2Q9J17k96q1J27k07J61J06k79M2j14K71j42L72k60j38
$$ plain form
6425 96 -176 -60 33 -109 -6 171 -28 20 -1 17 23 86 -58 429 7 106 28 235 33 246 -335 -146 -240 73
6449 73 -63 273 -6 -162 106 5 92 166 -108 -30 -116 164 135 -126 90 139 17 -49 -126 20 131 -117 68
6472 68 109 243 118 259 -154 -7 5 -100 -98 -111 320 -84 -124 -64 247 -168 105 234 -56 4 29 -248 -29
6495 -29 101 90 21 118 -277 47 -35 58 40 -84 308 209 137 38 208 -50 183 -164 -36 -45 -28 93 -108 -70 64
6520 64 116 -14 -114 114 255 43 139 135 146 -81 -145 -71 -9 321 -119 89 145 -52 -8 77 232 172 51 119 35
6545 35 29 68 53 106 -87 -79 -202 -18 -86 147 -13 -199 -245 2 -29 211 -107 -112 -12 -15 20 -29 45 46 -103 -151 39
6572 39 -115 98 92 -46 115 -185 89 -264 -214 230 -120 -118 -101 111 -162 -34 25 192 -169 383 -320 -49 -222
6595 -222 75 54 185 29 81 49 138 255 -41 -122 5 -202 -41 65 -214 -172 -286 -15 -157 215 -45 -183
6617a83K13J09m7j22Qk32M91k89j09L07j07Pk2q5K16n7j04J19j90J47q1K82PM
6641B82l65J10l1m1P5P2k06j08N79j22j00j00j7j3K7J16k12P8k37J16j06L57k41
6664h7J19L1N6k74K36k44P0K30j69j31K01K31l11K00j46K93J15j146J035j85k02
6685g8K34k49r4K07Q7k18K19q7M8k88J07J27Q8q2M2K7K24k59n2J09j79L1j80L56
6709A40K3l28L26k89L21o6j47J10J24q0q8j01P7J3j80R8J56q9Q1q2J04j3l1j31
6733e2J68Kj82K80k09j02R3K19l69L3nJ72K5j78K49j22j23K05j37rj0J44k36J53
6757IR1M8k34J83j93Q7K02j66j94J9j12J26J12J48n5j62L60l54J36P9j93j73l
6780b39J95J79k68K56m5n15K96P1n7O0K16K06m99R3K28j39o0j11P5n8j23L19J52
$$ plain form
6617 -183 30 139 92 -30 -22 -254 237 -52 -161 146 39 46 24 -61 155 98 -6 113 -77 70 -11 271 278 282
6641 282 -83 27 -4 -45 30 102 -104 -212 367 245 145 45 28 15 42 158 -54 24 -213 -97 -203 154 -87
6664 -87 32 63 119 -155 81 -163 -93 137 -32 -163 38 269 -42 158 12 305 420 -726 309 124 -78
6685 -78 156 -93 -187 20 107 -111 108 21 69 -219 -112 15 103 21 63 90 314 55 3 112 -67 -36 -216 140
6709 140 163 -165 161 -128 193 127 -20 90 214 134 46 -55 22 35 -145 -47 109 20 101 19 123 110 79 -52
6733 -52 116 118 -64 216 7 -95 -2 217 -152 -119 -124 48 73 -105 144 22 -101 104 -33 -42 -52 92 -144 9
6757 9 100 148 -86 97 -96 -9 193 27 -167 -148 -260 -134 -22 126 71 -91 269 -85 51 130 -63 -236 -239
6780 -239 -44 135 -133 123 78 -437 -141 -70 -127 -67 149 355 -144 -51 177 38 -22 -133 -58 -116 -239 80 232
6803B32P5R5k95m84M21L61k85n1k0n0j78j09l6M26J04l01k15J32L68J15n04K35
6825C6j75n1J96J61r0k24K08J24l6j44K2Q9j52lJ7K9J9l7J62j91O0j28J94k13
6849a27J67M6M5j40J4J1n2K6L51l04J55k05j24J49j39K36M3m0j31J40j27l6j6
6872e8r7J21p1J89K4J05k71nN8O9r5q7L11l95L3K64j59Q7J55k68Q3rj90K34j0
6897A8lk1L3p5o4M7J02n9Mj28q9L01k75K78q5j10J54O0l8K01r6j80k9J56k04M07
6923C05m72J44lNq5J88N4oo3j36p6N0L3J72j34k33M90l00L08l33J22p6P4J3P5
6948A16n9j44K32o3Q1l79L58j61J2r6J71J20k17l6J20J73k86J10o9K37j55km2
6971B1o7J30qr2R4j67q2K0J17J41j70J75l55K20Rj13J90j04k17K38l9n0K24k97
$$ plain form
6803 232 307 402 107 -377 44 405 120 69 49 -1 -179 -288 -324 102 206 -95 -310 -178 190 305 -199 36
6825 36 -139 -190 6 167 77 -147 61 185 149 5 27 116 -36 -39 -22 7 26 -11 151 -40 20 -108 86 -127
6849 -127 40 86 131 -9 5 16 -36 -10 341 37 192 -13 -137 12 -127 109 152 112 -19 121 -6 -42 -58
6872 -58 -155 -34 -105 84 108 213 -58 -63 -5 64 -31 -118 193 -202 -169 95 -64 23 178 -90 -7 -16 -206 28 18
6897 18 15 -6 27 -48 -112 -65 37 -22 -18 -146 -235 66 -209 69 -16 -126 28 88 50 251 155 -25 -54 102 -102 305
6923 305 -167 -23 -26 -21 -106 82 136 130 67 -69 -145 -95 -62 110 -24 -257 233 -67 241 -92 30 -46 28 41 116
6948 116 57 -87 145 82 163 -216 142 -19 -7 -103 68 188 -29 -65 55 228 -58 52 -17 220 65 63 21
6971 21 -46 84 76 -16 78 -89 -171 -151 -34 107 -63 112 -243 -23 -14 -127 63 -41 -258 -20 -59 -109 115 -182
6995a82J66J02N7k08M43k39o5j12J3n7P9Q6J8k8n3J28j38L1j59l3J77j59J33Q9
7019H9M8l12K17M2j45N4j12J99j50Q6K3k90K01j22P5PP4KM6J75j82q8K02k28J58
7044F9l6j26L4O8J87j21ol1q5J05K7j2j00j40PK79j16m2j42K14j83M1J21K0o5
7069c3K2n6K83k92J15M1K1k11J40k3J25j01K19j52mj02r1p3M0K5L3O8j03k3J62
7094C0J78k12j17r2J99J45j73N2l4K5Q5j39J14Kj96J75p4j87K81MP6q9J3k44M09
7119B31j40o9J49o6k12j44M39p7J81m77J69j22M0l9K61J0J54k63MN3NN6k66R6
7143b7r0J6j90K97pK01l26O0J22k5J8J99j21Q1j18o1m5K21l87N2K64k22K80m71
7167b79N8L59k37k6J0M7J01J74j66l17L79j75K3K23l9l3r3q9r1M6J99q7K02j06
$$ plain form
6995 -182 -16 86 143 -65 378 139 74 -38 -25 -82 -3 83 101 73 20 148 10 41 -118 -151 26 -133 0 89
7019 89 137 -175 42 84 -61 -7 -119 80 -70 16 39 -251 -50 -172 -97 -90 -16 -14 32 207 25 -63 139 -89 69
7044 69 33 -93 -59 9 196 75 69 38 -47 58 85 73 -27 -167 -160 119 3 -39 -181 33 -150 -109 12 32 -33
7069 -33 -11 -67 216 -76 39 80 101 -110 30 7 132 31 250 98 94 -8 -99 -172 -132 -107 -74 -6 -109 -132 30
7094 30 208 -4 -121 -213 -14 131 -42 10 -24 1 86 -53 61 63 -133 42 -32 -219 62 66 142 53 66 -178 231
7119 231 91 22 171 105 -107 -251 188 111 292 -185 -16 -138 -98 -137 124 134 288 25 29 82 87 143 -123 -27
7143 -27 -117 -101 -291 6 -1 200 -126 -66 56 31 49 248 127 208 90 29 -16 205 -182 -130 134 -88 192 -279
7167 -279 -221 138 -99 -125 -115 -68 33 207 41 -276 103 -72 -49 174 135 102 9 -80 -171 -125 74 -13 189 83
7191H3j03J72k67K78k62J79p8RQ4J06l64J63k0K12Ml62m6L58r5j20J83k43L4L17
7215B22k81J08k22N1j9R3J94k54M9N7kl4j26K74k45L41l63L5K16j58q3j09L44
7238H8j25Q7r4%O1q6o5J89J00j79J17K9j92J27o3r6L12k94j12K12J13K7k4k19
7262h7L29l75J17L3j2K15l19J64pJ11m7k09k4J41R1j32j36j6J02K04k30J59j44
7285g2J05j07K8L6j23o9K81L6n1k9j6J51o6O8k82r3J04Q7J6ln1Q5K8j30O0j36
7311a43K42k5m9J47k17J78j71k11K00J85n9k4r2R3K4k08N0P6j04Q9j55J03P3m2
7335d0k06J71J7O3J05j96J56k9j01j2J29J73k42k00J98j83K65k02q5J74K66j67
7357E4j00J16kl60L53l02J00J36K80j58J75l39j39K61l5pL1J21k59j31J86n2K44
$$ plain form
7191 83 -20 152 -115 163 -99 80 2 11 95 201 -163 0 -20 192 196 -166 -212 146 51 -69 114 -129 -95 222
7215 222 -59 49 -173 -122 -141 -48 146 -108 -59 -2 -4 -38 -164 110 -135 206 -157 -122 94 -64 -147 -256 88
7238 88 -37 50 -44 -44 17 -69 -134 55 155 -24 93 122 -70 57 -6 -102 210 -84 -196 16 129 156 132 -87
7262 -87 242 -133 -16 17 5 220 -99 65 58 169 122 -87 -111 30 121 -11 -147 -163 -61 143 -87 72 -72
7285 -72 33 -74 -46 -10 -133 -202 79 115 64 35 19 170 104 172 -110 -203 -99 -12 4 1 -50 35 63 -67 -7 -143
7311 -143 99 74 25 172 -45 133 -38 -249 -49 136 77 53 -39 54 78 -130 -80 -4 -108 -19 -174 -71 2 -40
7335 -40 -246 -75 -58 5 110 -86 70 41 -60 -72 57 230 -12 -212 -14 -197 68 -134 -219 -45 221 54
7357 54 -46 70 68 -292 61 -241 -141 -5 275 117 292 -47 -186 75 40 33 64 185 -74 -205 -19 -71 173
7380A73j07p3OJ0j62J00n0j06L63k37P4o0M8K6n3P8j05j15K34n8K14k28kqQ1n4
7406a1P3j38M8K61j74p6j34K50j75N0J97k83K50j9k31K12k80J99j08n7J25K64
7428B43m7k86mL8j53J35J13r1J15k43R9J11M7j22J13k14p2L8M58j41j06p2J45
7451A04RJ06k59M4j52j46K91k64L02j1Q5J46m38K37m4K5n0m9J69j55L9J60j01
7474D8P3j51J43O6q9j54j74M08j33O2Pj02J7p0J35m9J17j35J20j62k53L53O9l10
7498a64J08j43R7L2R5O8k22K63j24k13r7M08jK9k06l41M81Oj20o6L37j36k02J11
7522@j3N3J33l23K79j92j7KO2K43j88J06l4k27qJ85j12Oj2J03j12N2J7k45K40
7547bj2K19j15m5p9o5JK7M0K1J29k53j24L19r5M7m7k24K33l9l3M15k42j64J18
$$ plain form
7380 173 66 -7 -1 9 -153 -53 -103 -209 154 -83 -9 -69 -21 5 -48 30 -75 -190 44 -14 200 -28 -30 -38 43 -11
7406 -11 62 -76 -28 233 59 -17 -151 99 -76 -26 171 -112 138 119 -112 100 -180 19 -89 -146 -21 243
7428 243 196 -90 -94 -56 -209 -74 39 -52 63 -180 -81 30 77 -45 68 -146 -218 -180 278 137 31 -41 104
7451 104 113 219 -40 4 -148 -294 -3 -267 35 24 109 255 -183 54 10 35 -15 -64 105 -50 -11 149 48
7474 48 121 -30 113 179 90 -64 -238 170 37 99 106 4 21 -49 86 37 154 19 139 -23 -276 77 146 -164
7498 -164 -56 -199 -102 -70 25 93 -129 134 10 -203 -300 108 107 136 -70 -411 70 76 -44 -110 227 91 -111 0
7522 0 -13 40 173 -150 129 -63 -80 -78 -16 227 39 145 111 -116 -124 61 -51 -45 -57 46 -66 -14 3 -242 -2
7547 -2 -14 205 90 45 -34 -99 -98 -71 -31 -10 119 -134 -258 61 -34 13 -34 -258 -25 -64 -97 318 76 -88 30
7572C0P3LP0j59k0M5j28Q1j29J22p4M0p5L4J69k96J81q4J56J44m17K99j03j5J46
7597I3N9j36j74QJ58K13l57J57j23J69J04m61M86k59J3J41P1k06J08l2j9r2O4
7620a5Q7m1K9r7m6R0k4o6J00J2j07J43qq5j57K9L77j84J21k47oQ4r3o6J22J81
7646A33l86M79j72j43KP1K56m40L36k06oJ2K25j75j47K70j18J77j01Lj54P7j02
7669a09O8K4j04K26l40K74j28J62j16q4r6R6K43K55l30Q5k44k4Q0j00J85J45k34
7692f6J85n4q3P4k07lP7J36j40n8L09j70L9p7K15k86l8L3r8J73J94O8j17j44k12
7717b50P3M50m02M25l26r5L8p3M1L84j70r3K52k39J92j56K60k60R4j63K96k55
7739B3jJ9j3j9k15J51k5O8LK5j07k27J37J38j46J38J35oK0j75J96j18O2k15J86
$$ plain form
7572 30 103 106 176 17 -3 42 -86 -5 -134 -12 -86 -46 -121 -87 82 -214 -33 -117 39 183 -234 65 -38 -53 93
7597 93 152 16 -158 -150 8 221 -136 21 -102 67 171 -290 196 -63 -50 91 162 -44 64 32 13 -79 -15
7620 -15 72 31 60 -37 -83 7 -17 -83 17 29 -78 65 57 -28 -185 -156 221 37 158 -89 -95 -11 -104 -170 -48 133
7646 133 -253 226 54 -89 -87 -16 240 -200 136 -70 -76 -64 161 -14 -161 109 -9 168 67 70 -84 -7 -109
7669 -109 -41 -17 -121 105 -235 39 -89 73 -43 -127 -223 -127 116 371 41 126 -118 -142 -62 -162 23 168 -66
7692 -66 119 65 -18 56 -151 -154 -77 59 -81 -139 170 0 39 -38 177 -109 -147 -114 -212 -39 155 223 106 -38 -250
7717 -250 -177 273 -129 296 -30 -125 -87 -160 -119 265 95 2 254 15 207 51 311 51 145 -18 278 23
7739 23 22 41 28 9 -206 -55 -80 -12 -9 16 -91 -318 -181 -43 -189 -51 84 78 98 -77 119 1 63 -152 34
7764C4l81J02L93j16J14k71J08lJ89k07J92rj26k37K51k13Q7K19q1O5r0J23k05
7787f2J71k11Q9l7J32K4j78R5j57K29j43J1j33L07j06p5K07j45p7P0j67M20l56
7810i2j7k4J94k28J39Q3k0o2n1J95R0lq0L3j25R0k83K2K38J26k56n4J30n6j75
7835a86J46l5K12j28j28J77J4j16K04k84K66k3k23J60l5q1J82j7j56J41k28L80
7857B42j33J7k17q5N9JR0P6k98J73K75q8k00J57J1j25K41Rl60J77j30K15j59M6
7881fL4l1k43K75O4q3R3j94j5M8L34k53Q9k22p8J54N1N5O2k19Q6K63j73o5k26
7906b00L25q2j07k83L83Nn3m1j7J2M30l91j47j69K30J17J03oj58N4j90N00l44
7929b9J19l8j33J52O9k07J44k7j00L1q6j98L34J14k78n0Q3K24k52N2N9pM1j30
$$ plain form
7764 34 -347 -245 148 32 146 -125 -17 -20 169 -38 154 145 19 -218 33 -180 -93 126 45 110 20 143 -62
7787 -62 109 -102 -13 -50 82 106 -72 23 -134 95 -48 -37 -170 137 31 -44 163 18 -59 11 -156 264 -92
7810 -92 -109 -133 61 -167 -28 55 35 -27 -78 117 207 204 124 157 32 122 -161 -139 99 225 -31 -85 45 -11 -186
7835 -186 -40 -75 137 9 -119 58 72 -44 160 -124 142 119 -104 56 21 -60 122 105 -51 90 -138 242
7857 242 109 126 -91 -176 -117 -116 -26 50 -248 -75 200 112 -88 69 80 -45 196 205 -155 22 -108 107 -52 -6
7881 -6 28 -3 -246 29 93 10 103 -91 -106 -58 276 23 112 -110 -188 -34 17 72 134 -85 1 264 91 26 -200
7906 -200 125 43 -64 -347 36 41 -12 -53 -70 -58 372 -19 -166 -335 -105 12 115 109 -49 5 -185 315 -29
7929 -29 90 52 -81 71 140 -67 77 50 -50 -19 -105 -303 31 145 -133 -183 -100 124 -128 -76 -17 -24 17 -113
7953a13J61lo7J57J1p2k77j93L83m5R6J50m95M65j13k51N28j39m5l4j0j53O8p0
7977f1J71k29K60m15L06J30j08k59L76l92O7J36O1K7p3o2r0L2J30J98k9k65L5
8000e4L10l56NkK05j24K03K0j49J46k36NK7j1M6p9O9N5o8m1O4j50K57j65J15o9
8026B3J00p3j31L4N9J2k9P3J8n85K66N82j10j70o1L7Q3o7l19R1J46q7P0n7J13
8051A8j02J3K13n39N14k45K54p2l41K94N9j23N6p6j91O84m65j74N24m84J20j4
8073g7k24M47j0l3j22j6J10L9j00p8J63j2k28l9R4J99j77K78k07k08L0L1o7J65
8097d2q8K92m29O7J65%J50k16M11k59J6j61J4p7K91k3k62q5L41q7k36J5J25K47
8121A69n4k08K40j99J23r3PJ25l82J56o8N2J91J4l2%K9R6j43j05O9j82K32m7j5
$$ plain form
7953 -113 48 45 -22 135 146 74 -203 -396 -13 -58 38 188 -307 158 45 -206 322 183 138 104 94 -59 9 -61
7977 -61 110 -119 141 -274 32 162 54 -205 171 -221 -154 -18 43 70 -3 -65 -155 -123 7 205 176 -89 -54
8000 -54 256 -100 -95 -97 108 -16 187 207 58 204 -32 -27 0 -11 35 -44 25 80 12 -29 35 -115 142 -23 92 23
8026 23 123 50 -81 -47 12 24 -5 68 86 -499 -233 349 239 69 8 45 128 61 -258 -167 -21 -108 -38 -95 18
8051 18 -84 -71 142 -397 117 -128 126 54 -287 7 66 -57 -1 -77 -268 416 -49 -223 301 -183 -63 -77
8073 -77 -301 146 136 103 -19 -35 75 114 14 -64 99 87 -141 -180 -86 113 -64 214 7 -201 -171 -140 -207 -42
8097 -42 -130 162 -267 -200 -35 -35 115 -101 310 51 67 -94 -80 -157 134 111 -151 -236 105 18 -218 -203 -78 169
8121 169 115 -93 147 -52 71 -22 -15 110 -272 -116 -184 -132 59 73 41 41 70 166 23 -82 -13 -195 37 -10 -25
8146b5l0L04l15Q7l1J66k70J82n6N5K6k54P8M9kK6L5rj24K22j40R4j89K00j10
8171c1q5K14j30j33L03j16J1M3j12K27j84J58N9k26MJ63j91j95J14K69
$$ plain form
8146 -25 -55 249 -66 21 -10 156 -114 68 12 67 93 -161 -83 -34 -36 -10 25 16 -108 114 -26 68 -121 79 -31
8171 -31 -116 98 -32 -165 138 22 33 76 -36 191 7 165 224 -2 2 165 -26 -221 -107 162
8191A62
$$ Imaginary data points
##PAGE= N=2
##DATA TABLE= (X++(I..I)), XYDATA
0@%%%%%%%%%Qj6J6j6K4l2L6m4N6o4P2q8J04j20J41j65J89k13K40k76L16l59M03
32B12m51N03n60O25o96P74q56R44j040J145j261J387j523J672j833K010k205K420
50A267k660K925l221L555l936M371m874N464o163P006q039R336j1006J3221j6280
65i034K0733k7701L9908o6470K11821k15856q5597L54803m02686K28581K5847
76G4349j86425J65052j1955j26943J25822K8173k22500L01194j82644p9420L27150
87B11853m02991K58457J6764k55181L21882k02713J095J38408j32916J4597J02853
98G2108j10272j1978J78318k60066J78161L4011k49981L34474k33213R867J98059
109A39488k69503J78916p747j19456J22563j9366r2972J14782j7421j32806K22645
$$ plain form
0 0 0 0 0 0 0 0 0 0 0 8 -8 8 -8 16 -16 20 -24 32 -32 40 -48 56 -64 77 -88 101 -112 128 -148 168 -191 212
32 212 -239 264 -296 329 -367 407 -449 495 -545 600 -661 726 -797 875 -958 1052 -1153 1267
50 1267 -1393 1532 -1689 1866 -2070 2301 -2573 2891 -3272 3734 -4305 5031 -5975 7246 -9034
65 -9034 11699 -16002 23906 -42564 169257 -46599 -132196 222607 -180079 48502 74349
76 74349 -112076 52976 41021 -85922 39900 68073 -154427 146767 -35877 -115297 211853
87 211853 -191138 67319 84083 -171098 150784 -51929 -50834 87574 -45342 -30745 72108
98 72108 -38164 -50142 128176 -131890 46271 80282 -169699 164775 -68438 -58571 139488
109 139488 -130015 48901 41154 -78302 44261 24895 -68077 46705 29284 -103522 119123
120A19123j74710L613J87771k78517K11117k9319j51519K24499j59208J5202J01221
131F9273j14858L2601O9444j03823L7400Q3706j68898J48161k4655j26415K08973
142A10909j70211L6643J05539j69561J25196j5684p7443R2748l0164n2596Q5979
153D1355l8936n6700J29413j22159L1095Q8178j59358J37495l6869p6687J32320
164F9147j01933J5595O2041p8959L1481L8549p3591M4135K9607r4308J00430l8984
176C210n2368J14245j07580L9040M6038r3732P8363j7901m2118O0842k9975k2395
188b4331N4612m1011r032N9197p2479L6979K4274p1685P4806l2853k4306O0178
200C4349n3962J4120K7954m3152K3286J4383l9719L3596q4l6987N0792l0587j1218
$$ plain form
120 119123 -55587 -51974 135797 -142720 68397 39078 -112441 112058 -47150 -31948 69273
131 69273 -45585 -12984 56460 -47363 -9963 73743 -95155 53006 28351 -98064 110909
142 110909 -59302 -22659 82880 -86681 38515 22831 -54612 38136 7972 -44624 41355
153 41355 2419 -54281 75132 -47027 -15932 72246 -87112 50383 13514 -63173 69147
164 69147 -32786 -17191 44850 -34109 -2628 35921 -37670 6465 36072 -58236 42194 3210
176 3210 -49158 65087 -42493 -3453 42585 -51147 27216 9315 -32803 28039 -1936 -24331
188 -24331 30281 -10730 -19762 39435 -33044 3935 28209 -43476 31330 -1523 -25829 34349
200 34349 -19613 -5493 22461 -20691 2595 16978 -22741 10855 10771 -26216 24576 -6011 -17229
213a7229M5857n0707K4334J4945m0827L7420r978k0802L3404k0164p533K9075
225A7795k8532O656K0039l3289K3919J526k5239L2081j7942o307K4093k4485Q177
238a508J1884k1622J5098J865j6317J8534p557q468J7823j4735J866J1904j7113
251h346J0634J864j2238J3219m799o177J1555r093P78Q490j1059O153K403q730
265e346Q152k352m605Q203n308j089O432p643M405J659n888M833j129k657M369
280B036k941m96L267l449J774Q65l209K732r52r29K713j718J28Q72j351R48J16
297D06j027R96j42o84J035j095L29N82p24M67r4j81L02k8r4L8j34R7K98l66j28
318a47L81j97q5K68l16K4N4r4K51J58p39Q80k99l47R04r95MJ091j751J341k71
$$ plain form
213 -17229 28628 -22079 2255 17200 -23627 13793 3815 -16987 16417 -3747 -11280 17795
225 17795 -10737 -4081 15958 -17331 6588 8114 -17125 14956 -2986 -9293 14800 -9685 -1508
238 -1508 10376 -11246 3852 5717 -10600 7934 377 -8091 9732 -5003 -3137 8767 -8346
251 -8346 2288 4152 -8086 5133 334 -5843 5712 -3381 -2603 5887 -5172 981 3384 -5346
265 -5346 2806 454 -4151 4052 -1256 -2345 4087 -3556 849 2508 -3380 1453 324 -2333 2036
280 2036 -905 -1401 1866 -1583 191 1056 -2153 579 -373 -1302 1411 -307 -179 693 -658 290 406
297 406 -621 375 233 -451 584 -511 -182 400 -324 143 49 -132 170 142 48 86 -48 49 347 -19 -147
318 -147 234 37 -48 220 -96 -72 -18 -112 139 297 -442 438 139 -208 696 -299 -295 796 -955 386 115
339A15j239K080j378k63K224k394N78J692l307K529J7k469L311k262r38L789l716
356a631J410K220m490L433K32m134N219k665j717N483n415J225M041o880M935
371A266Q29o282P677l575l405Q315p690J836N406q792N787J403p223P996k652
386H96n715J0655q239o45R699j2407O871L528j1537J1730m226o122J1730q556
400b338r53R694j1074L872P178j4120J1421p3j2487J7542j1283k131J4126j6927
414g553Q151N365j3891J1905q88j0694J4233o363p871J7877j5871J979J4677k2840
428a1784J6775O5j6503K2024j3340l413J5496j5358L556J0846j6357Q260Q023
441H290k0471J9484m451j5094K6618k1886L600J6298k5060J7306J83j5046J7090
$$ plain form
339 115 -1124 956 -422 -685 1539 -855 -277 1415 -1892 637 654 -1815 1496 -766 -1704 2085 -1631
356 -1631 -221 1999 -2491 942 1174 -2960 2259 -406 -2123 3360 -2055 -830 3211 -3669 1266
371 1266 2095 -4187 3490 -85 -3490 4825 -2865 -1029 4377 -4415 1372 2775 -4448 3548 896
386 896 -4819 5836 -2403 -3048 6651 -5756 1115 4643 -6894 4836 610 -5512 6218 -2338
400 -2338 -3291 6403 -4671 -799 6379 -7741 3680 3607 -8880 8662 -2621 -4752 9374 -7553
414 -7553 598 5963 -7928 3977 3089 -7605 6628 265 -7606 10271 -5600 -3621 11056 -11784
428 -11784 4991 5056 -11447 10577 -2763 -6176 9320 -6038 -2482 8364 -7993 267 8290
441 8290 -12181 7303 2852 -12242 14376 -7510 -3910 12388 -12672 4634 4817 -10229 6861
454F861n902r182J6582r612p311K1961k2456O980J5062k9518K6271p444j5320
467a3028K7688k1904L768J3735j8589Q090Q330j7088J0627P279k3413K5181r646
480A030j4522L1696l0312J1251J3540k8788K5268p290j1545J8396r549o728J6357
493H804j1159o198K3580k7111J2602J2384l1767L2695j5127j0315K7979k7090
505a0723J0773Q357j7276J0696M831j5702J2081M227k2154K7903j5104r650L0869
518A9128l4969J9146O372k5685K8168j3978n501J6346j1764k806J4623j3282k119
531f321K0736k8201J7891N232k7608L4770k2030k270K2901k7572J5612L047j4760
544h573J2192R38j3175J3089L12j7667K6511j8650k494K4041l2614K2567o80j8943
$$ plain form
454 6861 959 -8223 8359 -1253 -8564 13397 -9059 -2079 12983 -16535 9736 2292 -13028
467 -13028 14660 -7244 -3476 10259 -8330 -240 8090 -8998 1629 8908 -14505 10676 1030
480 1030 -13492 18204 -12108 -857 12683 -16105 9163 1873 -9672 8724 -825 -7553 8804
493 8804 -2355 -8553 15027 -12084 518 12902 -18865 13830 -1297 -11612 16367 -10723
505 -10723 50 8407 -8869 1827 6658 -9044 3037 7264 -14890 13013 -2091 -11741 19128
518 19128 -15841 3305 9677 -16008 12160 -1818 -7319 9027 -2737 -5543 9080 -4202 -6321
531 -6321 14415 -13786 4105 9337 -18271 16499 -5531 -7801 15100 -12472 3140 6187 -8573
544 -8573 3619 4557 -8618 4471 4783 -12884 13627 -5023 -7517 16524 -16090 6477 5797 -13146
558a3146K5145j5996n49J2491j1896N05J1326j2998J801J4571k4267J9108r49
571E146j9433K9617k2780L715J5177k2785J5630r43j0677J1249j144r880J2425
584E317l839j0963K1658j8806L208J5078k5230K1194n527j1628J9712j5097K504
597b419Q799j0221K281P709j1474N231P385j7611J7078n256j0438K0654j8963
610g245O416Q030j5772J3071k882p130R520l392n604J0329o226m587J4263j5130
624f339O465O610j6506J6527o890n502J3103j1627L186N340q118L792L978q657
638d638O145K052j0107J2465p115l182J1833j3213O640L276r793R380l079m301
652c637O860l783k423P076o102R2O853r454N769J532p933R768n833j252O944p567
$$ plain form
558 -13146 11999 -3997 -4546 7945 -3951 -3446 7880 -5118 -3317 11254 -13013 6095 5146
571 5146 -14287 15330 -7450 -3735 11442 -11343 4287 3344 -7333 3916 2772 -7108 5317
584 5317 1478 -9485 12173 -6633 -3425 11653 -13577 7617 2090 -9538 10174 -4923 -2419
597 -2419 6380 -3841 -1560 6149 -5325 -94 7291 -10320 6758 1502 -8936 11718 -7245
610 -7245 -829 7201 -8571 4500 1618 -5512 4008 616 -4988 5341 -885 -5472 8791 -6339
624 -6339 126 6736 -9770 6757 -133 -5635 7468 -4159 -973 4367 -3751 41 4019 -4638
638 -4638 1507 3559 -6548 5917 -1198 -4380 7453 -5760 880 4156 -5637 3743 664 -3637
652 -3637 3223 -560 -2983 4093 -2009 -1917 4936 -4518 1251 2783 -5150 4618 -1215 -2467 4477 -3090
668c090K978K909n644L644J342n349N039p99m278P045n203k11N093p004M525P27
684A724n141N899k606j735M213l136l86L523l964J192K564m915M161n94l248M989
700B540l557P9L133l896K073R65l027K479l96j959K888j596j060L016k981J019
716b80J777l087K512k67k098K377j516j34K038k165O88P85j764J425K09j553K033
733I80r63j040K190j751L39Q22j356J069Kr42J084o3j77j58j190P64R86q56O31
752C71Q1r93Q73m20l25P46l19M7N66p93K54K24m63M54k19j97K46k23p6L98n06
773b74L59Rl28N50j69j64P4j80M4J25k34L20k57RK82n8l36M34k68J09J32k08m7
796g6K42l08L63k50q8K0r1K68J08l73L53jl89K58L14n16L18j72l04N65m15J47
$$ plain form
668 -3090 -112 2797 -2847 797 2139 -3210 1829 1030 -3248 3797 -1406 -1617 3476 -3528 997 1724
684 1724 -3417 2482 -124 -1859 2354 -782 -1168 2355 -1609 -417 2147 -2768 1393 799 -2449 2540
700 2540 -1017 -938 2195 -1701 372 1337 -1690 789 393 -1566 1322 -274 -1334 1682 -1299 -280
716 -280 1497 -1590 922 655 -1443 934 -582 -716 1322 -843 -155 630 -1134 291 500 -1053 980
733 980 17 -1023 1167 -584 -245 577 -779 290 292 -650 434 371 194 36 -1154 -390 596 -260 371
752 371 452 -541 332 -88 -413 333 14 61 627 -166 88 312 -151 303 84 -113 133 -90 -166 232 -274
773 -274 85 94 -234 316 147 -17 57 -123 -79 46 -188 132 -125 -116 166 108 -228 206 -62 47 179 -29 -76
796 -76 166 -142 221 -29 -117 -97 -188 80 188 -185 168 167 -222 36 350 -166 152 -20 -324 241 -174 -27
818b7m9N4p1Mj24L34j39k09L16k38P4P2k45O5L85o01N49K7j111J253l63q3L11
841A84k25j03O70q83L24M7m24N06j1p7L47o22J29L92o58M38L80q34P40j73p06
862e59J066o04q0O66p57K88O46j259R03J13j194J457p56j54J238j443L46M99j284
881h68J190r1q59J448r06k94J159j119O0J120j702Q63O41j611J589p84p92J953
899I97j631P80P01j770R04O87j463J422k89j351K114j535j24J750k174J445J98
916F61j541J691p08q93J720j289KJ117j370O04J269k479J778J87k159K723j637
933c24j10J531k037J122M79j793J704n4j443J532k50j489K543k203K17J879k657
950a353K165m45j575K641j618n33J691j584J47J435j643O02R15k428K415o89j449
$$ plain form
818 -27 -76 -22 -93 -89 -213 121 -18 -227 89 -149 -75 -3 -248 -183 202 -399 150 177 -934 319 -44 -127 184
841 184 -41 -144 526 -357 -33 14 -410 96 85 8 355 -267 -138 254 -404 34 414 -420 320 147 -559
862 -559 507 -97 -177 489 -268 20 666 -593 310 423 -771 686 -70 -224 1014 -429 -83 416 -868
881 -868 322 231 -628 820 -86 -380 779 -340 -280 840 -862 1 642 -969 620 -164 -956 997
899 997 -634 146 847 -923 -19 668 -795 627 338 -1013 1101 -434 -558 1192 -982 463 661
916 661 -880 811 103 -790 930 -359 -357 760 -610 -6 1263 -1216 562 749 -1410 1313 -324
933 -324 -434 1097 -940 182 661 -1132 572 518 -925 607 357 -1132 1411 -792 -575 1304 -1353
950 -1353 812 367 -1208 1433 -185 -718 973 -611 -464 971 -672 -70 845 -1583 832 143 -1306
967a306K990k492M97J342k299J858j68j427J468j11j223J843p84j123K498k586
983a023J043J127k844K894j215j080K294j701K92Q25j407N34J276j900J137N21
999G73k221K501j148j106K689k829J197R23j844J646p19n63J174n58p64J651j019
1016b17m56K190k718J426Q63k586K529j291m98J976k223R10L88q92M98Q33j438
1033g06R58K20j730K400j723J46J649k494J778o8j525J580m26m30Q22n64l72J229
1051G44j289Q5J538k197J530J45j606K134j618K07J006j297J07O34L13p43K54
1068e3j048J567L7j714K159j187K18O53j625J463m51l50R93p61k00O86o50P9P53
1087E69q90K70O47j467J379l33o00R44n92j65Q42j085O42m8l37O17k68m84R26
$$ plain form
967 -1306 1684 -808 -311 1031 -1268 590 422 -1005 463 352 -871 972 188 -935 1563 -1023
983 -1023 20 1147 -1697 1197 -18 -1098 1196 -505 -213 612 -795 -261 1015 -885 252 773
999 773 -1448 1053 -95 -1201 1488 -1341 -144 779 -1065 581 -138 -701 473 -85 -849 802 -217
1016 -217 -673 1517 -1201 225 1088 -1498 1031 -260 -758 1218 -1005 -95 293 -599 -101 732 -706
1033 -706 252 472 -1258 1142 -581 -435 1214 -1280 498 430 -1095 485 59 -371 451 -113 -485 744
1051 744 -545 -460 1078 -1119 411 556 -1050 1084 -534 -327 679 -618 -511 123 436 -307 -53
1068 -53 -1101 466 503 -1211 948 -239 -21 632 -993 470 19 -331 662 -99 -299 387 -263 -184 569
1087 569 -321 -51 596 -871 508 175 -425 519 -73 -238 604 -481 161 113 -224 393 125 -359 567
1106E67p03l4J070j472O62M10r05P11k21k81N46n41J50K55l88k6O14p46O3J78
1126i1P0M81j042N02k34O6N49k48M1j02J07l84N98k79l48M58j36L0j08j11L08
1147A27M9j51J98j78Mm4j67K71j21l00K24pK0J11j60n6L22j32mp9j51K72j2l3
1171CK0M1R6j71K2j79L48K5j33l2r8L01m27K01N3P5j50K78l78J79k72K26k0k10
1195b02L89k57j22Ll04R69p5n59K07M2pOk55J15Q7J39k06Q0J7k13L12m74N41n6
1219A77qk81L16l58M23l02L76n21K72rJ30k03P8j90N3J23m7j69L34j36J6j95R9
1242b2J25k47L1J90L4K9k58N5mL10k68L9P3j03J39p7o8R0k0q9M4K01k87L9J76
1267A32j83J84j6O5l19J95p4M2jK1K2j48K55J65j65m95L86J15k34J00l77L53k33
$$ plain form
1106 567 -136 -170 900 -572 90 500 -405 306 85 -196 350 -191 -41 214 -174 -200 414 -332 -269 -91
1126 -91 -21 460 -582 -80 -314 -248 301 53 94 -8 99 -285 313 34 -314 144 8 38 -70 -181 127
1147 127 176 25 223 45 49 5 -162 109 -12 -312 -88 -95 -75 36 -124 -180 142 10 6 -73 -224 48 36 3
1171 3 23 64 160 -11 11 -168 180 205 72 40 -58 243 -184 17 70 145 -5 273 -105 74 -198 28 8 -202
1195 -202 187 -70 -192 -189 -493 476 401 -158 49 91 84 90 -165 -50 37 176 -30 50 67 -146 166 -308 233 177
1219 177 169 -112 204 -154 269 -33 343 -178 94 85 215 12 90 -100 -47 76 29 -140 194 58 74 -121 -22
1242 -22 103 -144 -113 77 111 140 -118 -63 -67 243 -25 14 87 -16 123 46 -22 68 48 -41 3 204 -83 -44 132
1267 132 -51 133 117 182 -137 58 -16 26 25 46 68 -80 175 340 175 -320 66 181 -53 47 -330 23 -210
1290b10J48M9K21l20Q6J49j24K0n8j16j4K67p7l4J13l12K04J72j21j01k61N59
1312B40m73J06M4j6L1J65l70N5M33l60K43Kl20L17l5m2J68j67J24k80Q0J06K4
1335G5J39j16j38j49J84j81J21K72m77N45l62j48L88k53j27N51m55K46L27n29
1355h7K33J40p04N49o2j26K30l23o7N51o69L76L29p68N75j53k65K66j44m9N22
1376C54o80K18N1j56L90j99j27M67m67J09K73k72J76L6n50M14P7l98O55m21l11
1397c61Q80p12L38p6n34R98m97n42P00m23N0M08m59K52N70q94M29R5o38O24l53
1418a45N6O19q20K96K65o11N17q4o27O57j17m15R22p19Q9O25j074Q64J56q47Q05
1439D12m65l20Q49n47j11N82o23lQ09j148Q68j22q47J326q96o8J137j436P07L55
$$ plain form
1290 -210 -62 -13 208 -112 -26 123 -1 19 -39 -155 -169 98 21 -13 100 -212 -8 164 43 -58 -319 240
1312 240 -233 -127 -83 -99 -68 97 -273 -218 215 -145 98 100 -220 97 62 20 188 21 145 -135 -55 51 75
1335 75 214 98 -40 -189 -5 -186 -65 207 -270 275 -87 -235 153 -100 -227 324 -131 115 442 -87
1355 -87 146 286 -418 131 69 -57 173 -150 -217 334 -335 41 370 -398 177 24 -241 25 -119 -168 354
1376 354 -326 -108 -57 -213 177 -22 -149 318 -149 -40 233 -39 137 173 -377 37 114 -284 371 -50 -361
1397 -361 519 -193 145 69 -465 533 36 -506 194 -229 -179 229 -230 22 592 -302 127 222 -416 208 -145
1418 -145 -89 530 -290 6 271 -340 177 93 -534 123 6 -409 513 -206 -117 508 -566 298 454 -393 412
1439 412 -53 -373 476 -71 -182 400 -223 -226 583 -565 303 181 -666 660 -236 -304 833 -603 104 459
1459D59j077Q53j57q03R54K20r71J205j114J59J233j844J463m95o76J132q19p8
1477c56J049r58j5P92j070N89P62j742J562m01j098J713j477O83M19r29Q92k57
1495A58o98R70k05n11O48p12m73J706j736R46O16j848J779o64o84J307j043N01
1513E7O20p88K6N72p72M60M23j610J787p97p12J721j746J023L35j442J183k44
1531I6q21J046l4q17J257r36m36J882k050Q77N33j545J627q09m11J039p38Q8M54
1550C02q17M51N96j007O50K38j291J767q41n29J387j908R61L40j136J328m53n51
1568e13J069n67l12R76j007J01J199j522P60M63j444J421q83k76J446j243J47
1585a85K42m94N78J73r73R62k18q52J626j195P0J024j523J263k41o36Q03m31l33
$$ plain form
1459 459 -618 235 78 -725 229 449 -522 683 -431 -272 961 -883 580 85 -591 541 -278 -356
1477 -356 693 -265 -280 512 -558 31 793 -949 613 212 -886 827 -650 33 452 -477 415 158
1495 158 -540 430 225 -286 362 -350 -823 883 -853 93 709 -1139 640 -24 -708 599 -444 57
1513 57 677 -111 -85 487 -285 175 598 -1012 775 -22 -734 987 -759 264 599 -843 340 96
1531 96 -725 321 287 -530 727 -209 -645 1237 -813 64 597 -948 679 -130 -541 498 -240 -152 302
1550 302 -515 -64 532 -475 175 413 -878 889 48 -481 906 -1002 -41 299 -837 491 38 -513
1568 -513 556 -11 -323 653 -354 -253 946 -576 184 647 -797 624 -259 -535 911 -332 -185
1585 -185 57 -437 141 314 -659 303 85 -767 859 -336 -266 758 -765 498 257 -379 424 -7 -340
1604c40O38k37o29J226r39K05M77j027R28k19p25J217r09M00M56j145O23K80o93
1623d13N65J62o80P68n07k89R68q28K49L21j122J199k64o87R25n53j02J075r28
1642a41K7O32q56O03J01q21O07m5l06Q93r03n9M79m19M19R6o01M68J2m52K39p
1664c4j56P20q00L00L46n38O26o75J26L72m72R2M30n03J61J42l41M25j42k29J98
1685D8j71jL34m92N11j12m38K80J53l74N65n82J54M55k81K4n9k55M99N5l79K69
1707B03k89J72K5j27P4L4k74L31k7j63N3j2k03L23n6L5rj33K05J89l46J73k13
1730c5K63j34j61j39J15N7J51j95J41Nj71j7O6m3Q6k4M0J2J4l9J9p0J67n0k37
1755a79j02M47j24m5r1j82K92J61k85J16J23j02p0o5K6J8j00m6J29j01R6L08k17
$$ plain form
1604 -340 298 61 -568 658 -281 -76 401 -626 302 83 -642 575 -334 66 522 -623 0 280 -413
1623 -413 152 314 -366 402 -105 -394 574 -254 -5 316 -806 393 129 -558 367 -186 -288 787 -141
1642 -141 -114 518 -338 265 366 -455 152 107 -199 694 -209 -268 211 -208 211 307 -294 174 186 -266 -27 -34
1664 -34 -190 530 -270 30 376 -162 464 -211 -85 287 -185 -93 337 -166 -5 137 -204 221 79 -150 48
1685 48 -123 -124 210 -282 229 117 -321 -41 112 -262 303 -279 -125 330 49 73 14 -241 258 313 -66 203
1707 203 -86 86 111 -16 58 92 -182 149 122 -41 12 0 -203 120 64 99 90 -43 162 351 5 178 -35
1730 -35 228 94 -67 -206 -91 -34 117 -78 63 68 -103 -120 -54 -97 -11 -35 5 17 31 -8 11 -59 108 58 -179
1755 -179 -281 166 42 -3 -94 -276 16 177 -108 8 131 29 -41 -106 -80 -62 -162 -208 -79 -180 -84 224 7
1778Gn6J31JRk23J78jk01N85m62q6L96l66J64j9j17R2j08m5K13l62M37j11N9k20
1803a05K94n6k94K80j52J47O7k46Q8J59k74JJ8j70N03k65k36K64j9J82j51j55
1825a20K19k15r9N00k87j92J18K7m2N2r3m8J23j17L61l66J69J12l32j3L08k44
1847a79K57m0M4k49K2k16L96j74n9M27m99L39K3j96L31j90j67K53k68J26M6k03
1869a76L95r5j6k7j89o3K35j82J2L62l09J02J14n45O94n01L57O0l44L01R4j37
1891A42j92k7k60N27l8l10L93m18k30O51k88J20J89n17N68j75m20M47k71QoN4
1913e3K00J89n52K65j09k58O65l20k31N13n98K58K27l30K36m3l03Q25n28l07O09
1934C55o79L61Q4m64O97j74m10N32l10k13L11l39L68J33o38M55J14n15M24j24
$$ plain form
1778 7 -49 82 83 92 -131 47 46 -155 430 -32 -118 278 -88 76 57 -60 32 -76 -121 92 -270 167 56 115 -105
1803 -105 189 133 -161 119 -33 114 181 -65 23 182 -92 -91 -73 -243 260 -5 -241 23 4 186 35 -120
1825 -120 99 -116 -215 285 -2 -194 -76 -49 -91 -39 -132 -180 -57 -174 187 -179 -10 102 -230 -243 65 -179
1847 -179 78 38 82 -167 -145 -361 35 -139 -198 229 -270 69 92 -104 227 37 -130 123 -145 -19 27 -176
1869 -176 219 124 108 81 -108 -171 64 -118 -106 256 -53 49 163 -382 312 -189 168 228 -116 185 279 142
1891 142 -50 -77 -337 190 152 -158 235 -183 -413 238 -50 70 259 -258 310 135 -285 162 -109 -101 -107 -53
1913 -53 147 336 -216 49 -60 -318 347 27 -204 309 -289 -31 196 -134 102 59 -244 581 53 -254 355
1934 355 -324 37 121 -343 354 180 -230 302 -8 -221 90 -249 119 252 -386 69 183 -332 92 -32
1954c2l33N33o88L81L41n60O00l49j00M32j23j87J14K1r3N88o71L32m8n30P76
1975D04m00k03K12LJ3K66n61K96J86n88O54K7o46Q29n40k26O38n19L30p9k51M60
1997C05l00r7L64k56j66M04l72k6L76n45K68M26p19P71l66k43K66k8J21j15l41
2018b73L39J75o16N86O1n57P63n52J05K41o50O43j68j63M62m66O2L24l19L7M7
2039H1j02K79o1l79K62J01m38M73m88J71J32q4Q9J50k44K04R2k92J28J35m24M88
2061B73m28M4K76m53K43Qm4J01k15J07P1j71K65j0j19O0J63l83N89m67l84O54
2083A80k84P1K89l66K63ok70L37k21j55K04k23J16J77k50J62N8oL5k20l35N03
2105E9k19M39k84k18K04J88j99L4J53l85M13k57J35j36j0k5J8l2K73j45j92J64
$$ plain form
1954 -32 -365 168 -520 -139 202 -358 242 -107 -207 225 102 -85 29 50 -43 545 -126 206 158 -372 404
1975 404 4 -199 13 16 29 295 -266 30 216 -372 282 309 -337 492 -48 -274 364 -155 175 96 -155 305
1997 305 5 -92 272 16 -150 254 -118 -144 232 -313 -45 381 -338 433 67 -176 90 62 183 68 -273
2018 -273 66 241 -375 211 272 -285 478 -74 31 272 -378 265 97 -66 396 -70 -8 316 -3 34 81
2039 81 -21 258 197 -182 80 181 -257 216 -272 -101 31 -53 36 186 -58 146 238 -54 74 209 -215 273
2061 273 -155 -111 165 -288 -45 -37 -81 20 -195 -88 -17 -188 77 67 -52 8 171 -212 377 -90 -474 180
2083 180 -104 -33 256 -110 153 147 -123 214 -7 -162 42 -181 -65 112 -138 24 82 76 111 -109 -444 59
2105 59 -160 279 -5 -223 -19 169 -30 4 157 -228 185 -72 63 -73 -83 -108 -90 -122 151 6 -186 -22
2127b2J34o1Rk51K52n6j72J98K39l61K03o2J02j5j46N2rj87j76M26j33K9jk67
2151b75J66J17J20J55n70J66K7j06K18L3n3J22j93LJ47j30J24k36J17L8j75Pk6
2174b04P07r79J32O8N73L68p12K1l09J31O49l91k93J51k86L01M9k72J41R6j98
2195b57J55j8R1m7k71Q4O56o81L87N0lj46L21J87r53O72J2L43k49n75L57r7l50
2218c32K21J137o67n34M67l88O8K32k82R3j98K24k50J39K8m1K09k37p1L33m24
2239b73J18J38K63j48o6N5j36OK23l07K33M2k47n6L90m25O52q18M16j10o41R98
2261C07m13K35k03m6K1K58r5N0l70J76L4K75j59j77P3Q8m12K18O3K79k05l9j2
2284e4J12p7rq8J95L2k15l8K19kpl5K0K47l37J3j41J91j1J4J95r6N5j05o2K25
$$ plain form
2127 -22 112 51 60 -191 61 5 -167 31 270 -91 112 50 152 137 -9 43 34 -153 -329 97 -36 -7 -8 -275
2151 -275 -109 8 128 283 -287 -121 -94 -200 18 51 -2 120 -73 -70 77 -53 71 -165 -48 -10 -185 -178 -204
2174 -204 503 -476 -344 -276 297 665 -47 -26 -335 -204 445 54 -239 -88 -374 -73 -24 -296 -155 -59 -257
2195 -257 -102 -120 -29 -76 -347 -263 393 -288 99 149 146 0 321 508 -445 227 239 582 333 -242 115 18 -332
2218 -332 -111 1026 359 -175 292 -96 -28 204 -78 15 -183 41 -209 -70 -42 -83 126 -111 -182 151 -273
2239 -273 -155 -17 246 98 32 87 -49 -43 180 -127 106 148 -99 -155 235 -190 462 -356 60 -50 -691 307
2261 307 -106 129 -74 -120 -99 159 64 114 -256 -80 -46 229 70 -107 -34 54 -358 -140 -77 202 -3 -42 -54
2284 -54 58 -19 -28 -116 79 111 -104 -142 77 75 68 33 53 300 -37 -24 -165 26 15 29 224 128 183 78 16 241
2310B41j99o1K00l23KK95k15K55k99J69j9p8M9O1M7j99q8N5K45k37K96l42K08
2333F3j08q7p2J81K16k67L6j99J87J63Rr3j12J37k52K90j78k13M03j45K28k70
2355h3L93n2j66j38k1J13j33JK4k2J42o2J66k96K73j81o5j52K19J26n7K8j3Pj02
2380e1L40l06l7N8j05J40k00J66o7J08j7J28K08l58N8o7P6J11n9j89j59K03p1
2403i0k84L60j45j16K24J24l33K04J96j31K41m90M89l54P7J16j68K25Q4k17l2
2424b0J09q8j25K14j08j3N8l61L74l5j95K09k3J0k97L75Q9n0k81L29k16J08j25
2447f2K0N0J56j47j17L7j43K73n5J15K9j55o3L8k7m7J04J74j54j41p5L64k07L2
2471aL18l73J02k5p5J04o7m5n0j32L56j43k16J48L20mj99j5j55J89j50P7M4o9
$$ plain form
2310 241 42 -19 181 -142 -140 155 -60 195 -104 65 46 -32 17 78 125 -74 -162 -107 138 -99 197 -145 63
2333 63 -45 -132 -204 -23 193 -74 -38 -237 -50 113 122 29 -83 54 -198 92 -86 -299 104 -41 187 -83
2355 -83 310 258 92 -46 -67 46 -87 -86 -62 -84 58 -4 162 -134 139 -42 -107 -259 -40 86 29 57 44 51 -51
2380 -51 289 -17 -54 4 -101 39 -161 5 -62 46 29 157 365 7 65 -2 74 185 126 -63 -222 -19 -90
2403 -90 -374 -14 -159 -275 -51 73 -260 -56 140 9 250 -240 249 -105 -28 88 -80 145 229 12 -20
2424 -20 89 1 -124 90 -18 -31 27 -334 40 5 -190 19 -4 6 -291 84 173 123 -158 171 -45 63 -62
2447 -62 -42 8 164 17 -100 -63 -206 67 12 127 156 1 -62 -24 -51 -98 6 180 26 -115 -190 174 -33 -1
2471 -1 317 -56 46 21 -54 50 -17 -62 -112 -244 112 -31 -247 -99 221 217 18 3 -152 37 -113 -36 8 -61
2495f1MK95o12K98Q9j06J27j49J62m9j47j39J27K34j18j04K58k74J77J38l36K01
2517A5Q5l27O5Q8K0O5R0j33P5j17l1O4m7J78j95O6J41r7J12m0J71l26R9j36L2
2542h3J90j74J46m6Pp5J90j34Q6q6q3J93j78Q0L21l15K29k24KJ03j13j08k8K11
2566A11j81K2n2o3J80pj5k5K71k21j03J3K27o2p6J23J40l20j38M04l01k28K74
2589b7K01k76j90K37R1N5p7o9J13l1J5llrj25p2L20j50k47J82Q7J58m62K47m6
2614h1N4J26j52J26n8J17q3q6l6k55L76j29K65l41j6J93r2J2n1O9P4j12J9j27
2638a88K62L8l37J38j0J49K7j80Q1J22j66J33N3l74K27n2o0K41j72L25j61p1j69
2661a44L50m12J99Q5q1p9NP2JRmK27l36J67j09Lk5k08L44P3p8P1k08J51o5O5J50
$$ plain form
2495 -61 -57 238 -374 -76 13 -93 34 -115 47 -2 -149 -288 -161 73 -45 -149 109 -165 12 150 -186 15
2517 15 100 -227 -162 -74 -54 11 101 -32 43 -74 -105 -41 -88 90 -105 -39 102 5 117 77 248 -78 21 -115 -83
2542 -83 107 -67 79 33 40 -35 155 21 107 21 -62 131 -47 33 354 39 268 44 46 149 36 -72 -100 111
2566 111 -70 -48 -100 -163 17 10 -5 -30 241 20 -83 -70 157 95 19 142 282 -38 -176 228 -73 -301 -27
2589 -27 174 -102 -292 -55 36 91 14 -55 58 27 42 39 36 27 -98 -170 150 0 -247 -65 22 180 -282 -35 -81
2614 -81 -27 99 -53 73 15 132 49 -37 -73 -328 48 -81 184 -157 -173 20 -72 -60 -111 -42 32 -80 -61 -188
2638 -188 74 112 -225 -87 -97 52 79 -101 -20 102 -64 69 122 -252 -25 -77 -137 104 -68 257 96 25 -144
2661 -144 206 -206 -7 78 -3 -82 -77 -5 -4 5 1 228 -108 59 -50 -47 -72 -280 64 137 59 130 -78 73 8 73 223
2688B23k34M9j19J77O7k01J08n4O4j49LJ71L9N3k15Q3L9l4k60L99k08o4m7L31
2712B21j70%j05j09J15j6K32k28j09M54p9l87K18q1k00J23K9j27R9K36l5m0K7
2735F8K08m32K89P2q7j74O9O2r6R1L0l6K53m49L00k15o2J15J56k08l3J54j90K84
2759A69k85J45q4j35R4J0R0n4l35P00m40K53r5J34j92n1p1L30l17L65k58J71k72
2782a28K78l08l9M07n5o8n7J19k22N6K46l49J9J21M7k19J87j73R7J95L5j63J89
2805B15l14K7K14J06k65P9j58J60J08j44o1k36R3L28j06j26K65j33p8k89J69J19
2827b7Pm5K28r8r7J89k77P8p1M5R7j09L0r9K70k32P9o9k4K36L2k97K57k46J1J85
2853E3j86O6L97l61k6Q9Rj23M6L2K11j82jj87mL27j14j5n2l8K65j83J00k03J65
$$ plain form
2688 223 -11 38 -81 96 163 -38 70 16 80 -69 -66 105 144 197 -18 65 104 70 -190 209 1 -63 -110 221
2712 221 51 51 -54 -163 -48 -64 168 -60 -169 285 206 -181 37 -44 -244 -121 -92 -219 -120 116 81 41 68
2735 68 276 -156 133 205 118 -56 13 75 -21 70 100 64 317 -132 168 -47 -109 6 162 -46 -79 75 -115 169
2759 169 -116 29 -55 -190 -96 -86 4 -50 -385 315 -125 128 33 167 -25 -76 -147 183 -134 231 -27 144 -128
2782 -128 150 -158 -197 210 155 87 30 149 -73 -17 229 -120 -101 20 67 -152 35 -138 -41 154 189 26 215
2805 215 -99 -72 142 248 -17 62 -96 64 172 28 -33 -269 -176 152 46 -80 185 52 -26 -315 -146 -27
2827 -27 -20 -65 163 65 -32 157 -120 -42 -113 -68 29 -80 -50 -149 121 -111 -32 -101 -125 111 143 -154 103 -143 -132 53
2853 53 -133 -67 330 -31 -57 32 41 -82 -36 -4 207 25 24 -163 -167 160 46 31 -21 -59 206 23 123 -80 85
2878H5o5O4j77K4j69R8P4o4o2L42k1l47L77j79K5K98l43Q8J23k49Q0J08o4j11
2902f5j08kK65j55Ql6oM6K19l34q4J76K94j28N6j50J25j84m9M5L8J40J32m78j09
2927c44N32m78n1K44L79j66j13J3j01q3J88J89l31K78o8k10R8oKp5Q6j12J85q2
2951b6K92l42J58k9k98L15n7m0J16n0j41K11l14L08j65J74j54K34k99L14l58Q6
2973f5J32k4j67O9p9K51j76l46M93m01K87J80M4j51l2K51l74J38K50k81M4K4P5
2996A42Jl07K02k01K61k51l9m0K55K3j88J11j18K84L3l10K14j13o0M6j49K68j52
3019h8J04PJ29p9j87Q9J93p8j32P1k75J41R7O0N4K26k19J8jl32mJ42K60q3l00
3044a87MK44k89O5J00k9O1l5mM2j7r5J92k27J95l4l6J34j59J09O9o7K4J72k09
$$ plain form
2878 85 20 84 -93 -69 -238 -140 -66 -130 -192 150 129 -218 159 -20 5 303 -40 48 171 -78 2 110 46 -65
2902 -65 -173 -175 90 -65 -57 -93 -99 -53 166 -168 -252 -76 218 90 146 -4 121 -63 -112 -67 -29 111 243 -235 -344
2927 -344 188 -290 -341 -97 282 116 3 16 -85 -168 20 209 -122 156 88 -122 -24 -30 -28 -103 -17 -129 56 -26
2951 -26 266 -76 82 53 -245 70 13 -27 89 39 -102 109 -205 103 -62 112 -42 192 -107 207 -151 -65
2973 -65 67 43 -124 -55 -134 117 -59 -405 88 -313 -26 154 198 47 15 266 -108 30 280 -1 43 67 142
2996 142 143 -164 38 -163 98 -153 -192 -232 23 46 -142 -31 -149 135 168 -142 72 -41 -101 -55 -204 64 -88
3019 -88 16 23 152 73 -114 -25 168 90 -42 29 -246 -105 -8 52 106 332 113 131 130 -202 -206 -64 196 113 -187
3044 -187 -183 61 -228 -163 -63 -92 -31 -66 -70 -28 -45 -140 52 -175 20 -14 -50 84 -75 34 103 36 60 232 23
3069B3l43L52l7L9l7j26J99J1k5m3J53k47K31n3q8j43R1K1l54N38Q8q78R45m27
3093a10j46K30j17N84J17p09P43r0m27j58J8m7J58Q4j24K35k67k43K79J48%k31
3115g3L31j70k02K65j74k8K80k20K4n6J6K16n00J74J14j45oJ59Q1n1j93J55K31
3138B28o7k85J12J0N7j05Q5q4L8M7k06M0K29N2j94L40l82O5j4j4J13k21Q6K21
3162A51k8NK0j88M5J12J14k64o2k7l0J82j24O6M1J02j09j3j98K83k54L95k08M8
3186E9O6LJ4j06r3jJ11p4K19k61J79Q1m16J2J79j51J85q1mj8J59k70O7K51k12
3211a02J32K3j6n0j43N6K64n06L92R5J2k81J54k87L82p9k45R9J56J08j73J10j48
3234d7J49k42K00k0m4K7J30j46m7q1K44kl53K30O7k88K49O2j64J22n6J91k77N7
$$ plain form
3069 23 -320 32 -5 34 -3 -129 70 81 56 13 166 -81 150 97 9 -134 -43 -22 -376 162 250 -628 317 -110
3093 -110 -256 -26 -143 441 558 -151 592 502 75 -83 -65 -112 46 130 6 241 -26 -269 10 158 158 -73
3115 -73 258 88 -114 151 -23 -51 229 9 33 -23 -7 209 -291 -117 -3 -148 -154 5 86 35 -158 -3 228
3138 228 161 -124 -12 -2 55 -50 35 -49 -11 36 -170 -130 99 151 -43 297 -85 -20 -34 -48 65 -156 -70 151
3162 151 123 128 148 -40 5 117 231 -33 -95 -122 -152 30 -94 -28 13 115 6 -7 -205 78 -176 219 11 59
3186 59 125 128 142 36 -57 -58 53 -21 198 -63 116 197 -219 -207 -28 -179 6 -75 -79 -97 62 -208 -141 110 -102
3211 -102 30 53 37 -13 -156 -100 164 -342 50 145 157 -124 30 -257 125 46 -199 -100 56 164 -9 101 -47
3234 -47 102 -140 60 40 -4 23 153 7 -40 -121 123 121 -232 -2 65 -223 26 88 -76 46 -10 181 -96 -39
3258c9q8l2K03q3J47k91p0P3L14J41P3j76L1j91M1j1p5p5N2L8J19l14K69l17L25
3283F4k8m27J387r17Kk53J41J84j90Q4J2j1Q4J15j40j56k18L89q0J25k71p5L01
3306A22l16K89n1O9k33M2K16j62J41j4Q6j92k36L89j82o8K20k81k4L33j53P8j61
3329h8J52k0J18n8q1r3k9J73k98L84l7p0r7M2L8N9j09M6r1N5k7j47J63J4O5j49
3355h5J53k94J16J13R1K51j84j03m7J11J28k0k43j29J62j28L24k99j06K65j63
3376h7L20l06M8K37k44J25J12kk14o6J8J05k04K30k32K25M9k13J17N9jk57P4K36
3400A29k54J35p8M2r7L67k31j15J38l10J49K44Qo7j10o3K15j55L65l65Jj72K25
3423AJ14N4j9m5l47K98j39J62LL3j79P1k02j86O53m21K11l1J83k09J09o7Q3j79
$$ plain form
3258 -39 -127 -159 44 -39 108 -183 -253 -180 134 275 348 172 203 12 53 42 -33 -108 -56 -18 101 -213 56 -261 64
3283 64 36 -391 996 79 81 -172 -31 153 -37 47 59 48 132 247 107 -49 -267 122 42 167 -104 -179 122
3306 122 -194 95 44 113 -120 -78 138 -24 117 103 189 -3 -239 150 -32 -100 120 -161 -185 148 -5 73 -88
3329 -88 64 44 162 104 23 -70 -99 74 -224 160 123 53 -44 -2 36 95 -14 32 -59 -4 -31 -178 -15 -1 64 -85
3355 -85 68 -226 -110 3 94 345 161 58 11 122 250 230 -13 -142 20 -108 216 -83 -189 76 -87
3376 -87 233 -73 -25 212 -32 93 205 203 -11 -77 -59 46 -158 72 -160 65 114 -99 18 77 76 -181 -107 129
3400 129 -125 10 -68 -26 -123 244 13 -102 36 -274 -125 119 127 60 -50 -113 102 -53 312 -53 -52 -224 1
3423 1 115 169 150 105 -242 56 -83 79 82 115 -64 7 -195 -381 272 -149 62 31 214 5 114 47 130 -49
3447d9r1J90j40M54k18k11K74m19L3K65o5j31J44j11J0J83o8k3q7K39j27l29L42
3470F5j54J57l6j45j98L57j29q6P5j57K39Rp1p9M39j91j9J4q3j02K18j33l2K1
3494b1J67k21l20L91q1QJ84n7l09K04q2K43j21o6O0p8J54j50j5jK29Jp0q5J42
3519A06l29L27l8k02J19j79L47k40k6L53j30j18j81J00L2J46K5j39k23J46q6j3
3541b03K2M01k34k1P7m8K35k28j86L53j63k41M04k4r5j1j13M4m8J78l9n2J52j62
3565bJ98j98J6M1j56m9P2K22m17M21n6k8n2j62K62j26K14l40%J09J3l2n8J85j27
3590e0J92k31K30k21p1P6j5J38q9J48L0k74JL50j23l23J95M7k1J92j61o8q6K13
3614G9L0k91R5P3R7j01l4K96l3l40J89k90K73l9Lk24K66j79J05j5r0J37k34J80
$$ plain form
3447 -49 -140 50 -90 364 146 -65 209 -210 -177 88 23 -108 36 -75 -65 118 50 27 -60 179 52 -277 65
3470 65 -89 68 32 -113 -311 46 -83 -169 -94 -251 -12 -3 -74 -153 286 95 76 90 7 -95 123 -10 -42 -21
3494 -21 146 -75 -395 -4 -85 -77 107 50 -259 -55 -137 106 -15 -81 -21 -99 55 -95 -110 -111 118 119 49 -36 106
3519 106 -223 104 66 -136 -17 -196 151 -89 -115 238 108 -10 -191 -91 -59 87 112 -27 -250 -104 -190 -203
3541 -203 -181 220 -14 -35 42 -6 229 1 -185 168 5 -236 168 144 49 38 -75 -31 -79 99 60 8 160 -2
3565 -2 196 -2 14 55 -101 -150 -78 144 -273 148 92 64 12 -150 112 -14 200 -140 -140 -31 -18 -50 -108 77 -50
3590 -50 142 -89 141 -80 -151 -75 -90 48 -41 107 137 -137 -136 214 91 -232 -37 10 -11 181 20 -48 -134 79
3614 79 109 -182 -87 -14 83 -18 -52 244 211 -129 60 -230 43 4 7 -217 49 -130 -25 -40 -130 7 -227 -47
3638d7K51l77L24N3j13j82j43K82J07q5p0R4l49M36k59M6j67M89l67K09j12j75
3660a55r4L85k00P8p4%J82k4k92J98K95k42J22K4r9P2k0k77J34j27L03j2k74O9
3684b8N0L6p7J65L9o7n9j61J54j47jj2k4J67J1N0m4j68P9P6J52k37J15m1N6j83
3710i9k2J27q1P1LK53P8m00l00M49k23J97k68J72l11L62K23k56J49k67M5j97L46
3733E1j27L9J45N7q2o2j20K48Jk13K55mN8j98N5O5P4k24QJ61kk20R5R4q81J308
3759E81m03n91M81k45L76l15q0O62k80k7j65M3k03j32L71k67J9K95k11o9j39K31
3781f8Rn7p4K02kk89O30o29J25Q6J19N5k15K69l50L23n73M00L01j14k11K7O33
3804E97p46k38K13q6m26N89j75K2M48k39R3K63j84K9l59J49P0q6J83k29M34m07
$$ plain form
3638 -47 204 -173 151 204 91 -91 -234 48 155 70 0 94 -255 181 -78 -32 -199 290 -77 132 20 -155
3660 -155 -249 136 -64 14 -60 -60 122 98 -194 4 299 57 179 203 104 176 156 -121 13 -114 189 177 -97 -28
3684 -28 22 58 -19 146 185 118 59 -102 52 -95 -96 -108 -132 35 46 96 52 -116 -37 39 191 -46 69 28 84 -99
3710 -99 -121 6 -75 -4 -1 252 330 -70 -370 79 -144 53 -215 -43 -354 8 231 -25 124 -143 -98 -295 51
3733 51 -76 -37 108 165 83 21 -99 149 150 -63 192 188 246 48 103 168 242 18 26 187 185 -35 60 154 -727 581
3759 581 178 -413 68 -177 199 -116 -196 466 186 159 -6 37 -166 -298 73 -194 -175 120 -91 -160 -299 -68
3781 -68 -59 -116 -190 12 10 -279 351 -278 -153 -67 52 107 -108 161 -189 134 -439 -39 262 148 -63 -36 597
3804 597 -149 -387 -174 -260 -686 -97 -272 -250 198 -41 52 315 131 160 -199 -50 20 -66 117 -112 322 -85
3826h5j9J49p9K32j68k5o2K5m6K05j49J05k3k18j61L59j29L07m18N2J71J9r6K32
3850A78k41j8J42K8j87M1P5k3j10K07Q4l64J32J20n4j96L19o9j11L48J1l88Q4
3873Hr9J01k44L30q8M4j13O9j6n7N8j02M0L04j89J61j76J12j59K01p1Q3j59pq3
3898e2R8M3l8j52Q2K7K7j27J05j2J8j1L5N4j96j84L03o6j4j25P7KK15k52K66j53
3924c0j25K99k74L70j49j85J30k12lJ42J57j04k36K33r0L36r1k03o8L21j68j05
3946e5P0J47j72J25q9R6j23R3j01nQ3O5k69K38K1J26k47J76k35Q0j26J4Q2k90
3970b96M29k18m2J14M9j62K50R4j92k80L53k03J60j23J09o6L6J97k29J27j39J79
3992A47j1p3n2R4j63l15L88l07M90m8j93K24j83J3J07k42L86r1j63J59j59M2J1
$$ plain form
3826 -85 -104 45 -34 198 30 5 -57 -32 -78 127 -22 83 60 -158 -319 40 -89 218 -200 -148 23 42 -54 178
3850 178 -63 -81 61 89 -98 -57 18 -5 -115 92 176 -188 -56 64 10 -186 133 64 -47 301 312 -76 8
3873 8 -91 10 -234 96 8 52 -61 8 -8 -65 -7 -109 -69 235 46 207 31 143 -16 185 114 197 38 31 -52
3898 -52 46 89 51 -101 -19 8 35 -92 13 1 19 8 43 97 -99 -283 20 -46 -60 -185 -108 -106 109 -143 123 -30
3924 -30 -155 144 -130 240 91 -94 36 -176 -179 -37 120 16 -220 13 -77 259 168 -35 -103 218 50 -55
3946 -55 15 162 -10 115 26 122 -1 92 -9 -14 69 134 -135 103 124 250 3 179 -56 24 -102 -88 -6 -296
3970 -296 133 -85 -127 -13 36 -126 124 218 26 -254 99 -104 56 -67 42 -24 12 209 -20 107 -32 147
3992 147 136 63 11 105 -58 -373 15 -292 198 150 -43 181 -2 11 118 -124 262 171 8 167 8 50 61
4015F1n9J3Pj34K90j26j46J64p6P4m4j11K7P7N0j0o1j15J25Jk66J82n0n8J08L6
4041d1j25p3J75P4l1r4J61j3%j48J08O9p1r2l8J51j18j76M28j10O7n1k3j12n1
4066a34J57K02Qn23J91J6J06K7P6k36J67q9J3Q6Lm6J87k15Q3j49L23j0j93J44
4090A94l16K70J36l39n9L12J13j35K3j33q4J5P4j08K3k66L17p0k0K58k25j96K49
4113C3j75K53n2M2m6K65k91QL8n7P2j86K76k11J76k02k88N46k31J04j25J49p2
4136B6rj45K13r2mQ1R3l68J64J19k54M28m30K86pj09J7l8Q1k3j6r1J27j78o0J27
4162f2K52j27r3J22q6j45K8K74l38L19J0l40J30J33K21k03J06J1k24J33j10J63
4184A74j53N1j3l02J24J14J51k4j07j86K27P1L4r4n9j54L05l2l11k54K45L41M3
$$ plain form
4015 61 2 15 22 -112 178 52 -94 70 -6 68 24 -87 -60 17 67 57 -4 -119 6 7 -259 -77 -127 -185 -77 -41
4041 -41 -166 -239 -64 10 -21 -115 46 33 33 -115 -7 62 -9 -101 -139 12 -106 -282 146 36 103 52 29 -83 -134
4066 -134 23 225 233 -290 -99 -83 23 50 126 -110 57 -32 -19 67 70 24 211 -4 79 -70 253 243 50 194
4090 194 -122 148 284 -55 -114 198 311 176 199 66 -18 -3 71 -37 -14 -280 37 -33 -53 205 -20 -216 33
4113 33 -142 111 59 101 55 320 29 37 75 18 90 -96 180 -31 145 -57 -345 201 -30 74 -51 98 26
4136 26 17 -128 85 -7 -11 70 163 -205 -41 78 -176 252 -178 108 101 -8 9 -29 52 29 13 -78 49 -129 -189 -62
4162 -62 190 63 -30 92 6 -139 -111 163 -175 144 154 -186 -56 77 298 95 201 212 -12 121 11 174
4184 174 21 72 59 -243 -119 -5 146 122 15 -171 56 127 161 67 8 -146 159 127 -184 -438 -193 148 191
4207A91l09K80k69qJ34PJ4L1k43K46k12J12P5K56k93n9M6j30NJ47l16L27K20l68
4231a16K15l2r4L4K01n69L13j84J21J68j51P8P0k38J80k21K51K2K12n4k54J82
4253A34l09L64k00K1k03J64j72P1J35L2j66L39Mm48J75P8J38p6J37r0r9j31K11
4276A09Ro7rj91J10J1O8lM0Rj09L6j05K63j79J07J65l45Q8P8j32K13k56J20q7
4301e7K00p1j54L6j03J0rM0j6P7L2O1k29R7P9O6j01J74l27K67n8J04n5p7j15M36
4327C07m61Q1j15J47q0J21J09J27M7l31J22l63K15L4K29j07k38O9P4J3L8Q1q0
4350C9k07J92J5K40k32Q8k14K26j39p8k06K83Kk2K0n6P4J71j00j2j04j6J8J27
4374A09o2J9l48J96m8J12J55k12R8K2P2l37J66l0J54o0n0p8J73n9p4n2Q1P5J48
$$ plain form
4207 191 -118 162 -107 -115 19 26 40 71 -172 74 -138 -26 49 305 12 -47 -1 -131 -126 21 -295 32 252 -116
4231 -116 99 67 -27 7 208 -361 -48 -232 -111 57 -94 -16 54 -184 -4 -225 26 48 260 206 -48 134
4253 134 -175 189 -11 10 -193 -29 -201 -130 5 37 -129 210 214 -234 -59 19 157 81 218 128 29 -102 109
4276 109 118 51 42 -149 -39 -28 40 37 77 86 -23 13 -92 171 -8 99 264 -81 7 85 -47 166 -90 30 -57
4301 -57 143 72 -82 -46 -149 -139 -148 -108 -124 -47 -15 46 -183 -86 -7 59 -42 132 -195 72 14 118 63 -14 -129 307
4327 307 -154 -73 -188 -41 -121 0 109 236 283 -48 74 -289 -74 -40 189 82 -156 -87 -13 0 38 119 39
4350 39 -168 24 39 279 47 135 -79 147 8 -70 -276 7 9 -13 7 -49 25 196 96 84 -20 -36 -18 109
4374 109 47 66 -282 -86 -134 -22 133 -79 19 41 113 -224 -58 -88 66 6 -44 -122 51 -8 -82 -134 -53 22 170
4399A70k05L2o9L1m7J20R2j75K6RJ95l30qK26L5k83Q7J05O5J2o5j70oJ76Q2p4
4425C1NJ27k9j90J21q0j34L8J89P6J6L8n4j21l14K28L0P1q4K36k24qJ69o8m0p7
4451d8j17O4K82q1k35J31J27k8k87K23J19k71J87l29N1L69r7O4k20l5q9K41r2
4474g1J47j35L42l90J38p4K96k87J69k99l1Q0m6J82QR5J5j65Ml0l4K98k39r0P0
4499d7N9J4j09Q5R8j59J21o8J11J55l83O9K08l03J6M21m35M5J97r6L9nK6q7j05
4524a33K17Rk86J93q6k13L10j8K3O9j34K2Q8J28r4L9l82K19l31K62K6L97l57J67
4548A35L6l09R7r3K31K6l18J07j05K44o6K07j74k04Q2J34n6j00j40L62l8J28j54
4571C2j53K57k35J5j95J53J28k10K77j88J28K06k30j1l8J67P9k60J32K1k74J68
$$ plain form
4399 170 -35 -3 -72 -41 -88 32 124 -51 -25 -16 179 -151 -159 67 102 -181 -94 11 76 88 23 -147 -153 23 105 31
4425 31 36 163 134 -56 65 -15 -149 -111 78 154 170 208 154 33 -281 -53 -23 48 -36 200 -24 -32 137 69 29 -48
4451 -48 -165 -101 181 100 -135 -4 123 95 -192 31 150 -121 66 -263 -212 157 60 124 -96 -131 -220 21 -71
4474 -71 76 -59 283 -107 31 -43 253 -34 135 -164 -195 -115 -161 21 29 124 139 -26 -22 -52 -86 212 -27 -117 -47
4499 -47 12 26 -83 2 100 -59 62 -6 105 260 -123 -54 154 -149 -133 288 -147 -102 95 -1 38 33 59 -28 -133
4524 -133 84 93 -193 0 -86 -299 11 -7 16 85 -49 -27 61 189 95 134 -248 -29 -360 -98 -72 325 -32 135
4548 135 171 -138 -41 -134 97 123 -195 -88 -193 51 -15 192 18 -186 -104 30 -26 -126 -266 96 58 186 32
4571 32 -121 136 -99 -84 -279 -126 2 -208 69 -119 9 215 -15 -26 -64 103 182 -78 54 75 -199 -31
4593c1P7j44r0M00j24j10L4j46N4n8M5%n4r5J21m2J38K24m72L58O8j32k4j41L67
4618B23j44r7Q5K9J31l02L39l63L8J25k98O2J92J55k07K08j13j74J34j82K18Q3
4640A42J63O7j99j97k83K67J15j01j93M07O1j7l71J82N5j40R2k12J56o3J93j26
4662bj20K50q7j17O1J94k37K09j78M5nJ67O4k98J95l63L87j29J68q5j51J03N9
4685A30j91J13o1L9l6j96J09K91j36J83k74l2J26l98L27M8k28J00KP3j8K4Jj17
4709a21L46k05q1J61O7j34J4j96p8L08k22MK5Q6r3Q6or9P2J9J44j01J03j80Q1
4734@L4n5N6J04k17J91J09j35j08R8N6l99L38K08k39N3J34j56K0j53L46l01j85
4757b01J25QJ05L03m16J42k96K04J51j63Q1j8o7Q5K36k27q0K0q7M05l13P0j76
$$ plain form
4593 -31 46 -98 -188 212 88 -22 12 -134 -80 -138 -93 -93 -147 -242 -121 -163 -25 199 -273 85 153 21 -3 -144 223
4618 223 79 -18 67 96 227 -75 264 -99 -61 64 -234 -172 20 175 -32 176 63 -111 23 -159 59 142
4640 142 305 372 173 -24 -307 -40 75 -26 -219 188 249 232 -139 43 98 -42 50 -162 -6 -69 124 -2
4662 -2 -122 128 41 -76 -15 179 -58 151 -27 18 13 180 244 -54 141 -222 165 36 204 119 -32 71 130
4685 130 -61 52 -9 30 -6 -202 -93 198 62 245 -29 -61 65 -333 -6 42 -186 -86 -84 -11 -29 -5 -4 -121
4709 -121 225 20 -61 100 167 33 47 -149 -227 81 -141 -137 -112 -26 -119 -33 -39 -138 -66 -47 97 -4 99 -81 0
4734 0 34 -21 35 139 -78 113 222 87 -21 77 133 -266 72 280 41 94 228 72 92 -61 285 -16 -201
4757 -201 -76 -68 37 340 -76 66 -230 -26 125 -38 43 25 -42 43 279 52 -28 -8 -95 310 -3 67 -109
4780a09K9N1j18J50J96k00L7k33J81J51j54m6j35j48K98nK78l17q9J66k15M30
4802A98k32k17M03k83K66n6j73L43m29M9K13j76kK72j35K1l31L98l43K11M4j59
4824a18K30k54L07j47n7J64q3J68l40P9K35k58J69n9J79q84N72QJ00Q2J22j39
4846G6J11k96K54P7r3o8o0j34L0J14p4m9L6J29o1R1j06J38m0j8K0j73L45j08j94
4871e3j35K70j43J6j06J26O7j20l2J61k49L13m2l45L78q3Q8q6ON5O4j61n4L60
4895B95k81j42J10J07j65r5K19p3J21j28J24J85l28J19O9k87M8o2J98N4l18J07
4917a23L32j49k9Q0n1j83L62k55P8O3k53J46p4J57o9K2k72J67J12L5p5j24J47
4940D4J4j16j21LQ0J51O2k06RK59r8n5K20l17Q7J67k76J04j18k44L98j48J35k31
$$ plain form
4780 -109 -80 -29 -147 3 199 -1 36 -197 -16 135 -19 -65 -200 -348 -50 -55 223 -94 -183 -17 -232 198
4802 198 -34 -251 152 -131 135 79 -94 249 -180 -131 82 -94 -96 176 41 62 -269 129 -214 -3 41 -118
4824 -118 112 -142 165 18 -39 125 42 210 -130 -51 184 -74 95 36 215 -669 -97 -89 11 93 215 76
4846 76 187 -109 145 222 129 61 1 -133 -103 11 -63 -112 -76 53 -8 83 -23 115 75 57 77 -96 249 141 -53
4871 -53 -188 82 -61 -45 -151 -25 42 -78 -110 51 -198 115 73 -272 106 23 111 25 31 86 150 -11 -65 295
4895 295 14 -128 -18 89 -76 -171 48 -25 96 -32 92 277 -51 68 137 -150 -102 -164 34 88 -230 -123
4917 -123 209 60 31 111 60 -123 239 -16 62 125 -128 18 -56 101 32 54 -218 -51 61 96 21 -103 44
4940 44 58 -58 -179 -176 -96 55 117 -89 -80 179 81 26 246 -71 16 183 -93 11 -107 -351 47 -101 34 -197
4964a97J67L79j67j79M6n4Q9r6Q1q6P3k44L58J16m71J45j3J68r3K62j20j51j40
4987a27Q9N0M8QJ81j99J28j17k28J74j17m2J98j10P5k60M66j93J15j9j34P8l9
5010B5O3O2J02k04Q3M5j93Ol3K03j08k2J52K6m6P2o4q4J49j32k32J14K03j30K65
5035C22k93J05k66N4m1J14K15k87n7J94J9j20q8K20k17J75j15Q0o1J21J91l44
5057g9L9J69k69J85P8j63J60J27m83L77J6l7j69%K04p5j38J89j79J51j11J09J24
5080B25k34J52j07j67J57K63l10n5J91m9l34K06N3j79J74qK3K26m81K80n8l3K63
5103A98j30J55r1j2K09k67P3J0j24M0M7j17j5J37l41K83jnJ52q5j07N0m1om1K14
5129A85m08L76l28R5L03O7m74K14O0j95j12O6p7J25L9R6L6l9k34m4K96l08J97
$$ plain form
4964 -197 -30 349 182 3 49 -5 84 -12 69 -17 56 -188 170 286 -185 -40 -53 115 22 284 164 13 -127
4987 -127 -38 12 60 68 249 50 178 61 -167 7 -110 -152 46 -64 11 -249 217 24 139 120 -14 64 25
5010 25 88 150 252 48 131 176 -17 -11 -44 159 51 29 181 207 161 233 169 85 234 102 -130 -16 187 57 322
5035 322 29 134 -132 -78 -119 -5 210 -77 -134 60 79 -41 -129 91 -126 49 -66 14 -47 74 265 -79
5057 -79 -40 129 -140 45 123 -40 120 247 -236 141 157 120 -49 -49 155 80 -58 131 -48 103 -8 101 225
5080 225 -9 143 36 -131 26 289 -21 -76 115 66 -268 -62 -9 -188 -14 -22 1 227 -254 26 -32 -65 198
5103 198 68 223 132 120 329 62 135 145 21 61 108 -9 -24 113 -228 55 54 49 201 116 9 59 18 12 -29 185
5129 185 -223 153 -175 -80 223 290 -184 30 90 -105 -217 -151 -228 -103 -64 32 68 29 -205 -249 47 -261 -64
5152f4m9J69o4M0K74m52K66j98J42Q0K9k26K0j25K43k45L32p5k32J39J7K50k87
5175a6J18n6l8J30k98K58j08q4K10r6k2Q1qk14P6k18J18J60k03L20j2J00k0k58
5199h0K41N1K40m17J26n9j49J09l78K19R2k3k1m6J2L1m5k7K27n5p4PJ55k99P3
5224i0P2J64j92J29r2j26P1l8K13j82J91m78K50L02l04K06j98L69m96J36L01q8
5246A20N3m5p5m5p8j03K1L05ql61J27J56J2J83j01m4J6k34R9o1K36r2r2j13P1
5271e3J90r0m2q4P6K4J33o5m7k03J78l5J39l27J88n7l2K53k72Q7q0R8jj14L12
5296A76j02J16l53P1Q6M2J84j09o1q3J99l27J82K24j41j04J09j77K70k31j65M4
5318a50J38j20l0J59O4j5k1l4j75L11k38L46k17J92mj22k50Q9J09r5k2O1L72m65
$$ plain form
5152 -64 -113 56 -8 32 306 -146 120 -78 64 144 173 -53 -33 -158 85 -160 172 97 -135 4 21 271 -16
5175 -16 102 46 8 138 -160 98 -10 -94 116 20 -2 79 71 -143 -67 -285 -167 -7 -210 110 98 198 178 -80
5199 -80 161 212 452 35 161 102 -47 62 -316 -97 -5 -28 -49 -95 -83 -52 -97 -124 103 48 -26 -19 136 -163 -90
5224 -90 -18 146 -46 83 -9 -135 -64 -102 111 -71 120 -358 -108 194 -110 96 -102 267 -229 -93 208 120
5246 120 173 128 53 8 -70 -173 -152 153 145 -216 -89 67 79 262 161 117 133 -101 -2 -63 173 81 -11 -124 -53
5271 -53 137 47 5 -79 -3 21 154 89 42 -161 17 -18 121 -206 -18 -75 -107 146 -126 -39 -119 -21 -22 -136 176
5296 176 74 190 -163 -92 -6 36 220 111 50 -33 166 -161 21 245 104 0 109 -68 202 -29 -194 -150
5318 -150 -12 -132 -162 -3 61 46 25 -9 -184 127 -111 235 18 210 206 84 -166 -77 32 -63 -85 -24 348 -117
5342a17J25k8N6j83J05j12K87j68J15m0j51K05Q1J1R7l96J57o0J25p4q0K66k36
5365a5J98r5j32MN8o9j37J42O3l71M85j59K9J49k12J68j30p4R7Q1j75K67j8l61
5389b07L79k69K68j71n1J97n0j46J64n7q9J21j80k15L41j76K13r1k27J56M0r8
5411a48Q8K56n9j62J08k00K95m2j76J1P1j4m8j36K05Q2n1K98n79K79k46L51M29
5434F12n77L04k02k63K1J5K21r3r9j4M2o2J61O6l15J02j36M16l84p5L43j84P6
5457b5k12K48K2kl9N4J44k68J80k77P6J01J76m3o3l02K76J49k12L5O8Kj42J75
5481A21j42M5K15k30M1o1po2n8Q0j3k6P9k8j48K15j79J10J65k76L27k7pl56L77
5506A55k18j9J46K0n4m2L12m77K07Nk86J42J90l0J42l20J19p0J63j75J07l4J05
$$ plain form
5342 -117 8 -20 36 -147 -42 -154 133 -35 80 40 -111 94 175 186 283 -113 44 -16 109 35 -45 221 -15
5365 -15 183 88 -44 -40 18 -51 -188 -46 17 -354 131 -28 1 150 -62 106 -24 -98 -1 80 -95 172 154 -207
5389 -207 172 -97 171 0 -51 146 96 -50 114 57 -32 89 -91 -306 35 -141 72 -19 -246 -90 -50 -148
5411 -148 -60 196 137 -25 83 -117 178 136 -40 -29 42 28 -20 -156 49 131 80 378 -201 78 -168 183 612
5434 612 35 339 137 -126 -105 -90 131 38 -61 -75 -33 -95 66 132 -183 -81 -217 199 -185 -260 83 -101 -25
5457 -25 -237 11 33 31 -8 46 190 -78 102 -175 -99 2 178 135 72 -230 46 195 -17 18 86 88 -54 121
5481 121 -21 24 239 9 50 -11 -18 -80 -138 -58 -71 -97 -18 -46 -194 21 -158 -48 117 -159 168 141 134 -222 155
5506 155 -63 -82 64 84 30 -12 300 -177 30 35 -251 -109 81 51 193 -127 -8 -78 85 -90 17 -17 88
5529H8l5j56J21J2N1k50J94m5r5K20j3j63K18j1l8j27n1K08J17j37k08L15j69
5552D6k7m3P2n3j39K43l9k48L8J15J88k23L8l5l2M0J71p9k82K65J76j75RM6j37
5577f5J01J79n6r6o2q5J5nq0J63n7J31k87L16j83J0N9j23j14O44l65J19j75K55
5601B39l36R2K78K06m31j00J81l23M99n4l41k11L27m42J8l09K91N90p6m5J48k21
5623b0j49L8K53j59J22j24j25K06n7j8j66J63j9No2K79j0O3k91K35j95k08K74
5646C5j06K53l65M21p1l55KK29J8k00L3J76n2j24nP8L00j02j20r1o4K09k51M11
5670B59m09J82k58K14k61J91P1J98j09k0O1j66J47O0k13n3J06P1o6k24J11J15
5692GQ6k77J11K82j86j20K30J32j78k7k8J39k25j01J93k59L76k90Q2O8J22j72
$$ plain form
5529 88 53 -103 18 30 81 -169 25 -20 -115 105 92 -71 147 136 98 -29 -80 128 245 108 -100 215 46
5552 46 19 -24 48 -5 -144 99 60 -188 -150 -35 153 -70 -32 -67 -99 -59 112 33 -249 16 192 17 26 72 -65
5577 -65 36 215 159 63 1 -84 -69 -74 -154 9 -48 83 -204 112 -71 -61 -2 -125 -239 405 40 159 -16 239
5601 239 -97 -5 273 479 48 -52 129 -194 305 251 -90 -301 26 -416 -398 -707 -416 174 98 53 201 -20
5623 -20 -169 -131 122 -37 85 -39 -164 42 -15 -33 -199 -36 -55 -50 -112 167 157 220 -71 164 -31 -239 35
5646 35 -71 182 -183 238 167 -188 -186 43 61 -139 -106 70 18 -106 -111 -33 267 165 45 -46 -110 99 -152 259
5670 259 -150 32 -226 -12 -273 -82 -11 187 78 58 119 -47 100 160 -53 -106 0 71 5 -219 -108 7
5692 7 93 -184 -73 209 23 -97 133 265 87 60 32 171 -54 -155 38 -221 155 -135 -53 15 137 -35
5714c5P1j05q6J48J11k13R2J48k69M31m99J89j27J42l8j41J31O4J76k99M5K10
5736A46l27J69l6n3Mp8L60m9j68Q7K1K25j80j89L09l35K72j22r2k6J26L9j38L
5760c2r0J61N1J7L0K5k27j3r7K25R6l11O4k5N3R5Lj47l9K03r7k28K11J24r4K31
5786A89q7j22O2r7J29k42K67j61k3J19N8l4j40K62p2j8k04J62l26L29J30r4K17
5809C04j75l32J55L0L5K11l58L16j11r5L7P7p5j24K72J14j49k95RK59j68J65k70
5832a68J20R9p3J42j60L9K36q8QO0k3O7k89J59l6J44m16J04OJ77m39K05K31k52
5856a47J36J13o4r0J16j36J84k3k99j5K99L3J47l04j1j01M87k89M4L0n6j72n2
5879a70J72L2j30J10J30j73k07K97J83j74N9j46j25L30k52K86k32j0j52K42j31
$$ plain form
5714 -35 36 -69 -155 -7 104 -109 -17 131 -138 293 -206 -17 -144 -2 -40 -181 -50 14 190 -109 -64 146
5736 146 -181 -12 -48 -101 -97 -175 185 136 -32 55 76 301 121 -68 241 -94 178 56 -36 -62 64 103 -35 -32
5760 -32 -122 39 90 107 137 162 -65 -78 -175 50 146 -165 -101 -126 -73 22 25 -122 -161 42 -55 -283 -72 52 -42 189
5786 189 102 -20 42 -55 74 -168 99 -62 -85 34 92 58 -82 180 108 90 -114 48 -278 51 181 87 304
5809 304 129 -203 -48 -18 17 228 -130 186 75 -20 17 94 19 -105 167 281 132 -163 -154 105 -63 102 -168
5832 -168 -48 51 -22 120 -40 -1 235 147 155 215 192 259 -30 129 93 237 -179 -75 -69 108 -331 -126 105 -147
5856 -147 -11 102 38 -52 64 -72 112 89 -210 -225 74 107 254 -50 -61 -162 325 36 80 110 54 -118 -170
5879 -170 2 34 -96 14 144 -29 -236 61 244 70 129 -17 -142 188 -64 222 -10 -20 -172 70 -61
5900f1P3n4q3J58J6L1m9l4j0j93L69l25J79L2L3o8J52k68r9K81J7k27K82k88L37
5925B01j22k4l60J66n8L79k80J56%j33J09j19K00j10O5qL2j94J58l15L19q5Q5
5948F2Q4q6r1K4J0j76M9Q6j01J48K07j75o2j46J63j72K30N0l06K17K59j89L2j85
5972f8l9Q7L0J52q6m2r3J52J8n2J50j42Qk01J73k95J41r2P12K1l76j36n6J59l77
5997b52J28J15k52L83K8K2k38R0J13j59r0J17L2j55L51N9l21j63J25L6k60J69
6019a22J24P5o4k54L34j95K57j40j14J20J50j47j48L29k47PJ30m2J97l33o6O4
6041h5K76j30j25Q5n8j61N4J03k4Q1p9K27j36J8r1m2j02k5M37J9l03J0m6J1J05
6066A9j23L0K10k52R8j45J92n2j0M6j24RJ07r3J76p1q5r5rJ72j46L6K78l13J25
$$ plain form
5900 -61 12 -42 -125 33 49 80 31 -3 -13 -206 163 -162 17 49 82 14 166 -102 -201 80 97 -130 152 -136 201
5925 201 79 55 -305 -139 -197 182 -98 58 58 -75 34 -85 115 5 70 62 94 -100 58 -257 62 -23 62
5948 62 146 60 -31 -7 3 -173 -124 -38 -139 9 216 41 -21 -167 -4 -176 54 104 -202 15 274 85 117 -68
5972 -68 -107 -20 10 162 76 34 -59 93 111 59 209 67 75 -126 47 -248 -107 -199 513 534 158 22 -34 125 -252
5997 -252 -124 -9 -261 122 150 172 -66 24 137 -22 -112 5 37 -118 233 292 -29 -192 -67 -31 -291 -122
6019 -122 2 77 13 -241 93 -102 155 15 -99 21 171 24 -124 205 -42 -35 95 53 250 -83 -149 -85
6041 -85 191 61 -64 21 -37 -198 -144 -41 -65 16 -63 164 28 46 -45 -87 -189 -214 223 242 -61 -51 -97 -86 19
6066 19 -104 -74 136 -116 -18 -163 29 -23 -33 13 -111 -102 5 -88 88 17 -68 -163 -172 0 -146 -110 168 -145 -20
6091b0l4K10l51K93k84K30K52l60J65n8l2N1l2o7l5j68K18J51p5K4N9k03K98k48
$$ plain form
6091 -20 -54 156 -195 98 -186 44 296 -64 101 43 11 62 30 -37 -72 -240 -22 129 54 78 137 -66 232 -16
$$ [...]
8191a70
##END NTUPLES=NMR FID
##END=
