##TITLE=1H_Pr Glu Am2
 CDCl3, 8 sc, 
 24.9.2020
##JCAMPDX= 6.0         $$ Bruker NMR JCAMP-DX V2.0
##DATA TYPE= NMR FID
##DATA CLASS= NTUPLES
##ORIGIN= UXNMR, Bruker Analytische Messtechnik GmbH
##OWNER= root
$$ XWIN-NMR		Version 3.5
$$ Thu Sep 24 10:04:21 2020 Russian Standard Time (UT+4h)  she@DPX200
##.OBSERVE FREQUENCY= 200.1315066352
##.OBSERVE NUCLEUS= ^1H
##.DELAY= (6, 6)
##.ACQUISITION MODE= SIMULTANEOUS
##.ACQUISITION SCHEME= undefined
##.AVERAGES= 8
##.DIGITISER RES= 18
##SPECTROMETER/DATA SYSTEM= spect
##.PULSE SEQUENCE= zg30
##.SOLVENT NAME= CDCl3
##.SHIFT REFERENCE= (INTERNAL, CDCl3, 0, 15.7039)
##AUDIT TRAIL= $$ (NUMBER, WHEN, WHO, WHERE, WHAT)
$$ ##TITLE= Audit trail, XWIN-NMR		Version 3.5
$$ ##JCAMPDX= 5.01
$$ ##ORIGIN= Bruker BioSpin GmbH
$$ ##OWNER= she
$$ F:/spectra/data/she/nmr/H-F/1/audita.txt
$$ ##AUDIT TRAIL=  $$ (NUMBER, WHEN, WHO, WHERE, WHAT)
(   1,<2020-09-24 10:03:14.42 +0400>,<she>,<DPX200>,
      <created by zg, POWCHK disabled, PULCHK disabled
       configuration hash MD5:
       00 E9 B6 7A A2 85 ED C7 34 08 36 98 17 FE 4E 26
       data hash MD5: 16K
       E2 F4 AD 3A 1A C6 5A C2 E9 C0 3F 8A D9 B3 34 45>)
$$ ##END=
$$ 
$$ hash MD5
$$ D5 6B D1 06 A9 F1 12 0A D1 82 3A 8B 17 B5 2D 2A
##$RELAX= 
##$RELAX= 
##$RELAX= 
##$RELAX= 
##$RELAX= 
##$RELAX= 
$$ Bruker specific parameters
$$ --------------------------
##$DU= <F:/spectra>
##$EXPNO= 1
##$NAME= <H-F>
##$PROCNO= 1
##$TYPE= <nmr>
##$USER= <she>
##$AMP= (0..31)
100 100 100 100 100 100 100 100 100 100 100 100 100 100 100 100 100 100 
100 100 100 100 100 100 100 100 100 100 100 100 100 100 
##$AQSEQ= 0
##$AQ_mod= 1
##$AUNM= <au_zg>
##$AUTOPOS= <>
##$BF1= 200.13
##$BF2= 200.13
##$BF3= 200.13
##$BF4= 200.13
##$BF5= 200.13
##$BF6= 200.13
##$BF7= 200.13
##$BF8= 200.13
##$BYTORDA= 1
##$CFDGTYP= 0
##$CFRGTYP= 5
##$CHEMSTR= <none>
##$CNST= (0..31)
1 1 145 1 1 1 1 1 1 1 1 1 1 1 1 1 1 1 1 1 1 1 1 1 1 1 1 1 1 1 1 1 
##$CPDPRG= <>
##$CPDPRG1= <>
##$CPDPRG2= <>
##$CPDPRG3= <>
##$CPDPRG4= <mlev>
##$CPDPRG5= <mlev>
##$CPDPRG6= <mlev>
##$CPDPRG7= <mlev>
##$CPDPRG8= <mlev>
##$CPDPRGB= <>
##$CPDPRGT= <>
##$D= (0..31)
0 1.2 0 0 0 0 0 0 0 0.06 0 0.03 0 0 0 0 0.0002 0 0 0 0 0 0 0 0 0 0 0 0 
0 0 0 
##$DATE= 1600927393
##$DBL= (0..7)
120 120 120 120 120 120 120 120 
##$DBP= (0..7)
150 150 150 150 150 150 150 150 
##$DBP07= 0
##$DBPNAM0= <>
##$DBPNAM1= <>
##$DBPNAM2= <>
##$DBPNAM3= <>
##$DBPNAM4= <>
##$DBPNAM5= <>
##$DBPNAM6= <>
##$DBPNAM7= <>
##$DBPOAL= (0..7)
0.5 0.5 0.5 0.5 0.5 0.5 0.5 0.5 
##$DBPOFFS= (0..7)
0 0 0 0 0 0 0 0 
##$DE= 6
##$DECBNUC= <off>
##$DECIM= 32
##$DECNUC= <off>
##$DECSTAT= 4
##$DIGMOD= 1
##$DIGTYP= 9
##$DL= (0..7)
0 120 120 120 120 120 120 120 
##$DP= (0..7)
150 150 150 150 150 150 150 150 
##$DP07= 0
##$DPNAME0= <>
##$DPNAME1= <>
##$DPNAME2= <>
##$DPNAME3= <>
##$DPNAME4= <>
##$DPNAME5= <>
##$DPNAME6= <>
##$DPNAME7= <>
##$DPOAL= (0..7)
0.5 0.5 0.5 0.5 0.5 0.5 0.5 0.5 
##$DPOFFS= (0..7)
0 0 0 0 0 0 0 0 
##$DQDMODE= 0
##$DR= 18
##$DS= 0
##$DSLIST= <SSSSSSSSSSSSSSS>
$$ [...]
##$SUBNAM2= <"">
##$SUBNAM3= <"">
##$SUBNAM4= <"">
##$SUBNAM5= <"">
##$SUBNAM6= <"">
##$SUBNAM7= <"">
##$SUBNAM8= <"">
##$SUBNAM9= <"">
##$SW= 16.880792210976
##$SWIBOX= (0..15)
0 0 2 0 0 0 0 0 0 0 0 0 0 0 0 0 
##$SW_h= 3378.37837837838
##$TD= 16384
##$TD0= 1
##$TE= 0
##$TE2= 300
##$TE3= 300
##$TEG= 300
##$TL= (0..7)
0 120 120 120 120 120 120 120 
##$TP= (0..7)
150 150 150 150 150 150 150 150 
##$TP07= 0
##$TPNAME0= <>
##$TPNAME1= <>
##$TPNAME2= <>
##$TPNAME3= <>
##$TPNAME4= <>
##$TPNAME5= <>
##$TPNAME6= <>
##$TPNAME7= <>
##$TPOAL= (0..7)
0.5 0.5 0.5 0.5 0.5 0.5 0.5 0.5 
##$TPOFFS= (0..7)
0 0 0 0 0 0 0 0 
##$TUNHIN= 0
##$TUNHOUT= 0
##$TUNXOUT= 0
##$USERA1= <user>
##$USERA2= <user>
##$USERA3= <user>
##$USERA4= <user>
##$USERA5= <user>
##$V9= 5
##$VALIST= <valist>
##$VCLIST= <CCCCCCCCCCCCCCC>
##$VD= 0
##$VDLIST= <DDDDDDDDDDDDDDD>
##$VPLIST= <PPPPPPPPPPPPPPP>
##$VTLIST= <TTTTTTTTTTTTTTT>
##$WBST= 1024
##$WBSW= 4
##$XGAIN= (0..3)
0 0 0 0 
##$XL= 0
##$YL= 0
##$YMAX_a= 183677
##$YMIN_a= -195986
##$ZGOPTNS= <>
##$ZL1= 120
##$ZL2= 120
##$ZL3= 120
##$ZL4= 120
##$ABSF1= 10
##$ABSF2= 0
##$ABSG= 5
##$ABSL= 3
##$ALPHA= 0
##$AQORDER= 0
##$ASSFAC= 0
##$ASSFACI= 0
##$ASSFACX= 0
##$ASSWID= 0
##$AUNMP= <proc_1d>
##$AZFE= 0.1
##$AZFW= 0.1
##$BCFW= 1
##$BC_mod= 2
##$BYTORDP= 1
##$COROFFS= 0
##$CY= 11.3945322036743
##$DATMOD= 1
##$DC= 2
##$DFILT= <>
##$DTYPP= 0
##$F1P= 16.9975609425685
##$F2P= -3.02152046262296
##$FCOR= 0.5
##$FTSIZE= 0
##$FT_mod= 4
##$GAMMA= 1
##$GB= 0.15
##$INTBC= 1
##$INTSCL= 1
##$ISEN= 128
##$LB= 0.24
##$LEV0= 0
##$LPBIN= 0
##$MAXI= 10000
##$MC2= 0
##$MEAN= 0
##$ME_mod= 0
##$MI= 1.114404
##$NCOEF= 0
##$NC_proc= 0
##$NLEV= 6
##$NOISF1= 3.799351
##$NOISF2= 2.8
##$NSP= 1
##$NTH_PI= 0
##$NZP= 0
##$OFFSET= 15.70392
##$PC= 1
##$PHC0= -9967.367
##$PHC1= 8.4009
##$PH_mod= 1
##$PKNL= yes
##$PPARMOD= 0
##$PSCAL= 0
##$PSIGN= 0
##$REVERSE= no
##$SF= 200.130013532006
##$SI= 16384
##$SIGF1= 3
##$SIGF2= 2
##$SINO= 400
##$SIOLD= 16384
##$SREGLST= <1H.CDCl3>
##$SSB= 0
##$STSI= 0
##$STSR= 0
##$SW_p= 3612.71676300578
##$SYMM= 0
##$S_DEV= 0
##$TDeff= 0
##$TDoff= 0
##$TI= <>
##$TILT= no
##$TM1= 0
##$TM2= 0
##$TOPLEV= 0
##$USERP1= <user>
##$USERP2= <user>
##$USERP3= <user>
##$USERP4= <user>
##$USERP5= <user>
##$WDW= 1
##$XDIM= 8192
##$YMAX_p= 0
##$YMIN_p= 0
$$ End of Bruker specific parameters
$$ ---------------------------------
##NTUPLES= NMR FID
##VAR_NAME=  TIME,          FID/REAL,        FID/IMAG
##SYMBOL=    X,             R,               I
##VAR_TYPE=  INDEPENDENT,   DEPENDENT,       DEPENDENT
##VAR_FORM=  AFFN,          ASDF,            ASDF
##VAR_DIM=   8192,          8192,            8192
##UNITS=     SECONDS,       ARBITRARY UNITS, ARBITRARY UNITS
##FACTOR=    0.000296,      1,               1
##FIRST=     0,             0,               0
##LAST=      2.424536,      0,               0
##MIN=       0,             -195986,         0
##MAX=       2.424536,      183677,          0
$$ Real data points
##PAGE= N=1
##DATA TABLE= (X++(R..R)), XYDATA
$$ [...]
1846b46k90K80L05o55J86L4q1M31m93L71J05o03P79n63m7O95p03J98Q69j478J638
$$ -246 -536 -256 49 -606 -420 -386 -467 -36 -529 -158 -53 -656 123 -440 -487 208 -495 -297 572 -906 732
1867G32J2j074K85m5J99J02l21J32L35r10J589n26p54R54j024J244q3r09J49o1
$$ 732 744 -330 -45 -90 109 211 -110 22 357 -553 1036 510 -244 710 -314 930 847 -62 87 26
1887B6j34N07n65L81L38q06R51l87j038J310o06K66K58r47R6P38k75L45p90k47
$$ 26 -108 399 -166 215 553 -253 698 311 -727 583 -23 243 501 -446 -350 388 113 458 -332 -579
1907e79J479j235L56l30o38J426l03p14M00k11k62J246j295L18J73o65J179p12
$$ -579 900 -335 21 -309 -947 479 176 -538 -138 -349 -611 635 -660 -342 -169 -834 345 -367
1925c67m25M35O0N5L95j308J037K03o16J088j584P43Q56j162J193n59q89J422
$$ -367 -792 -357 -297 -242 153 -1155 -118 85 -531 557 -1027 -284 572 -590 603 44 -845 577
1943E77l23o49R01q01L81P80j333P20o43N03R24j131k0N48l56N38J4j092R26l04
$$ 577 254 -395 506 -295 86 866 -467 253 -390 113 1037 -94 -114 434 78 616 630 -462 464 160
1963A60l7P59j289K56N62k67M27q84JJ710j260J03L16r61J008k45m52m9k85J14
$$ 160 123 882 -407 -151 411 144 571 -313 -312 1398 138 241 557 -404 604 359 -93 -142 -427 -313
1983c13P78q82L56R7q40J421r25j83O20p79Q94j97p64N47L46r06J337j224l0J009
$$ -313 465 -417 -61 36 -804 617 -308 -491 129 -650 244 47 -717 -170 176 -730 607 -617 -647 362
2003C62q45N37l63l40O84j91R1m1m44O41J68o85N38l33j36J232j130k5L19l76
$$ 362 -483 54 -309 -649 35 -156 -65 -106 -550 91 259 -426 112 -221 -357 875 -255 -280 39 -337
2023c37R07l68o49R26l04J45L56j429P51M83o50Q35n82j07P57l62l53J57m50N71
$$ -337 570 202 -447 479 175 320 676 -753 -2 481 -169 666 84 -23 734 372 19 176 -274 297
2043B97l44L01K08r57P81k85k36M99J42r19O17j42J34j18J63J07j99l80J229J06
$$ 297 -47 254 462 -495 286 1 -235 264 406 -513 104 -38 96 -22 141 248 49 -331 898 1004
2063A004p99k68J40j196J276l81M10n45m39J268r05O31l17p59R55j87k25L13l80
$$ 1004 205 -63 77 -1119 157 -224 186 -359 -798 470 -435 196 -121 -880 75 -112 -337 -24 -404
2082d04j13R72r83K04L84k47L81j45n94P13k04k62O84n16j14M00J49j81JJ57o4
$$ -404 -517 455 -528 -324 60 -187 194 49 -545 168 -36 -298 386 -130 -244 156 305 124 125 282 218
2103B18L2r0M79n99L64k53j64N67o82L77Q3j41O7o8r8K52o9n34M80k42K81KK9
$$ 218 250 160 639 40 404 151 -13 554 -128 249 332 191 258 190 92 344 275 -259 221 -21 260 262 291
2126B91j80n9o8J76l48o4K28r3K10k44L0J69n19N60l08l9J5J88k7P6j06l80N67
$$ 291 111 52 -16 160 -188 -252 -24 -117 93 -151 -121 48 -471 89 -219 -258 -243 -55 -82 -6 -112 -492 75
2149G5l03J03J35k48K76l48M52m80P32q09L0J68J6J13L78k2n92K76L20m52J88
$$ 75 -228 -125 10 -238 38 -310 142 -338 394 -415 -385 -217 -201 -88 290 268 -324 -48 272 -180 8
2170HK80m72k18j34Q25n23L06K82l20j77N94k67kj62N83p59M04Qm8K6p3J88l61
$$ 8 288 -184 -402 -536 289 -234 72 354 34 -143 451 184 182 20 603 -156 248 256 208 234 161 349 -12
2193a2N95q15L51Q7k49P2p1J98j18L99o52Q4Q7j53K47k11K73l58K25l43L53j08
$$ -12 583 -232 119 206 -43 29 -42 156 38 437 -215 -131 -44 -197 50 -161 112 -246 -21 -364 -11 -119
2215a19j19J40m5J08l16L00l60N81m95K47p8p2J50k26K80m11J97K36k82K57ok0
$$ -119 -238 -98 -143 -35 -351 -51 -411 170 -325 -78 -156 -228 -78 -304 -24 -435 -238 -2 -284 -27 -33 -53
2237e3J80J7j75m1jr0J95r6J19J29J19k84m3M3L62J19l94K6K4J46l06J71J47j58
$$ -53 127 144 -31 -72 -73 -163 32 -64 55 184 303 19 -24 19 381 500 106 132 156 302 -4 167 314 156
2261A56m0K0M6j68M11n92J62k73O08l9o31O22j16K36o82M39J42o9k77L79l09j65
$$ 156 116 136 182 14 425 -167 -5 -278 330 291 -340 282 166 402 -280 159 301 232 -45 334 25 -140
2283a40j4K61l07j42K52L1K6j97L1K65k51J94m44K05K49m80P9J25k0J63k67l2
$$ -140 -154 107 -200 -342 -90 -59 -33 -230 -199 66 -185 9 -435 -230 19 -461 -382 -257 -277 -114 -381 -413
2305d13L15O0j7pq8L3L9n0M41m15J14J98k16L01k05k19L13j12m9L66n10L90k75
$$ -413 -98 -38 -55 -62 -150 -117 -78 -128 313 -102 12 210 -6 295 90 -129 184 72 23 389 -121 269 -6
2328fr0M12k89N4J89j06M5Oj53M75l55j81J70j81Q4J62l90K16J9P2J45p26N58
$$ -6 -96 316 27 81 270 164 209 215 62 537 182 1 171 -10 74 236 -154 62 81 153 298 -428 130
2351A30J56m58M19j47k91K31O7l19R0k90M46K30n24M83m53J46L85o13r0K34PJ70
$$ 130 286 -172 247 100 -191 40 107 -212 -122 -412 34 264 -260 223 -230 -84 301 -312 -402 -168 -161 9
2373IK65p00N12k14p7L78r63O33K96l93N03n73k53O94j47QJ83m90P52l06k67L44
$$ 9 274 -426 86 -128 -205 173 -790 -157 139 -254 249 -324 -577 117 -30 -22 161 -329 423 117 -150 194
2395A94k22R0O66r66K85J54m66P54l21j65M24l30K58j23m69L34J31j66J81l19
$$ 194 -28 62 728 -238 47 201 -265 489 168 3 427 97 355 232 -237 97 228 62 243 -76
2415g6n65J462q54K45m57O11L65o71o4M4j90J29P02r51N15o41O3Q58p73K93K44
$$ -76 -641 821 -33 212 -245 366 731 60 -4 40 -150 -21 681 -270 245 -396 -333 525 -248 45 289
2436B89l98P20k10m65M97r53P65M84j376K46L40K40M59j138L56N38j073O00M05
$$ 289 -109 611 401 -64 433 -520 245 729 -647 -401 -61 179 638 -500 -144 394 -679 -79 326
2455C26j029J098m59j41N41m30K43j74k48R8J08K97nJ07q6M32k331K280k67n23
$$ 326 -703 395 -64 -205 336 -94 149 -25 -273 -175 -67 230 225 332 246 678 -1653 627 360 -163
2475a63O21j89qN89j066P8O75m41M34l97n45M74L43k98J51l47L73J42m93L28l25
$$ -163 458 269 261 850 -216 -138 537 96 530 133 -412 62 405 107 258 -89 284 426 -67 261 -64
2496f4j05N13l74Q1k8N1L55m75p4M32k03l81J483j698L51L97k38M66m63l46L84
$$ -64 -169 344 -30 51 23 74 429 -46 -120 312 109 -272 1211 -487 -136 261 23 489 26 -320 64
2517F4n34O29l05l06K04L80j81L22r22J453j183L20P88r18L7J49j85M6K82l85
$$ 64 -470 159 -146 -452 -248 132 -49 273 -649 804 -379 -59 729 -189 -152 -3 -188 -142 140 -245
2537b45L63p7k19K73o0J03K41l41P6j12J25j9R0j78K42p0N1o9J43l29L31k84R0
$$ -245 118 41 -178 95 35 138 379 38 114 2 127 108 198 20 262 192 243 174 317 -12 319 35 125
2560A25j47j8L52k79M00k94k76N42n24k5J76L8q7K03j73P9q5K16j29k16K15k03
$$ 125 -22 -40 312 33 433 139 -137 405 -119 -144 32 70 -17 186 13 92 7 223 94 -122 93 -110
2582a10O6j59K29o9J23L5l92L57k27J83J78l78K67j80l93M30N0l55L22j50Q9K8
$$ -110 -44 -203 26 -43 80 115 -277 80 -147 36 214 -164 103 -77 -470 -40 10 -345 -23 -173 -84 -56
2604e6k66J22J71P4j06J95Jl00J40jK73l45K66m2J37m15P4K10k44J25mK7j30L09
$$ -56 -322 -200 -29 45 -61 134 135 -165 -25 -26 247 -98 168 126 263 -152 -78 132 -112 13 9 36 -94 215
2628B15p0j37J41k10K56j25L32k17Jj9l49J88O0k7l01K30K27j08L04l75J22l0
$$ 215 145 8 149 -61 195 70 402 185 186 167 -182 6 66 39 -262 -32 195 87 391 16 138 108
2650A08L8j35k98R9K3O1j60J97P5J34l36L36l84K71k06L25k30j82K22j22m1k1
$$ 108 146 11 -287 -188 -165 -104 -264 -67 8 142 -194 142 -242 29 -177 148 -82 -264 -42 -164 -205 -226
2672b26J06qj00J39j46K16k45J99p4J31J6j52J76k45K83k40K30M9k12J65j48R5
$$ -226 -120 -128 -228 -89 -235 -19 -264 -65 -139 -8 8 -144 32 -213 70 -170 60 109 -103 62 -86 9
2694Il4L78j30q3n8J2J01N3m0j30J30j16K1P1j40M4O8J07l2m0j97q2K82l08J71
$$ 9 -25 353 223 140 82 94 195 248 208 78 208 92 113 184 44 88 156 263 231 191 -6 -88 194 -114 57
2719E7K90q7k98J73J08k47N1J10j31j1J83l09K51l7p4o5O6j17j3R8m30N60j3p
$$ 57 347 260 -38 135 243 -4 47 157 26 15 198 -111 140 103 29 -36 30 -87 -100 -2 -432 128 115 108
2743A08J35j86k11j46N1r0K79k00Q1m6K52K86m86K94k02j86L45j75QL2K08r7r1
$$ 108 243 57 -154 -300 -249 -339 -60 -260 -179 -225 27 313 -173 121 -81 -267 78 -97 -89 -57 151 54 -37
2766c7p2K73j28N2M7q5J69n4k30K60m3k12K06l7o9K02j67J06j41j31J39k4K5K47
$$ -37 -109 164 36 88 135 50 219 165 -65 195 152 -60 146 109 40 242 75 181 40 -91 48 24 49 296
2790B96l5j94L34m54K70k38L6J23q1k83K71R8j48P5k82K66r5Pj59r2L14j2q3l27
$$ 296 261 67 401 -53 217 -21 15 138 57 -226 45 143 -5 70 -212 54 -41 -34 -193 -285 29 17 -66 -393
2814c93J97j56L84j39l1K03m85J95K33m80M12J47k48J68k52J78J51k0Q4k21j35
$$ -393 -196 -352 32 -107 -138 65 -420 -225 8 -472 -60 87 -161 7 -245 -67 84 64 148 -73 -208
2835b08L30l30L48j09k10N53m07K06l13j75N49lk75J49p9j49M33p1k76J33o2j31
$$ -208 122 -208 140 31 -179 374 -33 173 -140 -315 234 231 -44 105 26 -123 310 239 -37 96 34 -97
2857i7N30n96J03R4k81N10k63n5J41J25J36k95p4M5J52n6K47p64P35k27l79L35
$$ -97 433 -163 -60 34 -247 263 0 -55 86 211 347 52 -22 23 175 119 366 -398 337 110 -269 66
2879F6r1l73P09o8n79K54J25p2O3m00M00k25mN06n06K6J09o8M05o53m5O05l75
$$ 66 -25 -398 311 243 -336 -82 43 -29 34 -366 34 -191 -195 311 -195 -169 -60 -128 277 -376 -421 184 -191
2902a91j06N31j17k26P6j00K15kl38P01n45J99k23j18M40pj14j01J33k70K81l7
$$ -191 -297 234 117 -109 -33 -133 82 80 -258 443 -102 97 -126 -244 196 189 75 -26 107 -163 118 81
2924H1n2K28k89L46o12M36Rj86K23j1k90L61k65K15K08o49M43q6k47L82l08J58
$$ 81 29 257 -32 314 -298 138 147 -39 184 173 -117 244 -21 194 402 -247 196 110 -137 245 -63 95
2946I5K76l56k83O31o08L11K32n67L73k46J87J42l52K1L20q7n7J98n21K42j4j57
$$ 95 371 15 -268 363 -245 66 298 -269 104 -142 45 187 -165 -144 176 89 32 230 -291 -49 -63 -220
2968b20J78k47L15j00%K3j63M8J47J15j03J48k25J90n3j07K48l47J4J22j19J69
$$ -220 -42 -289 26 -74 -74 -51 -214 -166 -19 96 -7 141 -84 106 53 -54 194 -153 -139 -17 -136 33
2990C3Q2k84L76l89J39J12k9J81O8m49K48k91M4K34l8j10L38k19j36J89r6J89
$$ 33 115 -169 207 -182 -43 69 40 221 289 -160 88 -203 -159 75 37 -73 265 46 -90 99 3 192
3012A92m27N16m77L95p0k2o0K76m57L02R9l51J65q3O9r4L1j01J27j50m0K37k82
$$ 192 -235 281 -196 199 129 107 47 323 -134 168 267 -84 81 -2 67 -27 4 -97 30 -120 -160 77 -205
3035b05R2J25k90J61j38L03j06pk7O9R2L5k16l5P5K22k55l8J16r0K29q9q2m4K5
$$ -205 -113 12 -278 -117 -255 48 -58 -65 -92 -23 69 104 -112 -147 -72 150 -105 -143 -27 -117 112 23 -59 -103 -78
3060g8J71J0k00O5O4J89k76L14l29K96k31O1N3p9J12n2Ll01L55j05L12l51L58
$$ -78 93 103 -97 -32 32 221 -55 259 -70 226 -5 56 109 30 142 90 93 -208 147 42 354 3 361
3083C61k51j81L5J97o2n6O8j19Q7Q5m9o2k67J26j24K84Q1j78l9K08k12j31K20
$$ 361 110 -71 -36 161 99 43 111 -8 79 164 115 53 -214 -88 -212 72 153 -25 -64 144 -68 -199 21
3106B1O3N2l91L07P4k54J28l7l1j16J14J42k75K66j94j88J21M4J16n6K14j94J08
$$ 21 84 136 -255 52 126 -128 0 -37 -68 -184 -70 72 -203 63 -131 -319 -198 -154 -38 -94 120 -74 34
3129C4j65N0J26P9j0k40M7p3m6J57K44j5R2k11J4m1J06M2o6J13l40M00k72J39
$$ 34 -131 -81 45 124 114 -126 -79 -152 -198 -41 203 188 280 69 83 42 148 190 124 237 -103 297 25 164
3153A64J06q3j52N0O5j15J06p8K0n5R1J26L5j03k64K32j23PJ25k12j08J87l8M2
$$ 164 270 187 35 85 150 35 141 63 83 28 119 245 280 177 -87 145 22 29 154 -58 -166 21 -17 25
3177B5M2k03L05o2l67K30jJ49j21M8j53L39m44QNJ8n26J24O33J15k29RJ07k11
$$ 25 67 -136 169 107 -260 -30 -31 118 -3 45 -108 231 -213 -205 -200 -182 -708 -584 49 164 -65 -56 51 -160
3201a60L06j70n8J80lj34j87L42k3k55J62kK28j92p5k20L59j18L16l40LL36n63
$$ -160 146 -24 -82 98 95 -39 -226 116 93 -162 0 -2 226 34 -41 -261 98 -20 296 -44 -41 295 -268
3224b68M49N3p0Mj19J14q0k7K03k26j16J93n9N1j1j22jK7P6j12j25qK59J6j98
$$ -268 181 234 164 168 49 163 83 56 259 33 -83 110 51 102 91 -31 -32 -5 71 -41 -166 -174 85 101 -97
3249i7n4J94J13j09j9j94J85m2j09LM4K1r4mJ04M4K49j67k31K91n2j71r2k3J80
$$ -97 -151 43 156 47 28 -166 19 -23 -132 -129 -85 -64 -158 -162 -58 -14 235 68 -163 128 76 -95 -187 -210 -30
3274c0l5j96K48J14Jm0j00O1K8k59K47k12l2L87l45NK16j21K03j17j83M46j95
$$ -30 -65 -261 -13 101 102 62 -38 23 51 -208 39 -173 -205 182 -163 -158 58 -63 140 23 -160 286 91
3297I1j93M4L3L3R7j00j5p8Q4K64k05j81R5J05q9R2k05M39m8l32K46m63L15J34
$$ 91 -102 -58 -25 8 105 5 -10 -88 -4 260 55 -126 -31 74 -15 77 -128 311 263 -69 177 -286 29 163
3321A63m48L74j54o3K83l0l60K11k37J88J23l18J22Q8J01q2q9q3K22j79K09j63
$$ 163 -285 89 -65 -128 155 125 -235 -24 -261 -73 50 -268 -146 -58 43 -39 -128 -211 11 -168 41 -122
3343a22l0o8J81J47j05p5J42j14PO2j80j5K27j27m9K15j40K01j30J3j01j57J42
$$ -122 -152 -220 -39 108 3 -72 70 -44 -37 25 -155 -170 57 -70 -119 96 -44 157 27 40 -61 -218 -76
3366g6O2j58J38J83k98L78n94L93J60r1j07o1J82j62j42J11J97j84K85r2j30L39
$$ -76 -14 -172 -34 149 -149 229 -365 28 188 97 -10 -71 111 -51 -193 -82 115 -69 216 124 -6 333
3388C33k44N0o3k39J31K44m83K65K61n39M77j54J27j15Ml6l0J5J34j10j09j02
$$ 333 89 139 76 -163 -32 212 -271 -6 255 -284 193 39 166 51 55 19 -11 4 138 28 -81 -183
3410a83N6R6l0r7KK2K89q9r3J18J89m45M6n5K15K5r9J10j18j78L81q0o3p9P8J51
$$ -183 -127 -31 -61 -158 -156 -134 155 66 -27 91 280 -165 -119 -174 41 66 -33 77 -41 -219 162 82 19 -60 18 169
3436A69j99j14J88N4k22N4J61j38k26L32j19J74l04K37K27l99J98q8J70j33j21
$$ 169 -30 -144 44 98 -124 -70 91 -47 -273 59 -60 114 -190 47 274 -125 73 -15 155 22 -99
3457i9J13O5N2n0r0J11j64J05j64J70j21r8J30K62l76J75o3L0o8J12m7J79j34
$$ -99 14 79 131 81 -9 102 -62 43 -121 49 -72 -170 -40 222 -154 21 -42 -12 -80 32 -15 164 30
3480C0j66Q5K13j38M0J37m75M47l78L77k03k2l9K0k25L71k71L6Q6J14k63J5K50
$$ 30 -136 -51 162 24 64 201 -274 173 -205 172 -31 -53 -92 -72 -297 74 -197 -161 -75 39 -224 -209 41
3503D1l4j59M7J18l81L38J23k8J07o0j62J45n0o4J09l10M2K27N2m7K03k17J11
$$ 41 7 -152 -105 13 -368 -30 93 65 172 112 -50 95 45 -19 90 -220 -178 49 101 54 257 40 151
3526A51j16L0M8j02K75q8r5r7l6L22l55PJ34p4o0P6J61k07oM8J30k46J44j2l6
$$ 151 35 65 113 11 286 198 103 6 -30 292 -63 -56 78 4 -56 20 181 -26 -32 16 146 -100 44 32 -4
3551dq7K18p7j28j77K73J49k33j61R7j7K73j84k08J35j97J65J83n8l45N8J92J12
$$ -4 -91 127 50 -78 -255 18 167 -66 -227 -130 -147 126 -58 -266 -131 -328 -163 20 -38 -383 -325 -133 -21
3574b1j0J98j89p6K52k81P4J88k25K18k69L05k05Q6j6J26r9k33K15m1j42l9L05
$$ -21 -31 167 -22 -98 154 -127 -53 135 -90 128 -141 164 -41 45 29 155 56 -177 38 -3 -145 -184 121
3597A21K0k20k5K2K47k1K5k01P2j44n4J67j54P8L54l15k20K83L2K8L9J61o38L96
$$ 121 141 -79 -104 -82 165 144 169 -32 40 -104 -158 9 -145 -67 287 -28 -248 35 67 95 134 295 -343 53
3621E3J36k6n5j03k2j85R4J63l1lQ7p9R1j26q2l6P9k7J55j96l5J86j94J80l7K2
$$ 53 189 163 108 5 -17 -202 -108 55 24 21 108 29 120 -6 -88 -124 -45 -72 83 -113 -148 38 -156 24 -13 9
3647Ik8J11j73Rk8J61k18j18J73P7q2m7M9j80L28Jj3j09K34Q4k00j75O4L66q4
$$ 9 -19 92 -81 -72 -100 61 -157 -275 -102 -25 -107 -154 -105 -285 43 44 31 -78 156 240 40 -135 -71 295 211
3672B11m3j8J5l90J87K25M3n6j45j41L28k35K77j43k70K36j46j64N17k19j89K66
$$ 211 168 150 165 -225 -38 187 230 174 29 -112 216 -19 258 115 -155 81 -65 -229 288 69 -120 146
3694A46j43K6J70K6p5k3j47N9k07J04O4n5jj35j6R9K34q1j50P2k47K19M6P2p8
$$ 146 3 29 199 225 150 127 -20 39 -168 -64 0 -55 -56 -191 -207 -108 126 45 -105 -33 -280 -61 -15 57 -21
3719b1j18R6j5rr7K09k72L78kj29j91K59k28J46J70j80k01K44J2Q7Q7k79K00l7
$$ -21 -139 -43 -58 -67 -164 45 -227 151 149 20 -171 88 -140 6 176 -4 -205 39 51 138 225 -54 146 109
3743A09j68O8R9l22J76J57j55m2J45n5Q7j66L25k92K80k2l43j11K26l0o9L00l32
$$ 109 -59 9 108 -214 -38 119 -36 -78 67 12 99 -67 258 -34 246 224 -119 -230 -4 -34 -103 197 -135
3766a35K24j49o9K76j93J46k90L8J71n1J35k3l56L32R9j77n1MR8J99j42j51L20
$$ -135 89 -60 -129 147 -46 100 -190 -152 19 -32 103 80 -276 56 155 -22 -73 -69 29 228 86 -65 255
3789B55m48J88j16j08K73p3j51J63k20L97P1j37Rj61J02K7j35J24k25L4OJ32R2
$$ 255 -193 -5 -121 -229 44 -29 -180 -17 -237 160 231 94 103 -58 44 71 -64 60 -165 -131 -125 7 99
3812I9o1p2M7J98j60k04K21OJ42l88K46j16j06K11j58O5M9J1K3q0L1L2l93P73
$$ 99 38 -34 13 211 51 -153 68 74 216 -172 74 -42 -148 63 -95 -30 19 30 53 -27 4 36 -357 416
3836D16j058P26L8m11K03L94J0m24P4P6M6j20K72k68j68J28j31J78o3J73j54l54
$$ 416 -642 84 122 -289 -86 308 318 -106 -32 44 90 -30 242 -26 -194 -66 -197 -19 -82 91 -63 -417
3858d17L18n1J98J60k67o3Q6j20K58K2k62J34JP3m9jQL1j11K86m12P2oR6p7k41
$$ -417 -99 -150 48 208 -59 -122 -36 -156 102 124 -138 -4 -3 70 21 20 28 59 -52 234 -178 -106 -112 -16 -93 -334
3884c34K48L4J7p8K06q7Oj3k1L9p1j48J65J12j81K32j1J03j38j66K30j10k18M51
$$ -334 -86 -52 -35 -113 93 6 12 -1 -22 17 -54 -202 -37 75 -106 126 115 218 80 -86 144 34 -184 267
3908B67k35m7J93j53J30l01K62K11l83L32l4k35j31Q1Q8J71n4N8j58M6l1k52K47
$$ 267 32 -15 178 25 155 -146 116 327 -56 276 242 7 -124 -43 45 216 162 220 62 108 77 -175 72
3931G2j22J37j75J87j95J85m6k43mKJ09J12K0l71K65o1J61r7j19O9L5J16p8J10
$$ 72 -50 87 -88 99 -96 89 43 -200 -204 -202 -93 19 39 -332 -67 -128 33 -64 -183 -114 -79 37 -41 69
3955F9n4K15m27K28Nk2K64l07K5J3l9N24l62k70K68j23M0r5k9K01O3j10M8J97
$$ 69 15 230 -197 31 36 14 278 -29 -4 9 -30 494 132 -138 130 7 47 -48 -77 124 187 77 125 322
3979C22m63P1q8J78O7k29K27p0M5J6j48J15K9K5j25K09j60J33j09Nq1l9j6m0J
$$ 322 -141 -70 -158 20 87 -142 85 15 60 76 -72 43 72 97 -28 181 21 154 45 50 -31 -70 -86 -126 -125
4004a25J07q3P1J04J2j61J76m1l25M34j42l9O3k83J39J2j37L14o0KJ33l53L02
$$ -125 -18 -101 -30 74 86 -75 101 60 -265 169 27 -12 51 -232 -93 -81 -218 96 36 38 171 -182 120
4027A20l69L02n8r4J86k68L4K72j06L3m7l3qK86k56K13l39M5M46n18K19r1Kq2
$$ 120 -249 53 -5 -99 87 -181 -147 125 19 52 5 -28 -36 250 -6 207 -132 -87 359 -159 60 -31 -29 -111
4051a11RO7q2R2J28j37oJ01j23K74k74K99l83R7j43J75Q9k11M6L9K78m27M22l06
$$ -111 -102 -35 -117 -25 103 -34 -40 61 -62 212 -62 237 -146 -49 -192 -17 72 -139 -93 -54 224 -203 219 -87
4075h7P3J46L2j30rj44M38l57LM7L1j32J1l2N2o9R7j17M5Q1l6J6L1J04j62j52
$$ -87 -14 132 164 34 25 -119 319 -38 -35 12 43 -89 -78 -110 -58 -127 -30 -147 -102 -21 -57 -41 -10 94 -68 -220
4101b20J02K01p4j84K60j65J77k88J91k00L5Q5m6K61l37P8NPK65M4j39R6p5Q7
$$ -220 -118 83 9 -175 85 -80 97 -191 0 -200 -165 -80 -126 135 -202 -124 -119 -112 153 197 58 154 79 166
4125A66j99J19n2k86J92J39j51n4K22o8POJ7nq8k22M02n2J8p7M4j30K18j92Rq
$$ 166 -33 86 34 -252 -60 79 -72 -126 96 28 35 41 58 53 -35 -257 145 93 111 34 78 -52 166 -26 -17 -25
4151b5J50r0q6j0M9J31o2j24p1J57oQ5j33j06J96j21j19K67k17K93j09J54k77
$$ -25 125 35 -51 -61 -12 119 57 -67 -138 19 13 98 -35 -141 55 -66 -185 82 -135 158 49 203 -74
4174g4q2K91k81K9M4jJ61j62n4J34J4L1L5lj91l7K15M3k59P6J66k35l1J38j94
$$ -74 -156 135 -146 -117 -73 -74 87 -75 -129 5 19 50 85 82 -109 -146 69 112 -147 -71 95 -140 -171 -33 -227
4199b27L90k17j34L76Pk15j7M11l65O4n7k35K27qJ87q3n6n4l7J44J3p4j76J74
$$ -227 163 -54 -188 188 195 -20 -37 374 9 73 16 -219 8 0 187 104 48 -6 -43 101 114 40 -136 38
4223C8q0J57k34K25m64L36J83j91N8l55J78Q4m0nK23q4L9j61j38J42k15K18m0
$$ 38 -42 115 -119 106 -358 -22 161 -30 28 -327 -149 -65 -105 -110 113 29 68 -93 -231 -89 -304 -86 -126
4246a26k8P6K11k69R6KJ6j15J16L2l4j62K35p7n7J83j75P4P5j27O7J08k37J39
$$ -126 -154 -78 133 -136 -40 -38 -22 -137 -21 11 -23 -185 50 -27 -84 99 -76 -2 73 -54 13 121 -116 23
4270B3K44j31m0N5j14j98M07k35M2q5o0P2L4m2m9k1K4K02k97L67m40K74k93K6
$$ 23 267 136 96 151 37 -161 246 11 53 -32 -92 -20 14 -28 -77 -98 -74 128 -169 198 -242 32 -261 -235
4294b35M18R7k00k11K38q7j96J77l7j05l7J62j0Q9j34J08J79k43mk49P5K20j96
$$ -235 183 280 80 -131 107 20 -176 1 -36 -141 -178 -16 -26 63 -71 37 216 -27 -31 -280 -205 15 -181
4317a81J68l7J6Mj09j13K76o1n2O2j75L45l79J28O4J33L5%k3k25P8J0O8K79r9
$$ -181 -13 -50 -34 -30 -139 -252 24 -37 -89 -27 -202 143 -236 -108 -44 89 124 124 101 -124 -46 -36 32 311 212
4342B12j45j87J51k4R8J95k89k5j9n3j58N2L11J71l3j24p6K2P0j97K24j24j60
$$ 212 67 -120 31 7 105 300 11 -14 -33 -86 -244 -192 119 290 257 133 57 79 149 -48 176 52 -108
4365a08J70l4K01k06o3k6J32oK43k74R8j65k29L90p1K6k87L52j77K38l36L47m92
$$ -108 62 28 229 23 -40 -66 66 60 303 29 127 -38 -267 123 52 78 -209 143 -34 204 -132 215 -277
4388b77L20J10j15l5J15m08L28M4j58M2j15N7J56k41L2m2L68k22rJ47p9r5N8R4
$$ -277 43 153 38 3 118 -290 38 82 -76 -34 -149 -92 64 -177 -145 -187 181 -41 -50 97 18 -77 -19 75
4412G5p2K31l16K42j94M5J11o3j34J60j73N6L9o2J71Mm63M03R3Pk29J79o7k12
$$ 75 3 234 -82 160 -34 11 122 59 -75 85 -88 -32 7 -55 116 120 -343 60 153 160 -69 110 43 -169
4436a69rJ25J43P3j06j03M4r8j46J79L13l24N5J22m08N95J36O4J88r01N59l73
$$ -169 -178 -53 90 163 57 -46 -2 -100 -246 -67 246 -78 -23 99 -309 286 422 486 674 -227 332 -41
4458d1j27J01n4j05J03J30j27RJ85q1j39P3k7J13qk3Oj13J87O4j32k3O8l1k3K8
$$ -41 -168 -67 -121 -226 -123 7 -120 -111 74 -7 -146 -73 -100 13 5 -18 -12 -125 62 126 -6 -29 39 8 -15 13
4484A3n8Q6R3k92M95m24k21M59j84k13J82L45K45p20J22J44l11J64K1L25J55j45
$$ 13 -45 41 134 -158 337 -87 -308 151 -33 -246 -64 281 526 -194 -72 72 -239 -75 -54 271 426 281
4506B81p2k15PK17j61k5kp8M7Q7Q6k44J01o5K2m3P6M1k38J51J41O9l57J05L7l9
$$ 281 209 -6 1 218 57 32 30 -48 -1 86 172 -72 29 -36 -14 -57 19 60 -178 -27 114 183 -174 -69 -32 -71
4532g1L28k83j76J66Mj37L1N4r0L31l40M18l52K78k11l06N10j58m9j19k7J64J61
$$ -71 257 -26 -202 -36 -32 -169 -138 -84 -174 157 -183 235 -117 161 -50 -356 154 -4 -53 -172 -199 -35 126
4555A26o7K1j51l8J2J80p9m0l0K44n2O2k68Q8p4m1K49j57m1r2K82p5j23j3M6J21
$$ 126 59 80 -71 -109 -97 83 4 -36 -66 178 126 188 -80 8 -66 -107 142 -15 -56 -148 134 59 -64 -77 -31 90
4581I0k9n2j31K84k54M64k33k43J81j3j21J18j55J00K2j0P9J05k03J70k08N5l
$$ 90 61 9 -122 162 -92 372 139 -104 77 64 -57 61 -94 6 28 18 97 202 -1 169 -39 16 13
4604A3n4r7q6L64k96K06m34K70m0J81q8J4J88j69K3R8l65J18n3J97nk33K41Q6
$$ 13 -41 -138 -224 140 -156 50 -384 -114 -154 27 -61 -47 141 -28 -5 93 -272 -154 -207 -10 -15 -248 -7 79
4628G9j96j00L32j51L19l08J26pk96N6J81l2o6j9l8K20j71k06L11j31K91k40j2
$$ 79 -117 -217 115 -36 283 -25 101 94 -202 -146 35 3 -63 -82 -120 100 -71 -277 34 -97 194 -46 -58
4651e8O5j38R7J28j96j2K9N3J05k98J49J23j67P5N1p0o7J16J33j94j14L94j23
$$ -58 7 -131 -34 94 -102 -114 -85 -32 73 -225 -76 47 -120 -45 6 -64 -131 -15 118 -76 -190 204 81
4674H1j79m1J92j37Q8M8K7k43K47j34pM3K9j10J66j83J8o0j11K4K79p9j82L7J52
$$ 81 -98 -139 53 -84 4 52 79 -164 83 -51 -58 -15 14 -96 70 -113 -95 -155 -266 -242 37 -42 -224 -187 -35
4699c5J41J1o1l20K78k4r8J42r8J60r4K49k65P3q8q5K13j74J62j07J15J63k56
$$ -35 106 117 56 -264 14 -10 -108 34 -64 96 2 251 -14 59 -29 -114 99 -75 87 -20 95 258 2
4722Bm5M9N5k06K00J01p5j46J53j87K15j27j43L9K20j33P3J91k87J18%%K10l39
$$ 2 -43 6 61 -145 55 156 81 -65 88 -99 116 -11 -154 -115 105 -28 45 236 -51 67 67 67 277 -62
4746f2J93r8q9J27j94K75o4L1k7j44J13o0J52k42n9M4R6l6R0k52K91p4J14k28
$$ -62 131 33 -56 71 -123 152 88 119 92 -52 61 1 153 -89 -148 -104 -8 -44 46 -206 85 11 125 -103
4770a03K4k51K21L8J61o2r0kJ49p4p7J72n7J55K7p9j82k5j09K80k03M0m04M88
$$ -103 -79 -330 -109 -71 90 28 -62 -64 85 11 -66 106 49 204 231 152 -30 -55 -164 116 -87 -47 -451 37
4794C7m8j54K22p5q8N2J11l7P2j14j7p0o5L50k32J40j15J36k15J66k58J35m4J80
$$ 37 -11 -165 57 -18 -106 -54 57 20 92 -22 -39 -109 -174 176 -56 84 -31 105 -110 56 -202 -67 -111 69
4818F9j62N5M4o2K33j17K6m2k14K6J86M0M6l23J32K6K00q7k51J50K7l7J51j89
$$ 69 -93 -38 6 -56 177 60 86 44 -170 -144 42 82 128 -195 -63 -37 163 76 -175 -25 2 -35 116 -73
4842g3J00K8m1k26J99k19O7K36l16K79k31J9M26l07J11J09l62L38j11j13J55k
$$ -73 27 55 14 -212 -13 -232 -165 71 -245 34 -197 -178 248 -59 52 161 -201 137 26 -87 68 66
4864F6j21K23l50L46r0j5l2j52K50M1o4J24q0J12l48L50l13m1J41J8k30J9J6N6
$$ 66 -55 168 -182 164 74 59 27 -125 125 166 102 226 146 258 -90 260 -53 -94 47 65 -165 -146 -130 -74
4888g4j2L36j02j28O0j87L60k71J67j69J53k20Q3j43J49Lm8j2qJ10R2n08K53J59
$$ -74 -86 250 148 20 80 -107 253 -18 149 -20 133 -87 -4 -147 2 5 -43 -55 -63 47 139 -369 -116 43
4912D3N0j68j14K89j45L7R3R0l76K5L77l51K30l6j01K06j13J26k96Q2J48j12r7
$$ 43 93 -75 -189 100 -45 -8 85 175 -201 -176 201 -150 80 44 -57 149 36 162 -134 -52 96 -16 -113
4935a13J18k44K49K12n1n2j60R4k30L19m07K95J87j62J41k74M14l29J02k18L04
$$ -113 5 -239 10 222 171 119 -41 53 -177 142 -265 30 217 55 196 -78 336 7 109 -109 195
4956A95m59L24J07p1j47Q5J07m1k04R0j25R9J62l09K09q2L0Q8k86O1M89k51k3
$$ 195 -264 60 167 96 -51 34 141 100 -104 -14 -139 -40 122 -187 22 -60 -30 58 -228 -167 322 71 48
4979D8K05k69k00K07j83K47j03j12l9QM38k22j04j66J08n5J55m4n1J85K5l9K9
$$ 48 253 -16 -216 -9 -192 55 -48 -160 -199 -191 247 25 -79 -245 -137 -192 -37 -81 -132 53 78 39 68
5002F8k8J25j52k08L01k47j0J16r9N5J10J72j84l2j11K59l7Q8k41J64r8j10Q6
$$ 68 40 165 13 -195 106 -141 -151 -35 -134 -79 31 203 19 -13 -124 135 98 186 -55 109 11 -99 -13
5025a3JN4j67J71K32k60J42k89K33k6k19m3K90mj82o7M0K34j27R8K3j8j49j17
$$ -13 -12 42 -125 46 278 18 160 -129 104 78 -141 -184 106 102 -80 -147 -107 127 0 98 121 103 -46 -163
5049a63K79k39p5M02k34j98K23j05n0Q6Q8J66k59N6k98J71MJ89m3J31k59k9K66
$$ -163 116 -123 -198 204 -30 -228 -5 -110 -160 -74 14 180 -79 -23 -321 -150 -146 43 0 131 -128 -157 109
5072A09J10k30n5L1M4j96O4R1K19n5k75L43k67p8J76J69k66p7l5M98k07l46M35
$$ 109 219 -11 -66 -35 9 -187 -123 -32 187 132 -143 200 -67 -145 31 200 -66 -143 -178 320 113 -233 202
5095B02q0J0N0o3J32l26J01Q3n4j1O5j11q9K18o9n1K65j94N9j20Qo6K13j75n0
$$ 202 122 132 182 119 251 -75 26 109 55 44 109 -2 -91 127 58 7 272 78 137 17 25 -41 172 -3 -53
5120e3lKJ23k08Q3J15M5j79R3j50J65j71K32L07o15J49J8J35p2j58J52j78M6M5
$$ -53 -56 -54 69 -139 -56 59 104 -75 18 -132 33 -138 94 401 -214 -65 -47 88 16 -142 10 -168 -122 -77
5144g7J65L2j07M6j11K5m0j56K16o2k6R4n1N5j51J34p4J69Ql31L02P7j31j32k6
$$ -77 88 120 13 59 -52 -27 -67 -223 -7 -69 -95 -1 -52 3 -148 -14 -88 81 89 -242 60 137 6 -126 -152
5169a52M1k2K53l84K74J59m00K35k5l52K68J7K63n7M3k18q0J10K11Nk31p9J89
$$ -152 -111 -133 120 -264 10 169 -231 4 -21 -373 -105 -88 175 118 161 -57 -137 -27 184 189 -42 -121 68
5192F8k06K20N1k40M4k4O1N7K24k36j78m3J87J83j87j60L18l47R2J27k16M9J61
$$ 68 -138 82 133 -107 -63 -87 -26 31 255 19 -159 -202 -15 168 -19 -179 139 -208 -116 11 -205 -156 5
5215ENj44J0%M00l44K52n0l05M03j86j46Q2J24k2l7q3NK24n35M91j73N8P0k10
$$ 5 10 -134 -124 -124 276 -68 184 134 -171 232 46 -100 -18 106 84 47 -36 -31 193 -342 149 -24 34 104 -106
5240a06r3M61k25R4m07K99P8k49J15J99j62K22l30K57q2n8j15P4k8R9K68k65P
$$ -106 -199 262 37 131 -276 23 101 -148 -33 166 4 226 -104 153 71 13 -102 -28 -56 43 311 46 53
5263E3P6j16q9N1p1J43j31J90m2n3lq4o9%J88l3L00m3k77j68k1L48l3m7m6k18
$$ 53 129 13 -76 -25 -96 47 -84 106 64 11 8 -76 -145 -145 43 10 310 267 -10 -178 -199 149 116 69 23 -195
5289a95J43r4R5J77j13j60j16L76j19j65l5K6J52J50j51k44K81P4p7o9n5J55r
$$ -195 -52 -146 -51 126 13 -147 -263 113 -6 -171 -206 -180 -28 122 -29 -273 8 82 5 -64 -119 36 27
5312B7J83q3l63K09K83P5k87n3j74K57k4m4k8k9J06qK44j49j93j3j4J10O8O4j26
$$ 27 210 127 -236 -27 256 331 44 -9 -183 74 50 6 -22 -51 55 47 291 142 -51 -64 -78 32 100 164 38
5337C8k8m1j27J45J16l43J61J77l41J75n7n0l0L7K15P8L9l37Q0j63M39j18j01
$$ 38 10 -31 -158 -13 103 -240 -79 98 -243 -68 -125 -175 -205 -168 47 125 164 -173 -93 -256 183 65 -36
5360c6k10J08N9J14k79L29j09Q1m1K6l36K89j33J26N6j52K45j85j61L9L18o0o1
$$ -36 -246 -138 -79 35 -244 85 -24 57 16 42 -294 -5 -138 -12 44 -108 137 -48 -209 -170 148 88 27
5383B7k86L93n3j12M7J2j16K23Oq1j14J47j85L1K21j8m47M46l04J52j83M01j15
$$ 27 -259 134 81 -31 16 28 -88 135 141 60 -54 93 -92 -61 160 142 -305 141 -163 -11 -194 207 92
5406I2n8r5N2O3J44q9j77j46L2N1o7K10K03K20m98j81L71N9l62L09r6N4j42k40
$$ 92 34 -61 -9 54 198 109 -68 -214 -182 -131 -198 12 215 435 -63 -244 127 186 -176 133 37 91 -51 -291
5430b91J31J06k09L83p6k57O9J42j48K33J09n5j48K5J41l25K47j5J21q0l14K03
$$ -291 -160 -54 -263 120 44 -213 -144 -2 -150 83 192 137 -11 14 155 -170 77 62 183 103 -211 -8
5452hp0nk6J21J51k52L28j89rn1Oj24p3o7J65j37K76j20K06Rk93J32O8nj11p8
$$ -8 -78 -83 -109 12 163 -89 239 50 41 -10 -4 -128 -201 -268 -103 -240 36 -84 122 131 -162 -30 38 33 -78 -156
5478a56L59j42j50L28k59j2R1j75K64l70L39k24N36k92j66J77m27L22k16K3J81
$$ -156 203 61 -89 239 -20 -32 59 -116 148 -222 117 -107 429 137 -29 148 -279 43 -173 -150 31
5499C1l36L00k0l11L91j09J51j20OK85l37q3K01k73L13k25J25M7k74N4lK28j75
$$ 31 -305 -5 -25 -336 55 -54 97 -23 -17 268 -69 -152 49 -224 89 -136 -11 36 -238 -184 -187 41 -134
5522a34K16l18L35n4o0j25L18k82K82j50p5K54j93JM0r0j00nJ63q0R4k48K31J7
$$ -134 82 -236 99 45 -15 -140 178 -104 178 28 -47 207 14 15 55 -35 -135 -140 23 -57 37 -211 20 37
5546C7L3n6mj35O6l9K21l11J71J77k14l5J23n3l3J20l1J90L34o43l9N6K37J33
$$ 37 70 14 10 -125 -59 -98 123 -188 -17 160 -54 -89 34 -19 -52 68 37 227 561 -82 -121 -65 172 305
5570C05l92J13l39L72j35j6n2J79NJ70l9j78O4j43K82k63J43q6J4j0J06J75j73
$$ 305 -87 26 -313 59 -76 -92 -144 35 40 210 171 -7 57 -86 196 -67 76 -10 4 -6 100 275 102
5593A02P4L6k35J34m33L09j09O8J26l41N16j68l39L55Lj83J36l3j8j18R6j37K65
$$ 102 176 212 -23 111 -322 -13 -122 -54 72 -269 247 79 -260 95 98 -85 51 18 0 -118 -22 -159 106
5616A06n1J19j26Nj11J38k86J76J90n2l44K59J77m38J98J57j61K0L5j7O4R6k72
$$ 106 55 174 48 53 -58 80 -206 -30 160 108 -236 23 200 -238 -40 117 -44 -24 11 -6 58 154 -118
5639a18L15k50n4K41j96K41j12q4J64k05P5j93N9J06K31m48L12j39J60k34R3m4
$$ -118 197 -53 -107 134 -62 179 67 -17 147 -58 17 -176 -117 -11 220 -228 84 -55 105 -129 -36 -80
5661h0Lj13K29J23k39j8M5K1j11O4M1J12M6R1m38J44P0P5O6K4k94K66l11L03q0
$$ -80 -77 -190 39 162 -77 -95 -50 -29 -140 -76 -35 77 123 214 -224 -80 -10 65 131 155 -139 127 -184 119 39
5686C9q6K55j61k53K05K52j45O2j10p4K17q5P8n2k37J69Mj10J5J54j01j68j81
$$ 39 -47 208 47 -206 -1 251 106 168 58 -16 201 116 194 142 -95 74 78 -32 -17 137 36 -132 -313
5709c13L16j01J40P2j61J29p5n9j32R4L70o3l51L70k07j01J66k46J24n8j41R9
$$ -313 3 -98 42 114 -47 82 7 -52 -184 -90 280 217 -134 236 29 -72 94 -152 -28 -86 -227 -128
5731a28K26l5j62R7j06n5J65n4J54j32N9n5j89L01J30l48J61k26Q7J85k49M61
$$ -128 98 63 -99 -2 -108 -163 2 -52 102 -30 29 -26 -215 86 216 -132 29 -197 -110 75 -174 287
5753B87k63j45K66l79K38J45k18J39j28k83M10j57j13L08m9k21K66o7j82J40j9
$$ 287 24 -121 145 -234 4 149 -69 70 -58 -341 69 -88 -201 107 58 -163 103 36 -146 -6 -25
5774b5KJ2M0j77J71K8j97p8L87j30m1o9qJ12j49j0K18Kj52K11k72J53o3J71j10
$$ -25 -23 -11 29 -148 23 51 -146 -224 163 33 -8 -77 -85 27 -122 -132 86 88 -64 147 -125 28 -35 136 26
5799B6k3j07J85j33j36K73m25K20K29j48K21m3j30k55M44j13R9j4K5k72j36K95
$$ 26 3 -104 81 -52 -188 85 -340 -120 109 -39 182 139 9 -246 198 85 184 170 195 -77 -213 82
5821H2l1k37L29l22K76k06J30P1J0p7j3j10J90J60k31N1r1N5J37J5p0l41K48L0
$$ 82 51 -186 143 -179 97 -109 21 92 102 25 12 -98 92 252 21 72 -19 36 173 188 118 -223 25 55
5845E5r2R0o0KPRj9N3J19j02NLQ1L4k88KL70k58m8j18j63J86J54j9n0J70k43K8
$$ 55 -37 53 -7 -5 2 11 -8 45 164 62 67 70 151 185 -103 -101 269 11 -37 -155 -318 -132 22 3 -47 123 -120 -92
5873i2J73j21j1n8j00j0M90l01j31K84k29o5K41jo5k57L9K89j61m3K87%k74J99
$$ -92 81 -40 -51 -109 -209 -219 271 -30 -161 123 -106 -171 70 69 4 -253 -214 75 -86 -129 158 158 -116 83
5897H3j57j8Q7k41O0K03J8K25k23oj54J52J15j76QK40l34J51J46J10j61p8r1J44
$$ 83 -74 -92 -5 -246 -186 17 35 260 37 31 -123 29 144 -32 -24 216 -118 33 179 289 128 50 -41 103
5921A03r9%J50l32L48p8j11j29K79j45J89n5j94j4J63j27lP5k51K04O4P2L9m7
$$ 103 4 4 154 -178 170 92 -19 -148 131 -14 175 120 -74 -88 75 -52 -55 20 -231 -27 37 109 148 101
5945A01m06L46J34k25k07J63j40K97k1n2J46j92j52O2K0J22k47K95Qq0j38m8J48
$$ 101 -305 41 175 -50 -257 -94 -234 63 42 -10 136 -56 -208 -146 -126 -4 -251 44 52 -28 -166 -214 -66
5968f6j51M77j35j09J2k7m3j02K24k97J63J36k03K71j53k47L33l9q4M3J29m7r1
$$ -66 -217 260 125 16 28 1 -42 -144 80 -217 -54 82 -121 150 -3 -250 83 44 -40 3 132 85 -6
5991fo2K38m22L38k84M22k74R8n8j60K70j83j30O3M38k83o8J85j52j96L41p1k41
$$ -6 -68 170 -252 86 -198 224 -50 48 -10 -170 100 -83 -213 -150 288 5 -63 122 -30 -226 115 44 -197
6014a97K60r1K85l60p8J25j94K40K11j39j27J89j69J28j71j50J67L15k08J12k02
$$ -197 63 -28 257 -103 -181 -56 -250 -10 201 62 -65 124 -45 83 -88 -238 -71 244 36 148 -54
6035e4K8J22k96K61j64kL9J2K60j96k20K21J62k19J8j36N6o0K51l03L28J60l88
$$ -54 -26 96 -200 61 -103 -105 -66 -54 206 10 -210 11 173 -46 -28 -164 -108 -168 83 -220 108 268 -120
6058a20J34N6k01R0J29n9L2J31k09K30j87m7j33J74Qp7J3R1k1k45L36o3k09J82
$$ -120 14 70 -131 -41 88 29 61 192 -17 213 26 -21 -154 20 28 -49 -36 55 34 -211 125 62 -147 35
6082C5J02k62J19K68k52N5j18j93L39m0j37Q3O5q2r8J32mK68l38j01K67r5j16
$$ 35 137 -125 -6 262 10 65 -53 -246 93 53 -84 -1 64 -18 -116 16 12 280 -58 -159 108 13 -103
6105a03j0L1Q4KO4l2Np2j36Q0K15K4l28J22K6L22l07O1o6Q1l7L4pj42K09O3n2
$$ -103 -113 -82 2 4 68 36 41 -31 -167 -87 128 152 -176 -54 -28 294 -13 48 -18 63 26 60 53 -89 120 183 131
6132A31Pl47L09J11j76K38k79Q8j54J88OJ56l9j98j48P6K13l29Q7L0L8r6L2j14
$$ 131 138 -209 100 211 35 273 -6 82 -72 116 122 278 239 41 -107 -31 182 -147 -60 -30 8 -88 -56 -170
6156a70j2R8KQ7P9j65J87N8m2k13l7ML76k34K61k69k42K33l9P1l68K16rL81l53
$$ -170 -182 -84 -82 5 84 -81 106 164 122 -91 -128 -124 252 18 279 10 -232 1 -38 33 -335 -119 -128 253 -100
6181a00j15J54K82m94L33j31J48j78K11j01R9j35J39j53M2Q9l08J16k9M7K5P5
$$ -100 -215 -61 221 -273 60 -71 77 -101 110 9 108 -27 112 -41 1 90 -218 -102 -131 -84 -59 16
6203A6j89J46j21K43j6P7k06J05J8J52m10L31k54R7L7J8j66N7K24j41K9n4p7O4
$$ 16 -173 -27 -148 95 79 156 -50 55 73 225 -185 146 -108 -11 26 44 -122 -65 159 18 47 -7 -84 -20
6227b0n8J23R0J7k20J2l1L66rj44j91r9J75O8o4P2l1l3J11O5k20j10J27q2l0r
$$ -20 -78 45 135 152 -68 -56 -87 279 270 126 -65 -164 11 79 15 87 56 23 134 199 -21 -131 -4 -86 -116 -125
6253a25lJ25J29r2q0K5j35K59k12j3J58n6j88J56J91j83JK0m7p1J83j92M5L7j0
$$ -125 -128 -3 126 34 -46 -21 -156 103 -109 -122 36 -20 -208 -52 139 -44 -43 -23 -70 -141 42 -150 -105 -68 -78
6278g8M3l6K5J38j65QJ62J47m47K90j13l7J02R3M1q6m4j8p8nK57k36k77L33o8
$$ -78 -35 -71 -46 92 -73 -65 97 244 -203 87 -26 -63 39 132 173 87 43 25 -53 -58 199 -37 -314 19 -49
6303d9J04R8k44j65K90j55J43m0r1J86j87J59J33k49M8P8j34K17k23J3K05k54
$$ -49 55 153 -91 -256 34 -121 22 -18 -109 77 -110 49 182 -67 -19 59 -75 142 -81 -68 137 -117
6325a17P7j40J20J46j26o6J41Q3k73K10l4r7J96j99r8M6K10r8K21j57k15J71j19
$$ -117 -40 -180 -60 86 -40 -106 35 118 -155 55 21 -76 120 -79 -177 -131 79 -19 202 45 -170 1 -118
6348a18J59j96J19m1j02J82o5J79L6k39K96l20mJ74j00m4K30j52k0J01j44M7Q6
$$ -118 41 -155 -36 -77 -179 3 -62 117 153 -86 210 -110 -114 60 -40 -84 146 -6 -26 75 -69 -22 64
6371F4J43j27Oj7m3k96J48L0J53m3j18M4R5n5r9K60J7q7n6j79P6j16J10J29j09
$$ 64 207 80 86 69 26 -270 -122 -92 61 18 -100 -56 39 -16 -115 145 162 75 19 -160 -84 -200 -90 39 -70
6396g0J26j20K75r2P2p1k8n8m6K70r5l66M05q3n9r9L8k20J75P6k7K74n15J89j15
$$ -70 56 -64 211 119 191 120 92 34 -12 258 163 -203 202 119 60 -39 -1 -221 -46 30 3 277 -238 -49 -164
6421a64J57L20n86J66J10k11J85Pj50J61k7j34J79k64K48n6J63k23Q3L02l03Q7
$$ -164 -7 313 -273 -107 3 -208 -23 -16 -166 -5 -32 -166 13 -251 -3 -59 104 -119 -36 266 -37 50
6443E0j24L74j36m8l23Q7M96m30j2j52J16L8J47k16K70j86L8K1J36r8J28m24K42
$$ 50 -74 300 164 116 -207 -120 376 -54 -66 -218 -102 -64 83 -133 137 -49 -11 10 146 48 176 -248 -6
6466fJ7j2q3j06J09J47N1j8k25M2J24j28K00n6k04jL29k9m14K97n7R9j27J23k45
$$ -6 11 -1 -84 -190 -81 66 117 99 -126 -84 40 -88 112 56 -148 -149 180 151 -263 34 -23 76 -51 72 -173
6491a73K73O6M7r8j31M3j76n2J8L19o7M8j64M8J25j83j02L11j38o1N9J72k09J57
$$ -173 100 166 213 115 -16 27 -149 -201 -183 136 69 117 -47 1 126 -57 -159 152 14 -47 12 184 -25 132
6515A32J53k84K06k05N9J20p9J35k18l7K45k75J8J4J84Mr6n1l6O9N1q3j25K73
$$ 132 285 1 207 2 61 181 102 237 19 -18 227 -48 -30 -16 168 172 76 25 -11 58 109 26 -99 174
6539A74k87l2K9o6L36l65K41l7j09L17l81p4J40K35j60J7K42k99N4R0j03o8J0
$$ 174 -113 -145 -116 -182 154 -211 30 -7 -116 201 -180 -254 -114 121 -39 -22 220 -79 -25 65 -38 -106 -96
6562i6Q8K21Pk81o9K6r5J62r6L44q6n5n1qj38pr7K07k03J79J2J93j08M6q8o1L10
$$ -96 -8 213 220 -61 -130 -104 -199 -37 -133 211 125 70 19 11 -127 -134 -231 -24 -227 -48 -36 157 49 95 7 -54 256
6589B56k39k6k0m0J88J06k04j33R4k0O0q2P8N8jK2r8j03L57j29j9j84K58k69K39
$$ 256 17 -9 -29 -69 119 225 21 -112 -18 -38 22 -60 18 76 75 97 -1 -104 253 124 105 -79 179 -90 149
6614A49l25J15J74J25k01L4k74L2J27j04K20j69L13k09j38M0J75o0j4m9o9j73
$$ 149 -176 -61 113 238 37 71 -203 -171 -44 -148 72 -97 216 7 -131 -91 84 24 10 -39 -108 -281
6636b81K13j52K8K23p7%J80j72j06R0n0q2K15K3J49l28M6J84j73J44j4p2l6J35
$$ -281 -68 -220 -192 31 -46 -46 134 -38 -144 -54 -104 -186 29 52 201 -127 -81 103 -70 74 60 -12 -48 87
6660H7k72L02j27PJ04l09NL90l14K84Q2r8r4m1jj7mJ89q3j47J2j91J29K44j45
$$ 87 -185 117 -10 -3 101 -208 -203 187 -127 157 239 141 47 6 5 -12 -16 173 90 -57 -45 -236 -107 137 -8
6685hJ03L1m5J2j33k49L82l7O5k57M08l10RM1p8j49J25J03R6p0j24Q6M8P3j14
$$ -8 95 126 81 93 -40 -289 93 56 121 -136 272 -38 -29 12 -66 -215 -90 13 109 39 -85 1 49 122 8
6710Hlj62L72P5j74k00q9J10j7K34j41q0j2L8K30Qq9k5l3k44J70K03mk21k6K0
$$ 8 5 -157 215 290 116 -84 -173 -63 -80 154 13 -67 -79 -41 189 197 108 83 50 -194 -24 179 175 -46 -72 -52
6736e2o8n9K73r3J08j96q8L92j75K56j51p6j62Q4k39R0J07K1j13Q1j9j6J67n3
$$ -52 -120 -179 94 1 109 -87 -175 217 42 298 147 71 -91 -7 -246 -156 -49 -28 -141 -60 -79 -95 72 19
6760A9O7k82o8L42o4K5l5N0k01O1O8J19M0k23j34K53j57j20J55K17p0q9O1q3p
$$ 19 86 -196 -264 78 14 39 4 54 -147 -86 -18 101 141 -82 -216 37 -120 -240 -85 132 62 -27 34 -49 -56
6785e6M9mJ2L0op8K94l47J05J5j35J40k7l2j31K87k00M0L20l39K35k03J7P2k42
$$ -56 -7 -11 1 31 25 -53 241 -106 -1 14 -121 19 -8 -40 -171 116 -84 -44 276 -63 172 -31 -14 58 -184
6810a84J00K9O4J26k09K11r1l3q0J74%q3J52j99J15J1j72l8j44K03O4j91L89k69
$$ -184 -84 -55 9 135 -74 137 46 13 -67 107 107 24 176 -23 92 103 -69 -107 -251 -48 16 -175 214 -55
6834e5o3j82L49j96k8J19K76l36L16k50p0R8J18j89K5J61l5n5j19j7K07j70J59
$$ -55 -118 -300 49 -147 -175 -56 220 -116 200 -50 -120 -22 96 -93 -68 93 58 3 -116 -133 74 -96 63
6857F3N9k23J91L6P3m27L63j15q5J96L8q5j8o2r4m4k9J02n7J12P5N5M3j10L0m4
$$ 63 122 -101 90 126 199 -228 135 20 -65 131 169 84 66 4 -90 -134 -163 -61 -118 -6 69 124 167 57 87 43
6883D3pJ88k15J51J00l92j03O14m15pJ43m7j0r7J81j51n6j09Q8M8L51l05J84k35
$$ 43 36 224 9 160 260 -132 -235 379 -36 -43 100 53 43 -54 127 -24 -80 -189 -101 -53 298 -7 177 -58
6907e8j61J53k9J43j06N9k27L93J3l57J5L11j34NK08j12j9r1pl1J10j81L51j69
$$ -58 -219 -66 -95 48 -58 1 -226 167 180 -177 -162 149 15 20 228 116 97 6 -1 -32 78 -103 248 79
6931G9J5m7j2q8N5k32K17K29j89Q8k43J51J3l2P1j63J61j67p2K16j86L46q4q4
$$ 79 94 47 35 -53 2 -230 -13 216 27 115 -128 23 36 4 75 -88 73 -94 -166 50 -136 210 126 42
6955D2j09J79K36m10J03j12Q1P4M8k91J36qn3R2L9j8J04OL5N4l13K67jl88K67
$$ 42 -67 112 348 -62 41 -71 10 84 132 -159 -23 -31 -84 8 47 29 133 139 174 228 -85 182 181 -207 60
6980F0p9j00P8j7J4K4j07K17k73L17o6j21M8m5K72k01K02o1N1k04p7J36q5m7J66
$$ 60 -19 -119 -41 -58 -44 -20 -127 90 -183 134 68 -53 -5 -50 222 21 223 162 213 9 -68 68 -17 -64 102
7005A02j78J19K8l45J24K73n0m3N5q9j14J71L9p4J16p1O5k8j21J53j44J54k26
$$ 102 -76 43 71 -274 -150 123 73 30 85 -4 -118 53 92 18 134 63 128 100 -21 132 -12 142 -84
7028h4J99m6Kl14L94k28l06M98p1n6K70l23K9K60k94L16m68J22K08M1J7k60L32
$$ -84 115 69 71 -243 151 -77 -383 115 44 -12 258 -65 -36 224 -70 246 -222 -100 108 149 166 -94 238
7051B38l59K48j68J10n4l9J22q2n7O9p4j53K46n9K00j30m9J1O2K06j99j39k93
$$ 238 -121 127 -41 69 15 -24 98 16 -41 28 -46 -199 47 -12 188 58 9 20 82 288 89 -50 -343
7074c43L89m14N33n6q6J8j42K6K90j01q1q7p1p2J22J44o3lp6N0J33k98L65K49
$$ -343 46 -368 165 109 23 41 -101 -75 215 114 33 -54 -125 -197 -75 69 6 3 -73 -23 110 -188 177 426
7098D26m57M4k37N2J80M0O3k14J42m8j89J22n0Q0L8J13j13l7J08o8qj23j83L06
$$ 426 -31 13 -224 -172 8 48 111 -103 39 -9 -198 -76 -126 -46 -8 105 -8 -45 63 -5 -13 -136 -319 -13
7122a3k6R1J13j78J1J41N3p4o3j82J49J97k15j55M4r6J35J92j53J38j67N4n4J45
$$ -13 -39 52 165 -13 -2 139 192 118 55 -127 22 219 4 -151 -107 -203 -68 124 -29 109 -58 -4 -58 87
7146H7J31l01K08p9q3K57m8l4j69P1q0p4Q5J99j01j87M8r5J57k67L62k71J90N1
$$ 87 218 -83 125 46 -37 220 172 138 -31 40 -40 -114 -29 170 69 -118 -70 -165 -8 -275 87 -184 6 57
7170E7J32l36J35j29J21r7R3l26L22L9Q8k62J89P7p9L1j2r1J49n0j31J52j84Q2
$$ 57 189 -147 -12 -141 -20 -117 -24 -350 -28 11 99 -163 26 103 24 55 43 -48 101 51 -80 72 -112 -30
7194c0l4K1L5L8j29L30p4l29K2J41j65K23o1J69j55L1J30m31L53j93K09J67k53
$$ -30 -64 -43 -8 30 -99 231 157 -172 -150 -9 -174 49 -12 157 2 33 163 -268 85 -108 101 268 15
7217A5r0J7Nn9P2j82K51J29r5J14j21j02j4J1O3j2P0J54k42j3K9j84J42K54k3
$$ 15 -75 -58 -53 -112 -40 -222 29 158 63 177 56 -46 -60 -49 14 2 72 226 -16 -29 0 -184 -42 212 189
7242A89j96R2j07n6p4kL74j94l03L52J78k55K6om8K8K10k12l6k27L99N6m11L48
$$ 189 -7 85 -22 -78 -152 -154 220 26 -277 75 253 -2 24 18 -30 -2 208 -4 -40 -267 132 188 -223 125
7266A25j14J46j75J78P6r0J2j78oP4j29J09J34j85L3k36K86n0Q8j74J78Mk20M07
$$ 125 11 157 -18 160 236 146 158 -20 -26 48 -81 28 162 -23 10 -226 60 10 98 -76 102 106 -114 293
7290B93l99J83k02K94l04O7J07J82n7J8l01J26j32J00j12J8J33L6P6k07J72J69
$$ 293 -106 77 -125 169 -135 -68 39 221 164 182 -119 7 -125 -25 -137 -119 14 50 126 -81 91 260
7312B60j79r2j86K37j47j4K05j92L36l07L17j97j56j9K44j79K19j65O5J16J4l85
$$ 260 81 -11 -197 40 -107 -121 84 -108 228 -79 238 41 -115 -134 110 -69 150 -15 50 166 180 -205
7334b05K17J56k97K42Kj83N2n7J1Q6r7J92j52N3k03J07k27L46K9m0k18J47N2j21
$$ -205 12 168 -129 113 115 -68 -16 -73 -62 24 -73 119 -33 20 -183 -76 -303 43 72 32 -186 -39 13 -108
7358a08R9j18J02Pj90J56o0J23K85k17o9j19R2J16k33K08r1P2l3N6r1J24n3K8
$$ -108 -9 -127 -25 -18 -208 -52 -112 11 296 79 10 -109 -17 99 -134 74 -17 55 22 78 -13 111 58 86
7382H6k07kL19j96j35K64l0m01O35n47mL08J22j80qM3p3J04n4K1K2j96p0J32J31
$$ 86 -121 -123 196 0 -135 129 99 -302 333 -214 -218 90 212 32 24 67 -6 98 44 65 87 -109 -179 -47 84
7407H4J18O5l60K47l8K4j31j04J92R6l34j9nJ28K43l39J26Q9j35K57l38L43l71
$$ 84 202 267 -93 154 116 140 9 -95 97 193 -141 -160 -165 -37 206 -133 -7 82 -53 204 -134 209 -162
7430a62N3L81k81j81K58l6l2J52l81L14l50J83L3K41O1l62J06J05j85N3J6J76
$$ -162 -109 272 -9 -190 68 32 0 152 -229 85 -265 -82 -49 192 253 -109 -3 102 -83 -30 -14 162
7452A62j46J0J8K7Mn8o6OL8j7J58l17q5L69j40m6K97k43J92l17J05K2r5MJ31j0
$$ 162 16 26 44 71 75 17 -49 -43 -5 -22 136 -181 -266 103 -37 -83 214 -29 163 -154 -49 -27 -122 -118 13 3
7478CR8q2J46j58j27K33n0j92K54j69p4J21k5K55m31K23j70K51M8j72J07j9j52
$$ 3 101 19 165 7 -120 113 63 -129 125 -44 -118 3 -22 233 -198 25 -145 106 154 -18 89 70 -82
7501h2K23p8K2k4N2o6k36M33k07l09K78L0j5J43j71%J57k89N8J10Nj67K80j07
$$ -82 141 63 85 61 113 47 -189 244 37 -272 6 36 21 164 -7 -7 150 -139 -81 29 34 -133 147 40
7525D0K25l10K67k85K67m7k82J47j37J87L4J51j88j68K92k11K0l5J1r3Q8j62J99
$$ 40 265 -45 222 -63 204 157 -125 22 -115 72 106 257 69 -99 193 -18 2 -33 -22 -115 -27 -189 10
7548A0M3k33K58j8L3k66L50j92q6O9K35Pq0L8j0j6k70j9J23J47j72K06J00m13
$$ 10 53 -180 78 60 93 -173 177 -15 -101 -32 203 210 130 168 158 142 -128 -147 -24 123 -49 157 257 -156
7572a56K10j39mL35j61L67n00K00R7m69O10K91r81L69L46k86l91J28O44q44R51
$$ -156 54 -85 -89 246 85 452 -48 152 249 -220 390 681 -300 69 415 129 -262 -134 510 -334 617
7593F17r93j55P76j114P47O74L18p89k5J24k53k00L60r9k69K88r2N3J84k0J00
$$ 617 -376 -531 245 -869 -122 552 870 81 56 180 -73 -273 87 -12 -281 7 -85 -32 152 132 232
7614B32j46r6m8RJ42j50K09l60O5K07k67L18jp6J1K6j08Oj2L4r2K84k71j36N20
$$ 232 86 -10 -58 -49 93 -57 152 -208 -143 64 -203 115 114 38 49 75 -33 -27 -39 -5 -97 187 -84 -220 300
7639C00k4l33M0K30k13J98P2l26J21r2J24K3j95J21l3j8k53O9O4J91l28J96Oj30
$$ 300 276 -57 -17 213 0 198 270 -56 65 -27 97 120 -75 46 13 -5 -258 -189 -125 66 -262 -66 -60 -190
7663a90L23p9O6l68J07lP5J03r7K56j19j52P4j27K08j02J76j51K44j83M9k01L
$$ -190 133 54 120 -248 -141 -144 -69 34 -63 193 74 -78 -4 -131 77 -25 151 0 244 61 110 -91 -88
7686h8L5J05J22j25l35L22k09L76k18rqJ22L0j82J09J3J18j66O8K63l22J37j99
$$ -88 -53 52 174 49 -286 36 -173 203 -15 -24 -32 90 120 -62 47 60 178 12 80 343 21 158 -41
7709d1J05N4j29j17l3J08J9K22k99O6j00J10n1N2L0q2k56L64q0nJ19J86j23m9
$$ -41 64 118 -11 -128 -161 -53 -34 188 -111 -45 -145 -35 -86 -34 -4 -86 -342 22 -58 -63 56 242 119 70
7733G0q7J94m33J83L1o4K78K0J31k9q9k90j26K64k70P0L93l77N7j20K13pJ9j2
$$ 70 -17 177 -256 -73 -42 -106 172 192 323 294 205 -85 -211 53 -217 -147 246 -131 -74 -194 19 12 31 19
7757A9O7j71o6J20j9O3M4n9j25J17j1N2lj96j6J88oK9J28l09K26Q7m5j27j15L74
$$ 19 86 -85 -151 -31 -50 13 57 -2 -127 -10 -21 31 28 -168 -184 4 -2 27 155 -154 72 159 114 -13 -128 246
7783B46l85K61j57j3r6J06J26M5Nj81m6QK05k50L84l40O4j12J18J11j9j93K48
$$ 246 -139 122 -35 -48 -144 -38 88 133 138 -43 -89 -81 124 -126 258 -82 -18 -130 -12 99 80 -113 135
7806A35n9K0n2R1j19j97K47m8K33l40J29r5QJ25r7J7N2K5j3k89J68K1j01R4j04
$$ 135 76 96 44 135 16 -181 66 18 251 -89 40 -55 -47 78 -19 -2 50 75 62 -227 -59 -38 -139 -45 -149
7831a49R4p5o8K57L7o9J11j20j03Q5K23l68L7J55J91j58p5l09M38m56K34k3J00
$$ -149 -55 -130 -198 59 96 27 138 18 -85 0 223 -145 -108 47 238 80 5 -304 134 -322 -88 -111 -11
7854a1L3n7n1O0n1N7J54k09N6J08j35L05l82K1R0R1k5%oP4k37Q3k7j55K3J18K23
$$ -11 22 -35 -86 -26 -77 -20 134 -75 -19 89 -46 259 -123 -102 -12 79 54 54 48 122 -115 -32 -59 -214 -191 -73 150
7881A50j53j9L5q0O4q1K92K8p24N32kk11J84N4k33K64J25k97L32l00K63j92%o1
$$ 150 -3 -22 13 -67 -3 -84 208 236 -488 44 42 -169 15 69 -164 100 225 -72 260 -40 223 31 31 -30
7905c0oj0j6J67j24L9q6J4J0J08j03L7M2l1j72R0L49l13J16j86K33k2l07L11j26
$$ -30 -36 -46 -62 105 -19 20 -66 -52 -42 66 -37 0 42 11 -161 -71 278 -35 81 -105 128 106 -201 110 -16
7930a6k0J88j60Nj04o9M00k71o0N5j78L11k61Q6J55j15p4J50M8j49j2K87m58M85
$$ -16 -36 152 -8 -3 -107 -176 224 -47 -107 -52 -230 81 -180 -94 61 -54 -128 22 70 -79 -91 196 -262 223
7954B23k20K27M1j37j77K91j89J21k77L48l56J41l3j58Q2Q7J41k53N9J68N1q7
$$ 223 3 230 271 134 -43 248 59 180 -97 251 -105 36 3 -155 -73 14 155 -98 -39 129 180 93
7976I3K8O9j59j65M56l80J5Oo7K3p7K11k20K10j00L8R5J40j85m7J2J96j39O5J32
$$ 93 121 190 31 -134 322 -58 -43 -37 -104 -81 -158 53 -167 43 -57 -19 76 216 31 -16 -4 192 53 118 250
8001B50l4j54n1Q6k42L29j64M7P0m6j17j5J15k05M65l91J56lM6M5l30J50kj54
$$ 250 216 62 11 97 -145 184 20 67 137 91 -26 -41 74 -131 334 -57 99 96 142 187 -143 7 5 -149
8025a49K73k34q0J53P9J8J01J66k81p7N9O1J09k44l2J66J12m39j26L30j40K06
$$ -149 124 -110 -190 -37 42 60 161 327 46 -31 28 89 198 -46 -78 88 200 -239 -365 -35 -175 31
8047C1j7O3j3k06K9J67k40L15n9N6J5k04J23j45o9K14nJ31l05L7L28l21J82j08
$$ 31 14 77 64 -142 -113 54 -186 129 70 126 141 -63 60 -85 -154 60 55 186 -119 -82 246 -75 107 -1
8071aL07k29J07Jq0k28J0j08M28j0n3j38Km6J60j89j57K12J29Q9j68m9J57m0k82
$$ -1 306 77 184 185 105 -123 -113 -221 207 197 144 6 8 -38 122 -67 -224 -12 117 206 38 -11 146 106 -176
8096a76N4R5K5P3oo2P0N2k16m1K83k69J15Q3m11K25K55j55j76P6J28J2p1M2j62
$$ -176 -122 -27 -2 71 65 3 73 125 -91 -132 151 -118 -3 80 -331 -106 149 -6 -182 -106 22 34 -37 5 -157
8121a57K18m2j07j43L77k26K43p8J43L7k61o1O0O3%k31J32P9l41K74J33q7j58
$$ -157 61 19 -88 -231 146 -80 163 85 228 265 4 -57 3 66 66 -165 -33 46 -295 -21 112 25 -133
8144a33J54J74j47j05J01j18lL1j09L16n9O2k75K16j26j32K2k0K68k34j09J76
$$ -133 21 195 48 -57 44 -74 -77 -46 -155 161 102 164 -111 105 -21 -153 -131 -151 117 -117 -226 -50
8166e0J6O2j85J57J69k87Q9J2j28K59o7j35L0r9K42l70K28j09J26l8l96L50J87
$$ -50 -34 28 -157 0 169 -118 -29 -17 -145 114 47 -88 -58 -157 85 -285 -57 -166 -40 -78 -474 -124 63
8189F3j77p3
$$ 63 -114 -187
8191a87
$$ Imaginary data points
##PAGE= N=2
##DATA TABLE= (X++(I..I)), XYDATA
0@%%%%%%%%%%%Qj6J6j6J6k4L2m0M8n6O6p4Q8j04J27j51J70j94K24k56K95l35L76
$$ 0 0 0 0 0 0 0 0 0 0 0 0 8 -8 8 -8 8 -16 16 -24 24 -32 34 -40 48 -56 71 -80 90 -104 120 -136 159 -176 200
34B00m26M82n43O08o80P58q45R41j043J155j278J411j557J717j892K084k296K530
$$ 200 -226 256 -287 321 -359 399 -446 495 -548 607 -671 740 -817 900 -992 1092 -1204 1326
52A326k788L075l396L758m167M638n185N824o589P524q691J0198j2227J5118j9583
$$ 1326 -1462 1613 -1783 1975 -2192 2446 -2739 3085 -3504 4020 -4671 5527 -6700 8418 -11165
67a1165K7419m5001J50877l0047k88069K56041K3695j45769P0711M7484r6393
$$ -11165 16254 -28747 122130 92083 -195986 60055 83750 -62019 8692 56176 -40217
78d0217K8053L8165J3721m7335l2505M1998N6105m3380p5660P3952L0769p4821
$$ -40217 -12164 26001 39722 -7613 -40118 1880 57985 14605 -61055 12897 43666 -31155
90c1155M6710M814o4019N4726J9371m9899L5477n2303K6597Q0701j13008n406
$$ -31155 15555 20369 -43650 11076 30447 -19452 16025 -36278 -9681 71020 -41988 -47394
102d7394J03032o4717k9405P0604l8128k2973L2476R101j2549l1651L0593J9278
$$ -47394 55638 -9079 -38484 32120 -6008 -28981 3495 12596 47 -31604 -1011 18267
114A8267k7381j4098K7627Q121l6054J8454K5575m6869J6637M9416q3565L2831
$$ 18267 -9114 -23212 4415 12536 -23518 -5064 20511 -26358 -9721 39695 -43870 -11039
126a1039O8315j07464L5676P3928j03446K0983Q9000r4707q845Q1374l7060k7889
$$ -11039 57276 -50188 -14512 59416 -44030 -23047 65953 -28754 -37599 43775 6715 -21174
138b1174K5344O942j4996R665K556j1771K947L432R392N78k8760P252M5448m0865
$$ -21174 4170 11112 -3884 5781 8337 -3434 -487 2945 12337 12915 -15845 -8593 36855 -4010
152d010r317L6023l7375J9069K6889n0252J1191K8951l0261K2144m340l5020L9502
$$ -4010 -13327 22696 -14679 4390 31279 -18973 -7782 21169 -9092 13052 8712 -26308 13194
165A3194L154k5329Q177N06n978J6278k751k0760O012J3949k163q738J198r994
$$ 13194 16348 -8981 -804 -298 -6276 10002 7251 -13509 -7497 6452 4289 -4449 -3251 -13245
179a3245J9058L491k9040K4402m555k4578M4635j0052n5009N6302J2224n5382
$$ -13245 5813 9304 -19736 4666 111 -24467 20168 10116 -44893 11409 23633 -31749
191c1749L2058J1636l0238J3772J6713j8531m666P733R324j363j7808O811J7630
$$ -31749 309 11945 -18293 -4521 12192 -6339 -11005 -3272 6052 4689 -13119 -6308 11322
204A1322q138k0170K5287K776l0832K7170R425l3177J4212J9063k2567Q354r70
$$ 11322 3184 -16986 8301 11077 -19755 7415 16840 -16337 -2125 16938 -5629 2725 1755
217A755o176K0331j7932n932K2251r831j3529K1083n537j4813J4825K224p906
$$ 1755 -4421 15910 -2022 -7954 14297 4466 -9063 12020 6483 -8330 6495 8719 813
230H13l768P649M90K1q248M03J5672j4808n149J7580q827j5138K6455q100k0730
$$ 813 -2955 4694 5184 5205 -3043 -2640 13032 -1776 -6925 10655 1828 -13310 13145 5045 -15685
245a5685K1928k275q940N210j586m067R673o747m157R321q434L397M013n112n087
$$ -15685 6243 3968 -4972 238 -1348 -5415 4258 -2489 -6646 2675 -5759 -2362 1651 -3461 -8548
260h548R635j083n981N564o429N071M005p761j358J1793r990j737J5480j6565
$$ -8548 1087 4 -5977 -413 -6842 -1771 2234 -5527 -6885 4908 -5082 -6819 8661 -7904
274g904M87J4489o303r962J1725k09o095P067n162K454p95J539J230j040m176
$$ -7904 -7417 7072 769 -9193 2532 2323 -3772 3295 -1867 587 -208 1331 2561 1521 -2655
289b655M594P078j3416N404N038n025o46O116n868j960J0391r085K167J394k752
$$ -2655 1939 9017 -4399 1005 6043 1018 372 6488 620 -1340 9051 -34 2133 3527 775
304G75K133K876o363m95R017r270K733J166k352J7K797k246k968M681m202M105
$$ 775 2908 5784 -579 -1074 7943 -1327 1406 2572 220 237 3034 788 -2180 2501 -1701 2404
320B404k978k495L155J713m146p77N497p749N157J242n729J248L737k015k821
$$ 2404 -574 -3069 86 1799 -2347 -3124 2373 -5376 -219 1023 -4706 -3458 279 -1736 -4557
335d557M567m977M336j395j160J291j357J678m6R96m601M798k26j413M8J275L84
$$ -4557 10 -4967 -631 -2026 -3186 -1895 -3252 -1574 -1620 -624 -5225 -427 -653 -2066 -2018 -743 -359
352c59j942M627n096K923L15j731L470j643k756L674L987q579M717J705k074m67
$$ -359 -2301 2326 -2770 153 468 -1263 2207 564 -2192 1482 5469 -3110 1607 3312 1238 771
368G71O18L616m998R4M940n46p908O979K909p580J695L200J620q800N576M212
$$ 771 1389 5005 7 101 5041 4495 -3413 3566 6475 -1105 590 3790 5410 -3390 2186 6398
384F398p991Q66N686n028o06M096n281M864l742j551O071m090k176R99K698j354
$$ 6398 -1593 -727 4959 -69 -675 3421 -1860 3004 -738 -2289 3782 -308 -2484 -1485 1213 -141
400a41l192R41N007o810J215O192q883L083J850p26Q03m335J469N641m690j342
$$ -141 -3333 -2392 2615 -4195 -2980 3212 -5671 -2588 -738 -1464 -661 -4996 -3527 2114 -2576 -3918
416c918L298l335N413m935R15N071q681M156O665o889l315N233L431l36j0695
$$ -3918 -620 -3955 1458 -3477 -2562 2509 -6172 -2016 4649 -2240 -5555 -322 3109 2773 -7922
431g922Q574P744j6332Q480Q457j2916j601J2156O95j1265j797J4918l752j3862
$$ -7922 652 8396 -7936 544 9001 -3915 -5516 6640 7335 -3930 -5727 9191 5439 -8423
445h423J6645l879j0385J1484l76m367m57j511O840J263j1705N875L146k056j458
$$ -8423 8222 4343 -6042 5442 5066 699 242 -1269 5571 6834 -4871 1004 4150 2094 636
460F36k021Q561j0802r61J7199j3082j1747K0213l201j1745R818l655j239M57
$$ 636 -1385 7176 -3626 -4587 12612 -470 -12217 7996 4795 -6950 2868 -787 -2026 -1569
474a569L690p59r174P584L061p410N107j843q343J5611n544q100R197p198N642
$$ -1569 2121 1362 -7812 -228 2833 -4577 530 -1313 -9656 5955 411 -7689 1508 -5690 -48
489d8K413q394N208M09o648J1322j894j2138P524N904K25j2487O822R597j6831
$$ -48 2365 -6029 -821 -412 -7060 4262 2368 -9770 -2246 3658 3883 -8604 -1782 7815 -9016
504i016R378J0582k0072M090J5087j2465M901k984n624J6138q320n654P322q72
$$ -9016 362 10944 -9128 -5038 10049 -2416 2485 -499 -6123 10015 1695 -3959 3363 2491
518B491m718M431N820q150r474J7834N676k6548J4467Q043j5485Q924K809p195
$$ 2491 -2227 2204 8024 -126 -9600 8234 13910 -12638 1829 9872 -5613 3311 6120 -1075
532a075j251L561N718l960j1698J2302K18n890P675j1324M789N889p614M087n27
$$ -1075 -2326 1235 6953 2993 -8705 3597 3815 -2075 5600 -5724 -935 4954 -2660 1427 900
547I00q242R115K305p624K759n261Q096M05p126M086m126M467L414q078L297K413
$$ 900 -7342 1773 4078 -3546 -787 -6048 2048 2453 -4673 -587 -4713 -246 3168 -4910 -1613 800
563H00r255J3373j722j4847J2441l10q55O71n574M820K471n696N921q35q656Q087
$$ 800 -8455 4918 3196 -11651 790 480 -375 296 -5278 -458 2013 -3683 2238 1403 -7253 834
579H34K775j42r389J281J5455j2895l711J3848q622n856J4698m909o497K011L399
$$ 834 3609 3467 -5922 -4641 10814 -2081 -5792 8056 -566 -6422 8276 3367 -3130 -1119 2280
594B280N507j0732K433N225o027L913J370n837M191j911m79Q949j3321R43J1494
$$ 2280 7787 -2945 -512 4713 -1314 2599 3969 -1868 2323 412 -67 8882 -4439 -3496 7998
609G998p126k177K492l6j795J75M379k874p972J0056J253r289O674l789L56M538
$$ 7998 872 -1305 1187 1151 -644 -469 3910 1036 -6936 3120 4373 -4916 1758 -2031 -1675 2863
625B863m960J094J28l189O082j418o504O904l323N61L841n730Q57K598K9p25j705
$$ 2863 -2097 -1003 -875 -4064 2018 600 -5904 1000 -2323 -1762 2079 -3651 -2794 -196 -167 -892 -2597
642b597J028J708k703M403k397n347Q823l110k065L240k777O98K952k391P08o9
$$ -2597 -1569 139 -2564 1839 -558 -5905 2918 -192 -2257 983 -1794 -1096 1856 -535 173 104
658A04j641N422m604P29K202l426L337M17l400J619J680k172J712r58j19k82L76
$$ 104 -1537 3885 -719 10 2212 -1214 2123 2540 -860 759 2439 267 1979 1021 902 620 996
675I96K855m786J634K816l568Q04K192m117J342K799l249R91j157J405o7j609
$$ 996 3851 -935 699 3515 -53 751 2943 -1174 168 2967 -282 709 -448 957 890 -719
691g19J820p41j626J600J006l662K222J28p42K74j187J692k445J812M25j842L56
$$ -719 1101 360 -1266 334 1340 -2322 -100 28 -714 -440 -1627 65 -2380 -568 -143 -1985 -1629
708a629J319j660N15J445l064K700o51l08k6j0R85r30P55j76K32j520K455n90
$$ -1629 -310 -1970 -1455 -10 -3074 -374 -1025 -1333 -1359 -1369 -384 -1314 -559 -735 -503 -2023 432 -158
726a58j167J563n45R73j913K207r44q1K70Q66o66l08J717j766J767j826R80P01
$$ -158 -1325 238 -307 666 -1247 960 16 -65 205 1071 405 97 1814 48 1815 -11 969 1670
744A670r81Q06n13Q31j416J384p61L39o35L03Q03j890J355o77O52j647J416K10
$$ 1670 689 1495 982 1813 397 1781 1020 1359 724 1027 1830 -60 1295 618 1270 -377 1039 1249
762A249j654J111O6k92k125K866j395o56R42k39R8j513J960j544P87j151J292
$$ 1249 -405 706 772 480 -1645 1221 -174 -830 112 -127 -29 -1542 418 -1126 -339 -1490 -198
779a98p43q11J450j105P03r56J407j315J40R75q74N12o62Q47q37J457j407Q38
$$ -198 -941 -1752 -302 -1407 -704 -1660 -253 -1568 -1428 -453 -1327 -815 -1477 -630 -1467 -10 -1417 -579
797e79P30j382J094j17L86j173J814p90k30O38l60J090j645J884j043M67l78L00
$$ -579 151 -1231 -137 -254 132 -1041 773 -17 -247 391 31 1121 -524 1360 317 784 406 706
815G06N20p01P60r12J135j105Q90o92J033J13k383K609p63j194O56J634k664Q55
$$ 706 1226 525 1285 373 1508 403 1293 601 1634 1747 -636 1973 1210 16 672 2306 -358 497
833D97J252j939P45o98J511j399l11M12K94m73m74R50j168O53p71J358j072n74
$$ 497 1749 -190 555 -143 1368 -31 -342 70 364 -109 -583 367 -801 -148 -919 439 -633 -1207
851a207J289j234J355j398o11J718k86k172L021j105k398L635j449n00N37mM44
$$ -1207 82 -1152 203 -1195 -1806 -88 -374 -2546 475 -630 -3028 607 -842 -1342 -805 -809 -365
868c65j01q93O92M74n50R15r60J237j295L6K643k503j55J606r9J28n64j285L512
$$ -365 -466 -1359 -667 -193 -743 172 -788 449 -846 -810 1833 -670 -825 781 682 810 246 -1039 2473
887B473k405j010N037m467j250M444p65k800J385J033j73j208O66J375m001L263
$$ 2473 68 -942 4095 -372 -1622 2822 2057 -743 642 1675 1502 294 960 2335 -1666 1597
903A597J143l152J223p57O19J288j748j250K121j223J002j421J87J721m135M465
$$ 1597 2740 -412 811 54 673 1961 213 -1037 1084 -139 863 -558 -371 1350 -2785 1680
919A680M98o547L938L439o093K927J211m493M087j92j868J21r7J187n93Q25j192
$$ 1680 2178 -4369 -431 3008 -3085 -158 1053 -3440 647 455 -1413 -1292 -1389 -202 -795 30 -1162
936a162j721L397J175n211L561n26k105N213m435O55J913l262L610J673p411M167
$$ -1162 -2883 514 1689 -3522 39 -487 -2592 2621 -1814 -1159 754 -2508 1102 2775 -4636 -469
952d69L775n174K516p70n66N33R78J729m137J40M518j977j270J900l596M156M36
$$ -469 3306 -1868 648 -122 -688 -155 823 2552 -1585 -1445 3073 1096 -174 1726 -1870 2286 2722
969B722m344M124l124O79L211k790m34p0q19N370l930m323Q261n015p60N549n606
$$ 2722 -1622 2502 -622 57 3268 478 44 -26 -845 4525 595 -3728 4533 -482 -1242 4307 -1299
986a299j435M865m6k941j54R31O51j589L487l775l306Q073m031r77L236n106K153
$$ -1299 -2734 2131 2085 -856 -1010 -79 572 -1017 2470 -1305 -4611 3462 -569 -1546 1690 -3416 -1263
1003a263M373n531J338R45k911N908l833k028L383k031J969M91k778J73J456N60
$$ -1263 3110 -2421 -1083 -138 -3049 2859 -974 -3002 381 -1650 319 810 -1968 -1795 -339 221
1019B21J540m742J930J775j891L961n262L31M546k961M56J687m271K921K948m108
$$ 221 1761 -2981 -1051 724 -1167 2794 -2468 -2137 2409 -552 -96 1591 -2680 241 3189 -919
1035i19J898k723K761K589n433L012L21m043N012J249o442L231J359j250R09j745
$$ -919 979 -1744 1017 3606 -1827 1185 1506 -2537 2475 3724 -2718 513 1872 622 1531 -214
1051b14J307j941K419J232m529J689J825k792L287j070n077O632k030k175L240
$$ -214 1093 -848 1571 2803 -1726 -37 1788 -1004 2283 1213 -3864 2768 738 -1437 1803
1066A803m181J491K343k346M41L31k270M267j706k432K381j496J763q53l56l17
$$ 1803 -2378 -887 1456 -890 -449 -118 -2388 1879 173 -2259 122 -1374 389 -464 -820 -1137
1082a137j041K986k37l420K768J81l006N137l607j972N070k419j23J458k671J532
$$ -1137 -2178 808 571 -2849 -81 100 -2906 2231 -1376 -3348 1722 -697 -820 638 -2033 -501
1098e01J823k510J955j597m77L683k511J07Q4p8O94n4qo35l75K278p59k563L696
$$ -501 1322 -1188 767 -830 -1307 2376 -135 -28 56 -22 672 618 610 -25 -400 1878 1119 -1444 2252
1117B252k604J04L361l716K83K545k301R52J196l351K415K2j473J589j521M36
$$ 2252 -352 -248 3113 -603 -320 2225 -76 876 2072 -1279 1136 1158 -315 1274 -247 189
1133A89O86m86m09J2q8K56L57l85o75m79K268k057L38J626k910J734J005k675
$$ 189 875 389 -20 -8 -96 160 517 132 -543 -1022 1246 -811 -473 1153 -1757 -23 982 -1693
1151a693N77J827k708K066m9j654J676j020J56K49m6m14O98P3l30p5K52K75n43
$$ -1693 -1116 711 -1997 69 20 -1634 42 -978 -822 -573 -619 -1033 -335 -262 -592 -667 -415 -140 -683
1170f83Q42j186R65M04j323J407q2j183J264O55k416K299k36j184J786j218j43
$$ -683 159 -1027 -62 342 -981 426 344 -839 425 1080 -1336 963 727 -457 1329 111 -32
1187c2Q40nq30J238q00n80J229p04K09j12R66j487R97j50r63J012n82J48L21o8
$$ -32 808 803 -27 1211 411 -169 1060 356 565 453 1419 -68 929 779 -184 828 246 394 715 647
1207F47j056J441p36q49J774j771J71O90k59r83J261m29r30J404p75N0k82O56
$$ 647 -409 1032 296 -553 1221 -550 -379 311 52 -931 330 -99 -1029 375 -400 -350 -632 24
1225B4j218P41j63l42J059j111M69J69L7j011J252n68l19J508j688O74K24j12
$$ 24 -1194 -453 -616 -958 101 -1010 -541 -372 -335 -1346 -94 -662 -981 527 -1161 -487 -263 -375
1243c75m70J062p92j22R03p90M69R8K20o71P85j37l49J058j233Q92j58J16k32
$$ -375 -845 217 -575 -697 206 -584 -115 -17 203 -468 317 180 -169 889 -344 548 390 506 274
1262B74N25m02k16J246j504R47P7o83J95M49o32j96J280j489M94K11j56m55M71
$$ 274 799 397 181 1427 -77 870 947 264 459 908 276 80 1360 -129 365 576 420 -35 436
1281D36k2o33R58q96M14JN7p27M10P4l28L42q17J019m17m11Q6K87n12J74L31r16
$$ 436 414 -219 739 -157 257 258 315 -412 -2 72 -256 86 -731 288 -129 -540 -454 -167 -679 -505 -174 -1090
1303a090R34l90k45M98n60L28j89M36k93J22nK66m42J54M71j081J181q24N77J0
$$ -1090 -156 -546 -791 -293 -853 -525 -714 -278 -571 -449 -454 -188 -630 -476 -5 -1086 95 -729 -152 -142
1323a42k90M12O3l04O71m9j074J598q87J04M81q23R15k86M16p24M84q9K01o35
$$ -142 -432 -20 43 -261 410 361 -713 885 -2 102 583 -240 675 389 805 81 565 476 677 42
1343D2Q34M2j748K381o83n44J91J04l70L46j84N9m70j9J443k046K85J182j654
$$ 42 876 918 -830 1551 868 324 515 619 249 595 411 470 0 -19 1424 -622 -337 845 -809
1362h09J477jj474P84P28j233R18r85M5L66m62J098j941P74R68r30P2P25j438
$$ -809 668 667 -807 -23 705 -528 390 -595 -550 -184 -646 452 -1489 -715 253 -677 -605 120 -1318
1381a318R01P63j767J367r51L95J282j560L63Q2k16J118n25j427J928j202J119
$$ -1318 -417 346 -1421 -54 -1005 -610 672 -888 -525 -443 -659 459 -66 -1493 435 -767 352
1398C52M26j827J574q23M9J491j983m9K246j475K9J153k228K017j93l18J53j240
$$ 352 778 -1049 525 -298 -249 1242 -741 -790 1456 -19 10 1163 -1065 952 759 441 594 -646
1416f46J631J01j330R99m62q93K781k085p63J651j455J667l98j048M50J5N30M57
$$ -646 985 1086 -244 755 293 -600 2181 96 -667 984 -471 1196 798 -250 200 215 745 1202
1434A202k504J493R85k581L512j964j796K688r50o06P49j451P78J083j328R92
$$ 1202 -1302 191 1176 -1405 2107 143 -1653 1035 85 -521 228 -1223 -445 638 -690 302
1450C02k167J220J678k822J688n25j002K440r18j722J881j056R08R86l130K129
$$ 302 -1865 -645 1033 -1789 -101 -626 -1628 812 -106 -1828 53 -1003 -95 891 -2239 -110
1466a10K6p34J775k137Q1J705o22J25j36j217J863p24L65Q60l004K618N10j956
$$ -110 -84 -818 957 -1180 -1099 606 -16 109 -27 -1244 619 -105 260 1120 -1884 734 1244 -712
1484g12J607q12q69K614j035j334J360j197J972j037r45J220j440J590Q97k648
$$ -712 895 83 -786 1828 793 -541 819 -378 1594 557 -388 832 -608 982 1879 -769
1500g69O41J188j559K057j331j150J835r73J100q93j347K193o33r17J382j879
$$ -769 -128 1060 -499 1558 227 -923 912 -61 1039 146 -1201 992 359 -558 824 -1055
1516a055Q2K640k555P20k59q03J939j008k02L38r63J041R59k498J385k0o45K001
$$ -1055 -973 1667 -888 -168 -427 -1230 709 -299 -501 -163 -1126 -85 874 -1624 -239 -259 -904 1097
1534A097k266K58J012o16J176r15j311J899o13j31J271k507J415J197j860J154
$$ 1097 -1169 -911 101 -515 661 -254 -1565 334 -279 -410 861 -1646 -231 966 -894 260
1550B60o93K58Q63p41j18L68r99K061o77j234J690j254N25J097j262K70k5k92
$$ 260 -433 -175 688 -53 -171 197 -802 1259 582 -652 1038 -216 309 1406 144 414 389 97
1568I7R97p78q65J484j170J209j75k048K125k66p42R50r25k19J513j227K44n4
$$ 97 1094 316 -549 935 -235 974 799 -1249 876 610 -132 818 -107 -326 1187 -40 204 150
1586A50o52J274j038J94K17q70Q39K84j270P93m18j0R90j342M54J07n68J196o95
$$ 150 -502 772 -266 -72 145 -725 114 398 -872 -79 -497 -507 483 -859 -405 -298 -866 330 -365
1605c65n93Q83j06o34J223j137J80Q16r92Q45o93M23J39j38J09k03l85P12J5n30
$$ -365 -958 -75 -181 -815 408 -729 -549 267 -725 120 -573 -150 -11 -149 -40 -243 -628 84 99 -431
1625d31N19k82M30Q0l09N11o83K88O59o61k68R16p90K89M12n57J35J29L1j81K21
$$ -431 88 -194 236 316 7 518 -165 123 782 121 -147 769 -21 268 680 123 258 387 418 237 458
1646D58k1k27J93L3q8n56J197j225M30P5n19M45J02r9l09J69k22M91o80K56K42
$$ 458 437 210 403 436 348 -208 989 -236 194 269 -250 195 297 198 -111 58 -164 327 -353 -97 145
1667A45p96N88l12J74k69K76k08K47j35k15M87m63K87l63M10j39j55J97j45K79
$$ 145 -651 -63 -375 -201 -470 -194 -402 -155 -290 -505 -18 -481 -194 -557 -147 -286 -441 -244 -389 -110
1687a10k50N01o06K38j9k3Q7k55L68Q8J44l55L36l73K85L84o18L50m2K83n19L96
$$ -110 -360 141 -465 -227 -246 -269 -182 -437 -69 19 163 -192 144 -229 56 440 -178 172 130 413 -106 290
1709B90J13q5j24p3M12o79R43q28K16J06J13J53p9j69J40J84k95l7l22M33n0m81
$$ 290 403 318 194 121 533 -146 797 -31 185 291 404 557 478 309 449 633 338 301 -21 412 362 -119
1731a19N61m88L38k00J48m60Q6J47n29M17q1J91m93L52j85KJ92l35L68j8j3k97
$$ -119 442 -46 292 92 240 -220 -134 13 -516 -99 -180 11 -482 -130 -315 -313 -121 -456 -88 -106 -119 -416
1753d16J64L7j47K67k27J43m33O47m00O1j24m4L18k51K94k85L51j63L73j29L5
$$ -416 -252 -215 -362 -95 -322 -179 -612 35 -365 -304 -428 -472 -154 -405 -111 -396 -45 -208 165 36 71
1774G1j40j68N41n33M77m50K52J84k6j45l1M70n04M43l23N4L77j93j61k94K90
$$ 71 -69 -237 304 -229 248 -202 50 234 208 63 32 502 -2 441 118 172 549 356 195 -99 191
1795A91J93O1j89Mk70J16N05q14N19M9n14M67q4k67L22j14m2j73l23M26n07J79
$$ 191 384 445 256 260 -10 106 611 -203 316 365 -149 318 234 -33 289 175 133 -40 -363 63 -444 -265
1817b65O63r22K66K14m59K34L84p96N02M6j53p6j73K53j29N6J30j16k09N17k81
$$ -265 398 -524 -258 -44 -503 -269 115 -681 -179 -133 -286 -362 -535 -282 -411 -355 -225 -341 -550 -33 -314
1838c14j52L32l41O35k90l68Q38p52K17Q63q40L10K23n38N40k13l13N92o34N88
$$ -314 -466 -134 -475 160 -130 -498 340 -412 -195 668 -172 138 361 -177 363 150 -163 429 -205 383
1858C83m03j9J91j14j63N77r12P85J077j591N21J42l09J112q27j27M95j108R77
$$ 383 -20 -39 152 38 -125 452 -460 325 1402 -189 332 474 165 1277 450 323 818 -290 687
1877F87k13j080O76Kn37J223j352J8M40J18M15m53k65L51l12J94L40j374J218
$$ 687 474 -606 70 72 -465 758 -594 -576 -136 -18 397 -56 -321 30 -282 -88 252 -1122 96
1896I6K73r36Q13r63K32O33l74k56L05o88J300m13j047J211r09J118L3j149L92
$$ 96 369 -567 246 -717 -485 148 -226 -482 -177 -865 435 22 -1025 186 -723 395 428 -721 -329
1915c29N11n45R49j026l77J380r57P29J92j218Q78K91p29O32n69j46J194q74L94
$$ -329 182 -363 586 -440 -817 563 -394 335 527 -691 187 478 -251 381 -188 -334 860 -14 380
1934C80o62j14J616j154J90J31q20Q75M32j116N32K05p28J333j405L26L73m05
$$ 380 -282 -396 1220 66 256 387 -433 442 874 -242 290 495 -233 1100 -305 21 394 -11
1952a1Q65j003j14M34M2l47O97j396R24P2m32M90j045L33J376j463O93L98j453
$$ -11 854 -149 -263 171 213 -134 563 -833 91 163 -269 221 -824 -491 885 -578 115 513 -940
1971i40J494L5j598J188j303J142O53j430K34qK88N05p74j16P95q00Q54m21p41
$$ -940 554 589 -1009 179 -1124 18 671 -759 -525 -533 -245 260 -514 -630 165 -635 219 -202 -943
1990i43J198l53J05M64j352O54P59q22O10k86p18J613j031L8K82o64O38J68j18
$$ -943 255 -98 7 471 -881 -227 532 -290 320 34 -684 929 -102 -64 218 -446 192 360 242
2009B42k00m9k36J011q87K53K84o27J058q68j30N48l62K96N0r90P70K72n63R31
$$ 242 42 -7 -243 768 -119 134 418 -209 849 -19 -149 399 37 333 383 -607 163 435 -128 803
2029H03j869P23J053j200Q20k96o20O20J02m16M16n69M80K34o55N49m24Q2N45
$$ 803 -1066 -343 710 -490 330 34 -586 34 136 -280 136 -433 47 281 -374 175 -249 -167 378
2048C78q97M36l42L0O77p1j859J382k34P67Kj445J149l16m40O40M37j279J290
$$ 378 -519 -83 -425 -395 282 211 -1648 -266 -500 267 269 -1176 -27 -343 -783 -143 294 -985 305
2067C05j8k87r0r41Q74N21m26L8Q1Q3L69k47k13J64m64J155p69k68N04l43K92
$$ 305 287 0 -90 -1031 -157 364 -62 -24 57 140 509 262 49 213 -251 904 135 -133 371 28 320
2088C20J60n93L86J69n75Q98j99p15O37l49L72n16ok8K4K39K12n41J65J25m96
$$ 320 480 -113 273 442 -133 765 566 -149 488 139 511 -5 -11 -39 -15 224 436 -105 60 185 -311
2109c11P66n24m6J74j30k40J61J28j52J01l30M29p9k0J00k81l2J17P7k37L13j37
$$ -311 455 -69 -115 59 -71 -311 -150 -22 -174 -73 -403 26 -53 -73 27 -254 -286 -169 -92 -329 -16 -153
2131a53mL11l71j77j07O12l65J05L53k93j8J21q6J43O9k24J32j62l2K02l34N59
$$ -153 -157 154 -217 -394 -501 111 -254 -149 204 -89 -107 14 -72 71 140 -84 48 -114 -146 56 -278 281
2153B81j48k30J17o76N12L74J53n97K86M30q8n81M27l79L59o1j03L88k38l97l74
$$ 281 133 -97 20 -656 -144 230 383 -214 72 502 414 -167 260 -119 240 179 76 464 226 -171 -545
2174e45N94m25M19J30m41J49J81J5j51M51n76J43L81m79K61l14J96l09L90l36
$$ -545 49 -376 43 173 -268 -119 62 77 -74 377 -199 -56 325 -154 107 -207 -11 -320 70 -266
2194b66o0M55l43K12l9o4j89L26k49k64M01k71k2J84pnRj4J63K96k99Rq2j49J63
$$ -266 -326 129 -214 -2 -41 -105 -294 32 -217 -481 -80 -351 -373 -189 -196 -201 -192 -206 -43 253 -46 -37 -119 -268 -105
2219a05K5J70j01J33k00K81k61J83l7j66L87k11K35l32K83o4K5K0j57K47j10J17
$$ -105 -80 90 -11 122 -78 203 -58 125 88 -78 309 98 333 1 284 220 245 265 108 355 245 362
2241C62m45M07k92Q9L30l47p1J25J48k23J33j47j59j02L70J37m22M98o15M13j71
$$ 362 -83 324 32 121 451 104 33 158 306 83 216 69 -90 -192 178 315 -107 391 -224 189 18
2262A8q1J69k92Rj42L60p3j4j65R9j5n91M08K83n21R59p07m4J90j57O1j42K52
$$ 18 -63 106 -186 -177 -319 41 -32 -46 -211 -112 -127 -718 -310 -27 -548 411 -296 -340 -150 -307 -246 -388 -136
2285a36R5l72J63K0q5L28J52j68K95l87J54J33m98K57K97k55K13j22j42O6L0j77
$$ -136 -41 -413 -250 -230 -315 13 165 -3 292 -95 59 192 -306 -49 248 -7 206 84 -58 8 38 -139
2307a39M04l77L63K09m39M68n25j2K85p1L6L0l37O10k82l20M24l73K34K51n30
$$ -139 265 -112 251 460 21 489 -36 -48 237 166 202 232 -105 505 223 -97 327 -46 188 439 -91
2328i1K02J76j49J13m12j62P23o86K42Qk18L97K8l03L33n27J31K98l47K27k47
$$ -91 111 287 138 251 -161 -323 400 -286 -44 -36 -254 143 171 -132 201 -326 -195 103 -244 -17 -264
2349b64l42Q40n52K1K39k20M37j77l52J38k9j2O04o61J61J16j12M32k70k48M52
$$ -264 -606 234 -318 -297 -58 -278 159 -18 -370 -232 -261 -273 331 -330 -169 -53 -165 267 -3 -251 201
2370B01l34j41N38n67K96L73m33O28o88J95K12r1L1M5n58N74J99n52O05o21K18
$$ 201 -133 -274 264 -303 -7 366 -67 561 -127 68 280 189 220 265 -293 281 480 -72 533 -88 130
2391A30L83p96Q13n61L7M89n73q5M44o6O0Q6q32O51l26P2L12m07K63L5k69L07
$$ 130 513 -283 530 -31 6 495 -78 -163 281 215 275 361 -471 180 -146 -74 238 -169 94 129 -140 167
2413A67l99m27R80n4m40j89l8P87q05k8N57j084P37P43p61j12O16r35J023o92
$$ 167 -232 -659 321 267 -173 -362 -400 387 -418 -446 111 -973 -236 507 -254 -366 250 -685 338 -354
2433c54l6K94L7K14K73r25K30O61p78Q69j095l03J273l98j73M86o27J5L25K9j60
$$ -354 -390 -96 -59 155 428 -497 -267 394 -384 485 -610 -913 360 -38 -211 275 -352 -337 -12 17 -143
2454a43k97N29O43j078J129k29q55L93j90m1k22j18M67M77m61j7p25O82k00p56
$$ -143 -440 89 732 -346 783 554 -301 92 -98 -139 -361 -479 -12 465 4 -13 -738 -56 -256 -1012
2474a012J059O16q28L16M95j364J000R2m11J06l29N16k07m30N18o08M40J27o4
$$ -1012 47 663 -165 151 646 -718 282 374 -37 69 -260 256 49 -381 137 -471 -31 96 32
2493C2k58N33p36O09k75k80M56n40M47l0l46J12O5k30M78k95n1K68r11P77N0j44
$$ 32 -226 307 -429 180 -95 -375 81 -459 -12 -42 -388 -276 -211 -441 37 -258 -309 -41 -952 -175 -125 -269
2515b69L22k27m3L8k49N81J33n52K96K54o08O26J93M64j075R1lK98l28K06J94
$$ -269 53 -174 -217 -179 -428 153 286 -266 30 284 -324 302 495 959 -116 -25 -28 270 -58 148 342
2536C42l20N40q12N21k3l46M15k53k56M54k7l30K34r2kK81m10K97k69l42N53k39
$$ 342 22 562 -250 271 248 -98 317 64 -192 262 235 -95 139 47 45 326 -84 213 -56 -398 155 -84
2558h4M81n61K00j9J46k59M3m3J43n1m20N21k63J08J92m5l53R4k85M16j92k5L21
$$ -84 397 -164 36 17 163 -96 -53 -96 47 -4 -424 97 -166 -58 134 89 -264 -170 -455 -39 -231 -256 65
2581F5Q3j12r1l4q2J31N7j94J8J31Q5k39L0P5o1K64m4k13J77m5J2L39k23j17j46
$$ 65 148 36 -55 -89 -171 -40 17 -177 -159 -28 57 -182 -152 -77 -138 126 82 -131 46 1 13 352 129 12 -134
2606a34J40L30k04j1q1J44q4Q6j75J70j3k49K70l11L78J7j4k20q7K58n1Jj42J22
$$ -134 6 336 132 121 40 184 100 186 11 181 168 -81 189 -122 256 273 259 39 -48 210 159 160 18 140
2630A40k05L06r0Q9j89Ll1k65K51N8K0l23L40j85k6K23j73Mj33J09Lk86K47J54
$$ 140 -65 241 151 240 51 54 23 -242 9 67 87 -236 104 -81 -107 116 -57 -53 -186 -77 -74 -360 -113 41
2654D1m3l58K45o7J54M1j55L4J3K08l72J90k19P5J21L3m3q1K25m3K35k52j95K67
$$ 41 -2 -360 -115 -182 -28 13 -142 -108 -95 113 -259 -69 -288 -213 -92 -59 -102 -183 42 -1 234 -18 -213 54
2678E4q7J47Op8J04N8j10j82L43j74J09qj2K25k77J04L3j67j71P6L6J11J32j17
$$ 54 -33 114 120 42 146 204 94 -88 255 81 190 182 170 395 118 222 255 88 -83 -7 29 140 272 155
2702A55q8q0J52k39K82j53P3j64J00o8r8N9OJ31k53RK7k89J78J67j15J64Q2k97
$$ 155 67 -13 139 -100 182 29 102 -62 38 -30 -128 -69 -63 68 -185 -176 -149 -438 -260 -93 -208 -44 38 -259
2726b59J53j25M48l37j69J91r3m4M3J45o3J58k47L26k48n8L7l3K43O8n4k12J92
$$ -259 -106 -231 217 -120 -289 -98 -191 -235 -192 -47 -110 48 -199 127 -121 -179 -142 -175 68 136 82 -130 62
2749F2N6R6k20P7j19J0K17k16m1L42j44q6O6J19N7j71N7K02p5l14J63j52n1J58
$$ 62 118 214 -6 71 -48 -38 179 -37 -78 264 120 34 100 219 276 105 162 364 289 -25 138 -14 -65 93
2773I3m41N16p3k41J7J02j83M61l57p4J07J3R2M22o39j60N89m11N98n17k21L60
$$ 93 -348 168 95 -146 -129 -27 -210 251 -106 -180 -73 -60 32 454 -185 -345 244 -167 431 -86 -307 53
2795E3m01M31J16o12M53k12J15l4j11K43k9j07j39k4p4M09k50L13j94p6J20P3
$$ 53 -348 83 199 -413 40 -172 -57 -91 -202 41 12 -95 -234 -258 -332 77 -173 140 -54 -130 -10 63
2817F3k67N11o17K62M39m08PK33r7r8l4m8K00K26k55J11o13O19r2m8L6l45K87
$$ 63 -204 307 -310 -48 391 -17 -10 223 126 28 -6 -54 146 372 117 228 -385 234 142 94 130 -215 72
2840G2L86m33n85Q51n30K38J33l11J34J18Q4J7l84J43K63k21N3j20j51O05m93
$$ 72 458 25 -560 291 -239 -1 132 -179 -45 73 157 174 -210 -67 196 -25 28 -92 -243 362 -131
2861a31L2J85k44J75j66J07K28l11J52qk10L28j51l97O97m82J35J8K1L55n45j99
$$ -131 -99 86 -158 17 -149 -42 186 -125 27 19 -191 137 -14 -411 286 -196 -61 -43 -22 333 -212 -411
2883d11L20K58r8J15o41N16o3M1Q9k01N1J64m00L69J83p03N07l0j47L98k80J00
$$ -411 -91 167 69 184 -457 59 -4 37 126 -75 -24 140 -260 109 292 -411 96 66 -81 317 37 137
2905A37J71k42O9L32o88K26R3j84K17r0M4K31n02K74k39M76q0k79m5M9o3L28j44
$$ 137 308 66 135 467 -221 5 98 -86 131 41 85 316 -186 88 -151 325 245 -34 -79 -30 -93 235 91
2928I1l29M11j4J06j74m22M60k62O9J18m46J24M78o69M26M7k71N61m11P9j48J36
$$ 91 -238 173 159 265 91 -331 129 -133 -64 54 -392 -268 210 -459 -33 14 -257 304 -107 -28 -176 -40
2950d0P5M9l37N4J74j57L38n79J07L59k37K38j32K4j0K05l97O31n31l8O03l77
$$ -40 35 84 -253 -199 -25 -182 156 -423 -316 43 -194 44 -88 -64 -74 131 -266 365 -166 -204 399 22
2972B2J15k38j70L95m7j80QO5J97j37k59L10j45Q7L90k39j18K34o6J8n1k79L75
$$ 22 137 -101 -271 124 77 -103 -95 -30 167 30 -229 81 -64 23 413 174 56 290 224 242 191 -88 287
2995B87o0j30j1k31K15J34l65K4K98l85M83k20j55K77l50N16l52O2J69k28J64
$$ 287 227 97 86 -145 70 204 -161 -137 161 -224 259 39 -116 161 -189 327 -25 37 206 -22 142
3016A42j07l29N5L09l15M65l48L8K29l69K80j52j73L04K0j88J71j16K05j88j05
$$ 142 35 -294 -239 70 -245 220 -128 -90 139 -230 50 -102 -275 29 49 -139 32 -84 121 -67 -172
3037a72J45l39L09l3j2j20L29p5j70N07m44J73Po9J38k57K18j29j23J61J9O5n7
$$ -172 -27 -366 -57 -90 -102 -222 107 32 -138 369 -75 98 105 36 174 -83 135 6 -117 44 63 128 71
3060G1j74J47K91k11l2K1Q4l9N0l08L81j69j25K25l12K26j0j39rPr4L3m8J68J63
$$ 71 -103 44 335 124 92 113 197 158 208 -100 281 112 -13 212 -100 126 116 -23 -32 -25 -119 -86 -134 34 197
3085A97k39j50N4p1P5j13K37P2j8l11L49l17r8K64j48J86k78K01k92M77m7r7J54
$$ 197 -42 -192 -138 -209 -134 -247 -10 62 44 -267 82 -235 -333 -69 -217 -31 -309 -108 -400 77 30 -67 87
3108H7j00j49K59R4j72J68k34N2j85K02R0k44K11l72M15m6j16k02J98L22l36K38
$$ 87 -13 -162 97 191 19 187 -47 5 -180 22 112 -132 79 -293 122 76 -40 -242 -44 278 -58 180
3130A80l42K13J59m23N08k47q1K09j91p2J93N3m5j4j80J77K66k40k60K52n3J21
$$ 180 -162 51 210 -213 295 48 -33 176 -15 -87 106 159 114 100 -80 97 363 123 -137 115 62 183
3152A83k09M5Q4q6KL9j28J20O9k13J34j49r9K65j19J13k17J28O1q8K38k84J33
$$ 183 -26 19 103 17 19 58 -70 50 119 -94 40 -109 -208 57 -62 51 -166 -38 23 -65 173 -111 22
3175B2o4jl1J58k62O2R5k0q6R9n9Q1j04J12J68k72n0j5L16J11j36j37p8O2kJ74
$$ 22 -42 -43 -74 84 -178 -116 -21 -41 -127 -28 -87 -6 -110 2 170 -102 -152 -167 149 260 124 -13 -91 -29 -31 143
3201A43ok82J07P0j7O5O9qj24M29k08j88l7R8K7rq3j27O3j9J08j06j9nN0P2J65
$$ 143 137 -145 -38 32 15 80 149 141 17 446 238 50 13 111 138 129 46 -81 -18 -37 71 -35 -54 -59 -9 63 228
3228B28J17k54o4j30M1j42J76J31k77J69pq8k9j15R3Oj22L63m0k86J76M8q6J48
$$ 228 345 91 27 -103 -62 -204 -28 103 -174 -5 -12 -100 -129 -244 -151 -145 -267 96 56 -230 -54 -6 -92 56
3252E6j44q9J70j25J38j14K8J84o7k06K01J0j13K15k82J20J1J39j15K04l65J68
$$ 56 -88 -177 -7 -132 6 -108 -80 104 37 -169 32 42 -71 144 -138 -18 -7 132 17 221 -144 24
3274B4J44j73O8l19M42k46M4m7k31K41N7L7K74j65j07Nk42L46r2J13k8L9j64N9
$$ 24 168 -5 63 -256 186 -60 -16 -63 -294 -53 4 41 315 150 43 48 -194 152 60 173 145 184 20 79
3298G9J14l45K91j48K36p7k51J43j79K08j51r4P4K59k40R7j12r8M46n51K24L18
$$ 79 193 -152 139 -9 227 150 -101 42 -137 71 -80 -174 -100 159 -81 16 -96 -194 252 -299 -75 243
3320B43l14J50j66K25l9r2P8L1k11J32J47k70M6P3p5J5r5R7K9l5J71n3k84K23
$$ 243 -71 79 -87 138 99 7 85 116 -95 37 184 -86 -40 33 -42 -27 -122 -25 4 -31 140 87 -197 26
3344B6K3k35J93M0O5r4j87R7J60r8Q4j75J36j36J0M43l68j18J44O7J32K02l40
$$ 26 49 -186 7 47 112 18 -169 -72 88 -10 74 -101 35 -101 -91 352 -16 -134 10 77 209 411 71
3367G1j23nk9K92m27L60j92Q8J63J0l01J09J43l62L75k46k2K44k60L70k97k24
$$ 71 -52 -57 -86 206 -221 139 -53 35 198 208 -93 16 159 -203 172 -74 -96 148 -112 258 -39 -263
3389b63N13r4l4k21J17j09M5q3R3k6JJ58k51k14m2J95J35K57m24J74l2J11J69
$$ -263 250 156 122 -99 18 -91 -46 -129 -36 -62 -61 97 -154 -368 -410 -215 -80 177 -247 -73 -105 6 175
3412A75l03J73L7j13Q8k6m7K46k72N0O5k53K00M9J70j47j05K01r3M0j49J6J70
$$ 175 -128 45 82 -31 57 31 -16 230 -42 8 73 -180 20 69 239 92 -13 188 95 135 -14 2 172
3435A72N6n9k72K95l26K99O9j85J08j43K1O3Qk49L89j76j64J2k97N32R9n6q0n
$$ 172 228 169 -103 192 -134 165 234 49 157 14 35 98 106 -143 246 70 -94 -82 -379 153 252 196 116 111
3459A11L5j77j9J4M0k02M17l01J70k31J31kJ67j88N7j34m6M07n82J99p9P5L18
$$ 111 146 -31 -50 -36 4 -198 219 -82 88 -143 -12 -14 153 -35 22 -112 -158 249 -333 -134 -213 -138 180
3482A80k33j42Q7R7l0O7m7m3J59k70L45k81RL07n9k91L4K14J39r8m9p8J30P8k33
$$ 180 -53 -195 -108 -11 -41 26 -21 -64 95 -175 170 -111 -102 205 146 -145 -111 103 242 144 95 17 147 225 -8
3507hJ03J84k9j17j1j62Q6j42P6o7l8M0J63r6Lo5n9O2J97k90J43J64l34L34k77
$$ -8 95 279 250 133 122 -40 46 -96 -20 -87 -125 -85 78 -18 -15 -80 -139 -77 120 -170 -27 137 -197 137 -140
3532a40N1J30k7O2j81J5O8K74j69q2k36L35k06j07J51L16k85n3p4K51n2K9K6k11
$$ -140 -89 41 14 76 -105 -90 -22 252 83 1 -235 100 -106 -213 -62 254 -31 -84 -158 93 41 70 96 -115
3556a15J77L7j32L3M1j13j98K23k9n5L36k9j86j16K47j03M1L00m14k8o2J52J1
$$ -115 62 99 -33 0 41 -72 -270 -47 -76 -131 205 176 -10 -126 121 18 59 359 -55 -83 -145 7 18
3579A8J89J22l95J64P2j03K17j60Q6l7k83j4L29j89l24M08j44K02k04j95L19k94
$$ 18 207 329 -66 98 170 67 284 124 210 173 -110 -124 205 16 -308 100 -44 158 -46 -241 78 -216
3601b16J95n6PJ15L1l04K40j58J32Pl5J77n0q4o6J19k25K63m4lk94M43j49O4j45
$$ -216 -21 -77 -70 45 76 -228 12 -146 -14 -7 -42 135 85 1 -65 54 -171 92 48 45 -249 194 45 109 -36
3626c6K27l25j13R2K7P7j97M38k15K7j42L69l23o4M31q6l74R9L33j05j61K07k13
$$ -36 191 -134 -247 -155 -128 -51 -248 190 -25 2 -140 229 -94 -158 273 187 -187 -88 245 140 -21 186 -27
3649b7l6N3J41j99pK75n8o7r7j23M02j70P6j56j14J55Q4j17k7j68K26k01N8J21
$$ -27 -63 -10 131 -68 -75 200 142 75 -22 -145 257 87 163 7 -107 48 132 15 -12 -180 46 -155 -97 24
3673B4k49L97N0l20J11J64j52j86J78p3K26j65Kk03k3L10j69K26l04j38L57j07
$$ 24 -225 172 222 -98 13 177 25 -161 17 -56 170 5 7 -196 -219 91 -78 148 -156 -294 63 -44
3695d4L2k83K50J96k45kJ29k77K82R7k56J8nJ52rj73N6J0k41M66k54l4O1J96p4
$$ -44 -12 -295 -45 151 -94 -96 33 -244 38 135 -121 -103 -108 44 35 -138 -82 -72 -313 153 -101 -135 -74 122 48
3720D8K33k79O7N7k44K54m09K09N2k6K72q4l01M75k41R9k03J31M7L5l76K49k2
$$ 48 281 2 69 126 -118 136 -273 -64 -12 -38 234 150 -151 324 83 182 -21 110 157 192 -184 65 43
3743D3K0J8L5J2l2l58J31R8k68M94j70R2n4k98M32k07n9J22l6J22r3R0k70j4n2
$$ 43 63 81 116 128 96 -262 -131 -33 -301 193 23 115 61 -237 195 -12 -71 51 15 137 44 134 -136 -150 -202
3768b02K92%j40p5K33J58j71j46p0o9M05k06kJ06k66J33L24k23j53%K39j98J36
$$ -202 90 90 -50 -125 108 266 95 -51 -121 -190 215 9 7 113 -153 -20 304 81 -72 -72 167 -31 105
3791A05r2r7J00k46K64k71K8K29Q7P9j80r0m4J56r6J08p1J68J24k47K63l46J32
$$ 105 13 -84 16 -230 34 -237 -209 20 107 186 6 -84 -128 28 -68 40 -31 137 261 14 277 -69 63
3814F3R0M7k16J70Kk71l3J38J92l39LK43j71O3J9k12K73j20r4K82m50L11j73L92
$$ 63 153 200 -16 154 156 -115 -148 -10 182 -157 -154 89 -82 -19 0 -212 61 -59 -153 129 -321 -10 -183 209
3838B09J10l92r5M89r19R32l12q9j93N86j0r79O35k92L50l58P74m34k45J60k67
$$ 209 319 -73 -168 321 -598 334 22 -67 -260 326 316 -663 -28 -320 30 -328 446 12 -233 -73 -340
3859c40L97M7j12k88N43k28k12K33K11k79j85K86K09l80M4J59k03K25k9k17M10
$$ -340 57 104 -8 -296 247 19 -193 40 251 -28 -213 73 282 -98 -54 105 -98 127 98 -119 291
3880B91j47m6P6l05M35m09K9L3J0L05l09N3M26j47l27J30k28J68o4j65J68M7k4
$$ 291 144 98 174 -131 304 -105 -76 -43 -33 272 -37 16 442 295 -32 98 -130 38 -26 -191 -23 24 0
3903@J7j3K4op9j07R4K77j35ll04Q3P3Q3J47r5R1m79J48K46j22j26J59mN3j76
$$ 0 17 4 28 22 -57 -164 -70 207 72 69 -235 -152 -79 4 151 56 147 -332 -184 62 -60 -186 -27 -31 22 -154
3929a54l0L91k60J41j53j65P8j3Q5K78k77J5l5k3R8P9j35p2K2J14J27L2k9J16
$$ -154 -184 207 -53 88 -65 -230 -152 -165 -80 198 -79 -64 -99 -122 -24 55 -80 -152 -130 -16 111 143 114 230
3953B30j12l29K57j59J63K94j69p3j48N6P3J03j01k5j44p6M3L77k80J24j89J58
$$ 230 118 -211 46 -113 50 344 175 102 -46 10 83 186 85 60 -84 -160 -117 260 -20 104 -85 73
3975G3j03n2J28m53L74q7J80j37J61l03K01K2j26R0K32j60q3J73j81j52J95K15
$$ 73 -30 -82 46 -407 -33 -120 60 -77 84 -219 -18 4 -122 -32 200 40 -43 130 -51 -203 -8 207
3997B07j85j5K3l03M57j49j19oO4j12N0L8L3k96L19j9k79N68k18J0j97J35P3K0
$$ 207 22 7 30 -273 184 35 -84 -90 -26 -138 -88 -50 -17 -313 6 -13 -292 276 58 68 -129 6 79 99
4021I9q8K39q3m77J66K79J02k25j43J52L3j6N4j08k26Q1J75r0RK37m8r7R8j34
$$ 99 11 250 167 -310 -144 135 237 12 -131 21 54 38 92 -16 -242 -161 14 -76 -67 170 122 25 123 -11
4045a1j26K47p0N2j49O2okr0j0K94l50K88k63J3K85k13K13o9Kk92J82K11k12p
$$ -11 -137 110 40 92 -57 5 -1 -3 -93 -103 191 -159 129 -134 -121 164 -49 164 95 97 -195 -13 198 -14 -21
4070b1m71L84K22j97k32L49J42k84J61K3o3j51K17l94L30j7L03m81J03J89k01
$$ -21 -492 -108 114 -83 -315 34 176 -108 53 76 13 -138 79 -315 15 -2 301 -180 -77 112 -89
4091h9N3J54k4n5l8lN1j77K76j92J54LP7n0j67QJ81J04k25L8q1J18o2M3jl1Kn9
$$ -89 -36 118 94 39 1 -2 49 -128 148 -44 110 113 190 140 -27 -19 162 266 41 79 -2 116 54 97 96 65 67 8
4119Hk6Rk16R4L6J83oO9l0K3k17J66k1l87L37j61R7J26j95J64o7J49n34L33j13
$$ 8 -18 -9 -225 -131 -95 88 82 151 121 144 -73 93 72 -315 22 -139 -42 84 -111 53 -14 135 -399 -66 -179
4144a79k02P80n99J28j50M11k80K80m7k69j05NM1j67M55k69L43j66j62L47j73
$$ -179 -381 399 -200 -72 -222 189 -91 189 142 -127 -232 -227 -186 -353 102 -167 176 10 -152 195 22
4165B2J4k45j76M09j2N2P2J1k10N9l3J42J23k27N7lQ7j99n0L6L54j49L7q1k8k22
$$ 22 36 -209 -385 24 12 64 136 147 -63 -4 -37 105 228 1 58 55 142 -57 -107 -71 283 134 171 90 62 -160
4191a60K63L1j71N0K30l24Ok04J63J35j21RJ27J03k89J56N7nJ9O2k43J95m87M05
$$ -160 103 134 -37 13 243 -81 -75 -279 -116 19 -102 -93 34 137 -152 4 61 56 75 137 -106 89 -398 7
4215GM9j38J28k21J00m5k00J53Q3J50j32J85l49L60l33K21j38R1O5L1k3J04j06
$$ 7 56 -82 46 -175 -75 -120 -320 -167 -84 66 -66 119 -230 130 -203 18 -120 -29 36 67 44 148 42
4238D2o1j2l8r9K30j47J21j26l5J44rK7M7m5K6R9k76J75j08K50j88j62L65j97
$$ 42 -19 -31 -69 -168 62 -85 36 -90 -125 19 10 37 84 39 65 164 -112 63 -45 205 17 -145 220 23
4262B3o7J91L6q2m8J06m4L4n2R4%j52K28l71K89j27k2P1L%r9n9P6Q8k25J34m9
$$ 23 -44 147 183 101 53 159 115 149 97 191 191 39 267 -104 185 58 36 107 110 110 11 -48 28 116 -109 25 -24
4289b4q7J26lK6Ql62J88Q0j00K10O7k30J7J78k94J37j15K64j68J06m9j90N8K18
$$ -24 -111 15 12 38 46 -316 -128 -48 -148 62 129 -101 -84 94 -200 -63 -178 86 -82 24 -25 -215 -157 61
4313F1q2k04r3L86j38J51K0l07K5K7M06m46R6q6K36J15j83J09KJ27p0j00k2j47
$$ 61 -21 -225 -318 68 -70 81 101 -206 -181 -154 252 -194 -98 -184 52 167 -16 93 95 222 152 52 30 -117
4337a17K72j28j90K51k53J69m7K73Pl34N6M4m5K91k96l2J49Lk16J88j34J90r0
$$ -117 155 27 -163 88 -165 4 -43 230 237 -97 -41 3 -42 249 -47 -79 70 73 -143 45 -89 101 11
4360A1k07L01o5J58k97J91k57L71j26r3l16J6K25j16N6K03K5O8m4k09J94k00K62
$$ 11 -196 105 40 198 -99 92 -165 206 80 -13 -329 -313 -88 -204 -148 55 80 148 104 -105 89 -111 151
4383A51k32o3L4P0j35O4j9J10Q3K0p9J60k70K29q2j35mJ18K32P7m15J70K36l30
$$ 151 -81 -144 -110 -40 -175 -111 -130 -20 63 83 4 164 -106 123 41 -94 -98 20 252 329 -86 84 320 -10
4407a0K8K21j3k21P9k30L4J28L5lp5J75J00k43k46P9K38k51L67j67P4o7kll1J59
$$ -10 18 239 226 5 84 -146 -112 16 51 48 -27 148 248 5 -241 -162 76 -175 192 25 99 32 30 27 -4 155
4433A55r0k47K5J64J89l84J91Q3k72J53k19P2K94j47o0K27r0j23J40l59J98O6
$$ 155 65 -182 -157 7 196 -188 3 86 -186 -33 -252 -180 114 -33 -93 134 44 -79 61 -298 -100 -34
4455c4l73O99m20p1K97J1j34J12k00R0J31l2j34j76K96m1k7j07N3J92j96Q8j14
$$ -34 -407 292 -128 -199 98 109 -25 87 -113 -23 108 76 -58 -234 62 21 -6 -113 -60 132 -64 24 -90
4478i0j31K23K16l57J91j49L50m52O4L36J48o36k14K08N79j84Q6K78l98r4L95
$$ -90 -221 2 218 -139 52 -97 253 -199 -135 201 349 -287 -501 -293 286 102 188 466 68 -26 369
4499C69o5l80k43L98m4J15j32L9J99m60K82m4j78L43j49j80j9M2J68j19r5J44
$$ 369 304 -76 -319 79 35 150 18 57 256 -204 78 34 -144 199 50 -130 -149 -107 61 -58 -153 -9
4521ij48L63l12J54M2l98L47L47k95m03L70Qj77J83j94K62j26n4J26j65p5K35
$$ -9 -157 206 -106 48 90 -308 39 386 91 -312 58 66 -111 72 -122 140 14 -40 86 -79 -154 81
4543H1K5m05K70Q8L4k50L25j93N2j08J67j20J98o7j21J18j35K37l12J56k22K32
$$ 81 106 -299 -29 59 93 -157 168 -25 27 -81 86 -34 164 97 -24 94 -41 196 -116 40 -182 50
4565E0l7N6m9K34l49N4l72O04k21j6RJ82k34j12L60j55J92l19O5j38N3K52l1j36
$$ 50 13 69 20 254 -95 -41 -413 191 -30 -46 -37 145 -89 -201 159 4 196 -123 -58 -196 -143 109 78 -58
4589e8j33J69l00L94k13J36L8l3j2K26n6j08j59J53J16n7r6Pm7j19L10k07J91
$$ -58 -191 -22 -322 72 -141 -5 33 0 -12 214 158 50 -109 44 160 103 7 14 -33 -152 158 -49 142
4612A42j56Q7n4j73K84L8N0R5m7k67j52J81l2O6%n0J17n3J14k16J61jk01p5K4
$$ 142 -14 73 19 -154 130 168 218 313 266 -1 -153 28 -4 62 62 12 129 76 190 -26 135 134 -67 -142 -118
4637a18K69k34q1J58J40J03j42m5R1j02o7K21k4p9k02J71om08M25qJ68l74M58
$$ -118 151 -83 -164 -6 134 237 95 50 141 39 -28 193 169 90 -112 59 53 -355 70 62 230 -144 314
4660C14k30J34k48K69k9q5j20l08L47j30k9j74L22J26r9qr1O8j22o2M10m48J49
$$ 314 84 218 -30 239 210 125 5 -303 44 -86 -115 -289 33 159 60 52 -39 29 -93 -155 255 -193 -44
4683d4J95j84%J63j47KM5K3j56K33k72J87j22j17L23j23q0N2J96j00k33J43l5
$$ -44 151 -33 -33 130 -17 -15 30 53 -103 130 -142 45 -77 -194 129 6 -74 -22 174 74 -159 -16 -51
4706e1M5K14q5J8j1r2J99Oj10k17j33J99j34m3k01N09l21J73N9O4l3j37Q2K71
$$ -51 -6 208 123 141 130 38 237 243 133 -84 -217 -18 -152 -195 -396 113 -208 -35 24 88 55 -82 0 271
4730B71n22L40n1j04k1P2J67n9j77j08J36P3j37J93r0J10j73n3L7l4M7j6n4k5
$$ 271 -251 89 38 -66 -87 -15 152 93 -84 -192 -56 17 -120 73 -17 93 -80 -133 -96 -130 -83 -99 -153 -178
4754a78J89r9J85R9l78O8j13L33o7r9j8J26M1Lp0J10j00k63K90j9j09J82o3K6
$$ -178 11 -88 97 196 -182 -114 -227 106 39 -60 -78 48 89 92 22 132 32 -231 59 40 -69 113 50 76
4778G6p6j69L69m04J98j10K44l34K55k60K88j06J70r0j75J30n1J6K43l23J96M
$$ 76 0 -169 200 -204 -6 -116 128 -206 49 -211 77 -29 141 51 -124 6 -45 -29 214 -109 87 91
4800I1j51P0J24m57K43K55l83L33q4o2K43k03n1P6k64K18J72k90J95k25J84L5
$$ 91 -60 10 134 -323 -80 175 -208 125 41 -21 222 19 -32 44 -220 -2 170 -120 75 -150 34 69
4822F9j06N0n3K35k61p4R5j5q8oK99k04K15j35p2j94L08j19K1o0j00R3N4K16l66
$$ 69 -37 13 -40 195 -66 -140 -45 -60 -148 -154 145 -59 156 21 -51 -245 63 -56 -35 -95 -195 -102 -48 168 -198
4847a98L14l07J29J96q8j1N7J72k11K2J02j43j29L1K38j89K49k50q2L47k47M5
$$ -198 116 -191 -62 134 46 35 92 264 53 75 177 34 -95 -64 174 -15 234 -16 -98 249 2 47
4869D7M4R1k50M75n55K89j69K86k36MN3j76K58k03J12kk46K59N0j36lK54j22m2
$$ 47 91 182 -68 407 -148 141 -28 258 22 26 79 -97 161 -42 70 68 -178 81 131 -5 -8 246 124 82
4893H2o1k4K5Q1k22K13p6P3o0j00j17O6Q8rK3n6P0q5K70j03J67l18j8J0l6J57
$$ 82 21 -3 22 103 -119 94 18 91 31 -69 -186 -120 -32 -41 -18 -74 -4 -89 181 78 245 -73 -91 -81 -117 40
4919D0p7j1L05m92K54P8oJ80k91p7K75j95J17m7mR7o9M9j89m6M29k01j72J95k
$$ 40 -37 -48 257 -235 19 97 91 271 -20 -97 178 -17 100 53 49 146 77 126 -63 -109 320 119 -53 142 140
4944A40j48o0j73K53j19K11m9k07P4K00k29n0K7j36J80J41j92J50j42J97l29J13
$$ 140 -8 -68 -241 12 -107 104 55 -152 -78 122 -107 -157 -130 -266 -86 55 -137 13 -129 68 -261 -148
4966a48k5pk2J96J23r9O4j44K27j71R4k47jJ28j86K29L5r9J14Jk1Q6j3j23Q4j36
$$ -148 -173 -180 -202 -6 117 18 82 -62 165 -6 88 -159 -160 -32 -218 11 46 -53 61 62 41 127 114 -9 75 -61
4992f1O1Q3R2j68J95l51J67k71L48L0q9j61K51J05m55J84N6N0k26K48r1j3Qo1
$$ -61 0 83 175 7 202 -149 18 -253 95 125 36 -125 126 231 -224 -40 16 66 -160 88 -3 -16 -8 -69
5016f9K44j48M0L2j31P2k25L81N1m7j22j4k0j1o5K77k00p3J71k16K3qM7o2j07
$$ -69 175 27 67 99 -32 40 -185 196 247 200 78 64 44 33 -32 245 45 -28 143 -73 -50 -58 -11 -73 -180
5041a80K18k1l4K21k91M5q7j42N8K88j25J41j99L20k64k62M64o2j42Lk9j40J45
$$ -180 38 17 -17 204 -87 -42 -129 -271 -213 75 -50 91 -108 212 -52 -314 150 88 -54 -51 -80 -220 -75
5064g5N9R8k65K91L7j13O6l32L23r7J64j79R3N7L0r1o3J80k23J35j9p1o5j04K83
$$ -75 -16 82 -183 108 145 32 98 -234 89 -8 156 -23 70 127 157 66 3 183 -40 95 76 5 -60 -164 119
5089A19M2K2k93r2L08j12J67l88L02j53Q0j8M5L5l29J69K98l2j64j86M74l00l6
$$ 119 161 183 -110 -202 106 -6 161 -227 75 -78 2 -16 29 64 -265 -96 202 170 6 -180 294 -6 -42
5112d2k25K35j74K92k43O0J2j54J68J51m2j24J5J31L3J65l71M4j20n0L17k39o4
$$ -42 -267 -32 -206 86 -157 -97 -85 -239 -71 80 38 -86 -71 60 93 258 -113 -69 -189 -239 78 -161 -225
5135b25L81l30Q8O1J54K5k67j1o6R9J60J05j42j47L15k33R8j11J2M1o8J73j25
$$ -225 156 -174 -86 -25 129 154 -113 -124 -190 -91 69 174 32 -115 200 -33 65 -46 -34 7 -61 112 -13
5158a3L0M4j81K87k45J20k0k7J36O1k02J17j64J78j95j77L89l7J21l66J82k02
$$ -13 17 61 -120 167 -78 42 22 -5 131 192 -10 107 -57 121 -74 -251 138 101 222 -144 38 -164
5180a64Q0K4j46J52R6r0k8p5p9J61J55k26J24P2l7l03M87j89n3Q6l70M52k63N0
$$ -164 -84 -60 -206 -54 42 -48 -76 -151 -230 -69 86 -140 -16 56 19 -284 203 14 -39 47 -323 129 -134 -84
5204h4J09k06P9K96j49l00K81RQ7ol29L60j27k31N35l08j62K00k09K03J06j21
$$ -84 25 -181 -102 194 45 -255 26 35 122 116 -213 147 20 -211 324 16 -146 54 -155 48 154 33
5226C3j7J13rp2k02p1J63L1P7K64n11O7J97k1J28k19J05o7R1j21Q0J11K94p39
$$ 33 16 129 120 48 -154 -225 -62 -31 46 310 -201 -134 63 42 170 -49 56 -11 80 -41 39 150 444 -295
5250b95Q1J81j6J5j12L52j40J09j56J97j06k87K46L9J15m07M05k67o2P0J99n3
$$ -295 -214 -33 -49 -34 -146 206 66 175 19 216 110 -177 69 108 223 -184 221 -46 -108 -38 161 108
5272A08j12O1r2l5m3M0J26j92O4j01K10j03K51l20M14m68J16L7M8M6j51J25J34
$$ 108 -4 57 -35 -70 -113 -73 53 -139 -75 -176 34 -69 182 -138 276 -192 -76 -39 9 55 -96 29 163
5295A63j08j83L00j93J03p2Oj45N6j04K80k64k2J24Q7k72K03k73K17L29m24R1
$$ 163 55 -128 172 -21 82 10 16 -129 -73 -177 103 -161 -183 -59 28 -244 -41 -314 -97 232 -192 -101
5317a01n0Q8J20l5j41K33O0k50RKL7j65K79k33J41j63K45k33J64q9p0P2J20k43
$$ -101 -151 -63 57 22 -119 114 174 -76 -67 -65 -28 -193 86 -147 -6 -169 76 -157 7 -82 -152 -80 40 -203
5341b03LJ7Q3J31j85J31J82j66l3j92M51j65m42L67j60M42m79O8K30m0j4k34J21
$$ -203 -200 -183 -100 31 -154 -23 159 -7 -40 -232 219 54 -388 -21 -181 261 -218 -150 80 40 26 -208 -87
5364h7M9J3l6K28M1j03p6k09R6J68j29J83l03K10ON2k67K75K55l59J06k04J55
$$ -87 -38 -25 -61 167 208 105 29 -180 -84 84 -45 138 -165 45 51 103 -164 111 366 7 113 -91 64
5387F4oQ9L3j34L4J63l13J23k3J06n8K7j25L6j26J74k4j4Po4M7n6K10j36j00k34
$$ 64 58 147 180 46 80 243 -70 53 30 136 78 105 -20 16 -110 64 40 26 33 -31 16 -40 170 34 -66 -300
5413c00L64j9j75J88o2J36j80j21J45n8J24j42j93L30j04MQ3o8k48K73Jj88K78
$$ -300 64 45 -130 58 -4 132 -48 -169 -24 -82 42 -100 -293 37 -67 -63 20 -48 -296 -23 -22 -210 68
5436F8o8q9K7J21q5r5K71p7r2L5p8K63j36J50l12J75R4j23j46K54k10J68k75J34
$$ 68 0 -89 -62 59 -26 -121 150 73 -19 16 -62 201 65 215 -97 78 172 49 -97 157 -53 115 -160 -26
5460b6K7q3m6J73m0Mk7J5J40j39J41j68QJ50j3K2m2k41nK02J8N2j35N8o3J6p1
$$ -26 1 -82 -128 45 5 9 -18 -3 137 -2 139 -29 -21 129 116 138 96 -145 -150 52 70 122 -13 45 -18 -2 -73
5487g3R0NOp9p3K20j52k6R6J4j56j28K13K23k01M1nn9O9K4L1k61L28j44k98K89
$$ -73 17 22 28 -51 -124 96 -56 -82 14 28 -128 -256 -43 180 -21 20 15 -44 25 49 80 -181 147 3 -295 -6
5513fJ4N7l1j28J41r6M15k27j84J52j02q4J42qMo1K3J1L2J49j39k63KJ88k4k48
$$ -6 8 65 34 -94 47 -49 366 139 -45 107 5 -79 63 55 59 -2 21 32 64 213 74 -189 -187 1 -23 -271
5539b71J07L26j85j75M8J50J4j13J06J46k25r9R8K1Q6R7o1j90n3j13L27m4o5k1
$$ -271 -164 162 -23 -198 -150 0 14 -99 7 153 -72 -171 -73 -52 34 131 70 -120 -173 -286 41 -3 -68 -89
5563h9j89L3J34N4j39K52K03m00L36l90J63K05k44j0k7N2J43j09K13p7j12P2l40
$$ -89 -278 -245 -111 -57 -196 56 259 -141 195 -195 -32 173 -71 -81 -108 -56 87 -22 191 114 2 74 -266
5586b66J13K33n0j0j20K94j09j06q3J03j21J9J62rJ01j12R9n2N2k07M1J64J02
$$ -266 -153 80 30 20 -100 194 85 -21 -104 -1 -122 -103 59 50 151 39 138 86 138 -69 -28 136 238
5609B38j08j57n3jK2J74L1k65J05p4L7R5K8J70m31K1L01J3k29k2J18o1O8O5K5
$$ 238 130 -27 -80 -81 -59 115 146 -119 -14 -88 -51 44 72 242 -189 -168 133 146 -83 -105 13 -48 20 85 110
5634A10j5j63M3j4J31k81K72j09r4l5L25j28k01m7p0j13J38M06l60L83l71L85
$$ 110 95 -68 -25 -39 92 -189 83 -26 -120 -155 170 42 -159 -206 -276 -389 -251 155 -205 178 -193 192
5656A92j88o6L22k60J19R7k20K8K2PJ11j59J26m5k7j74K63j29P3k51N35l45M6
$$ 192 4 -62 260 0 119 216 -4 24 46 53 164 5 131 86 59 -115 148 19 92 -159 376 31 77
5679G7j72J80k15O7J11j77K11k41K29N3p8J01l50L96l55J44N7o3L8l51L72O9P0
$$ 77 -95 85 -130 -63 48 -129 82 -159 70 123 45 146 -204 192 -163 -19 38 -25 13 -338 34 103 173
5702A73j64%r9O3J16j44O6J04k31J50k01J76k8J0J6o3R6J94j61j29Q1L3j81q0
$$ 173 9 9 -90 -27 89 -55 11 115 -116 34 -167 9 -19 -9 7 -56 40 234 73 -56 25 58 -123 -203
5726b03J92k5O3J3k97N09j00k53j15K88r3K29m6Qk67J99o2j44J58j44k2K15j04
$$ -203 -11 -36 27 40 -257 252 152 -101 -216 72 -21 208 162 170 -97 102 40 -104 54 -90 -112 103 -1
5749aJ56k72L19j12K0q9q6M9J75k88Q9J64n1q8L6j29QM27l63L06l16K94k44j29
$$ -1 155 -117 202 90 110 21 -65 -16 159 -129 -40 124 73 -15 21 -108 -100 327 -36 270 -46 248 4 -125
5773a25R7j03M8j3Q3j2Q3k9m6Ql18L07j83J44J71k46J10j3o0P0j2j12J34j25K16
$$ -125 -28 -131 -83 -96 -13 -25 58 29 -17 -9 -327 -20 -203 -59 112 -134 -24 -37 -97 -27 -39 -151 -17 -142 74
5798G4k28O3J23j46J78rk7k1J2j4Rr1K6J64j37O2j5rK30m40J90K07q0L3j7k58
$$ 74 -154 -91 32 -114 64 55 28 7 19 5 14 -77 -51 113 -24 38 23 14 244 -196 -6 201 121 154 137 -121
5824a21M2J47q5j13L88l83L85k44J62j81m3Q2j52P9r7M1P3j9N0J47Pn6J15j32
$$ -121 -79 68 -17 -130 258 -125 260 16 178 -3 -46 36 -116 -37 -134 -93 -20 -39 11 158 165 109 224 92
5848I2k39L33n34L63j95J49K44j46R7j00j48K37k22O6J01k80N3K05k41J40M5l79
$$ 92 -147 186 -348 15 -180 -31 213 67 164 64 -84 153 -69 -3 98 -182 -129 76 -165 -25 20 -359
5870c59J89K66j81K74n9j03O5k23O6J17j28K4K11l32o3M07j47J32k76K9O4P0K6
$$ -359 -170 96 -85 189 130 27 92 -131 -65 52 -76 -52 159 -173 -236 171 24 156 -120 -91 -27 43 69
5893F9J04q8j66J84N2J04j89J05j80R2k3k1k72N53j87j66rQ8l39K80P7L0k50J03
$$ 69 173 85 -81 103 155 259 70 175 -5 87 64 43 -229 324 137 -29 -38 50 -289 -9 68 98 -152 -49
5917d9J03MK36n5l32j52K87j56Q3N8q2j10q3L29k33J10J36o2J03k19J38j79J77
$$ -49 54 58 294 239 -93 -245 42 -114 -31 27 -55 -165 -248 81 -152 -42 94 32 135 -84 54 -125 52
5940E2l12N22k13l8O0k97L54j4o2J9J55o3j9k40j84J99k0J12lK34m07K8N98j80
$$ 52 -260 262 49 11 71 -226 128 114 52 71 226 163 144 -96 -280 -81 -101 11 8 242 -165 -137 461 281
5964B81m02o8J4J96J22j90j95K55oR4K64k32j69n4J07j70J67m8J38J6r6J19r2
$$ 281 -121 -189 -175 21 143 -47 -242 13 7 101 365 133 -36 -90 17 -153 14 -34 104 120 24 143 51
5987E1o6l1n5M4J63j60o7L41j49k77K66J49k30j4N7r3N1M1k11J62M6N6r6K37k40
$$ 51 -15 -46 -101 -57 106 -54 -121 220 71 -206 60 209 -21 -35 22 -71 -20 21 -190 -28 18 74 -22 215 -25
$$ [...]
8191f4
##END NTUPLES=NMR FID
##END=
