##TITLE=1H_Pr GlnAd
 CDCl3, 8 sc, 
 5.4.2019
##JCAMPDX= 6.0         $$ Bruker NMR JCAMP-DX V2.0
##DATA TYPE= NMR FID
##DATA CLASS= NTUPLES
##ORIGIN= UXNMR, Bruker Analytische Messtechnik GmbH
##OWNER= root
$$ XWIN-NMR		Version 3.5
$$ Fri Apr  5 15:35:03 2019 Russian Standard Time (UT+4h)  she@DPX200
##.OBSERVE FREQUENCY= 200.1316
##.OBSERVE NUCLEUS= ^1H
##.DELAY= (6, 6)
##.ACQUISITION MODE= SIMULTANEOUS
##.ACQUISITION SCHEME= undefined
##.AVERAGES= 8
##.DIGITISER RES= 18
##SPECTROMETER/DATA SYSTEM= spect
##.PULSE SEQUENCE= zg30
##.SOLVENT NAME= CDCl3
##.SHIFT REFERENCE= (INTERNAL, CDCl3, 0, 15.7039)
##AUDIT TRAIL= $$ (NUMBER, WHEN, WHO, WHERE, WHAT)
$$ ##TITLE= Audit trail, XWIN-NMR		Version 3.5
$$ ##JCAMPDX= 5.01
$$ ##ORIGIN= Bruker BioSpin GmbH
$$ ##OWNER= she
$$ F:/spectra/data/she/nmr/H-F/1/audita.txt
$$ ##AUDIT TRAIL=  $$ (NUMBER, WHEN, WHO, WHERE, WHAT)
(   1,<2019-04-05 15:34:01.67 +0400>,<she>,<DPX200>,
      <created by zg, POWCHK disabled, PULCHK disabled
       configuration hash MD5:
       00 E9 B6 7A A2 85 ED C7 34 08 36 98 17 FE 4E 26
       data hash MD5: 16K
       C9 36 1A 6C F7 4C CE 1C 56 A8 F6 3B 17 82 C5 60>)
$$ ##END=
$$ 
$$ hash MD5
$$ B0 07 9E 17 43 56 BF 22 F4 90 6A 49 D2 6B 98 12
##$RELAX= 
##$RELAX= 
##$RELAX= 
##$RELAX= 
##$RELAX= 
##$RELAX= 
$$ Bruker specific parameters
$$ --------------------------
##$DU= <F:/spectra>
##$EXPNO= 1
##$NAME= <H-F>
##$PROCNO= 1
##$TYPE= <nmr>
##$USER= <she>
##$AMP= (0..31)
100 100 100 100 100 100 100 100 100 100 100 100 100 100 100 100 100 100 
100 100 100 100 100 100 100 100 100 100 100 100 100 100 
##$AQSEQ= 0
##$AQ_mod= 1
##$AUNM= <au_zg>
##$AUTOPOS= <>
##$BF1= 200.13
##$BF2= 200.13
##$BF3= 200.13
##$BF4= 200.13
##$BF5= 200.13
##$BF6= 200.13
##$BF7= 200.13
##$BF8= 200.13
##$BYTORDA= 1
##$CFDGTYP= 0
##$CFRGTYP= 5
##$CHEMSTR= <none>
##$CNST= (0..31)
1 1 145 1 1 1 1 1 1 1 1 1 1 1 1 1 1 1 1 1 1 1 1 1 1 1 1 1 1 1 1 1 
##$CPDPRG= <>
##$CPDPRG1= <>
##$CPDPRG2= <>
##$CPDPRG3= <>
##$CPDPRG4= <mlev>
##$CPDPRG5= <mlev>
##$CPDPRG6= <mlev>
##$CPDPRG7= <mlev>
##$CPDPRG8= <mlev>
##$CPDPRGB= <>
##$CPDPRGT= <>
##$D= (0..31)
0 1.2 0 0 0 0 0 0 0 0 0 0.03 0 0 0 0 0 0 0 0 0 0 0 0 0 0 0 0 0 0 0 0 
##$DATE= 1554464041
##$DBL= (0..7)
120 120 120 120 120 120 120 120 
##$DBP= (0..7)
150 150 150 150 150 150 150 150 
##$DBP07= 0
##$DBPNAM0= <>
##$DBPNAM1= <>
##$DBPNAM2= <>
##$DBPNAM3= <>
##$DBPNAM4= <>
##$DBPNAM5= <>
##$DBPNAM6= <>
##$DBPNAM7= <>
##$DBPOAL= (0..7)
0.5 0.5 0.5 0.5 0.5 0.5 0.5 0.5 
##$DBPOFFS= (0..7)
0 0 0 0 0 0 0 0 
##$DE= 6
##$DECBNUC= <off>
##$DECIM= 24
##$DECNUC= <off>
##$DECSTAT= 4
##$DIGMOD= 1
##$DIGTYP= 9
##$DL= (0..7)
0 120 120 120 120 120 120 120 
##$DP= (0..7)
150 150 150 150 150 150 150 150 
##$DP07= 0
##$DPNAME0= <>
##$DPNAME1= <>
##$DPNAME2= <>
##$DPNAME3= <>
##$DPNAME4= <>
##$DPNAME5= <>
##$DPNAME6= <>
##$DPNAME7= <>
##$DPOAL= (0..7)
0.5 0.5 0.5 0.5 0.5 0.5 0.5 0.5 
##$DPOFFS= (0..7)
0 0 0 0 0 0 0 0 
##$DQDMODE= 0
##$DR= 18
##$DS= 0
##$DSLIST= <SSSSSSSSSSSSSSS>
##$DSPFIRM= 0
$$ [...]
##$SUBNAM2= <"">
##$SUBNAM3= <"">
##$SUBNAM4= <"">
##$SUBNAM5= <"">
##$SUBNAM6= <"">
##$SUBNAM7= <"">
##$SUBNAM8= <"">
##$SUBNAM9= <"">
##$SW= 24.9336934301222
##$SWIBOX= (0..15)
0 0 2 0 0 0 0 0 0 0 0 0 0 0 0 0 
##$SW_h= 4990.01996007984
##$TD= 16384
##$TD0= 1
##$TE= 0
##$TE2= 300
##$TE3= 300
##$TEG= 300
##$TL= (0..7)
0 120 120 120 120 120 120 120 
##$TP= (0..7)
150 150 150 150 150 150 150 150 
##$TP07= 0
##$TPNAME0= <>
##$TPNAME1= <>
##$TPNAME2= <>
##$TPNAME3= <>
##$TPNAME4= <>
##$TPNAME5= <>
##$TPNAME6= <>
##$TPNAME7= <>
##$TPOAL= (0..7)
0.5 0.5 0.5 0.5 0.5 0.5 0.5 0.5 
##$TPOFFS= (0..7)
0 0 0 0 0 0 0 0 
##$TUNHIN= 0
##$TUNHOUT= 0
##$TUNXOUT= 0
##$USERA1= <user>
##$USERA2= <user>
##$USERA3= <user>
##$USERA4= <user>
##$USERA5= <user>
##$V9= 5
##$VALIST= <valist>
##$VCLIST= <CCCCCCCCCCCCCCC>
##$VD= 0
##$VDLIST= <DDDDDDDDDDDDDDD>
##$VPLIST= <PPPPPPPPPPPPPPP>
##$VTLIST= <TTTTTTTTTTTTTTT>
##$WBST= 1024
##$WBSW= 4
##$XGAIN= (0..3)
0 0 0 0 
##$XL= 0
##$YL= 0
##$YMAX_a= 130401
##$YMIN_a= -168253
##$ZGOPTNS= <>
##$ZL1= 120
##$ZL2= 120
##$ZL3= 120
##$ZL4= 120
##$ABSF1= 10
##$ABSF2= 0
##$ABSG= 5
##$ABSL= 3
##$ALPHA= 0
##$AQORDER= 0
##$ASSFAC= 0
##$ASSFACI= 0
##$ASSFACX= 0
##$ASSWID= 0
##$AUNMP= <proc_1d>
##$AZFE= 0.1
##$AZFW= 0.1
##$BCFW= 1
##$BC_mod= 2
##$BYTORDP= 1
##$COROFFS= 0
##$CY= 11.3945322036743
##$DATMOD= 1
##$DC= 2
##$DFILT= <>
##$DTYPP= 0
##$F1P= 18.9103706918063
##$F2P= -1.10871071338519
##$FCOR= 0.5
##$FTSIZE= 0
##$FT_mod= 4
##$GAMMA= 1
##$GB= 0.15
##$INTBC= 1
##$INTSCL= 1
##$ISEN= 128
##$LB= 0.24
##$LEV0= 0
##$LPBIN= 0
##$MAXI= 10000
##$MC2= 0
##$MEAN= 0
##$ME_mod= 0
##$MI= 1.114404
##$NCOEF= 0
##$NC_proc= 0
##$NLEV= 6
##$NOISF1= 3.799351
##$NOISF2= 2.8
##$NSP= 1
##$NTH_PI= 0
##$NZP= 0
##$OFFSET= 15.70392
##$PC= 1
##$PHC0= -8856.136
##$PHC1= 20.20028
##$PH_mod= 1
##$PKNL= yes
##$PPARMOD= 0
##$PSCAL= 0
##$PSIGN= 0
##$REVERSE= no
##$SF= 200.130013532006
##$SI= 16384
##$SIGF1= 3
##$SIGF2= 2
##$SINO= 400
##$SIOLD= 16384
##$SREGLST= <1H.CDCl3>
##$SSB= 0
##$STSI= 0
##$STSR= 0
##$SW_p= 3612.71676300578
##$SYMM= 0
##$S_DEV= 0
##$TDeff= 0
##$TDoff= 0
##$TI= <>
##$TILT= no
##$TM1= 0
##$TM2= 0
##$TOPLEV= 0
##$USERP1= <user>
##$USERP2= <user>
##$USERP3= <user>
##$USERP4= <user>
##$USERP5= <user>
##$WDW= 1
##$XDIM= 8192
##$YMAX_p= 0
##$YMIN_p= 0
$$ End of Bruker specific parameters
$$ ---------------------------------
##NTUPLES= NMR FID
##VAR_NAME=  TIME,          FID/REAL,        FID/IMAG
##SYMBOL=    X,             R,               I
##VAR_TYPE=  INDEPENDENT,   DEPENDENT,       DEPENDENT
##VAR_FORM=  AFFN,          ASDF,            ASDF
##VAR_DIM=   8192,          8192,            8192
##UNITS=     SECONDS,       ARBITRARY UNITS, ARBITRARY UNITS
##FACTOR=    0.0002004,     1,               1
##FIRST=     0,             0,               0
##LAST=      1.6414764,     0,               0
##MIN=       0,             -168253,         0
##MAX=       1.6414764,     130401,          0
$$ Real data points
##PAGE= N=1
##DATA TABLE= (X++(R..R)), XYDATA
0 0 0 0 0 0 0 0 0 -5 8 -8 8 -10 16 -16 24 -25 32 -40 46 -54 64 -73 85 -99 113 -128 148 -167 190 -214 242
31 242 -274 306 -341 382 -425 473 -526 582 -647 716 -793 878 -972 1077 -1194 1326 -1477
48 -1477 1649 -1849 2085 -2366 2709 -3139 3700 -4458 5550 -7264 10367 -17755 73069 -11682
62 -11682 -158925 36774 118757 -15464 -119580 -6 111963 33591 -113786 -38644 109525
73 109525 35527 -116461 -42780 78345 29921 -58837 -31170 39593 48987 -31661 -70796 13730
85 13730 63393 -19270 -47860 25514 41207 -5411 -18511 -7618 15759 25328 -17231 -31334
97 -31334 27917 38650 -10644 -14366 5409 4154 7036 -13875 -31746 22412 45129 -30433 -46489
110 -46489 28883 35277 -29853 -44635 3309 41910 1871 -60372 -4773 81113 2944 -91410
122 -91410 -1191 80390 -6458 -66926 8362 67772 15449 -57933 -23132 69817 34134 -75939
134 -75939 -28892 80172 22866 -64830 -6537 56851 10071 -46041 -28993 28957 33501 -35083
146 -35083 -40113 42601 32800 -52817 -28179 40568 9391 -37643 -14452 19540 21042 -8635 -25231
159 -25231 16746 32332 -29372 -32416 37488 26326 -27105 -2379 28922 4489 -10766 -4211
171 -4211 4866 12758 -5911 -17652 16646 18458 -19952 -2595 19556 -20205 -23242 19463 3918
184 3918 -24575 3617 18965 -5976 -18776 -9794 13344 14550 -28684 -23353 42580 25271 -45647
197 -45647 -9775 51487 5691 -43840 -7188 36498 23904 -21887 -26707 34487 41801 -41024
209 -41024 -42501 46958 34373 -46455 -26949 37122 26430 -24245 -35200 10189 37272 -21118
221 -21118 -54946 22668 52900 -30476 -44795 28553 29970 -25817 -27684 11883 29802 -1073
233 -1073 -33029 6400 46904 -7040 -41468 19152 34505 -20185 -17231 21757 15567 -4097 -9007
246 -9007 -3292 13269 2594 -22554 711 20362 -12210 -14493 15426 -982 -18086 4662 1923
259 1923 -16490 236 7675 -4207 55 -1524 -3091 10939 -3015 -19751 14155 23765 -19592
272 -19592 -12332 30123 12093 -19639 -5155 14465 12731 -6561 -21203 11825 36252 -16375
284 -16375 -38570 24861 31608 -33409 -30141 24048 22136 -18335 -29376 6417 35459 -9715 -51537
297 -51537 8658 50307 -19982 -48322 24522 42198 -17431 -32894 7851 33618 4631 -36856
309 -36856 -5039 50632 9378 -46265 3174 45569 -4501 -33249 1473 22646 8209 -16343
321 -16343 -17303 18599 21034 -27549 -23600 22992 8968 -23145 -5362 8632 758 351 -9112 -11685
335 -11685 11533 6898 -16451 -1287 13929 902 1249 1400 -9269 9602 18114 -16442 -13117
348 -13117 26848 14680 -18504 -7115 14471 12686 -6124 -23881 1956 34087 -6709 -42088
360 -42088 11731 38591 -19125 -38158 9677 26753 -5906 -31052 -7549 34636 12372 -44573
372 -44573 -13690 47399 6981 -46128 -1629 39877 7431 -25352 -9923 25030 24428 -23272
384 -23272 -27573 32006 30536 -31017 -19728 31983 15253 -21656 -13844 8554 14922 -4354 -25165
397 -25165 1323 26848 -9358 -28813 9383 15195 -14185 -10384 3132 1631 5656 -2149 -12206
410 -12206 7584 12576 -10629 -5357 10945 1558 1963 6383 -6859 2488 19623 -5764 -17710
423 -17710 13320 15737 -10564 -8189 5555 8977 3579 -16288 -12562 21228 7514 -32809 -6405
436 -6405 29779 -1900 -27635 -1970 15986 4121 -16612 -16528 16691 23486 -22138 -23020 29952
449 29952 20447 -27868 -12200 23961 13610 -10503 -12654 9375 25545 -4714 -29117 11172
461 11172 31634 -15648 -25385 16914 17646 -11603 -13822 -6 11163 2636 -21331 -9269 22208
474 22208 1295 -25885 1805 17332 -7477 -10301 1872 1230 4708 1401 -9605 5003 14942
487 14942 -6534 -6919 10956 2405 -2774 6963 -2067 -1967 14136 268 -14653 6658 11204 -9124
501 -9124 -6707 2995 1666 3265 -6682 -13362 9171 10877 -21206 -12795 18642 3941 -17370 -2854
515 -2854 8946 5730 -3825 -13697 3036 22501 -5377 -22817 14506 24040 -12075 -13622 12330
528 12330 12674 -1413 -10532 -2533 19228 7976 -23029 -4286 25437 -2934 -24174 4277 13720
541 13720 -5589 -10085 -4355 3983 7671 -11193 -13987 12407 7614 -18275 -2343 14585 -2454
554 -2454 -6688 3549 -169 2488 5487 -5528 431 13071 -1966 -7377 10633 4904 -5746 3476
568 3476 1924 -4693 6504 1988 -9393 4157 6172 -10844 -3694 6070 -4690 -3100 1997 -7945
582 -7945 -1704 8346 -7851 -9423 9687 1589 -10866 1014 5342 1296 3503 -4852 -3718 14334
596 14334 3630 -16434 6340 20047 -6681 -11256 9640 9634 -1071 -5930 -4420 8772 7527 -15902
610 -15902 -7310 19612 533 -21324 -297 11122 -4479 -7443 -2867 572 6712 -4727 -14115
623 -14115 7396 13546 -12094 -9367 11238 5033 -3393 649 30 6007 8328 -9484 -5594 17964
637 17964 5683 -13829 2076 10644 -2042 -2539 -639 -1472 6542 -233 -14094 1658 12278 -7154
651 -7154 -9551 3110 -1734 -2619 1549 -8232 -1956 12940 -4598 -16336 7573 12658 -6099 -6526
665 -6526 3022 5622 6239 -5424 -7068 15977 11366 -17816 -5284 19598 3366 -11482 1283
678 1283 5504 1902 -1385 -8918 112 12391 -6025 -16448 5586 7983 -8196 -4333 1565 -2772
692 -2772 1018 -2517 -8840 6433 9644 -11186 -5964 12119 434 -6898 5214 4609 -404 1728
706 1728 -2259 1936 11502 -1952 -8344 9252 4611 -11064 2475 9604 -5390 -4184 2722 -4103
720 -4103 -649 3499 -6496 -2356 4623 -6708 -6243 5891 -952 -4874 2561 -3748 -5442 8562 1837
735 1837 -8717 6449 7814 -8909 -1049 10008 1433 -493 1326 -1981 5304 5540 -7413 1437
749 1437 11827 -5634 -10665 7705 4613 -6238 -17 -854 -4312 2759 -2490 -8669 5274 4835
763 4835 -11765 -4413 6920 -652 -2486 -126 -3216 3972 4742 -9726 -169 17004 -747 -13098
777 -13098 6575 10452 -2606 -1380 1935 2799 5770 -3707 -7303 9940 8069 -11837 -4623 7473
791 7473 -2622 -3578 1562 -4767 -818 4696 -9152 -7751 9097 2378 -9992 -1450 2351 -757
805 -757 2623 -2624 -3726 9349 2601 -11231 3906 12649 -2679 -3375 5463 -85 945 5478 -3302
820 -3302 -806 8849 -2968 -7969 4835 2616 -3874 1100 -3443 -5512 5746 -448 -11181 3563
834 3563 6470 -10410 -5450 6231 -1069 -2609 1875 -3484 519 5549 -4339 -1323 9326 -412
848 -412 -5556 5937 3109 -2613 5911 2480 -5971 4419 4568 -6671 1590 6812 -4700 -3826 2977
863 2977 -2839 -679 2253 -6187 -2507 5176 -5970 -6176 7013 -127 -8406 2589 2155 -5353 3081
878 3081 2924 -4211 2368 3906 -4338 2428 6466 -2871 1058 5739 -3445 244 8261 -2272 -3210
893 -3210 6832 -1262 -6176 5082 1457 -5876 2198 412 -7150 1015 1852 -5908 208 1253 -6887
908 -6887 888 4735 -6989 -1466 7736 -4176 -5744 6731 1729 -2965 4355 705 -1724 6145
922 6145 923 -4295 6395 4639 -5733 1828 4622 -3027 2018 2455 -6803 792 5976 -6825 -5197
937 -5197 6675 -1356 -6864 968 -966 -2458 2581 -4502 -4963 6915 506 -8788 3655 6232 -4487
952 -4487 -404 3937 -1704 3062 4916 -4412 1207 8461 -2609 -3723 6972 1567 -2670 2636 -1602
967 -1602 -1750 6185 -2422 -7715 4874 2912 -9297 -1152 4150 -4526 -1988 782 -4777 1005 3868
982 3868 -6666 -2304 7130 -2924 -4464 5239 998 -1904 4398 -837 -2576 7496 1918 -6147
996 -6147 5093 6374 -4806 278 4505 -2363 930 2487 -5291 618 5369 -6204 -4328 5843
1010 5843 -2563 -6377 2582 -1023 -4459 2836 -1941 -5664 4633 1880 -6667 2127 4880 -3848 660
1025 660 4251 -2475 2289 5205 -3755 843 7982 -2640 -3270 6709 1114 -3895 3623 361 -3134
1040 -3134 3775 -780 -5750 3718 1757 -7686 364 3748 -6005 -2158 2312 -4256 -892 2992 -4988
1055 -4988 -1562 5867 -3388 -4649 6265 1118 -4172 4394 2320 -2264 4373 2351 -3314 5053 4043
1070 4043 -5676 2514 6220 -4571 -1418 4630 -2927 -2245 3251 -3792 -2735 4357 -3678 -5474 3973
1085 3973 -803 -6410 1828 755 -5156 1868 1009 -4993 3265 3807 -5605 1230 6682 -3031 -1094
1100 -1094 5311 -849 178 4995 -1921 -1188 7271 -770 -5112 5657 2425 -4948 1447 1413 -3492
1115 -3492 1847 -596 -6641 2245 3320 -8377 -2533 5507 -3375 -4478 2323 -1627 -1004 3080 -3960
1130 -3960 -1932 7498 -1162 -6396 6158 4982 -4092 1476 3813 -1045 2941 1578 -3846 3923 5437
1145 5437 -6407 -1021 7253 -2549 -4493 3179 -1419 -2712 2426 -3417 -4232 4604 -1567 -7345 2948
1160 2948 2063 -6033 519 2279 -3521 2160 2616 -4717 1864 6096 -3608 -857 6741 -91 -1501
1175 -1501 4649 -557 -867 5653 -1523 -4034 5996 2021 -6238 1796 3016 -4074 -452 394 -4320
1190 -4320 1720 1597 -7595 -556 5606 -5117 -5138 4560 -408 -3832 1487 -425 -921 4010 -2380 -3488
1206 -3488 7497 2526 -6408 3770 6831 -3214 -257 4471 -948 1458 2296 -4020 1434 6013
1220 6013 -5164 -3850 6014 -1273 -6166 2127 -11 -4099 1420 -2037 -5067 3559 328 -7049 2285
1235 2285 4414 -5292 -1030 3869 -2076 626 3362 -3141 795 6559 -2758 -1944 6972 668 -3294
1250 -3294 4421 1037 -2925 4509 512 -5486 3147 3159 -6120 -797 3364 -3358 -1938 354 -3736
1265 -3736 1198 2960 -7258 -2775 7026 -2637 -7137 4640 3304 -3322 -5 605 652 5048 -1291
1280 -1291 -4929 6990 5178 -6830 443 8153 -1185 -2566 2299 -510 1498 2940 -5263 -1497
1294 -1497 6502 -3332 -7705 4190 2142 -5413 -986 -477 -2457 2064 -1708 -5667 3817 3203 -7371
1309 -7371 -326 6942 -2358 -2263 4290 -570 -767 4134 -715 -651 5929 -806 -3061 4518 1061 -3151
1325 -3151 4437 980 -5476 2958 3102 -6082 -176 4352 -4602 -3744 2033 -1919 -1079 1016 -4583 -1133
1341 -1133 4379 -4030 -4244 6636 596 -6453 2699 3840 -2436 1892 2537 -1673 3047 2548 -3906
1356 -3906 3670 6229 -4241 -1966 5462 -673 -2577 3013 -788 -1138 2039 -4671 -3112 6004 -1294
1371 -1294 -8733 2747 3936 -6655 -2619 3218 -425 -707 -2058 -3648 4596 3804 -6847 20 8739
1386 8739 -2660 -5275 6125 3464 -2229 2160 535 -956 4316 21 -3369 4134 2334 -5238
1400 -5238 856 2508 -3428 912 1975 -6556 -1193 4642 -4400 -4707 4151 -1270 -4651 1003 -1116
1415 -1116 -958 3698 -2115 -4949 5517 3089 -5128 2340 5219 -2084 568 1633 -1826 4631 4416
1430 4416 -6053 -508 8270 -1503 -6053 3816 3149 -2940 -1859 -2305 891 4511 -5133 -7023 6344
1445 6344 2086 -10349 -548 6960 -2586 -4415 888 -338 1741 1994 -4312 1086 5980 -2743 -3171
1460 -3171 6192 1524 -2391 3381 79 -2694 4880 1778 -4464 2817 3218 -4620 -346 3014 -2401
1475 -2401 -141 1235 -4822 -1073 3711 -3693 -3278 3193 -2174 -3953 2779 -977 -2562 4114 -705
1490 -705 -5795 4351 3914 -4402 1383 4995 -1715 -446 2470 -259 2951 3102 -4312 1319 6080
1505 6080 -4142 -3404 7123 173 -7257 1273 2490 -2938 -720 -809 -1965 1804 -2519 -5680 4613
1520 4613 3557 -7674 -1513 6067 -2667 -3453 3446 397 -369 1932 -2559 343 6795 -773 -4558
1535 -4558 5082 3368 -4318 1195 2944 -677 1192 -581 -3692 3700 2919 -6698 -751 5358 -3971
1550 -3971 -5027 3356 49 -3292 426 -2442 -1589 3256 -1824 -3800 3998 1050 -4473 2375 2710
1565 2710 -2997 2781 3464 -4724 928 6387 -1784 -1795 4021 811 -543 1084 -2102 1147 5150 -4974
1581 -4974 -5058 6060 1696 -7820 356 3409 -3199 -2530 -911 -2069 2813 332 -7199 475 6078
1596 6078 -3802 -3865 4784 1443 -2224 901 -304 1010 5032 -2147 -3207 6367 2356 -5923 2694
1611 2694 5325 -2453 -794 1758 -1381 1315 1032 -3961 224 3189 -5064 -2720 4423 -2585 -4376
1626 -4376 3049 -713 -4283 2189 571 -3199 1625 716 -2617 2509 1664 -2721 2993 3311 -4111 1100
1642 1100 5631 -1999 -1504 4850 -4 -1982 3079 -239 -925 2994 -2102 -3505 3866 123 -5371
1657 -5371 1497 2241 -4591 -1008 1599 -2761 -69 1014 -3899 541 3226 -4729 -1574 5887 -1150
1672 -1150 -3744 4067 2184 -1743 1940 759 -95 3794 -310 -3078 5558 2649 -5700 810 5594
1687 5594 -3114 -2322 2337 -400 -1032 362 -3665 -651 3253 -4394 -4142 4369 -191 -5655 1490 1391
1703 1391 -2662 584 100 -2327 2636 2130 -3937 1505 4495 -2131 -343 4288 -1124 -445 3572 -1399
1719 -1399 -1199 4328 -378 -3348 2614 526 -2720 1612 -560 -3528 2085 651 -6021 423 3626
1734 3626 -4400 -2369 2104 -861 -1029 836 -2838 701 4315 -3829 -2911 6297 1604 -4307 2317
1749 2317 3527 -826 839 144 -589 4125 808 -5362 2811 4747 -4608 -2443 4180 -750 -2967
1764 -2967 1167 -1625 -1136 2061 -3734 -2890 3991 -951 -5537 2668 2058 -3897 386 1989 -1796 1436
1780 1436 1717 -2631 1655 3649 -2430 131 4808 -1412 -999 4005 -507 -1931 3638 189 -2677
1795 -2677 2627 628 -3224 1295 261 -3447 1373 785 -4895 821 2362 -4420 -1722 3504 -2159
1810 -2159 -2227 2309 -911 -713 2608 -1736 -1395 4683 99 -3481 3986 2626 -3202 1572 2914 -1164
1826 -1164 1150 1597 -1812 1797 2525 -4030 -15 4112 -3249 -3786 3243 -502 -3337 561 -753 -1784
1842 -1784 1451 -2005 -3596 3365 903 -5056 1253 3497 -3057 -541 3035 -909 684 2170 -2014
1857 -2014 1398 4009 -1867 -1735 4770 162 -2445 2600 664 -2215 1940 250 -3119 1619 979
1872 979 -3834 175 1827 -3527 -295 1129 -3610 -663 2616 -2787 -2309 3601 -868 -2231 2284
1887 2284 337 -1748 2674 -219 -1894 3906 1714 -3380 2632 4110 -2392 72 3095 -774 272
1902 272 1882 -2626 232 3065 -3273 -2290 3875 -1238 -4495 1939 142 -2881 375 -670 -2336
1917 -2336 1988 144 -4376 2180 3091 -3903 -165 4270 -1510 -571 2984 -240 384 3188 -745 -521
1933 -521 3823 -665 -2299 3366 878 -2891 2220 777 -3436 950 1427 -3628 32 1478 -3180
1948 -3180 -1128 1673 -2938 -1546 2284 -2212 -1917 2476 -861 -2197 3084 144 -2144 2706 1275
1963 1275 -2017 2761 2034 -1880 2274 2711 -2351 531 2826 -1597 -259 2690 -1554 -1041 2092 -1745
1979 -1745 -1419 2740 -2033 -3767 2465 173 -4744 935 1453 -2946 -468 593 -1776 1671 1135 -3166
1995 -3166 1532 3721 -2825 -853 4408 -474 -1821 2714 25 -338 2881 81 -1736 2686 817
2010 817 -3059 1692 1581 -2866 116 576 -2630 604 1547 -3801 -1064 2620 -2914 -1965 2991 -1098
2026 -1098 -2550 1871 -350 -1775 2591 106 -1743 2445 663 -2359 2587 2306 -1994 1795 2620
2041 2620 -2431 973 3884 -1819 -990 3233 -1163 -2085 1725 -385 -1296 1353 -1759 -2399 2673 -742
2057 -742 -4154 1667 1327 -4086 -224 2094 -1946 -1 1970 -2032 19 2799 -1458 -262 3689
2072 3689 -385 -932 2862 57 -718 3304 -173 -2552 2811 1491 -3127 1495 2085 -2693 -299 1204
2088 1204 -2848 -42 1312 -2687 -1117 1317 -2584 -1974 2421 -1726 -1788 2696 -747 -3069 2783 1535
2104 1535 -2455 1219 1969 -1205 1492 1819 -1142 1720 2130 -1895 784 3378 -1843 -720 3264 -1978
2120 -1978 -1893 2775 -438 -3157 1170 76 -2617 630 184 -2402 881 -185 -3258 701 1509 -2985
2136 -2985 417 2373 -2272 -288 2698 -848 -397 3668 -112 -1514 3145 1230 -1131 2356 582
2151 582 -1213 1772 323 -1956 2221 1434 -4086 43 2330 -3128 -1139 2469 -1780 -2305 965 -1368
2167 -1368 -1152 1671 -1413 -1942 2117 -567 -2340 2519 788 -2204 1891 1430 -1796 2236 3025 -2213
2183 -2213 349 3233 -1332 -605 2499 37 -479 1315 -1709 -422 2916 -1645 -2878 2405 -39
2198 -39 -3610 632 1060 -2609 150 627 -2927 528 2012 -1923 -500 2059 -1261 -527 2217 -859
2214 -859 392 3407 -1310 -2099 4028 1090 -2395 2402 2009 -1594 796 1315 -1033 982 1338 -2606
2230 -2606 -68 1219 -2084 -394 1821 -2630 -1889 1859 -2027 -2162 2234 -486 -2995 1122 582 -1943
2246 -1943 1224 991 -1783 1349 1323 -1514 1841 2441 -2113 880 2968 -1384 -19 3488 -978 -1808
2262 -1808 2280 56 -2031 1540 -87 -2081 780 -951 -2449 1073 -7 -3270 751 909 -3017
2277 -3017 -238 2382 -1974 -612 2046 -1415 -1092 2437 -270 -912 2389 -128 -1340 2375 566
2292 566 -1549 2467 1115 -2049 1705 1856 -2601 698 2322 -2438 -860 2238 -1463 -937 1336 -1624
2308 -1624 -1762 1538 -1176 -2085 1825 -1193 -2467 1683 162 -2390 1894 1321 -2646 1042 2228 -1300
2324 -1300 269 2163 -472 376 2012 -1111 283 3340 -1240 -1453 2958 16 -2123 1606 82
2339 82 -1794 1204 -153 -2836 888 796 -3296 -103 1495 -2202 -588 1299 -1584 -347 2413 -1841
2355 -1841 -1071 3307 -472 -1735 2411 847 -1353 2154 1048 -1289 2083 1392 -1852 1093 1888 -1887
2371 -1887 436 1836 -1767 -432 1683 -2285 -1400 1815 -1791 -2249 1744 -963 -2349 852 -230
2386 -230 -2007 1172 -43 -2102 1637 1115 -2374 981 2478 -1528 209 2314 -993 -5 2563 -583
2402 -583 -443 2657 -529 -1466 1894 -313 -1950 1481 -18 -2475 1111 288 -3071 513 693 -2961
2418 -2961 -354 1111 -2373 -793 1652 -1680 -511 2132 -1051 -1170 2547 1 -1358 2339 865
2433 865 -996 2483 1240 -1808 1822 1700 -1965 701 2052 -1700 -71 1533 -1777 -230 1658
2448 1658 -1701 -1580 1695 -1415 -2057 1220 -606 -2385 984 -356 -2425 1006 957 -2071 784 1756
2464 1756 -1931 1021 1871 -1607 427 2914 -1069 -144 2826 -288 -752 2195 -253 -1552 1929 -596
2480 -596 -2239 1794 462 -2710 608 940 -2656 -524 587 -2100 -164 755 -2377 -958 2128 -1632
2496 -1632 -1603 2366 -452 -1338 1904 253 -996 2341 485 -1608 2423 1471 -1551 1551 1919 -1487
2512 -1487 413 1705 -1611 100 1857 -1791 -794 1948 -1699 -1860 1469 -1046 -1845 989 -634 -2258
2528 -2258 1364 220 -2822 1135 794 -1832 121 1400 -1585 704 1994 -1509 399 2692 -966
2543 -966 -688 2770 0 -905 1911 88 -978 1697 -196 -1820 1742 440 -2398 227 1145 -2128
2559 -2128 -197 843 -2209 -355 1296 -2374 -834 1943 -1199 -1648 1945 -532 -1387 2190 -9
2574 -9 -1251 1832 957 -1744 1892 1490 -1631 991 1974 -998 683 2221 -1835 -104 2213 -1752
2590 -1752 -1012 1811 -1204 -1969 1436 -773 -1903 1334 -432 -2359 1001 224 -2410 688 893 -1927
2606 -1927 776 1463 -1456 297 2085 -1064 64 2628 -436 -554 2483 128 -927 2410 -100
2621 -100 -1363 1560 627 -1676 792 918 -2048 584 579 -2632 48 1573 -2122 -1039 1436 -1564
2637 -1564 -1329 1530 -923 -1042 1829 -385 -1643 1906 393 -1749 1605 1304 -1288 1604 1400 -1356
2653 -1356 1051 1845 -1739 476 2357 -1166 -779 1569 -864 -864 1093 -969 -1190 1412 -1342 -2458
2669 -2458 1211 89 -2352 733 781 -2502 370 892 -2108 643 2017 -1496 -532 2438 -829 -312
2685 -312 1921 -163 -282 2284 -521 -1067 2694 515 -1965 1498 1393 -1781 236 819 -1782 287
2701 287 683 -2336 -528 1101 -1916 -1016 1624 -1405 -1240 1478 -1172 -1340 2100 -156 -1892 1740
2717 1740 741 -1487 1310 1373 -1036 848 1195 -1000 1092 1354 -1558 147 2001 -1331 -440 2099
2733 2099 -1188 -1616 1497 -644 -1995 1194 -282 -1882 824 -137 -2270 644 265 -1916 288 905
2749 905 -1882 225 1810 -1602 -50 2298 -1067 -1011 2355 41 -714 1951 505 -932 1750 243
2765 243 -1380 1718 425 -1964 1145 1185 -2390 173 1296 -2349 -917 1624 -1263 -1364 984 -1214
2781 -1214 -1425 951 -554 -849 1474 -45 -1492 1768 526 -1559 1871 1583 -1950 1093 2150 -1105
2797 -1105 123 2289 -790 -304 1581 -738 -120 1628 -1211 -1276 2111 -434 -2074 1263 -393 -2257
2813 -2257 447 122 -2391 849 1131 -2294 30 1508 -1278 -55 938 -865 265 1842 -988 -266
2829 -266 3320 -407 -1396 2333 525 -1536 1186 1069 -1429 834 914 -1765 418 977 -1764 -225
2845 -225 874 -2274 -377 1079 -1867 -1123 1715 -1233 -1878 1829 237 -2147 1315 668 -1439 1162
2861 1162 680 -1130 1108 1100 -1511 1404 1474 -1305 662 2143 -1113 -574 2354 -879 -1276 1635 -168
2878 -168 -1584 1128 64 -1392 485 -256 -1682 767 9 -2127 683 816 -2302 -233 1893 -1655
2894 -1655 -868 2330 -756 -694 1594 104 -487 1714 83 -805 1679 216 -1349 2037 888 -1681
2910 -1681 1148 1013 -1774 -110 1518 -1802 -465 1169 -1439 -947 1047 -1395 -1065 969 -972 -1244
2926 -1244 1479 -386 -1426 1238 130 -1797 1408 1412 -1603 580 1943 -1190 -17 1808 -709 418
2942 418 1693 -747 -103 1993 -946 -1068 2139 -254 -1846 1407 -294 -2128 800 472 -2196 -190
2958 -190 825 -1781 176 411 -1662 25 1288 -1854 33 2171 -1086 -1153 2132 85 -930 1848
2974 1848 417 -1002 1580 927 -999 1586 916 -1403 544 1172 -1361 532 1125 -1696 -319 1450
2990 1450 -1465 -1217 1536 -878 -1711 1470 -394 -1690 983 -438 -1253 1070 565 -1622 1150 1004
3006 1004 -1469 1003 2032 -1512 518 2020 -695 -200 1785 -781 -773 1740 -186 -890 1113 -247
3022 -247 -1516 1004 -373 -1746 963 255 -2008 553 970 -1749 -216 983 -1470 -306 1097 -956
3038 -956 -591 1668 -541 -589 1849 -148 -1151 1748 224 -913 1801 785 -1450 1494 1470 -1579
3054 -1579 685 1615 -1185 -231 1225 -1644 -643 1138 -1460 -858 1284 -1036 -1549 1503 -973 -1828
3070 -1828 1210 187 -1941 1237 912 -1409 712 1208 -997 763 1533 -1103 479 2059 -789 -361
3086 -361 2227 -461 -561 1725 -276 -1003 1262 -20 -1776 731 234 -1386 269 435 -1976 176
3102 176 445 -1728 -71 876 -1488 -709 1465 -1031 -1157 1556 42 -719 1587 -147 -680 1657 334
3119 334 -1186 1194 835 -873 853 854 -1360 793 1309 -1820 77 1614 -1279 -687 1326 -935 -1346
3136 -1346 978 -876 -1163 1129 -665 -1683 1246 221 -1859 1027 946 -1455 539 1278 -1033 620
3152 620 1788 -1020 104 1969 -658 -433 1948 -285 -458 1454 -211 -963 1162 323 -1519 663
3168 663 557 -1712 138 878 -1923 -284 744 -1889 -564 1157 -1440 -793 1236 -761 -731 1241
3184 1241 -584 -703 1508 49 -964 1687 938 -1170 1207 1261 -934 673 1133 -1392 497 1096
3200 1096 -1614 -306 1016 -1226 -947 1454 -930 -1462 1053 -511 -1544 1126 239 -1714 824 484
3216 484 -1786 578 814 -1198 105 1271 -831 24 1500 -693 -275 1605 -617 -250 1770 -407
3232 -407 -561 1476 150 -1365 1084 385 -1438 629 478 -1644 302 402 -1885 -80 866 -1419
3248 -1419 -483 1255 -964 -628 1308 -897 -549 1795 -409 -913 1365 387 -1235 1360 827 -1189
3264 -1189 1014 1089 -1146 612 1534 -1165 -70 1515 -826 -416 1032 -650 -656 1285 -968 -1342 1124
3281 1124 -445 -1484 731 127 -1689 585 245 -1527 665 1056 -1693 532 1421 -653 -91 1719
3297 1719 -570 -169 1195 -249 -266 1583 7 -761 1492 -83 -1237 863 355 -1259 245 426
3313 426 -1717 221 961 -1575 -355 827 -1440 -551 1045 -921 -1024 1366 -806 -1298 1774 65
3329 65 -1262 1310 808 -879 930 916 -882 1077 1088 -1251 501 1146 -861 -230 1369 -798 -319
3346 -319 1330 -728 -944 939 -719 -1498 1000 -153 -1707 233 266 -1571 368 156 -1238 763
3362 763 1035 -1124 481 1389 -830 -150 1854 -434 -612 1425 -50 -800 1197 248 -915 1077 229
3379 229 -1057 818 601 -1478 754 1031 -1819 -108 934 -1340 -625 756 -1079 -912 1028 -700
3395 -700 -669 1240 -258 -1085 1074 288 -857 951 613 -948 976 1155 -1313 971 1495 -682 -81
3412 -81 1310 -340 -230 1282 -735 -596 1124 -555 -931 1030 -701 -1394 797 57 -1595 531 429
3429 429 -1757 231 888 -1300 -237 1110 -1044 -118 1028 -565 -2 1328 -550 -509 1888 -235
3445 -235 -555 1345 549 -1262 921 573 -859 665 954 -1375 -51 645 -1144 -108 177 -1108 -367
3462 -367 1043 -1478 -877 1181 -582 -1121 948 -47 -1267 463 540 -509 905 455 -537 795 937
3479 937 -680 587 1230 -1157 78 1298 -806 -141 1313 -411 -885 1335 -380 -1002 459 -350
3495 -350 -1179 580 -112 -1431 518 -46 -1649 418 1148 -1128 19 1182 -980 -585 984 -168
3511 -168 -537 1300 -118 -524 1293 77 -411 1221 124 -955 999 625 -1080 836 493 -1348
3527 -1348 86 1118 -1150 -518 558 -1080 -609 623 -775 -704 605 -826 -769 1111 -306 -1012 949
3544 949 427 -1193 866 893 -1175 338 1266 -593 287 961 -291 57 1119 -780 -281 1043 -536
3561 -536 -742 1261 78 -1104 779 159 -1563 651 529 -1279 107 283 -1013 -290 579 -956 -296
3578 -296 650 -1196 -293 1443 -503 -894 1305 -201 -491 1208 569 -697 866 762 -557 565 554
3595 554 -709 370 655 -1407 149 479 -1248 -345 934 -1383 -831 987 -766 -1013 560 -272 -963
3612 -963 399 -77 -1034 1097 438 -687 534 823 -1234 1012 975 -869 469 1458 -502 -382 1319
3629 1319 -306 -674 740 -316 -788 828 -114 -900 926 -255 -1671 772 176 -1574 395 547
3645 547 -757 -224 772 -887 -314 1208 -787 -599 723 -366 -399 1092 -72 -252 1285 69 -969
3662 -969 791 625 -1328 314 1062 -1133 136 756 -1011 -338 734 -763 -241 689 -759 -661 627
3679 627 -398 -732 960 -267 -936 986 241 -1327 627 804 -578 463 574 -536 408 1051 -279
3696 -279 312 948 -577 -223 1278 -134 -892 1122 24 -771 1024 101 -1105 535 496 -1031 176
3713 176 291 -1060 153 258 -1503 -138 649 -963 -113 885 -606 -342 1213 -310 -359 849 417
3730 417 -881 961 658 -576 737 821 -756 540 540 -651 210 1137 -961 -455 671 -776 -687 711
3748 711 -446 -1046 622 -486 -988 654 -151 -1175 325 351 -956 251 759 -879 344 924 -694
3765 -694 68 1061 -417 74 1163 -393 -218 1377 -13 -659 979 -119 -1109 680 81 -1111 544
3782 544 60 -1331 65 307 -909 16 546 -1359 -458 425 -864 -304 964 -207 -466 994 64
3799 64 -609 1182 171 -539 892 696 -509 472 915 -893 384 777 -437 70 367 -847 -339 667
3817 667 -820 -867 591 -789 -989 477 -184 -1086 328 -92 -936 324 455 -930 490 1138 -1020
3834 -1020 68 941 -537 108 1072 -544 -194 1122 -128 -321 971 155 -692 1236 277 -1189 554
3851 554 43 -993 631 345 -1125 13 279 -1152 -633 865 -785 -470 947 -530 -419 728 -445
3868 -445 -892 843 85 -883 664 515 -524 838 344 -702 601 663 -735 468 1003 -934 -226
3885 -226 873 -541 -702 694 -694 -521 480 -398 -1019 312 -159 -1115 337 -73 -915 435 85
3902 85 -1059 -167 788 -1075 -46 1034 -181 -19 769 -159 -122 1422 -124 -609 994 98 -800 871
3920 871 0 -647 516 455 -662 189 193 -992 -143 528 -1137 -262 567 -880 -328 752 -564 -464 892
3939 892 -286 -664 889 -26 -591 616 549 -570 489 573 -560 623 1273 -793 29 833 -800 -189
3957 -189 933 -545 -518 839 -744 -810 606 -152 -1114 485 -161 -1181 405 152 -893 199 651
3974 651 -782 226 776 -895 232 1170 -747 71 1444 -274 -537 1201 37 -748 1033 101 -629
3991 -629 702 521 -785 416 275 -1089 385 519 -959 -207 677 -896 -403 436 -756 -711 696
4008 696 -340 -387 636 -102 -393 667 314 -794 872 618 -475 253 790 -679 240 984 -305 -190
4026 -190 752 -560 -169 860 -369 -648 823 -448 -801 480 -179 -887 465 109 -940 347 502
4043 502 -951 244 744 -585 121 692 -400 -242 723 -351 -299 1221 35 -284 1127 -7 -767
4060 -767 824 328 -774 556 457 -862 283 456 -907 30 233 -828 -168 599 -722 -451 1054
4077 1054 -445 -891 738 -456 -592 805 310 -389 520 42 -764 814 669 -597 543 995 -389
4094 -389 187 753 -434 71 997 -776 -758 1072 -193 -729 755 -14 -622 489 -45 -642 223 152 -1187
4113 -1187 536 275 -1232 -193 975 -602 5 1023 -539 -597 975 2 -453 732 -4 -454 992
4130 992 475 -165 781 197 -815 617 503 -826 292 219 -806 -429 608 -678 -296 725 -914
4147 -914 -576 513 -112 -562 425 -364 -596 548 141 -1126 664 333 -664 660 644 -502 15 949
4165 949 -489 -29 906 -515 66 752 -390 -254 762 -451 -578 772 -348 -943 506 -92 -1193
4182 -1193 109 222 -1154 -64 356 -687 -322 257 -875 -208 974 -875 -247 889 -259 -618 918
4199 918 5 -501 992 438 -816 373 710 -689 548 398 -623 68 709 -629 251 586 -956
4216 -956 -391 871 -758 -793 782 -279 -708 557 -192 -811 191 -22 -565 520 496 -948 421 788
4234 788 -729 176 989 -382 -86 994 -190 -182 737 6 -493 641 -190 -664 492 25 -843 384
4252 384 186 -938 719 121 -920 273 638 -1051 43 919 -777 -173 472 -369 -324 760 -220 -9
4270 -9 762 224 -136 1012 183 -530 715 925 -1077 447 525 -635 116 540 -533 -278 558 -864 -424
4289 -424 422 -631 -630 640 -601 -1131 751 -56 -684 341 570 -1000 461 503 -309 120 811 -745
4307 -745 387 775 -492 -198 942 -398 -203 1088 -338 -500 749 2 -545 365 118 -1105 385
4324 385 302 -1088 347 57 -813 33 285 -749 37 605 -693 -293 809 -520 -484 733 88 -643
4342 -643 475 285 -406 419 248 -529 747 459 -651 442 467 -878 22 868 -549 -360 393 -490
4360 -490 -551 375 -386 -443 653 -287 -818 100 63 -811 682 356 -1123 269 561 -463 235 840 -333
4379 -333 0 1097 -77 -438 761 -209 -297 574 -21 -780 687 79 -643 455 -120 -790 197 135 -1108
4398 -1108 -133 361 -836 -121 330 -696 -225 742 -192 -230 701 -398 -467 961 152 -293 617 305 -577
4417 -577 748 590 -486 495 382 -539 424 752 -678 -56 550 -719 -448 899 -322 -626 389 -94
4435 -94 -937 298 -319 -837 141 221 -566 353 76 -397 165 688 -479 224 987 -386 -200 871 -677
4454 -677 -94 847 -61 -377 675 267 -615 394 468 -731 607 192 -659 19 588 -780 -36 360 -623
4473 -623 -159 -46 -419 -222 441 -683 -489 620 -58 -680 668 170 -108 796 392 -496 451 731 -629
4492 -629 402 607 -677 -12 935 -568 103 354 -337 -428 243 -395 -810 475 -164 -694 269 117 -756
4511 -756 466 246 -671 0 -153 -848 261 832 -205 198 708 -195 -117 833 -183 -498 691 133 -446
4530 -446 833 251 -687 352 237 -711 405 220 -721 -8 234 -672 -241 519 -687 -486 479 -296 -209
4549 -209 477 -401 -385 705 -100 -705 554 325 -380 570 447 -447 564 683 -262 -15 843 -501 73
4568 73 627 -321 -33 742 -431 -492 438 -232 -616 437 174 -819 106 145 -857 32 270 -893 287
4587 287 343 -748 -34 648 -415 -119 698 -290 -236 713 -132 -478 607 173 -437 653 311 -354 404
4606 404 -98 -747 383 277 -1024 122 556 -450 -380 329 -492 -343 560 -535 -765 486 139 -747
4624 -747 657 427 -273 410 350 -675 334 601 -535 419 714 -260 277 281 -395 162 401 -210 -289 821
4644 821 -202 -220 739 -384 -806 248 328 -739 293 384 -666 -20 437 -889 96 -83 -514 7 463
4663 463 -557 -295 705 -171 -475 628 -4 -189 618 231 -225 218 190 -809 596 116 -698 90 385
4682 385 -441 -94 487 -440 -156 400 -593 -484 588 -271 -840 136 187 -468 683 -21 -380 788 375
4701 375 -620 245 557 -349 482 912 -206 196 1038 -424 23 735 -99 -153 783 -53 -268 595 -286 -565
4721 -565 243 -99 -814 140 328 -895 158 370 -750 70 577 -509 -132 428 -237 -283 746 -244 -84
4740 -84 841 315 -274 550 276 -590 187 413 -466 110 452 -593 94 332 -602 -196 449 -550 -510 531
4760 531 -341 -394 211 -251 -375 661 -76 -693 543 148 -618 565 460 -503 -34 526 -550 -177 723
4779 723 -500 -2 785 -384 -212 406 -287 -72 454 138 -343 455 68 -510 466 204 -736 74 428
4798 428 -530 -110 280 -132 -317 447 -622 37 532 -344 -235 981 241 -388 435 149 -242 390 184
4817 184 -431 154 330 -351 264 574 -508 160 380 -602 -243 98 -483 -471 64 -570 -734 547 20 -560
4837 -560 395 -2 -877 233 94 -555 65 335 -586 338 554 -278 223 1044 -148 -339 807 72 -353
4856 -353 432 156 -220 682 67 -545 238 72 -593 350 335 -345 179 224 -458 -6 621 -412 -474 371 -372
4877 -372 -454 147 -50 -189 430 -145 -341 624 4 -519 698 58 -584 205 517 -634 -111 426 -643
4896 -643 -97 365 -358 -101 194 -432 -513 585 -254 -579 434 -272 -666 265 380 -571 199 357 -417 -239
4916 -239 511 -402 240 517 -434 88 813 -313 -45 586 -326 -230 442 -30 -797 540 73 -488 -19 -50
4936 -50 -844 -101 -221 -667 -77 391 -422 -65 269 -604 -164 688 -325 158 802 -250 -564 704 456
4955 456 -242 632 286 -360 481 364 -631 -136 541 -263 76 530 -373 -225 539 -573 -329 411 -285 -289
4975 -289 252 204 -278 33 52 -255 277 -68 -442 -19 468 -534 383 637 -319 150 529 -348 -98 660
4995 660 -20 -107 365 186 -252 532 54 -594 84 100 -561 397 19 -405 -81 117 -596 -158 324 -407 -347
5016 -347 144 -502 -366 298 -381 -272 539 -4 -575 587 146 -742 183 403 -420 399 540 -469 29
5035 29 284 -173 90 192 -216 18 473 -296 -316 220 -404 -547 65 -123 -733 145 284 -557 112 139 -356
5056 -356 582 135 -260 370 550 -320 28 396 -275 -171 401 -1 -248 456 -72 -75 505 78 -457 429 249
5077 249 -264 144 -14 -367 -2 291 -282 -97 71 -562 -153 226 -272 -518 345 -366 -524 539 -48 -444
5097 -444 543 255 -396 410 566 -211 367 366 -641 110 520 -495 -155 683 -295 -118 450 -187 -416 487
5117 487 -299 -591 250 -4 -534 82 165 -670 77 163 -394 31 593 -530 -202 412 -319 -248 216 -283 -222
5138 -222 614 62 -248 392 -28 -287 343 200 -503 200 -5 -208 53 376 -333 -280 410 -477 12 232
5158 232 -583 -176 503 -383 -520 298 -344 -664 578 122 -446 324 284 -280 579 206 -351 351 542 -93
5178 -93 -73 503 17 80 338 -225 -159 352 -184 -303 22 240 -426 -127 90 -342 122 71 -509 22 224 -366
5200 -366 -111 670 -254 27 328 -136 18 366 232 -271 347 90 31 426 145 -153 344 -25 -334 162
5220 162 55 -446 118 184 -360 -54 715 -441 -288 12 -239 -194 416 -311 -137 218 30 -498 202 1
5240 1 -584 340 443 -281 117 363 -103 147 384 -468 66 357 -433 117 494 -90 -378 278 -155 -618 259
5261 259 -104 -465 190 49 -836 127 190 -480 -135 154 -210 4 245 -192 123 579 -66 244 310 166 -75
5282 -75 442 89 -266 269 171 -493 260 314 -350 188 409 -168 -155 463 -411 -229 463 -230 -130 255 -188
5303 -188 -327 355 5 -255 244 -223 -358 477 206 -275 175 289 -529 275 265 -421 83 536 -153 18
5323 18 523 -89 -16 386 -329 -416 76 -385 -235 -71 -115 -328 70 118 -457 -37 113 -281 18 237 -218 -158
5345 -158 243 -183 -104 244 63 -192 588 284 -314 221 190 -450 251 155 -247 204 299 33 -167 -7 -245
5366 -245 70 220 -323 62 558 -438 -454 424 -188 -421 210 -232 -422 316 178 -479 76 272 -321 -93
5386 -93 392 -276 -113 131 -203 136 436 14 -135 483 -26 -336 246 13 4 502 170 -352 279 22 -356
5407 -356 -14 256 -763 -213 117 -482 211 82 -203 121 209 -148 -250 233 -85 -1 380 379 -54 196 359
5428 359 -270 207 371 -119 65 469 -208 -91 248 -104 191 82 -314 -34 508 -117 -113 42 -191 -330 350
5449 350 -153 -119 94 203 -313 -224 245 -203 143 393 -321 -306 316 -178 136 697 -21 18 444 64 -44
5470 -44 8 126 -485 298 -17 -84 -27 -34 -143 -78 -15 -490 121 283 -368 -68 449 -262 -454 233 -172 -372 53
5493 53 -137 -120 312 129 -316 259 202 -502 96 469 -180 -23 447 -302 61 557 -164 200 200 -256 -220 91
5515 91 14 -374 230 -280 -441 368 -30 -626 -50 151 -533 -73 249 -383 -248 621 -583 242 629 -227
5535 -227 -74 484 -77 -318 751 232 -456 111 207 -423 393 211 -454 108 580 -209 -66 91 -379 -290
5555 -290 183 -25 -262 194 -107 -216 363 -564 -217 507 161 -415 698 286 -574 336 413 -292 140 159
5575 159 -202 230 398 -170 133 340 -261 126 348 -228 -235 194 -68 -114 345 -292 -217 148 259 -328 -98
5596 -98 78 -482 18 335 -190 -71 241 -370 210 424 92 -65 627 217 -600 529 174 -398 403 177
5616 177 -544 -30 -26 -443 222 46 -474 -85 206 -509 -278 44 -585 -435 62 146 -107 189 -147 -232 391
5637 391 177 -305 354 532 -343 177 391 -402 301 711 -167 -133 313 -198 -208 487 3 -68 774 24 -350
5658 -350 168 -298 -649 88 21 -580 81 -29 -506 -71 420 -141 -216 286 -156 92 425 -473 -53 344 -8
5679 -8 -235 434 390 -78 311 -44 -247 197 60 -493 301 141 -131 151 134 -407 -155 320 -332 -111 73
5700 73 -305 -378 4 -25 -196 298 125 -423 283 169 -247 170 56 -390 -10 513 -71 124 681 -294 -157
5721 -157 511 185 -31 91 -163 -316 323 -47 -488 -60 -267 -598 143 -66 -528 286 78 -630 -2 131
5741 131 -476 -258 285 28 -94 376 -240 8 514 -86 -230 214 300 -158 55 -153 -266 336 363 -331 303
5762 303 149 -425 67 294 -114 133 346 -117 -617 174 -80 -254 281 -268 -320 175 -19 -580 171 -30
5782 -30 -308 95 256 -65 161 410 18 -135 567 -251 -104 417 21 -191 466 84 -104 387 133 -447
5802 -447 309 61 -473 176 -65 -268 7 46 -365 137 156 -61 2 488 -359 -71 561 105 -76 208 377
5823 377 -336 173 497 -388 6 -9 -170 126 501 -271 39 127 -272 -159 176 -605 -351 299 -13 -205 210
5844 210 -35 -319 290 -55 -561 106 305 -408 -161 66 -321 219 229 -425 93 424 -107 -191 309 -29 28
5865 28 258 -146 -369 397 -196 -134 503 -77 -559 140 67 -646 51 -5 -357 406 -24 -263 -274 358 63 -318
5887 -318 7 -372 -202 435 -55 -88 682 -31 -701 243 401 -309 -131 357 -242 -75 192 -217 -11 229
5907 229 -288 -119 286 -390 -370 365 -98 -236 480 -44 -517 65 -355 -280 62 -26 -456 -50 140 -457 163
5928 163 318 -206 -94 252 -305 -137 327 -13 -377 226 73 -564 470 -1 -389 242 116 -149 243 105
5948 105 -266 -58 -84 -464 -94 155 -371 -398 325 212 -230 334 -159 -73 566 -198 -25 400 150 -86 128
5969 128 130 -84 266 179 -343 98 704 -344 300 588 -431 34 91 -345 -149 419 -181 -14 378 -283 -358
5990 -358 347 99 -346 214 9 -447 -178 156 -130 118 526 -20 177 357 42 292 112 -201 -359 685
6010 685 -19 -216 447 54 -279 177 158 -389 -15 99 -547 -160 73 -255 -205 250 -440 26 405 -263 -151
6031 -151 572 -34 -108 137 174 -94 278 1 -638 107 429 -125 241 373 -353 230 220 -229 -11 436 -219
6052 -219 -230 303 -140 -226 368 -99 -498 -1 138 -654 60 -155 -652 331 124 -398 123 412 -53 -99 147
6073 147 -238 -182 593 -54 -217 265 167 -315 149 223 -184 166 55 -172 202 182 -333 -107 -33 -179 -71 -89
6095 -89 -219 -304 67 -61 -219 172 -453 -283 285 -130 -171 304 626 -454 -130 433 98 222 -35 -167 209
6116 209 298 -109 127 414 -355 -91 350 24 -104 295 -227 -226 238 -4 -382 298 -96 94 -55 93 -536
6137 -536 -76 256 -327 -234 334 -44 87 495 7 19 611 -239 -139 163 17 -347 449 -76 -332 349 229
6158 229 -37 -28 186 -373 -268 387 -237 -299 248 -501 -27 148 -62 -552 202 -40 -135 60 -74 -197 386
6179 386 128 -281 497 48 -471 117 208 -121 143 363 -412 -53 154 -373 -36 220 -94 -170 350 -403 -642
6200 -642 469 224 -147 248 -79 -446 -209 246 -448 165 159 -529 -113 384 128 -225 532 -25 -218 476
6220 476 -92 -170 76 211 -221 282 152 -256 405 307 -136 77 59 -581 396 490 -355 -92 151 -371 -183
6241 -183 101 -212 -275 368 365 -237 137 -29 -434 272 329 165 245 192 -395 64 515 -75 139 66 -185 130
6263 130 355 -32 -307 483 -206 -526 96 -191 -209 469 200 -486 -1 218 -578 -79 272 -466 -181 337
6283 337 -146 -191 168 -13 -17 247 -242 -230 301 5 -391 310 -36 -329 538 283 -396 -15 155 -54 167
6304 167 382 -552 -249 -26 -113 -104 387 -384 -82 399 -370 -356 370 174 -363 -48 135 -321 135 22 -131
6325 -131 75 321 -285 181 314 -77 -11 62 -390 134 565 -151 80 133 -442 -429 319 122 -288 179 237 -266
6347 -266 49 -66 -110 80 123 -398 -268 222 -371 -251 115 -151 -198 440 59 155 500 61 23 373 158 172
6369 172 196 242 -251 338 410 -312 44 346 -268 -74 2 92 -73 108 -341 -279 -182 -209 -224 -55 -164 -631 212
6392 212 99 -506 162 207 -132 -89 304 -302 -68 401 106 208 593 -67 -264 178 -178 -225 773 -214 -526
6413 -526 202 -120 -461 -10 76 -484 143 242 -102 -224 316 -339 210 132 -309 -412 49 -78 -16 226 -143
6434 -143 -460 375 -60 -277 558 -125 -268 -97 188 -176 194 409 -383 -269 94 -318 -3 209 -336 -290
6454 -290 270 -117 -520 133 -149 -234 248 -16 -314 57 201 -412 139 160 -497 -32 15 -433 174 371 -71
6475 -71 -179 520 140 -62 652 18 -47 327 214 -161 94 39 -223 299 195 -402 -152 84 -53 -405 272
6496 272 -382 -108 475 -173 -338 181 32 -345 718 223 -99 -42 260 -433 302 332 -428 245 494 -41
6516 -41 66 196 67 -94 267 -86 81 205 113 -202 391 -126 -241 190 -123 -583 -131 -3 -156 129 -47
6537 -47 -350 287 51 131 29 169 -179 -172 381 -120 15 304 150 -40 289 397 -439 178 337 -52 165
6558 165 58 -240 -159 5 -221 176 267 -69 -135 237 -145 -58 164 -416 -225 345 110 -23 344 281 -174 -89
6580 -89 342 -499 339 131 -108 -28 122 104 16 165 -421 -28 545 -226 -385 176 -123 -324 34 -193 -537
6601 -537 -59 -347 -265 72 61 -52 21 181 -109 121 134 -165 -185 538 -123 -232 10 168 -125 317 164 -416
6623 -416 510 126 -295 352 185 -215 369 328 -109 104 256 -129 -193 -103 -342 -177 -23 -411 8 296 -239
6644 -239 -291 110 -99 -262 -27 236 -39 75 491 68 229 87 -176 -97 45 -413 158 179 -101 -267 365
6665 365 -33 -203 366 -160 -36 28 10 -84 209 24 -278 -12 179 -307 -59 78 -413 134 160 -299 -122
6686 -122 -39 -410 -293 277 11 -149 310 85 -205 381 12 -205 273 121 -329 2 -45 -301 20 327 -229
6707 -229 7 -181 94 -163 245 -20 -415 113 -266 -447 -24 384 -66 159 58 -189 401 -21 -91 20
6727 20 34 -267 23 479 57 172 315 -253 -353 75 -42 -420 464 -278 -544 148 386 -254 -234 173 -210
6748 -210 38 -81 -330 191 188 -76 203 474 -30 -224 229 143 6 229 -225 -144 366 -155 -458 -67 92
6769 92 -41 -198 235 -192 172 60 -76 -57 260 -164 -203 -68 -138 -126 -103 -127 -117 -1 124 -504 563 39
6791 39 -248 234 51 -294 21 279 -270 85 228 -424 -284 407 35 268 321 -122 -277 230 206 -206 187
6812 187 -190 -214 127 215 -368 205 -151 -257 -123 207 -114 -38 340 -165 51 397 -153 137 219 -74 -106 -32
6834 -32 -114 -307 411 211 -209 43 -117 -67 109 373 -109 -77 371 -237 -250 -88 -152 -179 303 -97 -484 64
6856 64 105 -349 116 -15 -58 433 149 -408 120 107 45 479 147 -167 -131 72 136 108 418 96 -96 411 -161
6879 -161 -194 533 -293 -430 135 -36 -297 -129 -14 167 61 -38 -13 -45 110 -75 8 21 -119 -382 273 44
6901 44 -153 541 -125 17 433 174 -272 246 291 -597 411 69 -32 83 395 -542 -126 349 35 -383
6921 -383 215 -285 -16 352 -5 -402 497 104 -266 -30 -119 -209 383 31 -299 23 60 -49 87 60 -53
6942 -53 23 348 -113 -69 523 10 -308 107 39 -92 160 7 -439 322 -242 -495 149 193 -323 374 85 -84
6964 -84 -123 52 -485 157 260 -211 -117 233 -268 44 349 99 -82 247 65 -57 352 217 -81 273 43
6985 43 -87 106 88 -271 55 397 -275 -86 99 -663 104 277 -256 25 247 -138 -380 525 18 140 96
7006 96 89 -241 221 111 -262 -202 12 -256 281 -88 -189 -74 146 -373 -122 208 107 -206 454 17 -351
7027 -351 146 191 -150 -40 133 -231 -281 318 -247 -247 282 -273 -52 213 -160 -226 406 -85 -209 117 -56 -654
7049 -654 294 41 19 511 -225 36 39 243 -278 68 372 -95 321 299 -360 -128 405 -252 -274 348 -163 -196
7071 -196 216 46 -43 154 -28 -132 134 311 -322 212 369 -71 -14 328 -128 -394 218 72 46 377 -142
7092 -142 -155 173 -86 -217 82 219 -229 -164 306 -187 67 18 -125 -88 -5 -133 -125 490 -301 74 466 -71
7114 -71 -335 212 278 -383 80 -115 -187 220 126 -156 332 343 -10 65 399 -190 371 373 -225 73 268 -431 -38
7137 -38 100 -58 -332 344 78 -264 -38 90 -84 163 -146 -234 39 220 -70 98 216 71 -9 566 -63
7158 -63 120 235 124 -84 207 174 -122 113 146 -399 -20 127 -308 136 417 -115 -327 84 -396 -85 207
7179 207 -49 -83 252 -478 52 191 32 -116 -50 -75 -118 147 134 -119 488 320 -33 103 306 -345 -19 122
7201 122 -304 70 187 -75 -2 334 -312 -159 100 -43 -68 299 182 -5 -33 -151 -205 81 245 -311 -183
7222 -183 -214 -467 -94 129 -310 -77 300 48 175 399 277 -411 -2 232 -202 262 425 -107 -62 -101 -73
7243 -73 -58 126 -404 -29 383 -81 -208 192 0 8 224 -223 -410 221 -13 -38 290 -44 -382 307 126 5
7265 5 -39 120 -118 234 150 -166 -148 208 -155 -137 57 -39 -89 -174 65 -367 192 -228 -152 103 309 -271 -224 -319
7289 -319 -387 -132 260 -223 136 217 -130 -45 289 -123 -148 138 -334 -32 77 -14 -45 -101 92 -297 93 96 -98
7312 -98 146 192 -148 200 96 -168 71 42 -198 18 180 -290 -438 170 77 -81 243 -64 -287 354 -47
7333 -47 -149 346 35 -205 292 338 -221 107 -132 226 165 157 -148 -173 158 -91 -61 360 -331 -428 -51 -8 -501
7356 -501 -38 -208 -189 -62 21 -207 -133 -51 -243 204 105 -222 -53 240 -7 -204 177 -298 -254 -12 -224 -377
7378 -377 439 318 -224 266 -30 -171 295 -13 -257 65 -97 -246 -96 118 -166 128 171 -277 -154 227
7398 227 64 -304 251 -41 -381 168 110 -156 184 -159 -256 111 168 -83 241 596 -177 -57 444 -88 202
7419 202 -4 -42 -485 68 171 -296 24 151 -491 12 -98 -451 -144 16 -236 62 277 -365 -97 259
7439 259 -204 -256 237 39 79 227 40 171 204 97 -195 347 75 -435 391 99 -386 187 67 -107 -160
7460 -160 -21 74 -38 141 -571 -327 284 -235 -345 347 -30 -167 179 -154 -286 257 65 -363 331 16
7480 16 -267 182 506 -138 -552 521 -139 80 294 -125 3 314 -308 -217 156 -25 -67 -31 -69 -227 -251 83
7502 83 -401 -233 313 46 -294 -7 -2 -113 158 -305 -44 216 -115 -7 270 27 -88 295 -31 -273 -118
7523 -118 53 54 261 -80 -440 -266 366 -152 -178 224 -299 -166 219 -381 -50 314 -147 -290 56 60 -359 -265
7545 -265 -58 -323 53 182 -215 147 283 -374 20 222 -287 14 387 -133 -9 447 -39 -274 396 -74
7565 -74 -293 557 -80 -369 82 -167 -45 -199 209 -156 -273 177 -126 -54 132 -372 -72 -174 82 131 288
7586 288 -270 -267 47 301 -140 322 273 -62 9 -80 -197 169 362 -191 -68 426 -108 -362 162 -337 -112 259
7608 259 -90 -70 81 -206 -185 66 35 -707 161 85 -59 -125 166 -31 81 60 -243 180 352 61 -102 -22
7630 -22 -84 -125 542 71 -185 121 439 -328 189 224 -297 314 -20 -330 -28 -159 -681 -155 111 -466 -381 177
7652 177 -415 -47 13 -347 -50 150 -74 -148 232 16 68 60 234 -203 119 11 -319 286 155 -4 -146 -76
7674 -76 75 -111 -106 -243 -275 283 -68 -535 184 45 -403 240 9 -365 234 360 -540 -102 -115 -181 119 472
7696 472 -170 -47 169 -178 -257 693 -38 -340 230 35 -250 -124 206 -97 263 21 -239 30 40 -547 -2
7717 -2 -20 -240 264 173 -474 -282 141 -110 -188 -61 120 -395 239 182 -179 531 125 -148 147 133 -259 87
7739 87 79 -78 -127 109 -88 -143 120 100 -113 184 -23 164 -159 -71 -319 206 143 7 106 41 -171 -119 364 -244
7763 -244 -39 -33 -237 -83 162 -100 170 383 36 121 396 155 -399 131 110 -4 47 121 -80 425 -50 -166
7785 -166 202 -167 -147 -60 305 -341 -60 164 -152 -73 153 -276 35 245 -170 -101 244 -96 -340 194 -57
7806 -57 -422 78 147 -114 -89 334 -22 -103 144 -221 -171 155 -51 -226 73 -43 44 85 -170 -305 83 82 -105
7829 -105 109 226 -288 281 164 -356 210 36 -190 -141 230 -259 83 100 104 -57 606 59 -148 -304 -256 -264
7851 -264 -47 -195 -93 172 371 -197 52 28 -211 78 289 -113 164 110 -326 3 500 31 -215 159 46
7872 46 -403 451 356 -79 161 312 -70 204 140 -129 351 267 -155 -101 271 92 38 415 173 -361 266 -37
7894 -37 -280 15 -127 -106 -71 348 72 -26 171 -192 152 423 -73 -68 12 36 46 70 -144 -121 82 -59 -282 77
7918 77 27 41 343 -125 -222 205 -14 -361 -95 47 -309 34 139 -228 -241 562 -224 -182 394 -165 -259 465
7940 465 -158 85 212 -210 -242 360 -94 -189 87 35 -170 -199 241 -107 345 159 -129 16 547 -264 -28
7961 -28 195 -302 -396 225 -170 -240 234 139 -68 138 122 6 59 -133 -236 51 322 -153 213 333 108 -186
7983 -186 325 -116 123 255 -191 -255 257 31 -286 370 -132 -299 185 111 -358 11 -89 -62 -89 -73 -7 -145
8005 -145 373 -181 -58 119 -173 -175 -78 -180 -627 257 -3 -39 213 36 -205 -45 323 -50 136 270 -350
8026 -350 64 166 -155 157 319 -308 57 65 135 32 226 55 -271 501 325 -334 -73 151 -20 -63 167
8047 167 -19 -84 122 -96 -304 2 -502 -225 -143 71 208 266 -230 -171 104 -55 -227 -26 142 -99 -41 107
8069 107 -346 179 50 -247 39 48 92 12 200 106 -536 -13 -112 -64 -154 -125 -11 197 -138 -304 -61 304 96
8092 96 -121 39 -430 290 -27 40 57 238 -71 57 71 -122 -140 -41 319 -374 33 171 -300 268 -84 -204
8114 -204 275 -11 -325 -46 105 -262 65 5 -320 -16 148 -35 -171 -141 191 -388 261 -218 43 -311 82
8135 82 -87 12 218 -391 323 556 -135 -251 57 32 -84 430 29 -97 262 -38 -118 13 -38 -111 294 -262
8157 -262 -205 259 -36 73 -5 179 -355 188 2 24 -66 34 -94 -311 364 227 15 138 -101 -89 300 76
8179 76 -269 326 -88 -107 253 -198 -362 27 181 -368 10 132
8191A32
$$ Imaginary data points
##PAGE= N=2
##DATA TABLE= (X++(I..I)), XYDATA
0 0 0 0 0 0 0 0 0 0 0 0 0 8 -8 8 -8 8 -10 15 -16 20 -23 24 -31 34 -39 45 -52 57 -65 73 -82 92 -102 115 -127
35 -127 141 -157 175 -194 214 -238 261 -291 323 -357 396 -442 495 -555 626 -710 813 -945 1115
54 1115 -1343 1667 -2171 3028 -4769 9653 -48628 -168253 28533 130401 -27875 -121697 9066
67 9066 112292 16784 -116114 -41059 107350 35254 -118449 -40485 98925 38024 -66162
78 -66162 -26326 49324 39635 -35103 -60131 23643 73005 -11566 -51540 27631 47290 -15489
90 -15489 -28316 -846 15542 17160 -15177 -28874 24378 36521 -22611 -29813 4745 3152 -3313
103 -3313 -9988 -21376 16513 38540 -29057 -49508 28520 38607 -32124 -39851 17401 43864 3056
116 3056 -47152 -1840 73553 5880 -86963 -258 89954 300 -70179 12413 69245 3966
128 3966 -61708 -20348 62402 28770 -74230 -33618 78675 25371 -74843 -16395 57760 2348
140 2348 -55349 -22006 34746 31019 -31392 -38743 37556 36682 -49251 -31902 48032 19173 -38037
153 -38037 -7661 31863 20622 -9378 -20813 12991 30928 -21468 -31581 36621 32852 -31019
165 -31019 -13125 28900 1006 -21841 -5549 4975 6830 -5497 -17206 9149 17377 -21469
177 -21469 -15024 17020 -11962 -24445 20586 14086 -22709 1403 22239 -6329 -17901 -167
189 -167 16230 14232 -17149 -16614 38619 28477 -42674 -16549 50474 7772 -47910 -3834 41785
202 41785 16052 -27828 -26196 25340 32689 -40507 -45665 42473 36934 -49877 -31521 41087 23340
215 23340 -33014 -32444 14087 34307 -14747 -45986 22789 56556 -25352 -48443 31662 38580 -26819
228 -26819 -25551 21651 30819 -2653 -28538 4729 42046 -5415 -45147 13455 38390 -20808
240 -20808 -25396 22077 14670 -15474 -13819 -3421 7247 1411 -20262 -3404 20641 -7998 -19811
253 -19811 13249 5802 -18673 3223 10454 -10643 1778 14801 -800 -1492 4017 -803 7310
266 7310 2851 -13701 10783 25233 -15233 -17308 27008 12278 -25850 -8447 15620 6842 -10498
279 -10498 -17694 7132 27763 -15975 -41510 18120 33339 -32046 -32476 28876 24845 -21866 -25025
292 -25025 11807 31651 -7175 -43137 9764 53855 -11867 -47530 25774 47312 -19934 -35516
304 -35516 14179 33728 39 -33073 -4471 44698 8515 -49709 -4424 45694 -6148 -41673
316 -41673 2048 26453 1234 -20537 -14797 14341 17574 -25172 -24836 25003 16340 -24166 -5954
329 -5954 17240 2927 -2993 -3451 -5689 11762 11847 -12470 -1758 18678 2606 -5106 2337 -5063
343 -5063 4209 15283 -12602 -16156 22429 13293 -24724 -12056 14611 6774 -12260 -19953 1302
356 1302 27484 -4783 -40316 7594 39682 -17407 -40072 14725 32260 -7775 -26406 228
368 228 33137 12300 -38261 -12036 48635 12198 -45529 -1005 45379 5244 -31059 -7302
380 -7302 24475 17446 -23394 -26774 26963 29566 -32932 -27054 30729 14923 -30009 -15759 12829
393 12829 11805 -7259 -21148 789 26231 -5944 -29535 9463 22892 -11738 -11543 10996 6957
406 6957 3122 881 -7767 6296 15102 -7941 -7777 13431 4832 -3591 4032 -4093 -3100 13170 -4307
421 -4307 -20458 8939 15678 -13944 -13221 6670 6086 -2923 -13998 -10355 17314 9515 -28632 -7509
435 -7509 32080 1781 -29254 1090 23227 3468 -13947 -8922 18220 22993 -17489 -22019 28098
448 28098 23397 -28896 -15147 27380 12800 -17080 -12245 9487 18272 -7517 -29263 5887 29248
461 29248 -15059 -30734 15046 20257 -16423 -16962 4532 10394 822 -16442 -6939 22487 6523
474 6523 -24160 1308 23233 -4597 -12714 7237 7019 3188 2897 -5485 2913 14436 -4925 -10795
488 -10795 9661 4936 -7430 2756 155 -5800 7365 -75 -16773 1207 11646 -10205 -10404
501 -10404 5476 2161 -1460 -3896 -9783 6252 12456 -15300 -12109 21365 9402 -17328 -1671
514 -1671 14743 5230 -4351 -7623 4457 20257 -1767 -21809 11141 24774 -13441 -18705 12762
527 12762 12322 -7788 -11542 -1701 13293 4732 -22962 -8646 23335 -993 -27475 2919 18020
540 18020 -6698 -12371 442 6036 5752 -7063 -10969 12763 12696 -14212 -3494 18819 1045 -9374
554 -9374 5178 4521 300 4988 -3297 -2230 11169 -941 -11384 6166 5719 -9734 -1263 3203
568 3203 -6317 979 2658 -9972 -756 6962 -9896 -6825 8183 -1493 -5374 4076 -2529 -2191 9111
583 9111 -2164 -8661 10640 6890 -9515 1779 10394 1042 620 -1311 -3351 10804 5264 -15333
597 -15333 1860 18690 -6980 -16107 7881 9593 -6996 -8580 -3245 5408 5597 -13801 -9732 16978
611 16978 3075 -22446 -1309 16158 -3014 -8764 2025 4079 5476 -892 -9714 7348 16170
624 16170 -8723 -10261 13782 8678 -6246 83 2850 2698 5101 -7282 -7646 14170 6104 -17240
638 -17240 -2541 11773 -4220 -7891 -300 -1720 1728 -110 -12273 -414 12835 -5517 -12214
651 -12214 5030 4046 -2927 2799 -1578 -1556 12013 92 -13581 8210 16310 -5972 -8141 6255
665 6255 6785 2764 -4006 -6539 10641 9594 -17608 -9354 18758 3396 -16884 -1727 6612 -2082
679 -2082 -4277 -6734 -1317 9799 -4127 -16440 5078 12346 -7798 -6222 5712 627 213 1422
693 1422 -4052 6298 11242 -7900 -6488 13825 4509 -8824 3997 6719 -2881 -726 -515 -468 7063
708 7063 -2219 -11111 4440 5678 -11726 -2243 9655 -6170 -8123 3053 -1514 -2891 3725 -3920
722 -3920 -4274 6104 -1863 -5450 7315 3504 -5317 3143 2008 -3252 8084 5819 -7620 3738
736 3738 9736 -7268 -3752 11096 1630 -5171 420 -1158 1022 3706 -7407 -3671 8551 -5003
750 -5003 -13095 5783 6741 -8876 -2849 1846 -3897 1338 1162 -6426 3862 7165 -8838 -4176 10922
765 10922 2948 -3885 2305 416 2937 6262 -5472 -1806 14619 809 -14823 4411 12239 -4539
779 -4539 -5812 1872 682 947 -3766 -7947 5739 7047 -12534 -7828 8603 99 -6669 2175 -1319
794 -1319 -2483 4474 -4207 -6577 10528 6350 -9435 -701 7712 1576 2191 1172 -2238 7061 4670
809 4670 -9859 1252 13679 -3257 -8509 4318 864 -3046 2994 -3241 -4635 5085 -2137 -10169
823 -10169 2989 4700 -5848 -2264 -606 -4738 4357 2770 -8654 1902 9539 -6973 -5412 9966
837 9966 3123 -3430 3081 634 402 6321 -806 -2689 7914 1532 -7607 3980 5013 -4382 1278
852 1278 1996 -7334 442 4819 -7075 -3011 5948 -4460 -6814 2836 -607 -2610 2099 -3566 -3397
867 -3397 6197 -1386 -5666 7617 3979 -7619 2579 6334 -3022 2292 6211 -3146 977 5794
881 5794 -2975 177 6522 -2913 -3174 4768 -2788 -3448 5727 -2082 -7418 3576 192 -8399 2316
896 2316 2767 -7212 -572 2323 -5680 -90 4509 -4244 -672 4271 -3711 547 7280 -3021 -1740
911 -1740 8757 -352 -5759 7315 4898 -4173 2272 2561 -2952 3643 1719 -5902 2685 4306 -7213
926 -7213 -2488 4870 -3702 -2582 1970 -5799 -2652 5547 -5094 -6783 6815 1248 -7639 1451 3292
941 3292 -1573 2267 -17 -3783 6780 4104 -7032 2886 9229 -3441 -2192 6045 157 183 4192
956 4192 -3684 -1833 7215 -2155 -6868 4285 1695 -6255 -67 -544 -4132 3182 -1090 -8464 2329
971 2329 4869 -8376 -2498 6847 -2100 -3074 3293 -1293 519 5407 -2998 -2376 8506 926 -5253
986 -5253 5433 4208 -3070 3109 1580 -3720 4820 3126 -7472 1164 6342 -5886 -3774 4265
1000 4265 -2392 -3086 1869 -4634 -2321 4610 -4705 -6037 6036 498 -7297 2648 2848 -3629 2506
1015 2506 1992 -3908 4118 5125 -5106 1269 7518 -2402 -1360 5635 -764 -341 4884 -2813 -2399
1030 -2399 6652 -1587 -6520 4417 1722 -6761 415 1179 -4993 432 445 -6634 1220 3125 -7195
1045 -7195 -1395 5883 -3376 -3303 4844 -938 -1420 5261 -1061 -1919 7058 502 -4317 6015 3547 -4770
1061 -4770 2889 4239 -3323 1582 2473 -4435 1422 3673 -6234 -1508 5358 -4624 -5256 3935 -2399
1076 -2399 -4711 2779 -1829 -3986 3735 -1029 -5932 4241 2637 -5856 2432 4685 -3261 1380 4269
1091 4269 -3059 2074 5976 -3464 -276 7495 -1245 -3388 5186 228 -2855 3360 -1405 -4225 4639
1106 4639 -658 -7288 2263 2746 -6926 -1466 2638 -4035 -614 1065 -4991 765 4849 -5805 -3344
1121 -3344 7458 -236 -4869 4135 2332 -846 3559 -498 -1624 6905 1609 -6603 4822 6795
1135 6795 -5058 -1145 4851 -1668 -1035 1306 -4228 508 4104 -6262 -4654 6387 -1917 -6984
1149 -6984 2395 608 -4152 1572 -1118 -3996 4146 1457 -6313 2785 5684 -4238 54 5284 -1524
1164 -1524 1093 5007 -2400 303 7020 -2115 -3421 6143 729 -4358 2924 680 -3641 2901 -543
1179 -543 -6283 3116 2129 -7307 -1042 4286 -4427 -2330 1795 -3268 -205 3171 -4956 -1327 7368
1194 7368 -2367 -5247 6226 3326 -3931 2117 2667 -207 3744 270 -3725 5861 4192 -6930 920
1209 920 7031 -4255 -3684 3632 -1411 -2430 1099 -3708 -1284 4103 -4517 -5937 5107 150 -7403
1224 -7403 1522 2881 -3847 1022 1326 -3685 3627 3509 -5257 1834 6787 -2749 -1722 6264 -71
1239 -71 -1456 3906 -1041 -830 5499 -1448 -4193 4940 872 -5840 1384 1945 -4487 971 800 -6117
1255 -6117 714 3485 -5776 -2946 4226 -2305 -3611 2087 -1330 123 4277 -3925 -2653 8664 859
1270 859 -6755 4769 6529 -3835 -689 3328 988 3227 -100 -4706 4292 5425 -7303 -2603
1284 -2603 7573 -1495 -6002 1505 -54 -1445 1274 -4294 -3585 5351 -1403 -8123 3044 4476 -5113
1299 -5113 -1592 2807 -1342 1709 1431 -3631 3267 5520 -5085 -873 8706 -391 -3899 4666 1629
1314 1629 -2021 3154 301 -2288 3565 201 -5343 2585 1722 -5189 695 1332 -6469 131 3780
1329 3780 -5554 -2583 5056 -3177 -5179 3758 1000 -1764 2148 -1555 -1156 5382 -406 -3719 6662
1344 6662 3282 -6418 2329 6253 -2337 78 3577 -1760 433 2325 -4097 162 5029 -4586 -4953
1359 -4953 4617 -544 -5058 1291 -101 -3408 779 -2289 -3807 5035 596 -8520 2304 6639 -4690
1374 -4690 -2705 5696 1223 -1466 407 -959 3824 4674 -4672 -1298 9080 -943 -6584 5562
1388 5562 4761 -4848 -926 1270 -2037 1995 252 -5161 1320 2184 -6063 -1388 3736 -2926 -2052 2244
1404 2244 -4664 -2136 5755 -1828 -5042 4656 1573 -4060 1821 2688 -588 3059 -7 -4035 4759
1419 4759 5163 -4495 923 5855 -1947 -2275 2448 -1218 1250 3150 -6203 -3869 7056 -1111 -7939
1434 -7939 2337 3501 -4713 -3454 -283 541 3188 -3214 -6535 5798 4911 -8292 -1048 9393
1448 9393 -905 -5161 2692 2302 1533 2527 -1815 -90 5943 -1396 -3996 5688 2609 -4920 1063
1463 1063 1410 -3391 1937 2373 -5661 -362 3087 -4815 -2618 3515 -1948 -2398 1438 -3305 -1843 4772
1479 4772 -1341 -4114 3996 904 -3510 2992 2360 -1793 3815 1788 -4607 3361 6012 -3919 -574
1494 -574 5462 -1661 -2436 2636 -257 -61 1526 -4394 -1504 5041 -3552 -5852 5184 1001 -8599
1509 -8599 279 4105 -3177 -2126 840 -1219 1187 61 -3735 3934 5217 -5853 -1747 7856 -130
1524 -130 -3949 4037 2740 -1348 2025 -355 -565 5626 -443 -6204 3194 3597 -5315 -1219 3572 -2156
1540 -2156 -1956 -660 -3847 1288 3003 -6107 -2710 5835 -2180 -6160 3896 2345 -3278 549 515
1555 515 -1206 3657 965 -3010 3835 3418 -4144 1459 4691 -2101 527 3816 -3626 -1275 5735
1570 5735 -1319 -4407 3068 906 -3092 61 -1040 -881 2804 -3500 -6271 4760 2824 -7614 -1077
1585 -1077 5681 -2061 -2905 1293 -194 2034 1771 -4540 612 7745 -1650 -4166 5872 3494 -2894
1600 -2894 918 1459 645 3754 -1402 -4296 4596 2858 -7103 -80 5182 -3286 -3716 1745 -969 -1163
1616 -1163 964 -3491 -1219 3360 -3354 -3679 4693 -274 -4685 2897 2284 -3693 2060 2977 -2258 1421
1632 1421 3076 -1765 1372 3126 -2190 1153 3996 -3077 -1421 5472 -1421 -3971 3569 -171 -4116
1647 -4116 1392 175 -2837 1490 -896 -4472 2267 1177 -5729 444 3975 -3776 -1785 3541 -1242
1662 -1242 -572 2469 -1572 431 4520 -2058 -1920 6377 955 -4415 3499 3539 -2557 464 1874 -1325
1678 -1325 1376 -199 -3973 2578 2510 -6530 -1689 5359 -2884 -4983 2416 253 -2788 290 -1678
1693 -1678 -689 3792 -2218 -4158 4962 2655 -4915 1086 4545 -1950 338 2513 -1141 1921 3197
1708 3197 -2851 272 5113 -1897 -2497 3998 -460 -2672 2178 -796 -3311 2612 -501 -4672 1283
1723 1283 1214 -3864 -322 586 -3417 1120 1926 -4491 -323 5202 -2278 -3049 3938 1148 -1290 1901
1739 1901 -263 550 4693 -1677 -3166 5784 2795 -5743 1147 4619 -1882 -1376 865 -1269 1154
1754 1154 598 -5236 204 4630 -4675 -4279 3969 -43 -4542 478 63 -1503 1434 -1336 -2472 4248
1770 4248 1187 -4596 2640 4402 -2752 -52 3964 -855 411 2671 -1400 345 3981 -1860 -1823
1785 -1823 4058 -838 -3179 2586 -116 -3695 1724 235 -3990 791 1092 -4076 -458 1315 -3106
1800 -3106 -263 1902 -3580 -165 3817 -2655 -1644 4448 -164 -2506 2965 1202 -930 2421 298
1815 298 -1486 3958 1079 -3985 2316 3719 -3808 -670 3448 -1997 -1579 1141 -2286 -498 1912
1830 1912 -4204 -2085 3981 -2114 -4774 3187 1057 -3983 358 1145 -1603 1529 414 -2298 3277
1845 3277 2354 -4081 877 5321 -1874 -1554 3603 362 -529 2239 -1011 -479 3455 -1318 -3513 3452
1861 3452 480 -4603 1127 1219 -3295 266 861 -3435 39 2057 -3656 -553 2340 -2305 -1132 2920
1877 2920 -1730 -1046 3882 -996 -2002 4227 1380 -2656 2330 2104 -1451 1631 1082 -1960 2452 2108
1893 2108 -4067 524 3825 -3271 -2312 2556 -1315 -1871 962 -2057 -1494 2253 -2597 -3651 3606 467
1909 467 -4666 1310 2310 -2456 370 1220 -1245 2015 1615 -2781 1497 4628 -2801 -962 4778 -473
1925 -473 -1781 2926 158 -1472 2184 -738 -2276 2535 -100 -3921 1754 1192 -4042 202 1545
1940 1545 -3494 -514 2018 -3109 -1156 2378 -2071 -1439 2639 -847 -1421 3232 -207 -1857 3335
1955 3335 1058 -2128 2972 1995 -2261 2032 2288 -2569 1049 2680 -2455 -471 2199 -2540 -1163
1970 -1163 2643 -1492 -2614 2008 -1519 -2470 1290 -1407 -2449 1956 -564 -4096 2477 1939 -4057
1985 -4057 610 3585 -1907 -258 2173 -395 1070 2138 -2256 565 4307 -1669 -1875 4260 594
2000 594 -2987 2280 1221 -2136 1380 -265 -3108 1028 940 -3618 -168 1948 -3227 -1316 1509 -2342
2016 -2342 -528 2191 -2587 -1374 3260 -1169 -2046 3778 975 -2561 2241 1657 -1444 1989 1682 -1790
2032 -1790 1834 1998 -2128 1083 2538 -2290 -289 2379 -2697 -1582 3119 -1880 -2717 1865 -517
2047 -517 -3261 1237 546 -2273 603 -756 -2408 2155 538 -3439 1534 3146 -3262 -358 3684
2062 3684 -457 -713 2436 -918 -255 3374 -336 -986 3017 134 -2229 2107 473 -1914 2018 71
2078 71 -3783 882 1898 -3565 -539 2508 -2815 -1779 1350 -1316 -1001 1665 -1482 -1559 2319 -324
2094 -324 -1472 3061 423 -2176 2968 1219 -2396 2781 3065 -2693 527 2902 -1118 110 2222
2109 2222 -1371 -196 1641 -2166 -812 2511 -1671 -2188 2099 -1191 -3404 1884 506 -3522 480
2124 480 937 -2749 427 1317 -1591 611 1504 -2134 994 3118 -1561 -366 3366 -650 -1246 3312
2140 3312 484 -1873 2741 568 -2812 2115 1659 -2463 310 653 -2339 152 735 -3090 418 1094
2156 1094 -3814 -1227 2818 -2297 -2568 3058 -592 -2551 1686 705 -1179 1704 313 -1501 2539
2171 2539 901 -2002 2334 2410 -2263 1232 2482 -1736 917 2904 -2283 -1305 3055 -1075 -2605 1819
2187 1819 -82 -2076 159 -1277 -1520 1994 -1427 -3581 1790 1171 -3513 472 2810 -1971 -589
2202 -589 1855 -1416 104 2958 -893 -965 2428 139 -933 2434 303 -465 2613 -504 -2220 2861
2218 2861 1065 -3477 381 1712 -2813 -683 1358 -1886 -460 936 -2424 -1493 1942 -1845 -1830 1649
2234 1649 -1438 -1895 2253 -39 -2229 2451 1096 -2642 1423 1990 -1407 1147 2157 -1327 721
2249 721 2096 -1368 642 2328 -1637 -854 2272 -1492 -1735 2494 -682 -3355 1091 115 -3147 484
2265 484 806 -2336 412 632 -2560 836 1191 -2332 190 2276 -1554 -314 3291 -468 -971 2764
2281 2764 246 -1296 2416 913 -1261 1956 731 -2011 1566 1178 -2213 724 1130 -2730 335
2296 335 1589 -2663 -1361 1863 -2392 -2212 1927 -1003 -1963 1590 -582 -1844 1918 478 -1840 2098
2312 2098 1171 -1895 1319 2018 -1682 1241 2313 -1826 349 3413 -1103 -895 2120 -375 -1217 1553
2328 1553 -873 -1157 2163 -1256 -2838 1619 396 -3437 537 1051 -2938 -291 884 -1967 327
2343 327 1996 -2171 -630 2501 -465 -918 2480 -402 -597 2482 105 -992 3107 991 -2131 2054
2359 2054 1601 -1881 999 1420 -2261 662 984 -2512 -505 1347 -2075 -1080 1419 -1481 -1526 1709
2375 1709 -1387 -2259 2127 -431 -2809 1782 1052 -2166 911 1526 -1389 1160 1682 -1664 1420 2239
2391 2239 -1764 200 3237 -1446 -1145 2440 -818 -1404 1669 -565 -1943 1637 -231 -2726 1334
2406 1334 319 -2705 416 491 -2669 359 1023 -2432 193 1799 -1854 -473 2415 -949 -990 2602
2422 2602 180 -1324 2585 268 -934 2099 723 -1693 1685 1469 -1753 1143 1510 -1998 207
2437 207 1732 -2200 -1187 1614 -1928 -1656 1203 -1488 -1643 1571 -994 -1732 1670 -157 -2244 1261
2453 1261 968 -1806 1092 1447 -1806 964 2029 -1364 792 2416 -780 -337 2537 -999 -437 2505
2469 2505 -908 -1685 1973 -165 -1846 1098 -91 -2178 854 -14 -2666 1020 877 -2805 -201 1877
2485 1877 -2018 -1037 1937 -1122 -360 2050 -948 -549 2858 -68 -1278 2667 832 -1287 1843 1251
2501 1251 -1301 1313 1600 -2253 906 1767 -2311 -87 1785 -1771 -1119 1331 -1984 -1375 1512 -1383
2517 -1383 -1954 1802 -645 -2310 1248 70 -1953 1021 595 -2122 1412 2019 -1997 966 2652 -1139
2533 -1139 94 2337 -437 -180 2183 -821 -739 2579 -627 -1692 1795 407 -2264 816 342 -2236
2549 -2236 451 -51 -2454 504 1106 -2990 -495 1621 -1730 -814 1596 -1245 -546 2100 -406 -893
2565 -893 2447 80 -1209 1960 1043 -1157 1834 809 -1345 1481 1463 -2032 920 1900 -1892 -669
2581 -669 1587 -1369 -1023 1633 -1833 -1600 1980 -1119 -2274 1553 -336 -2047 1076 40 -2194 1307
2597 1307 994 -1963 997 1824 -1652 391 2279 -923 65 2581 -940 -266 2346 -644 -1074 2301
2613 2301 -252 -1913 1798 532 -2366 1114 619 -2607 147 718 -2446 -77 861 -2280 -6 1326
2629 1326 -2091 -614 2454 -1314 -1296 2447 -191 -1265 1910 633 -1134 1798 807 -1681 1838 1408
2645 1408 -1490 1248 1671 -1677 299 1507 -1253 -647 1812 -1861 -1318 1898 -1156 -1976 1621 -496
2661 -496 -2232 955 -253 -1542 1102 158 -2027 1230 1182 -1645 540 2323 -1023 114 2222 -1153
2677 -1153 260 2723 -660 -723 2280 92 -1281 1489 391 -1196 1229 -514 -1991 1733 427
2692 427 -2763 219 1142 -2260 -1009 988 -1663 -703 866 -1619 -548 2004 -1073 -1198 2035 -363
2708 -363 -934 1952 723 -764 2574 878 -1646 1671 1926 -1744 565 2141 -1005 -64 1290 -1119
2724 -1119 -198 1330 -1386 -992 1290 -1215 -1926 1572 -424 -2380 1109 246 -2245 713 862 -1946
2740 -1946 135 1032 -1781 577 1665 -1060 320 2002 -1106 156 2661 -745 -707 2473 -25 -1759
2756 -1759 2003 720 -1864 603 665 -1818 58 603 -1846 89 123 -2318 213 1195 -2471 -680
2772 -680 1764 -1423 -1423 1914 -454 -1845 1701 257 -1002 1609 789 -1275 1497 888 -1196 1582
2788 1582 1528 -1882 831 1830 -1916 94 2442 -1105 -1099 1686 -327 -1585 466 -629 -1160 983 -772
2805 -772 -1873 1423 479 -2503 734 686 -2192 515 1237 -1327 60 2050 -1372 -632 2191 64
2821 64 -382 1924 -162 -419 1703 -524 -691 2360 -27 -2286 1658 848 -2249 -151 1429 -1534
2837 -1534 -217 706 -1795 -263 1061 -1612 -771 1302 -1214 -993 1465 -929 -1339 2238 -65 -1573
2853 -1573 2360 960 -1481 952 1627 -1185 909 1693 -607 507 1339 -1349 -114 1671 -1139 -710
2869 -710 1591 -1131 -1865 1655 -490 -2395 811 -166 -2313 434 532 -1761 226 494 -1738 365
2885 365 1245 -1346 547 1827 -1628 -352 2488 -612 -804 2473 578 -1186 1542 862 -923 1607
2901 1607 440 -1347 1102 523 -1854 1037 948 -2356 -412 1611 -1730 -819 1595 -1476 -1101 1310
2917 1310 -869 -1228 1270 -230 -1465 1412 261 -1335 1518 976 -1336 1540 1082 -1551 1145 1907
2933 1907 -1238 -33 2396 -1125 -1017 1733 -261 -939 982 -794 -1463 1243 -222 -2054 900 112
2949 112 -2383 729 288 -2137 214 1031 -1710 -195 1449 -870 -288 1645 -1149 10 1932 -766
2965 -766 -373 2723 -674 -1496 2365 766 -1482 1246 861 -1685 741 813 -1801 260 1121 -1957 -911
2982 -911 1099 -1426 -976 1416 -1188 -1124 1141 -1251 -1549 1745 216 -1750 1460 926 -1257 1245
2998 1245 1148 -1024 793 1079 -999 571 1539 -938 263 2004 -1014 -640 2035 -615 -1300 1452
3014 1452 -516 -1473 1083 123 -1962 249 71 -1551 244 93 -1900 508 1127 -1998 -94 1886
3030 1886 -1328 -617 1805 -223 -539 1854 72 -840 1853 441 -825 1638 648 -1492 1127 702
3046 702 -1704 818 1166 -1707 50 1001 -1577 -766 1250 -1340 -815 1322 -889 -1404 1035 -637
3062 -637 -1238 1440 -13 -1267 1301 478 -1582 1256 1115 -1379 735 1762 -838 275 1907 -455
3078 -455 -141 1798 -876 -481 1455 -723 -1262 1577 -65 -1487 648 37 -1804 640 257 -2070
3094 -2070 298 677 -1945 -184 1192 -1452 -110 1331 -979 -436 1699 -637 -593 2000 -260 -938
3110 -938 1841 404 -1125 1553 828 -1369 975 1038 -1805 202 853 -1888 -231 1345 -1716 -535
3126 -535 850 -1498 -1082 1337 -945 -1552 1236 -255 -1650 943 -9 -1216 1197 514 -1462 1023
3142 1023 1395 -1341 462 1845 -845 301 1688 -392 -128 1489 -958 -660 1549 -494 -1245 1259
3158 1259 -100 -1872 674 253 -1724 554 872 -1753 -27 578 -1738 -297 1090 -1436 -605 1631
3174 1631 -791 -400 1855 -363 -839 1419 193 -835 1676 765 -1137 1610 924 -1361 728 1256
3190 1256 -1396 140 1177 -1138 -220 1063 -1279 -770 903 -1393 -1175 1477 -1005 -1727 991 -87
3206 -87 -1519 883 168 -1191 791 927 -1215 628 1434 -1008 637 1749 -907 126 1810 -432
3222 -432 -491 1566 -25 -953 1423 -198 -1260 1011 -230 -1706 1016 353 -1967 240 359 -1610
3238 -1610 -195 929 -1614 59 1179 -1265 -458 1675 -735 -996 1492 -129 -853 1453 533 -830
3254 -830 1331 296 -1019 1067 1040 -1130 775 910 -823 130 1128 -1128 -622 1060 -1139 -1057 1109
3271 1109 -851 -883 857 -753 -1336 555 -53 -1695 902 320 -1439 979 779 -851 488 1410 -668
3288 -668 244 1580 -921 65 1661 -502 -662 1597 -33 -1250 1536 123 -1051 921 136 -1335
3304 -1335 826 497 -1603 -25 780 -1384 -367 828 -1140 -520 1117 -906 -352 1172 -577 -798
3320 -798 1362 -141 -707 1649 496 -899 1100 798 -1133 771 851 -1198 504 816 -1086 201
3336 201 653 -1217 -610 1357 -853 -978 811 -807 -1376 586 -246 -1289 1035 -21 -1571 464
3352 464 1004 -1193 252 982 -956 307 1377 -445 254 1543 -733 -224 1675 -312 -577 1555
3368 1555 -248 -1162 939 134 -1484 858 387 -1390 84 465 -1402 -44 536 -1523 -193 1060
3384 1060 -1238 -468 1317 -847 -1138 1417 -483 -731 1578 25 -836 1200 662 -924 956 674
3400 674 -931 699 949 -1198 434 1421 -1116 -51 1257 -976 -758 931 -537 -1043 799 -711
3416 -711 -897 725 -473 -1359 603 436 -1180 612 824 -1475 702 1205 -1357 214 1680 -296
3432 -296 -102 1457 -208 -519 1254 -150 -415 1312 -378 -792 1317 228 -1382 524 597 -1657 161
3449 161 648 -1557 -408 968 -1121 -656 748 -1155 -615 776 -745 -484 1114 -523 -1074 1113
3465 1113 277 -1172 1140 890 -872 532 1269 -652 436 881 -924 294 1445 -853 -195 1288
3481 1288 -1104 -700 1284 -542 -1345 1019 -358 -1545 748 147 -1706 271 669 -1022 219 561
3497 561 -1019 288 884 -1308 133 1722 -827 -122 1617 -239 -495 1375 303 -676 1359 283
3513 283 -760 942 163 -1051 304 368 -1348 184 708 -1708 -410 881 -1576 -796 1063 -893
3529 -893 -977 941 -401 -1128 917 176 -1175 891 212 -957 1052 767 -1024 892 1222 -1033 636
3546 636 1628 -764 8 1496 -659 -697 880 -272 -447 674 -552 -1208 801 -461 -1046 786 -312
3563 -312 -1533 299 587 -1217 392 1169 -1234 -90 1026 -602 -218 1441 -82 68 1056 -554
3579 -554 20 1306 -120 -1149 1279 560 -1113 708 861 -1017 258 695 -1262 26 546 -1131
3595 -1131 -403 563 -1099 -446 992 -722 -815 1116 -194 -1502 918 -90 -764 702 728 -725 772
3612 772 641 -543 582 961 -730 69 1105 -642 83 1497 -1000 -504 1186 -622 -876 978 -197
3629 -197 -1441 34 172 -1134 196 91 -1307 374 71 -1049 52 1165 -1146 160 1124 -843
3645 -843 -242 1275 -103 -469 1461 204 -548 686 210 -658 610 458 -707 898 308 -1152 228
3662 228 638 -1533 76 1051 -1054 -901 437 -675 -944 707 -362 -625 476 -507 -937 774 15
3679 15 -1208 900 549 -916 831 1119 -672 411 1065 -569 226 948 -367 -32 1015 -417 -727
3696 -727 682 -441 -997 776 -388 -1341 525 -4 -1327 570 223 -1014 -215 691 -639 6 757
3713 757 -671 -12 852 -502 -150 1227 -372 -617 1613 371 -339 1281 204 -862 906 505 -839
3730 -839 545 683 -1267 -72 588 -889 -195 431 -851 -348 501 -615 -844 909 -229 -1210 573
3747 573 -194 -759 728 176 -675 737 689 -721 463 913 -978 302 824 -361 252 1265 -614
3764 -614 -148 1253 -146 -616 1144 -255 -687 565 -248 -998 569 208 -1148 435 37 -1030 -84
3781 -84 695 -1066 57 1002 -714 -474 956 -436 -310 1061 197 -360 952 433 -546 733 543 -563
3799 -563 930 839 -983 615 727 -1052 59 672 -551 -251 656 -750 -562 690 -787 -791 555 -100
3817 -100 -872 677 -304 -914 729 392 -990 460 888 -956 675 764 -385 335 1035 -916 210
3834 210 1230 -243 -213 1048 -105 -723 849 -101 -789 779 118 -757 441 -10 -1059 125 514
3851 514 -903 -179 705 -808 -330 692 -598 -275 1027 -199 -472 922 125 -263 954 539 -488
3868 -488 894 632 -698 554 600 -679 170 752 -293 -2 790 -987 -422 669 -494 -729 482
3885 482 -680 -917 506 46 -978 603 -67 -1257 362 651 -991 423 514 -915 635 827 -354
3902 -354 3 1103 -169 -337 1278 -54 -454 937 -282 -720 630 60 -908 415 82 -806 354
3919 354 415 -947 136 386 -1258 -357 808 -721 -399 910 -329 -564 850 -223 -610 743 22
3936 22 -391 738 450 -462 819 764 -724 526 678 -494 79 801 -866 -240 985 -512 -697 381
3954 381 -703 -1343 625 -293 -560 160 -140 -766 595 196 -924 333 453 -827 -59 659 -726 224
3972 224 1136 -559 58 952 -239 -556 888 -316 -596 1189 -141 -956 754 245 -1115 333 269
3989 269 -1175 -94 334 -992 77 335 -799 -176 801 -793 -567 803 -129 -283 819 -202 -853
4006 -853 777 363 -468 614 474 -624 746 576 -490 265 555 -922 167 781 -663 -492 791
4023 791 -377 -556 594 -523 -733 355 -276 -1053 909 -229 -861 360 149 -1111 243 942 -1015
4040 -1015 371 1131 -609 24 615 -313 -81 970 53 -421 1077 -179 -775 1117 -84 -788 577
4057 577 234 -1142 230 312 -1233 -60 731 -633 -96 424 -781 -562 618 -553 -479 877 -319
4074 -319 -529 745 -140 -1121 830 354 -635 467 363 -391 479 721 -659 326 791 -424 112 786
4092 786 -525 -117 739 -786 -669 300 -463 -733 254 -373 -1143 451 249 -995 318 398 -928 -189
4110 -189 349 -817 364 893 -725 186 866 -509 -301 1066 145 -452 982 154 -594 636 593 -670
4128 -670 499 452 -784 591 182 -861 -100 375 -1136 -407 582 -881 -572 609 -532 -653 762
4145 762 -363 -601 834 189 -822 605 367 -642 765 862 -812 448 693 -700 76 856 -665
4162 -665 -205 427 -343 -726 254 -530 -544 776 -250 -488 781 -37 -889 708 159 -1174 144 649
4180 649 -708 430 1075 -557 -141 824 -345 -242 798 -37 -230 989 -191 -389 757 -140 -580
4197 -580 931 315 -741 588 535 -783 404 718 -747 288 377 -1013 -310 267 -652 -498 472 -479
4215 -479 -820 827 -275 -594 559 -90 -927 398 313 -444 370 806 -438 58 874 -483 499 842
4233 842 -567 -245 799 -274 -576 1017 -252 -820 505 -247 -816 180 -144 -597 188 201 -759 20
4251 20 328 -754 20 672 -712 -87 911 -285 -272 842 27 -610 928 306 -274 797 284 -211 621
4270 621 -63 -501 441 533 -929 300 572 -826 -153 260 -705 -562 458 -384 -432 871 -227 -622 397
4289 397 -292 -601 601 282 -845 313 532 -779 548 915 -209 332 1029 -209 -259 733 -160 -266
4307 -266 859 -390 -561 783 -61 -800 540 267 -819 612 158 -1043 63 382 -858 95 587
4324 587 -797 -214 403 -406 -107 692 -391 -159 1145 -41 -643 815 85 -691 908 214 -925 159
4342 159 446 -777 446 684 -381 90 439 -567 -59 360 -714 -172 803 -675 -800 487 -14 -1059
4360 -1059 544 166 -727 284 235 -757 567 654 -264 387 737 -615 151 976 -558 -372 695 -397
4378 -397 -585 929 -21 -728 346 -68 -464 372 192 -689 272 129 -663 -26 92 -836 -50 611 -856
4397 -856 -60 547 -167 -382 860 -3 -216 675 -30 -76 1148 114 -488 594 226 -700 490 534 -606
4416 -606 303 276 -846 57 637 -317 -244 671 -479 -728 593 -192 -424 309 -139 -818 816 -43 -856
4435 -856 432 360 -904 270 304 -385 359 614 -475 -241 582 -527 -303 837 -29 -631 848 -277
4453 -277 -173 511 217 -782 523 186 -957 -163 607 -730 -176 345 -518 -225 386 -564 37 653 -414
4472 -414 -355 514 73 -311 855 -7 -250 596 508 -595 359 564 -697 450 979 -378 -16 521 -480
4491 -480 24 593 -956 -480 615 -531 -585 424 -143 -508 367 -26 -873 309 335 -576 216 123 -637
4510 -637 105 720 -529 -102 590 -507 27 717 -183 -72 729 37 -512 556 140 -620 618 -26 -848
4529 -848 329 269 -1063 -34 223 -780 68 366 -626 -24 568 -322 -492 587 -221 -236 657 -38 -547
4548 -547 734 149 -495 505 399 -363 486 461 -456 68 246 -490 4 476 -372 -231 580 -311 -264 554
4568 554 -414 -512 722 -125 -513 564 54 -836 36 267 -363 519 405 -387 133 448 -636 221 745
4587 745 -252 -67 810 -322 -314 565 151 -494 624 110 -827 641 164 -1005 196 65 -936 -353 54
4606 54 -1152 -377 737 -741 -190 748 -364 -752 823 -279 -639 324 -59 -309 1041 377 -422 474
4624 474 650 -548 499 698 -513 375 672 -323 -52 926 -286 -92 662 -250 -202 554 -522 -927 423
4643 423 -27 -728 402 328 -654 292 161 -790 530 521 -804 -179 630 -597 -3 795 -266 -473 667
4662 667 -23 -129 485 111 -372 491 80 -630 411 526 -660 201 766 -839 -53 777 -684 0 377
4681 377 -247 131 380 -543 -404 615 -41 -360 692 -37 -601 603 486 -605 589 723 -390 150
4699 150 571 -375 164 861 -376 -328 747 -239 -521 750 -462 -701 442 -46 -688 252 176 -558 74
4718 74 186 -659 116 388 -770 -202 555 -670 9 421 -52 -114 693 -125 -442 857 92 -356 457 42
4738 42 -479 286 211 -313 404 286 -321 282 651 -576 -176 310 -801 -273 338 -580 -425 376 -88 -554
4758 -554 642 -198 -685 614 527 -607 267 416 -415 144 713 -449 -19 471 -671 76 829 -241
4776 -241 12 424 116 -542 752 -6 -610 342 170 -574 391 211 -704 23 449 -646 34 496 -508
4795 -508 -12 942 -306 103 778 -110 -60 581 134 -505 795 360 -325 482 303 -262 490 214 -581 282
4815 282 300 -515 -333 104 -271 -20 399 -523 -307 557 -546 -402 497 -260 -254 266 -102 -668 526 -52
4835 -52 -55 381 326 -308 365 483 -246 323 412 -438 -26 864 -197 -502 669 -248 -449 592 -73 -404 -98
4856 -98 188 -569 145 120 -338 159 262 -366 -206 424 -419 -53 253 -416 -308 516 -172 -199 945 122 -231
4877 -231 523 158 -208 473 253 -644 210 297 -416 173 184 -436 0 407 -707 -593 327 -335 -236 218 107
4898 107 -304 117 -339 -418 424 111 -420 447 -37 -481 60 558 -701 57 398 -189 -150 714 -183 3
4918 3 922 -46 -32 233 -114 -234 396 34 -381 372 -156 -924 400 300 -433 -169 237 -477 -269 363 -235
4939 -235 -163 491 -309 -71 376 132 -289 751 -30 -491 740 151 -538 525 47 -324 210 247 -289 128
4959 128 412 -476 -122 47 118 -216 412 -561 -321 277 -306 -742 340 -141 -644 111 70 -393 309 411
4979 411 -616 190 365 -245 -16 600 -288 -3 604 -524 -393 713 -177 51 394 94 -423 306 -307
4998 -307 -590 123 85 -588 -146 76 -809 -63 39 -662 -34 685 -348 -175 600 -411 -27 504 134 -358
5018 -358 398 139 -644 553 146 -169 607 -72 -714 181 409 -415 32 462 -333 -312 362 -129 -515 298
5038 298 -168 -761 453 -209 -322 404 134 -389 514 130 -586 105 556 -418 188 467 -229 136 643 -106
5058 -106 -146 556 -149 186 703 61 -648 382 -551 -232 139 12 -768 280 101 -697 137 57 -500 -99
5078 -99 430 -396 -153 56 -477 -285 250 -262 -79 581 31 70 271 326 -552 233 136 -130 123 324 -279
5099 -279 164 687 -444 85 314 -370 -355 111 -300 -195 335 -414 -642 120 307 -463 307 272 -456 85
5119 85 402 -280 14 168 -361 142 363 -357 63 571 -132 -23 530 -204 -357 459 90 -380 323 76
5139 76 -404 461 274 -480 -82 154 -484 -118 497 -640 -187 248 -324 -303 241 -399 -159 553 52 -423
5159 -423 485 68 -141 734 381 -248 511 167 -194 253 425 -11 52 275 -256 -25 683 -244 -123 452
5179 452 -242 -327 259 -151 -731 92 -282 -413 47 153 -513 -1 341 -346 -275 410 -465 198 414 -130 -9
5200 -9 448 -203 28 635 62 -493 339 59 -478 416 167 -301 153 76 -49 180 436 -403 -35 261 -653
5221 -653 -323 90 -204 -174 208 -319 -192 390 2 126 521 106 -548 356 216 -103 80 369 -387 178
5241 178 463 -77 13 467 -227 -172 293 -242 -226 584 6 -378 464 164 -237 463 -123 -492 -38 -37 -301 81
5263 81 87 -510 34 337 -33 -186 614 -215 -229 371 -75 69 251 -14 -190 220 -19 -190 28 152 -208
5284 -208 153 374 -582 305 430 -321 -131 415 -673 -129 233 -341 -338 493 -272 -444 347 -117 -486 268
5304 268 275 -213 223 338 -260 206 505 -84 65 467 -137 -26 531 -159 -334 579 -112 -340 606 -225 -457
5325 -457 -12 62 -697 -56 255 -228 168 451 -797 -132 211 -258 -161 377 -164 -134 580 -200 -236 605 48
5346 48 -275 245 213 -555 200 320 -646 66 168 -392 253 365 -524 104 -94 -124 -433 443 -77 -314 331
5367 331 -233 -221 282 -175 -487 19 211 -598 231 351 -331 223 326 -30 74 683 -188 18 114 -99 -135
5388 -135 484 -608 -430 342 34 -247 74 23 -156 429 -161 -612 90 339 -329 -187 206 -443 -54 523
5408 523 -332 219 409 -408 -147 599 -174 -105 536 242 -231 390 410 -129 565 43 -344 303 356 -523 98
5429 98 318 -575 134 324 -91 -646 309 -278 105 157 -289 -131 123 -58 -204 188 144 -163 88 259 -502
5450 -502 40 472 -168 50 689 -16 -58 691 -269 -73 634 -114 -428 271 -61 -318 558 -283 -550 78
5470 78 -218 -339 -223 127 -197 113 261 -288 64 383 -440 -154 404 -34 -8 543 -171 -383 533 236 -576
5491 -576 501 198 56 204 92 -233 270 464 -538 -413 328 -474 85 338 -297 -541 407 -297 -228 156
5511 156 -341 -249 39 -78 -145 286 14 -494 355 122 -468 144 568 -215 114 635 -471 -266 324 15
5531 15 -255 412 277 -550 302 34 -287 139 213 -500 272 33 -528 13 215 -523 -333 9 -411 -194 248
5552 248 41 -113 30 -132 176 447 -78 -466 461 388 -261 201 343 -468 152 268 -342 199 362 -231
5572 -231 -105 537 -177 -254 255 -162 -298 40 -242 -655 320 552 -229 -148 366 -641 -105 13 -515 177
5592 177 221 -163 -187 352 -345 11 287 -516 -277 370 -126 -36 326 -319 -441 445 258 -521 125 153 -41
5613 -41 68 151 -404 -91 -44 -375 -157 18 -420 -360 442 -187 -164 447 167 -365 540 269 -108 247 227 -170
5635 -170 -9 524 -389 17 476 -221 -33 207 -775 -106 294 -224 -493 524 -308 -480 384 142 -809 318
5655 318 3 -525 110 312 -379 157 324 -157 413 347 99 -179 319 -205 -32 380 -263 -276 719 -114 53
5676 53 240 -103 -146 560 415 -853 64 454 -599 75 269 -290 -88 135 -465 -62 412 -153 -107 358
5696 358 -143 -280 285 -8 13 162 182 -336 279 296 -338 -97 399 -505 -379 269 -150 185 386 -73 -1
5717 -1 195 70 -86 237 -415 -545 461 27 -495 254 13 -461 4 98 -612 23 -94 -356 93 485 -152
5738 -152 -208 257 -173 94 495 -197 -373 692 -118 -237 327 401 -47 429 21 -158 141 -242 -574 -290
5758 -290 160 -276 33 574 -445 -266 172 -42 -14 85 -167 -513 493 -13 -221 556 10 -477 344 245
5778 245 -31 8 375 -366 98 551 -351 -169 182 -233 -155 317 35 -319 294 -247 -194 203 163 -649 11
5799 11 412 -332 146 278 -331 -131 505 -245 -1 374 -174 -366 400 46 -349 292 -121 -380 559 210
5819 210 -194 462 17 -525 319 18 -406 -145 359 -363 62 42 -444 -172 300 -87 -56 489 -237 -322 219
5840 219 -109 -259 132 65 -558 350 455 -352 270 475 -73 159 370 -251 -304 295 54 -139 779 -407
5860 -407 -247 338 -338 -204 350 -106 -523 -177 54 -233 -30 -37 -226 -104 156 -499 -222 199 -185 27 288
5881 288 196 -85 255 -127 -158 352 -88 51 208 63 60 414 122 -254 347 294 -316 -37 185 -466 -83 38
5903 38 -226 19 167 -36 -320 453 251 -190 50 190 -156 293 -196 -221 -70 220 -417 42 567 -254 184
5924 184 196 -254 136 580 -154 -262 309 -82 -333 297 51 -487 56 -84 -557 368 292 -420 226 447 -252
5945 -252 27 331 -166 107 158 -288 -144 265 66 -260 317 70 -153 402 150 -348 187 91 -512 493
5965 493 128 -280 333 216 -156 -157 62 -583 -130 589 -420 -351 360 -295 -162 126 50 -481 378 -153 -429
5986 -429 153 234 -501 155 199 -253 -211 673 -166 -238 -37 -140 -219 402 -127 -230 237 172 -123 374 101 -620
6008 -620 403 34 -243 350 304 -487 15 247 -422 -152 419 -505 -148 125 -285 -311 265 31 -228 455
6028 455 261 -69 289 288 -203 280 202 -326 -1 490 -360 221 314 -310 -70 326 -315 -177 298 -155 -489
6049 -489 605 -141 -334 42 -103 -263 249 60 -215 270 285 -198 268 477 -208 -54 302 -238 -98 554
6069 554 -25 -100 302 85 -308 300 -79 -320 -199 -125 -368 172 -121 -259 183 -190 -504 72 444 -280 -178
6090 -178 577 -184 52 72 -239 -287 377 267 -240 261 -128 224 408 -101 -367 320 257 -94 442 -99 -246
6111 -246 -39 390 -157 -212 250 -422 -217 196 -33 -262 327 -13 34 212 122 -219 313 297 -464 226 -51
6132 -51 -133 376 421 -570 191 512 95 -467 579 -166 -20 325 58 -206 235 241 -335 244 51 -403 316
6153 316 305 -338 -178 328 -371 -129 255 -185 -58 347 -255 -195 276 -164 -269 413 217 -87 293 169 35
6174 35 246 368 -329 329 413 -79 121 406 -306 199 646 -383 -109 444 -312 -364 275 249 -135 277 -129
6195 -129 -314 131 -163 -390 51 538 -161 98 319 -354 207 127 -227 201 381 82 45 158 -145 -7 164
6216 164 -279 -200 396 -79 -251 250 270 -322 201 103 -425 93 356 -135 -203 386 -601 -152 504 -223 -124 376
6238 376 -157 -284 209 -193 -379 131 152 -319 -104 121 -668 208 260 -349 85 138 -262 102 392 -352 -167
6259 -167 571 -180 -381 353 217 -212 -147 282 -605 268 46 -79 226 -6 -67 -77 78 -381 -116 325 -146
6280 -146 -307 458 123 -245 470 304 -127 176 -87 -217 139 293 -486 329 -112 -200 292 196 -220 -417 285
6301 285 -583 -225 322 -252 -445 275 -56 -131 408 -266 -52 309 326 -459 383 -35 -252 73 84 -218 302
6322 302 450 47 178 306 -81 -228 399 -333 -398 -13 17 -472 69 -194 -468 174 -54 -367 -33 161 -279
6343 -279 -183 277 -150 -57 246 -87 -358 266 -158 46 267 -45 62 393 163 -123 334 79 -264 -57 466
6364 466 -286 233 -52 -70 130 220 25 30 159 -131 -17 319 -217 -255 100 -182 -531 196 115 -351 159 -89
6386 -89 -342 189 174 -152 156 97 -207 -27 250 -237 133 274 -175 -17 376 310 -172 75 -309 -234 86 15
6408 15 -489 83 352 -329 162 -45 -454 -76 -53 -339 -90 290 -407 -5 235 -169 -355 546 -170 -435 309
6429 309 129 -69 401 162 -168 -118 398 -271 -21 352 49 204 137 -485 -190 267 -81 -35 319 -342 37
6450 37 296 -389 -252 62 -114 -334 68 34 188 95 399 -459 232 424 -177 -194 184 -397 -117 228 -39
6471 -39 -111 188 -13 -231 114 248 -338 87 234 -676 113 196 -183 123 12 -232 -267 507 -449 -158 61
6492 61 101 -170 96 227 -120 364 -146 -130 480 420 -302 64 121 -224 165 291 -113 35 205 -148 -71 246
6514 246 -342 88 295 -249 -272 237 -165 -48 260 -121 -281 154 47 -387 151 327 -233 180 507 -160
6534 -160 -24 348 135 -11 115 -216 43 451 83 -44 309 378 -365 240 31 -371 25 200 -177 -207 -8
6555 -8 -397 201 253 -262 -84 397 -372 -179 -14 -147 76 324 81 -40 312 -210 141 359 82 -144 -114
6576 -114 148 -208 89 396 -112 175 467 -131 248 294 -69 -299 339 48 -105 176 -241 -354 65 -66
6596 -66 -297 226 -203 -446 47 444 -243 7 366 -185 -199 381 -401 -101 216 31 -49 435 54 200 156
6617 156 -94 -579 113 151 -371 407 186 -508 -46 -4 -532 65 404 -213 -302 297 -66 -115 340 -150 -391
6638 -391 132 135 -251 55 268 -91 60 -15 -585 248 -110 -100 387 -2 63 41 525 -128 -27 303 -119 -130
6660 -130 285 -345 -82 325 31 -257 -160 -187 -422 -23 -30 -121 39 447 -494 200 483 -176 13 180 -56 -62
6682 -62 544 342 -173 370 3 -371 596 -184 -359 255 -90 -304 213 455 -420 28 -8 -385 74 198 -232
6703 -232 -213 385 -119 -103 298 -265 -256 28 -43 -129 240 206 -366 224 351 -213 177 -1 -270 160 217 -340 16
6726 16 194 -52 -229 87 -15 -378 139 -144 -210 103 -234 -62 -444 254 -317 -113 191 -229 -22 164 55
6747 55 10 175 -218 -133 468 -160 90 -85 -122 -191 323 212 -125 234 187 -702 -71 -36 -44 229 429 -106 100
6770 100 -11 -83 -49 184 -417 -163 299 -173 -28 195 -136 -424 87 -175 -320 393 -23 34 127 77 -315 213
6792 213 348 -162 75 290 -22 -81 272 -147 -125 472 229 -534 19 95 -226 324 -148 -328 -65 -284 -272
6813 -272 -175 226 -578 142 262 -40 -183 207 -528 -150 118 -157 -332 186 182 -136 -133 -36 -35 240 362 -146 452
6836 452 -81 -380 -69 -4 -272 -271 229 -210 -356 -298 -148 -249 163 -428 -422 290 -287 -392 1 105 -388 112
6858 112 13 -14 116 327 -488 171 248 -128 -109 196 -309 -197 251 61 -347 223 -24 -229 112 58 -52 131
6880 131 83 -393 270 54 -295 100 188 -360 -107 56 -489 -257 402 108 -60 317 71 -370 354 8 -407
6901 -407 247 27 -422 69 -77 -545 -74 230 -147 -233 282 -397 -218 -129 -478 -42 -21 -315 -207 -3 -32
6922 -32 -389 186 -57 -92 -58 160 -244 262 -215 14 69 -92 13 282 -98 -206 86 163 -204 0 289 26
6944 26 -58 130 138 -499 58 -123 -499 249 203 -462 99 82 -234 291 20 -281 -257 88 125 100 290 -280 -357
6967 -357 260 -59 -265 313 37 15 190 107 4 15 407 -224 156 76 -293 -439 -64 -216 -227 197 -313 -142
6989 -142 196 -49 -303 267 -28 -366 -34 204 -380 211 -16 25 -30 173 -180 421 200 -225 -107 272 -149
7010 -149 131 342 -241 -35 358 103 -128 114 -13 -232 110 -133 -142 183 85 -180 144 6 -503 -53 363
7031 363 -52 -110 234 -428 -166 125 -206 -157 613 96 -102 220 10 -312 146 287 -6 203 144 -404 -47
7052 -47 122 -378 52 363 -198 -320 286 -220 -294 45 -199 -59 258 -132 -265 174 338 -360 113 219 -11
7073 -11 -90 30 -101 63 95 -334 205 375 226 -136 443 -271 -211 301 -111 -429 45 395 -347 217 105
7094 105 -243 9 -110 -585 -166 78 -207 -309 63 17 -212 149 148 -260 231 -74 -163 321 282 -185 348 508
7116 508 -463 616 224 -127 -148 209 -377 -19 252 -274 -98 154 -115 -240 184 -197 -383 115 -610 -265
7136 -265 349 -46 29 241 51 -144 223 171 180 64 135 -21 249 590 -38 -160 156 44 31 443 -3 -46
7158 -46 203 76 -67 -116 21 -299 207 93 -249 191 121 -317 -304 432 -164 -46 251 -71 177 249 153 -43
7180 -43 229 -242 -27 220 -73 -424 392 208 -255 400 62 -529 -190 307 -126 -86 376 -201 -117 386 47
7201 47 -264 262 -231 -297 145 174 -317 113 43 -114 91 74 -330 -4 348 -29 111 144 30 -245 378 -375
7223 -375 -60 368 -200 -18 141 161 -65 249 -190 170 25 -92 -143 96 256 -238 -185 330 -304 -284 -37
7244 -37 -390 -36 410 -261 -150 201 20 12 309 173 -252 179 -442 -272 204 11 -420 318 235 -132 68
7265 68 427 -102 12 152 -74 -322 421 -138 11 302 -276 -404 70 70 -401 304 -111 -85 -115 337 -189 44
7287 44 125 -109 -140 154 -88 -186 209 -126 -21 312 -7 -492 265 165 -203 221 58 -75 318 -79 -312
7308 -312 237 67 -309 -84 37 139 -123 299 -185 -146 226 -284 11 288 -19 -78 254 195 -176 108 22
7329 22 -28 274 78 -130 -39 540 -144 -127 229 -318 -230 234 133 -170 396 -55 -462 -85 97 -94 0 -166
7351 -166 -289 -37 -147 -508 -28 388 -217 207 185 -481 45 253 91 -240 277 -89 -319 260 43 132 262
7372 262 101 -26 269 -180 -403 -139 105 -6 25 -77 -418 -192 42 -228 52 22 -180 14 -3 -468 -36
7393 -36 169 17 -170 210 212 -312 -41 291 -258 24 315 -86 62 20 -185 318 434 23 -124 293 -390
7414 -390 -63 296 -128 -225 233 -35 -171 187 110 -187 153 106 -361 -264 214 43 -110 -73 61 -213 288 -53
7436 -53 37 297 108 181 370 -118 -306 407 15 -129 325 111 -9 99 51 -417 -155 235 -287 49 -48 -387
7458 -387 62 139 55 -158 175 -73 -135 115 -15 -34 -85 473 -68 501 145 -141 -88 173 1 -17 235 -379
7480 -379 -60 355 -310 -319 285 -336 -269 307 -322 -454 19 27 -211 -128 70 -463 -101 387 -241 23 121 -267
7502 -267 -62 291 -204 -160 369 -163 -12 465 92 -196 470 274 -338 187 -132 -272 199 85 -296 -96
7522 -96 142 -266 -62 142 62 -221 382 -43 -260 281 -197 -345 210 60 -344 5 -278 -126 250 -30 -423
7543 -423 109 183 -115 -2 273 -76 94 567 150 164 240 263 9 227 -323 -65 118 -58 -72 8 312 -79
7565 -79 148 -132 75 -76 190 -81 64 80 -325 113 -9 -269 -83 61 -269 -293 414 53 -106 313 176
7586 176 -177 424 13 -235 -16 90 -191 145 61 -572 -87 271 -47 -172 254 -362 -406 142 -78 -266 -8
7607 -8 55 -142 262 274 -312 345 -255 -178 385 202 -241 56 136 -24 -141 -46 -240 100 204 126 3 15 -183
7630 -183 -81 320 28 -474 -15 89 -212 -133 41 -296 -37 132 -182 -7 591 -240 -172 397 -61 15 351
7651 351 -108 149 59 -72 19 204 379 -372 67 254 -177 39 149 -167 18 59 -547 61 281 -490 -230
7672 -230 197 5 -96 184 120 -350 131 101 -586 171 123 -285 298 1 -490 -256 186 -203 -91 236 -171
7693 -171 -39 316 88 50 358 -44 25 291 132 -255 245 62 -230 33 69 -75 -144 46 -310 -105 -50 -175
7715 -175 26 161 -42 -114 68 31 -266 391 171 -199 348 115 -94 309 338 -345 50 -111 -69 -60 56 -159
7737 -159 49 -39 -419 192 -28 -36 -70 -95 -168 -171 402 -84 -159 161 169 -285 -206 95 -562 -257 -68 248 -172 340
7761 340 -28 -106 242 -149 -225 403 146 -218 404 106 -60 55 33 -553 79 107 -379 155 208 -467 -74 226
7783 226 -18 373 -6 -15 2 239 -364 3 151 -132 -282 84 258 -131 394 29 -26 170 482 -319 -93
7804 -93 252 -158 217 136 -211 -239 79 -391 125 66 -90 -144 235 -321 -383 276 222 -202 160 311 -217 440
7826 440 231 90 253 454 104 42 240 -205 -141 262 53 -188 143 48 20 535 16 -241 194 138 -285 158
7848 158 345 -287 92 274 -197 -30 359 -198 -241 534 -25 242 434 -289 -38 42 -59 57 184 -5 -275
7869 -275 386 26 -255 330 195 -66 -207 106 -245 -137 381 -200 -430 137 -47 59 -126 151 -58 57
7889 57 -42 -410 164 66 -98 68 34 -263 94 -238 -132 19 81 375 -20 -105 -314 -17 454 -78 135 -46
7911 -46 76 -38 38 -17 -298 182 -201 -304 77 40 -288 241 8 -476 -37 36 -195 99 307 98 -224 157
7933 157 224 -278 176 -300 -323 25 70 -129 290 195 -247 -128 224 -52 35 234 -88 50 340 167 -31 -55
7955 -55 49 -374 137 -182 -299 192 -81 -331 319 48 -243 22 180 117 -62 -173 13 -22 246 -237 102
7976 102 237 -239 20 268 -41 -245 280 40 -66 20 170 9 165 -35 16 5 63 253 -52 98 -88
7997 -88 -102 248 133 -275 27 -139 -5 456 -269 -263 73 -77 48 362 267 131 258 213 256 -55 208 -10
8019 -10 39 461 -244 -236 189 -236 148 159 -75 -206 136 45 -211 1 -39 -405 63 292 -59 438 203 -311
8041 -311 241 396 140 141 114 -73 103 220 -35 -6 119 244 139 360 -256 -58 42 -50 -288 395 142 -298
8063 -298 30 -43 -59 -200 -97 -3 10 -305 -166 -10 407 -23 -208 562 337 -130 146 -168 -246 446 190 -314
8085 -314 190 -10 -379 -114 391 -156 -104 546 24 -6 367 -145 41 148 -19 -114 439 -40 -444 256 63
8106 63 -52 -79 20 -228 215 99 -41 -323 -166 -214 3 206 -195 135 -2 214 -19 356 -14 -57 293 141
8128 141 -12 145 -228 -198 65 148 -534 -115 84 -458 -139 47 -124 -143 340 -487 -25 181 -270 -422 321
8149 321 43 -367 230 -360 -113 -91 -160 -368 -6 129 -68 -10 -8 78 -102 -60 -63 68 135 -512 -19 171 2
8172 2 -167 128 -86 -312 238 42 -320 -171 151 -392 -28 310 -534 -264 110 -262 69 171 -31
8191c1
##END NTUPLES=NMR FID
##END=
