##TITLE=1H_Pr Gln-Am-2
 CDCl3,8 sc, 
 11.4.2019
##JCAMPDX= 6.0         $$ Bruker NMR JCAMP-DX V2.0
##DATA TYPE= NMR FID
##DATA CLASS= NTUPLES
##ORIGIN= UXNMR, Bruker Analytische Messtechnik GmbH
##OWNER= root
$$ XWIN-NMR		Version 3.5
$$ Thu Apr 11 16:02:33 2019 Russian Standard Time (UT+4h)  she@DPX200
##.OBSERVE FREQUENCY= 200.1315
##.OBSERVE NUCLEUS= ^1H
##.DELAY= (6, 6)
##.ACQUISITION MODE= SIMULTANEOUS
##.ACQUISITION SCHEME= undefined
##.AVERAGES= 8
##.DIGITISER RES= 18
##SPECTROMETER/DATA SYSTEM= spect
##.PULSE SEQUENCE= zg30
##.SOLVENT NAME= CDCl3
##.SHIFT REFERENCE= (INTERNAL, CDCl3, 0, 15.7039)
##AUDIT TRAIL= $$ (NUMBER, WHEN, WHO, WHERE, WHAT)
$$ ##TITLE= Audit trail, XWIN-NMR		Version 3.5
$$ ##JCAMPDX= 5.01
$$ ##ORIGIN= Bruker BioSpin GmbH
$$ ##OWNER= she
$$ F:/spectra/data/she/nmr/H-F/1/audita.txt
$$ ##AUDIT TRAIL=  $$ (NUMBER, WHEN, WHO, WHERE, WHAT)
(   1,<2019-04-11 16:01:11.15 +0400>,<she>,<DPX200>,
      <created by zg, POWCHK disabled, PULCHK disabled
       configuration hash MD5:
       00 E9 B6 7A A2 85 ED C7 34 08 36 98 17 FE 4E 26
       data hash MD5: 16K
       E4 5D 36 C5 AF 09 21 EA 10 D1 FF 0F F0 23 7E 64>)
$$ ##END=
$$ 
$$ hash MD5
$$ 27 F5 D1 C4 2F 86 8B 4A 2A 5A 18 D9 B5 AC 7C 54
##$RELAX= 
##$RELAX= 
##$RELAX= 
##$RELAX= 
##$RELAX= 
##$RELAX= 
$$ Bruker specific parameters
$$ --------------------------
##$DU= <F:/spectra>
##$EXPNO= 1
##$NAME= <H-F>
##$PROCNO= 1
##$TYPE= <nmr>
##$USER= <she>
##$AMP= (0..31)
100 100 100 100 100 100 100 100 100 100 100 100 100 100 100 100 100 100 
100 100 100 100 100 100 100 100 100 100 100 100 100 100 
##$AQSEQ= 0
##$AQ_mod= 1
##$AUNM= <au_zg>
##$AUTOPOS= <>
##$BF1= 200.13
##$BF2= 200.13
##$BF3= 200.13
##$BF4= 200.13
##$BF5= 200.13
##$BF6= 200.13
##$BF7= 200.13
##$BF8= 200.13
##$BYTORDA= 1
##$CFDGTYP= 0
##$CFRGTYP= 5
##$CHEMSTR= <none>
##$CNST= (0..31)
1 1 145 1 1 1 1 1 1 1 1 1 1 1 1 1 1 1 1 1 1 1 1 1 1 1 1 1 1 1 1 1 
##$CPDPRG= <>
##$CPDPRG1= <>
##$CPDPRG2= <>
##$CPDPRG3= <>
##$CPDPRG4= <mlev>
##$CPDPRG5= <mlev>
##$CPDPRG6= <mlev>
##$CPDPRG7= <mlev>
##$CPDPRG8= <mlev>
##$CPDPRGB= <>
##$CPDPRGT= <>
##$D= (0..31)
0 1.2 0 0 0 0 0 0 0 0 0 0.03 0 0 0 0 0 0 0 0 0 0 0 0 0 0 0 0 0 0 0 0 
##$DATE= 1554984070
##$DBL= (0..7)
120 120 120 120 120 120 120 120 
##$DBP= (0..7)
150 150 150 150 150 150 150 150 
##$DBP07= 0
##$DBPNAM0= <>
##$DBPNAM1= <>
##$DBPNAM2= <>
##$DBPNAM3= <>
##$DBPNAM4= <>
##$DBPNAM5= <>
##$DBPNAM6= <>
##$DBPNAM7= <>
##$DBPOAL= (0..7)
0.5 0.5 0.5 0.5 0.5 0.5 0.5 0.5 
##$DBPOFFS= (0..7)
0 0 0 0 0 0 0 0 
##$DE= 6
##$DECBNUC= <off>
##$DECIM= 24
##$DECNUC= <off>
##$DECSTAT= 4
##$DIGMOD= 1
##$DIGTYP= 9
##$DL= (0..7)
0 120 120 120 120 120 120 120 
##$DP= (0..7)
150 150 150 150 150 150 150 150 
##$DP07= 0
##$DPNAME0= <>
##$DPNAME1= <>
##$DPNAME2= <>
##$DPNAME3= <>
##$DPNAME4= <>
##$DPNAME5= <>
##$DPNAME6= <>
##$DPNAME7= <>
##$DPOAL= (0..7)
0.5 0.5 0.5 0.5 0.5 0.5 0.5 0.5 
##$DPOFFS= (0..7)
0 0 0 0 0 0 0 0 
##$DQDMODE= 0
##$DR= 18
##$DS= 0
##$DSLIST= <SSSSSSSSSSSSSSS>
##$DSPFIRM= 0
$$ [...]
##$SUBNAM2= <"">
##$SUBNAM3= <"">
##$SUBNAM4= <"">
##$SUBNAM5= <"">
##$SUBNAM6= <"">
##$SUBNAM7= <"">
##$SUBNAM8= <"">
##$SUBNAM9= <"">
##$SW= 24.9337058887773
##$SWIBOX= (0..15)
0 0 2 0 0 0 0 0 0 0 0 0 0 0 0 0 
##$SW_h= 4990.01996007984
##$TD= 16384
##$TD0= 1
##$TE= 0
##$TE2= 300
##$TE3= 300
##$TEG= 300
##$TL= (0..7)
0 120 120 120 120 120 120 120 
##$TP= (0..7)
150 150 150 150 150 150 150 150 
##$TP07= 0
##$TPNAME0= <>
##$TPNAME1= <>
##$TPNAME2= <>
##$TPNAME3= <>
##$TPNAME4= <>
##$TPNAME5= <>
##$TPNAME6= <>
##$TPNAME7= <>
##$TPOAL= (0..7)
0.5 0.5 0.5 0.5 0.5 0.5 0.5 0.5 
##$TPOFFS= (0..7)
0 0 0 0 0 0 0 0 
##$TUNHIN= 0
##$TUNHOUT= 0
##$TUNXOUT= 0
##$USERA1= <user>
##$USERA2= <user>
##$USERA3= <user>
##$USERA4= <user>
##$USERA5= <user>
##$V9= 5
##$VALIST= <valist>
##$VCLIST= <CCCCCCCCCCCCCCC>
##$VD= 0
##$VDLIST= <DDDDDDDDDDDDDDD>
##$VPLIST= <PPPPPPPPPPPPPPP>
##$VTLIST= <TTTTTTTTTTTTTTT>
##$WBST= 1024
##$WBSW= 4
##$XGAIN= (0..3)
0 0 0 0 
##$XL= 0
##$YL= 0
##$YMAX_a= 88565
##$YMIN_a= -138904
##$ZGOPTNS= <>
##$ZL1= 120
##$ZL2= 120
##$ZL3= 120
##$ZL4= 120
##$ABSF1= 10
##$ABSF2= 0
##$ABSG= 5
##$ABSL= 3
##$ALPHA= 0
##$AQORDER= 0
##$ASSFAC= 0
##$ASSFACI= 0
##$ASSFACX= 0
##$ASSWID= 0
##$AUNMP= <proc_1d>
##$AZFE= 0.1
##$AZFW= 0.1
##$BCFW= 1
##$BC_mod= 2
##$BYTORDP= 1
##$COROFFS= 0
##$CY= 11.3945322036743
##$DATMOD= 1
##$DC= 2
##$DFILT= <>
##$DTYPP= 0
##$F1P= 18.9103706918063
##$F2P= -1.10871071338519
##$FCOR= 0.5
##$FTSIZE= 0
##$FT_mod= 4
##$GAMMA= 1
##$GB= 0.15
##$INTBC= 1
##$INTSCL= 1
##$ISEN= 128
##$LB= 0.24
##$LEV0= 0
##$LPBIN= 0
##$MAXI= 10000
##$MC2= 0
##$MEAN= 0
##$ME_mod= 0
##$MI= 1.114404
##$NCOEF= 0
##$NC_proc= 0
##$NLEV= 6
##$NOISF1= 3.799351
##$NOISF2= 2.8
##$NSP= 1
##$NTH_PI= 0
##$NZP= 0
##$OFFSET= 15.70392
##$PC= 1
##$PHC0= -8855.986
##$PHC1= 19.40026
##$PH_mod= 1
##$PKNL= yes
##$PPARMOD= 0
##$PSCAL= 0
##$PSIGN= 0
##$REVERSE= no
##$SF= 200.130013532006
##$SI= 16384
##$SIGF1= 3
##$SIGF2= 2
##$SINO= 400
##$SIOLD= 16384
##$SREGLST= <1H.CDCl3>
##$SSB= 0
##$STSI= 0
##$STSR= 0
##$SW_p= 3612.71676300578
##$SYMM= 0
##$S_DEV= 0
##$TDeff= 0
##$TDoff= 0
##$TI= <>
##$TILT= no
##$TM1= 0
##$TM2= 0
##$TOPLEV= 0
##$USERP1= <user>
##$USERP2= <user>
##$USERP3= <user>
##$USERP4= <user>
##$USERP5= <user>
##$WDW= 1
##$XDIM= 8192
##$YMAX_p= 0
##$YMIN_p= 0
$$ End of Bruker specific parameters
$$ ---------------------------------
##NTUPLES= NMR FID
##VAR_NAME=  TIME,          FID/REAL,        FID/IMAG
##SYMBOL=    X,             R,               I
##VAR_TYPE=  INDEPENDENT,   DEPENDENT,       DEPENDENT
##VAR_FORM=  AFFN,          ASDF,            ASDF
##VAR_DIM=   8192,          8192,            8192
##UNITS=     SECONDS,       ARBITRARY UNITS, ARBITRARY UNITS
##FACTOR=    0.0002004,     1,               1
##FIRST=     0,             0,               0
##LAST=      1.6414764,     0,               0
##MIN=       0,             -138904,         0
##MAX=       1.6414764,     88565,           0
$$ Real data points
##PAGE= N=1
##DATA TABLE= (X++(R..R)), XYDATA
$$ plain form
0 0 0 0 0 0 0 0 0 0 8 -8 8 -8 16 -16 16 -24 25 -32 40 -46 52 -62 72 -81 96 -105 121 -138 159 -178 202 -226
32 -226 255 -286 318 -353 393 -437 486 -539 598 -660 731 -810 896 -995 1104 -1231 1374
49 1374 -1541 1736 -1973 2260 -2620 3088 -3725 4644 -6096 8749 -15187 66679 14572 -121529
63 -121529 -10955 72108 34824 -37625 -14674 17510 18656 -7243 -3638 18763 19012 -17004 -8735
76 -8735 22581 10645 -21456 5850 22560 -17944 -25153 26202 29319 -15429 -18497 11717 7425
89 7425 -9228 -8402 3879 12778 1683 -23471 -10208 27023 12244 -30541 -10269 25521 -1789
102 -1789 -28762 1744 19871 -8190 -21631 -3862 8482 5335 -8296 -17731 -3289 8830 -7523
115 -7523 -9523 12703 -3239 -33187 -1669 33697 -7160 -42555 -888 29733 -3495 -26110
$$ packed form
0@%%%%%%%%Qj6J6j6K4l2L2m0M9n7P2q6R8j14J34j53J77k01K26k59K97l37L80m28
32b26M81n41O04o71P46q30R23j025J137j258J391j541J706j891K099k335K605
49A374k915L277l709M233m880N708o813Q369j0740J4845k3936Q1866n2107j36101
63a21529J10574Q3063l7284p2449K2951L2184J146k5899L605K2401K49l6016Q269
76h735L1316j1936l2101K7306J6710m0504p209N1355L117m4748l068L0214m292
89G425j6653Q26J2281Q899j1095k5154J3263L7231j4779m2785K0272L5790k7310
102a789k6973L0506J8127k8061j3441J7769J2344l147j3631r435J4442J2119j6353
115g523k000K2226j5942k9948L1518L5366m0857l5395M1667L0621l3228k2615
$$ plain form
127 -26110 -5053 11316 3353 -12405 -14568 5839 15224 -11260 -20374 10035 11081 -20469 -10263
140 -10263 20803 4132 -19349 -1000 9976 -4187 -2060 4262 -6710 -5648 8762 4467 -3119
153 -3119 1984 -3139 -5312 13940 13429 -13072 -8823 15302 3830 -12724 5679 15912 -956
166 -956 -4251 4646 3652 5264 6702 -4455 -3134 12527 4739 -7356 9683 11935 -14603 -5301
180 -5301 29008 12508 -23018 -6123 22398 8734 -11402 -5194 9220 14415 2853 -13242 -507
193 -507 21411 3372 -19793 4514 22327 -5488 -15124 12224 12299 -9982 -4144 8592 1235 -1082
207 -1082 4260 -1964 -3047 4657 -631 -4735 5455 1473 -9326 3251 8870 -12017 -9708 15948
221 15948 5447 -20952 -6939 14776 2879 -11213 -6200 -300 3659 1985 -10917 -7998 11082
$$ packed form
127b6110K1057J6369p963j5758k163K0407R385k6484r114L0409J046l1550J0206
140a0263L1066j6671k3481J8349J0976j4163K127O322j0972J062J4410m295p586
153c119N103n123k173J9252n11k6501M249K4125j1472j6554J8403J0233j6868
166i56l295Q897r94J612J438j1157J321J5661p788j2095J7039K252k6538R302
180e301L4309j6500l5526J6895K8521j3664k0136O208J4414N195j1562j6095J2735
193e07K1918j8039k3165K4307J7813k7815r636K7348P5k2281N838J2736p357k317
207a082N342o224j083P704n288m104J0190l982j0799J2577N619k0887K309K5656
221A5948j0501k6399J4013K1715j1897j4092N013N900L959j674j2902K919J9080
$$ plain form
234 11082 1586 -19678 -3414 16335 -5973 -18036 5513 7984 -14356 -9324 8375 1319 -9838
247 -9838 -7229 -2129 2391 2053 -10431 -9240 8571 1913 -17568 -2349 14427 -8044 -19442 6644
261 6644 12104 -10965 -9791 5617 518 -6646 -1938 -1463 -921 3253 -4066 -7060 5683 3577 -11279
276 -11279 -1292 11900 -5094 -11766 9355 8382 -12312 -4772 12530 2151 -8367 244 5091
289 5091 2813 1006 -5965 -3417 12966 6883 -13971 -2135 19346 2034 -15200 5336 15903
302 15903 -4294 -7620 7317 7484 1502 355 -1743 3484 11457 185 -8983 7614 12330 -7022
316 -7022 -3901 14772 3963 -10790 5125 13007 -3323 -4211 8475 4535 -1900 2737 1997 1063
330 1063 6528 1206 -5657 6395 9575 -6924 -4289 12121 1504 -11066 5307 11587 -6368
$$ packed form
234A1082r496k1264J6264J9749k2308j2063K3549K471k2340N032J7699p056j1157
247i838K609N100M520l38j2484J191J7811o658j9481J5219J6776k2471j1398K6086
261F644N460k3069J174J5408n099p164M708M75N42M174p319k994J2743k106j4856
276a1279R987J3192j6994o672K1121r73k0694P540J7302j0379j0518Q611M847
289E091k278j807o971K548J6383o083k0854J1836K1481j7312j7234K0536J0567
302A5903k0197l326J4937J67n982j147k098N227P973j1272r168J6597M716j9352
316g022L121J8673j0809j4753J5915P882j6330q88J2686l940o435M637p40r34
330A063N465n322o863J2052L180j6499K635J6410j0617j2570J6373O280j7955
$$ plain form
343 -6368 -6501 8721 3794 -6627 -748 2707 549 1568 -4079 -5676 7330 6902 -13054 -7737 14386
358 14386 3060 -17381 -2621 12222 -3306 -11479 375 2991 -1953 -2550 -5322 -3743 5416 -1022
372 -1022 -12920 -713 8948 -7668 -11058 5975 2193 -12238 -1995 7135 -6271 -9085 3002
385 3002 684 -6296 -1956 -1346 -3302 1645 -1927 -9335 1428 7453 -8912 -10090 9153 3693 -13297
400 -13297 -2707 10546 -3149 -9248 3426 3741 -4119 -1018 594 -883 3282 -244 -6891 3999
414 3999 9790 -7186 -8423 12170 8148 -12107 -3286 13213 2416 -7967 1735 6614 2146 1594
428 1594 -1300 -1281 8588 4973 -8300 426 13845 817 -8696 6822 10274 -4734 -1157 9221
442 9221 1359 -2914 5463 4684 -1446 3075 4211 -620 4262 4707 -3174 1976 10286 -2027 -7457
$$ packed form
343f368j33J5222m927j0421N879L455k158J019n647j597J3006m28j9956N317K2123
358A4386j1326k0441J4760J4843j5528q173J1854K616m944n97k772J579R159o438
372a022j1898J2207R661j6616l390J7033l782j4431J0243R130j3406k814J2087
385C002k318o980M340O10j956M947l572p408J0763O025j6365j178J9243n460j6990
400a3297J0590J3253j3695o099J2674L15p860L101J612j477M165l526o647J0890
414C999N791j6976j237K0593m022k0255Q821J6499j0797j0383R702M879m468n52
428A594k894J9R869l615j3273Q726J3419j3028r513J5518L452j5008L577J0378
442I221p862m273Q377p79o130M521J136m831M882M45p881N150Q310j2313n430
$$ plain form
457 -7457 9171 9143 -8237 -2627 11904 2141 -7274 2603 6156 -931 -560 545 -432 4345 2366
472 2366 -7141 35 10060 -3299 -11276 6595 9498 -9801 -7080 9214 2602 -9171 -1647 3702
486 3702 -1080 -1846 -2737 -4086 3540 2412 -9758 -4416 8896 -1471 -13255 1114 7687 -7563
500 -7563 -8317 4623 -56 -7973 -1200 993 -4008 -1639 -1230 -5229 -97 2015 -8275 -5091 6324
515 6324 -1813 -11964 1420 8025 -8177 -8806 5171 2273 -7495 -2636 2033 -1687 -1020 -1651 -4469
530 -4469 2201 4063 -7077 -5051 8598 1645 -11309 907 9847 -4300 -7512 5549 4610 -4658
544 -4658 -887 2791 -282 1637 1327 -2779 3151 6930 -4082 -4477 9133 5252 -7794 939 10159
559 10159 -1072 -5029 5805 4694 -2049 2456 4430 -688 2521 3973 -1617 1840 7341 -858
$$ packed form
457g457J6628k8j7380N610J4531r763r415R877L553p087L71J105r77M777j979
472B366r507P176J0025j3359p977J7871K903j9299K721J6294o612j1773P524N349
486C702m782p66q91j349P626j128j2170N342J3312j0367j1784J4369O573j5250
500g563p54J2940m679p917O773K193n001K369M09l999N132K112j0290L184J1415
515F324q137j0151J3384O605j6202o29J3977k898r768M859M669l720O67o31k818
530d469O670J862j1140K026J3649o953j2954J2216Q940j4147l212J3061r39r268
544d658L771L678l073J919l10m106N930L779j1012l95J3610l881j3046Q733R220
559A0159j1231l957J0834j111o743M505J974n118L209J452n590L457N501q199
$$ plain form
573 -858 -2642 8738 4728 -7070 1620 10840 -730 -5408 6864 6719 -3192 -172 4489 915 2479
588 2479 2583 -2175 2182 6542 -2778 -4646 8002 5159 -8019 -123 10360 -1296 -7825 3722
602 3722 5175 -3156 -1613 2685 -565 162 535 -3844 -199 5154 -3527 -6400 5265 3233 -9398
617 -9398 -2617 7701 -2314 -8732 2218 3430 -5715 -3087 755 -2694 -1771 107 -4646 -1897 3585
632 3585 -4309 -8343 3065 2891 -9471 -4181 7096 -2162 -9965 490 3626 -5033 -4213 380 -1380
647 -1380 -500 -1112 -6265 -1995 5340 -3311 -9148 3802 6215 -8581 -6429 6677 564 -8071 594
662 594 4682 -2478 -3225 851 -944 -225 1287 -2816 -140 6147 -1822 -7605 3956 6644 -5468
677 -5468 -3234 8855 1978 -6925 1697 5791 -1362 -711 4051 979 925 3073 -1710 -619 6908 1443
$$ packed form
573h58j784J1380m010j1798Q690R220j1570m678J2272j45r911L020M661l574J564
588B479J04m758M357M360r320j868J2648k843j3178P896J0483j1656o529J1547
602C722J453q331J543M298l250P27L73m379L645N353q681k873J1665k032j2631
617i398O781J0318j0015o418J0950J212r145K628L842l449R23J878m753K749N482
632C585p894m034J1408j74j2362N290J1277r258p803J0455L136q659Q20M593j760
647a380Q80o12n153M270P335q651n837J2950K413j4796K152J3106o113q635Q665
662E94M088p160p47M076j795P19J512m103K676O287p969n783J1561K688j2112
677e468K234J2089o877q903Q622M094p153O51M762l072n4K148m783J091P527n465
$$ plain form
693 1443 -4985 5383 8878 -3788 -4223 8187 3941 -4343 2986 7232 319 -964 2057 841 3384
708 3384 4810 -2281 -1171 8267 2511 -7048 2385 10001 -2726 -5768 7699 6667 -4473 -1263
722 -1263 3955 633 454 1680 -1041 2053 4004 -3877 -3967 6792 3369 -7494 -76 7658 -3496
737 -3496 -6564 4764 3208 -5768 -1639 3222 -1414 -1524 518 -3514 -1937 3216 -2831 -5288 3608
752 3608 1942 -8202 -2681 4985 -2909 -6338 2385 1538 -5827 -1758 1666 -3715 -2762 394 -3263
767 -3263 -1859 3141 -3476 -7911 1836 2249 -7556 -3353 5674 -2474 -7965 1025 2362 -5204 -2550
782 -2550 1987 -1350 -2016 115 -3571 -1930 3597 -1956 -5530 4111 4195 -6809 -3410 5373 -1629 -5329
798 -5329 4727 5003 -5053 -2567 3857 -604 -2043 2714 793 -275 2788 -367 -3320 4361 4136
$$ packed form
693A443o428J0368L495j2666m35J2410m246q284P329M246o913j283L021j216K543
708C384J426p091J110R438n756r559R433P616j2727l042J3467j032j1140L210
722a263N218l322j79J226k721L094J951p881r0J0759l423j0863P418P734j1154
737c496l068J1328j556q976M129M861m636j10K042m032J577N153o047k457Q896
752C608j666j0144N521P666p894l429Q723q47p365M069L424n381R53L156l657
767c263J404N000o617m435R747M13r805M203R027q148n491Q990J337p566K654
782b550M537l337o66K131l686J641N527n553l574R641Q4j1004L399Q783p002l700
798e329J0056K76j0056K486O424m461j439M757j921j068L063l155k953P681k25
$$ plain form
813 4136 -4595 -291 8075 661 -5213 3807 4878 -3338 221 6676 1234 -1290 2715 1114 346
828 346 4266 1202 -2333 4898 5703 -4789 -1198 9092 1794 -5558 3712 7288 -1399 -1434 4399 1433
844 1433 -537 1720 711 1509 4553 -542 -4897 4710 6437 -4938 -3126 8307 2158 -6706 1356
859 1356 6986 -2517 -4030 2842 1546 -1277 412 -410 -854 2421 -1539 -4701 2978 4761 -6289
874 -6289 -4908 5682 480 -7852 247 5026 -3747 -4898 1661 -474 -3246 -85 -1669 -2841 1496
889 1496 -735 -6227 -139 3561 -5370 -5564 4675 963 -7574 -1321 2887 -3948 -4582 1626 -233
904 -233 -2653 -470 -2421 -2747 1885 -515 -6309 66 4921 -4734 -6299 4423 2044 -7214 -1454
919 -1454 5121 -1609 -4248 1158 398 -1747 -74 -822 -1551 2696 846 -4989 836 6113 -3173 -4825
$$ packed form
813D136q731M304Q366p414n874R020J071q216L559O455n442k524M005j601p68
828C46L920l064l535P231Q05j0492L591J0290p298p352R270L576q687l5N833k966
844A433j970K257j009P98L044n095m355R607J727j1375J812J1433o149q864Q062
859A356N630r503j513O872j296k823J689q22m44L275l960l162P679J783j1050
874f289J381J0590n202q332Q099M779q773j151O559k135k772L161j584j172M337
889A496k231n492O088L700q931j94J0239l712q537O253M208o835o34O208j859
904b33k420K183j951l26M632k400n794O375M855r655j565J0722k379r258N760
919a454O575o730k639N406p60k145J673p48p29M247j850n835N825N277r286j652
$$ plain form
935 -4825 5525 3456 -5505 -388 5357 -493 -2632 2759 1905 -698 2403 1144 -1383 2966 2842
950 2842 -3177 509 6656 -282 -4076 4854 4840 -3383 273 5279 347 -1157 3541 1957 -667 3414
966 3414 1936 -1408 3346 4118 -3133 83 6981 216 -4575 4080 5511 -3167 -621 4911 867
981 867 -2175 2368 1434 -739 2206 777 -2452 2432 3694 -4039 -1166 5471 -716 -5405 3245 3853
997 3853 -4785 -2173 4259 -457 -3693 1281 540 -3085 342 187 -3808 408 1746 -4206 -2653 3902
1013 3902 -1535 -6074 1274 2464 -5229 -2808 2491 -2104 -4661 605 -127 -3426 -356 -43 -3980
1028 -3980 -536 1170 -4835 -3354 3497 -1100 -6909 835 3330 -4604 -3883 2612 -394 -4062 54
1043 54 74 -2739 73 -208 -3501 415 2861 -4191 -2898 4965 37 -6121 1083 4961 -3135 -3297
$$ packed form
935d825J0350k069q961N117N745n850k139N391q54k603L101j259k527M349j24
950B842o019L686O147o938l794Q930j4q223L656N006m932j504M698j584k624M081
966C414j478l344M754P72p251L216O898o765m791Q655J431q678K546N532m044
981H67l042M543r34k173K945j429l229M884J262p733K873O637o187m689Q650O08
997C853q638K612O432m716l236M974p41l625L427j55l995M216J338n952J553O555
1013C902n437m539P348J190p693K421N299m595k557N266p32l299L070L13l937
1028c980L444J706o005J481O851m597n809P744K495p934P21O495l006l668M116
1043E4K0k813K812k81l293L916K446p052J293P863m928o158P204L878q096j62
$$ plain form
1059 -3297 4152 1505 -2946 1075 1740 -1092 1642 1358 -2075 2063 4613 -2298 -2086 6131 2621 -4398
1075 -4398 1992 5804 -1412 -1997 4237 2138 -1516 2677 2510 -487 2545 3401 -1252 1257 5275 -630
1091 -630 -2279 5576 3496 -3557 1679 6458 -596 -2158 4329 2521 -1696 1884 2321 -636 2015
1106 2015 2962 -1643 770 5122 -1002 -3051 4558 3226 -4199 152 5395 -1356 -3226 3389 1963
1121 1963 -2660 585 1638 -1803 74 1144 -2629 -948 3633 -2132 -4175 3211 2311 -5559 -1354
1136 -1354 4345 -2113 -5091 1522 985 -3567 -759 380 -2842 -848 942 -3471 -2071 2856 -2102
1151 -2102 -5378 1765 1821 -5880 -2443 3775 -2280 -4759 1081 468 -3815 -1121 539 -3091 -696 1304
1167 1304 -3592 -2235 3222 -1522 -5156 1565 3236 -4794 -2547 3649 -668 -4153 1225 1648 -2633
$$ packed form
1059c297P449k647m451M021O65k832K734k84l433M138K550o911K12Q217l510p019
1075d398O390L812p216n85O234k099l654M193j67k997L032Q56m653K509M018n905
1091f30j649P855k080p053N236M779p054j562O487j808m217L580M37k957K651
1106B015R47m605K413M352o124k049P609j332p425M351N243o751j870O615j426
1121A963m623L245J053l441J877J070l773J681M581n765k043P386r00p870M205
1136a354N699o458k978O613n37m552K808J139l222J994J790m413J400M927m958
1151b102l276P143N6p701L437O218o055k479N840o13m283K694J660l630K395K000
1167A304m896J357N457m744l634O721J671q030K247O196m317l485N378M23m281
$$ plain form
1182 -2633 -19 1461 -2260 -2 2269 -1984 -1505 4155 19 -4805 2390 4414 -3559 -2157 5059
1197 5059 1029 -3133 2178 2460 -1136 674 2212 -873 1016 3595 -1193 -1316 4654 1371 -3478
1212 -3478 2750 5197 -2151 -1285 5291 1226 -2450 2492 3061 -1599 1170 2821 -410 468 3583 -828
1228 -828 -987 4382 1637 -3512 2243 4955 -2224 -1681 5006 1577 -3154 1813 2916 -1570 -199 1954
1244 1954 -1051 -13 2683 -1300 -1899 3510 849 -4686 1400 4497 -3220 -3501 4060 1122 -4647
1259 -4647 -23 3033 -2006 -1715 1013 -1768 -1042 1306 -2608 -2942 2924 188 -5720 -360 3778 -3792
1275 -3792 -4663 2875 643 -5037 -1064 1572 -2289 -2276 549 -1979 -1832 1310 -2352 -3507 1958 345
1291 345 -5662 -993 3475 -3009 -4224 2523 947 -4433 -1597 1724 -2090 -1492 1060 -1849 -1283 1979
$$ packed form
1182b633K614J480l721K258K271m253M79N660m136m824P195K024p973J402P216
1197E059m030m162N311K82l596J810J538l085J889K579m788j23N970l283m849
1212c478O228K447p348Q66O576m065l676M942N69m660K769J651l231Q78L115m411
1228h28j59N369k745n149N755K712p179N43O687l429m731M967J103m486J371K153
1244A954l005J038K696l983n99N409k661n535O086L097p717k81P561k938n769
1259d647M624L056n039K91K728k781P26K348l914l34N866k736n908N360M138p570
1275c792q71P538k232n680L973K636l861J3K825k528J47L142l662j155N465j613
1291C45o007M669M468o484j215O747j576n380K836L321l814N98K552k909N66L262
$$ plain form
1307 1979 -1645 -3999 2401 2180 -4414 -1073 4482 -1330 -4144 2277 1825 -2715 237 2721 -1099
1322 -1099 -790 1709 -1060 -526 3486 -22 -2798 2860 3214 -3713 -691 5266 461 -2750 3240 3077
1338 3077 -2406 568 3297 -342 37 3421 403 -468 3723 1251 -2186 2442 4035 -2063 -214
1353 -214 5311 695 -2658 2965 3237 -1742 1040 3452 -455 -144 2912 -426 -903 3673 1335 -2977
1369 -2977 2033 4080 -2339 -1873 4300 1101 -2782 1887 2518 -1986 -322 1669 -1602 -737 2530 -979
1385 -979 -2388 2636 739 -4495 298 2908 -2782 -2591 3172 -38 -4532 160 1370 -3250 -842
1400 -842 1822 -1974 -2021 1060 -1935 -3546 1517 475 -4066 -685 1981 -4039 -3701 2446 -848 -4459
1416 -4459 618 1623 -3871 -2227 1209 -2317 -2485 1489 -537 -3219 948 475 -4112 -638 2364
$$ packed form
1307A979l624k354O400k21o594L341N555n812k814O421m52m540K952K484l820
1322a099L09K499k769N34M012l508k776N658L54o927L022N957m805l211N990j63
1338C077n483K974K729l639L79L384l018q71M191k472l437M628J593o098J849
1353b14N525m616l353N623K72m979K782K412l907L11L056l338m77M576k338m312
1369b977N010K047o419M66O173l199l883M669O31m504J664J991l271Q65L267l509
1385i79j409N024j897n234M793K610n690J91N763l210m494M692J210m620K408
1400h42K664l796m7L081k995j611N063j042m541L381K666o020L38O147l294l611
1416d459N077J005n494J644L436l526j68L974k026k682M167m73m587L474L002
$$ plain form
1431 2364 -2813 -2603 2484 35 -4700 243 2395 -2506 -1416 1932 -961 -2039 1707 -329 -2510
1446 -2510 1505 1685 -2725 362 3830 -1941 -2547 3707 1247 -3312 1776 4225 -1867 -1626 3015 707
1462 707 -1031 2035 1124 -1056 2100 1535 -2283 1222 4449 -1451 -1629 5118 2701 -3532 1173 4693
1478 4693 -991 -1066 3928 1954 -464 1910 919 -1038 2348 2536 -1871 1169 4765 -866 -2657 4031
1494 4031 2919 -2862 401 4083 27 -1145 2041 100 -1076 2086 769 -2106 2237 2849 -3305
1509 -3305 -1551 4364 -302 -3131 2021 2009 -3123 -961 2363 -1460 -1665 1724 -590 -1785 1407 -621
1525 -621 -3683 863 2134 -3370 -1858 3266 -968 -4781 371 1762 -3351 -1825 1778 -1423 -2867
1540 -2867 512 -1483 -2738 1018 -211 -3900 85 1888 -3474 -3184 2248 -260 -3986 684 1892
$$ packed form
1431B364n177K10N087k449m735M943K152m901J090L348k893j078L746k036k181
1446b510M015J80m410L087L468n771o06O254k460m559N088K449o092K41M641k308
1462G07j738L066r11k180L156n65l818L505L227n900j78O747k417o233M705L520
1478D693n684p5M994j974k418K374r91j957L386J88m407L040L596n631j791O688
1494D031j112n781L263L682m056j172L186j941j176L162j317k875M343O12o154
1509c305J754N915m666k829N152j2n132K162L324l823k05L389k314j195L192k028
1525f21l062M546J271n504J512N124m234l813N152J391n113J526L603l201j444
1540b867L379j995j255L756j229l689L985J803n362K90N432k508l726M670J208
$$ plain form
1555 1892 -2931 -1882 1129 -1689 -2371 1591 -845 -2655 1270 357 -3751 159 3084 -2195 -2798 3298
1571 3298 827 -3432 272 2513 -1838 -984 2608 -392 -1154 1759 156 -1788 1940 1795 -1934 1125
1587 1125 3563 -1403 -1834 3934 1825 -2842 1582 4160 -920 -857 3435 1003 -1015 2181 1815 -387
1603 -387 2289 2163 -1434 1104 3916 -664 -1331 4337 2303 -2661 1500 3926 -479 -751 3157 1222
1619 1222 -1185 2043 1511 -929 1733 2478 -1261 539 3589 -634 -2241 3044 1993 -2796 627
1634 627 3373 -1305 -1516 2544 258 -1729 1297 1077 -2290 834 1671 -2619 -793 2534 -1402 -2851
1650 -2851 2289 1179 -3912 -771 2748 -2135 -2683 1913 -46 -2908 -113 127 -2205 -214 549 -2262
1666 -2262 -1055 1821 -1964 -3678 1586 746 -4097 -1167 2403 -2386 -3167 1151 -204 -3424 -217
$$ packed form
1555A892m823J049L011k818o82L962k436j810L925r13m108L910K925n279o03O096
1571C298k471m259L704K241m351Q54L592l000p62K913j603j944L728j45l729L059
1587A125K438m966m31N768k109m667M424K578n080O3M292k432k018L196l66k202
1603c87K676j26l597K538K812m580o67N668k034m964M161K426m405k72L908j935
1619A222k407L228n32k440K662P45l739J800L050m223j607N285j051m789L423
1634F27K746m678k11M060k286j987L026k20l367L124Q37m290J826L327l936j449
1650b851N140j110n091L141L519m883n48M596j959k862K795K40k332J991P63k811
1666b262J207K876l785j714N264q40m843K930L570m789p81M318j355l220L207
$$ plain form
1681 -217 607 -2636 -532 794 -2468 -1873 1781 -925 -3161 1467 1313 -3549 -985 2764 -1417 -2834
1697 -2834 1539 391 -2378 331 1377 -1728 261 1625 -1969 -1298 2746 -362 -3348 2172 2631
1712 2631 -2908 -705 3235 -92 -2213 1778 1606 -1140 1005 1556 -851 910 2170 -1479 -704 3745
1728 3745 572 -2695 2139 3449 -1705 -688 3807 392 -1622 2030 1663 -1222 958 1957 -963
1743 -963 630 3097 -765 -1238 3271 1299 -2070 1529 3061 -1625 -666 3045 257 -1461 1807 807
1759 807 -1735 688 1551 -1397 -176 2794 -1088 -1606 2403 1137 -3152 612 2529 -2156 -1678 2454
1775 2454 -9 -2471 472 1123 -2196 93 1351 -2021 -773 1515 -1451 -2532 2004 603 -3700
1790 -3700 -266 1967 -2613 -2593 1756 -330 -3200 112 533 -2341 -646 734 -2048 -1624 938 -1731
$$ packed form
1681b17Q24l243K104J326l262N95L654k706k236M628j54m862K564L749m181j417
1697b834M373j148k769K709J046l105J989J364l594O71M044l108k986N520M59
1712B631n539K203L940l327k121L991j72k746K145N51k407J761J260l649P75M449
1728C745l173l267M834J310n154J017M495l415k014L652l67k885K180R99k920
1743i63J593K467l862m73M509j972l369L599J532m686R59L711k788j718L268j000
1759H07k542K423Q63k948J221K970l882n18M009j266m289L764J917m685M78M132
1775B454k463k462K943O51l319K289J258l372J248K288k966j081M536j401m303
1790c700L434K233m580K0M349k086k870L312M21k874J695J380k782M24K562k669
$$ plain form
1806 -1731 -2921 952 -27 -3656 -374 2036 -2748 -2663 1770 -268 -3348 254 911 -2256 -624 865
1822 865 -1619 -1276 1710 -1177 -2443 1441 914 -3266 -640 2725 -1600 -2369 1722 1302 -2204 64
1838 64 1624 -1207 38 1720 -1097 -308 2514 -271 -1964 2563 2406 -2386 122 3876 111 -1830
1854 -1830 2590 1774 -1447 865 2163 -459 229 2375 -74 -276 2914 749 -1339 1816 2815 -1493
1870 -1493 151 3568 391 -1347 2377 2102 -1316 960 2530 -490 -91 2677 -163 -527 2757 988
1886 988 -1382 1626 2525 -1694 -229 2920 -21 -2027 1826 1700 -1952 -38 2127 -1029 -484 1758
1902 1758 -1166 -1606 1868 282 -2397 748 1736 -2325 -1451 2434 -503 -2999 699 1277 -2173 -913
1918 -913 1210 -1376 -1230 1045 -1228 -2042 1347 -33 -3341 36 1538 -2543 -2217 1822 -359 -3319
$$ packed form
1806a731j190L873r79l629L282K410m784Q5M433k038l080L602O57l167J632J489
1822H65k484L43K986k887j266L884n27m180K626L365m325p69M091m20l506K268
1838F4J560k831J245J682k817P89K822k785j693M527j57m792K508L754l765j941
1854a830M420q16l221K312J298k622O88K146k449k02L190k165k088L155R99m308
1870a493J644L417l177j738L724k75l418K276J570l020L99K768k840l64L284j769
1886I88k370L008Q99m219J465L149k941k006L853j26l652J914K165l156N45K242
1902A758k924m40L474j586k679L145R88m061Q74L885k937k496L698N78l450J260
1918i13K123k586J46K275k273q14L389j380l308L377J502m081L26M039k181k960
$$ plain form
1934 -3319 149 813 -2241 -1354 550 -1437 -1568 676 -1157 -2319 1014 167 -2960 -211 1810 -2094
1950 -2094 -2463 2054 358 -2529 419 1222 -1757 -859 1061 -917 -752 1845 -380 -2162 1367 974
1966 974 -2380 -165 3011 -778 -1560 2000 993 -1738 641 1559 -766 -190 2177 0 -305 1932
1982 1932 585 -1696 1955 2348 -2043 475 2894 -87 -1309 2920 1535 -1303 1200 2516 -621
1997 -621 -339 2239 185 0 2463 856 -1185 1524 1888 -1494 -4 2692 -464 -1250 2248 1084
2013 1084 -1844 1041 2882 -474 -427 2051 -190 -986 1532 587 -1455 942 1596 -1706 -419 2365
2029 2365 -353 -1976 1774 1268 -2379 223 1656 -1347 -1219 1099 -437 -1709 985 110 -1972 -32
2045 -32 1000 -2201 -1306 1729 -993 -2558 1083 566 -2645 -936 1302 -1502 -1546 819 -616 -1891
$$ packed form
1934c319L468O64l054Q87J904j987j31K244j833j162L333q47l127K749K021l904
1950b094l69M517j696k887K948Q03k979Q98J920j978J65K597k225j782L529l93
1966I74l354K215L176l789p82L560j007k731K379R18k325N76K367k177l05K237
1982A932j347k281L651L93m391K518K419k981j222M229j385k838K503J316l137
1997f21K82K578k054j85K463j607k041K709L64l382J490K696l156p86L498j164
2013A084k928K885J841l356M7K478k241p96K518r45k042K397O54l302J287K784
2029B365k718j623L750n06l647K602J433l003J28K318j536j272K694q75k082J940
2045c2J032l201Q95L035k722j565L641n17l211J709K238k804m4K365j435j275
$$ plain form
2061 -1891 55 -202 -2250 -108 834 -2477 -1404 1523 -1367 -3042 640 909 -2650 -1185 1591 -1363
2077 -1363 -1706 605 -133 -2003 569 371 -1683 6 1273 -1970 -1063 2043 -116 -1998 1316 1305
2093 1305 -1978 -907 1716 -751 -1325 1609 429 -1403 596 650 -1037 476 2098 -591 -669 2789
2109 2789 341 -2185 1186 2205 -1163 -222 2630 492 -694 1278 769 -881 1372 1694 -853 1225
2125 1225 2251 -732 -753 2854 1433 -1486 1133 2754 -1152 -948 2323 562 -469 1729 1281 -459
2141 -459 1142 1153 -1279 667 2889 -778 -1275 2552 1254 -2249 452 1895 -630 -794 1955 -125
2157 -125 -1209 982 71 -1595 1136 1307 -2058 -453 1998 -869 -2481 1152 1006 -2390 -202 1310
2173 1310 -1346 -1597 628 -841 -1481 771 -76 -2255 113 1142 -2681 -1663 1822 -902 -2854 639
$$ packed form
2061a891J946k57k048K142R42l311J073K927k890j675L682K69l559J465K776k954
2077a363l43K311p38j870K572j98k054J689J267l243R07L106k159j882L314j1
2093A305l283J071K623k467n74K934j180j832J999N4j687J513J622k689p8L458
2109B789k448k526L371J019l368R41K852k138j186J972n09j650K253L22k547K078
2125A225J026k983k1L607j421k919K619J621l906K04L271j761j031K198m48j740
2141d59J601J1k432J946K222l667m97L827j298l503K701J443k525j64K749k080
2157a25j084K191r11j666K731J71l365J605K451k867j612L633j46l396K188J512
2173A310k656k51K225j469o40K252q47k179K368J029l823J018L485k724j952L493
$$ plain form
2189 639 835 -2609 -1113 922 -1212 -1201 1249 -975 -2211 540 204 -2296 -407 1051 -1945 -1422
2205 -1422 1362 -505 -2237 525 698 -2171 -515 1222 -1484 -1327 1204 -131 -2155 823 1090 -1756
2221 -1756 -174 965 -1052 -1137 1718 337 -1644 1156 1285 -1805 -114 2100 -805 -875 1870 890
2237 890 -1254 882 1650 -1005 96 1956 -223 -513 1876 487 -1678 1385 1976 -1172 260 2697
2253 2697 -69 -1064 1902 1223 -664 1011 1755 -350 402 1667 -116 11 2127 631 -1391 1606
2269 1606 2274 -1460 -343 2491 228 -1133 1746 1631 -912 182 1541 -651 -34 1659 -464 -701
2285 -701 1581 291 -2026 654 1766 -1284 -965 2025 34 -1828 795 359 -1298 7 803 -1331
2301 -1331 -898 1055 -991 -1872 768 37 -2505 220 1435 -1898 -1828 972 -596 -2413 -95 362
$$ packed form
2189F39J96l444J496K035k134J1K450k224j236K751l36k500J889J458k996N23
2205a422K784j867j732K762J73k869J656J737k706J57K531j335k024K978K67k846
2221a756J582J139k017q5K855j381j981K800J29l090J691K214k905p0K745r80
2237H90k144K136P68k655J101J860k179k90K389j389k165L063N91l148J432K437
2253B697k766r95K966o79j887J675P44k105P52J265j783J27K116j496k022K997
2269A606O68l734J117K834k263j361K879j15k543J094J359k192O17J693k123k37
2285g01K282j290k317K680J112l050L19K990j991j862K623m36j657J305P96k134
2301a331M33J953k046q81K640p31k542K725J215l333P0K800j568j817K318M57
$$ plain form
2317 362 -1704 -396 767 -1570 -1303 815 -1325 -2336 841 -73 -2328 -589 1345 -1566 -1942 1066
2333 1066 -281 -1852 140 409 -1533 -484 730 -1216 -1079 1036 -483 -2055 969 499 -2073 -98
2349 -98 1426 -918 -1448 1323 25 -1250 608 669 -921 -87 1431 -816 -933 1445 204 -1507 1461
2366 1461 1418 -1247 -69 2436 15 -829 1526 749 -661 995 1168 -638 545 1661 -403 -175
2382 -175 2300 446 -1173 1276 2185 -909 -70 2595 93 -995 1913 1245 -586 647 1726 -447
2398 -447 255 1779 76 -398 1894 682 -1125 1202 1849 -1049 -175 2105 127 -1260 1487 897
2414 897 -968 460 1297 -1290 -548 1213 -861 -934 1699 638 -1778 231 1328 -1489 -805 1565
2430 1565 -564 -1550 833 388 -1591 -230 636 -1377 -1281 732 -1093 -1491 668 171 -2211 -246 638
$$ packed form
2317C62k066J308J163k337K67K118k140j011L177r14k255J739J934k911l76L008
2333A066j347j571J992K69j942J049J214j946J37K115j519j572L024m70k572J975
2349i8J524k344n30K771j298j275J858O1j590Q34J518k247j17K378j241j711K968
2366A461m3k665J178K505k421q44K355p77j410J656J73j806J183J116k064K28
2382a75K475j854j619K449R09l094Q39K665k502j088K908o68j831J233J079k173
2398d47P02J524j703m74K292j212j807K327O47k898Q74K280j978j387K747n90
2414H97j865J428Q37k587P42J761k074p3K633j061k416K009J097k817O84K370
2430A565k129r86K383m45j979J361Q66k013R6K013j825l98K159m97k382J965Q84
$$ plain form
2447 638 -1785 -1503 924 -568 -2253 346 250 -1680 -609 501 -1585 -1493 701 -806 -1565 639 13
2464 13 -1965 1 1060 -1575 -1195 1223 -159 -2246 323 700 -1394 -665 1097 -675 -704 991 -301
2481 -301 -1127 845 732 -1633 217 1883 -787 -1132 1693 555 -1858 560 1188 -1094 -130 1497
2497 1497 -441 -211 1478 425 -1029 1279 1302 -1280 474 2205 -287 -657 2070 989 -1017 899
2513 899 1890 -200 229 1739 -171 -214 1837 777 -909 1253 1817 -1173 386 2432 60 -978
2529 -978 1741 1175 -1203 723 1469 -627 139 1191 197 -567 1339 367 -846 1011 1220 -1310 -474
2546 -474 1928 -450 -1406 1000 400 -1561 170 1466 -982 -880 1281 -339 -1221 843 224 -1476
2562 -1476 410 1111 -1511 -748 1286 -535 -1823 556 483 -1892 -596 792 -1275 -1165 444 -975
$$ packed form
2447F38k423K82K427j492j685K599r6j930J071J110k086R2K194j507p59K204o26
2464A3j978J966J059k635L80K418j382k087K569L77k094P29J762j772k9J695j292
2481c01q26J972j13k365J850J666k670l45K825j138k413K418O28k282R64J627
2497A497j938K30J689j053j454K308K3k582J754J731k492l70K727j081k006J916
2513H99R91k090M29J510j910m3K051j060j686K162N64k990J559K046k372j038
2529i78K719n66k378J926P46k096P66J052r94p64J906r72j213J857K09k530Q36
2546d74K402k378r56K406o00j961J731J296k448J02K161j620q82K064o19j700
2562a476J886P01k622P63K034j821j288K379p3k375J296J388k067J10J609j419
$$ plain form
2578 -975 -1391 378 -525 -1907 -180 810 -1661 -1239 1663 -523 -2171 456 845 -2093 -613 699
2594 699 -1106 -1088 656 -320 -1469 539 166 -1512 275 1043 -1399 -1171 1646 -72 -1995 633 884
2611 884 -1362 -279 1145 -436 -783 839 175 -977 1177 797 -1189 102 1535 -334 -694 1885
2627 1885 839 -1254 817 1372 -646 234 1736 -101 -512 1597 652 -918 969 1391 -773 249
2643 249 1875 166 -748 1898 514 -796 994 1913 -647 119 1494 -13 -342 1228 691 -910
2659 -910 1095 1285 -612 -37 1472 -547 -690 1639 574 -1479 907 1417 -959 -730 1566 186
2675 186 -1074 925 960 -1259 441 1220 -963 -282 1060 -894 -1746 1013 415 -1952 178 1379 -1150
2692 -1150 -1018 1637 -261 -1665 337 156 -1360 -35 475 -1840 -616 834 -970 -1828 748 459
$$ packed form
2578i75m16J769r03j382J727R90k471M22K902k186j648K627L89k938J480J312
2594F99j805J8J744r76j149K008l73j678J787P68k442K28K817j718j923K628K51
2611H84k246J083J424j581l47J622o64j152K154l80j986J291J433j869l60K579
2627A885j046k093K071N55k018Q80J502j837m11K109r45j570J887M22k164J022
2643B49J626j709r14K646j384j310J790R19k560P66J375j507l29J570n37j601
2659i10K005J90j897N75J509k019j43K329j065k053K386N10k376K29K296j380
2675A86j260J999L5k219J700P79k183O81J342j954q52K759n98k367K130J201k529
2692a150J32K655j898j404K002j81j516J325N10k315J224J450j804q58K576k89
$$ plain form
2708 459 -2168 -736 625 -1427 -1403 677 -291 -1281 185 -89 -1514 -188 310 -1540 -972 1222 -450
2725 -450 -2079 471 609 -2063 -563 1279 -929 -1237 615 -72 -1374 213 397 -1167 40 568
2741 568 -964 -653 1321 -274 -1837 988 1271 -1150 -399 1465 -543 -1038 1220 575 -714 595
2757 595 719 -1033 377 1421 -525 -676 1711 548 -1013 1054 1464 -910 -381 1673 180 -339
2773 -339 1241 611 -773 1105 1254 -820 643 1864 -372 -837 1828 885 -1218 719 1671 -752
2789 -752 16 1679 164 -674 1123 581 -842 805 980 -784 240 1423 -900 -766 1577 529
2805 529 -1312 527 1270 -776 -836 828 -220 -1129 957 488 -1290 249 760 -1040 -606 1064 -687
2822 -687 -1438 994 110 -1920 -76 997 -1252 -1029 961 -716 -1559 310 -99 -1685 -126 918
$$ packed form
2708D59k627J432J361k052K4K080r68r90J466k74j425J326M98j850N68K194j672
2725d50j629K550J38k672J500J842k208l08J852o87j302J587J84j564J207N28
2741E68j532L11J974j595j563K825K83k421P51J864k008m95K258o45j289J309
2757E95J24j752J410J044j946j51K387j163j561K067M10k374N29K054j493n19
2773c39J580o30j384J878J49k074J463J221k236m65K665r43k103J937R52k423
2789g52P68J663j515q38J797n42j423J647J75j764J024J183k323J34K343j048
2805E29j841J839P43k046o0J664j048r09K086m69j778J539N11j800M34J670j751
2822f87p51K432q84k030J844J073k249K23J990j677q43J869m09j586J559J044
$$ plain form
2838 918 -1369 -1017 836 -951 -1572 847 259 -1623 -400 547 -1496 -1500 739 -376 -1582 834 459
2855 459 -1609 -407 660 -977 -968 649 -319 -1450 679 271 -1742 -118 1124 -1045 -829 1296 -13
2872 -13 -1413 563 780 -943 -278 1303 -116 -663 880 66 -946 1254 1117 -902 483 1615 -738
2889 -738 -947 1951 629 -1101 858 1677 -321 -73 1170 -112 -194 1507 465 -662 1522 1110 -1128
2906 -1128 225 2094 156 -954 1423 943 -1204 537 1321 -278 262 1406 -36 92 1497 -21
2922 -21 -962 1135 1669 -1075 -205 2040 -296 -1151 1009 837 -726 324 832 -647 152 1033 -720
2939 -720 -785 1186 102 -1361 779 1101 -1271 -946 1361 -502 -1235 699 659 -1307 -448 652 -1342
2956 -1342 -377 1020 -724 -1242 710 -250 -1601 290 1096 -1337 -1028 725 -163 -1736 237 433 -1195
$$ packed form
2838I18k287L52J853j787o21K419n88j882J223R47k043mK239j115j206K416l75
2855D59k068J202J067j637RJ617r68j131K129m08k013J624J242k169K16K125j309
2872a3j400J976K17j723O65J581j419n47J543q14j012K200j37k019J385J132k353
2889g38k09K898j322j730J959Q19j998K48J243j282q2J701j042j127K184m12k238
2906a128J353J869j938j110K377m80k147J741P84j599N40J144j442J28J405j518
2922b1r41K097N34k744Q70K245k336q55K160j72j563J050N08j479P99Q81j753
2939g20o5J971j084j463K140L22k372L25K307j863p33J934m0j966Q59J100j994
2956a342R65J397j744n18J952r60j351J891Q06k433L09J753q88j573J973J96j628
$$ plain form
2973 -1195 -380 704 -1170 -820 611 -889 -1325 566 641 -1563 -222 1061 -1291 -1170 876 -276
2989 -276 -1701 222 363 -986 -228 806 -894 -771 731 30 -1071 824 558 -1481 61 1161
3005 1161 -714 -988 1506 4 -1439 477 1081 -986 28 1096 -261 -499 1075 201 -771 979
3021 979 1072 -1169 596 1548 -478 -750 1419 899 -964 787 1191 -622 152 1364 -121 -216 1529
3038 1529 704 -878 1106 1363 -746 -51 1772 90 -767 1375 876 -707 517 1203 -156 -53 1110
3055 1110 -34 -281 1231 529 -919 581 887 -925 -91 1577 -367 -1226 1153 529 -1110 229
3071 229 1076 -857 -492 867 -402 -916 1105 125 -1081 59 726 -1156 -365 1503 -428 -1264 589
3088 589 481 -1133 -218 797 -1096 -998 1043 -739 -1110 541 134 -1324 -96 615 -1204 -667 371
$$ packed form
2973a195Q15J084j874L50J431j500m36J891P5k204J341J283k352J21K046j152
2989b76j425J923J41j349P58J034j700J23J502p01j101J895k66k039J542J100
3005A161j875k74K494j502j443J916O04k067J014J068j357k38J574q74r72J750
3021I79R3k241J765R52k026k72K169n20j863J751M04j813P74J212j485r5J745
3038A529q25j582J984K57k109O95J823j682q57K142m99j583J224O86j359J03J163
3055A110j144k47J512p02j448J500L06j812Q34J668j944q59K379o24j639J339
3071B29Q47j933L65J359j269n14K021r80j206J140O67j882P91J868j931q36J853
3088E89j08j614R15J015j893R8K041j782l71J651m07j458J228P11j819N37J038
$$ plain form
3105 371 -521 -1562 347 269 -1463 -408 504 -895 -878 877 -513 -1342 529 230 -1461 -121 705
3122 705 -1003 -858 1281 -54 -1558 431 682 -1279 -201 970 -327 -639 914 -133 -805 691
3138 691 250 -726 239 1067 -702 -471 1232 -21 -1282 875 1293 -623 181 1330 -100 -337 1281
3155 1281 185 -651 898 1077 -698 169 1406 -395 -561 1409 527 -947 685 1336 -860 -77 1169
3172 1169 51 -681 1118 331 -861 932 1102 -647 295 1558 -339 -871 1441 713 -1117 554
3188 554 1194 -506 311 1091 -340 -711 1041 368 -911 537 713 -1080 -300 1292 -428 -980 1121
3205 1121 509 -1454 177 956 -667 -674 1108 -355 -1118 361 -65 -1371 -121 457 -1099 -671 836
3222 836 -728 -1117 326 112 -1482 -463 728 -1427 -1236 551 -117 -1345 388 107 -1298 -84
$$ packed form
3105C71q92j041J909p8j732J055R12j399J7J755j390q29J871k99j691J340Q26
3122G05j708J45K139j335j504J989K51j961J078J171j297l12J553j047o72J496
3138F91m41r76R65Q28j769K31J703j253j261K157M18j916Q04J149j430k37J618
3155A281j096q36J549J79j775Q67J237j801j66J970q82j474J632O51k196P83J246
3172A169j118p32J799p87j192J793J70j749R42J263j897n32K312p28j830J671
3188E54O40j700Q17P80j431l71J752o73j279J448J76j793P80J592j720n52K101
3205A121o12j963J631P79j623pJ782j463p63J479m26j306J250N78j556M28J507
3222H36j564l89J443k14j594J019J191k155J91J787o68j228J733k81j405J214
$$ plain form
3238 -84 675 -1052 -733 1059 -519 -1697 419 598 -1605 -419 626 -594 -1057 710 -338 -908 640
3255 640 43 -1160 221 616 -912 -595 1240 -30 -1340 538 770 -792 -448 1306 -141 -935 812
3272 812 61 -812 429 618 -524 400 966 -383 -326 1346 366 -1293 886 828 -635 -303 1448 -52
3290 -52 -690 1112 690 -340 584 878 -615 217 1436 -114 -441 1676 323 -729 910 1003 -458
3307 -458 -131 1066 -163 -526 1055 356 -674 560 1160 -455 169 1375 -280 -739 937 524 -996
3324 -996 591 589 -753 -384 1410 -403 -951 787 341 -826 248 579 -735 15 1023 -472 -874
3341 -874 836 244 -1321 212 795 -1144 -672 777 -447 -1109 294 280 -1314 -480 313 -1074 -412
3358 -412 566 -825 -1238 497 44 -1640 159 955 -1047 -914 360 -458 -983 193 -307 -865 66 358
$$ packed form
3238h4P59j727L19J792j578j178K116J79k203J186J045j220m63J767j048n70J548
3255F40n97j203J381L95j528L17J835j270j310J878K32j562L44J754j447p94J747
3272H12p51q73J241J89j142R24N66j349N7J672r80j659K179n8j463L32J751j500
3290e2o38J802m22j030R24K94j493Q32J219j550l27K117j353j052J639R3j461
3307d58L27J197j229l63J581o99j030J234O00j615O24J206j655m59J676m13j520
3324i96J587kj342L69J794j813n48J738m46j167J074L31j314P50J008j495m02
3341h74J710n92j565J533N83j939M72J449j224o62J403j4j594Q34P93j387O62
3358d12R78j391m13J735m53j684J799P96k002J33J274q18n25J176n00n58R31K92
$$ plain form
3376 358 -916 -405 550 -771 -1398 673 296 -1351 -131 919 -499 -800 764 -107 -455 226 399
3393 399 -846 90 609 -616 -275 1057 -110 -1033 554 924 -1051 -30 1253 -54 -631 807 333
3410 333 -791 503 515 -700 576 1202 -246 -109 1098 242 -777 1203 1124 -319 300 1313 120
3427 120 -311 1088 474 -563 673 1143 -648 72 1302 49 -522 1017 692 -867 521 1036 -805
3444 -805 113 1307 -42 -620 929 272 -569 504 868 -478 -85 859 -148 -593 610 203 -827
3461 -827 92 978 -822 -480 811 -371 -1054 584 310 -952 -44 400 -763 -496 542 -568 -1151
3478 -1151 346 2 -823 -91 480 -1076 -689 720 -524 -1264 297 -62 -1060 -326 603 -851 -746 333
3496 333 -395 -778 -95 -52 -1235 204 336 -1028 -1009 337 -327 -951 177 172 -1049 -321 784 -521 -292
$$ packed form
3376C58j274N11R55j321o27K071l77j647J220J050j418l01J564q71l48O81J73
3393C99j245R36N19j225L41J332j167r23J587L70j975J021J283j307n77J438m74
3410C33j124J294J2j215J276O26j448J37J207q56j019J980p9j443O19J013j193
3427A20m31J399o14j037J236M70j791P20J230j253n71J539l25j559J388N15j841
3444h05R18J194j349n78J549o57q41J073L64j346L93R44j007m45J203m07j030
3461h27R19Q86j800L42J291j182o83J638k74j262R08M44j163K67J038j110n83
3478a151J497l44q25P32N71j556L87J409j244p40J561l59r98P34R29j454J05J079
3496C33p28l83O83M3j183J439J32j364J9J346o64o24J128nj221P28J105j305K29
$$ plain form
3515 -292 560 -418 -827 672 468 -1043 122 618 -1046 -862 854 315 -828 394 689 -828 33
3532 33 625 -454 -252 753 62 -304 513 428 -778 -71 1117 -429 -709 909 550 -608 463 1107
3550 1107 -248 45 672 -33 -119 1068 19 -579 942 1045 -759 225 1345 -55 -526 659 754 -861
3568 -861 382 940 -245 -300 568 -68 -47 1026 58 -836 569 818 -847 -247 1327 -69 -572 869
3586 869 801 -570 -87 508 -369 116 686 -62 -649 793 -106 -1134 550 907 -995 -672 589 -296
3604 -296 -1062 245 364 -998 -57 105 -1250 -297 549 -517 -500 921 -220 -1482 -199 385 -1064
3621 -1064 -648 639 -302 -902 292 315 -1236 -117 -86 -604 -554 698 -351 -1060 337 356 -1232 -541
3639 -541 507 -765 -618 326 -16 -1188 275 258 -887 -45 656 -630 -453 515 -398 -439 438 631 -1017
$$ packed form
3515b92Q52r78m09J499k04j511J165M96j664J84J716n39j143J222K95j517Q61
3532C3N92j079K02J005o91l66Q17q5j206P07J188j546k80J618l59j158J071O44
3550A107j355K93O27p05q6J187j049n98J521J03j804R84J120j400m71J185R5j615
3568h61J243N58j185n5Q68o36K1J073r68q94J405K49j665O00J574j396n03J441
3586H69o8j371M83N95q77M85N70p48n87J442q99j028J684L57j902L23J261q85
3604b96p66J307J19j362R41J62j355R53Q46j066J7J421j141j262J283N84j449
3621a064M16J287r41o00J194K3j551J119L1n18N0J252j049p09J397J9j588O91
3639e41J048j272J47R44l42j172J463j7j145Q42P01j286J77R68r13m1Q77J93j648
$$ plain form
3658 -1017 111 721 -574 -451 648 157 -547 553 652 -711 -160 905 -383 -313 962 284 -267 157
3676 157 790 -490 90 908 -66 -242 831 508 -663 547 868 -232 73 1184 -24 -282 801
3693 801 526 -213 671 1029 -484 365 1153 -418 -191 917 237 -572 268 713 -619 -159 863 -30
3711 -30 -126 728 85 -732 457 375 -694 -389 897 -119 -567 626 569 -848 359 386 -594 -368 438
3730 438 -259 -768 389 240 -645 36 233 -1002 -390 696 -344 -832 416 52 -980 -266 246 -752
3748 -752 -567 360 -315 -959 145 -60 -701 11 386 -1019 -501 665 -404 -1173 259 58 -710 -179
3766 -179 516 -482 -741 256 -439 -654 156 120 -828 52 312 -822 -407 808 -444 -1010 -1 460 -857
3785 -857 -228 655 -7 -545 583 379 -595 474 327 -310 26 631 -517 -232 994 327 -565 565
$$ packed form
3658a017J128O10j295J23J099m91p04J100R9j363N51J065j288P0J275o78n51M24
3676A57O33j280N80Q18r74j76J073l23j171J210L21j100L05J111j208k58J083
3693H01k75p39Q84L58j513Q49P88j571K27J108o80q09Q40M45j332M60J022q93
3711c0r6Q54o43q17J189q2j069L05J286j016m48J193n7j417J207K7r80K26Q06
3730D38o97n09J157j49q85O81J97j235O12J086j040m88J248l64j032P14N12r98
3748g52J85R27o75o44J104k05o41P12L75j405N18J166j069p69J432k01p68N31
3766a79O95r98k59R97o95k15Q10l6r48Q80K60j134M15J215j252n66J009M61j317
3785h57O29Q83o62n38J128k04r74J069j47o37L36O05j148K85J226o67q92J130
$$ plain form
3803 565 595 -304 59 948 196 -417 979 184 -257 488 450 -207 317 1142 -213 -81 818 569 -672 453
3823 453 913 -179 225 799 -11 -185 711 487 -528 200 481 -399 -38 812 -186 -453 776 217 -426
3842 -426 213 643 -562 -222 831 -148 -528 687 101 -746 113 416 -562 -64 660 -251 -703 295 314
3861 314 -859 -264 852 -776 -581 604 -474 -966 222 126 -907 -195 151 -697 -331 217 -370 -548
3879 -548 41 175 -807 -271 169 -635 -684 528 -323 -1019 345 162 -790 -317 177 -528 -364 492 -259 -976
3899 -976 58 276 -961 -111 923 -422 -666 632 -153 -312 266 244 -743 -487 760 -465 -457 469 -296
3918 -296 -686 541 638 -754 -62 844 -186 -300 738 618 -698 133 573 -263 140 672 -368 -407 1102
3937 1102 388 -520 691 731 -235 -190 1047 -114 -94 643 539 -324 587 460 -245 -17 882 -106 -555 665
$$ packed form
3803E65L0q99L63Q89p52o13J396p95m41P45l8o57N24Q25j355J32Q99k49j241J125
3823D53M60j092M04N74q10j74Q96k24j015P28K81q80L61Q50r98k67J229n59o43
3842d26O39M30j205L40J053r79l80J215n86q47Q59L03r78M98P24r11m52R98J9
3861C14j173N95J116j628J95J185j078m92J188r6j033P12L46q48L66N48n87j78
3879e48N89J34r82N36M40q04m9J212q51o96J364j83r52M73M94p05J64Q56p51p17
3899i76J034K18j237Q50J034j345k44J298p85j59N78k2r87K56J247j225QR26p65
3918b96l90J227R7j392O92R06j030j14J038j20j316Q31M40q36M03N32j040l9J509
3937A102p14r08J211M0r66M5J237j161K0P37j04q63R11j27p05K28Q99r88m49J220
$$ plain form
3957 665 460 -659 461 675 -399 -4 612 5 -179 548 318 -239 325 703 -485 89 1111 -301
3975 -301 -546 596 168 -499 354 630 -280 -400 561 3 -757 128 554 -521 247 138 -479 -373 288
3994 288 -303 -370 623 64 -993 -277 686 -646 -707 455 -115 -905 12 229 -716 -34 -39 -849 -590 430
4014 430 -462 -1002 460 111 -1150 -279 330 -820 -356 246 42 -786 96 -46 -834 -254 394 -363 -464
4033 -464 435 -274 -723 149 175 -613 -238 231 -391 -595 676 186 -636 111 49 -459 54 617 -499 -316
4053 -316 592 90 -500 315 530 -508 190 475 -512 -347 677 528 -413 670 726 -334 237 858 -159
4072 -159 -613 989 365 -431 761 861 -548 -404 756 -3 -36 895 218 -333 435 841 -267 -239 913
4091 913 -143 -421 599 545 -248 545 544 -469 43 695 12 -132 783 178 -664 -59 491 -459 -55 798
$$ packed form
3957F65k05j119J120K14j074L95O16o07j84P27k30n57N64L78j188N74J022j412
3975c01k45J142m28o67Q53K76r10j20R61n58p60Q85M26j075P68j09o17J06O61
3994B88n91o7R93n59j057P16R63j332o1J162n70p90R17K17r45O82nq10K59J020
4014D30q92n40J462l49j261Q71O09j150M64O02k04q28Q82j42p88N80O48p57j01
4033d64Q99p09m49Q72K6p88L75M69o22k04J271m90q22P47o2n08N13N63j116J83
4053c16R08n02n90Q15K15j038O98K85r87J65J024j49r41J083N6j060N71O21j017
4072a59m54J602o24p96J192J00j409J44J160p59l3R31o77n51P68M06j108K8J152
4091I13j056k78J020n4p93P93jj013N12O52o83j44R15o05q42O05N50r50M04Q53
$$ plain form
4111 798 -295 -234 621 112 -456 139 -85 -548 -321 766 -439 -827 395 179 -553 17 491 -385 -228
4130 -228 237 -104 -482 194 2 -1074 134 464 -807 -859 634 -39 -1107 296 563 -969 -353 121
4148 121 -423 -516 240 -566 -872 -98 -119 -1061 -193 216 -836 -454 515 -195 -581 165 128 -577 -104 331 -332
4169 -332 -345 363 -373 -691 442 350 -840 311 571 -447 -599 337 392 -544 520 596 -207 223 546 -259
4189 -259 -408 615 116 -572 878 329 -734 263 1010 -270 -363 647 290 -484 194 759 -515 -405
4207 -405 863 -21 -301 923 276 -368 656 518 -703 112 858 -371 -283 686 159 -469 384 775 72
4226 72 -174 343 -3 -268 465 -148 -391 437 527 -681 -260 700 -14 -604 318 224 -374 96 468 -708
4246 -708 -62 278 -327 -667 494 -78 -837 21 315 -551 -457 881 -371 -734 192 -260 -705 -98 158
$$ packed form
4111G98j093O1Q55n09n68N95k24m63K27J087j205l88J222k16p32N70M74q76J57
4130b28M65l41l78O76j92j076J208L30j271n2J493o73j068J403K67j532O16M74
4148A21n44r3P56q06l06P74k1r42Q68M09j052L82R69p10l86P46l7p05M73M35o63
4169c32j3P08p36l18J133r2j190J151K60j018j52R36N5r36J064P6q03M30L23q05
4189b59j49J023m99o88J450n49j063R97P47j280r3J010l57p74O78N65j274J10
4207d05J268q84k80J224o47o44J024j38j221Q15P46j229Q8R69n27o28Q53L91p03
4226G2k46N17l46k65P33o13k43Q28R0j208M21R60p14n90R22r4n98M70L72j176
4246g08O46L40o05l40J161n72p59Q58K94q66R4J338j252l63R26m52m45O07K56
$$ plain form
4265 158 -636 -213 671 -382 -842 185 181 -888 -60 453 -442 -693 152 -177 -898 190 318 -859 -56
4284 -56 335 -464 -319 354 -156 -775 334 88 -693 -533 352 -326 -401 366 -34 -469 415 150 -457 -262
4304 -262 887 -236 -171 877 -132 -602 278 338 -532 83 455 -298 -307 387 -110 -449 708 407 -488 120
4324 120 590 -60 -329 769 320 -168 717 575 -336 31 797 -183 -202 582 357 -591 417 567 -228 -189
4344 -189 581 -85 38 688 -36 -473 493 353 -397 -111 887 110 -463 567 14 -464 49 405 -105 -58
4364 -58 602 -161 -184 425 113 -613 400 430 -273 188 495 -335 -423 465 604 -746 -138 156 -275 -262 334
4385 334 16 -498 -164 244 -774 -102 603 -656 -599 528 -252 -839 338 299 -706 -87 616 -392 -269
4404 -269 631 -297 -699 -65 156 -826 -73 272 -599 -292 627 -190 -159 270 581 -288 6 637 -500 -484
$$ packed form
4265A58p94M23Q84j053m60J027mj069Q28N13q95k51Q45l29p21J088J28j177Q03
4284e6L91p99J45O73n10o19J109k46p81J60Q85o78p5P67m00m35Q84k65o07J95
4304b62J149j123O5J048j009m70Q80O0q70O15L72p53rO94m97l39J157l01q95O08
4324A20M70o50k69J098m49m88Q85j42r11L67P66r80j9P84k25r48J008J50p95L9
4344a89P70o66J23O50p24m37R66j40p50K86R98p77n73J030n53m78N13L56n10M7
4364e8O60p63k3O09l12p26J013L0p03M61L07q30q8Q88J39j350O08K94m31J3N96
4385C34l18n14L34M08j018O72P05j259N7J127p80n87J177l9j005O19P03j008J23
4404b69R00r28m02O34K21r82P53L45q71L07R19q17L1M29L11q69K94O31j137J6
$$ plain form
4424 -484 555 162 -705 441 20 -406 -40 677 -201 -400 675 -121 -565 97 273 -384 14 559 -394
4443 -394 -306 541 91 -304 620 630 -278 98 598 -115 -491 495 205 -70 539 532 -632 124 748 -130 -266
4464 -266 692 441 -377 559 467 -429 499 720 -44 -293 531 534 -349 457 923 120 2 245 -45 -96 380
4485 380 187 -477 85 745 -295 280 599 -422 -382 380 174 -406 138 483 -274 -188 598 -154 -294 454
4505 454 228 -765 88 379 -44 -266 263 -189 -500 -76 337 -658 109 628 -249 -451 501 -431 -691 110
4525 110 -32 -628 -374 360 -622 -472 264 -57 -555 365 -40 -890 -34 339 -707 -452 267 -44 -920 -58
4545 -58 -111 -1052 -195 353 -760 -543 184 -234 -417 325 200 -583 -278 395 -310 -383 421 137 -596 291 376
4566 376 -312 -181 365 -407 -95 444 -67 -468 470 18 -323 84 752 126 -27 406 281 -577 280 708
$$ packed form
4424d84J039l93q67J146m21m26L66P17q78j99J075p96m44O62J76o57L98N45r53
4443c94Q8Q47m50l95R24J0r08L76N00p13l76R86k90k75O09pj164P56O24q78j36
4464b66R58k51q18R36r2q96R28K21p64k49Q24Lq83Q06M66q03j18K43k90n1M76
4485C80j93o64N62O60j040N75L19j021M0P62k06n80N44L45p57Q6P86p52j40P48
4505D54k26r93Q53K91m23k22N29m52l11M24M13r95P67N19q77k02R52r32k60Q01
4525A10j42n96K54P34r82J50P36l21m98R20m05q50Q56L73j046K55P19l11q76Q62
4545e8n3r41Q57N48j113K17P27m18j83P42j25p83L05O73p05p3Q04k84p33Q87Q5
4566C76o88J31N46p72L12N39n11m01R38m52l41M07O68o26j53M33j25q58Q57M28
$$ plain form
4586 708 -339 171 351 161 -71 768 190 -601 767 418 -300 335 537 -456 -368 701 676 -210 273 566
4606 566 -79 263 756 -161 -501 644 148 -487 447 825 -273 116 943 143 -82 497 273 -178 189
4625 189 649 -406 65 327 -22 -299 480 340 -572 244 360 -340 -106 378 -11 -452 578 102 -744
4644 -744 -15 -78 -425 -248 285 -476 -837 260 232 -691 62 317 -528 -292 572 -100 -435 405 -1 -399
4664 -399 56 149 -692 -296 433 -201 -534 235 -59 -443 -85 653 -354 -382 451 104 -608 270 310 -372 -236
4685 -236 66 -228 -720 183 63 -484 375 525 -554 7 491 -292 -389 725 47 -673 340 347 -678 109
4705 109 906 -34 95 444 228 -463 208 329 -261 113 747 136 -142 659 498 -459 330 713 -291 14
4725 14 648 -63 -257 549 300 -183 219 544 -111 -21 655 82 -287 698 461 -626 182 652 -294 -111
$$ packed form
4586G08j047N10J80j90k32Q39n78p91J368l49p18O35K02r93Q8J069k5q86M83K93
4606E66o45L42M93r17l40J145m96o35R34L78j098L89Q27q00k25N79k24m51L67
4625A89M60j055M71K62l49k77P79j40r12Q16J16p00K34M84l89m41J030m76q46
4644g44P29o3l47J77N33p61l61J097k8r23P53K55q45K36Q64o72l35Q40m06l98
4664c99M55R3q41L96P29o34l33P69k94l84L58P38j007k8Q33l47p12Q78M0o82J36
4685b36L02k94m92R03j20n47Q59J50j079N61M84p83r7J114o78p20J013Pj025P87
4705A09P97r40J29L49k16o91O71J21n90L74O34o11k78Q01j61r57P89L83j004L05
4725A4O34p11j94Q06k49m83M02L25o55R0O76n73l69R85k37j087Q08M70r46J83
$$ plain form
4745 -111 719 224 -235 343 215 -216 276 239 -205 -79 526 -221 -524 621 30 -403 117 486 -608 -166
4765 -166 329 -287 -255 282 207 -652 78 146 -232 -233 203 -359 -506 269 62 -570 140 424 -531 -97 278 -134
4787 -134 -553 -174 -422 -540 145 154 -758 -475 433 -570 -431 505 66 -776 68 607 -103 -535 369 -60
4807 -60 -938 205 322 -656 47 245 -702 -555 257 -164 -747 299 353 -288 -211 206 -227 -10 146 -177
4827 -177 -662 429 -41 -309 -3 644 -161 -294 662 198 -289 389 289 -336 113 262 -156 -232 225 -158
4847 -158 -209 479 477 -359 -11 510 -74 -181 497 239 -319 349 252 32 257 194 -40 -201 670 234 -92 164
4869 164 544 -316 -2 399 -83 -334 573 178 -461 457 501 -323 69 652 176 -277 526 434 -640 162
4889 162 314 -128 10 661 -8 66 334 288 -167 238 485 -133 -206 142 -363 -498 258 -56 -487 -43 51
$$ packed form
4745a11Q30m95m59N78j28m31M92l7m44J26O05p47l03J145n91m33N20L69j094M42
4765a66M95o16L2N37p5q59P30O8l78jM36n62j47P75k07o32P10K84r55M34L75m12
4787a34m19L79k48j18O85Rr12K83R08j003J39R36m39q42Q44N39p10m32R04m29
4807f0q78J143J17r78P03J98r47J47Q12m21n83J046N4o41P7M17m33K17J56l23
4827a77m85J091m70k68L06O47q05j33R56m64m87O78j00o25M49J49m18p6M57l83
4847a58n1O88kq36L48N21n84j07O78k58n58O68r7k20K25o3k34j61Q71m36l26K56
4869A64L80q60L14M01m82k51R07l95o39R18M4q24L92N83m76m53Q03r2j074Q02
4889A62J52m42J38O51o69P4K68m6m55M05K47o18p3L48n05j35P56l14m31M44R4
$$ plain form
4910 51 -532 -395 168 -365 -566 29 257 -500 -298 447 -687 -239 207 -214 -159 142 226 -602 -104 181 -209
4931 -209 -363 605 -308 -408 178 298 -781 -172 210 -406 -315 381 -56 -437 159 209 -267 -18 241 -250
4951 -250 -151 336 -348 -649 307 -9 -389 94 270 -356 -144 807 66 -191 582 107 -230 -8 677 0
4971 0 -433 596 -101 -412 673 -71 -445 -23 354 43 -95 686 112 -242 136 820 -60 92 752 -263
4991 -263 -423 748 110 -404 197 738 -84 -166 574 25 -165 705 381 -240 395 279 -234 -9 571 -381
5011 -381 -276 773 224 -527 362 614 -546 -237 405 190 -715 93 395 -337 203 268 -97 -230 327 -452
5031 -452 -502 280 -42 -170 -93 642 -145 -495 288 -114 -690 441 31 -779 54 337 -263 -368 299 84
5051 84 -395 25 -111 -481 -209 126 -207 -424 330 -373 -323 443 89 -563 -50 60 -435 -290 315 -29 -609
$$ packed form
4910E1n83J37N63n33k01N95K28p57K02P45j134M48M46m21N5L01Q4q28M98K85l90
4931b09j54R68r13j00N86J20j079O09L82o16R1O96m37l81N96N0m76K49K59m91
4951b50R9M87o84l01R56l16l80M83J76o26K12R51p41k57P73m75l37K22O85o77
4971@m33J029o97l11J085p44l74M22L77l11j38P81n74l54L78O84q80J52O60j015
4991b63j60J171o38n14O01N41q22q2P40n49j90Q70l24o21O35j16n13K25N80r52
5011c81J05J049n49p51Q89K52j160L09O42k15r05Q08L02p32N40O5l65j33N57p79
5031d52n0P82l22j28P7P35p87l50P83m02n76J131m10q10Q33K83o00j05O67k15
5051H4m79M20j36l70K72L35l33k17P54p03N0P66l54o52N13J10m95J45O05l44n80
$$ plain form
5072 -609 -73 0 -499 -69 662 -371 -133 305 3 -438 390 140 -512 -208 461 -33 -307 491 513 -311
5092 -311 270 403 -262 -19 300 -48 -21 430 81 -473 182 145 -186 124 459 -35 -479 703 377 -419
5112 -419 383 542 -324 -68 737 -147 -212 656 139 -238 198 554 -208 140 451 201 -212 125 149 -85 90
5133 90 377 -185 111 741 -163 -1 450 211 -195 150 354 -5 -361 334 -410 -482 445 351 -321 273 390
5154 390 -149 -281 320 -12 -323 191 -77 -350 49 276 -232 -195 290 -29 -387 79 67 -539 -323 382 -411
5175 -411 -567 -159 -336 -490 70 140 -520 -210 318 -362 -391 66 -279 -433 63 309 -428 -258 147 -305 -463
5196 -463 297 -131 -106 283 34 -580 -203 504 -207 -496 516 186 -654 159 380 -662 311 209 -393 -476
5216 -476 282 -149 -324 240 114 -200 26 402 -314 -165 299 117 -187 97 80 -241 173 279 -192 -36
$$ packed form
5072f09N36P3m99M30P31j033K38M38l02m41Q28k50o52L04O69m94k74P98K2q24
5092c11N81J33o65K43L19l48K7M51l49n54O55l7l31L10L35m94m44J182l26p96
5112d19Q02J59q66K56Q05q84o5Q68n17l77M36L56p62L48L11k50m13L37K4k34J75
5133I0K87n62K96O30r04J62M51k39m06L45K04l59l56O95p44p2R27r4o72N94J17
5154C90n39j32O01l32l11N14k68k73L99K27n08L7M85l19l58M66j2o06K16P05p93
5175d11j56M08j77j54N60P0o60L10N28o80k9M57l45j54M96K46p37J70M05m52j58
5196d63P60m28K5L89k49o14L77P07p11k89J012l30q40Q13K21j042R73j02o02q3
5216d76P58m31j75N64j26l14K26L76p16J49M64j82l04K84j7l21M14J06m71J56
$$ plain form
5236 -36 417 119 -225 292 615 -319 -214 252 80 134 77 218 -156 274 314 -286 -235 619 -25 -134 219 -127
5258 -127 -46 47 358 -113 84 405 112 -395 434 233 -396 134 198 -196 -80 444 42 -43 411 473 -84 141
5280 141 262 -147 -74 571 -192 -305 159 47 -323 -64 309 -588 -427 92 175 -177 508 -102 -626 -57 -99
5301 -99 -505 -413 101 -333 -562 459 26 -427 -139 15 -697 -413 645 164 -420 7 -184 -399 -153 333
5321 333 -205 -265 194 -438 -582 63 -82 -378 43 25 -312 -297 312 -97 -183 -98 63 -364 97 490 -111 -38
5343 -38 264 71 -95 9 94 -277 -50 72 -353 -113 292 -158 -566 256 20 -190 37 515 54 -514 97
5364 97 193 -192 198 381 -104 -152 347 100 -131 266 207 -79 171 375 -328 -162 580 101 -94 113 499
5385 499 -194 695 188 -242 106 715 -17 95 34 276 -129 44 583 -104 -64 367 -160 8 513 170 -377
$$ packed form
5236c6M53k98l44N17L23r34J05M66j72N4n7J41l74M30M0o00N1Q54o44j09L53l46
5258a27Q1R3L11m71J97L21k93n07Q29k01o29N30O4l94J16N24m02q5M54O2n57K25
5280A41J21m09P3O45p63j13M64j12l70K59L73q97J61N19Q3l52O85o10n24N69m2
5301i9m06R2N14m34k29J021m33m53K88J54p12K84J058m81n84M27j91k15K46M86
5321C33n38o0M59o32j44O45j45k96M21j8l37J5O09m09q6Q5J61m27M61L93o01P3
5343c8L02j93j66J04Q5l71K27J22m25K40M05m50m08Q22k36k10K27M78m61n68O11
5364I7R6l85L90J83m85m8M99k47k31L97n9k86K50K04p03J66P42m79j95K07L86
5385D99o93Q89n07m30L48O09p32J12o1K42m05J73N39o87M0M31n27J68N05l43n47
$$ plain form
5406 -377 374 230 -238 -467 251 -59 -310 430 155 -281 -61 362 -318 20 310 -185 -435 397 -221 -404
5426 -404 75 230 -142 -382 220 -416 -626 170 73 -576 -99 595 -344 -120 120 -62 -556 -193 -50 -327
5446 -327 -156 144 -364 -790 118 -256 -496 99 101 -528 173 20 -291 -51 272 -140 -493 124 -145 -491 -101
5467 -101 -44 -499 -436 267 -110 -501 82 350 -292 -122 375 -139 -511 445 -124 -265 319 263 -691 91 515
5488 515 -87 -252 399 207 63 243 269 -5 -91 512 -169 -118 164 204 -266 84 305 -158 47 387 -354
5509 -354 -2 569 381 -413 209 433 -286 71 442 7 -284 497 -135 -438 354 495 -352 -95 171 -16
5529 -16 -235 633 521 -183 189 4 -353 -195 111 -145 -593 302 390 -362 -122 317 -234 277 384 -56 -134
5550 -134 321 37 -334 358 496 -354 93 552 -132 -410 243 23 -298 -13 328 -173 -65 144 -240 -601
$$ packed form
5406c77P51j44m68k29P18l10k51P40k75m36K20M23o80L38K90m95k50Q32o18j83
5426d04M79J55l72k40O02o36k10P96r7o49M77O94r39K24K40j82m94L63J43k77
5446c27J71L00n08m26R08l74k40N95Ko29P01j53l11K40L23m12l53O17k69l46L90
5467a01N7m55O3P03l77l91N83K68o42J70M97n14l72R56n69j41N84n6r54P82M24
5488E15o02j65O51j92j44J80K6k74q6O03o81N1K82M0m70L50K21m63K05L40p41
5509c54L52N71j88p94O22K24p19L57L71m35k91P81o32l03P92J41q47K57K66j87
5529a6k19Q68j12p04L72j85l57J58L06k56m48Q95Q8p52K40M39n51N11J07m40p8
5550a34M55k84l71O92J38q50M47M59o84k78O53k20l21K85L41n01J08K09l84l61
$$ plain form
5570 -601 145 102 -326 -12 513 -101 -420 516 -107 -462 29 87 -542 -98 428 -51 -411 300 -169 -501 -197
5591 -197 256 -312 -331 535 -156 -399 121 -75 -357 140 277 -301 -161 31 131 -33 267 -120 -367 61
5611 61 -88 -336 60 54 -123 -379 256 186 -299 69 402 129 90 443 108 -164 471 183 -79 184 304 -298
5633 -298 280 303 -47 105 470 314 -439 298 444 -144 314 218 -46 -72 412 119 -337 483 209 -138 122
5654 122 547 153 -485 346 10 46 154 207 144 249 300 16 -141 273 228 -607 10 300 -137 -349 -27 300
5676 300 -340 369 106 -193 60 127 -90 -310 130 -270 -193 -102 153 -419 -198 155 -316 -208 271 -121 -471
5697 -471 267 -227 -666 -355 326 -334 -325 324 -279 -379 98 89 -345 257 318 -358 -558 276 -401 -460 23 157
5719 157 -517 -18 374 -342 -268 60 19 -583 -176 142 -89 -246 381 -112 -193 342 508 -460 129 335 -373
$$ packed form
5570f01P46m3m28L14N25o14l19R36o23l55M91N8o29M44N26m79l60P11m69l32L04
5591a97M53n68j9Q66o91k43N20j96k82M97J37n78J40J92J00j64L00l87k47M28
5611F1j49k48L96oj77k56O35p0m85L68L33k73l9L53l35k72O35k88k62K63J20o02
5633b98N78K3l50J52L65j56p53P37J46n88M58r6k64k6M84k93m56Q20k74l47K60
5654A22M25l94o38Q31l36L6J08N3o3J05N1k84j57M14m5q35O17K90m37k12L22L27
5676C00o40P09k63k99K53O7k17k20M40m00P7R1K55n72K21L53m71J08M79l92l50
5697d71P38m94m39L11O81o60RO49o03j00M77rm34O02O1o76k00Q34o77n9M83J34
5719A57o74M99L92p16P4L28m1o02M07L18k31j57O27m93q1N35J66r68N89K06p08
$$ plain form
5740 -373 41 234 -132 -149 190 -126 -500 -58 153 -189 -334 441 248 -245 237 156 5 128 165 -20 -6
5761 -6 272 98 -62 372 279 -302 50 -16 -361 106 565 -122 -191 435 378 -343 133 305 -126 108 543 -260
5783 -260 -186 278 187 59 237 673 -395 -69 572 -101 126 581 341 -19 269 388 -294 8 394 52
5803 52 -326 326 206 -31 248 649 -366 -68 313 -39 -26 123 149 -386 295 149 -207 -267 383 -1 -223
5824 -223 -103 123 -239 -496 423 -18 -159 224 -101 -238 -193 -6 -517 -106 -158 -620 -205 212 -117 -517 -114
5845 -114 246 -362 -163 -56 -512 -491 161 -227 -463 155 144 -250 -166 316 -195 -487 -54 -10 -190 -103 43 -306
5867 -306 -198 198 -281 -464 384 78 -408 379 181 -173 -91 373 39 -101 174 -82 -369 -6 147 -160
5887 -160 132 530 -71 -173 467 226 -271 182 300 -189 -17 436 -321 -164 546 -77 -279 344 0 -446
$$ packed form
5740c73M14J93l66j7L39l16l74M42K11l42j45P75j93m93M82q1j51J23L7j85J4
5761fK78j74j60M34r3n81L52o6l45M67M59o87o9O26n7p21M76J72m31K34M35q03
5783b60P4M64r1j28J78M36j068L26O41o73K27M55k40l60K88J19o82L02L86l42
5803E2l78O52j20k37K79M01j015K98L81l52J3J49K6n35O81j46l56o0O50l84k22
5824b23J20K26l62k57R19m41j41L83l25j37M5J87n11M11n2m62M15M17l29m00M03
5845a14L60o08J99J07m56K1O52l88k36O18j1l94Q4M82n11k92M33M4j80Q7J46l49
5867c06J08L96m79j83Q48l06m86P87j98l54Q2M64l34j40K75k56k87L63J53l07
5887a60K92L98o01j02O40k41m97M53J18m89J72M53p57J57P10o23k02O23l44m46
$$ plain form
5907 -446 -42 375 -114 -209 151 288 -150 22 202 -1 172 105 272 39 138 245 -296 -51 469 -468 -87
5928 -87 141 -93 -362 285 71 -100 -136 -128 -41 -215 128 -133 -121 232 280 -605 164 279 -132 -10 112 178 -396
5951 -396 47 37 -404 -4 54 -241 -126 292 -191 -403 41 180 -442 -320 86 -44 -299 266 -340 -559 278
5972 278 -83 -420 -369 363 -500 -129 237 -31 -386 163 183 -400 -191 70 -242 -393 208 -104 -594 169 72
5993 72 -261 167 265 -309 -265 322 -309 -411 142 571 -367 -48 136 -377 -109 151 22 4 390 381 -45 -191
6015 -191 409 -195 -336 156 138 -102 -15 240 -610 39 452 -119 -129 439 96 -282 -58 395 -371 -31 279
6036 279 -185 -378 404 144 -292 347 188 -157 -117 348 -58 -277 202 -62 -168 51 207 -358 -212 -31
6056 -31 196 -323 -58 320 -285 310 235 33 29 177 114 -408 115 63 -240 -257 49 -287 -245 31 -155 -231 13
$$ packed form
5907d46M04M17m89r5L60J37m38J72J80k03J73o7J67k33R9J07n41K45N20r37L81
5928h7K28k34k69O47k14j71l6QQ7j74L43k61J2L53M8q85P69J15m11J22J22O6n74
5951c96M43j0m41M00N8k95J15M18m83k12M44J39o22J22M06j30k55N65o06k19Q37
5972B78l61l37N1P32q63L71L66k68l55N49K0n83K09K61l12j51O01l12m90P63r7
5993G2l33M28R8n74M4N87o31j02N53M29r38L19J84n13K68K60j29j8L86rm26j46
6015a91O00o04j41M92j8k40Q7K55q50O49M13n71j0N68l43l78K24M53p66L40L10
6036B79m64j93P82k60m36O39j59l45M0M65m06k19M79k64j06K19J56n65J46J81
6056c1K27n19K65L78o05N95p5k02mJ48o3n22N23n2l03j7L06l36M2K76j86p6K44
$$ plain form
6079 13 -196 -486 -262 470 -357 -128 184 -101 127 153 -11 -400 -82 158 -403 -352 141 -113 -698 -71 201
6100 201 -700 -130 407 -113 -260 378 156 -233 111 -133 -483 -78 220 -233 -94 430 92 -439 73 -44
6120 -44 -440 -26 97 -322 -96 233 -8 -315 107 511 -130 -300 399 -110 -306 324 -90 -346 -98 198
6140 198 -203 -61 294 110 -12 320 74 101 115 286 -294 152 194 -55 67 376 240 -387 59 156 493
6161 493 -119 610 19 -269 426 252 50 499 320 -123 97 222 -164 -77 -3 267 -138 462 308 51 -186
6182 -186 231 203 -149 200 211 -188 263 196 -240 -11 338 31 -145 162 258 -167 -107 -68 -561 107 243 -451
6204 -451 -356 -16 62 -201 221 158 121 -136 -203 -82 -331 -73 -19 -172 -414 354 -376 -191 165 -169 -261 -49
6226 -49 -12 -333 -76 47 -425 -263 112 -161 -619 -108 95 -230 90 281 -98 -221 168 -31 -330 236 90
$$ packed form
6079A3k09k90K24P32q27K29L12k85K28K6j64l89L18K40n61N1M93k54n85O27K72
6100B01r01N70N37n20j47O38k22l89L44k44l50M05K98m53J39N24l38n31N12j17
6120d4l96M14J23m19K26L29k41l07M22M04o41j70O99n09j96O30m14k56K48K96
6140A98m01J42L55j84j22L32k46K7J4J71n80M46M2k49J22L09j36o27M46R7L37
6161D93o12P29n91k88O95j74k02M49j79m43K20J25l86Q7P4K70m05O00j54k57k37
6182a86M17k8l52L49J1l99M51o7m36K29L49l07j76L07R6m25O0L9m93O68J36o94
6204d51R5L40P8k63M22o3l7k57o7J21k49K58N4j53k42P68p30J85L56l34r2K12
6226d9L7l21K57J23m72J62L75k73m58N11K03l25L20J91l79j23L89j99k99N66j46
$$ plain form
6247 90 -212 22 196 -435 -271 109 -510 -431 277 422 -307 347 187 -307 -8 368 129 -284 299 266 -314
6268 -314 -114 485 -168 -114 242 315 -387 215 169 -287 69 682 177 134 343 472 -153 -39 364 -307 -96
6289 -96 -25 -41 -168 313 132 -212 77 24 -169 -119 104 41 231 118 378 -44 267 257 116 -56 352 54
6311 54 -85 -242 -23 -223 -8 293 -94 -22 232 -422 -173 412 75 -292 -85 -34 -134 49 15 -32 -403 80
6333 80 180 -451 -331 198 155 -119 326 -88 -278 -17 -63 -305 138 418 -65 -50 139 -145 -302 328 129
6354 129 7 100 204 -290 -165 -18 -95 -414 -82 -216 -527 78 502 -283 -129 218 76 -484 281 120 -233
6375 -233 -92 344 -66 -95 128 -27 -268 195 179 -210 -155 22 -236 91 68 55 -73 72 451 -368 -120 114
6397 114 141 31 318 -239 -256 356 245 -438 157 465 87 -64 654 59 -348 239 431 111 89 588 80
$$ packed form
6247I0l02K34J74o31J64L80o19P9P08J45p29O54j60m94K99L76k39m13N83l3n80
6268c14K00N99o53N4L56P3p02O02m6m56L56O13n05m3K09J29o25J14M03o71K11
6289i6P1j6j27M81j81l44K89n3j93N0K23o3J90j13K60m22L11j0j41j72M08k98
6311E4j39j57K19k00K15L01l87P2K54o54K49N85l37l67K07N1j00J83l4m7l71M83
6333H0J00o31J20N29m3k74M45m14j90K61m6k42M43K80m83J5J89k84j57O30j99
6354A29j22R3J04m94J25J47p7l19L32j34l11O05M24p85J54L47j42n60P65j61l53
6375b33J41M36m10k9K23j55k41M63j6l89N5J77k58L27k3j3j28J45L79q19K48K34
6397A14K7j10K87n57j7O12j11o83N95L08l78j51P18n95m07N87J92l20k2M99n08
$$ plain form
6418 80 114 385 -48 -29 -16 196 3 272 116 5 -186 520 70 -153 297 393 -211 258 537 -142 69 205
6440 205 71 -30 0 264 -108 -109 361 -191 -224 -217 246 -96 -88 122 -60 217 92 -104 -275 -102 216 -139 -98
6463 -98 198 -150 -65 195 -221 -496 -18 120 -327 -333 -227 -192 134 89 -144 -116 165 -239 -358 109 -77 -415
6485 -415 -254 219 172 -21 233 162 -223 -110 171 49 -375 96 -221 -248 155 -118 -289 -67 319 -445 -471
6506 -471 182 99 -302 152 164 -256 196 57 134 68 272 62 -4 481 150 -188 179 22 0 -132 124 -41
6528 -41 -339 -106 -92 -273 103 150 -93 -288 384 36 -146 662 566 2 105 498 -186 -608 304 -140 -213 29
6550 29 314 -220 54 245 -101 -22 85 197 -295 -120 275 -325 -125 524 -250 -41 157 -34 -37 70 67 12
6572 12 -2 153 -144 -182 320 366 -135 -92 119 -341 -258 361 -97 86 -21 249 -444 -208 -29 -72 -105 196 143
$$ packed form
6418H0L4K71m33J9J3K12j93K69j56j11j91P06m50k23M50R6o04M69K79o79K11J36
6440B05j34j01L0K64l72jM70n52l3PM63l42QK10j82K77j25j96j71J73L18l55M1
6463i8K96l48Q5K60m16k75M78J38m47oJ06L5L26m5k33K8K81m04j19M67j86l38
6485d15J61M73m7j93K54p1l85J13K81j22m24M71l17k7M03k73j71K22L86p64k6
6506d71O53q3m01M54J2m20M52j39P7o6K04k10o6M85l31l38L67j57k2j32K56j65
6528d1k98K33J4j81L76M7k43j95O72l48j82Q08r6n64J03L93o84m22R12m44p3K42
6550B9K85n34K74J91l46P9J07J12m92J75L95o00K00O49p74K09J98j91lJ07ln5
6572A2j4J55k97l8N02M6n01M3K11m60Q3O19m58J83j07K70o93K36J79m3l3L01n3
$$ plain form
6595 143 -251 -29 134 -226 -93 137 -286 4 276 97 -487 316 -146 -180 -27 37 -131 -181 254 -453 -285
6616 -285 28 -225 -159 153 358 -150 -16 125 94 -233 93 66 -292 -189 391 -361 -196 192 -172 -293 203
6637 203 265 -352 27 192 -369 -147 196 23 -207 320 -195 -39 -100 209 -732 19 256 233 -368 -150 -2
6658 -2 -275 318 71 5 84 -53 88 43 -182 391 -61 -371 385 -22 -157 412 -25 -144 94 332 -272 106
6680 106 243 -148 -240 357 14 -370 343 247 -69 -279 352 178 -229 359 161 -228 205 308 -208 -126 437
6701 437 -96 -201 107 389 -371 158 254 -308 27 131 48 -81 94 238 -138 75 105 -363 -459 265 -111
6722 -111 71 297 -108 -205 -87 138 -201 -256 59 43 -170 -3 -61 -129 105 16 -363 -73 -92 -78 -299 -158 48
6745 48 -290 198 -30 -363 -354 16 -191 -185 -3 -364 -235 -249 194 -147 -151 111 -22 -271 -160 9 -185 -29 -24
$$ packed form
6595A43l94K22J63l60J33K30m23K90K72j79n84Q03m62l4J53O4j68n0M35p07J68
6616b85L13k53O6L12K05n08J34J41l1l27L26k7l58J03N80p52J65L88l64j21M96
6637B03O2o17L79J65n61K22L43j73k30N27n15J56o1L09r41P51K37k3o01K18J48
6658bk73N93k47o6P9j37J41m5k25N73m52l10P56m07j35N69m37j19K38K38o04L78
6680A06J37l91r2N97l43l84P13r6l16k10O31j74m07N88j98l89M33J03n16Q2N63
6701D37n33j05L08K82p60N29R6n62L35J04q3j29J75J44l76K13L0m68r6P24l76
6722a11J82K26m05r7J18K25l39n5L15j6k13J67n8o8K34q9l79K90j9J4k21J41K06
6745D8l38M88k28l33RL70k07OJ82l61J29j4M43l41mK62j33k49J11J69j94J56N
$$ plain form
6768 -24 33 -419 -86 -39 -308 -132 -119 -375 -224 215 146 -48 227 157 -93 387 185 167 -188 286 87 -363
6790 -363 211 24 -379 255 153 -152 126 225 176 -100 262 169 -453 -34 383 58 -104 465 263 -372 187
6811 187 119 -57 73 393 -304 -189 59 109 -269 462 341 -142 -107 253 -75 -198 208 159 81 66 32 -282
6833 -282 151 255 -414 -135 143 -245 -600 123 62 -345 194 151 -54 -56 304 -402 -31 -69 -1 146 -171 -127
6855 -127 133 -210 130 21 -177 -252 224 -497 132 51 -252 143 474 -98 -452 51 178 -204 -40 2 -223
6876 -223 -328 221 -117 -283 16 -153 -245 31 130 -209 -200 132 -130 -348 25 -200 -384 26 98 -84 158 193
6898 193 64 95 276 39 -271 139 479 -171 -164 278 67 -33 124 172 -138 39 247 80 -287 -20 -361
6919 -361 -112 333 188 -223 -64 170 -373 -353 283 500 -89 -143 254 -186 -159 280 142 -205 153 15 43
$$ packed form
6768b4N7m52L33M7k69J76J3k56J51M39o9j94K75p0k50M80k02j8l55M74j99m50
6790c63N74j87m03O34j02l05K78R9m9k76L62r3o22M19M17l25j62N69k02o35N59
6811A87o8j76J30L20o97J15K48N0l78P31j21m83L5L60l28j23M06m9p8j5l4l14
6833b82M33J04o69K79K78l88l55P23o1m07N39m3k05kL60p06L71l8O8J47l17M4
6855a27K60l43L40j09j98p5M76p21O29q1l03L95L31n72l54N03J27l82J64M2k25
6876b23j05N49l38j66K99j69r2K76R9l39RL32k62k18L73k25j84M10P2j82K42L5
6898A93j29L1J81k37l10M10L40o50PM42k11j00J57M8l10J77K08j67l67K67l41
6919c61K49M45j45m11J59K34n43K0O36K17n89n4L97m40K7M39j38l47L58j38K8
$$ plain form
6940 43 207 276 -52 62 -65 221 125 329 -84 -94 197 63 -237 -57 109 -185 -300 256 255 -325 277 -70
6962 -70 -295 -99 88 22 269 217 319 -227 -43 -141 -203 -8 135 31 -91 20 -106 -153 126 52 21 36 294
6985 294 6 82 100 94 -247 -109 123 -401 26 472 83 -54 131 107 -333 52 35 -237 100 15 -122 -484
7007 -484 93 -203 -141 -281 -192 -283 55 350 -102 -90 152 61 -215 -74 23 -176 -63 489 -177 -153 385 251
7029 251 -347 411 -77 24 -369 79 45 -304 26 116 36 -3 233 -126 -309 84 138 -335 -168 53 -61 44
7051 44 255 147 -65 141 69 58 -10 117 -105 3 384 -18 106 122 170 -191 -43 237 100 15 113 181 -279
7074 -279 57 -199 267 210 218 -135 -134 149 -184 -277 393 -49 -313 46 33 -134 -180 345 -110 -222 14 86 138
7097 138 -232 -3 -379 224 175 -24 0 198 258 103 195 -76 -44 164 358 -94 -129 149 -9 -310 -83 -201
$$ packed form
6940D3J64O9l28J14j27K86r6K04m13j0K91j34l00J80J66k94j15N56jn80O02l47
6962g0k25J96J87o6K47n2J02n46J84r8o2J95J43j04j22J11j26m7K79p4l1J5K58
6985B94k88P6J8ol41J38K32n24M27M46l89j37J85k4m40L85j7k72L37q5j37l62
7007d84N77k96O2j40Q9r1L38K95m52J2K42r1k76J41R7j99J13N52o66K4N38j34
7029B51n98P58m88J01l93M48l4l49L30R0q0l9K36l59j83L93N4m73J67K21j14J05
7051D4K11j08k12K06p2j1o8J27k22J08L81m02J24J6M8l61J48K80j37q5R8O8m60
7074b79L36k56M66n7Ql53JK83l33r3O70m42k64L59j3j67m6N25m55j12K36P2N2
7097A38l70K29l76O03m9j99K4J98O0j55R2k71L2K08J94m52l5K78j58l01K27j18
$$ plain form
7119 -201 88 -262 0 -282 -269 70 -74 -91 37 258 -183 -147 -154 -129 -279 31 57 -252 158 204 -353 148 202
7142 202 -120 -227 29 224 -66 -277 -190 -173 -11 171 -8 -191 -133 130 -135 -64 19 222 -33 62 41 -111
7164 -111 197 -374 -403 187 59 -171 -173 61 69 -439 346 154 -266 -144 -59 139 6 391 25 -161 30 292
7186 292 214 109 468 -252 23 123 2 -52 86 -276 128 -214 164 -6 -48 166 -78 105 291 219 -124
7207 -124 141 269 -28 217 26 -316 -101 194 186 22 -76 38 -178 -182 -69 114 -157 218 266 -88 -170 222
7229 222 18 -25 105 299 12 40 120 -179 -158 189 262 -282 29 5 -110 -84 -29 -228 -127 192 -60 128 -7
7252 -7 149 -85 -155 191 -133 102 236 -4 -364 -28 195 -282 -10 67 -103 -85 -22 22 156 -24 211 -353
7274 -353 99 160 -319 -352 159 -76 -399 -101 69 49 -250 123 -118 31 -112 39 -349 -167 -71 -57 -113 23
$$ packed form
7119b01K89l50K62k82J3L39j44j7J28K21m41L6pK5j50L10K6l09M10M6n57N01N4
7142B02l22j07K56J95k90k11Q7J7J62J82j79j83N8K63k65P1Q3K03k55R5k1j52
7164a11L08n71k9N90j28k30kK34Qn08P85j92m20J22Q5J98j33L85l66j86J91K62
7186B92p8j05L59p20K75J00j21n4J38l62M04l42L78j70m2K14k44J83J86p2l43
7207a24K65J28k97K45j91l42K15K95qj64r8J14k16mJ13J83k71L75M8l54q2L92
7229B22k04m3J30J94k87K8Q0k99K1L47P3n44L11k4j15K6N5j99J01L19k52J88j35
7252gJ56k34p0L46l24K35J34k40l60L36K23m77K72P7j70J8O3M4J34j80K35n64
7274c53M52O1m79l3N11k35l23K98J70k0k99L73k41J49j43J51l88J82R6J4n6J36
$$ plain form
7296 23 -101 -32 155 327 -142 -117 124 -150 -133 56 -157 209 76 110 -95 241 275 -108 137 -12 -131 -308
7318 -308 147 -104 -69 78 -8 391 -39 168 428 -242 537 204 -44 33 230 36 -171 226 43 -192 56
7339 56 140 -376 89 146 -256 319 155 128 -84 85 172 242 -39 388 -169 171 195 -202 65 213 116 -363 -247
7362 -247 519 -156 -30 212 62 -377 186 238 -1 123 -130 -192 -217 14 -62 -499 306 34 -286 -156 -111 279
7384 279 159 310 -45 -48 -258 184 -312 53 -3 -368 -301 90 -128 -325 13 -267 -219 226 133 -509 174 -179
7406 -179 -57 4 211 -113 -244 -15 -70 30 -75 -73 -43 -108 -264 4 -442 -254 267 -203 -477 227 264 -58
7428 -58 -69 146 -36 -5 -27 -125 -100 121 67 -106 5 146 80 250 254 47 -112 274 -70 120 -89 -190 -73
7451 -73 21 310 -68 68 103 -110 -23 93 138 -48 87 -159 -176 175 290 13 -2 86 437 -15 -264 63 -58
$$ packed form
7296B3j24O9J87J72m69K5K41k74J7J89k13L66j33L4k05L36L4l83K45j49j19j77
7318c08M55k51L5J47q6L99m30K07K60o70P79l33k48P7J97j94k07L97j83k35K48
7339E6Q4n16M65N7m02N75j64k7k12J69Q7P0k81M27n57L40K4l97K67J48r7m79J16
7362b47P66o75J26K42j50m39N63N2k39J24k53o2k5K31p6m37Q05k72l20J30M5L90
7384B79j20J51l55lk10M42m96L65n6l65O7L91k18j97L38k80M8M45r3o42O83l53
7406a79J22O1K07l24j31K29n5J00j05KL0o5j56K68m46J88N21m70k74P04L7l22
7428e8j1K15j82L1k2r8K5K21n4j73J11J41o6J70Mk07j59L86l44J90k09j01J17
7451g3R4K89l78J36L5k13Q7J16M5j86J35k46j7L51J15k77j5Q8L51m52k49L27j21
$$ plain form
7474 -58 -2 41 -37 -247 113 99 43 -123 -36 -45 -400 -2 181 48 -77 55 -217 -56 115 -292 239 577 -1
7497 -1 -174 145 -48 -87 224 211 -37 35 -43 61 -210 200 -82 -342 -174 223 -137 -387 -121 13 -102 -48
7519 -48 -240 -226 -173 18 -45 -318 87 49 -57 -300 15 -34 -77 -58 129 -495 -56 154 -370 -145 167 -113 -175
7542 -175 184 -82 -183 197 13 -345 -233 304 -285 -237 -11 67 -182 124 47 -104 -46 273 -300 -345 -8 -183
7564 -183 -62 -35 -26 -691 -165 -103 -184 -16 79 -93 -50 -123 -225 -110 137 300 -301 -182 407 -24 -293 112 -49
7587 -49 -132 -94 74 -280 -299 201 -165 -81 425 175 -142 -189 162 -95 -173 472 -1 -322 -95 101 -28 406
7609 406 215 16 -253 373 21 74 109 100 -74 165 91 -108 -129 147 -38 -102 88 -175 -291 67 -117 -134 -157
7632 -157 35 61 -116 -67 177 -11 -203 -76 26 -284 -97 171 -40 110 61 -20 -194 224 -145 -228 154 38
$$ packed form
7474e8N6M3p8k10L60j4n6j66Q7rl55L98J83j33j25J32k72J61J71m07N31L38n78
7497aj73L19j93l9L11j3k48P2p8J04k71M10k82k60J68L97l60k50K66J34j15N4
7519d8j92J4N3J91o3k73M05l8j06k43L15m9m3J9J87o24M39K10n24K25L12k80o2
7542a75L59k66j01L80j84l58J12N37n89M8K26P8k49L06p7j51N8L19n73m5L37j75
7564a83J21K7Ro65N26O2q1J68R5j72M3p3j02J15K47J63o01J19N89m31k69M05j61
7587d9q3L8J68l54j9N00l66Q4N06k50l17m7L51k57p8O45m73l21K27J96j29M34
7609D06j91j99k69O26l52N3L5rj74K39p4j99k1K76j85o4J90k63j16L58j84j7k3
7632a57J92K6j77M9K44j88j92J27J02l10J87K68k11J50m9q1j74M18l69q3L82j16
$$ plain form
7654 38 -264 218 121 -236 -110 302 -38 -37 95 119 -249 -285 -63 38 -77 142 -163 -130 -185 -38 -23 -132 67
7677 67 -259 -207 222 -189 -171 -47 -5 93 -511 -21 -182 -91 -86 48 -80 95 -84 -301 -175 -226 -289 -37 -5 35
7701 35 -100 17 457 -140 84 146 -96 -55 330 -278 -275 105 -173 -139 53 -4 -7 166 310 168 -193 122 272
7724 272 -120 297 23 -88 215 192 -18 -321 78 400 201 -73 165 -321 93 179 -57 -391 -240 56 -125
7745 -125 -67 -65 65 -9 32 -79 -406 347 -265 276 -95 -30 92 -109 141 -44 -89 74 144 -78 44 217 291
7768 291 212 85 -293 -122 64 -61 -283 -2 154 4 -271 -143 -257 -205 41 182 -228 -263 -206 -363 -212
7789 -212 -52 -172 -238 -337 -109 249 -204 135 264 1 199 138 -247 245 -169 102 322 -230 -307 -144 84
7810 84 -120 -302 -154 74 120 -71 205 -9 -320 -256 78 -12 -138 86 -198 -141 -103 -138 -238 265 25 65 123
$$ packed form
7654C8l02M82r7l57J26M12l40JJ32K4l68l6K22J01j15K19l05L3n5J47J5j09J99
7677F7l26N2M29m11J8J24M2R8o04M90j61R1NJ34j28J75j79k17J26n1o3K52L2M0
7701C5j35J17M40n97K24O2k42M1L85o08LL80k78L4J92n7lJ73J44j42l61L15J50
7724B72l92M17k74j11L03k3k10l03L99L22j99k74K38m86M14Q6k36l34J51K96j81
7745a25N8KJ30p4M1j11l27P53o12N41l71O5J22k01K50j85m5J63P0k22J22J73P4
7768B91p9j27l78J71J86j25k22K81J56j50k75J28j14N2K46J41m10l5N7j57J51
7789b12J60j20o6r9K28L58m53L39J29k63J98o1l85M92m14K71K20n52p7J63K28
7810H4k04j82J48K28M6j91K76k14l11O4L34r0j26K24k84N7L8l5j00N03k40M0N8
$$ plain form
7833 123 295 -243 169 -366 -107 -296 397 -44 -74 119 248 43 -167 80 330 50 133 115 183 -148 210
7854 210 192 47 174 49 -174 -31 104 -87 178 346 178 116 413 153 5 -9 14 -360 116 181 -171 -146
7876 -146 114 15 -19 32 -1 -417 -388 116 -90 -186 246 187 182 87 381 -412 -144 373 203 69 189 162 -73 181
7900 181 164 -102 138 160 -203 63 198 -303 -48 -85 31 -371 -207 68 163 -155 -83 5 -248 -265 182 -166
7922 -166 -43 362 82 -99 241 112 -418 24 -83 -209 -115 247 -133 -178 -275 2 -294 -93 100 -84 115
7943 115 250 138 -297 214 154 -192 -295 24 177 -47 59 -8 -140 46 352 -146 -29 224 -149 199 235
7964 235 9 -139 98 76 -317 -148 -132 19 -130 36 85 -40 -275 70 -40 76 -272 142 -145 156 38
7985 38 -373 170 91 -215 -80 292 -76 -150 16 265 18 -167 79 -53 101 41 382 63 181 -18 -140
$$ packed form
7833A23J72n38M12n35K59j89O93m41l0J93J29k05k10K47K50k80Q3j8O8l31L58
7854B10j8j45J27j25k23J43J35j91K65J68j68o2K97k60j48j4K3l74M76O5l52K5
7876a46K60r9l4N1l3m16K9N04k06r6M32n9nr5K94p93K68N17j70j34J20k7k35K54
7900A81j7k66K40K2l63K66J35n01K55l7J16m02J64K75R5l18P2Q8k53j7M47l48
7922a66J23M05k80j81L40j29n30M42j07j26R4L62l80m5r7K77k96K01J93j84J99
7943A15J35j12m35N11o0l46j03L19J53k24J06o7j32J86L06m98J17K53l73L48L6
7964B35k26j48K37k2l93J69J6J51j49J66M9j25k35L45j10J16l48M14k87L01j18
7985C8m11N43p9l06J35L72l68p4J66K49k47j85K46j32J54o0L41l19J18j99j22
$$ plain form
8006 -140 -273 305 93 49 152 -110 -244 195 242 -290 -14 56 -71 79 370 -34 -107 14 -177 -102 233 -79
8028 -79 -123 -105 -141 -86 249 -237 63 -119 373 343 6 153 -94 91 -185 188 -57 -180 18 38 95 -98 161
8051 161 -44 -207 26 66 304 -323 177 -233 19 -107 -21 78 104 19 -341 48 258 10 -49 181 26 11
8073 11 205 80 99 326 72 -235 -124 354 29 226 384 120 150 -80 3 188 82 65 209 112 132 28
8095 28 -323 84 216 -7 -193 96 176 -299 483 256 -111 -158 -28 -13 146 -25 -1 -43 -81 314 -122 -12
8117 -12 165 146 -74 -131 64 35 40 247 77 72 -8 49 -138 -43 -104 -1 189 128 -114 119 73 -120 115 61 151
8142 151 130 207 362 -147 280 -63 79 -313 78 -224 60 -60 280 -364 -87 158 -69 -185 -117 -125 178 89
8164 89 196 -53 -384 326 122 -39 155 93 -227 -63 -30 -24 -269 244 -195 -17 124 -31 259 -331 -74 125
$$ packed form
8006a40j33N78k12m4J03k62j34M39M7n32K76P0j27J50K91m04p3J21j91P5L35l12
8028g9m4J8l6N5L35m86L00j82M92l0l37J47k47J85k76L73k45j23J98K0N7j93K59
8051A61k05j63K33M0K38o27N00m10K52j26Q6R9K6q5l60L89K10k48n9K30j55j5
8073A1J94j25J9K27k54l07J11M78l25J97J58k64L0k30Q3J85j06j7J44r7K0j04
8095B8l51M07J32k23j86K89Q0m75P82k27l67m7J30J5J59j71K4m2l8L95m36J10
8117a2J77j9k20n7J95k9NK07j70nq0N7j87R5o1J03J90o1k42K33m6j93K35n4R0
8142A51k1P7J55n09M27l43J42l92L91l02K84j20L40o44K77K45k27j16O8qL03q9
8164H9J07k49l31P10k04j61J94o2l20J64L3Ok45N13m39J78J41j55K90n90K57J99
$$ plain form
8186 125 -72 165 51 -202 -194
$$ packed form
8186A25j97K37j14k53Q
8191a94
$$ Imaginary data points
##PAGE= N=2
##DATA TABLE= (X++(I..I)), XYDATA
$$ plain form
0 0 0 0 0 0 0 0 0 0 0 0 0 2 -7 8 -8 8 -8 10 -15 16 -16 23 -24 30 -32 38 -42 47 -54 62 -67 77 -86 96 -107
35 -107 120 -132 148 -163 181 -202 221 -245 272 -303 334 -372 418 -467 527 -597 684 -790 929
54 929 -1112 1375 -1772 2447 -3805 7586 -36928 -138904 -14161 88565 25108 -57634 -27498
67 -27498 21429 17392 -14282 -12969 10828 8732 -22512 -17511 17647 6623 -26809 -4576 18088
80 18088 -15401 -25877 22072 25071 -24863 -26685 9661 8170 -12762 -9388 3738 6943 -2908
93 -2908 -20558 -8989 24760 10428 -32120 -13865 26042 1401 -29698 1134 22901 -8030
105 -8030 -21829 2453 14151 3471 -8707 -13431 196 14088 -977 -10181 9464 3099 -23551
118 -23551 592 34865 -2800 -39140 4010 38042 -458 -27314 829 19152 4524 -9399
$$ packed form
0@%%%%%%%%%%%KrJ5j6J6j6J8k5L1l2L9m7N4o2P0q0Q9j01J16j29J44j63J82k03
35a07K27k52K80l11L44l83M23m66N17n75O37p06P90q85R94j124J281j474J719
54I29k041K487l147M219o252J1391m4514j01976J24743J02726o3457q2742L0136
67b7498M8927m037l1674J313K3797k096l1244N001L5158j1024l3432K2233K2664
80A8088l3489j0476M7949K999m9934j822L6346j491k0932L374J3126L205r851
93b908j7650J1569L3749j4332m2548J8255L9907k4641l1099L0832K1767l0931
105h030j3799K4282J1698j0680j2178m724J3627J3892j5065r204J9645o365k6650
118b3551K4143L4273l7665l6340M3150L4032l8500k6856K8143J8323j4628j3923
$$ plain form
130 -9399 -7097 9991 16769 -6457 -16686 12076 18764 -12353 -8034 24414 10414 -18108 -281
143 -281 17917 1119 -3952 7945 596 -1941 12041 9076 -3115 1617 3852 -144 12151 13203
157 13203 -10591 -9330 17225 10107 -10059 4944 18263 -40 -7565 6070 6944 2641 4310
170 4310 -2607 -2811 11213 6881 -7858 4356 11660 -10314 -6275 24388 10526 -25455 -8875
183 -8875 23310 8308 -15900 -5764 11323 9804 -3368 -14101 -2130 16950 1773 -21723
195 -21723 -214 20134 -6401 -20363 7682 12536 -13350 -10029 7564 438 -7534 -666 -3046
208 -3046 -6397 793 -1545 -7525 527 732 -10409 -2158 6433 -10759 -12160 11407 4624 -22033
222 -22033 -8849 15819 1756 -15888 -6844 2422 1804 -1165 -9580 -7689 8816 2739 -18548 -4485
$$ packed form
130i399K302J7088O778k3226j0229K8762O688l1117M319L2448j4000k8522J7827
143b81J8198j6798n071J1897p349k537J3982k965j2191M732K235l996J2295J052
157A3203k3794J261K6555p118k0166J5003J3319j8303p525J3635Q74m303J669
170D310o917k04J4024m332j4739J2214P304k1974M039L0663j3862l5981J6580
183h875L2185j5002k4208J0136J7087j519j3172j0733J1971J9080j5177k3496
195b1723K1509K0348k6535j3962K8045M854k5886L321J7593p126p972O868k380
208c046l351P190k338n980Q052K05j1141Q251Q591j7192j401K3567o783k6657
222b2033J3184K4668j4063j7644R044R266o18k969q415J891J6505o077k1287J4063
$$ plain form
236 -4485 16920 -2954 -18978 4447 11738 -11547 -9632 10931 4300 -10274 -4474 3437 4534
249 4534 2335 -6346 -6380 9904 6564 -12415 -1334 17136 -1849 -16355 9437 17723 -7632 -9216
263 -9216 10372 6472 -4785 804 4820 2702 4962 1042 -2823 7173 8004 -5819 -633 14345
277 14345 826 -9232 9983 12996 -8430 -4103 15467 6213 -7847 1523 9084 3103 226
290 226 -2130 -225 11856 7783 -11644 -3150 18882 4003 -16458 3092 16869 -3541 -10381
303 -10381 6665 8411 -2626 -3009 -1133 1660 6931 -1409 -10478 3380 10626 -7493 -8944 10615
317 10615 2937 -13778 -699 10749 -5842 -9835 4861 2283 -7030 -2393 215 -2794 415 -1676
331 -1676 -8104 771 5516 -9201 -9595 7618 533 -14535 -390 9130 -8865 -11739 5489 2407
$$ packed form
236d485K1405j9874j6024K3425P291k3285J915K0563o631j4574N800P911J097
249D534k199q681l4J6284l340j8979J1081J8470j8985j4506K5792Q286k5355j584
263i216J9588l900j1257N589M016k118K260l920l865R996Q31j3823N186J4978
277A4345j3519j0058J9215L013k1426M327J9570r254j4060R370P561n981k877
290B26k356J905J2081m073j9427Q494K2032j4879k0461J9550J3777k0410o840
303a0381J7046J746j1037l83J876K793N271q340r069J3858P246j8119j451J9559
317A0615p678j6715J3079J1448j6591l993J4696k578r313M637K608l009L209k091
331a676o428Q875M745j4717l94J7213p085j5068J4145R520j7995k874J7228l082
$$ plain form
345 2407 -10476 -4538 2032 -2066 -3203 -4779 -6566 3418 4480 -12312 -9607 11974 3626 -18399
359 -18399 -4544 13297 -1995 -13684 849 5818 -3031 -3821 -2832 -1836 4554 710 -10130 -545
373 -545 10903 -3432 -10677 7239 7236 -9612 -2160 10404 -2347 -7945 5681 5951 -3804 -169 3757
388 3757 217 2508 2124 -4344 2857 10306 -3519 -7478 10875 9265 -9753 -1463 14319 1412
402 1412 -7976 5591 8562 -1776 306 4557 2385 3651 2782 -3076 3945 10923 -3584 -7206 11875
417 11875 10741 -10455 -3827 15063 4345 -9212 1707 9188 1682 -769 -161 25 6055 4538
431 4538 -7163 -1330 11908 1261 -10878 3662 10226 -5714 -5128 7895 1500 -6117 2355 3537
445 3537 -3949 -833 2741 -2759 -710 2422 -4328 -2487 6026 -2957 -10642 4398 7397 -10093 -7213
$$ packed form
345B407j2883N938O570m098j137j576j787R984J062j6792K705K1581q348k2025
359a8399J3855J7841j5292j1689J4533M969q849p90R89R96O390l844j0840R585
373e45J1448j4335p245J7916lj6848P452J2564j2751n598J3626K70r755L635L926
388C757l540K291l84o468P201P449j3825l959J8353j610j9018Q290J5782j2907
402A412r388J3567K971j0338K082M251k172J266q69n858P021O978j4507l622J9081
417A1875j134k1196O628J8890j0718j3557J0919P481p506k451O08J86O030j517
431D538j1701N833J3238j0647j2139J4540O564j5940N86J3023o395p617Q472J182
445C537p486L116L574n500K049L132o750J841Q513q983p685J5040K999j7490K880
$$ plain form
460 -7213 9137 641 -11428 -988 4926 -4081 -5094 -565 -2021 -354 -93 -7613 -2939 6592 -3653
475 -3653 -13021 2986 8338 -10790 -10440 8053 2935 -11597 -3820 4757 -2160 -4436 -2632 -2991 1295
490 1295 1903 -8161 -5410 7906 822 -12434 155 9764 -5512 -9218 5475 3371 -6718 -1014
504 -1014 4139 -1727 -1733 1484 -2178 285 3868 -3629 -3771 8106 2577 -9182 2534 11011 -3910
519 -3910 -7532 7701 6735 -5498 -1333 6284 1290 -47 1728 -241 3311 6087 -2730 -2954 9912
534 9912 5320 -8498 1470 12828 -726 -6846 7127 8379 -3104 -414 5790 1614 1039 2588
548 2588 -824 2272 6762 -1857 -4478 8581 6413 -7319 -744 10673 -48 -6766 4713 5872
562 5872 -3251 -37 4208 -1148 -298 3180 -1536 -1003 5126 -1445 -4983 4990 3887 -8113 -2279
$$ packed form
460g213J6350q496j2069J0440N914r007j013M529j456J667K61p520M674R531j0245
475c653r368J6007N352j9128L50J8493n118j4532P777Q577o917k276J804l59M286
490A295O08j0064K751J3316p084j3256J2589R609j5276l706J4693k104j0089N704
504a014N153n866oL217l662K463L583p497j42J1877n529j1759J1716Q477j4921
519c910l622J5233r66j2233M165P617m994j337J775j969L552K776q817k24J2866
534I912m592j3818R968J1358j3554o120J3973J252j1483K690O204m176n75J549
548B588l412L096M490q619k621J3059k168j3732O575J1417j0721o718J1479J159
562E872r123L214M245n356Q50L478m716N33O129o571l538R973j103j2000N834
$$ plain form
577 -2279 9110 -1550 -8785 3297 5319 -6003 -4378 2608 -659 -1633 17 -3824 -1823 3152
591 3152 -3790 -7533 4112 3588 -9915 -4382 7787 -2310 -11320 961 4709 -5473 -5001 1401
605 1401 -1523 -3410 -1123 -3984 -2256 3147 -3149 -7406 2509 3314 -9032 -4757 7161 -1248 -9985
620 -9985 898 4918 -5063 -4451 1929 -1059 -2202 862 -2105 -2076 3600 -1613 -6837 3051 5550 -6638
636 -6638 -3801 8788 1121 -8827 1878 7313 -2306 -3323 3402 1956 81 863 -2318 -10 6823
651 6823 442 -6272 4613 8907 -5145 -5080 9248 4589 -6181 2068 8487 -245 -2524 3768 2647
666 2647 1154 3542 598 982 6305 988 -5659 4502 9349 -2858 -3444 9397 4373 -6553 1751
681 1751 8167 -445 -1883 4417 2222 -296 2321 -449 -1026 5530 2241 -4682 2808 7560 -4406
$$ packed form
577b279J1389j0660p235J2082K022j1322J625O986l267r74J650l841K001M975
591C152o942l743J1645n24j3503N533J2169j0097r010J2281L748j0182M72O402
605A401k924j887K287k861J728N403o296m257R915Q05j2346M275J1918q409q737
620i985J0883M020r981O12O380k988j143L064k967K9N676n213n224R888K499j2188
636f638K837J2589p667r948J0705N435r619j017O725j446j875P82l181K308O833
651F823o381o714J0885M294j4052O5J4328m659j0770Q249O419q732k279O292j121
666B647j493K388k944L84N323n317o647J0161M847j2207n86J2841n024j0926Q304
681A751O416q612j438O300k195k518K617k770n77O556l289o923P490M752j1966
$$ plain form
696 -4406 -6177 6533 4539 -5557 162 6786 -1683 -4358 913 523 251 1933 -2927 -3669 4471
711 4471 1295 -8639 -617 8275 -3568 -9062 4193 5064 -7159 -5295 2638 -413 -3042 -357 -2300
726 -2300 -1729 641 -4399 -5944 3514 2257 -8504 -3158 6172 -3410 -8969 2529 3332 -6995 -4098
741 -4098 3207 -1619 -3946 -605 -2442 -2845 1962 -1672 -5445 2199 2453 -7601 -3589 6095 -775
756 -775 -6978 1628 3526 -4914 -2013 3493 -1524 -2586 2140 -212 -1430 3340 -777 -5725 2760
771 2760 6024 -3922 -2183 7365 927 -6507 2368 6067 -2382 -1370 4648 1416 -862 2273 202
786 202 -144 5074 1321 -2561 4391 6336 -3928 -2665 7649 2395 -3918 4874 7048 -3911 -1865
801 -1865 6054 2449 -1246 3518 3001 -98 2650 1247 -1850 3946 5442 -3180 -1067 8163 1397
$$ packed form
696d406j771J2710j994j0096N719O624q469k675N271l90k72J682m860p42Q140
711D471l176r934Q022Q892j1843n494J3255Q71j2223J864P933l051k629K685j943
726b300N71K370n040j545R458j257j0761N346R330r582n559J1498Q03j0327K897
741d098P305m826k327L341j837m03M807l634l773P644K54j0054M012R684o870
756g75o203Q606J898q440K901N506n017j062M726k352j218M770m117m948Q485
771B760L264r946J739R548o438p434Q875L699q449J012O018l232k278L135k071
786B02l46N218l753l882O952J945j0264J263J0314n254o313Q792K174j0959K046
801a865P919l605l695M764n17l099K748j403l097N796J496q622K113R230o766
$$ plain form
816 1397 -6357 2598 6362 -2291 -1402 6421 1320 -3585 1138 1643 -1065 2121 1162 -3132 2059 4123
832 4123 -4577 -3523 6553 1565 -7856 474 5970 -2862 -5037 2092 830 -3576 -608 -275 -1202
847 -1202 1314 -2220 -6069 1267 4639 -6156 -5965 5631 1419 -8783 -1465 5159 -3887 -7186 1426
862 1426 1069 -3805 -1892 -1161 -2556 9 -1480 -4711 760 3179 -5787 -6489 4157 1584 -8272 -1259
878 -1259 5616 -3126 -5495 1899 1151 -3853 -341 408 -2196 799 357 -4704 -516 4645 -2758 -4893
894 -4893 5104 3608 -6232 -1345 5352 -1342 -3963 3701 2261 -1941 845 1065 -969 2466 2295 -2924
910 -2924 1237 6855 -1291 -4810 5496 5547 -4998 -622 8033 1032 -3456 2843 4116 -494 1681
925 1681 2124 426 3359 2936 -2483 1432 6927 -246 -4102 5524 5432 -4420 -867 7335 1245 -3142
$$ packed form
816A397p754Q955L764q653Q89P823n101m905M723N05k708L186r59m294N191K064
832D123q700J054J0076m988r421Q330N496q832k175P129j262m406K968L33r27
847a202K516l534l849P336L372j0795J91J1596m212j0202P318O624r046l299Q612
862A426l57m874J913P31j395K565j489l231N471K419q966p02J0646k573r856P013
878a259O875q742k369P394p48n004L512P49k604K995m42n061M188N161p403k135
894d893R997j496r840M887O697o694k621P664j440m202K786K20k034L435j71n219
910b924M161N618q146l519J0306N1j0545M376Q655p001m488O299J273m610K175
925A681M43j698K933m23n419L915N495p173l856R626r2r852L553Q202o090m387
$$ plain form
941 -3142 3083 3668 -519 1447 1846 -1499 1824 3036 -2300 -412 5591 12 -5029 3018 4819 -3714
957 -3714 -2189 4688 76 -3260 1879 1379 -2590 381 888 -2929 71 2639 -4195 -3144 3999 -889
973 -889 -6479 1291 4061 -5191 -4198 3075 -581 -4417 87 473 -3041 -717 -153 -3656 -688 1250
989 1250 -4752 -3615 3489 -1247 -7463 570 3280 -5366 -4541 3032 -299 -5421 -195 1073 -3338
1004 -3338 -1236 532 -2845 -1153 2018 -3358 -3570 3568 -126 -5732 904 3815 -4076 -3626 3570
1019 3570 59 -4041 1258 2132 -2163 -463 1813 -2217 -371 3072 -2070 -2398 4739 1570 -5192
1034 -5192 1456 5806 -2677 -3143 4732 2411 -2906 832 3077 -647 822 2304 -729 1276 4058
1049 4058 -1602 -2213 5693 2582 -4471 1769 6888 -1381 -3045 5200 3541 -2481 1035 3442 130
$$ packed form
941c142O225N85m187J966L99l345L323J212n336J888O003n579n041Q047J801q533
957c714J525O877m612l336N139n00l969K971N07l817L000K568o834J051P143m888
973h89n590P770K770r252R93P273l656l836M504L86l514K324N64l503K968J938
989A250o002J137P104m736o216Q033K710q646Q25P573l331n122N226J268m411
1004c338K102J768l377J692L171n376k12P138l694n606O636K911p891M50P196
1019C570l511m100N299Q74m295J700K276m030J846L443n142l28P137l169o762
1034e192O648M350q483m66P875k321n317L738K245l724J469J482l033K005K782
1049D058n660o11P906l111p053O240N119q269j664Q245j659o022L516K407l312
$$ plain form
1064 130 1072 2363 -1050 1279 4655 -929 -2636 5176 3118 -4580 427 6374 -851 -3400 4016
1079 4016 2499 -2466 920 2650 -1132 693 2379 -1733 -869 3563 -1115 -3534 3270 2929 -4618
1094 -4618 -700 4491 -1244 -4658 1885 1981 -3570 -458 1796 -2191 -990 1145 -2502 -2127 2913 -1631
1110 -1631 -4971 2077 2122 -5274 -2486 4014 -1868 -5341 1108 1523 -4132 -1566 966 -2433 -1662 731
1126 731 -2502 -1949 1990 -1627 -4787 1834 2089 -5793 -2994 4019 -1260 -5531 1223 2003 -3579 -1792
1142 -1792 1419 -1718 -1719 1484 -2148 -2179 2918 -209 -4720 1965 3654 -4054 -2316 5123 211 -4562
1158 -4562 1936 3174 -2699 -510 2670 -996 -57 2833 -840 -1182 4192 1284 -3718 2503 5236
1173 5236 -2691 -1854 5732 2174 -3107 2294 3980 -839 701 3386 295 819 3374 188 -830
$$ packed form
1064A30R42J291l413K329L376n584j707P812k058p698N007N947p225k549P416
1079D016j517m965L386J730l782J825J686m112Q64M432m678k419O804l41p547
1094d618L918N191n735l414O543R6n551L112K254l987J201K135l647L75N040m544
1110a631l340P048M5p396K788O500n882l473O449M15n655K566K532l399P71K393
1126G31l233N53L939l617l160O621K55p882K799P013n279m271O754P80n582J787
1142a792L211l137jL203l632l1N097l127m511O685J689p708J738P439m912m773
1158d562O498J238n873K189L180l666R39K890l673l42N374k908n002O221K733
1173E236p927Q37P586l558n281N401J686m819J540K685l091N24K555l186j018
$$ plain form
1188 -830 4528 2378 -2906 2580 5864 -1289 -1916 5530 2857 -2861 1982 4107 -644 219 3169 85
1204 85 364 3294 -456 -1714 3845 1928 -3554 890 4800 -1997 -2476 4019 1415 -3550 911 3296
1220 3296 -1895 -1076 2292 -1035 -1411 2059 -665 -2914 2228 1033 -4430 -394 3838 -3070 -4123
1235 -4123 2923 584 -5213 -1070 2302 -2523 -2352 810 -1638 -2542 882 -1827 -3603 1324 278
1250 278 -5188 -1330 3413 -3316 -5345 2421 1081 -5383 -1376 2562 -2125 -3117 277 -1122 -2017 388
1266 388 -2176 -2998 1741 1037 -5047 -1101 4017 -2584 -4742 2996 2177 -4482 -813 3298 -1322 -2128
1282 -2128 1407 -299 -1039 2015 -302 -2162 2284 2403 -3840 -409 4987 -404 -3485 3775 3435 -3302
1298 -3302 -641 3876 66 -635 2966 305 -137 2947 784 -2080 3005 4037 -2331 -790 5586
$$ packed form
1188h30N358k150n284N486L284p153o27P446k673n718M843K125m751Q63K950l084
1204H5K79K930l750j258N559j917n482M444L910o797m79O495k604m965M461K385
1220C296n191Q19L368l327l76L470k724k249N142j195n463M036M232o908j053
1235d123P046k339n797M143L372m825J71L162k448r04L424k709j776M927j046
1250B78n466L858M743o729k029P766j340o464M007L938m687r92L394j399q95K405
1266C88k564q22M739p04o084L946N118o601k158P738q19o659L669M111m620q06
1282b128L535j706p40L054k317j860M446J19o243L431N396n391l081P260l40o737
1298c302K661M517l810p01L601k661m42L084k163k864N085J032o368J541O376
$$ plain form
1313 5586 540 -3408 3249 4133 -1745 399 4099 75 -888 2699 959 -882 3192 1662 -2120
1328 -2120 2372 3854 -2641 -1043 5302 1066 -3638 2407 3611 -2402 -621 3772 -448 -1087 2764
1343 2764 -105 -2192 1568 936 -2754 803 3515 -2607 -2484 3688 27 -4218 935 2820 -2839
1358 -2839 -1688 2332 -818 -2819 1088 -883 -2799 1437 569 -4056 -462 2755 -3370 -4092 2388
1373 2388 724 -4642 -279 1832 -2952 -2209 708 -1830 -2194 1254 -1298 -3938 952 743 -4516 -805
1389 -805 3007 -2405 -3831 2213 443 -4859 -773 2412 -2437 -1635 1881 -1189 -2560 1137 -422
1404 -422 -2616 1486 2086 -3138 -861 3109 -1959 -3194 3161 1663 -3223 733 3224 -2200 -1817 3298
1420 3298 475 -1720 2458 1572 -2043 1249 2061 -1808 175 4380 -38 -1667 3529 2029 -3109
$$ packed form
1313E586n046l948O657Q84n878K144L700m024r63L587j740j841M074j530l782
1328b120M492J482o495J598O345m236m704O045J204o013J781M393m220o39L851
1343B764k869k087L760o32l690L557K712o122J23O172l661m245N153J885n659
1358b839J151M020l150k001L907j971j916M236q68m625L594L217o125p22O480
1373B388j664n366M363K111m784P43K917k538l64L448k552k640M890k09n259L711
1389h05L812n412j426O044j770n302M086L185m849Q02L516l070j371L697j559
1404d22k194M102O00n224K277L970n068j235O355j498m886L956K491n424L83N115
1420C298k823k195M178q86l615L292Q12l869J983M205m418j629N196j500n138
$$ plain form
1435 -3109 1233 4802 -317 -877 3488 1263 -1327 2286 1758 -1382 2171 3376 -1087 290 3997
1450 3997 -166 -2026 3679 3059 -2661 1429 5053 -684 -2119 2961 1932 -1391 1525 1738 -958
1465 -958 956 1785 -1769 338 3855 -1087 -2783 3650 2335 -4212 -945 4124 -1400 -2914 2700
1480 2700 1414 -2339 -296 289 -2098 297 1516 -2385 -1403 3096 -1474 -4686 1741 2090 -4169 -1864
1496 -1864 2975 -1201 -3535 279 -214 -2721 251 260 -2810 -345 1282 -4089 -3157 3001 -362 -4689
1512 -4689 -34 1834 -3784 -2830 1982 -1064 -2980 655 -228 -2716 123 -139 -3655 -385 2523 -2624
1528 -2624 -2646 2449 18 -4659 -224 2926 -2329 -2071 2658 -503 -3049 1112 420 -1777 1340 1367
1544 1367 -2527 -90 3443 -1706 -2937 3137 1749 -2811 689 3436 -1460 -1304 2849 647 -1343
$$ packed form
1435c109M342L569n119n60M365k225k590L613n28l140L553J205m463J377L707
1450C997m163j860N705o20n720M090L624n737j435N080j029l323K916K13k696
1465i58J914Q29l554K107L517m942j696O433j315o547L267N069n524j514N614
1480B700j286l753K043N85k387K395J219l901R82M499m570l212O427L49o259K305
1496a864M839m176k334L814m93k507K972Rl070K465J627n371R32O158l363m327
1512d689M655J868n618R54M812l046j916L635q83k488K839k62l516L270K908n147
1528b624k2N095k431m677M435L150n255K58M729l161k546M161o92k197L117K7
1544A367l894K437L533n149j231O074j388m560L500K747m896J56M153k202j990
$$ plain form
1559 -1343 2342 1485 -1461 1774 2328 -1941 298 4373 -259 -2228 3495 2687 -2832 594 3740 -298
1575 -298 -918 3436 1251 -986 2001 1836 -1242 1799 3031 -1261 427 3635 -145 -1890 3741 2334
1591 2334 -2854 587 4375 -656 -2293 2803 1311 -1661 1082 1895 -1133 516 1825 -1633 -552
1606 -552 3262 -711 -2752 2499 1822 -3626 -478 3397 -1387 -2424 1835 377 -2654 476 556 -2418
1622 -2418 -69 1655 -2112 -1310 2295 -946 -3767 1161 1468 -3400 -1232 2273 -1648 -2818 1128
1637 1128 -36 -3016 396 687 -2598 -859 1205 -2437 -1910 1766 -1340 -3388 1407 1332 -3924 -1663
1653 -1663 2633 -1717 -3417 1639 734 -3068 -441 1384 -1945 -966 1359 -1302 -1627 1987 -510 -3053
1669 -3053 1732 2245 -3303 -1192 3330 -621 -2867 1974 1666 -1795 619 2520 -1024 78 2494
$$ packed form
1559a343L685q57k946L235N54m269K239M075m632j969N723q08n519L426L146m038
1575b98o20M354k185k237K987j65l078L041J232m292J688L208l780j745N631j407
1591B334n188L441L788n031j637N096j492k972K743Q13l028J649J309l458J081
1606e52L814l973k041N251o77n448L148L875m784j037M259j458l031L130Q0k974
1622b418K349J724l767Q02L605l241k821M928L07m868K168L505l921j170L946
1637A128j164k980L412K91l285J739K064l642N27L676l106k048M795p5n256K261
1653a663M296m350j700N056r05l802K627J825l329R79K325k661l25L614k497k543
1669c053M785N13n548K111M522l951k246M841l08l461K414J901l544J102K416
$$ plain form
1684 2494 -351 -1139 2441 682 -1700 1821 2982 -1815 -456 4079 409 -1997 2534 2389 -946
1699 -946 1034 2547 -76 245 2868 -109 -472 3308 1082 -2023 2116 3913 -1645 -766 4067 1245
1715 1245 -1965 1691 3015 -772 284 2395 -181 431 2486 -451 -911 3199 1146 -3026 1140
1730 1140 3578 -1860 -2088 3000 803 -2510 783 1662 -1816 -64 1716 -1361 -936 1888 -876 -2384
1746 -2384 1648 1004 -3372 -169 2068 -2439 -2556 1710 57 -3219 263 536 -2603 -1006 839 -2123
1762 -2123 -2006 891 -1341 -3505 808 620 -3911 -979 1732 -2174 -2965 1343 -181 -3732 -405 1109
1778 1109 -2354 -1547 749 -1897 -1666 997 -908 -2717 1168 596 -3515 -870 2510 -1601 -2898 1906
1794 1906 863 -3078 -50 1610 -1588 -931 1345 -685 -1219 1749 44 -2103 1171 1719 -2211 -163
$$ packed form
1684B494k845p88L580j759k382L521J161m797J359M535l670k406M531j45l335
1699i46J980J513k623L21K623k977l63L780k226l105M139J797n558Q79M833k822
1715A245l210L656J324l787J056K111k576O12K055k937m60M110k053m172M166
1730A140K438n438k28N088k197l313L293Q79l478J752J780l077M25K824k764j508
1746b384M032o44m376L203K237m507j17M266j653l276L482K73l139J597J845k962
1762b123J17K897k232k164M313j88m531K932K711l906p91M308j524l551L327J514
1778A109l463Q07K296k646K31K663j905j809L885n72m111K645L380m111j297M804
1794A906j043l941L028J660l198O57K276k030n34K968j705k147L274N48l930K048
$$ plain form
1810 -163 3121 -651 -2111 2553 1825 -2315 825 2416 -607 -365 2268 6 -698 2202 896 -1392
1826 -1392 2020 2571 -1737 217 3716 203 -2039 2319 2288 -1572 199 2541 -253 -373 1935 32
1842 32 -712 2698 898 -1838 1674 2639 -1805 -920 3902 266 -2192 1548 2320 -1724 -144 2158
1858 2158 -838 -856 1678 -109 -1513 1652 583 -2308 749 2459 -2177 -1507 2561 -294 -3149 664
1874 664 1345 -2359 -897 1719 -1011 -1601 1194 -485 -2234 711 321 -2765 -170 1619 -2173 -2251
1890 -2251 1683 -464 -3268 142 1128 -2273 -1437 1391 -1390 -1909 747 -705 -2340 689 126 -2695
1906 -2695 -762 1687 -2254 -2436 1816 53 -3404 -88 1639 -2342 -1639 1372 -934 -1759 1111 -165
1922 -165 -2095 939 1220 -2473 -146 2422 -1264 -1763 1975 614 -2950 621 2338 -1200 -1045 1922
$$ packed form
1810a63L284l772j460M664p28m140L140J591l023K42K633k262p04K900j306k288
1826a392L412N51m308J954L499l513k242M358l1l860J771K342k794j20K308j903
1842C2p44L410j800k736L512R65m444Q85M822l636k458L740P72m044J580K302
1858B158k996j8K534j787j404L165j069k891L057J710m636O70M068k855k855L813
1874F64O81l704J462K616k730n90K795j679j749K945l90l086K595J789l792p8
1890b251L934k147k804L410R86l401Q36K828k781n19K656j452j635L029n63k821
1906b695J933K449l941j82M252j763l457L316J727l981P03L011k306q25K870j276
1922a65j930L034K81l693K327K568l686m99L738j361l564L571J717l538J55K967
$$ plain form
1938 1922 -3 -960 1272 374 -1217 1468 1594 -1884 206 2836 -441 -1654 2780 1794 -1828 758
1954 758 2885 -620 -357 2035 778 -184 2085 1030 -965 1650 2475 -1724 260 3709 482 -1626
1970 -1626 2265 2235 -1432 604 2600 -93 -416 2049 538 -773 1940 1121 -1571 1486 2471 -1607
1986 -1607 -588 2830 188 -1829 1601 1808 -1647 -68 2462 -820 -1203 1829 87 -1204 1314
2001 1314 625 -1504 211 1495 -1823 -1091 1842 -845 -2739 710 1129 -2447 -891 1649 -1343 -1696
2017 -1696 1222 -675 -2223 196 523 -2481 -207 1177 -1839 -1625 1034 -536 -2613 135 722 -2382
$$ packed form
1938A922j925r57K232q98j591K685J26l478K090K630l277j213M434r86l622K586
1954G58K127l505K63K392j257r62K269j055j995K615Q25m199J984L449l227k108
1970a626L891l0l667K036J996k693l23K465j511j311K713q19k692L057R85m078
1986a607J019L418k642k017L430K07l455J579K530l282l83L032j742j291K518
2001A314o89k129J715J284l318P32K933k687j894L449M19l576J556K540k992l53
2017a696K918j897j548K419L27l004K274J384l016K14K659j570k077K748N87l104
$$ [...]
8191A
##END NTUPLES=NMR FID
##END=
