##TITLE=1H_Pr G-3
 CDCl3, 8 sc, 
 27.10.2020
##JCAMPDX= 6.0         $$ Bruker NMR JCAMP-DX V2.0
##DATA TYPE= NMR FID
##DATA CLASS= NTUPLES
##ORIGIN= UXNMR, Bruker Analytische Messtechnik GmbH
##OWNER= root
$$ XWIN-NMR		Version 3.5
$$ Tue Oct 27 12:19:20 2020 Russian Standard Time (UT+4h)  she@DPX200
##.OBSERVE FREQUENCY= 200.1315066352
##.OBSERVE NUCLEUS= ^1H
##.DELAY= (6, 6)
##.ACQUISITION MODE= SIMULTANEOUS
##.ACQUISITION SCHEME= undefined
##.AVERAGES= 8
##.DIGITISER RES= 18
##SPECTROMETER/DATA SYSTEM= spect
##.PULSE SEQUENCE= zg30
##.SOLVENT NAME= D2O
##.SHIFT REFERENCE= (INTERNAL, D2O, 0, 15.7039)
##AUDIT TRAIL= $$ (NUMBER, WHEN, WHO, WHERE, WHAT)
$$ ##TITLE= Audit trail, XWIN-NMR		Version 3.5
$$ ##JCAMPDX= 5.01
$$ ##ORIGIN= Bruker BioSpin GmbH
$$ ##OWNER= she
$$ F:/spectra/data/she/nmr/H-F/1/audita.txt
$$ ##AUDIT TRAIL=  $$ (NUMBER, WHEN, WHO, WHERE, WHAT)
(   1,<2020-10-27 12:18:21.29 +0400>,<she>,<DPX200>,
      <created by zg, POWCHK disabled, PULCHK disabled
       configuration hash MD5:
       00 E9 B6 7A A2 85 ED C7 34 08 36 98 17 FE 4E 26
       data hash MD5: 16K
       EC 63 72 6F AD F0 D4 54 D0 D7 B1 95 A2 7E A5 71>)
$$ ##END=
$$ 
$$ hash MD5
$$ 1A 51 15 D5 F3 62 4A 21 27 80 BE 01 AB 09 97 55
##$RELAX= 
##$RELAX= 
##$RELAX= 
##$RELAX= 
##$RELAX= 
##$RELAX= 
$$ Bruker specific parameters
$$ --------------------------
##$DU= <F:/spectra>
##$EXPNO= 1
##$NAME= <H-F>
##$PROCNO= 1
##$TYPE= <nmr>
##$USER= <she>
##$AMP= (0..31)
100 100 100 100 100 100 100 100 100 100 100 100 100 100 100 100 100 100 
100 100 100 100 100 100 100 100 100 100 100 100 100 100 
##$AQSEQ= 0
##$AQ_mod= 1
##$AUNM= <au_zg>
##$AUTOPOS= <>
##$BF1= 200.13
##$BF2= 200.13
##$BF3= 200.13
##$BF4= 200.13
##$BF5= 200.13
##$BF6= 200.13
##$BF7= 200.13
##$BF8= 200.13
##$BYTORDA= 1
##$CFDGTYP= 0
##$CFRGTYP= 5
##$CHEMSTR= <none>
##$CNST= (0..31)
1 1 145 1 1 1 1 1 1 1 1 1 1 1 1 1 1 1 1 1 1 1 1 1 1 1 1 1 1 1 1 1 
##$CPDPRG= <>
##$CPDPRG1= <>
##$CPDPRG2= <>
##$CPDPRG3= <>
##$CPDPRG4= <mlev>
##$CPDPRG5= <mlev>
##$CPDPRG6= <mlev>
##$CPDPRG7= <mlev>
##$CPDPRG8= <mlev>
##$CPDPRGB= <>
##$CPDPRGT= <>
##$D= (0..31)
0 1.2 0 0 0 0 0 0 0 0.06 0 0.03 0 0 0 0 0.0002 0 0 0 0 0 0 0 0 0 0 0 0 
0 0 0 
##$DATE= 1603786700
##$DBL= (0..7)
120 120 120 120 120 120 120 120 
##$DBP= (0..7)
150 150 150 150 150 150 150 150 
##$DBP07= 0
##$DBPNAM0= <>
##$DBPNAM1= <>
##$DBPNAM2= <>
##$DBPNAM3= <>
##$DBPNAM4= <>
##$DBPNAM5= <>
##$DBPNAM6= <>
##$DBPNAM7= <>
##$DBPOAL= (0..7)
0.5 0.5 0.5 0.5 0.5 0.5 0.5 0.5 
##$DBPOFFS= (0..7)
0 0 0 0 0 0 0 0 
##$DE= 6
##$DECBNUC= <off>
##$DECIM= 32
##$DECNUC= <off>
##$DECSTAT= 4
##$DIGMOD= 1
##$DIGTYP= 9
##$DL= (0..7)
0 120 120 120 120 120 120 120 
##$DP= (0..7)
150 150 150 150 150 150 150 150 
##$DP07= 0
##$DPNAME0= <>
##$DPNAME1= <>
##$DPNAME2= <>
##$DPNAME3= <>
##$DPNAME4= <>
##$DPNAME5= <>
##$DPNAME6= <>
##$DPNAME7= <>
##$DPOAL= (0..7)
0.5 0.5 0.5 0.5 0.5 0.5 0.5 0.5 
##$DPOFFS= (0..7)
0 0 0 0 0 0 0 0 
##$DQDMODE= 0
##$DR= 18
##$DS= 0
##$DSLIST= <SSSSSSSSSSSSSSS>
$$ [...]
##$SUBNAM2= <"">
##$SUBNAM3= <"">
##$SUBNAM4= <"">
##$SUBNAM5= <"">
##$SUBNAM6= <"">
##$SUBNAM7= <"">
##$SUBNAM8= <"">
##$SUBNAM9= <"">
##$SW= 16.880792210976
##$SWIBOX= (0..15)
0 0 2 0 0 0 0 0 0 0 0 0 0 0 0 0 
##$SW_h= 3378.37837837838
##$TD= 16384
##$TD0= 1
##$TE= 0
##$TE2= 300
##$TE3= 300
##$TEG= 300
##$TL= (0..7)
0 120 120 120 120 120 120 120 
##$TP= (0..7)
150 150 150 150 150 150 150 150 
##$TP07= 0
##$TPNAME0= <>
##$TPNAME1= <>
##$TPNAME2= <>
##$TPNAME3= <>
##$TPNAME4= <>
##$TPNAME5= <>
##$TPNAME6= <>
##$TPNAME7= <>
##$TPOAL= (0..7)
0.5 0.5 0.5 0.5 0.5 0.5 0.5 0.5 
##$TPOFFS= (0..7)
0 0 0 0 0 0 0 0 
##$TUNHIN= 0
##$TUNHOUT= 0
##$TUNXOUT= 0
##$USERA1= <user>
##$USERA2= <user>
##$USERA3= <user>
##$USERA4= <user>
##$USERA5= <user>
##$V9= 5
##$VALIST= <valist>
##$VCLIST= <CCCCCCCCCCCCCCC>
##$VD= 0
##$VDLIST= <DDDDDDDDDDDDDDD>
##$VPLIST= <PPPPPPPPPPPPPPP>
##$VTLIST= <TTTTTTTTTTTTTTT>
##$WBST= 1024
##$WBSW= 4
##$XGAIN= (0..3)
0 0 0 0 
##$XL= 0
##$YL= 0
##$YMAX_a= 140553
##$YMIN_a= -128753
##$ZGOPTNS= <>
##$ZL1= 120
##$ZL2= 120
##$ZL3= 120
##$ZL4= 120
##$ABSF1= 10
##$ABSF2= 0
##$ABSG= 5
##$ABSL= 3
##$ALPHA= 0
##$AQORDER= 0
##$ASSFAC= 0
##$ASSFACI= 0
##$ASSFACX= 0
##$ASSWID= 0
##$AUNMP= <proc_1d>
##$AZFE= 0.1
##$AZFW= 0.1
##$BCFW= 1
##$BC_mod= 2
##$BYTORDP= 1
##$COROFFS= 0
##$CY= 11.3945322036743
##$DATMOD= 1
##$DC= 2
##$DFILT= <>
##$DTYPP= 0
##$F1P= 15.9154993809931
##$F2P= -4.1035820241983
##$FCOR= 0.5
##$FTSIZE= 0
##$FT_mod= 4
##$GAMMA= 1
##$GB= 0.15
##$INTBC= 1
##$INTSCL= 1
##$ISEN= 128
##$LB= 0.24
##$LEV0= 0
##$LPBIN= 0
##$MAXI= 10000
##$MC2= 0
##$MEAN= 0
##$ME_mod= 0
##$MI= 1.114404
##$NCOEF= 0
##$NC_proc= 0
##$NLEV= 6
##$NOISF1= 3.799351
##$NOISF2= 2.8
##$NSP= 1
##$NTH_PI= 0
##$NZP= 0
##$OFFSET= 15.70392
##$PC= 1
##$PHC0= -10851.78
##$PHC1= 16.40088
##$PH_mod= 1
##$PKNL= yes
##$PPARMOD= 0
##$PSCAL= 0
##$PSIGN= 0
##$REVERSE= no
##$SF= 200.130013532006
##$SI= 16384
##$SIGF1= 3
##$SIGF2= 2
##$SINO= 400
##$SIOLD= 16384
##$SREGLST= <1H.CDCl3>
##$SSB= 0
##$STSI= 0
##$STSR= 0
##$SW_p= 3612.71676300578
##$SYMM= 0
##$S_DEV= 0
##$TDeff= 0
##$TDoff= 0
##$TI= <>
##$TILT= no
##$TM1= 0
##$TM2= 0
##$TOPLEV= 0
##$USERP1= <user>
##$USERP2= <user>
##$USERP3= <user>
##$USERP4= <user>
##$USERP5= <user>
##$WDW= 1
##$XDIM= 8192
##$YMAX_p= 0
##$YMIN_p= 0
$$ End of Bruker specific parameters
$$ ---------------------------------
##NTUPLES= NMR FID
##VAR_NAME=  TIME,          FID/REAL,        FID/IMAG
##SYMBOL=    X,             R,               I
##VAR_TYPE=  INDEPENDENT,   DEPENDENT,       DEPENDENT
##VAR_FORM=  AFFN,          ASDF,            ASDF
##VAR_DIM=   8192,          8192,            8192
##UNITS=     SECONDS,       ARBITRARY UNITS, ARBITRARY UNITS
##FACTOR=    0.000296,      1,               1
##FIRST=     0,             0,               0
##LAST=      2.424536,      0,               0
##MIN=       0,             -128753,         0
##MAX=       2.424536,      140553,          0
$$ Real data points
##PAGE= N=1
##DATA TABLE= (X++(R..R)), XYDATA
0 0 0 0 0 0 0 0 0 0 0 0 0 0 0 8 -8 8 -8 8 -16 16 -17 24 -26 32 -40 48 -54 63 -72 80 -94 105 -121 137 -156
35 -156 174 -196 220 -247 276 -308 341 -379 420 -465 515 -566 626 -689 759 -837 922 -1017
53 -1017 1120 -1235 1366 -1515 1685 -1879 2107 -2378 2706 -3115 3636 -4329 5297 -6762 9244
68 9244 -14571 51420 -99342 -69393 140553 -17553 -42690 59188 10655 -43474 5090 26634
80 26634 34717 -46719 -62788 53369 43037 -83247 -12551 48279 -54216 -17517 63449 -33384
92 -33384 -50670 30279 18089 5308 -3290 -31123 24770 30338 -12245 4919 2005 -11150 15871
105 15871 9347 1829 -9070 -37403 19987 39473 -44918 -33005 32401 -9344 -26307 28457
117 28457 -7465 -39727 17231 24870 -6738 -2323 -14780 9947 40592 -21015 -5600 35817
129 35817 -29132 -169 59576 -30840 -34880 44735 -7353 -17599 28942 -20652 -30449 30876
141 30876 8445 -25697 2823 -3027 -7282 17311 2323 -12701 2847 -4397 13075 28824 -27788
154 -27788 -14024 37961 -4308 -12286 25697 -14330 -23995 27020 11685 -19432 -15097 206 9652
167 9652 -1789 -10580 -3195 -8177 -7678 18369 4324 -26365 -4557 19846 1078 -2911 4254 -13640
181 -13640 2105 21270 21 -10634 -4716 -129 13998 4096 -15640 -1783 -3337 179 16472
194 16472 -9486 -23694 7668 12107 -4280 1177 -7727 -8746 13647 12424 -5791 -5216 -456 3710
208 3710 18627 2380 -16118 1841 10261 4247 5962 -7836 -12192 11473 5134 -2196 2512 -15151
222 -15151 -6439 22883 2104 -20925 2031 5256 -2115 8352 2342 -12765 -2875 12326 8233
235 8233 -1725 -13311 -1542 15486 1712 -8096 1593 -5759 -6689 15939 2173 -19520 -5120
248 -5120 7815 3124 -1610 -6859 -8225 2271 5567 3021 -4555 -9456 419 10404 4920 -6546
262 -6546 -6073 -144 8279 5971 -4580 -6381 -1361 4691 6526 71 -10601 -3542 6468 5794 38
277 38 -8576 -5150 6921 6769 -1970 -1240 -5637 -1100 14142 4839 -10346 -2642 6493 3738 6470
292 6470 -1423 -9773 2358 9081 2594 -2033 -5849 -5339 9364 6909 -7588 -4967 -924 1085 7370
307 7370 1733 -11773 -2207 6826 3041 1539 -4305 -7950 3767 10596 -2473 -6322 -2503 -495
321 -495 5672 4627 -6470 -8801 2184 5120 2449 -4414 -8569 -1210 6413 2974 -4720 -5380 -3137
336 -3137 4347 6359 -1597 -7923 -2666 6469 5024 -421 -5414 -3832 3851 7608 -291 -5771 -2036
351 -2036 798 5735 4458 -5279 -7838 3730 7876 -158 -3315 -3062 -359 4908 5810 -2642 -5041
366 -5041 -628 4828 8144 -2480 -8190 1986 6792 672 1429 -1836 -6526 3378 8570 -474 -7464
381 -7464 -2324 2361 4632 1759 -6096 -4629 2648 3449 1256 -707 -7624 -1303 8535 1108 -4477
396 -4477 -3162 -2046 3076 6360 -3468 -7430 153 3855 1968 -414 -3497 -6496 3043 7246 -2223
411 -2223 -6235 -2853 1250 6030 1369 -7959 -1336 2756 954 4043 -233 -8201 -1702 10942 3684
426 3684 -8073 -3051 4165 1726 3156 882 -6098 -592 3238 4821 3327 -8484 -6146 11405
440 11405 6333 -8523 -1534 3430 -1765 1673 7944 -4218 -10241 6010 9065 -1558 -5178 -3420
454 -3420 3422 6933 -3473 -2406 2671 -6231 1590 11238 -4500 -13046 4146 9504 -3538 -4447
468 -4447 1066 -2754 -602 7020 -1921 -5923 -918 352 6205 1094 -10298 -763 7464 -1875 -1556
483 -1556 936 -4763 -1523 6134 2089 -6982 -1860 2598 46 3656 -957 -8429 3067 6634 -4261
498 -4261 366 561 -5007 2912 5881 -1824 -4424 -143 2945 3464 211 -3797 -1809 5095 1299 -2486
514 -2486 3886 -3335 -4985 8955 3830 -7891 -924 3476 1206 1720 -1185 -1578 -537 1420 2976
529 2976 1102 -2539 -5174 3565 8306 -4870 -6844 5651 360 -2762 5229 -1473 -6730 703 5952
544 5952 1603 -5607 -4308 3310 3579 -1502 -2720 -1048 -247 -1227 4997 1602 -10604 -686 9211 -1041
560 -1041 -4269 -121 -2154 1212 3738 -140 -3865 -3675 3437 4619 -1082 -4399 -2103 3072 3527 -801
576 -801 -2006 -2518 -415 6513 1072 -5053 -949 1003 2972 2865 -2547 -3516 857 3845 3430 -3329
592 -3329 -3723 2288 2398 2434 -430 -3622 -555 2987 3114 53 -4449 -1327 4294 2269 -770 -3254
608 -3254 -990 2547 1290 949 -1517 -3910 1210 4458 33 -3305 -2914 2041 3344 -1851 -811 -979
624 -979 -2533 2123 3490 -2411 -4212 -375 3428 1542 -3486 -1490 359 -165 1327 1224 -2512 -3896
640 -3896 2168 4474 -1996 -3876 1194 119 862 2385 -2420 -2269 916 1774 1976 -1135 -3686 1150
656 1150 3408 158 -711 -1274 -793 1586 3041 -503 -3075 218 1742 1938 1129 -2606 -2413 3597 2161
673 2161 -1024 -314 -1595 220 3161 1378 -2428 -2137 982 2857 816 -1882 -1711 -142 2542 1325
689 1325 -1086 -2193 -1256 2388 2590 -1780 -3045 93 1344 1327 -143 -2438 -2159 1427 2986 -1140
705 -1140 -2534 -997 311 1921 1116 -3045 -2267 1679 1105 614 -1077 -2915 -79 3044 795 -2062
721 -2062 -1520 -504 1953 2017 -1423 -2623 485 1613 1187 795 -2626 -1741 3057 2312 -1469 -999 -626
738 -626 90 2971 740 -2377 -1237 1565 1983 874 -1305 -2214 1245 2407 615 -990 -1176 -526 2257
755 2257 2261 -1920 -1891 506 1453 1225 124 -2292 -1248 2378 1615 -739 -1697 -762 534 2296 137 -2480
773 -2480 -1201 1031 1437 251 -1360 -2419 617 2235 57 -1619 -1639 -310 1507 1633 -1865 -2088
789 -2088 191 1103 1067 -357 -2268 -1313 2439 1317 -1147 -1261 -872 442 2197 410 -2559 -815 1298
806 1298 1564 567 -1448 -1666 1120 2363 -84 -786 -1065 -409 2163 2019 -1929 -2080 1256 1419 1021 -138
824 -138 -1805 -565 2197 1484 -761 -1134 -1034 1206 2432 -407 -2595 131 1524 499 818 -1122
840 -1122 -2128 877 2466 -382 -1474 -1202 -106 2227 738 -2019 -1436 542 638 799 -179 -2596 -807
857 -807 2391 859 -1818 -779 -734 378 2022 -756 -2209 -364 753 841 618 -1639 -1707 956 1873
874 1873 -174 -1689 -481 53 1405 1167 -1520 -1397 901 830 785 317 -2171 -426 2547 997 -1262
891 -1262 -753 381 295 1461 604 -1935 -842 1893 1120 270 -718 -2051 1670 2243 -1115 -601 193 -895
909 -895 1393 2103 -1537 -2084 762 2068 103 -812 -1010 -605 1783 802 -1029 -745 -1044 208 2930
926 2930 -649 -3256 446 1246 557 -124 -1181 -1336 190 1706 608 -2095 -1734 1078 1304 682 -1891
943 -1891 -1673 1081 914 372 -628 -1926 -501 2040 1101 -1247 -2045 209 1928 310 -31 -1498 -1009
960 -1009 2134 1289 -920 -696 -772 835 2613 -567 -1750 -235 1015 1698 82 -1226 -954 941 1877
977 1877 184 -1242 -502 -62 1747 1569 -2196 -960 984 828 761 -801 -1531 532 741 751 213 -2213
995 -2213 -300 1650 564 -380 -1353 -493 1033 566 -125 -640 -1205 353 1134 182 -1262 -1622 1277 723
1013 723 -781 85 -1063 -824 1558 143 -975 -300 -1064 1151 1275 -1298 -819 146 297 697 194 -912
1031 -912 -857 430 1856 -243 -1222 -69 -254 1422 741 -1234 -424 387 772 1321 -692 -1262 500 826
1049 826 1286 -463 -1338 425 636 988 389 -1621 -488 1553 487 225 -736 -1287 1008 1439 49
1066 49 -1430 -746 616 939 593 -877 -1914 667 1719 -512 -299 -1328 -911 2129 610 -1749 -682
1083 -682 -124 457 1314 -769 -1819 -203 1261 920 -660 -1115 -978 892 1500 -765 -1581 -1 208
1100 208 971 786 -1983 -753 1134 800 241 -846 -1004 645 1368 382 -897 -1124 597 1013 642 -354
1118 -354 -1415 338 1558 472 -360 -754 -488 1233 1407 -547 -970 -208 931 770 147 -786 -940 1014
1136 1014 1292 -315 -610 -441 -247 1516 411 -1451 -359 240 607 696 -598 -1598 283 1257 92
1153 92 -440 -807 -590 683 1137 -1019 -1131 53 89 789 392 -1599 -803 1094 312 -165 -628 -1083 352
1172 352 1140 29 -1132 -506 -69 749 728 -858 -1177 311 1035 134 -236 -952 -443 1130 931 -537
1190 -537 -907 68 649 940 67 -929 -353 1083 936 -213 -614 -644 480 1367 296 -1267 -427 517 649
1209 649 702 -628 -956 354 1215 128 -450 -609 -478 1038 981 -838 -991 166 303 678 136 -1542
1227 -1542 -475 1103 417 -450 -557 -859 303 1258 -405 -1104 -404 14 475 702 -1023 -1140 702 745
1245 745 -70 -398 -826 -410 1309 533 -957 -521 -54 529 694 -272 -1220 -78 846 381 -59 -733 -534
1264 -534 696 1200 -316 -845 -250 349 947 453 -695 -800 760 862 184 -345 -508 74 1060 824 -892
1283 -892 -657 291 557 698 6 -1058 -124 1068 398 -241 -568 -531 504 1152 -382 -953 -50 189 649
1302 649 444 -837 -1072 633 745 -201 -458 -813 -262 1081 293 -1056 -535 8 283 758 -584 -1180
1320 -1180 -103 904 290 -343 -702 -426 570 684 -369 -1021 -53 338 660 278 -1088 -503 762 766 -53
1339 -53 -429 -591 382 936 179 -582 -656 466 725 473 -330 -923 81 974 214 -342 -426 -365 840 597
1359 597 -531 -513 -147 478 620 -57 -878 -118 491 693 -63 -677 -376 95 950 98 -816 -354 92 586
1379 586 322 -814 -668 226 247 396 -506 -875 -54 487 286 -274 -725 -237 531 251 -15 -718 -551 490
1399 490 338 194 -572 -643 374 707 -146 -366 -557 12 770 164 -221 -684 18 845 223 -186 -530 -339
1419 -339 1001 663 -531 -102 -356 172 1107 -221 -784 94 489 522 361 -567 -499 425 915 7 -641 -66
1439 -66 -160 800 788 -1108 -719 580 289 575 -33 -1256 180 845 109 -129 -795 -261 580 681 -331
1458 -331 -996 -240 675 233 -296 -647 -938 780 665 -542 -340 -506 129 851 -119 -928 -409 263 824
1477 824 -33 -512 -420 -130 984 310 -1074 -254 299 216 777 -574 -852 571 360 275 -74 -637 -210 649
1497 649 851 -311 -643 261 276 237 444 -897 -366 1009 82 64 22 -785 229 919 -263 -305 -133 -90
1517 -90 436 256 -284 -681 175 638 -93 -100 -326 -492 590 460 -641 -21 -326 -48 718 -111 -733 -249
1537 -249 115 383 34 -330 -361 -130 365 350 -676 -309 -26 144 539 -385 -719 94 366 91 -25 -625
1557 -625 -246 437 501 -47 -603 -21 151 335 383 -635 -475 707 365 -7 80 -702 188 931 -131 -378
1577 -378 -96 43 480 537 -382 -559 137 597 144 -63 -403 -454 810 437 -482 -200 -60 103 723 -66
1597 -66 -786 17 318 401 93 -477 -435 202 668 -40 -569 -246 85 249 338 -556 -510 358 232 170 -195 -562
1619 -562 -140 523 279 -370 -396 -58 321 192 42 -766 -167 436 81 -114 -218 -386 169 634 -162 -459
1639 -459 -147 135 498 246 -353 -404 280 409 190 -139 -380 -84 812 309 -402 -227 -6 204 498 -32
1659 -32 -485 3 388 60 141 -384 -351 415 450 -78 -444 -71 -77 473 253 -452 -395 204 206 96 -25 -608 -75
1682 -75 506 150 -417 -276 -127 128 426 -277 -564 -101 510 36 -2 -326 -388 335 334 -107 -415 -59 -5 310
1704 310 94 -590 -222 174 182 -64 -166 -415 -100 557 138 -300 -218 -43 120 591 -182 -490 139 326 251
1725 251 20 -271 -244 562 396 -108 -328 -89 180 410 292 -513 -119 396 311 108 -108 -367 98 597 -28
1746 -28 -333 -170 30 278 429 -196 -460 99 146 179 -59 -185 -283 326 267 -260 -336 -190 75 341 -21 -507
1768 -507 -237 207 118 37 -157 -342 41 442 69 -393 -171 -105 207 308 -224 -447 202 282 156 -15 -378
1789 -378 -182 318 343 -133 -190 -144 80 492 5 -428 -119 305 388 143 -127 -378 178 443 72 -249 -81
1810 -81 -54 378 319 -289 -171 124 246 116 41 -410 -140 451 274 -184 -288 -115 48 468 -38 -476 4
1831 4 121 96 102 -327 -309 256 271 -28 -203 -152 14 314 169 -369 -505 224 134 88 27 -549 -160 449 60 -81
1855 -81 -272 -109 256 420 -170 -365 -21 155 142 -60 -222 -292 273 447 -143 -111 -54 -43 360 139 -399 -75
1877 -75 219 77 227 -60 -184 1 220 85 -183 -53 67 127 386 -41 -346 279 155 66 285 -223 -145
1898 -145 300 135 -77 -127 -138 43 157 -16 -225 -243 203 48 -16 54 -417 -33 413 28 -150 5 -341 180
1920 180 305 -280 -238 -32 103 21 46 -72 -244 109 371 -165 -108 30 -161 471 317 -386 -31 145 94 359
1942 359 -43 -395 107 208 211 -33 -190 -74 19 395 4 -383 90 126 108 274 -423 -235 422 263 -76 -131
1964 -131 -246 150 309 77 -271 -238 185 268 33 -8 -315 51 460 -38 -168 -71 -84 252 264 -288 -242 13
1986 13 119 98 -146 -177 -129 229 353 -232 -222 84 -63 185 47 -473 19 216 10 103 -155 -277 203 154
2008 154 -109 -124 -186 129 153 90 -28 -380 203 165 46 -42 -178 -75 269 84 -230 65 -203 113 237 -39
2030 -39 -86 -49 243 168 -2 -102 -51 36 280 -87 -149 -1 -141 251 148 -219 -50 93 146 74 -98 -193 79
2053 79 217 179 -45 -132 11 -76 174 50 -118 -77 81 6 55 -181 -249 91 113 -34 -200 -215 -20 250 124
2076 124 -212 -145 -30 125 14 -67 -190 -69 338 79 -198 -114 -78 227 273 -192 -134 0 56 154 18 -105 -210
2099 -210 251 134 66 -43 -79 -94 220 184 -286 -51 29 83 138 -124 -152 -33 307 28 -209 -222 13 263 176
2122 176 23 -216 58 110 79 56 -110 -236 118 264 -78 -120 -52 23 204 125 -146 -144 93 4 131 -117 -183 -9
2146 -9 210 80 -97 -152 -85 30 197 -75 -121 -23 -29 140 23 -208 -206 158 110 -87 -133 -113 7 293 110 -210
2170 -210 -87 92 106 143 99 -96 98 275 96 -108 -52 -204 133 274 -52 -238 -15 171 173 140 -272 -39
2192 -39 155 106 -1 -162 -54 20 215 2 -204 -50 100 88 86 4 -245 22 164 61 65 -137 -78 12 125 -128
2216 -128 -209 -3 74 9 -39 -160 -87 144 -5 9 -69 -29 42 174 31 -297 4 24 87 43 -83 -232 -30 89
2240 89 38 2 -210 -76 167 -38 -90 -97 145 132 176 -22 -116 1 214 46 -14 -45 -157 111 286 27 -46 -53 44
2265 44 52 -5 12 -94 118 64 -19 -139 -29 -75 209 122 -141 -37 63 22 113 9 -244 -42 86 45 -10 -89 -116
2290 -116 89 158 -33 -118 -33 59 61 51 -174 -229 112 136 -46 42 -97 -207 103 10 -158 -51 -45 131 0 32 -186
2315 -186 -104 153 73 -93 -91 -29 -34 101 -41 -154 20 -6 198 107 -112 -198 142 230 87 -71 -14 -61 154 52
2339 52 -138 -74 39 14 111 4 -326 16 228 110 27 -130 -96 93 174 34 -136 29 99 37 54 -87 -295
2362 -295 220 127 -69 -29 -160 -50 161 65 -84 -160 9 98 143 -61 -66 -22 124 13 -125 -15 -81 59 117 -93
2386 -93 -165 -23 83 -41 67 -133 -30 17 44 -60 -156 -71 16 69 22 -145 -37 69 -38 66 15 -142 60
2409 60 142 14 102 -139 22 91 36 28 -64 -74 -32 125 85 -82 -201 114 124 100 49 -8 -23 140 57 -74 -48 38
2435 38 -9 30 32 -188 -68 66 153 -133 -32 -121 -86 124 -41 -62 20 21 0 106 -167 -116 81 73 19 -180 -168 109
2461 109 124 75 -86 -77 -2 76 80 -30 -165 49 169 -6 -40 -140 -172 119 95 -107 -93 -137 56 120 77 -28 -103
2486 -103 34 130 -22 -102 -74 -20 120 70 -130 15 92 54 172 -118 -96 -23 99 90 14 -86 -72 50 123 -71 -113
2511 -113 -22 -45 63 52 -247 -57 114 -38 -36 -69 -55 31 66 -35 -20 -106 7 141 26 -127 -67 98 164 -40
2535 -40 10 -126 -129 153 133 -104 -185 -9 -8 111 29 -39 11 18 106 -43 -82 -59 -48 77 11 -93 3 45 116 82 -31
2562 -31 -11 90 -17 52 -44 -57 -26 64 89 86 8 80 150 48 112 -83 -59 148 24 55 19 -98 23 76 13 -152
2588 -152 -76 -54 -33 141 -114 -130 52 69 39 10 -37 -77 178 97 -54 -42 -132 -51 103 -13 -200 -19 37 1 -63
2613 -63 -132 -74 -57 73 39 -98 -83 -41 42 130 -96 -63 91 -33 93 10 -108 -6 78 145 22 -91 1 44 92
2638 92 -2 -99 -89 88 98 -12 -75 -209 -22 98 6 -93 46 -35 -28 156 -29 -102 13 88 144 -46 -38 10 14 54 -101
2665 -101 -70 46 45 156 -11 -99 -17 25 13 -23 -2 -148 73 11 -82 -8 -100 -16 76 51 -126 -60 -29 55 24 -15 -166
2692 -166 -119 116 116 -63 -74 -61 114 66 56 -77 -70 -130 -40 4 -48 -153 30 179 39 -89 24 17 71 103 -141 -75
2718 -75 -33 -12 -85 29 -141 -51 132 146 -14 -38 39 -141 87 72 -72 -49 142 -22 52 11 -98 103 140 76 -13
2743 -13 16 128 86 45 -38 -143 120 84 -37 -4 -183 -31 124 77 -98 -36 9 26 181 -22 -88 -42 53 -24 2
2768 2 -132 -188 18 64 63 -65 -45 -91 147 53 -123 -46 106 55 24 19 -117 -10 -24 141 -39 -26 -16 -86 58 -34
2794 -34 -117 96 95 92 -48 -28 -130 169 17 18 -36 23 95 38 177 -101 -109 139 75 -30 33 -199 -44 224 -34 -130
2820 -130 -25 9 72 10 -97 -39 -133 151 113 9 -50 -170 60 63 -52 -42 -87 -66 23 25 -174 -105 78 110 35 -129
2846 -129 -100 -74 49 75 -165 -21 32 -34 82 -58 -164 46 90 50 88 -44 -57 141 81 47 -52 -54 49 94 56
2871 56 -86 -43 114 -30 -108 37 -163 23 101 -18 -65 -28 -86 114 34 -114 -129 -57 63 72 -9 -48 -129 114 65
2896 65 -139 -52 -42 22 201 35 -168 85 64 -36 86 -2 -44 62 62 33 -53 -119 -2 -88 52 -108 -230 45
2920 45 27 -27 92 -183 -113 69 -7 -48 -58 -66 -6 90 77 -71 -2 65 49 -28 4 -206 52 105 8 9 -30 -106 101 44
2948 44 -91 -2 -16 0 60 89 -115 -118 -17 117 -32 -20 -4 31 60 11 -185 11 -63 -31 150 -112 -135 47 -18 134
2974 134 -42 -29 -42 73 29 -160 -134 -34 -4 37 47 -151 -120 65 54 -48 -44 1 87 40 5 -170 -38 -46 48 5
3000 5 -92 -74 69 159 -25 -73 -73 -98 58 78 -64 -60 41 63 113 -12 -186 -61 157 52 31 -81 -138 59 145 7
3026 7 -82 -9 67 -43 123 -5 -102 28 128 72 -117 -105 -79 147 58 86 -12 118 79 -37 -27 -43 31 152 -61
3051 -61 -47 -10 -62 27 75 -120 -45 -61 15 96 -49 -63 -39 74 101 17 -64 -53 -4 169 51 -232 -112 -72 -15 67 -3
3078 -3 -155 53 74 59 -3 -104 -83 53 106 -37 -62 -93 -10 64 -2 -143 -79 131 45 19 4 51 14 176 39 -42
3104 -42 63 52 24 135 -28 -80 -11 85 -68 -8 -58 -32 108 175 -32 -120 -20 51 135 109 -88 -31 91 138 24
3129 24 -71 -54 16 110 -32 -49 -45 -45 -25 101 -28 -134 -13 78 4 45 -85 -21 122 35 -47 -117 -82 24 17 95 -177
3156 -177 -20 52 -3 -53 19 -124 -10 58 -59 -115 -47 93 -26 19 -22 -93 132 86 16 -15 -17 -115 64 71 -176 -41
3182 -41 -33 -16 78 128 -33 -86 81 -24 44 -28 -90 -37 192 33 -151 23 10 32 50 -27 -133 20 48 12 -109 -39
3208 -39 -20 31 31 -39 -80 -20 88 79 64 -80 5 115 38 19 -6 -107 -16 201 -76 -58 -47 -55 14 105 -68 -100 94 71
3236 71 -69 -149 -42 15 155 27 -114 -16 25 -92 204 -39 -108 91 91 94 -56 14 101 115 -12 29 12 9 15 4 73
3263 73 -110 -104 89 90 57 -9 -49 34 97 110 -50 -18 -16 87 37 -31 -63 -7 24 -9 -71 -47 -37 81 171 -76 79 41
3291 41 4 70 14 -50 -110 -66 14 60 -72 -98 -45 82 41 -128 -59 60 -32 49 -34 -84 -21 122 25 19 -103 -58 35 54
3319 54 1 5 -22 10 44 -32 -55 -121 42 -6 -6 -10 -69 -68 137 53 -56 -46 103 121 80 -19 19 -50 116 -14 2 48 -39
3348 -39 76 63 -29 8 36 -69 39 24 -113 -57 69 78 86 -77 -97 -34 106 178 49 -20 98 8 106 -175 -193 115
3374 115 7 50 24 -130 -124 -13 22 -36 -18 -13 86 29 28 -42 -115 36 58 -25 53 -29 39 95 63 -29 -55 -79 187 8
3402 8 -84 31 -16 68 63 34 -44 15 -1 67 -42 -22 91 47 55 -11 -118 31 -17 -23 108 -39 105 -39 103 38 -11
3429 -11 -59 62 -35 16 22 28 92 132 -55 -31 -118 -60 77 -150 -97 -7 -14 2 18 -131 -97 -132 -13 57 7 -34 -112 -1
3457 -1 -10 -58 -51 -48 -39 159 -17 -46 -43 -45 4 6 -70 -83 39 58 -10 -136 23 -21 -15 86 -28 -53 45 53 178 62 121 -53
3487 -53 147 72 -32 -45 56 112 31 173 -7 -41 125 67 14 -5 6 102 115 18 -1 -28 2 33 26 12 -88 -59 102
3514 102 112 54 -28 -50 -18 -13 -84 -73 71 62 25 11 10 -114 -4 -15 -48 -65 -57 19 85 28 -3 -24 118 27 -18 56 -28 47
3544 47 71 -26 41 -95 0 83 -54 -41 59 53 -13 126 -9 92 8 -27 15 67 -103 1 -36 140 -27 -61 34 17
3570 17 -13 38 62 -44 19 36 2 -3 -29 -50 58 -6 83 -96 -4 7 136 121 -94 44 -49 65 34 -32 -51 -51 43 -121
3598 -121 42 73 -64 -14 76 -55 -174 -36 -25 -114 -150 -81 -75 8 6 -17 10 -33 -77 81 80 11 -25 -7 0 20 -110 -11
3626 -11 79 81 35 12 -73 2 -73 34 41 -72 54 -55 30 -62 -74 11 38 72 42 20 -90 45 -12 47 -28 -116 51 -17
3654 -17 87 -118 -88 15 92 11 -5 12 -37 174 -7 -94 -22 55 47 -35 -16 -54 -86 67 -37 -50 4 -31 45 28 -69
3681 -69 -124 8 27 -149 0 -26 -109 20 38 -72 -54 26 92 9 99 -13 -89 -21 -64 47 15 8 -46 -3 116 32 18
3708 18 73 -48 83 45 -27 34 -13 -40 52 8 -12 111 67 74 -6 36 -13 35 25 -9 -10 2 -18 -46 7 -25 -11 32 -14 -43
3738 -43 5 45 110 14 -20 -57 19 17 33 10 -12 36 100 51 66 -64 60 -49 -59 -22 -113 -91 -3 -134 -9 49 -56 35
3766 35 34 -26 -142 -75 -12 5 79 121 -130 33 76 -43 58 27 -64 8 1 16 -55 -9 39 16 109 102 38 107 69 7 -46
3795 -46 -102 -82 87 -63 -100 77 -100 -13 -22 -121 -1 -133 29 136 -26 -30 -26 97 21 2 -27 40 35 -37 13 -124 -27
3822 -27 116 48 26 -24 -44 4 53 -23 77 -5 11 3 44 81 -101 30 71 -37 -9 40 -58 72 -16 63 -97 -59 1
3849 1 48 -17 -4 25 -38 135 31 -104 -104 -31 117 75 -130 35 39 48 123 -46 -19 -71 102 47 -44 -43 15 92 65 21 50
3878 50 31 -49 46 -2 -50 -4 26 -3 -2 -60 -6 -20 -25 -58 50 -107 0 -29 83 -49 -21 36 42 49 -63 46 -47 -21 -80
3907 -80 -178 -1 -84 -78 25 67 -80 -107 -129 10 58 12 -35 -27 -41 -17 26 34 -49 -51 -47 -144 -109 83 33 55 -35 -39 59 39 -40
3938 -40 -19 13 -66 61 -46 -3 31 52 42 -18 95 28 13 61 128 -93 -13 28 -85 164 -61 -101 9 56 -61 102
3964 102 -23 9 131 82 1 -163 -84 -41 17 135 8 -85 0 -47 101 39 8 27 -10 109 59 -38 -83 -62 110 -45
3990 -45 75 1 -18 -60 100 -52 -122 -23 -19 26 -58 -39 -11 -46 13 -35 -100 14 97 -3 29 3 12 -36 87 3 54 -1
4018 -1 21 28 18 -79 -71 -11 -21 102 -25 -64 42 57 5 57 23 -58 35 6 -105 -47 11 -31 53 -40 10 -59 85 -76 51
4047 51 -59 9 84 21 2 -137 -4 -3 19 -85 48 -93 111 -25 -12 -37 -63 30 40 -60 -62 -7 84 98 2 -35 -43
4074 -43 -6 127 76 -37 -101 -53 23 143 -51 -156 2 -26 -22 75 91 45 -41 48 -16 -49 -31 -1 130 7 -36 62 66
4101 66 37 70 32 87 -11 84 13 -28 19 30 -41 90 17 -146 26 -23 8 -44 -82 -80 -47 -34 -56 -5 26 -81 165 -69
4129 -69 15 -24 -12 15 93 -28 116 -24 94 49 -23 -7 -113 15 62 48 -23 -212 83 97 -31 -56 35 102 26 -34
4155 -34 46 -79 -66 4 11 -110 -62 -6 77 73 83 -116 4 -35 -131 -90 -42 35 -75 82 103 -122 -34 1 99 21 4 5
4183 5 -59 42 -99 22 -82 26 135 -18 2 25 -25 63 114 28 -91 -10 -35 -54 -93 -84 -48 128 49 -39 -7 -14 67
4210 67 64 -58 -56 -20 3 -37 -8 -5 -18 -63 -18 -28 17 38 59 -26 56 14 116 39 -45 -22 31 23 151 80 117 -109 11 -61
4240 -61 84 17 7 -63 -70 -56 10 43 109 8 48 142 12 -95 -28 -48 47 27 -27 -29 -51 80 -27 -160 -30 71 -13
4267 -13 74 -35 -117 92 -54 29 -32 44 39 72 14 -39 -8 -111 73 38 87 -19 18 -20 84 -94 11 -81 -5 20
4293 20 -4 -26 51 -36 51 76 -134 29 17 -25 4 -51 -14 -55 47 79 -34 27 -74 79 93 17 -5 97 37 -47 -36
4320 -36 -55 -42 -16 -25 2 -76 101 43 84 59 -91 -19 24 19 -67 -14 -63 106 -4 -71 33 91 -87 22 45 10 -17 -39
4348 -39 64 -4 9 2 -5 91 -48 -28 -22 39 -7 91 -28 -32 2 -91 38 -3 12 25 66 -6 -43 -35 -23 -52 -6 19 -43 -125 74
4379 74 -12 -98 42 -20 -145 43 98 40 -26 -26 91 0 -29 -97 -23 10 31 13 104 -100 13 -32 -108 73 -56 32 39
4406 39 94 -63 21 -11 -31 92 -66 -63 51 -50 78 -39 -8 23 -19 -15 -79 -44 121 -8 7 -30 -21 -81 19 122
4432 122 21 20 -103 64 74 59 82 -36 -6 26 -30 11 -4 -14 61 -36 -32 30 3 -41 -47 9 -1 84 75 -30 62 87 -97
4461 -97 20 -15 -6 -29 95 -9 91 -7 23 116 -13 -33 12 -91 -42 -46 49 81 -13 9 70 3 122 -37 -28 -53 36 93
4489 93 -29 3 -10 39 18 -39 -57 -17 17 26 6 -35 -16 85 96 69 -48 -24 14 -33 43 28 -37 -15 -11 30 57 -69 8
4518 8 0 42 89 -39 5 51 70 -93 15 -79 45 79 -40 -7 -63 15 86 -95 -39 -37 -31 15 91 -83 29 17 79 98
4546 98 31 10 45 60 33 54 -20 -71 131 118 42 22 -24 61 124 42 -30 28 24 90 40 -5 31 30 47 -35 -164 -66 24 11
4576 11 17 -45 -39 -48 87 22 -2 72 7 -4 -69 -11 -96 56 76 53 -66 -50 -46 -23 2 104 -121 -41 56 26 43 -104 -62
4605 -62 -27 -23 0 -66 -37 -69 75 114 -50 -65 -22 6 -87 -67 9 8 -1 15 15 10 41 -52 59 -53 63 -121 21 48 -95
4634 -95 -3 64 126 -4 129 -84 -28 76 -27 40 -25 -39 9 -32 28 -121 13 3 -20 17 35 -136 51 29 -114
4659 -114 5 -117 -70 -78 83 -66 46 -114 -37 58 15 6 -26 60 33 51 -33 -5 -17 -15 56 -14 -77 -52 51 3 66 37
4687 37 -52 -6 80 27 132 -7 -68 17 10 -41 -44 -36 7 58 -51 -14 89 -95 -89 24 -86 -45 71 69 -26 -40 -27 -10 81
4716 81 18 -29 12 -8 16 9 -63 -72 46 28 -15 39 0 -45 -36 30 -29 -32 -62 -10 -30 -55 -112 -29 44 38 96 31 22 126 98 0
4748 0 -48 49 -117 32 -18 -43 33 96 124 -4 -84 -21 3 56 36 -78 34 18 15 -21 -20 -18 1 -156 17 59 -92 38
4776 38 66 7 -95 -62 73 41 48 -8 -179 -10 14 6 26 69 -115 14 -18 -43 -131 -66 -42 4 10 -18 57 -10 63 -98
4804 -98 -45 0 -19 -102 11 60 -33 -34 -45 -4 -38 -132 -5 -115 67 9 -85 -54 4 -48 49 -70 18 72 -36 46 14 77
4832 77 15 -112 -9 49 13 6 44 83 29 -24 81 93 50 -3 -33 39 37 40 -56 72 1 55 72 -31 42 -38 19 57 37
4861 37 -22 66 -39 115 59 -84 -18 -53 4 -41 -28 39 -64 -2 183 -9 5 19 -39 42 -96 -109 61 22 86 3
4887 3 49 -8 -64 -51 35 -36 -78 117 -37 -8 -73 39 -53 109 -35 -48 77 -92 -15 30 -78 11 8 115 -91 35
4913 35 4 93 18 39 85 13 78 16 27 6 -53 -12 21 -62 64 -27 -33 32 12 -206 -35 -136 55 -19 -46 -17 -31 116
4941 116 29 -21 38 4 -27 -26 -13 28 -1 -20 102 70 -23 -96 79 32 53 53 -44 -17 59 77 -98 64 -43 -29 43 27
4969 27 -90 4 154 144 -28 -4 -44 -85 91 11 -15 -43 44 36 52 66 10 -49 -59 25 5 20 126 26 79 -2 -107
4996 -107 79 -68 59 -3 -4 -5 21 30 30 -87 -69 -16 -33 43 -41 5 18 -106 -76 -10 -104 14 -75 -16 14 39 -68 -13
5024 -13 -50 -21 26 -22 -50 -4 -146 -26 -14 -78 -41 -54 -75 40 50 6 65 -51 -62 -66 1 17 -49 -40 15 131 -102 11
5052 11 -6 33 -23 -21 -21 49 72 -38 -108 28 66 -52 -13 -4 138 47 -61 -26 77 13 -54 -14 -64 48 -15 25 25 -17 98
5081 98 45 24 14 28 57 -22 37 -57 -60 40 -6 23 -85 -76 14 11 43 -91 -62 -22 -51 25 -84 65 118 52 27 -36 -102
5110 -102 -37 40 -29 38 -98 -18 1 -1 -48 -10 126 39 -46 17 5 22 75 -39 -85 -23 -128 -74 15 75 58 -77 -18 84
5138 84 -42 -54 37 65 119 -2 45 6 -9 -50 37 -17 45 68 7 -10 14 -66 -30 34 27 -2 6 -43 -1 50 -3 -75 62 -31
5168 -31 -144 -78 -88 -32 -36 -19 -33 -34 -107 -94 29 -33 52 -17 16 -74 -12 -126 -87 13 18 26 18 146 -29 32 33 -20 -107 44
5198 44 -79 -72 -53 16 0 -41 -33 123 96 -8 165 -91 23 -106 20 11 91 52 21 -59 112 29 48 7 -70 21 -93
5225 -93 -5 9 40 24 17 17 9 -3 -135 -10 59 -74 65 23 30 155 -14 -54 -119 38 10 25 -29 -61 68 -8 68 -18
5253 -18 -48 43 14 138 -96 -16 -46 -14 87 -29 -88 -12 -14 -55 24 -129 -32 102 47 -65 -13 -6 -75 31 37 -65 6
5280 6 78 88 -19 -35 -83 25 89 -100 -4 -38 -56 72 64 -35 -29 -69 -32 -1 -55 -16 -21 -8 97 6 9 20 23 18 1 59 28
5311 28 13 -38 13 10 19 2 -58 27 122 75 79 -7 12 61 -72 -10 53 4 -26 -9 -83 -32 -30 62 -112 -88 68 55 -73 14
5341 14 -86 -49 -6 29 4 -20 -24 67 0 -67 35 25 38 -19 1 -4 -86 46 29 -58 34 -68 -55 74 7 53 19 -13 15
5370 15 -45 -60 86 -7 8 -7 1 -23 53 45 41 -37 21 -7 45 -32 41 -95 -48 -22 -132 -50 48 12 196 72 -69 38
5398 38 -55 69 -3 -59 50 -13 61 3 5 -89 -37 -37 31 98 -59 -75 -42 44 64 -82 59 -14 -76 -3 7 -4 16 62 72
5427 72 -40 56 -57 -8 10 -20 17 -34 39 -73 32 6 -89 66 -23 -50 -25 -69 -38 15 57 -43 68 2 46 95 51
5454 51 90 13 14 94 19 -21 -11 -3 -12 -27 -15 12 -40 1 -4 17 -35 -89 76 34 -38 37 -41 63 90 -9 38 32 -38 -16 -20 -48
5486 -48 -38 1 20 -28 70 101 13 15 -102 24 -73 -36 77 -38 -22 41 -15 58 -25 -143 -73 -100 117 -5 -6 -14 -34 85
5514 85 -17 40 13 -54 61 87 -60 48 17 -4 115 -61 -15 31 -15 -105 27 97 34 -92 121 25 -65 -20 -84 110
5540 110 62 -9 -49 151 -41 23 -11 -26 41 -33 -33 -44 39 -25 6 68 -50 -71 -39 -31 24 37 46 -19 26 -48 27 52 -77
5569 -77 146 -3 53 -34 9 -33 -52 -17 -22 98 20 29 -39 -24 -41 -20 48 21 -5 -81 -34 -42 -58 -36 -57 -63 99 -82 -78 -4
5599 -4 -138 18 46 123 -18 -11 69 -43 -27 115 45 -4 19 108 39 -64 62 -18 128 0 -119 -26 -17 38 60 30 -134
5626 -134 58 -34 -105 54 -57 -60 -11 29 -15 -16 -25 -12 -110 -63 29 -65 -72 59 -82 -42 5 85 49 69 -85 -118 32 -101
5654 -101 -28 -24 -54 34 -87 -63 -34 71 58 63 28 -88 -89 -3 -51 7 89 41 61 22 -4 18 82 27 -52 -53 43 -42 -14 -14 136
5685 136 -56 -102 -35 38 1 -99 40 30 -27 50 -4 104 -44 47 31 67 -39 -102 52 -13 37 20 -74 -83 25 58
5711 58 -53 25 -37 -119 32 -51 -30 -4 -22 -67 65 -110 -56 -69 38 -10 -63 6 89 -105 45 -35 8 59 -5 80 0
5738 0 -30 15 -49 30 -22 4 -10 0 -63 -88 -19 124 33 40 28 148 -35 -62 93 -50 -32 -39 21 78 26 -40 132 35 124
5767 124 26 -95 -12 39 6 12 33 -79 -43 -59 -9 43 -78 37 47 -7 22 -3 20 -14 65 15 14 -79 -35 56 -61 -11
5795 -11 74 -20 -17 -44 94 -7 47 8 -21 -51 -1 -49 41 -27 -70 -32 -82 0 -70 2 -40 50 35 106 13 -25 18 6 44 -34
5825 -34 -21 10 -26 11 -37 11 -25 17 -59 127 6 68 12 71 61 52 -20 -19 44 -35 19 -103 91 -35 -21 44 -76 63
5853 63 26 10 -58 -40 -44 -3 77 45 46 -10 26 -41 7 4 20 57 31 -55 21 98 -15 -42 45 -110 -68 -20 63 14 45 106 -47
5884 -47 6 -86 -39 -53 -90 -8 -13 -4 -88 -93 -30 58 -14 -103 -21 -106 -63 60 45 -45 8 -39 78 8 -1 43 -9 -52 32 -20 -63
5915 -63 30 -55 78 22 -27 97 -3 48 27 2 -191 40 -54 25 50 -19 40 27 30 -5 29 108 -60 37 -45 9 -110
5942 -110 -70 -44 8 -29 27 60 -56 -57 -30 108 -50 79 -18 -24 5 -13 4 -100 7 14 -15 35 -194 -45 -26 -44 -76
5969 -76 7 63 45 6 49 19 -96 -27 10 35 -109 -23 41 124 28 -55 -3 -17 29 -74 -20 1 -60 99 63 31 42 -26
5997 -26 -20 -12 45 26 -7 40 -61 14 -12 93 20 -22 -80 3 -59 -72 -65 -31 60 -33 51 52 -53 -62 -81 -36 84 -44 5 -88
6027 -88 -91 -20 -28 -49 -35 -45 -104 -14 25 -15 -42 99 13 74 -4 -8 -107 102 -15 -87 -39 31 -54 -33 -3 15 -18 7 23 5
6057 5 -59 -40 -65 22 -56 43 -84 85 30 -4 -61 1 18 13 -1 51 61 66 35 39 15 -3 -88 56 47 56 24 -72 96 -36 -6
6088 -6 -67 46 16 94 -20 41 10 -107 14 38 -89 -74 -46 0 3 -117 11 -11 -19 -54 17 -74 1 -27 -52 69 -58
6115 -58 66 52 24 -18 2 24 38 -87 -69 -69 31 33 40 99 -6 47 18 -185 -57 -57 42 19 -12 -28 -28 0 -112 -68 25
6144 25 23 56 -46 3 -1 -67 -107 -24 33 102 -37 -17 -43 -28 -1 -113 6 74 -53 113 7 -4 58 133 96 -11 0
6171 0 -42 -56 -109 -86 -19 -2 -75 32 -38 -30 -65 -70 -2 -59 -6 38 -11 60 6 -82 -60 -9 19 82 1 11 -25 -29 6 -23 -141
6202 -141 12 -58 -59 -88 30 -121 -37 -14 63 -37 -75 -50 81 7 56 4 -26 25 91 -20 -52 -102 -37 87 61 72 13
6229 13 78 -56 8 -29 -57 -4 -66 25 26 -2 -4 12 -18 -66 -18 -108 75 97 68 57 -6 13 -25 -84 -12 -14 -65 -136 1 9 -40
6260 -40 33 -31 -9 20 14 -7 -85 41 -48 -25 26 37 -31 -1 83 6 -175 -21 -25 17 -36 5 75 -75 -2 44 37 41 -73 -59
6290 -59 59 26 -61 -29 29 -52 67 3 18 -31 54 79 -10 -145 122 -92 68 108 -131 39 -176 91 23 90 28
6315 28 -64 37 92 127 34 -50 -28 36 44 39 -44 -51 -50 -49 -38 -111 79 -53 -27 -40 -133 -68 -40 -74 -28 17 24 -5 84 65 40 72
6347 72 31 -22 -31 57 50 13 -17 83 0 33 21 108 27 0 -55 5 25 -13 41 97 -51 26 -31 44 -28 -28 -50 -3 -3 20 -9
6378 -9 6 -47 49 -7 52 -55 -4 6 -32 -79 -33 5 61 -11 -15 -164 120 53 24 35 -52 52 -48 53 -75 38 60
6405 60 15 42 36 -48 26 3 -36 12 70 -24 124 8 67 28 38 94 22 27 -7 -32 53 109 -93 49 -11 -56 39 18 45
6434 45 -25 12 -18 3 -40 -58 21 -46 6 49 54 82 7 -21 45 32 39 -41 -85 -30 22 -4 -2 -11 17 -1 54 -29 26 20 -31 -13 -27
6467 -27 99 75 85 49 25 37 -52 -101 7 -23 28 -19 19 -55 -18 30 13 -85 -5 -4 -24 53 -17 48 -31 -3 1 0 130 88
6497 88 -40 -2 -17 -56 5 15 -92 10 35 -21 60 -51 77 -52 44 24 123 -9 -16 -42 -68 49 13 -12 -7 -7 -18 54
6525 54 -65 87 99 -12 28 -88 13 -73 -43 -5 -4 -43 -121 103 -70 -8 39 -6 -21 109 16 -68 -58 62 -22 79
6551 79 8 42 -7 4 -103 18 18 11 15 11 -19 -45 62 -18 0 45 -64 14 9 7 94 34 -11 -82 43 -75 69 -36 18
6580 18 11 -161 -32 -9 -34 26 92 29 -1 -105 -24 -10 55 28 28 -44 38 15 -22 -40 -50 65 -69 -26 -81 -51 83 40
6608 40 -20 102 -81 5 -78 12 81 -5 149 -19 -60 -36 18 -5 15 -35 -23 132 56 -18 53 -2 -23 58 29 10 -36 51
6636 51 91 -155 30 82 -22 -35 12 -5 -18 -21 76 54 10 6 66 9 19 26 -38 119 -13 -5 2 -111 36 -8 31 -9 -65
6665 -65 -73 -44 -8 98 5 -80 -46 -140 26 -30 -99 58 48 -55 0 42 -11 -47 1 -17 -58 -43 -52 37 68 46 29 15 -33
6694 -33 -67 -4 15 -89 -49 -3 17 -21 31 -11 -61 35 -41 -60 -81 34 19 -78 -66 -14 147 60 -104 66 13 32 60 14
6722 14 17 13 28 28 52 -75 30 12 41 -12 -51 21 -19 -80 29 0 -61 21 47 -118 4 4 -28 -5 -31 -69 -96 -52 22 4
6752 4 29 58 31 24 32 -78 -8 18 -50 -87 -28 23 -21 -24 -81 23 -57 -21 -29 91 -114 -8 32 -40 -14 -24 -17 -4 -3 68 25
6783 25 14 -41 -16 50 -47 26 -47 52 -61 -58 -32 -114 77 52 43 -48 -89 30 122 134 -62 -17 29 -16 -57 48 60 5 91
6812 91 21 -133 4 -47 56 5 -18 -21 -55 106 -82 42 -14 -63 -61 -52 120 11 63 -50 94 -53 42 40 -19 23 -44
6839 -44 49 70 28 80 10 -70 -102 -100 69 -53 -8 62 4 28 31 32 30 1 -21 44 13 -12 30 35 -26 -10 87 53 -7 -97 31
6870 31 -76 68 -90 -17 -46 7 32 185 -6 -24 -73 25 37 -35 14 -35 -9 14 79 -13 48 -115 69 -69 -31 98
6896 98 -23 11 37 52 57 59 -73 21 -98 -34 10 -12 -60 -32 -29 83 20 -17 24 15 -106 -3 -52 -46 -27 -52 54 12 24
6925 24 -18 2 -29 96 -44 46 4 -19 64 117 81 9 -54 -39 101 9 23 75 -2 108 -34 -32 35 -56 -54 -115 -50 -46 -17
6954 -17 -113 53 -21 62 43 30 -114 49 36 9 -24 -34 171 -16 107 14 -95 -27 -52 41 4 -4 -11 -1 -7 14 -88 51
6982 51 23 -16 -81 -94 -49 -44 46 -30 -88 114 15 -26 45 -9 72 35 89 -30 -63 94 104 53 129 22 54 -39 100 16
7010 16 23 -28 -12 144 34 -44 8 -19 -42 64 -88 -12 130 -112 -49 -46 36 -12 48 -5 7 -54 -34 26 65 43 66 7
7038 7 -17 29 90 -28 -8 77 111 45 46 91 119 112 102 7 45 113 -111 74 87 -78 19 -47 80 140 -37 58 64 -40 65
7067 65 -69 -47 -5 -86 -18 22 -9 -4 108 -24 50 50 21 24 -51 72 31 -17 46 55 37 21 66 -136 -27 -43 23 17 18 -12
7097 -12 34 -35 -45 72 -4 -88 5 -102 -14 -29 0 58 57 20 7 66 -25 18 21 28 4 46 -45 49 -65 -35 19 44 55 -7
7127 -7 13 50 51 -4 -26 -21 -38 -11 18 47 -20 70 4 81 39 54 20 -23 -34 -53 50 13 109 -16 -19 61 -30 -32 -62 -47 24 8
7159 8 18 25 -40 -17 -54 13 60 85 16 28 -94 -53 -1 46 -33 -30 -93 49 28 -2 4 -23 74 -24 -49 -12 -57 1 32 -96 90
7190 90 124 -75 73 -14 43 -37 0 -15 54 51 -2 -86 46 115 39 -38 71 12 54 -26 -87 122 16 -97 9 59 23
7217 23 -58 -69 29 34 3 23 -24 -12 -72 48 -21 -86 1 -19 -45 10 45 -25 -75 -14 -20 -71 21 24 -36 -59 -32 60 -50 -70 61
7248 61 28 -24 -51 110 8 123 -16 -2 4 -19 113 56 56 -59 52 77 21 -75 56 61 -42 28 133 -74 -160 -55
7274 -55 6 -80 59 54 -16 34 102 120 51 -59 -37 12 21 -122 -13 48 -85 65 23 -48 40 43 -78 -37 12 129 70 -35
7302 -35 -47 -65 -33 -102 46 -8 -20 -40 2 -4 -28 -41 5 24 12 -1 35 119 -12 -22 -75 -23 2 -96 -29 26 7 -45 -29 -28
7332 -28 12 87 48 -1 67 47 73 -27 33 -89 0 -10 59 62 -5 64 54 -110 39 111 22 4 27 -21 26 85 5 66 -47
7361 -47 -18 55 28 -80 -54 -48 83 24 2 -27 23 -49 -3 -52 -2 55 -208 -10 66 -49 -20 -96 49 80 31 -24 -11 27
7389 27 -72 21 0 -5 31 9 -22 13 -16 70 -112 -18 -4 61 48 -12 110 8 -8 23 62 82 41 23 -66 85 104 59 11
7418 11 -59 137 52 -15 -51 41 -115 40 -2 -47 74 -75 6 -49 30 35 -26 3 5 67 -137 49 32 -21 5 14 59 15
7446 15 60 -34 20 -28 -63 -50 28 -77 127 94 -22 12 16 40 74 37 -54 -111 -26 56 -12 107 92 -22 -18 42 41 -28 -81
7475 -81 -21 2 -77 10 38 33 1 174 21 139 -56 -7 48 -29 7 25 25 85 65 -2 -19 -16 -2 41 -69 121 -44 -45 -28
7504 -28 -24 95 -94 25 -66 -62 -78 37 -125 117 42 -5 50 5 72 -105 -20 60 -18 46 -59 13 12 28 -64 -49 32 93
7532 93 56 3 56 35 -9 -22 -1 -14 5 49 27 30 -10 27 -34 53 99 -73 -55 -15 97 55 -26 -2 -43 -73 -133 69 -1
7561 -1 -39 -20 -2 -36 54 -6 -59 -50 95 73 -72 80 -16 27 -14 -74 -58 -40 55 -68 -35 -12 -40 -20 -148 -88 -40 -32 -35 51
7591 51 87 96 -12 23 -70 -6 32 -19 -17 55 -54 -60 114 5 53 -101 14 8 -76 73 -37 13 15 51 11 27 33 -10 54
7620 54 7 35 41 -109 123 -61 144 42 -2 -9 -1 -3 -46 -29 10 69 88 56 42 6 -38 -62 78 -52 68 31 -51 -94
7648 -94 1 25 37 -1 108 -59 20 -10 -37 49 -52 -24 -55 -39 -49 5 14 -15 2 -24 -19 88 -35 -37 -60 2 -149 -63 -27
7677 -27 -100 -32 -33 -10 -11 26 -2 104 -6 33 -31 34 -13 -19 -24 8 -27 13 85 46 90 -45 46 -1 -3 20 10 -67 52 79 -55
7708 -55 -17 -38 77 -48 52 -17 -91 -121 39 -55 -69 -49 -88 1 -16 -46 -56 -24 107 92 38 6 57 -2 75 25 29 105
7736 105 -38 -24 43 23 -59 -35 -37 30 55 98 -77 -54 -98 -30 -21 -116 -14 -39 -42 -47 68 -163 -94 1 -70 -57 -4 -56 -13
7765 -13 -15 15 -49 90 7 42 -19 22 103 -89 -26 -42 -20 -24 -51 121 -12 -72 -23 -116 19 40 -11 -35 -99 -48 -36 -47 50
7794 50 -8 -24 -37 -85 61 -22 -58 -59 43 -32 -49 -59 -14 68 -65 22 56 -17 21 27 -29 59 31 -53 11 20 -67 98 -38
7823 -38 -44 21 -56 -59 -14 -4 3 -8 20 -27 -39 -39 -40 -80 -65 34 -9 -60 27 -5 -49 105 25 -53 -21 6 -6 4 -7 -30 31 2
7855 2 -23 23 27 18 1 -3 -81 -27 15 2 37 -27 -48 -74 -44 -87 10 -8 -87 27 -54 -28 -27 73 -21 -41 20 -14 31 103 -17
7886 -17 -25 68 -46 -25 20 -62 -19 57 -9 67 42 -1 12 -1 15 -42 -26 -55 -32 -35 94 2 -55 73 -19 23 3 100 29 -121
7916 -121 1 -18 -4 36 49 -78 -21 -9 -141 23 25 17 14 91 24 -26 6 5 49 -29 91 -46 -26 56 -78 17 67 7
7944 7 4 63 -40 -30 43 -3 -111 44 50 -31 -44 -18 21 29 64 -45 4 -67 24 29 -76 -14 64 83 -13 -16 -90 82 -11 -88
7974 -88 34 -41 38 -73 37 -27 -42 -37 20 -111 -81 19 -21 -59 17 53 -32 63 68 -58 28 -51 38 12 -4 41 50 -10 -39
8003 -39 69 -9 45 -6 81 -58 -53 -43 -13 42 -45 84 -4 -11 59 8 126 79 50 14 19 2 14 -47 32 -53 67 -176 2
8032 2 -128 -60 50 -15 26 -8 -26 -125 68 -13 -99 -6 5 -68 28 -9 -144 -15 17 -111 -96 18 46 50 -24 31 -74
8059 -74 91 17 -68 -7 -44 -79 32 13 -8 -62 -20 -64 -120 -71 -27 -30 -47 -3 37 -7 107 55 29 44 -109 -73 7 101 -48
8088 -48 1 -64 21 93 -88 -24 0 -89 -17 52 6 66 -67 71 30 -12 29 56 56 -14 -69 -43 -53 15 16 95 48 10 36 -60
8118 -60 -143 33 1 -96 39 -55 69 -61 46 8 31 -14 -32 -54 11 -39 -87 -53 69 -43 18 -22 -43 40 5 40 -34
8145 -34 -92 45 27 6 -4 -24 54 9 6 -59 -11 -44 -67 11 -60 18 -35 0 1 -95 -25 30 -2 17 2 42 13 -54 31 4 -43
8176 -43 -38 -35 4 -49 -15 69 -38 -31 60 1 87 -71 -39 -6 -11
8191a1
$$ Imaginary data points
##PAGE= N=2
##DATA TABLE= (X++(I..I)), XYDATA
0 0 0 0 0 0 0 0 0 0 0 0 0 0 0 -8 8 -8 8 -8 8 -16 16 -20 24 -27 32 -40 44 -48 56 -65 77 -88 97 -112 125 -141
36 -141 157 -176 197 -219 243 -270 298 -331 365 -404 444 -491 540 -593 656 -721 796 -879 972
55 972 -1077 1197 -1338 1503 -1696 1932 -2227 2602 -3103 3798 -4836 6542 -9814 18227 -82165
70 -82165 -128753 139238 13099 -87811 45768 30516 -50350 15062 39331 24010 -27059
81 -27059 -43885 55166 62418 -69288 -30633 67748 -25971 -41010 57893 -20000 -69338 27711
93 27711 25459 -24090 -13225 -28498 9715 32670 -22066 -11258 10949 -6085 15627 18682 -3132
106 -3132 914 -12180 20007 49126 -28907 -34652 43088 13720 -31925 18890 6086 -41369 10394
119 10394 28986 -19654 -17463 -6639 -581 29675 -15710 -27794 33928 -9506 -17569 53468 -11417
132 -11417 -47335 48106 18495 -30224 25688 -122 -30405 29587 20183 -32780 -3938 8426
144 8426 -10741 7731 -55 -22417 -3684 1214 -1229 15787 -23102 -26362 35820 5434 -26342
157 -26342 18752 1063 -24612 26879 20300 -22683 -9962 10352 13824 14 -11606 -2856 232
170 232 -4791 11134 3719 -26926 -7524 21581 1044 -14491 1073 -6694 -1576 20668 -605
183 -605 -14893 869 7984 12634 6991 -13654 -34 10559 2338 13176 -3711 -20909 9662
196 9662 19163 -7752 -6422 -3115 -7709 10301 9457 -11921 -10699 2732 3920 10138 422 -18276
210 -18276 1362 15596 2687 -440 -3948 -9245 12188 11047 -7766 -287 -6856 -5709 19226
223 19226 3555 -25574 -1736 11694 -5114 220 -428 -13583 -4427 12104 3838 -8164 -11324
236 -11324 -1197 15737 2571 -11964 299 2727 -3768 12709 5544 -18729 -2602 14128 4154
249 4154 -5156 -5614 -4791 4259 6649 -965 -5919 -7809 2440 10040 2385 -8930 -5217 4232 8317
264 8317 4948 -5749 -4919 3334 7754 5613 -707 -7783 -988 10689 5307 -2579 -7362 -2868 8094
279 8094 6353 -5323 -5093 -2135 -1081 10104 2484 -13521 -4246 8951 3140 104 -2048 -8971
293 -8971 2664 10488 425 -5715 -3862 -1830 7821 6943 -9818 -6640 2735 2261 3386 -629 -11593
308 -11593 -3372 9195 1127 -3607 -4937 -5879 3603 9563 -3725 -9268 261 2739 4757 2877 -6033
323 -6033 -6921 5301 7828 254 -4360 -5747 2043 8018 2455 -6132 -4531 818 4893 5112 -3514
338 -3514 -7166 -639 8058 4448 -3170 -4903 -1270 5860 6690 -1053 -6588 107 4199 4904 2926 -5392
354 -5392 -5780 4927 8882 -2139 -5723 -1865 1455 4170 2975 -4414 -6532 1252 4432 4412 -4055
369 -4055 -9131 1971 7801 -658 -3153 -1347 -4708 2999 7716 -2450 -8586 -1251 4981 3104 -258
384 -258 -6389 -4168 4042 3797 -1666 -2799 -5122 -1293 8536 553 -7382 -2434 1012 3239 4465 -3432
400 -3432 -7459 2407 5955 1455 -2164 -2457 -2801 3568 7968 -2810 -6702 48 4131 4785 756 -7439
416 -7439 -1394 6461 1257 1172 -522 -6086 -331 10547 3313 -9619 -3069 6746 3120 -118 316
431 316 -5017 -126 5635 2500 554 -6688 -4998 10207 6764 -10594 -4139 5782 -347 -857 4429
446 4429 -3271 -10004 5265 9731 -4704 -7424 -1393 3655 5529 -3485 -6166 3269 -2267 -1013 9129
461 9129 -3732 -12907 4165 11540 -4380 -7448 1931 548 -1235 5164 -1118 -7659 1058 2932
475 2932 3392 627 -8841 -1232 9766 -399 -4634 1893 -1989 -489 6070 2186 -6527 -1908 5809
490 5809 1101 933 -86 -6130 2160 8709 -3915 -3029 3167 -3136 1860 5872 -2421 -5028 1179
505 1179 3962 2230 -1130 -3628 -819 4635 2467 -4159 1297 15 -4999 6733 4482 -9233 -2521
520 -2521 5833 490 -709 -1550 -2316 260 1126 1737 -776 -3245 -3346 2751 6749 -4475 -8587 5245
536 5245 3664 -4964 2785 -41 -6550 1417 6177 116 -6156 -3265 4425 4062 -2741 -3208 -291 1285
552 1285 140 2380 1839 -8383 -1267 10648 -284 -7038 861 942 959 3647 -944 -3492 -1632 4132
568 4132 4803 -2197 -4387 -264 4094 3330 -1665 -2967 -420 902 5032 1099 -6221 -374 3352 2155
584 2155 1293 -2917 -3397 2139 3907 1395 -3528 -4056 3249 2958 90 -1445 -3490 -106 3485 1653
600 1653 -1794 -4134 -1165 4630 1473 -2907 -3080 -929 3028 888 -1205 -1673 -2784 1157 4300 -911
616 -911 -4297 -1607 2251 3475 -2228 -2424 436 -1231 1669 3101 -2557 -4008 1171 3755 1289 -3589
632 -3589 -1786 2080 674 890 731 -1925 -2459 2680 4593 -1941 -4285 1934 2411 -182 1740 -1758
648 -1758 -2243 2300 2131 793 -1191 -2812 1201 4177 -465 -1747 -740 106 1797 1923 -934 -3241
664 -3241 576 2599 730 -238 -2344 -1989 3111 2422 -2679 -1314 -595 264 2525 364 -3088 -2047
680 -2047 1563 2398 -127 -2776 -1517 575 2112 539 -2348 -1920 -355 2187 1666 -2327 -3227 810
696 810 2287 490 -660 -2380 -1024 1750 2661 -1330 -3067 162 1620 1725 395 -2480 -1910 2777
712 2777 1881 -538 -1032 -1843 765 3293 698 -2538 -838 1034 1924 1690 -1705 -2295 1160 2615 364
729 364 -69 -1893 -1168 3335 2127 -2348 -1602 714 500 2083 426 -2853 -894 2137 1671 -415 -1578
746 -1578 -1840 1386 2301 -376 -1933 -1108 178 1692 1547 -2413 -2301 1120 1631 183 -968 -1982 -1131
763 -1131 2352 1244 -1807 -1918 -248 1060 1494 -375 -2936 -822 1780 1292 -624 -1535 -1539 951 2432
780 2432 -370 -1939 -1006 698 1722 1017 -1849 -2105 1347 1864 584 -655 -1688 -495 2639 1439
796 1439 -1811 -1060 273 1168 1763 222 -2361 -499 2261 1301 -205 -1622 -1035 1391 2366 -595 -1617
813 -1617 -340 221 1742 1332 -2059 -2318 1728 1762 -188 -752 -1562 -307 1937 1066 -1691 -1360 -263
830 -263 1111 1816 -984 -2747 12 2127 -79 -343 -911 -1824 857 2236 -910 -2317 -461 326 1729
847 1729 355 -2504 -1145 1227 1037 -91 -287 -1968 -262 2639 908 -2351 -927 668 598 1643
863 1643 -752 -2238 387 1856 721 52 -1213 -1084 1686 1932 -363 -1857 3 1191 1047 835
879 835 -1458 -1180 1565 1493 -25 -83 -1472 -251 2678 727 -1858 -979 935 702 733 188 -1760 -773
897 -773 1956 1092 -971 -914 -1408 1127 2350 -1671 -1582 502 -310 587 1496 -1844 -2258 1188 2005 -549
915 -549 -1806 -591 -236 1377 734 -1549 -1020 -14 241 1922 -501 -3507 608 2178 -41 -612 -1069
932 -1069 -617 747 1525 213 -1986 -1264 1777 1703 -297 -1453 -1169 1800 1416 -276 -764 -937 194
949 194 2414 930 -1644 -1491 675 2462 -4 -1059 -732 -432 2120 1442 -1630 -907 245 675 2071
966 2071 -668 -2332 361 1307 1174 -516 -1654 -567 1135 1419 -366 -1728 -469 625 950 859 -2331
983 -2331 -1470 1617 691 -143 -896 -1539 641 1207 -211 -351 -1682 -499 1972 126 -1131 -1118 -125 1198
1001 1198 431 -813 -676 -666 443 1273 -320 -1086 -1082 1414 1343 -1152 -327 -160 -566 1535 676 -1433 -80
1020 -80 34 885 1519 -1332 -854 856 606 468 59 -825 -458 878 1556 -157 -1457 355 556 911
1038 911 516 -1414 -586 866 647 605 -733 -1439 862 1174 364 -629 -1510 565 1047 146 -76 -1438
1056 -1438 -636 1757 535 -940 -643 -1105 948 1343 -631 -1581 -486 1087 675 -151 -1010 -1403 652
1073 652 1924 -817 -1138 -369 -453 1715 673 -2256 -678 824 525 879 -739 -1868 359 1441 605
1090 605 -1078 -911 -126 875 1415 -797 -1614 517 1102 509 475 -1533 -755 1829 932 -275 -747 -671
1108 -671 907 1444 16 -1074 -721 831 1402 17 -553 -1092 348 1703 36 -969 -665 20 1000
1125 1000 843 -1092 -1149 6 1008 554 -708 -874 -601 830 1136 -734 -1195 -70 -10 839 330 -1785
1143 -1785 -404 831 348 72 -612 -1231 254 1372 -193 -844 -616 -199 813 990 -863 -1413 563
1160 563 622 349 78 -1222 -698 1500 637 -689 -522 -626 515 1367 -100 -1241 -298 750 836 478
1178 478 -819 -888 605 1354 35 -562 -355 -70 1256 673 -815 -914 353 808 649 -289 -987 -98 1042
1197 1042 767 -561 -814 -303 411 987 -111 -1322 -499 1017 291 38 -692 -1071 471 1158 -204 -1061
1215 -1061 -370 -166 806 651 -1203 -1043 556 605 98 -274 -1272 -374 1175 253 -932 -684 -318 295 1238
1234 1238 -514 -1159 -24 648 427 277 -869 -975 965 938 -311 -483 -391 57 1203 409 -1069 -424
1252 -424 595 651 512 -266 -1025 132 1266 188 -355 -587 -159 645 980 -460 -1003 168 637 705 76
1271 76 -708 -605 851 894 -292 -582 -521 349 898 431 -1062 -645 504 602 122 -358 -914 -177 1104 51
1291 51 -851 -563 -465 480 750 -560 -1260 100 446 215 -8 -800 -678 680 904 -498 -639 -364 166
1310 166 1037 177 -1216 -396 715 336 457 -439 -1114 302 1241 236 -677 -350 -148 778 749 -408 -946
1329 -946 159 855 270 138 -875 -304 1094 632 -385 -461 -267 438 1016 -119 -766 -400 604 748
1347 748 -34 -506 -733 254 1011 -47 -732 -325 39 645 531 -830 -637 30 540 411 -386 -948 -240
1366 -240 550 438 -367 -820 -269 198 577 -167 -906 -277 457 431 -27 -738 -778 552 407 92 -290 -758
1386 -758 237 615 145 -366 -576 92 781 154 -228 -389 -289 865 448 -83 -323 -434 687 921 -254
1405 -254 -461 -82 182 758 163 -518 -362 259 830 49 -663 -298 -73 839 688 -843 -359 290 48 751
1425 751 -213 -1077 132 590 154 -121 -838 -451 618 753 -233 -843 -195 363 346 444 -1036 -841 946
1444 946 334 -186 -241 -1154 29 1186 -193 -589 -553 -189 683 405 -489 -818 -72 962 212 -519 -314
1463 -314 -467 632 920 -794 -484 -36 358 743 -53 -859 -158 704 729 -98 -755 38 227 853 461 -1137
1483 -1137 -270 815 327 363 -235 -986 683 781 -67 -356 -451 33 542 554 -470 -758 271 626 -17 119
1503 119 -592 -636 1126 156 -528 47 -436 127 891 -418 -701 72 20 339 183 -450 -448 157 560 -111 -551
1524 -551 -129 -382 475 419 -806 -323 161 -88 546 -94 -802 2 249 231 87 -483 -168 206 351 248
1544 248 -607 -197 361 187 487 -174 -561 282 572 46 -46 -389 -44 500 312 -118 -559 35 512 277
1564 277 104 -554 -378 729 384 -366 -35 -330 60 807 -148 -675 -109 135 253 321 -478 -752 253 546
1584 546 -37 -359 -283 -294 521 608 -775 -333 180 69 433 -72 -948 -72 526 206 -182 -553 -465 254 516
1605 516 -315 -630 -236 233 318 120 -526 -529 396 430 -143 -242 -369 -3 626 245 -472 -271 50 463 226 -73
1627 -73 -393 -52 611 207 -249 -226 -35 302 695 -88 -477 123 228 280 197 -432 -319 429 388 -128 -304 -234
1649 -234 0 479 287 -625 -352 288 138 309 -152 -577 73 529 1 -243 -291 -339 305 419 -287 -559 26
1670 26 87 234 128 -599 -433 319 389 -215 -215 -436 -35 492 63 -534 -201 240 211 235 -294 -614 53 547
1692 547 52 -227 -214 -93 296 414 -290 -312 114 156 249 55 -404 -251 329 411 -62 -142 -191 23 544 87
1714 87 -394 -140 252 234 249 -218 -440 264 430 68 -221 -204 -84 376 392 -357 -315 -31 199 184 95 -531 -245
1737 -245 411 158 -141 -264 -307 -78 532 -106 -493 -145 -5 176 230 -272 -432 115 351 -45 -140 -404 -137
1758 -137 384 306 -275 -400 -3 214 309 -1 -495 -258 359 153 -73 -233 -236 207 317 150 -364 -69 196
1779 196 274 226 -277 -334 253 390 55 -133 -272 7 478 370 -144 -310 96 275 342 16 -284 -124 368
1800 368 158 -97 -98 -212 123 460 -10 -345 -17 70 240 277 -453 -277 102 247 37 -236 -324 -70 353 116
1822 116 -394 -255 -32 126 312 -83 -576 83 271 10 -1 -256 -219 294 319 -205 -369 -189 122 208 146 -357
1844 -357 -259 231 354 -49 -48 -299 -93 491 54 -341 -59 86 288 245 -279 -268 159 298 197 -32 -232 -8
1866 -8 221 412 -288 -53 214 80 335 97 -448 -108 283 128 9 -138 -245 140 296 86 -271 -167 41
1887 41 103 262 -86 -537 41 319 -179 115 -174 -291 224 235 -200 -186 -82 -1 221 -21 -262 -338 137 209
1909 209 -227 124 -205 6 384 66 -400 22 -140 93 338 -251 -261 89 186 109 8 -203 -205 237 370 17
1931 17 -349 105 -60 310 311 -388 -139 291 101 36 -117 -351 62 384 0 -117 -101 68 79 229 -34 -430
1953 -430 164 308 -43 30 -95 -303 385 238 -275 -127 -142 38 141 -88 -390 -159 233 187 -135 -209 -150 39
1975 39 517 -96 -325 53 42 223 238 -432 -219 198 187 70 -227 -264 -42 237 209 -145 -389 132 60 95 33
1998 33 -416 -141 385 -49 75 -60 -316 245 265 -152 -249 -55 104 217 34 -192 -263 168 349 -67 -9 -149
2020 -149 -12 361 131 -195 -1 -13 114 251 -109 -156 -104 143 99 -138 -202 -74 -58 414 -93 -295 -31 33
2042 33 -3 188 -271 -244 156 22 -13 -77 -316 -15 185 9 -198 -242 53 2 128 -19 -308 -119 206 -40
2064 -40 -68 -53 -142 261 247 -36 -152 -137 132 166 148 -175 -129 122 288 17 -1 -105 -29 341 52 -91 -49 -5
2088 -5 90 198 -26 -199 99 136 119 46 -226 -209 47 417 -115 -243 -57 -60 132 194 -161 -221 241 -56 144 -62
2112 -62 -176 32 141 -4 -163 -113 30 193 118 -200 -343 -22 59 2 15 -84 -136 262 204 -215 -228 38 -87
2135 -87 106 41 -148 -92 127 114 -93 -124 -180 -23 191 104 -134 -39 -5 163 197 -151 -187 96 191 70 3 -135
2159 -135 -86 179 188 -61 -202 -52 13 199 64 -267 -58 232 257 45 21 -186 56 187 53 -182 -99 57
2181 57 154 166 -95 -181 110 214 2 -103 -234 -154 190 86 -124 -233 26 117 137 2 -301 -35 27 52 30
2204 30 -104 -211 -37 187 4 7 -131 33 87 97 -180 -247 86 -10 58 -98 -154 -98 132 57 -146 -128 -36 127
2228 127 146 -16 -217 -9 74 93 31 -62 -38 232 151 80 -179 -78 -24 230 190 -87 -100 155 146 140 -81 -139 3
2253 3 186 146 -185 44 -32 32 271 39 -214 109 89 -8 -42 -89 -199 107 117 27 -180 -48 -40 45 102 -100 -130
2278 -130 157 14 -41 17 -242 -27 202 -28 -98 -84 -62 59 84 -42 -201 -65 30 68 -41 -134 -205 240 161 -46
2302 -46 -94 -67 -41 175 98 -105 -6 53 89 12 27 -153 -106 253 63 -151 -34 -69 73 276 -97 -156 79 75 145
2327 145 39 -134 -142 109 254 -26 -114 -43 81 178 163 -186 -66 134 131 49 -112 -186 -96 167 39 -94 -44 -76
2351 -76 77 120 -31 -180 -82 224 11 -78 -72 -102 177 210 -145 -34 -22 -25 181 67 -171 -101 36 30 2 -114 -95
2376 -95 -62 206 75 -181 -55 34 88 99 5 -204 103 82 104 82 -114 -57 43 -74 -90 -58 22 149 159 79 -21
2401 -21 -41 129 7 35 36 -146 112 176 -16 -98 58 -64 71 80 -109 -36 50 65 49 -36 -24 -128 63 88 -80
2426 -80 -131 -57 -197 106 62 -105 -62 -47 8 62 -136 -139 -59 104 69 -116 -145 -31 52 199 -46 -211 112 110 15 94
2452 94 -99 15 79 -77 37 -22 -203 -52 62 32 -87 -37 7 78 84 -83 -114 -81 235 1 -31 5 -49 193 75
2477 75 -134 20 13 158 88 35 -141 -18 167 178 -108 -86 -12 -62 132 70 -145 -46 6 32 145 46 -177 -44 42
2502 42 -14 -71 -149 -10 122 164 -116 -213 -22 78 84 25 -180 -1 162 3 -115 -51 -184 75 101 -44 -60 -64 51
2527 51 27 -17 -119 -252 51 108 69 23 4 -17 83 153 -82 -89 -84 88 54 -55 -160 103 89 6 -2 -11 8 46 81 70
2555 70 -138 44 87 98 112 -102 -150 43 -66 35 -77 -103 -34 -22 50 -64 -98 118 28 -26 -41 -175 29 -31 -10
2580 -10 -34 83 -86 93 70 17 -72 14 59 147 32 -116 -85 53 12 -10 -146 -77 8 -7 -26 -59 -1 17 -27 46 -61
2607 -61 -37 -44 40 -15 44 24 -63 33 152 12 -219 -69 22 -64 36 -176 -181 93 79 -35 -92 -38 82 115 75 -101
2633 -101 20 108 25 149 71 -145 -12 126 147 -113 -34 -75 47 177 -5 -103 9 70 13 117 -41 -168 1
2656 1 75 -46 -115 -56 -60 97 43 -107 -116 59 54 -76 17 -178 -79 155 -4 -95 -16 -68 26 71 -28 -49 -100 -52 47 59
2684 59 -94 -226 77 -49 -80 -27 7 13 97 3 -61 5 -19 87 112 115 -144 -27 34 -54 -139 -17 -100 16 187 14
2710 14 -37 -33 -20 150 75 -87 12 133 56 66 -118 -41 -44 146 32 -68 -22 27 53 105 -63 -141 -96 35 110 28 -104
2737 -104 -20 54 195 -66 -59 -30 35 99 -19 -33 -57 113 122 -109 3 -79 -80 175 -14 -212 2 -33 81 46 -26 -13
2763 -13 72 122 23 -35 -58 -69 55 193 -133 -109 3 18 -7 49 -167 -61 61 0 -24 -84 -23 -16 61 18 -157 -56
2789 -56 53 55 91 72 -94 35 -10 53 6 -15 -96 74 106 -50 -78 76 75 -30 71 -33 -101 -2 72 76 -10 -43 -125
2816 -125 188 -12 -113 -38 -26 84 -9 -149 -112 26 87 85 -137 -16 -21 5 171 -109 -113 10 -44 97 75 -127 -94
2841 -94 92 47 43 -22 -135 -17 14 78 -82 -26 46 137 52 23 -172 56 155 25 50 -157 -94 76 58 -110 -50 25
2867 25 99 45 -20 -71 -73 90 137 -90 -35 -83 16 133 -51 -103 79 -43 149 111 -134 -15 117 58 101 -94 -176
2892 -176 14 -14 100 -92 -49 -12 -101 15 18 -249 39 83 34 -78 -109 -147 6 30 -5 -33 -77 90 93 25 34 -100
2918 -100 66 32 -8 -44 -84 38 89 17 -5 105 -45 129 75 -1 -91 -48 115 101 -77 -20 -31 62 199 13 -57
2943 -57 59 -105 79 26 -95 -41 103 -30 29 -10 -146 148 140 96 13 2 -24 -17 97 143 -235 -18 58 38 54 -18
2969 -18 -178 81 -39 -43 -62 -92 13 82 54 -63 -110 82 42 -67 33 -198 -148 97 7 -138 22 -46 -9 103
2993 103 -1 -114 -122 107 165 72 77 -7 43 17 -52 -157 55 -7 48 138 -141 -77 177 102 -85 1 -108 7 -11 12
3019 12 -69 -55 147 62 81 -32 -56 78 6 -21 75 -48 -93 93 105 18 48 -47 -52 168 -32 -60 -69 83 119 -38 -92
3046 -92 -148 -77 113 61 -54 -11 1 102 90 -112 -146 2 20 49 -25 -74 -108 9 154 30 -103 -21 8 89 -34
3071 -34 -114 -50 129 -20 86 -49 -216 -50 46 74 -20 -1 -12 79 92 -15 -117 -39 98 18 37 11 10 110 160 -16
3097 -16 -43 -19 78 186 -46 -122 -106 94 25 24 -10 -130 65 200 31 -91 -47 -48 -48 39 -128 -115 91 119 106 -17
3123 -17 -73 -13 119 121 -57 -32 24 -15 -46 3 -132 -26 60 -25 -42 -138 -116 19 112 -29 -93 -26 -67 20 70 -57 -94
3150 -94 134 14 4 27 -128 -103 115 109 -12 -41 10 26 36 23 -56 -21 169 33 33 8 -117 58 77 3 -68 -37 70
3177 70 38 118 -197 -40 31 -12 -8 105 -6 -76 34 10 -72 -34 -57 130 16 23 34 33 47 81 32 -86 -90 133 72 -93
3205 -93 5 -125 11 131 12 -24 -86 132 77 65 -16 -88 -95 73 -5 23 46 -67 30 56 -23 -69 6 29 20 71 -57
3232 -57 -163 86 49 10 -18 58 -21 89 57 -13 10 63 -77 70 27 -91 76 145 3 76 -47 81 -37 131
3256 131 -30 -41 -7 133 17 91 -67 -120 105 49 -53 -133 31 -78 75 -15 -116 -103 40 61 69 -131 17 61
3280 61 93 46 -10 -79 -57 -59 60 -24 -125 76 -52 10 -2 -44 3 46 22 107 -9 -18 -17 13 112 -58 36 172 -17 16
3308 16 -26 -164 80 147 -87 8 -162 -105 99 35 11 14 1 -12 29 -20 -47 -55 61 90 -132 41 50 43 86 97 -16 82
3336 82 -25 8 43 -40 12 16 20 21 -113 16 46 -87 206 -161 -37 -13 2 -63 71 -140 -63 0 106 -18 24 -41
3362 -41 9 17 57 -110 -30 -55 -16 -93 -39 -90 47 171 -70 47 14 -67 94 139 -78 -14 -111 19 95 -119 -56 -121
3388 -121 28 91 7 28 25 -70 88 -79 23 23 -7 -17 56 -98 4 70 13 133 -171 21 -24 -7 145 -96 37
3413 37 82 -22 17 -33 -2 -39 43 -50 17 -21 -29 -56 96 -3 -82 -71 -41 80 -30 -52 -158 -23 85 10 -17 -57 61
3440 61 149 54 -128 1 -4 57 17 -104 -19 -188 0 35 -66 33 20 68 41 12 -14 -29 32 36 56 -127 -82 97 45
3467 45 29 -47 -34 94 94 36 -19 -53 -18 72 -30 33 -80 65 101 24 30 97 -19 27 122 68 60 -26 99 -11 65 -86
3495 -86 -64 52 -1 -10 -50 -50 -26 42 45 -102 8 7 38 -5 -43 -43 -11 64 35 -82 -51 -63 24 24 -91 -104 -102 76 11 47 22
3526 22 -118 117 170 -37 -55 -17 54 95 48 -15 -116 35 32 -69 -37 -90 -23 35 28 -44 -52 3 -31 57 -2 -100 63 71 -9
3555 -9 17 26 -72 51 77 28 19 -61 15 49 -1 -17 -54 -64 -77 88 21 -82 67 21 -8 -109 -33 -60 75 36 -85 -115
3583 -115 1 -48 43 12 -129 -61 38 -7 -51 -37 -55 5 -90 -30 -146 -103 59 140 -40 7 -19 -25 122 -18 -10 38 40 125
3611 125 89 -15 17 42 134 76 71 -99 1 70 -14 -11 -8 68 51 138 -28 -41 75 -21 -40 -8 89 -61 -5 83 -39 -31
3639 -31 47 44 -14 98 -64 -55 -80 59 -35 54 -55 -17 94 29 -55 3 1 98 54 -20 -4 88 25 -27 43 -163 -164 -4 -37
3668 -37 76 -14 -98 -28 21 20 -64 -77 -19 -23 -5 -44 47 -69 109 80 35 -33 -24 -85 54 87 -58 49 16 68 2 -48 -4
3697 -4 26 89 31 -18 -78 56 121 18 29 -105 44 48 60 -48 -87 46 5 25 -140 -126 -23 16 72 -107 71 -28
3723 -28 70 19 -9 17 -16 33 -8 15 -144 -5 -96 28 -50 -138 -61 -33 -42 -18 -52 -129 43 44 6 -129 -10 15 -16 29
3751 29 19 -20 11 65 -27 68 12 -18 103 68 -50 86 -112 -24 41 11 57 -36 2 37 -10 22 -36 113 90 -88 27
3778 27 -65 -88 -43 45 -30 -119 26 11 23 58 -58 -63 39 7 -18 -73 65 -123 60 21 -133 47 -36 -7 85 -39
3804 -39 30 14 45 2 26 -75 -12 -3 -33 -53 -27 74 47 -86 57 -71 -55 -26 35 11 -67 -110 19 -48 -73 26 -11 -22
3832 -22 30 -92 63 -45 36 62 -27 -32 -30 18 76 44 27 7 63 43 23 -2 -24 34 -9 79 -46 -40 28 50 1 -70 -107 -34
3862 -34 125 -3 63 -16 -8 72 17 -57 -77 -190 -62 58 80 -97 -99 -104 19 4 -60 -141 -59 3 -23 -49 62 -22 -26 40
3890 40 -6 -106 -104 -1 67 -17 -37 -47 7 91 104 -100 -2 -101 3 -31 -148 -39 89 28 120 -77 -100 59 27 66
3916 66 26 -59 10 -2 -23 53 -123 -25 -67 17 58 -28 -54 74 95 118 13 -41 14 1 -73 44 17 66 -6 -63 35 -99
3944 -99 -9 43 -4 -74 25 -42 37 53 -22 -79 -73 -109 -70 -53 -104 -107 -81 -12 16 -31 -60 31 41 56 -99 -53 -72 -48 -73 -33 -31
3975 -31 -34 175 -7 59 -96 24 43 78 -16 -57 -74 -57 -43 -40 33 -66 -80 50 -24 3 -25 -45 58 32 84 -101 -37 9
4003 9 -24 -43 24 -40 145 25 6 -110 -35 -61 74 -94 5 -13 35 43 -19 25 -98 -4 -21 64 -13 -54 -163 30 -58
4030 -58 -18 83 13 -77 9 -29 -59 7 -28 39 -6 -24 54 -26 10 -53 13 56 112 -3 -32 -124 -59 66 -5 16 -89 55
4058 55 36 29 42 -96 -29 -19 29 37 14 -79 -20 -54 -19 -12 -82 15 95 18 9 43 74 -37 40 -10 11 2 42 -22 67 24 20 53
4090 53 -47 126 -98 31 -36 -14 40 37 -68 32 1 -9 -69 -54 -59 32 -75 -44 -12 31 20 25 31 -50 -83 26 -45 -20
4118 -20 27 -133 43 52 -1 -86 -4 -5 -30 36 87 -22 9 -3 -96 -92 -16 -45 119 49 -14 -1 9 32 -27 -65 -113 125 30
4147 30 77 51 -8 62 -11 62 75 -42 -22 -83 27 -10 52 -62 173 98 65 -23 -51 49 13 97 15 102 -49 -9 41
4174 41 -56 -13 -1 28 -83 -49 64 -77 98 19 -27 -2 -38 35 14 3 -49 -24 -41 -43 0 -112 -3 31 11 -83 -63 -8
4202 -8 -9 77 5 -4 17 3 18 61 -55 -91 55 32 35 -65 -35 8 88 34 -38 -3 40 65 90 -89 -85 -81 43 87 60 -23 -5
4233 -5 -8 52 29 -72 65 76 -68 34 -46 -63 -101 -16 61 -59 59 71 45 23 -26 -122 13 68 33 16 -81 -7 79 31
4261 31 -51 72 -18 92 31 -1 -132 -79 -32 59 46 -33 -141 -39 61 -141 23 71 -93 39 0 -22 -92 3 95
4286 95 62 -32 47 53 4 114 -45 -11 45 56 30 -43 4 -56 47 17 -58 8 31 70 17 117 -9 -81 30 73 21 -17
4314 -17 -35 -46 -33 -33 -70 -7 -24 -21 48 55 -71 -34 -88 -17 23 -61 24 54 125 76 48 -43 -38 166 68 5 8 0 43 111 -119 -33
4346 -33 -97 116 38 62 30 -92 74 29 31 -19 7 53 196 64 -152 70 -69 28 12 -116 -50 114 107 -28 -69 29
4372 29 6 79 79 120 -49 24 37 56 -3 -34 -6 95 -7 -28 -90 -24 9 -58 -45 -64 -114 -26 108 -130 3 -116 14
4399 14 30 -191 4 -20 10 88 -5 9 -19 19 5 2 -146 -81 -52 82 92 -68 -56 -14 -30 115 -63 -47 37 42 0 13
4427 13 41 35 6 -151 3 -33 -40 -11 -69 108 31 2 23 -80 2 -73 22 70 -16 17 -59 -97 -90 96 85 32 -83 30
4455 30 -16 40 -72 19 -67 -4 -51 3 -3 7 0 -35 2 -125 -29 5 -129 -18 -35 -98 1 52 -36 -70 17 -39 78 48 -72
4484 -72 19 -81 -48 44 -59 -39 38 10 -11 76 -7 -21 -1 -13 -65 16 57 104 18 11 -56 -45 109 8 -35 -118 69 -17
4512 -17 119 38 -41 0 -61 84 8 -29 -24 43 72 87 -85 61 55 -82 40 -28 -115 56 -23 80 61 -15 -66 89 10
4539 10 10 -70 -49 -11 85 37 -53 -10 116 105 -89 45 34 -80 59 12 -10 -123 -117 -8 -47 -64 -15 -11 42 -3 -74 19
4567 19 -63 40 -56 32 23 27 -60 -26 124 -32 -1 32 -10 -163 -2 -44 7 -13 -44 -105 -55 -20 36 -20 60 -126 39 98
4595 98 -14 -64 -7 -9 33 59 96 61 126 31 -48 -8 -132 48 89 20 107 44 28 -20 114 -17 78 8 -21 114 46 73
4623 73 -20 -19 -128 -20 -83 -36 -85 -115 6 -81 -32 28 127 5 11 -37 -151 -4 -112 -7 -6 -33 -46 10 136 -81 -9
4650 -9 -10 -53 23 -30 -86 -17 77 96 -9 5 -24 -33 57 48 -37 -30 -9 1 -31 -61 37 -30 -32 -62 -57 -57 -3 -14 39 -6 38 -50 -159
4683 -159 70 -58 -6 10 71 -26 -37 -43 -50 50 77 -69 -127 16 -16 60 18 9 60 -64 -47 28 -10 -18 18 -49 71 20
4711 20 -86 30 -61 12 -75 -35 -27 98 47 12 -51 -105 62 -13 49 19 31 -14 -101 5 -91 -21 18 64 -46 -22 -83 -18
4739 -18 82 -72 7 28 -48 10 108 43 3 87 2 -99 -24 -63 59 27 64 -55 -46 28 86 -16 -54 -141 -59 58 15
4766 15 -26 -75 -99 63 9 83 -40 33 10 -58 -77 24 14 -35 34 -105 2 4 -13 54 11 -29 -54 -33 41 -109 -30 72
4794 72 3 -48 -21 -38 -28 -128 -44 -29 -27 -20 -26 -19 -18 62 4 47 110 -19 -7 27 5 81 0 -134 67 94 86 87 48 17 -23 -37
4826 -37 48 -29 -103 -119 82 -8 -129 -90 72 -47 37 41 -9 -7 -42 71 53 -19 -42 79 -43 31 -49 -92 -70 -6 37 38
4854 38 49 5 12 -1 36 66 34 46 84 37 89 -107 -12 23 23 -46 16 -25 -34 -27 -113 -110 30 1 79 33 10 -79 -56 -7 14 -105
4886 -105 -74 26 -90 -31 -37 38 -19 64 49 -20 -8 -135 43 208 -15 -11 -108 49 112 12 -50 -27 72 74 -18 70 -186
4913 -186 -119 94 51 -55 32 -78 -89 31 54 -13 -31 -34 10 -46 -99 -47 3 43 24 8 78 -28 -77 70 12 22 -16
4940 -16 -28 -23 -28 -134 72 54 55 -20 -18 -53 -82 34 -44 -80 6 -25 95 33 -74 -63 -14 -7 -22 -86 -43 -20 -21 -56 63 18
4970 18 -31 62 56 -20 -59 42 12 49 98 7 21 61 44 -20 -134 -3 73 -19 -82 -37 -3 47 33 53 5 -69 -71 -27 48 -72
5000 -72 0 -70 25 -25 -66 8 -41 -20 -14 -102 -8 -28 -73 16 -73 -30 110 -12 -1 -59 80 -53 20 32 0 -114 -9 -1
5028 -1 -20 127 -48 31 25 37 -75 32 -74 32 61 61 -35 -14 -53 1 20 -64 -51 -73 11 -20 -29 -56 -37 91 44 3 15
5057 15 22 13 86 38 -96 40 50 2 2 -20 -36 121 45 11 104 -55 -31 -48 -21 -5 -65 -15 -42 -51 -125 65 -108 -101 -49 -18
5087 -18 35 100 15 -36 -105 0 1 62 54 -108 -42 -69 -21 -25 28 10 -21 19 -64 12 -39 -38 -8 30 -17 19 68 -99 79 -32
5117 -32 99 -15 -4 -44 39 27 -42 -35 -57 42 -59 47 -25 19 17 9 46 -37 42 -28 51 31 -23 -3 112 77 23 -3 -107
5146 -107 17 40 8 64 28 -9 -34 103 -2 -67 65 -56 -15 73 22 -4 -55 -22 66 -30 -2 -19 86 -78 -98 -22
5172 -22 -112 21 -15 16 31 -11 -21 -75 59 29 4 -88 11 -130 24 79 -42 -53 -91 -23 -9 -34 -63 -88 23 -16 -56
5199 -56 2 0 85 -25 8 -55 -23 -143 47 -71 -79 16 -48 87 19 25 -65 -28 -11 22 22 -1 29 -74 31 27 42 -64 0
5228 0 -143 -67 -42 59 20 -16 33 -49 -10 -75 52 -115 10 -24 -51 -68 37 60 -40 12 73 111 104 -146 47 49 -42
5255 -42 134 -12 -60 53 -62 -72 69 -105 -8 -99 -9 -106 35 -77 -1 -50 27 -35 -8 99 -3 69 -41 -79 177
5280 177 2 -29 -45 21 -68 71 -22 -19 -4 34 -17 -34 60 -21 -25 29 20 79 45 -60 82 12 8 23 -13 8 -49 -17 -18 -64
5310 -64 -30 24 -8 44 -31 10 -40 -13 -52 16 -22 -16 -12 7 -94 22 -44 39 15 5 64 39 21 -1 -6 -126 20 12 17 -58 -2
5341 -2 10 -75 -27 5 12 -82 15 -1 -54 40 -52 -122 -48 62 -91 -15 -39 35 -36 -14 31 105 67 53 -140 -49 -54 -2 26 -89
5371 -89 -99 -17 21 -9 -23 -59 -65 -86 7 -77 47 -25 39 -14 -31 -42 -21 14 84 27 -23 77 12 8 -30 5 -53 89 7 -66
5401 -66 56 -58 8 -82 -48 57 -19 16 -108 68 -48 22 16 61 -36 -21 88 -36 -12 -5 -50 18 40 61 102 -12 -37
5428 -37 14 6 51 46 -26 -72 -11 1 162 -7 47 7 -14 -3 -36 106 -56 -55 23 18 -56 65 80 45 10 -113 -121 49 10
5457 10 9 -117 -36 -12 -20 29 -40 111 9 -21 -53 -71 76 125 -48 -11 -20 -25 3 2 -5 -205 -7 44 -52 36 -52 23 -40 -10
5487 -10 17 -16 -65 -52 1 -40 -2 -74 40 46 -116 -8 58 -80 -62 -25 27 41 5 -10 -5 86 -16 -93 -19 8 102 -86
5515 -86 -54 -67 -85 -30 25 18 -10 -91 -11 15 -15 28 44 -39 -77 39 13 71 79 -58 0 48 47 -24 20 -53 -38 -90 86 -10
5545 -10 -37 47 61 13 -36 -41 7 44 -131 -81 13 28 23 8 13 12 -74 22 -55 -14 24 -65 8 28 38 -35 49 88 8 89 50 -55
5577 -55 30 -1 112 34 -43 53 21 61 13 -97 53 -2 25 -38 34 5 105 -22 31 20 -14 -26 -68 12 -39 -44 -6 68
5605 68 65 -22 -90 80 58 -3 -61 -19 -60 19 10 -51 16 -19 -9 39 -28 16 -101 -23 135 -42 -2 -24 -39 -34 18 -33 -59 6
5635 6 26 -86 53 77 -54 -56 -21 60 3 76 -67 -17 -49 -5 7 -17 93 51 30 -42 -15 -43 -67 30 -35 2 92 -10
5663 -10 -4 -7 112 42 -121 73 -47 -23 92 27 -16 -2 1 -19 78 9 -38 0 -149 -7 -131 -19 12 -143 20 -64
5689 -64 -58 70 -29 -26 1 -89 -3 4 -38 5 82 36 80 20 55 2 -74 -65 -104 10 -34 -115 9 -57 -35 20 -4 -37 8 69 -72
5720 -72 8 -84 22 13 -54 -94 -78 -94 -109 4 5 2 -131 5 -48 44 -27 22 20 0 34 34 -51 24 106 104 30 54 -73 47
5750 47 -38 -1 -90 29 -75 151 -8 -17 -23 -4 79 3 -56 -18 32 -85 45 -75 25 56 98 -22 -36 1 -104 -37
5776 -37 -75 66 -69 38 8 0 46 35 12 15 124 14 39 -105 71 -6 -60 53 -59 -77 -58 -24 -75 -167 4 100
5802 100 -42 -14 -15 -48 56 -66 -70 -68 -25 -27 4 4 35 -70 -40 101 -35 -3 -71 16 -4 96 -44 -35 -78 20 6 -32 77
5831 77 48 131 36 80 36 -51 47 -35 79 38 157 20 21 -85 -29 -101 105 -65 -194 -25 -8 75 -61 -27 -25 -21 -125
5858 -125 -95 7 -75 -57 6 5 19 -25 -31 0 129 9 -80 -37 -23 86 44 -106 37 -64 -117 -18 -59 -69 6 148 -71
5885 -71 18 44 -69 -8 69 -29 -61 26 -49 -12 69 -36 -36 70 -35 -8 -33 62 -23 7 54 -70 -2 17 71 13 39 26
5913 26 -58 -20 67 84 -9 -34 -59 0 -44 -80 -38 -31 -21 15 -107 9 48 -39 58 -182 99 12 26 47 24 20 26 -71 4 135
5943 135 -52 -13 154 -92 -69 -48 -52 -48 13 114 64 -7 11 -4 -55 -33 -4 13 -4 -41 0 124 -44 -31 -66 -13 -25 -57
5971 -57 -6 45 -70 -78 23 -15 -27 76 -47 49 19 -35 46 -43 86 109 3 0 37 70 -15 19 25 21 -17 85 -67 30
5999 30 -37 -86 -20 13 7 -71 -52 20 -57 -110 -68 28 -122 7 32 -60 21 -23 -83 -52 -42 -33 -73 -19 -36 -107 91 -125 -27
6028 -27 110 113 16 42 41 41 -95 -18 33 49 -65 -27 -25 21 -110 -64 -53 -45 35 51 34 99 50 -18 -53 -93 -108 42 -65 5
6058 5 -164 72 -26 120 105 -29 46 55 52 45 8 -16 37 69 -51 -13 15 -14 101 -80 73 115 -82 -40 11 -37 -33 15
6086 15 -18 -6 75 63 -20 52 -41 -29 -50 -65 19 -35 67 -22 15 6 2 9 -17 -4 -77 -5 -47 39 9 57 -3 59 120 107 6
6117 6 -92 38 15 -15 -6 1 85 25 57 30 -97 -47 -46 -49 46 47 -14 -97 -21 65 -51 -10 13 84 0 -80 -19 96 34 29 58 -24
6149 -24 10 24 -14 -55 31 46 56 16 8 -22 -11 130 54 45 122 -74 -16 -5 -18 -1 -13 42 101 -40 -56 -12 -125 40 61
6178 61 -20 -13 -5 27 -116 -52 25 32 1 -59 -7 -80 -21 40 35 -21 -6 -75 28 -12 26 -75 -60 -1 103 44 -9 -6 9 -3 -26
6209 -26 -28 -54 108 3 47 -26 -119 18 -80 44 -6 -41 -82 -41 -62 -2 45 -9 -67 34 -35 87 19 28 41 36 94 -12
6237 -12 103 -66 52 -10 42 -14 43 45 -27 -50 -78 -62 -20 6 -45 -97 3 -86 2 26 30 60 -45 56 -22 0 -20 -23 -34
6266 -34 -23 -8 -24 18 -1 91 -1 34 41 67 -21 -61 13 -82 -48 48 -19 0 28 -55 1 -44 -20 25 -155 -8 23 -11 -27 -25
6296 -25 37 -44 -43 84 99 12 -6 19 -26 64 77 53 67 17 -18 -42 12 0 195 53 7 -24 -27 -60 -55 16 -11 -10 -53 -72 -21
6327 -21 134 -59 93 -39 21 24 -57 100 -2 12 26 53 -48 55 -34 20 46 -23 -50 98 -4 69 -32 31 12
6352 12 86 76 -27 2 13 -2 32 -90 -24 24 14 -47 40 -44 40 56 80 -54 -31 18 10 -116 -42 98 -51 -33 -4 -36
6380 -36 -71 22 -7 5 -70 48 -7 58 3 20 29 75 60 1 -51 31 141 -136 10 3 24 6 36 -30 28 91 -99 -4 58
6409 58 -72 -26 -49 -16 -32 41 26 -86 -113 35 33 10 -79 42 -13 -44 27 42 -15 -43 3 4 5 -17 -21 38 6 -55 22 -19
6439 -19 100 14 -12 -102 10 12 47 -38 9 1 -43 -17 46 -126 3 90 -66 -51 18 60 -58 -54 -54 -14 36 -87 -74 26
6467 26 13 31 16 -53 85 45 98 -86 45 25 72 36 -95 29 -30 99 23 -33 -143 20 58 -34 -16 -41 -83 -29
6493 -29 93 -8 4 -18 126 -33 -30 38 -53 -66 22 -77 44 0 -100 180 -9 2 -13 70 92 -52 50 63 28 -41
6519 -41 -70 -13 1 -3 7 -85 -2 -44 -50 39 33 34 -56 -26 23 -20 -42 -40 -52 -23 -75 6 -22 51 3 -72 34 13 7 -56 -5 -3 51
6552 51 -40 51 51 87 58 19 43 -66 -39 -14 -94 -11 19 47 -14 24 -62 -3 -15 -10 -17 -26 -4 -11 50 -75 -25 -36 58 -20 -47 103
6584 103 -57 -2 5 -58 73 62 1 -24 -94 31 -15 -46 33 4 -17 46 -61 20 -4 3 -69 49 51 -114 -61 17 -79 5
6612 5 -80 -21 6 -10 -4 2 -30 -35 35 -144 34 22 -32 -32 5 -61 -96 110 17 -22 -71 -37 -28 -68 53 37 -53 -88 34 -37 -1
6643 -1 -10 52 34 -33 -19 124 37 -95 -23 76 24 -29 -16 -143 -42 13 -103 -26 12 68 38 -6 9 -31 -48 -2 -112 -19
6671 -19 9 -14 -28 7 -20 -87 -40 -77 -17 129 31 -62 19 93 -78 81 -66 -32 -77 -44 4 -5 14 -55 -12 -44 45 -51 -10
6700 -10 -17 96 -3 -2 35 13 -30 -77 42 55 11 35 -44 -56 -33 30 63 130 64 52 -19 3 -44 -58 64 42 33 -4 57 17
6730 17 -131 -117 -56 21 -55 -9 -98 -64 63 -165 1 45 -9 -17 -53 -25 -19 -140 32 18 -14 34 21 11 5 -58 32 -15 51
6759 51 1 48 1 -31 7 44 50 3 -16 -59 -33 -27 34 30 86 -58 -1 37 7 -10 -61 68 -72 -35 -24 -23 61 16 -23 -17 -89
6790 -89 -4 99 64 74 17 -45 83 104 83 -101 56 -36 31 101 -132 17 15 -52 -27 -37 -44 9 -56 -112 10 -34 -80 -33
6818 -33 29 15 -54 -25 -36 -2 69 121 -82 -96 -83 43 -44 1 -29 -109 -28 14 -34 -56 52 25 -12 -16 68 -72 -9 -40 -64
6847 -64 -73 148 68 -85 -21 -9 -10 103 -20 -45 109 23 -99 -9 -25 -38 -65 -36 -53 115 17 10 -12 113 -78 -1 -49
6874 -49 58 -39 -16 -10 -65 49 83 34 -12 -40 -103 16 -19 -54 40 17 87 -17 -47 -29 -43 78 26 -89 -30 2 31 1
6902 1 -14 -35 42 -61 -53 4 103 -2 -69 30 76 -10 14 151 45 -78 -20 48 -75 -129 5 -10 64 -71 -60 4 20
6929 20 35 -37 -34 -1 42 -21 75 42 30 44 -14 -47 -17 -42 -36 94 -92 80 26 -30 -10 6 73 -45 -34 -10 -18 61 -41
6958 -41 22 -38 6 117 -61 -65 -37 -43 54 -29 -28 -43 51 -75 -80 47 -2 -44 9 36 0 -151 2 -25 99 -26 -43 -64
6986 -64 76 -102 14 -1 59 200 -32 65 -90 131 53 -19 25 -84 -11 18 -52 -12 -25 -14 -68 83 46 5 -52 -4
7012 -4 -22 -72 -2 -60 -1 38 -55 -39 10 70 -29 -37 -73 96 -11 31 54 2 -6 -79 19 17 44 73 44 26 120 -5 30 -26 50
7043 50 -8 83 -50 -8 -54 -90 32 5 -48 -11 -63 0 -71 35 -8 22 -1 -33 1 62 -40 -20 -43 -67 -23 -123 -7
7070 -7 -32 -60 -57 34 -8 29 36 7 15 8 3 86 30 91 -37 -97 -26 -36 -36 35 65 -7 -47 -12 -44 26 9 -7 -58 -1 127 -49
7102 -49 39 48 47 -4 -12 -135 -66 43 -63 86 60 -59 35 56 -58 10 -102 -48 30 35 9 -64 67 4 -76 10 -55 13
7130 13 28 -3 -9 -19 -10 -54 73 -56 5 -89 -3 40 -36 41 -93 -16 -67 36 21 50 -61 46 82 13 9 3 139 -40
7158 -40 56 15 -101 -13 -42 -18 80 28 84 49 -57 -123 26 53 70 32 -32 -35 -29 -98 36 -11 -70 -111 -3 -68 -95 -13 51
7187 51 -2 -37 110 53 25 15 36 -78 1 39 73 -66 -60 -24 2 5 -27 -16 55 -15 123 13 42 30 15 3 0 47 -27
7216 -27 -33 13 26 0 83 -19 57 91 -11 90 14 25 3 -87 25 -47 26 -24 29 -15 110 38 89 44 -14 -37 9 29
7244 29 -67 69 111 24 6 45 89 26 -59 -98 -23 -20 27 -78 -79 0 -2 -42 51 10 -75 -36 14 -8 -19 -54 -26 -71 -73 11 27
7275 27 -28 72 93 -3 -130 -23 65 37 -45 -19 16 11 38 -18 27 -111 23 30 -13 -20 27 57 -86 19 -65 59 56 154
7303 154 34 -19 18 -22 -45 2 -10 -26 -57 76 16 -14 68 -106 65 9 39 70 -33 -32 32 108 14 51 6 6 33 44
7331 44 -8 6 5 24 -58 -34 -35 18 -89 -69 64 64 18 -73 -106 68 -49 -30 -3 -55 -31 4 120 77 24 -7 34 -34 25
7360 25 -137 2 22 41 133 40 37 29 -31 -2 22 41 29 -119 -47 -40 -36 9 -62 -47 -62 8 12 49 -43 -57 -17 36 26 -62 -31
7391 -31 45 39 7 77 -48 -11 -79 51 -51 45 54 -43 129 -114 66 54 -21 -52 -41 8 8 0 -19 -75 9 36 -4 70 87
7420 87 16 -63 -38 -85 -121 -26 7 -191 42 11 -4 -66 -69 -59 5 80 -87 -95 38 13 -15 -36 -99 -48 60 12 45 -15 -41
7449 -41 77 27 24 -53 100 -44 12 -16 59 -90 33 -114 0 -28 32 21 -129 71 -23 7 -42 -28 -10 -22 46 -11
7475 -11 69 108 44 51 26 37 10 15 -36 24 0 20 -57 -27 16 -16 -43 34 94 13 -49 -76 -68 -116 11 -69 -113 18 31 -138
7505 -138 -23 -55 54 52 -27 59 -6 -16 19 106 -80 2 -27 -31 93 68 -24 63 3 8 -103 29 -26 43 96 -83 52
7532 52 -57 72 32 -48 50 -52 4 7 -60 118 80 -77 17 9 -14 48 -15 -59 40 45 33 -17 92 -43 -42 -2 -20 25 -50
7561 -50 22 50 61 53 -74 66 22 115 -2 -110 -24 18 -11 -2 20 28 -73 -13 -17 -34 60 45 -4 82 -11 -141 -37 73
7589 73 -117 80 -93 -53 27 -28 6 -2 -39 46 36 37 7 38 23 61 61 14 -24 -19 38 35 -75 24 121 -13 22 -76 -106 -147
7619 -147 65 -18 -1 -14 55 -1 -34 -9 77 -37 -18 -83 18 33 -36 39 89 1 -40 29 93 86 -53 42 40 23 1 71 -79
7648 -79 -67 -53 26 56 -10 -66 52 28 16 -55 -65 -145 -11 81 8 -78 87 61 8 -28 20 -64 -10 118 1 69 20 -92
7676 -92 66 -40 11 73 38 39 14 18 -48 -9 -4 -84 2 176 -64 -3 114 -26 -107 -22 52 -6 10 53 -17 -60 80 70
7704 70 -44 -40 -2 -94 59 21 0 38 31 -33 51 12 -1 -21 -5 -92 -26 58 25 107 16 13 -88 16 44 49 -53 -66 -35 -54
7734 -54 -69 -132 37 5 151 39 32 1 22 -97 -15 9 28 -124 -26 27 0 -96 -6 -21 48 86 36 -10 -40 -3 -58 98
7762 98 9 66 -58 8 23 34 80 -73 139 -90 4 29 -94 30 9 45 -4 -29 39 36 -41 75 34 -100 31 -21
7788 -21 -34 5 65 -98 -27 15 66 -41 -36 32 20 24 -92 110 -29 23 10 49 -42 -91 65 -55 1 79 -89 77 43
7815 43 2 -55 -19 -20 39 23 -11 -87 -31 -24 -63 63 -79 31 41 -8 1 -41 -46 44 19 142 -56 -1 -21 3 58 26 -35 15
7845 15 -49 -18 -99 -5 -4 136 4 16 15 51 -20 -5 51 0 17 67 -27 35 28 -105 51 33 -27 29 50 88 -9 -38 -3 -33
7875 -33 28 -8 -32 -75 31 -12 13 26 -43 -72 -69 4 127 -82 -66 9 116 0 23 15 -27 75 -40 -24 -60 33 1 -50
7903 -50 34 13 33 48 -4 72 20 24 43 -56 -27 -36 19 -107 -125 33 -12 14 57 45 -81 3 98 -41 33 -81 21 79
7931 79 60 38 66 -32 -63 -28 -66 -1 -56 10 -130 -59 -51 30 -136 -124 -16 29 43 4 54 35 3 -44 27 64 12 -60 28
7960 28 25 100 6 2 -49 37 16 84 14 -1 54 15 -69 -62 96 55 -54 87 -77 17 -34 -39 23 -5 55 -65 -27 59 37 -3
7990 -3 23 -6 -103 53 6 -16 -56 10 -12 -59 25 -90 -32 34 -8 -62 104 46 -18 9 69 3 -8 38 -56 76 70 10 13 -73
8020 -73 -79 2 -59 9 -110 -161 78 -46 -47 -14 -6 10 -76 1 1 -15 17 -56 0 -47 9 72 -23 -72 -67 62 -7 -58 -17 30 -24
8051 -24 -112 -99 -42 68 42 28 0 11 -58 -42 -10 -73 -78 -23 1 94 -54 13 -18 19 16 20 -10 -13 -77 24 20 -45 70 15 40
8082 40 -40 -14 17 -25 -73 -33 -42 -17 52 -59 -18 -29 23 -23 58 3 14 27 -3 56 -41 -129 19 13 -75 -1 -45 -5 19 47
8112 47 -61 20 55 -60 -47 -51 -33 70 37 35 30 -24 -9 -12 -203 -23 -77 55 -43 26 106 -37 -17 -13 8 -47 -36 -73 69
8141 69 -131 21 54 24 -41 1 -52 39 20 18 -34 79 48 91 3 9 -79 1 -45 38 112 103 -86 30 74 -56 173 35
8169 35 -40 -72 84 -65 71 52 55 33 18 -33 -34 -62 85 8 67 44 60 -86 -12 -11 -13 -20
8191b0
##END NTUPLES=NMR FID
##END=
