##TITLE=1H_Pr Fi
 CDCl3
 8 sc, 
 6.10.2023
##JCAMPDX= 6.0         $$ Bruker NMR JCAMP-DX V2.0
##DATA TYPE= NMR FID
##DATA CLASS= NTUPLES
##ORIGIN= UXNMR, Bruker Analytische Messtechnik GmbH
##OWNER= root
$$ XWIN-NMR		Version 3.5
$$ Fri Oct  6 14:51:15 2023 Russian Standard Time (UT+4h)  she@DPX200
##.OBSERVE FREQUENCY= 200.13135
##.OBSERVE NUCLEUS= ^1H
##.DELAY= (6, 6)
##.ACQUISITION MODE= SIMULTANEOUS
##.ACQUISITION SCHEME= undefined
##.AVERAGES= 8
##.DIGITISER RES= 18
##SPECTROMETER/DATA SYSTEM= spect
##.PULSE SEQUENCE= zg30
##.SOLVENT NAME= CDCl3
##.SHIFT REFERENCE= (INTERNAL, CDCl3, 0, 15.7039)
##AUDIT TRAIL= $$ (NUMBER, WHEN, WHO, WHERE, WHAT)
$$ ##TITLE= Audit trail, XWIN-NMR		Version 3.5
$$ ##JCAMPDX= 5.01
$$ ##ORIGIN= Bruker BioSpin GmbH
$$ ##OWNER= she
$$ F:/spectra/data/she/nmr/H-F/1/audita.txt
$$ ##AUDIT TRAIL=  $$ (NUMBER, WHEN, WHO, WHERE, WHAT)
(   1,<2023-10-06 14:50:11.48 +0400>,<she>,<DPX200>,
      <created by zg, POWCHK disabled, PULCHK disabled
       configuration hash MD5:
       00 E9 B6 7A A2 85 ED C7 34 08 36 98 17 FE 4E 26
       data hash MD5: 16K
       F3 0F 74 6D AF 70 34 06 C4 D3 D8 7E D5 93 02 1A>)
$$ ##END=
$$ 
$$ hash MD5
$$ 95 87 D0 B2 CE 7E 4B B8 01 75 7E 89 A9 63 38 5A
##$RELAX= 
##$RELAX= 
##$RELAX= 
##$RELAX= 
##$RELAX= 
##$RELAX= 
$$ Bruker specific parameters
$$ --------------------------
##$DU= <F:/spectra>
##$EXPNO= 1
##$NAME= <H-F>
##$PROCNO= 1
##$TYPE= <nmr>
##$USER= <she>
##$AMP= (0..31)
100 100 100 100 100 100 100 100 100 100 100 100 100 100 100 100 100 100 
100 100 100 100 100 100 100 100 100 100 100 100 100 100 
##$AQSEQ= 0
##$AQ_mod= 1
##$AUNM= <au_zg>
##$AUTOPOS= <>
##$BF1= 200.13
##$BF2= 200.13
##$BF3= 200.13
##$BF4= 200.13
##$BF5= 200.13
##$BF6= 200.13
##$BF7= 200.13
##$BF8= 200.13
##$BYTORDA= 1
##$CFDGTYP= 0
##$CFRGTYP= 5
##$CHEMSTR= <none>
##$CNST= (0..31)
1 1 145 1 1 1 1 1 1 1 1 1 1 1 1 1 1 1 1 1 1 1 1 1 1 1 1 1 1 1 1 1 
##$CPDPRG= <>
##$CPDPRG1= <>
##$CPDPRG2= <>
##$CPDPRG3= <>
##$CPDPRG4= <mlev>
##$CPDPRG5= <mlev>
##$CPDPRG6= <mlev>
##$CPDPRG7= <mlev>
##$CPDPRG8= <mlev>
##$CPDPRGB= <>
##$CPDPRGT= <>
##$D= (0..31)
0 1.2 0 0 0 0 0 0 0 0.06 0 0.03 0 0 0 0 0.0002 0 0 0 0 0 0 0 0 0 0 0 0 
0 0 0 
##$DATE= 1696589410
##$DBL= (0..7)
120 120 120 120 120 120 120 120 
##$DBP= (0..7)
150 150 150 150 150 150 150 150 
##$DBP07= 0
##$DBPNAM0= <>
##$DBPNAM1= <>
##$DBPNAM2= <>
##$DBPNAM3= <>
##$DBPNAM4= <>
##$DBPNAM5= <>
##$DBPNAM6= <>
##$DBPNAM7= <>
##$DBPOAL= (0..7)
0.5 0.5 0.5 0.5 0.5 0.5 0.5 0.5 
##$DBPOFFS= (0..7)
0 0 0 0 0 0 0 0 
##$DE= 6
##$DECBNUC= <off>
##$DECIM= 32
##$DECNUC= <off>
##$DECSTAT= 4
##$DIGMOD= 1
##$DIGTYP= 9
##$DL= (0..7)
0 120 120 120 120 120 120 120 
##$DP= (0..7)
150 150 150 150 150 150 150 150 
##$DP07= 0
##$DPNAME0= <>
##$DPNAME1= <>
##$DPNAME2= <>
##$DPNAME3= <>
##$DPNAME4= <>
##$DPNAME5= <>
##$DPNAME6= <>
##$DPNAME7= <>
##$DPOAL= (0..7)
0.5 0.5 0.5 0.5 0.5 0.5 0.5 0.5 
##$DPOFFS= (0..7)
0 0 0 0 0 0 0 0 
##$DQDMODE= 0
##$DR= 18
##$DS= 0
##$DSLIST= <SSSSSSSSSSSSSSS>
$$ [...]
##$SUBNAM2= <"">
##$SUBNAM3= <"">
##$SUBNAM4= <"">
##$SUBNAM5= <"">
##$SUBNAM6= <"">
##$SUBNAM7= <"">
##$SUBNAM8= <"">
##$SUBNAM9= <"">
##$SW= 18.05172834244
##$SWIBOX= (0..15)
0 0 2 0 0 0 0 0 0 0 0 0 0 0 0 0 
##$SW_h= 3612.71676300578
##$TD= 16384
##$TD0= 1
##$TE= 0
##$TE2= 300
##$TE3= 300
##$TEG= 300
##$TL= (0..7)
0 120 120 120 120 120 120 120 
##$TP= (0..7)
150 150 150 150 150 150 150 150 
##$TP07= 0
##$TPNAME0= <>
##$TPNAME1= <>
##$TPNAME2= <>
##$TPNAME3= <>
##$TPNAME4= <>
##$TPNAME5= <>
##$TPNAME6= <>
##$TPNAME7= <>
##$TPOAL= (0..7)
0.5 0.5 0.5 0.5 0.5 0.5 0.5 0.5 
##$TPOFFS= (0..7)
0 0 0 0 0 0 0 0 
##$TUNHIN= 0
##$TUNHOUT= 0
##$TUNXOUT= 0
##$USERA1= <user>
##$USERA2= <user>
##$USERA3= <user>
##$USERA4= <user>
##$USERA5= <user>
##$V9= 5
##$VALIST= <valist>
##$VCLIST= <CCCCCCCCCCCCCCC>
##$VD= 0
##$VDLIST= <DDDDDDDDDDDDDDD>
##$VPLIST= <PPPPPPPPPPPPPPP>
##$VTLIST= <TTTTTTTTTTTTTTT>
##$WBST= 1024
##$WBSW= 4
##$XGAIN= (0..3)
0 0 0 0 
##$XL= 0
##$YL= 0
##$YMAX_a= 369633
##$YMIN_a= -393435
##$ZGOPTNS= <>
##$ZL1= 120
##$ZL2= 120
##$ZL3= 120
##$ZL4= 120
##$ABSF1= 10
##$ABSF2= 0
##$ABSG= 5
##$ABSL= 3
##$ALPHA= 0
##$AQORDER= 0
##$ASSFAC= 0
##$ASSFACI= 0
##$ASSFACX= 0
##$ASSWID= 0
##$AUNMP= <proc_1d>
##$AZFE= 0.1
##$AZFW= 0.1
##$BCFW= 1
##$BC_mod= 2
##$BYTORDP= 1
##$COROFFS= 0
##$CY= 11.3945322036743
##$DATMOD= 1
##$DC= 2
##$DFILT= <>
##$DTYPP= 0
##$F1P= 15.7292609196834
##$F2P= 12.9074282941183
##$FCOR= 0.5
##$FTSIZE= 0
##$FT_mod= 4
##$GAMMA= 1
##$GB= 0.15
##$INTBC= 1
##$INTSCL= 1
##$ISEN= 128
##$LB= 0.24
##$LEV0= 0
##$LPBIN= 0
##$MAXI= 10000
##$MC2= 0
##$MEAN= 0
##$ME_mod= 0
##$MI= 1.114404
##$NCOEF= 0
##$NC_proc= 0
##$NLEV= 6
##$NOISF1= 3.799351
##$NOISF2= 2.8
##$NSP= 1
##$NTH_PI= 0
##$NZP= 0
##$OFFSET= 15.70392
##$PC= 1
##$PHC0= -22426.39
##$PHC1= 5.852712
##$PH_mod= 1
##$PKNL= yes
##$PPARMOD= 0
##$PSCAL= 0
##$PSIGN= 0
##$REVERSE= no
##$SF= 200.130013532006
##$SI= 16384
##$SIGF1= 3
##$SIGF2= 2
##$SINO= 400
##$SIOLD= 16384
##$SREGLST= <1H.CDCl3>
##$SSB= 0
##$STSI= 0
##$STSR= 0
##$SW_p= 3612.71676300578
##$SYMM= 0
##$S_DEV= 0
##$TDeff= 0
##$TDoff= 0
##$TI= <>
##$TILT= no
##$TM1= 0
##$TM2= 0
##$TOPLEV= 0
##$USERP1= <user>
##$USERP2= <user>
##$USERP3= <user>
##$USERP4= <user>
##$USERP5= <user>
##$WDW= 1
##$XDIM= 8192
##$YMAX_p= 0
##$YMIN_p= 0
$$ End of Bruker specific parameters
$$ ---------------------------------
##NTUPLES= NMR FID
##VAR_NAME=  TIME,          FID/REAL,        FID/IMAG
##SYMBOL=    X,             R,               I
##VAR_TYPE=  INDEPENDENT,   DEPENDENT,       DEPENDENT
##VAR_FORM=  AFFN,          ASDF,            ASDF
##VAR_DIM=   8192,          8192,            8192
##UNITS=     SECONDS,       ARBITRARY UNITS, ARBITRARY UNITS
##FACTOR=    0.0002768,     1,               1
##FIRST=     0,             0,               0
##LAST=      2.2672688,     0,               0
##MIN=       0,             -393435,         0
##MAX=       2.2672688,     369633,          0
$$ Real data points
##PAGE= N=1
##DATA TABLE= (X++(R..R)), XYDATA
$$ [...]
1878D37j79n57M09O03j22q58L72O81p65m63Q22K48q58k36Q22K07r45O3P69l12
1898A38p44j08P86k3q34L73P95l13o71O24M25l57m59M72M70l69l60J96K73k12
1918A02l42M61Pl2j12l08N81l47l0m27P05p0p90L69N38l99m86N65M1J49r55O17
1940a63O12o46j09M75J08k93q7M42N74j199R8M86K32p15R8O59k04n72r7L32J20
1961A51m53l8L57m9o38K74O22l29k63K63K85ln98L54N77j93m94J97P56j47r36
1982c05K93P44l37n62L45K16j89p71M88M68o15r5J91L58m26l27N43ql74O2K41
2003f0K4j64q6M12J29j56k6J51K69n62l79P57R0k13k45P9N20m10m76L54K86o51
2025c57j91O29P5n94j39P58j02m51l5O99mo62K26N29k78m83M39Q68p94l91Q05
$$ plain form
1878 437 258 -299 110 713 591 -267 105 786 21 -442 380 628 -230 -466 356 563 -382 -319 450 138
1898 138 -606 -714 72 49 -785 -412 383 70 -601 23 448 91 -368 104 574 205 -155 41 314 102
1918 102 -240 221 228 196 84 -224 357 10 -20 -447 258 188 -602 -233 305 -94 -580 -15 26 175 -780 -163
1940 -163 449 -197 -306 169 277 -16 -103 339 913 -286 -188 298 530 -185 -87 572 368 -204 -301 31 151
1961 151 -302 -340 17 -32 -670 -396 226 -103 -366 -103 182 179 -419 -65 512 319 -175 22 778 631 -305
1982 -305 -12 732 395 -167 178 394 205 -566 -78 390 -225 -320 -129 229 -197 -524 19 11 -363 -301 -60
2003 -60 -36 -200 -286 126 255 99 73 224 493 -69 -448 309 399 186 -59 20 540 130 -346 8 294 -357
2025 -357 -548 81 156 -438 -577 181 79 -372 -407 292 288 -374 -148 381 103 -380 59 927 133 -258 547
2046E47j02n48j40P82n9o04j61P74l65n04L44J64j85j08J92j95mk34K45J35m9
2067g5J0K87j69j07K49j66j27M13P2l40J54K09j59m09P4O91n62l61N22J95o46
2088b45m76R94K6r63J97N17kn07j57Q55l18m38M05P49n25j65J59L19p35K22P11
2109F23k01o37L43M44m89k99L56O4j97k31M21j61l98K95J30k95P8L34j39o11K31
2130c39N14n77j09N52K71n42J89M45ln66K23P37m37o53L49P43m94r23Q91N09j155
2151c75j92J017l08p64K00Q29l59p96N30O00o04k30N40L52q62J06P87m01l42J69
2171a03P96q03o4O28L21q04J36K69n37l2J46L50l14l27L96j63m28P0M63j41m79
2192f20Q43j8m75k39O16K17p64M13R28p85m91P41N37r58j52N43k4n38Q8P99l30
$$ plain form
2046 547 445 -103 -243 539 480 -124 -285 489 124 -380 -36 128 -57 -165 27 -168 -172 -406 -161 -26 -75
2067 -75 -65 222 53 -54 195 29 -98 315 387 47 201 410 251 -158 -84 607 45 -316 206 401 -245
2088 -245 -721 273 299 -664 -467 50 48 -459 -616 239 -79 -517 -112 637 112 -53 106 425 -310 -88 623
2109 623 422 -215 128 572 83 -216 140 204 7 -224 197 36 -362 -67 63 -232 -154 180 41 -570 -339
2130 -339 175 -402 -511 41 312 -230 -41 404 401 -165 58 795 358 -295 54 797 303 -620 271 780 -375
2151 -375 -567 450 142 -622 -422 407 48 -748 -218 382 -222 -452 88 440 -422 -316 471 70 -272 -103
2171 -103 693 -110 -174 454 775 -29 107 376 -161 -193 -47 303 -11 -338 58 -105 -533 -463 0 -141 -620
2192 -620 223 205 -270 -509 107 324 -440 -27 901 116 -375 366 903 -55 -207 336 312 -226 -138 661 331
2213C31p62L55N17m99l73N43J64n42n24R63J75q91J88M18J56p25N80K26o98j9
2233d17R62k35m44Q4L76J36n18J75L92n10j67L48R9m74J30L52j62n07L46M74r02
2254d62r6N02O3o16J99P59m41n20Q77K67o00k36P45M52j111J49M94o9n24O0N93
2275D85j81p03O14K19n85J01Q0Q2l41qM06k74m30M30Q8k24l50P92P7o29J44L88
2297A81j89j78M33L09o76N1N80j72o44M24M48o93k38J89L52m02k22O26n8n52J43
2318b88M41p8p24N89K65m32n14P01J65l36J72L22K33p32K79J29R2l83M33P4m95
2339h7M7L74j80K6l03M45n45J61k9J46l93k69Q09R6q34N33K56o01N1M71n6n44
2361d26M08L60k35k53J07M13j2n15P16k80k94KL85m3r70M62N06l70l41J42L88
$$ plain form
2213 331 -431 -76 441 -58 -431 112 276 -266 -790 173 348 -543 -355 63 219 -506 74 300 -398 -417
2233 -417 545 310 -134 -50 326 462 -56 119 511 1 -166 182 281 -193 -63 289 127 -380 -34 440 -462
2254 -462 -558 -56 7 -609 -410 349 -92 -612 265 532 -68 -304 441 893 -218 -69 425 356 -168 -108 485
2275 485 304 -399 215 434 -151 -50 30 112 -229 -237 169 -105 -535 -105 -17 -241 -591 201 278 -351 -207 181
2297 181 -8 -186 247 556 -120 -69 511 339 -305 119 567 -126 -364 -175 177 -225 -447 179 121 -431 -288
2318 -288 153 75 -649 -60 205 -227 -741 -40 125 -211 -39 283 516 -216 63 192 284 -99 334 408 -87
2339 -87 -40 334 154 180 -123 322 -223 -62 -91 55 -338 -607 202 298 -536 -3 253 -348 -297 174 118 -426
2361 -426 -18 342 107 -146 -39 374 362 -153 563 283 -11 -9 376 333 -637 -175 331 -39 -380 -238 150
2382A50n11j71N63J36o04P5P52l69l16K54L39ll96L05O3j98n9J57J59q2j37m6
2404F1k46K50O0j81q2J50j70Q0r0K0M6j31l03N07j22l32K20L32j54j52L82M03
2426E48m16l65P10j91n12K46L12r0l16MN95m26l56L99L04o86j79N04j6l24k87
2447e42N55m3n73L18K20O7N7k38J50n7J83j53L38q7j41o9J19K8j23p4K48o8j14
2470Aj58K01j08J55k15J27r6K8j43K04l5l43J19J97l3j92L23J16J37k69K31N2
2492B99m40J26K72n9k44r1L25R4m15K79l4P6l20R3P3l0l0l27M20k46n4k99N71
2515C9k08M1J83K91m33J23j43K22r5r0lM90k41j5MJ25j71k94L71q8k03j97K14
2538g8J62k99J29K84k38m5l3k19L04o3k7n8R9n13O83rl43J16J51N2k07K35J31
$$ plain form
2382 150 -361 -532 31 167 -437 -362 390 21 -295 -41 298 295 -101 204 267 69 10 167 326 244 107 61
2404 61 -185 65 125 -56 -138 12 -158 -78 -168 -148 -102 -233 -536 -29 -151 -483 -263 69 -85 -237 145 548
2426 548 132 -233 477 286 -226 20 332 242 -74 -70 525 99 -257 142 446 -240 -419 85 69 -255 -542
2447 -542 13 -30 -603 -285 -65 2 59 -179 -29 -86 97 -56 282 195 54 -15 104 132 9 -65 183 115 1
2470 1 -157 44 -64 91 -124 3 -93 -65 -208 -4 -39 -382 -263 -66 -99 -291 32 148 285 16 247 299
2492 299 -141 -15 257 198 -46 -137 188 282 -133 146 112 188 -132 -39 34 4 -26 -353 67 -179 -233 -532 39
2515 39 -169 -128 55 346 -87 36 -107 115 20 -70 -73 417 176 161 165 290 119 -175 196 108 -95 -292 -78
2538 -78 84 -215 -86 198 -40 -85 -118 -337 -33 -96 -123 -181 -82 -595 88 79 -264 -148 3 55 -152 83 214
2561B14l5k84K69J5l3J71j68k90K73j44O4n5k91K94j99L16o43M09J19j44Q2M6
2583a4J39k73J70J41l92K69K01k16R3q1J80j56Q4J71n9l50J37l0k55m0L07J78
2605B04m38k66P07O2o76QM32m0m91L12L85j73k7L03r1k76N4M30k0m97J84L71K5
2628D82o46j08O25l01k29L94k16j47j18L65k6k76k24N61j39j56o2K65j56j40J34
2649a18j04J37M3K39n9K20m72M41n30K83P7j13j60O25j62o73J11L87m0k43N3j47
2671b05J37n00L42M55m47q8M70j00k32l70O12ok17J83M22l12n12K84O08m65m04
2692c45O38J44k33l36K90M4l49n0M44m14k20L17M8j58j33R6P7j9k90K18J74J75
2714A18k16O8J03k05L26o0j37Q7L77l40P5p3j39j6J83J24l77k96J76N80n70J4
$$ plain form
2561 214 179 -105 164 179 146 317 149 -141 132 -12 52 -3 -294 0 -199 117 -526 -117 2 -142 -60 -14
2583 -14 125 -148 22 163 -229 40 241 25 118 37 217 61 145 316 257 -93 44 14 -241 -281 26 204
2605 204 -234 -500 207 269 -407 -399 33 -7 -498 -186 199 26 -1 302 211 -65 -11 419 399 -98 86 457 482
2628 482 -164 -272 353 52 -177 217 1 -146 -264 101 75 -201 -425 136 -3 -159 -221 44 -112 -252 -118
2649 -118 -222 -85 -42 197 138 358 -114 327 -203 80 157 44 -116 509 347 -326 -215 172 132 -111 -58 -205
2671 -205 -68 -568 -226 229 -218 -306 164 64 -168 -538 74 68 -149 34 456 144 -368 -84 524 59 -345
2692 -345 293 437 204 -132 158 202 -147 -197 247 -167 -387 -70 -22 -180 -313 -217 -140 -159 -449 -231 -57 118
2714 118 -98 -30 73 -132 194 134 -3 84 461 121 196 123 -16 -32 151 275 -102 -398 -222 358 -212 -198
2736a98J69j20l06QN41q9k89K09L26j95j35R7L64l12l61M40L38o47oO07j03l42
2758dN7M02n17Q1n1J37l4k54M04k22k89L8K82k0l53L32J51k38q9K57l5p6J0K71
2782B40j55k51M13l9j86l2J11J41m60j6M45k93l70L57L81k29j22K7N5j41J4J06
2804dl7k79K20K79m20K35p1K02l78O8M36L1k21M4J00J64m49J27K96k46k56J00
2826e9K26l55p5K30l3j30K0qJ33K6k1k37J59J77j93J7q3K13j5J8p1P0J85j35J4
2851G3L1Q8l74K45L17m53J3J25R9k36j75L17o8l13m4M68l82q8J85L95k84k35N55
2874B59j85k26j01M02j2k43K03J14K32n98L88K42l07l35L25o2M9l23J89m1r5M3
2896h2j25K10n3P1j48J42J48j17j69rQ3k24L11J78q1j67J27p5J02n10M05J59L6
$$ plain form
2736 -198 -29 -149 -455 -447 94 5 -284 -75 251 56 -79 18 382 70 -291 149 487 -160 -166 441 338 -4
2758 -4 53 455 -62 19 -32 105 71 -183 221 -1 -290 -252 30 10 -343 -11 140 -98 -187 70 35 -41 -31 240
2782 240 85 -166 247 208 22 -10 101 242 -218 -234 211 -82 -452 -95 286 57 -65 -38 17 -124 -110 -4
2804 -4 -41 -320 -100 179 -241 -6 -77 125 -253 -185 251 282 61 105 205 369 -80 47 343 97 -159 -59
2826 -59 167 -188 -263 -33 -66 -196 -176 -184 -51 -25 -46 -283 -124 53 -140 -123 -206 7 -8 10 -61 9 194 59 73
2851 73 104 192 -182 63 380 -73 -60 65 164 -72 -247 70 2 -311 -355 113 -269 -357 -172 223 -61 -296 259
2874 259 74 -152 -253 149 137 -106 97 211 443 -155 233 475 168 -167 158 96 145 -178 11 -30 -125 -82
2896 -82 -207 3 -50 21 -127 15 163 46 -123 -132 -49 -273 38 216 135 -32 95 20 122 -388 17 176 212
2919B12k37J04K48l04n46K68N56n66j64L92l9j71j14N52o1n34J04P14l26m30L26
2940a6J81J74n28O10Pl44n6J83K2n8l39L53N2k10M3J55j14k29jM5O4k54q7L06
2964d1r7j58KM47j61j00J08q8K33j05P6o0J32l05J61L29m72M8O8K12l7j91k00
2987a99M00k85k5K6j5O2l70J49K08r4jO4K39j53j56K98n8j58j01J54m8P8O4N3
3011A32q3J21J4j16J45j43k07M19m82No8O18m15K08l75J42j32q7J91K10k21k43
3033c67M27m2%k70L23qk5J09j16J25k19L4O6J31J91k51J63j98j46j17M88j43n85
3056d30N4MK76m16M59n9K6j92K93j18k8M4j67M23j58j81n0J98q1J68R8j10j14
3079f1J43j47R9J91j06j21J16k96j2J16M2j52P3rP6K0n2J96j52m8j22K79j71R6
$$ plain form
2919 212 -25 79 327 23 -523 -255 301 -265 -429 -37 -76 -247 -361 191 130 -404 -300 414 88 -342 -16
2940 -16 165 339 -189 421 428 84 28 211 233 175 -164 189 241 31 74 229 115 -114 -115 -70 -6 -260 -347 -41
2964 -41 -138 -296 -294 153 -8 -108 0 -88 145 40 116 56 188 -117 44 373 -99 -51 17 229 192 1 -199
2987 -199 201 -84 -109 -83 -98 -36 -406 -257 -49 -143 -144 -80 159 6 -150 148 90 -68 -169 -15 -63 15 79 132
3011 132 49 170 184 68 213 70 -137 282 -200 -195 -263 355 -60 148 -227 -85 -217 -304 -113 97 -124 -367
3033 -367 60 18 18 -252 71 63 38 147 31 156 -63 -29 37 168 359 108 271 73 -73 -190 298 155 -430
3056 -430 -376 -372 -96 -512 -53 -112 -86 -278 15 -103 -131 -87 -254 169 11 -170 -220 -22 -103 65 163 53 -61
3079 -61 82 -65 34 225 119 -2 114 -182 -194 -78 -36 -188 -115 -124 -48 -28 -80 116 -36 -84 -206 73 -98 -2
3103bJ36J51k26j23J06K19j81r8J42J39j39j81L76k04k96M2O9j13J0r7M37k89
3125a22M5j9K67k79J45k4Q7k1r3j68K45O7M0Ml06K78m9R3j5j27q9Q5M3l4j51J81
3151H3m5k02o5J48P9K2k77J59K18j74J0J5L2kJ23j24P9o9j35L72j77L8N4K0k5
3176A57p0R8J16l87k8R2P7j50k00K97m3j66O4J28j14k60J21L23J47m09N9J81j66
3199a33M4K8J92l0n2J44k50J85J03l51RK22k24l4Q7K6m1N4K64j38k22k37K66J40
3223E2k59O4L1L01j10l01K90J0j83J07L11l0m76N30j90r0j17J10K99m24M5J35
3245A05j84l2K08j91j75Q9Q2J68j82j09L64j96q7O9n1L13k43j6Q9J98l0n2Q9j28
3269I8mK37j60k02q8L57k26j73L64k16ML9nj03k10K57J46k26j55M9K63j87R1J35
$$ plain form
3103 -2 134 285 59 -64 42 261 80 -18 124 263 124 -57 319 115 -181 -139 -70 -183 -173 -270 167 -122
3125 -122 -77 -96 171 -108 37 13 100 79 -14 -182 63 130 170 174 -132 146 97 190 175 48 -41 44 87 53 -98 83
3151 83 38 -164 -229 -81 -2 20 -257 -98 120 -54 -44 -29 3 1 124 0 79 10 -125 247 70 108 162 182 157
3176 157 87 185 301 -86 -114 -22 55 -95 -295 2 -41 -207 -143 -15 -129 -389 -268 55 202 -207 -148 33 -133
3199 -133 -89 -61 131 101 49 193 -57 128 231 -120 -111 111 -113 -147 -60 -34 -75 -21 243 105 -117 -354 -88 52
3223 52 -207 -143 -112 189 79 -222 68 78 -105 2 313 283 -193 337 147 57 -60 50 349 -75 -30 105
3245 105 -79 -111 97 -94 -269 -180 -98 70 -112 -221 143 -53 -140 -71 -122 191 -52 -68 21 219 189 137 226 98
3269 98 94 331 171 -31 -119 238 12 -161 203 -13 -9 30 25 -78 -288 -31 115 -111 -266 -217 46 -141 -50 85
3293H5K5l05L40k9l68K16K90K18n62K37o0K01j56p5J55j52j31R5q1J8J14j14o0
3316i9OJ43J47j07k89j30J81k76J83K08k6J47m2Q3j03l8K88J6j20k06J65j50J98
3339A79j97J60Nk78K73j12k04J09J33j36p1M7M11n73P2J92J93n40N6N61j30J1
3361A61k2j39J42k65n4M14l64J85j9K35l36K5J01Qj88J89r4O6j75R9K29l55k35
3384c92M29j8j4n1o5n0K12%l66L71J15O7k87j88K92J26j96r1K33J2k55L45R8M
3408C31n83K34n4J31p3j84K09m31J64K80J46l69j01L97j85j27M60J6k14Q9P8K06
3430D20m38R3K28k33o0m4J66k13n0P2j25K05r9j58J83L9JOM3q1k23J16K2M0o7
3455a57K13M2q2K43j84P6J92m39M8L01j93r2j42K04k0O3k12J74J7j15Jj02K42
$$ plain form
3293 85 110 -195 145 116 -252 -36 254 472 -90 147 87 288 132 57 212 60 -71 24 -57 -39 75 -39 -99
3316 -99 -93 50 197 90 -199 -329 -148 -424 -241 -33 -59 88 46 129 26 -12 276 292 172 -34 131 -19 179
3339 179 -18 142 147 -131 142 30 -174 -65 68 -68 -139 -92 319 -254 -182 10 203 -337 -281 280 150 161
3361 161 139 0 142 -123 -177 237 -127 58 39 274 -62 -37 64 72 -116 73 -21 45 -130 -31 198 -157 -392
3384 -392 37 19 5 -46 -111 -161 51 51 -315 56 171 238 -49 -237 55 181 -15 -106 127 139 -116 229 327 331
3408 331 -252 -18 -72 59 -14 -198 11 -420 -256 24 170 -199 -300 97 -88 -215 245 261 47 136 214 420
3430 420 -18 75 303 70 10 -34 132 -81 -131 -59 -184 21 -78 -236 -53 -14 -13 -7 36 -45 -268 -152 -130 -90 -157
3455 -157 56 98 16 259 75 151 343 -96 -48 253 60 -32 -174 30 10 73 -139 35 52 -63 -62 -164 78
3478G8l99P3J66L6o1N3J75j67j06K29O1l00K2K71q8KK38j60Q5j57K6P3j95j76
3502b21K24K76m73K31K2N5n8j59J37m6l52J51K64R5j54j85K40k35L27q8Q5J64
3524C00k54Q2j50K93k98Q9J00j14J23k74j91M40j73j59Q5K04k41k04L98k22k26
3545c92J0L35K4l3Q7j08J3j2K48k17K7k5RJ31j80m2O4K60k75J10j87Q5K56m22
3569b34K82J97l66Q8l5J8j89Q7L11o7k81O4J49p8K62k49J90j92J75l44L32m8P5
3592A47j05j80L89k70O6K1O6jr1J16l6k92K85l14n2J5K5L68j85K7M3j40j8o3K04
3617B5M5k17K15J39p4p7J25j57K12p9r0j41L41N6k90J09j93n2J33J10j23l08R8
3640a93K91k78L2Q7J79oj69j37OL86r8j9K35k52j77J40l2j43K98j25Q9j17j84
$$ plain form
3478 78 -321 -248 -82 -46 -107 -54 121 -46 -152 77 138 -162 -140 131 43 45 283 123 208 51 77 150 -45 -221
3502 -221 3 279 -194 37 59 114 56 -103 34 -12 -364 -213 51 146 -8 -193 47 -188 139 51 136 300
3524 300 46 128 -22 271 -27 62 162 48 171 -103 -294 146 -27 -186 -101 103 -138 -342 56 -166 -392
3545 -392 -382 -47 -23 -56 31 -77 -64 -76 172 -45 -18 -43 -34 97 -83 -125 -61 199 -76 34 -153 -68 188 -234
3569 -234 48 245 -121 -33 -68 -50 -239 -152 159 92 -189 -125 24 -54 208 -41 149 -43 132 -212 120 72 147
3592 147 42 -138 251 -19 47 68 134 133 42 158 122 -170 115 -199 -251 -236 -211 157 -28 -1 42 -98 -116 -179 25
3617 25 70 -147 68 207 133 56 181 24 236 157 67 -74 267 323 33 142 -51 -103 30 140 17 -291 -193
3640 -193 98 -180 -148 -61 118 112 -57 -194 -188 198 100 81 316 64 -113 27 -5 -148 150 25 114 -3 -187
3663a87Q2N5j44J30L06j22m14J26J77j52J77N4Ol91M37k37L25l91R9K30j88J59
3685A37J47l53K04j92j39L40l66L17nj19L7M4l6K75j75O4l61M0pM3j6L8j7Np2
3710a67j8L86l15R8M3l8J41j78R9o9K03Q6J68j45Jk66K3m0j00J05l25J99k79L32
3734e6R2k56J82j04n9J35j23L8m4K74j22p5j72M55J00p8j22J32j88j16j4K15J32
3757B26m5j1r1K01O1l11k6k04K92R7l69l6L8M70m61K06j02m2L11n04K28j44K9
3780a87K09o5Q2L43k62j29N1j49L98k98K2j14N6Q9p4k7o7L3j35M18l21r7Q5J08
3804c1j88J09J37N2K9l36M37p0k32J98J51k63J01l8N7Kq5L4l48K63j72M39k34
3827A2N9r5R8o0j05K79m1k77j20L84k25j99J48J64K99k73Pj3K8rpJ37j43J81N
$$ plain form
3663 -187 -105 -50 -194 -64 242 120 -294 -168 9 -143 34 88 94 -297 140 -97 228 -163 -64 166 -22 137
3685 137 284 -69 135 -57 -196 144 -222 95 90 -29 8 52 16 291 116 180 -181 -141 -148 -105 -121 -83 -100 -95 -167
3710 -167 -185 201 -114 -16 27 -11 130 -48 51 -18 185 271 439 294 295 29 52 12 -88 17 -308 -109 -388 -56
3734 -56 36 -220 -38 -142 -201 -66 -189 -151 -195 79 -43 -118 -290 165 265 187 65 197 9 -107 -121 94 226
3757 226 181 170 79 280 341 30 4 -200 92 189 -180 -216 -178 292 -169 37 -65 -107 204 -300 -72 -216 -187
3780 -187 22 -43 39 382 120 -9 42 -107 291 -7 15 -99 -43 46 -28 -55 -122 -89 -224 194 -127 -224 -139 -31
3804 -31 -219 -110 27 79 108 -228 209 139 -93 105 256 -7 94 56 113 115 30 64 -284 -21 -193 246 12
3827 12 71 -24 74 14 -91 188 147 -130 -250 134 -91 -290 -142 22 321 48 55 42 70 61 54 191 48 229 234
3852B34k58n6J74p1rj98M44p9j17j33o2N04m44J15j65N3l8m8L1Jj05L42j5J10
3876B10l03J14lJ59o5j13n5K52j04Qj73R1l6N5M2k26j34l9L25j20K21p9R7l2j45
3901e3j0L7M3k09J66o3M98k88j87K9Q7K89l08J18p9Ll6K49l91J97j46K69m80J16
3925a49J93k29K22k22O2nJ58j91j9J35M39m50m2P8JM7L8p2Q4r6N5K09J26k36n0
3950H6J79J16l40N8j07j46L8n0J14K6n1K8j46O0j37J44L29k05Q2j19mK37k98K68
3974A62k80J92j15L91k80m01N39O0l71J62o4O9mk54M91l79o9P7p6J23J74j35j55
3997a43J80M5q3k56K66j14j3K06n3k72K96J61k65R2J00j38J35J9j98l5J58o1j45
4020a18J2L44j70j46k6K1o7K12P4r9l2n5l7k21K12J39J54l70K55L4P1k34M1K22
$$ plain form
3852 234 -24 -80 94 23 14 -184 260 181 64 -69 -131 373 -71 44 -121 -68 -106 -154 -123 -122 -227 115 100 210
3876 210 -93 21 18 177 112 -1 -56 196 92 100 -73 18 -18 37 79 -147 -281 -320 5 -115 106 27 124 92 -53
3901 -53 -63 -26 17 -192 -26 -89 409 121 -66 -37 50 339 31 149 70 73 37 286 -105 92 -54 215 -265 -149
3925 -149 44 -185 37 -185 -123 -128 30 -161 -180 -45 394 -56 -98 -20 -19 28 66 -6 78 -18 37 246 372 136 86
3950 86 265 381 41 99 -8 -154 -116 -166 -52 -26 -77 -49 -195 -135 -272 -128 201 -4 78 -41 -45 192 -106 162
3974 162 -118 74 -41 350 70 -331 208 268 -103 59 -5 64 60 -194 297 -82 -151 -74 -150 -27 147 12 -143
3997 -143 37 82 -1 -257 9 -105 -118 88 35 -237 59 220 -45 47 147 9 144 163 -35 -70 88 27 -118
4020 -118 -106 238 68 -78 -104 -83 -150 62 136 37 5 -50 -87 -308 -96 43 197 -173 82 116 187 -47 -6 216
4044B16r5L6k09J30om5k4MN6k17O9J56j60L23m07O8Q1j62q4L71r5j12J4JK50k68
4070a09K12J0l05L02r4k8K26m4k18J13j54K20M3j83N2j76mj03R4n1J50r9K48m9
4094E3l40K54j28L8L9L58m00O9J21m1j70J74J13J12j26J04P8k28k2l09L37l01
4116b15M71l0m4m27K39r2N2O8j5l9j60J24L0j22L52j77O6kl7M2j7k72K62k8J59
4141A88q6r9O5RR3l17L03l8p5k38J86J29k9m98L12L51k82P8l76L31Qj29J04L13
4165C03l99N6O7K42l21K15m3l0R2o0k24K71j0q8o1kK07m34K75J73k42l1K51j34
4189G3j34J10Ln5J15j34j13P8J31Oj49L3J45k34K20L9nj82K92j60Oj1j22J7M2
4214A1k56K61k0O0N4q4J73m27K84o3m7j53J77j57K35j01K18k34J11K7j40K16k12
$$ plain form
4044 216 121 157 -52 78 72 27 3 7 63 -154 -85 71 -89 234 -173 -105 -24 -186 -270 101 6 -106 -92 -91 159 -109
4070 -109 103 113 -192 110 16 -12 214 170 -48 65 -89 131 174 -9 43 -133 -137 -240 -146 -197 -47 -146 102 53
4094 53 -287 -33 -161 -123 -84 274 -126 -57 64 23 -147 27 140 252 126 230 308 80 58 -251 86 -215
4116 -215 256 226 182 -245 -6 -98 -46 22 7 -32 -192 -68 -38 -160 192 15 81 79 42 84 67 -205 57 29 188
4141 188 102 3 68 77 170 -147 156 118 43 -195 -9 120 91 -407 -95 256 -26 52 -324 7 15 -114 -10 303
4165 303 -96 -40 27 269 -52 163 120 90 182 122 -102 169 159 71 10 8 215 -219 56 229 -13 -44 207 73
4189 73 -61 49 52 -3 112 -22 -135 -57 74 80 -69 -36 109 -125 95 134 129 -53 239 79 85 74 -48 -31 11
4214 11 -245 16 -4 56 110 26 199 -228 56 -7 -54 -207 -30 -187 48 -53 165 -69 42 69 -71 145 -67
4237f7J11L8p4k73M01Q4P3j57O4m34O5J19Q6j78l6K65j22l0n7m2K37j31L48n00
4261b10M06J14l02M0J83k37k0K21l12J33m4l5J9l3M5j9K04o4Mj40K8r8L5L33l98
4286a47nJ11K5j65J11l8q8j23M8L92l7k4J70k10J1%j47M99k85k39K75N2k21j71
4310b06K87j04J06N6l43K25j07j28M9k1J57K72k41J5K93n56K63M7k75K81lj10
4332d3J91J64p4j38j95O1Q4Q4J67n43M40j76j90J92l06L68ml6j77L7R7M7o2k43
4356b55K29j33K65N8p7n5k29M20k60N4J27j12p9pL78j05k63MK26l87J82J00j53
4379g2J00K9m0n0j44k7L34J4j82M4o7M7J95j85K45k71J19R9k23J61PJ22l44J80
4403I1k25J10k2k32J90j19N1R5K14j66J14j97M07k45p3k3j15J34n0J6J06N7j12
$$ plain form
4237 -67 44 82 8 -265 136 220 293 136 200 -234 -169 -50 36 -142 -178 87 -35 -65 -122 -164 73 -58 290 -210
4261 -210 196 310 8 48 231 -6 -26 195 -117 16 -28 -63 -44 -77 -32 -51 153 89 93 -47 -19 -117 -82 251 -147
4286 -147 -152 -41 -16 -181 -70 -108 -196 -319 -271 121 84 60 230 20 31 31 -116 383 98 -141 134 186 -35 -206
4310 -206 81 -23 83 139 -204 21 -86 -214 -165 -186 -29 243 2 17 310 -246 17 64 -211 70 67 -43
4332 -43 148 312 238 100 -95 -34 50 134 301 -242 198 22 -168 24 -282 86 82 46 -131 -94 3 50 -12 -255
4356 -255 -26 -159 106 164 87 32 -197 223 -37 17 144 32 -47 -54 324 219 -44 -40 186 -201 -19 81 -72
4379 -72 28 57 17 -33 -177 -204 130 144 -38 6 -61 -14 181 -4 241 -30 89 188 -35 126 133 255 -89 91
4403 91 -134 -24 -46 -278 -88 -207 -156 -61 153 -13 101 -96 311 66 -7 -30 -145 -11 -61 -45 61 118 6
4426Fj0J99M8k89k3J55j50J50j44L12k64J77lJ61k46l23J35Q7K2j2k02j10K66
4449e8k76L34j3j7m7J63p7l1P7R5j99O7%K67l88N6J42NQ6q7j4p3Nj61J66J21l16
4476a73K13n9R5j41k2K72l72J4L41L0k18j02j36K38j46K58r5l36K90K8J44k69
4498a46L12m26J08m9J92J76m7o3p3k8J47L9p3l12K86k16K60j63pK84l56J45K57
4521B47k46K94l98L41Jk09J4k29J99Jr3J12j12K07l23J00K97l70q4N58l68q3K48
4544A04k04j3o5K37l52K11L7K00l18J01L8M4R8k40L87k47j24J30M1j81K84M1l29
4567a20K4J90l7j09k8J65j92p5l7J62R8J4r3n5J95R7j14j06K13L48n59l6J08r1
4591c8R5M6q3o5j39L31p6j17K68m56k8M73m3j63Q7M3j46rj7j3K55j24k85N61l82
$$ plain form
4426 6 -4 195 243 -46 -69 86 -64 86 -58 254 -10 167 164 325 79 -244 -109 -22 0 -12 -214 -324 -58
4449 -58 -334 0 -13 -30 -77 86 9 -22 55 150 -49 18 18 285 -103 -47 95 100 186 99 85 12 17 -144 22 143 -173
4476 -173 40 -19 76 -65 -87 185 -187 -173 168 198 -20 -122 -258 -20 -166 92 -3 -339 -49 -21 123 -146
4498 -146 166 -260 -152 -201 -9 167 120 57 -16 -44 103 142 69 -243 43 -173 87 -76 -83 201 -155 -10 247
4521 247 1 295 -103 238 239 30 44 -185 14 15 -78 34 -78 129 -194 -94 203 -167 -251 307 -61 -144 104
4544 104 -100 -113 -178 59 -293 -82 -45 155 -163 -62 -24 20 118 -122 265 18 -106 24 65 -116 168 209 -120
4567 -120 -96 94 57 -52 -80 85 -107 -182 -219 -57 41 55 -38 -93 102 199 85 -21 192 540 -19 -55 53 -38
4591 -38 57 103 20 -45 -184 147 71 -46 222 -234 -262 211 168 5 92 135 -11 -20 -37 -50 205 81 -204 357 -25
4616b5p3L73k33q7J63O0r1K29l64O5k51J71J69q5K13n53J33J93L65n16k76K27
4638a93L56k53J03k79L11j75K10L1J25j64j35J56O8k50j06J88p4K63k94J81j32
4659f3K5j10L43l76Q2P9j6L9J27j89J48qk14nK41l7O9j78K8K59k88p1K01m2m01
4684c57N14k33J37j31K25k34j69K48J43j00K0K16k42J5j28M7M8o5J6k1p1o3M01
4707B16k11J6j06k0J27j08J56n5J48J2j56o2J68k07LJ70L3k17J39M4K50l21j50
4730a31M9J28Jm4J94k01j80K09j64L86j23k72J84j14J4J9j76R4L13j99Q5j30K98
4753B40l17P5j28J55o4r9k6K16k04J52k7j23J12J14J37m18K03J3Jk38L76m99M48
4776I9l5k88L94k50m9J59K98j53J02j87M6k48J52j71J05M8k64L01j73L3m8K18
$$ plain form
4616 -25 -98 275 42 -45 118 178 87 316 -48 17 -234 -63 106 21 234 -319 -186 7 372 -144 -420 -193
4638 -193 163 -90 13 -266 45 -130 80 111 236 72 -63 93 161 -89 -195 -7 -81 182 -112 69 -63
4659 -63 -38 -148 195 -181 -99 -20 -36 3 130 -59 89 81 -133 -138 103 66 135 -43 -15 244 -44 -115 86 44 -357
4684 -357 157 -76 61 -70 155 -79 -248 0 143 43 63 279 37 52 -76 -29 19 -46 -30 -51 -122 -185 216
4707 216 5 21 -85 -105 22 -86 70 15 163 175 19 -43 125 -82 -79 91 124 -93 46 90 340 19 -131
4730 -131 -82 46 47 3 197 -4 -184 25 -139 247 124 -148 36 -78 -64 -45 -221 -127 186 -13 72 -58 240
4753 240 -77 -2 -130 25 -39 -138 -164 52 -152 0 -27 -150 -38 76 213 -205 -2 11 12 -226 150 -349 99
4776 99 64 -224 170 -80 -129 30 328 175 277 90 136 -112 40 -131 -26 22 -242 59 -114 -81 -129 89
4798H9P8l16J66j8o0K95J28l64rk48J13O5l8K03k55L7L01p2LJ85j84J22l09K94
4822B06m6j16j45P1J20Oj5J12l66K8J24m9n8L01o6R1j59k33r9J49J5L34j57n1
4846cK27k17M2k86L77m37N50n5j63j52L44k94J55j22J38j70K2L16n07L38n7m4
4868BJ14j33P3kp7kJ21P5k47K13j46o7K38j42k6j04J40J72k05J0j16J11J5j28
4892a11J74n1q9k03K68mJ19j74j01K98l17M22k45m6J92j30R4j39J31j72o7L7J19
4915EJ23n4rj28K51k72K01k76J78J18j78K39k30P2j55L42k47j43K86K1j58K18
4937B04k58J20p9J5J09o4q1M10j95m3m4N2P6n3n7j48k2L23l25J00J65k80k06K23
4961e8J52k09K77k35J01j89J72N6J32j62N5K1j41L00l06j1m8J37P8J91k17o5N
$$ plain form
4798 89 167 -149 17 -1 -61 234 362 -2 -11 -259 -146 -81 -119 84 -171 -134 167 95 98 283 99 221 -88 206
4822 206 160 44 -101 -30 90 96 81 193 -173 -145 -21 -70 -128 173 107 198 39 -194 -293 -144 -129 205 48 -3
4846 -3 224 7 49 -237 140 -297 253 198 35 -117 227 -67 88 -34 104 -66 -44 272 -235 103 46 2
4868 2 116 -17 56 54 -23 -25 96 171 -76 137 -9 -76 162 20 -6 -110 30 202 -3 7 -109 2 17 -111
4892 -111 63 12 -77 -280 -12 -16 103 -71 -172 126 -191 231 -14 -60 132 2 96 -43 88 -84 -151 -114 5
4915 5 128 74 65 -63 188 -84 117 -159 19 137 -41 198 -32 40 -115 227 -20 -163 123 144 -14 204
4937 204 -54 66 -13 2 111 47 -34 376 181 138 94 146 222 169 112 -36 -58 265 -60 40 205 -75 -281 -58
4961 -58 94 -115 162 -73 28 -161 11 67 199 37 92 113 -28 272 -34 -45 -93 44 122 313 96 31 36
4984C6j8k9O9k3j65Q7l3L63m70K80j0l2P7j20p3J7J17o4r0j68p6K88RJ40j55K44
5010B01j43k25J72o0O8J97k03L33l59l2L7J19L8l22J8M18l50J57l9k16L11m0k82
5033b02J51J62r3J82m15J03K76l01j15L20k85J59P2Kj80J25P4j95j60L07N4j31
5055i0J11j59L32l26j9K20k08m1J13K44j68K36k89P2q1J39k01K36l5r4j76J83
5077aK8j6n4N5n2J67p8O2j96K03j13j63J60K1J07J4j95K8q4N3j28r9L88l02Q4
5102a11N8m1O7p8O4K33l00R2r4L48m26L17l64J97q6J53n0R5LJ99j63j59j6j7K79
5127B00l86K70j69K8K17j93j17K68L3j65k17M60k94o2L51k61O2J10n4n6k03L25
5149A47n9j29q1j64J37j18r6K55J26K08m10R7n0J05N2K7L7J2l66L28J21P6k31
$$ plain form
4984 36 18 -11 58 35 -130 -43 -76 287 -183 97 87 55 132 12 -61 -44 73 9 -81 -249 -325 -37 -28 112 -43 201
5010 201 58 -167 5 -55 13 210 7 340 -19 -51 -14 105 143 -179 -161 257 -93 64 25 -191 120 80 -202
5033 -202 -51 111 18 200 -215 -112 164 -137 -252 68 -217 -58 14 16 -164 -39 35 -160 -320 -13 41 -90
5055 -90 21 -138 194 -132 -151 69 -139 -180 -67 177 9 245 -44 28 -53 86 -115 121 86 -8 -184 -1
5077 -1 27 11 -43 12 -40 127 49 111 -85 118 5 -158 2 23 130 144 -51 -23 -107 -54 -182 -281 107 -195 -111
5102 -111 -53 -94 -27 -105 -41 192 -108 -16 -110 238 -188 129 -235 -38 -124 29 -21 74 77 276 113 -46 -62 -79 200
5127 200 -186 84 -85 -57 160 -33 -150 118 151 -14 -231 229 -65 -127 224 -37 25 135 81 25 -178 147
5149 147 88 -41 -122 -286 -149 -267 -363 -108 18 226 -184 -87 -137 -32 20 47 84 96 -270 58 179 255 24
5172B4J50j84j97L37K8k07K23j54K8O3n1p2k53K82K64l54k10J87p1K2r9J00NK03
5196F4o4Q8J54m19L64Q7l83J68J5l2p2q6K44j62J77j02j60P4m0J09J10j61j35
5219a62J15J81k53K59k78J06k03J50K14r0o3L44k18p4qo6j9M4K82j19k85Q9K51
5242A97j22k08K4K17j30j19N2L31k13n0Rj4l5k4L72j19k37J27J34j11o7l64L11
5265c9L17l24j01mL19j88J44J0k13K14j68J08J23k44L5P8jl9k66J69k3%J44k24
5289a73L71k77K29j83K11j24j20J67q9j52M72k13j48J76j27K7j28J84j40k13K18
5310c2P9o7P5j90J24k04L96l77l0Q8J16k6O8r2Oj11K42l2K35k21l0J56j44o5Q1
5335D5J31p1p0j16m9J15j70M1O5P%j06J58k8j94L54l10kl8N0J67J45J7k6k19o9
$$ plain form
5172 24 174 -10 -207 130 158 -49 174 20 48 111 60 -12 -265 17 281 -73 -283 -96 -167 -145 -244 -144 -139 64
5196 64 0 88 242 -177 187 274 -109 59 74 42 -30 -116 128 -34 143 41 -119 -45 -85 24 134 -27 -162
5219 -162 -47 134 -119 140 -138 -32 -235 -85 129 39 -24 320 102 28 20 -46 -65 -21 261 142 -143 -54 197
5242 197 75 -133 -109 108 -22 -141 -89 242 29 -21 -12 -26 -61 -85 287 168 -69 58 192 81 14 -350 -39
5265 -39 278 -46 -147 -151 168 -20 124 134 -79 135 -33 75 198 -46 -11 67 66 27 -239 -70 -93 -93 51 -173
5289 -173 198 -79 150 -33 178 54 -66 101 12 -140 332 119 -29 147 20 47 -81 103 -37 -250 -32
5310 -32 47 -20 55 -135 -11 -215 181 -196 -226 -138 -22 -48 20 -72 -66 -177 65 33 268 47 17 173 29 -36 45
5335 45 176 105 35 -81 -130 -15 -185 -144 -79 -72 -72 -178 -20 -48 -242 112 -198 -200 -238 -188 -21 124 141 115 -104 -173
5361a73J68J6J25m7j33j2j27N17k44j40J63n2j70J5N4M8O8J5k08m5K16j37R5K30
5385B42k08O3j73J6K4Q4p6o0n8K22n0j47J60K68m51K6J09J90J02k64J32n5k88
5408a92L40j68K11j01k80J10R0R9o7l62L08o5l8J45q4K6j21J03K23k93L0p5J83
5431B2k18J41J80k09j24K10J43o4r3J45k05J33J77j30k18m3Q2l3J96j92P1J82
5453A53J12l42j41N7L69j33r9K86l79K1J57N8p7j97J86j58J40J1j63L14o02K64
5475a63J19J0K16j12k05J87k93K12l0K67r3l12N9K07l4j2q1J04M2p2Jj38J4J04
5499cj83J04P5J35pl02K52R5j98l5J53j52j54J71j37M36j92j23K12j7r4l5j56
5522a55M14o12N28k38J55k4J77j65j87o1Q4N9J0o5p5N5J39M9q4k9N3Lk54J76l4
$$ plain form
5361 -173 -5 11 136 89 -44 -56 -183 334 90 -50 113 61 -109 -94 -40 8 76 91 -117 -162 54 -83 12 242
5385 242 34 97 -76 -60 -36 48 -28 -88 -146 76 26 -121 39 307 -144 -118 -9 181 283 19 151 96 -192
5408 -192 148 -20 191 90 -190 -80 10 109 42 -320 -12 -77 -115 30 -54 -28 -149 -46 177 -116 -86 -161 22
5431 22 -196 -55 125 -84 -208 2 145 81 -12 133 -72 61 238 108 -110 -153 -71 -104 92 -100 -29 153
5453 153 265 -77 -218 -161 208 75 -24 262 -117 -96 61 119 42 -155 31 -127 13 24 -139 175 -427 -163
5475 -163 -44 -34 182 70 -135 52 -241 -29 -59 208 115 -197 -138 69 35 23 -58 46 88 16 17 -121 -107 -3
5499 -3 -186 -82 -7 128 121 -181 71 166 -32 -67 86 -66 -220 -49 -186 250 58 -65 147 130 36 1 -155
5522 -155 259 -353 175 -63 92 68 245 80 -107 -168 -84 -25 -15 -80 -155 -100 39 88 4 -25 28 31 -223 -47 -81
5547h1r3R4K81k64p7Q2K03p3j87J8L06k62k1L52j75j55L3K31k09R1o4N3k25LJ23
5572a6K8L3L8N3k36n1J33j2K20k39P4k90L13J00m48L05Q0r3M5J89j83r5J15m7
5596A6qn0l3P7J60l90J95l2O2j91o3K29k80J11L17k54K64jj38R2r8P4J6Oj55J31
5622E7j32m3K52N6l10J76j17K74k26k3J36j32P4N9J32j40o5k38J0J09J56k71L39
5645A33j4j01L3j8k48K51L4N1l92J99J17j0P5O5l44K17N4k33Q2J44K5r3N9j95
5669a09q1J90n3J20M3k06m6l6J20J99q4N6k67L25k63P5P9r0L2J57k26qLK51L7
5694B18m09J13J38r4k27K73K0j27K3m2K53j80L1k35L6J98L6ml58K82l2l6r2O4
5718a51J25J93j30l0j06L8K7J26K4l41L8K34O6j68r8Q6J21J3KQ0j99k1J70j4J02
$$ plain form
5547 -81 -174 -80 201 -63 -140 -58 145 72 -115 -97 209 -53 -74 278 103 -52 -19 212 3 94 30 83 -142 -139 -16
5572 -16 12 45 83 136 -100 -151 -18 -30 190 -49 25 -265 48 148 -300 5 85 -8 37 226 43 -52 63 16
5596 16 8 -42 -75 2 162 -228 -33 -65 -3 -194 -257 -28 -308 -197 120 -134 130 129 -9 83 -15 59 75 81 -74 57
5622 57 -75 -118 134 190 -120 56 -61 213 -13 -36 100 -32 42 101 233 93 28 -210 -200 -91 65 -206 133
5645 133 119 18 51 33 -215 36 70 121 -271 -72 45 35 110 175 -169 48 102 -131 -49 95 120 27 86 -109
5669 -109 -190 0 -53 67 110 -96 -142 -178 -58 141 57 113 -154 171 -92 -17 62 -28 4 161 -65 -73 -70 181 218
5694 218 -191 -78 60 -34 -261 12 32 -95 -72 -114 139 -41 -10 -245 -209 -11 25 21 -337 -55 -87 -123 -215 -151
5718 -151 -26 167 37 7 -99 -61 -34 92 116 -225 -187 47 113 -55 -153 -67 54 67 69 149 -50 -71 99 85 187
5743A87j73n8L27j33j3k07J85j85M0J86j90J35k56J70l64M44k52j12K62j98M3
5764a62J28n0j02K58l41K40L10k29k42N6L39J29k81K5j85n6K39P8k02R1l0m16
5786d03L93J69l18j5L99j97l5L4k4j56J64j03R0j35K1R8j30K84j79j15L65k93
5808h6j41K12K31j39j7M4k04j04P7K04N3k36K12J58m81M5L11k16J38K10j84j11
5830b4Q9l41L8J39K53k97O00k35j52J13j30J6M6k01J07J48l80K0K82j07J80p5
5852H9o4j08R5j8K1O4j94K19k3n8j75M7q5J49K39ok01k4J87j53K60n8j02k6M4
5877A19k87K21q9J24j25L8R7%j36J20j44J81k8k11J95J8j27L9k10o1L51j14M3
5900A4l0j02K62l21n6L49k12J62k65J42K29n0k93L24j10K13j19m81O72r4j94Q2
$$ plain form
5743 187 14 -44 283 150 137 -70 115 -70 -30 156 -34 101 -155 15 -349 95 -157 -269 -7 -205 -162
5764 -162 -34 -84 -186 72 -269 -29 281 52 -190 -134 205 334 53 78 -107 -163 76 154 -48 43 13 -403
5786 -403 -10 159 -159 -174 225 28 -7 27 3 -153 11 -92 -2 -137 -116 -18 -148 136 -43 -158 207 -86
5808 -86 -227 -15 216 77 60 104 -100 -204 -127 77 130 -106 106 264 -217 -172 139 -77 61 271 87 -24
5830 -24 65 -276 -238 -99 154 -143 457 222 70 183 53 69 115 -86 21 169 -211 -191 91 -16 164 89
5852 89 25 -83 12 -6 15 79 -115 104 81 23 -152 -105 -190 -41 198 192 -9 -33 154 1 261 203 101 75 119
5877 119 -168 53 -36 88 -37 1 98 98 -38 82 -62 119 91 -120 75 93 -34 5 -205 -266 85 -29 14
5900 14 -16 -118 144 -177 -233 116 -96 66 -199 -57 172 122 -171 153 43 256 137 -344 328 234 40 122
5922A22m9J12k35j76O9M10l34J92k56p1K27J45k81J3J03j53k1o8K15K09j23k59
5944b09L76m23N12l63J74j74K73o8j33k7p0q1K32J00M3m12L91k13J73j36j40J00
5966g5k15K90l1l3P1j19K92k11K43j90J57k68pJ46L3q4%J20k5k2k56O4K05k23
5990a38J85o4L13k32p7k17K1L52k3l00J20O0O0k9l19K56R5k9J03r7m7P0J26mk81
6015i6J18P7P9k08l32L39jj63J41j64K70o5k19J88j07J69q4J16j58K70k41K51
6037A80j12j33qk1K3L0p0k0K12j38K81k60J49k69L11k72N8N9K1k88L15o2n0M0
6061b4j16J56r5K64j83j33L7j5P6M8k7J36j69J64P3j18l5j90J58K93o17N76r3
6084A66l52k0K53m6J20M4j17j82J79jJ10j51j26J98P9M4K5k57o5J69j84o9J78
$$ plain form
5922 122 73 185 -50 -226 -157 253 -81 111 -145 -216 11 156 -125 -112 -9 -162 -183 -251 -36 173 50 -209
5944 -209 167 -256 256 -107 67 -107 166 98 -35 -62 -132 -213 19 119 162 -250 141 -72 101 -35 -175 -75
5966 -75 -290 0 -31 -64 7 -112 180 -31 212 22 179 -89 -96 50 83 -1 -1 119 94 72 -184 -120 85 -138
5990 -138 47 -17 296 64 -13 -230 -209 143 120 -180 -60 0 60 31 -288 -32 63 34 137 40 -7 63 189 185 -96
6015 -96 22 99 178 -30 -362 -23 -24 -187 -46 -210 60 -5 -224 -36 -143 26 -58 58 -100 170 -71 180
6037 180 68 -65 -73 -94 -71 -41 -111 -131 81 -57 224 -36 113 -156 155 -117 -59 0 21 -267 48 -14 -64 -24
6061 -24 -140 16 -79 185 2 -131 -94 -109 -33 15 -12 124 -45 119 192 74 39 -151 7 300 -317 259 166
6084 166 -186 -206 47 1 121 165 48 -134 45 44 154 3 -123 75 154 198 223 -34 -99 70 -114 -183 -5
6107eJ31J66k63j58M27l67j03R5R2L1j35Q5kk39j94N53k59K69r0k48L77l32L38
6130A69l86l5L47k20L68j79r1J75q3J43j54l1P7rj44k9K37o5j01n8Q0j55K49r9
6154Fn5J93rO3k81N8p7M6J37l24J66J7M15k27q7N4j88Q6m0j68K51k32K15K7K25
6179B71k19l7p8j23J37J33n5o2K54k48P8KJ9O0l48Q5L44k34q4J02Q0j5l7J1r8
6204f2K11k14l0J88j20l2l9J22j72J62m3J48j83J9l8J40l3j25K34l37J99k31n
6227b41K54J55o2kj11J06n4J29k35P7J30j51J15j04L3k4j4J28k20p5K61j02J01
6250I4j42k67J77Oj68L69j03qJ08j92J58j60M6J23l39M04q9k69J40j21J68J31
6272F6n3jm1Kj05K15M8m7n4n9J76j52q8mJ65r8k3Oj3K91M2j94j7k09Q8K14l33
$$ plain form
6107 -5 126 292 29 -129 298 -69 -172 -77 15 46 -89 -4 -6 -245 -439 114 -145 124 34 -214 163 -169 169
6130 169 -217 -252 95 -125 243 64 -27 148 65 208 54 23 100 91 -53 -82 155 90 -11 -69 11 -144 105 6
6154 6 -49 144 135 198 -83 -25 -102 -56 81 -243 -77 -60 355 128 41 95 -93 -7 -47 -215 36 -196 19 46 271
6179 271 52 15 -63 -186 -49 84 29 -33 221 -27 51 53 72 132 -216 -131 213 -21 -105 -3 77 62 25 36 -62
6204 -62 149 -65 -95 93 -27 -59 -98 24 -148 14 -29 119 -64 -45 -83 57 24 -101 133 -204 -5 -236 -241
6227 -241 13 168 106 104 -7 99 45 174 -61 16 146 -5 110 6 39 15 1 129 -91 -166 95 -7 94
6250 94 -48 -315 -138 -132 -300 69 -34 -42 66 -126 32 -128 -82 41 -298 106 17 -252 -112 -233 -65 66
6272 66 13 12 -29 -27 -132 83 131 84 30 -29 147 -5 -93 -97 68 -30 -53 -47 -60 231 273 79 62 -147 -59 155 -178
6299a78J80J70k78J99j13q2M1J63K0k09J40L3j97k88N06k21n9K38M1l99J26j95
6321c62M95j73K30k69Q4L9N1j5j08j22L18j18j06k20L52m2q0J72j08J9q8K60k9
6344A80k31Q1j82N0K24L9j44K00k99K01j88J74p4Q6l67K10j0p8K84j30P6m18K89
6367b7KJ62j87J67j2q8j5J75j23j1pR2k75R3N2Oj19J00J81k55L6J48k04K29r0
6392C0Rl6j0N1k04K83m38L85n3J5j23K78k74K50j20J0r3%rj73M47k34K4J9m5j0
6418b1jo7o8J71m5r6K39j45n5Q9M6J5j75l5M13j78j73J16P8j9m8N8m08L75o1j11
6444a06L30k10k65N6P7J62j36L39k84J56J1q5O8J17l34j88K75J70j45j88K19k39
6466b00K72o2J25n9J08o6l48O07l88l3j16O5p3L35o2j68j3Pj05J23K01n08N06
$$ plain form
6299 -178 2 172 -106 93 -20 -102 -61 102 122 -87 53 86 -111 -399 107 -114 -173 65 106 -293 -167 -362
6321 -362 133 -40 190 -79 5 44 95 80 -28 -150 168 50 -56 -276 76 34 -46 126 18 37 -51 209 180
6344 180 -51 30 -152 -102 122 161 17 217 -82 119 -69 105 31 117 -250 -40 -50 -128 156 26 102 -316 -27
6367 -27 -25 137 -50 117 105 17 2 177 54 43 36 128 -147 -54 -2 4 -115 -15 166 -89 -53 95 -109 120 30
6392 30 39 3 -7 44 -160 123 -315 70 17 32 -91 187 -87 163 43 53 -40 -40 -49 -222 225 -9 15 34 -11 -21
6418 -21 -22 -89 -157 14 -31 -127 112 -33 -88 1 47 62 -113 -148 265 87 -86 30 108 89 41 99 -309 66 5 -106
6444 -106 224 14 -251 -195 -118 44 -92 247 -37 119 130 45 113 230 -104 -292 -17 153 8 -180 39 -200
6466 -200 72 10 135 76 184 118 -230 377 -11 -44 -160 -95 -168 167 105 -63 -76 -69 -174 -51 150 -358 148
6489A48n2l62N71k73l8J11k22R3k7Qn5J50Mk41J66q9K49j11nk3l2J39k92M42k60
6514ak87O27k06j54n7P8J43k00K5lj26K51j61p4p4K92k1j75J71qM6j60m1R2K82
6539B59n99J18K71k79K83q8N5r8j13K15j77K6K34l19J09Q6J36jl6J52j91j40K69
6562A72l02K93k44K3j15K50J45k73J05j32J57q3OJ20l45n3Q5K62k42P8K10j00
6584A7Q6j94J58O3p3m9J29k76J60j89J03N7l4R3l3K28j26j45M0o4J75j48j24L02
6608A56j11J13j9o3j72Q7j0Q5J45n06K33k28N20l63L56l23k3N0K49k5J14m51K40
6631E4j89K76k43K61j48m4K05j23Q8O0r8k76K26j18J01K29j37N1l19p0R7K6K06
6654A15r1l0j04%Q1j66L09j34Q3KK0j63RR9P2k29j7k6L43j05j65N0j24J22L1j
$$ plain form
6489 148 96 -266 305 32 -6 105 -117 -24 -51 -43 -98 52 56 -185 -19 -108 141 30 25 2 -30 109 -183 259 -1
6514 -1 -288 339 133 -21 -78 0 143 -57 -32 -35 -161 90 -71 -145 -219 73 52 -123 48 40 86 -74 -115 -23 259
6539 259 -340 -222 49 -230 53 -35 20 -78 -191 24 -153 -127 107 -212 -103 -17 119 118 82 234 43 -97 172
6562 172 -130 163 -81 -58 -173 77 222 -51 54 -78 79 -4 2 122 -223 -276 -191 71 -171 -93 117 17
6584 17 103 -91 67 130 57 8 137 -139 21 -168 -65 -8 -42 51 18 246 120 -25 15 -49 126 -22 -146 156
6608 156 45 158 139 76 -96 -9 -19 66 211 -295 -62 -290 230 -133 223 -100 -123 -73 176 151 265 -186 54
6631 54 -135 141 -102 159 11 -33 172 49 137 197 99 -177 49 -69 32 261 124 175 -144 -214 -117 -91 115
6654 115 24 -6 -110 -110 -29 -195 114 -20 63 65 85 -78 -69 30 102 -127 -144 -170 173 68 -97 -47 -171 -49 -18 -19
6680a9K57k3l95K46J99j88j31K1J61Q0j93K64j48J33j93rJ5J63m45L7J2R3p4m3
6704a80K32K51n32K62m8n2kL14l01J37k55K66l19L85k28J52O2K6l74K90o9j95
6726a78O9K07K08m42K38Q3q8k5K17j77k64m5J15j1J22j78m8n2q3K68J48O3k60
6749a13J84k98M81j60k16J88J5M3k18r4Q0J25j9K13k17J02l33O3J62j99L00k2
6771F7j08K26m2K18m65J82j75J13k00J37m7l9p0l5L56j74K94l4k30J00r2j49J86
6794A9j54K40j39JJ07K6n1J03k13L37l01K07l11m7K22j0j62j89O9L00r0m7j8o4
6818a65K52k0k41N8M1O0m1M0M7J03J29m36J94J24r6j41K16j11M1k06R0N15o56
6841b03r8K40N8L03k18O4j12n3j07K03j94P9N8K81j4m31M57k89Q3k64p8K13n2
$$ plain form
6680 -19 238 215 -180 66 265 77 -54 -33 128 208 15 279 131 264 71 62 77 240 -205 -168 -156 -63 -137 -180
6704 -180 52 303 -229 33 -15 -67 -69 245 -56 81 -174 92 -227 158 -70 82 144 170 -204 86 17 -178
6726 -178 -109 98 306 -136 102 185 97 72 289 112 -152 -197 -82 -93 29 -149 -197 -249 -332 -64 84 147 -113
6749 -113 71 -227 254 94 -122 66 81 124 -94 -188 -108 17 -2 211 -6 96 -237 -174 -12 -211 89 67
6771 67 -41 185 143 361 -104 78 -97 16 -184 -47 -94 -133 -203 -238 118 -56 238 204 -26 74 -18 -167 19
6794 19 -135 105 -34 -33 74 100 49 152 -61 276 -25 182 -129 -176 46 36 -126 -315 -246 54 -36 -83 -101 -165
6818 -165 87 67 -174 -116 -75 -15 -56 -16 31 134 263 -173 21 145 49 -92 124 13 54 -152 -62 453 -203
6841 -203 -301 -61 -3 300 82 146 34 -19 -126 77 -117 -38 20 301 287 -144 313 24 107 -157 -235 -22 -74
6864g4K7J65k92K11K67k30l62J94R7j26k1j45L63r4k56L36r5o2K70j64n9P9j48
6887a19N8K04l38K17L2j34J44j27p9K08o3L0j69L5j49J33K28l27J03R9J18j58
6909e4J53j63J96k05K06j01m56N13m8K9J00k44K52j51l33L13K5m7K61p5q7j20
6931c6L3j26Q0J4P2j39L60l60J46J61j27j96J10j7J28k10O6L0k21M17k17k8n9
6954a19K35K6j52K67m12J24j26J24j56J97k31LK05j01J62J23J05k21l7k55K97
6975E8m6J61l7J5l02P3J28r4O2k65K65J00k31J87o2M6p3j9o4j08K18k39K60J8
6999E1j36q1K64O2k73R2l7J64j63M21m18l1k4J12kk2J19l5l01M48j46k1j01N7
7023al4K7J23j31k20l2N45l94P7R7j10Pq8J56M9j97L8K14l4j24J16k89K57j69
$$ plain form
6864 -74 -47 118 -174 37 304 74 -288 -94 3 -123 -144 -289 74 -20 -276 60 -35 -97 173 9 -50 29 -119
6887 -119 -61 143 -195 22 54 -80 64 -63 -142 66 3 33 -136 -101 -250 -117 111 -216 -113 -14 104 -54
6909 -54 99 -64 132 -73 133 32 -424 89 41 70 170 -74 178 27 -306 7 32 -15 246 171 84 -36
6931 -36 -3 -129 -49 -35 37 -102 258 -102 44 205 78 -118 -8 -25 103 -107 -41 -11 -232 185 -32 -60 -119
6954 -119 116 142 -10 257 -155 -31 -157 -33 -189 8 -223 -220 -15 -116 46 169 274 53 16 -239 58
6975 58 12 173 136 151 -151 -78 50 -44 18 -247 18 118 -113 74 12 58 -15 -34 -98 -206 12 -227 33 51
6999 51 -85 -166 98 160 -113 -21 -58 106 -57 364 -54 -85 -109 3 1 -21 98 63 -238 210 64 43 -58 -1
7023 -1 -35 -8 115 -16 -236 -268 277 -117 -40 57 -53 -46 -134 22 71 -126 -88 126 92 -32 84 -205 52 -117
7047a17K16J03j06j41K03k29J52j35j80K83k69K88k3N5j97J8M8J00q7j53J60J37
7069A26j10k38R9M8k9L57j56j88R2q7K95j64O4N1j64j90R1J88j27q4K43J9k20
7092h4R4o4J89l0m18L44k69J82J87q5J38k41K27O0j72p6J05mk45M8L0N6J57k34
7116a05K95l00K13r1j35K41M2p9k49J72j00R6L18l96L5l4q1J11j16K54J95l40
7138e4j78p6J36K04j55J14J21j33j82K39K51j85q3J04j49J77j35L19m26K93m22
7159b20K04K6j91N40m45J10p1K53m9m30K75j71L75k04qp8J90l57O14k11j11r8
7181e7j7K10j58j16J52J1K5K07l03J46ok96K07l1J62j97J32m6J74l62J64J63q6
7204G8j51l46L86P3P8K7m9J3k06K25q4p0K08k52L6j76J52j5K75l62M31l89K18
$$ plain form
7047 -117 99 202 96 -45 158 -71 81 -54 -234 49 -220 68 45 100 -97 -79 -31 69 -18 -171 -11 126
7069 126 16 -222 -123 -75 -104 253 97 -91 1 -86 209 45 109 160 -4 -194 -103 85 -42 -126 117 136 -84
7092 -84 10 -54 135 105 -313 31 -238 -56 131 46 184 -57 170 230 58 -18 87 83 -162 -114 -84 -28 129 -105
7116 -105 190 -110 103 12 -123 118 160 81 -168 4 -96 0 318 -78 -43 -77 -158 -47 -163 91 286 -54
7138 -54 -232 -308 -172 32 -123 -9 112 -21 -203 36 287 102 19 123 -26 151 16 335 -91 202 -220
7159 -220 -16 10 -181 359 -86 24 -47 206 157 -273 2 -169 206 2 -6 -84 106 -251 363 152 41 -57
7181 -57 -74 136 -22 -138 14 25 50 257 -46 100 94 -202 5 -26 136 -61 71 25 199 -163 1 164 78
7204 78 -73 -419 -33 40 118 145 96 109 -97 128 44 -26 182 -70 -34 -210 -58 -73 202 -160 271 -118 100
7227A00j61J36K3n8J27l57K36j62N5j0Q5m9K24j61j02K96M7k00j86Q1j66J02J48
7250D8k2j13K16k14O6K00k89M49k68R5l08J85n5K42p2j0k47K6K5k00K96k31J75
7273fm6Jn8PJ44j10J22L0k19J84J2j63J77j09K8j91O6P8M1l5J65j14L6j91J71
7298B0k00L37j01J15k47K73m5j92P8j31j22J42j07J88O4m8k22M4LJ56l8J12j65
7321h6J0O1p6L1Q5n0j19K11O4j90j20J74O9r1J11j13J63m0J32l45K54o9J6K8j14
7346dm5k50K73l9J50k43K49k30J22r7n5K7Q8j31K45j65M0jL25m29K94j66k12J23
7370a31M08j58m5j1m1m6O0j24k9M0J61%R2k63J97l26o2Q0K29R4m20M05p0n9j52
7395a71O9L8j65J58P8j79J63O6p8j37NK09k0K13l27J47k4k12J98l7P9q4o2J00
$$ plain form
7227 100 -61 75 98 40 167 -190 46 -116 -61 -71 14 -35 189 28 -74 222 269 69 -117 -36 -202 -100 48
7250 48 26 -87 129 -85 -19 181 -108 341 73 168 -140 45 -10 232 160 150 -97 -71 -46 -246 50 -181 -6
7273 -6 -52 -51 -109 -102 42 -68 54 84 -135 49 61 -102 75 -34 -6 -197 -131 -53 -12 -47 118 4 40 -151 20
7298 20 -180 157 56 171 -76 197 152 -40 38 -93 -215 -73 -180 8 72 24 -198 -154 -151 5 -33 79 -86
7321 -86 -76 -15 -91 -60 25 -25 -144 67 131 -59 -179 -5 64 -27 84 -29 134 94 226 -119 135 66 82 110 -4
7346 -4 -49 -299 -26 -65 85 -158 91 -139 -17 -114 -169 -142 -54 -185 60 -105 -65 -66 259 -170 124 -42 -254 -131
7370 -131 277 119 74 63 22 -24 36 -88 -117 -77 84 84 176 -87 110 -216 -278 -198 31 125 -295 110 40 -19 -171
7395 -171 -102 -64 -229 -71 7 -172 -9 57 -21 -158 -153 56 36 249 -78 69 45 -167 31 -6 73 -11 -73 27
7419B7J05M4K4j40L1L7j91J64P8j33j38J76K45l80L5j18j82K92j11K41k19On3
7442a60p2J40L10l06K54l10J21j04j50L53k98K87j88R1j08J02jO6o2j25J89L08
7464C37l82P7r7r8J32K2K64j28k96K11j19j60K45K54m79K44J05j37l8J50m5R7
7486A59k80J10J91k36l4%n7J10K13O4k03O6j47N4K00m35J41o2Q3J30P7j50rq7
7510a02P7K9k71L71j69R7K85k02j25J1P9r6k71J81J64Rk23Q0P4M7n1JM4j02K36
7535A73j64J2j59J19o5M0j0n8J44J52j70j46J53J57k05j69L18j39j94Q6L62j40
7557I7k07J98K29l61K78m94J04J45P2J99k00k37j58L86j02p0J76o9k77N17l26
7578a00L21k54M2j16R9O8l76K37J13p1j66J39J92K3l77K80p0Q0j22J33mj1K93
$$ plain form
7419 27 132 176 200 60 91 128 -63 101 179 46 -92 84 329 -51 -16 -134 -316 -24 -135 106 -113 -107 -160
7442 -160 -232 -92 218 -88 166 -144 -23 -127 -277 76 -222 65 -123 -32 -140 -38 -39 27 -35 -160 29 337
7464 337 -45 32 -65 -163 -31 -9 255 127 -169 42 -77 -237 8 262 -217 27 132 -5 -43 107 62 159
7486 159 -121 -11 180 -56 -90 -90 -147 -37 176 240 37 103 -44 10 210 -225 -84 -146 -63 67 144 -6 -15 -102
7510 -102 -25 4 -267 104 -65 32 317 115 -10 1 80 -16 -287 -106 58 67 -156 -76 -2 45 -6 -5 39 -63 173
7535 173 9 21 -138 -19 -84 -44 -54 -112 32 184 14 -132 21 178 -27 -196 122 -17 -211 -125 237 97
7557 97 -110 88 317 -44 234 -260 -156 -11 61 260 60 -177 -335 51 -51 -121 55 -14 -291 226 -100
7578 -100 221 -33 9 -107 -8 60 -316 -79 34 -37 -203 -64 128 151 -226 54 -16 64 -58 75 71 60 353
7601C53l91m7O2k58K39L2k33J05NQ2J24r3k86N62k97k08K56r1P6J7K08k88j7J63
7625G5j6j20q1O8J01k5j01J53Q7m9k20J95j11K17k77%j11J71%p7J10r1M6J8J72
7650A34k92L06N0m5k24J15J9j17K07k18J45L6k01l0o6L27m03M14j65K0Q9M6k79
7673a32j3J88K7k43L62k45K59l97J63M3m2K75j18R7m90K24K25r9J97l32L2K1J3
7696A5M2j56N8j39L4J66j22J75n3L7M8P3L6j18m69J57J98N8m7p1r0K18k41R6J37
7721D2J71k80R0J18q5K8j18j7K81K3m57K50j3O8k30O1Q7j06J29N7n2n5j47J96
7745D1n0m4L5J31r0J36l43K15o1j11L47k22k13J61M6L3rM1j61K6j42J95O5p7r0
7770a41lQ5O1J98k09j98J93j39J50r8J78n3L4j49J59kj02k80k4M31j87j14J04
$$ plain form
7601 353 -38 -85 -23 -281 -42 -10 -243 -138 -133 -51 73 -20 -306 256 -41 -249 7 -84 -8 9 217 -71 -88 75
7625 75 59 -61 -142 -74 27 2 -99 54 141 92 -128 67 -44 173 -104 -104 -215 -44 -44 -121 -11 -102 -56 -38 134
7650 134 -158 148 198 153 -71 44 63 -54 153 -65 80 116 -85 -115 -181 146 -257 157 -8 12 101 147 -132
7673 -132 -145 43 70 -173 189 -56 203 -194 -31 12 -30 245 127 224 -266 -42 183 84 281 -51 -19 2 15
7696 15 57 -99 -41 -180 -146 20 -102 73 20 57 105 178 214 96 -373 -216 -18 40 -7 -78 -168 50 -191 -95 42
7721 42 213 -67 23 141 56 84 -34 -51 230 253 -204 46 33 101 -129 -68 19 -87 42 99 47 -8 -155 41
7745 41 -9 -53 -18 113 23 159 -184 31 -30 -141 206 -16 -229 -68 -22 11 2 43 -118 -92 -234 -39 26 -51 -141
7770 -141 -144 -59 2 200 -9 -207 -14 -153 -3 -101 77 24 58 -91 68 66 -36 -316 -340 91 -96 -210 -106
7793a06K17p0j97K70n4m5k43K15k39J83j27L79k81P4l4L43m04J34N1m8K1k50J86
7816b5k2M5p2J08O5j93M4O0j07p4k4K71j37p3K34n6J06m0j66L3K57J23m84p0K22
7841B5J63k14j17n3L65m82M7K95q7L27l53P9r2J68J17l01N8J69m7j38J43j14k5
7864f7K04j66J10kk33J71l00K45j72L19j24J07o7o2j90J48O8N7n2Qj55n2J66l5
7888g4q8J94k18K1K09Mo5Q3j46R0JL0J9m3L2L3j7L1k12K93k62J03m5L7K86n37
7914b41L13o2J8p7J26Oo4J39j29O3m9p8l1MJ81j31K85k52J56j38q2j5J40OJ87
7939B75k36r4J07j90J77M4l07K08P9LJ21r6j72J92m8J17j90n0K1p5O5k4m7r5k7
7964b42M61j98K1J34j80R2P5l21L79l21J57j81J25M9L1m8j36j60K87k31J77l1
$$ plain form
7793 -106 111 41 -156 114 60 15 -228 -13 -252 -69 -196 183 -98 -24 -58 285 -119 15 66 18 39 -211 -25
7816 -25 -47 -2 -74 34 99 -94 -50 10 -97 -171 -195 76 -61 -134 100 44 150 110 -56 -23 234 357 -127 -197 25
7841 25 188 -26 -143 -196 169 -313 -266 29 -58 269 -84 -5 -97 71 188 -113 -55 114 67 -71 72 -42 -67
7864 -67 137 -29 81 79 -154 17 -283 -38 -210 109 -15 92 25 -37 -227 -79 -11 46 -6 2 -153 -205 -39 -74
7888 -74 -162 32 -186 -165 44 48 -17 66 -80 10 11 41 60 17 49 82 65 96 -116 177 -85 18 -27 10 296 -241
7914 -241 72 10 28 -49 77 83 19 158 29 92 43 -35 -66 -62 119 -12 273 21 177 39 -43 -58 82 88 275
7939 275 39 -55 52 -138 39 83 -224 -16 63 66 187 91 -81 111 63 180 -10 -60 -39 -114 -49 -73 -120 -215 -242
7964 -242 219 21 42 176 -4 88 163 -158 221 -100 57 -124 1 50 81 33 -103 -263 24 -207 -30 -61
7986f1k3Q5P7m59M83j07K47n28J95K60k17M6l5K2j85J73j86J26Q1q2M4p5K23q6
8010A8J65O2l0j61p8j93M9K89M1n6k05RK93l62mJ84j43J39j79L72Jj7j41j18L28
8035B63k91K19m54L51j7k69K1K42k97K43r8M1J86O5n4k04J8j14O5j00K89j18J51
8058A38k68n5L02k25M4K33j39J8Lj29O7O5k55K96m66K71J43k03K12r1r2J84M4
8081I7j43k1L1K7k10L25k59Pm5L48k19K30k6N3r5J73l46Rpk47M12k22q8L55j78
8106c9j63J06J99J93l80K69K0q5M6l13K46M0j68J82k35J38M0r7r5K59j25j22r
8129i3N8K3J62l7M9mm95L64K8o7J11Kk49L14k19j99K45j92l0K42j73j58J07L29
8153A18k60J03Nj8K65k89l7J69M2K30j89k05K46k68L50k10K7k60K61J46k61j11
$$ plain form
7986 -61 -84 1 78 -381 102 -5 242 -286 -91 169 -48 -2 -37 -15 -200 -27 -213 -87 -6 -88 -44 -119 104 18
8010 18 183 245 215 54 -24 -217 -168 121 162 106 -99 -90 203 -159 -163 21 -122 17 -162 210 211 194 53 -65 263
8035 263 -28 191 -263 88 71 -198 -177 65 -232 11 -87 -46 140 205 151 -53 -35 -149 -84 -184 105 -13 138
8058 138 -130 -185 117 -108 -64 169 30 48 51 -78 -11 54 -201 95 -371 -100 43 -160 52 -39 -131 53 97
8081 97 -46 -67 -36 -9 -219 106 -153 -146 -191 157 -62 168 142 195 100 273 -73 -64 -71 -318 94 -128 -216 139 -39
8106 -39 -202 -96 103 296 -84 185 205 120 166 -147 99 139 -29 153 -82 56 96 -1 -96 163 38 -84 -93
8129 -93 -35 -12 150 113 162 158 -337 27 55 -12 99 101 -148 166 -53 -252 -7 -199 -229 13 -160 -318 -211 118
8153 118 -142 -39 -34 -52 213 -76 -113 56 98 328 139 -66 180 -88 262 52 79 -181 80 226 -35 -146
8175a46N6R5l12N11k61k18J48J09rq5j5J51j32J49j94J53
$$ plain form
8175 -146 -90 5 -307 204 -57 -275 -127 -18 -27 -112 -127 24 -108 41 -153 0
8191@
$$ Imaginary data points
##PAGE= N=2
##DATA TABLE= (X++(I..I)), XYDATA
0@%%%%%%%%%%Qj6J6j6K4l2M0m8N6p2Q8j04J20j38J62j92K24k58K98l44L94m51
32b41N15n83O58p41Q32r36J048j168J303j451J610j786J977k183K412k660K931
49A537l230L559l922M321m765N262n820O453p175Q009q988J0151j1561J3317j5572
64h424J8586k2846K9369m0714O5963k24180J21658M30221l11890k76198J48621
75f9834K30919j35173j23295N3427P8561o338L5497n0926j26490K1770K05650
86A13768J6906j90628m6499J57301J5312j23888N306J14640j0007p5543p187O005
98b4514j6485O6605O6093q7279r8682Q1610Q0348r0136n8475J14752O2353j01851
110e661o7927M8890L3284O370L1138k0123p7465J5490Q9000k8365r1332N8243
$$ plain form
0 0 0 0 0 0 0 0 0 0 0 0 8 -8 8 -8 16 -16 24 -24 32 -40 48 -56 64 -74 88 -104 120 -138 160 -184 210 -241
32 -241 274 -309 349 -392 440 -496 552 -616 687 -764 846 -940 1037 -1146 1266 -1394 1537
49 1537 -1693 1866 -2056 2265 -2500 2762 -3058 3395 -3780 4229 -4759 5392 -6169 7148 -8424
64 -8424 10162 -12684 16685 -24029 41934 -182246 -60588 369633 57743 -218455 -69834
75 -69834 161085 25912 -97383 -43956 34605 28267 63764 12838 -113652 -91882 113768
86 113768 130674 -59954 -106453 50848 66160 -57728 -52422 62218 52211 -23332 -30519 -24514
98 -24514 -40999 25606 91699 4420 -94262 -12652 67696 -22440 -80915 33837 96190 -5661
110 -5661 -73588 -24698 8586 14956 46094 25971 -51494 -36004 52996 24631 -66701 -8458
122h458J04785q0714j16804Q2043J01815q5996o0707J14492K4219j59583k0755
133a05663J78795L0473j61429k1076J34894m000j21347J6238J07250n110o4848
144a5823J827Q193k3769K7957N0743l3101n1839L6489L4261n6387k3815P6956
156C1692K6639p7697k7485O0139N765m8211K2735N0278l5954m9993L0103K9933
168A7944k6858J53L9354j6566n0637J4206M1514j2625j6173K8484L007m3820k871
181b4888L9289l667k1763K7349J3969n2691j9136O1053J8378n9284k504O3899
193D0004j7276q0012K1198Q8078j3674p8576R425N9147j4990m4939J9404L7824
205B5613q423k2008p400o726J0541L5375J119m6230p429M5707J374m8871N984
$$ plain form
122 -8458 96327 15613 -101191 -19148 82667 -3329 -64036 50456 74675 -84908 -105663
133 -105663 73132 103605 -57824 -78900 55994 51994 -69353 -53115 54135 49025 -15823
144 -15823 -13996 -5803 -29572 -1615 49128 16027 -35812 677 34938 -21449 -45264 31692
156 31692 58331 -19366 -46851 13288 19053 -29158 -6423 43855 7901 -42092 -11989 17944
168 17944 -8914 -8761 30593 14027 -36610 -22404 19110 6485 -9688 18796 21803 -22017 -24888
181 -24888 14401 10734 -11029 16320 30289 -22402 -41538 19515 37893 -21391 -23895 40004
193 40004 22728 -57284 -36086 51992 38318 -40258 -30833 28314 13324 -31615 -12211 25613
205 25613 17190 -4818 -12218 -18944 -8403 26972 28091 -18139 -25568 20139 21513 -27358 -21374
218b1374N6971l034n5364n159L7102o5j6646J5340P242k7997n560K7562k222k3606
232a6810J5256K7414k3554l3651J7632L1767o409j5465M536j31q982P130R238
245G971j0461L50K1925p566l8597K920M6669N182m1812m396L2802m746l1103Q598
259a2264K9411n420k0569K391M660p769O489J6610p382j7454N801J0222r131l864
273h269J7010N586j7870n564J1550j528o178J3469R282k0333j4529J9046J0946
286A2618j8678l299K2955k02k7116m068K2865N963j3034j693N077m788l146N968
300e78J056j471P132J356j5253o589J8241J1606j4112q722J1042K743j3301n21
314g371J5940K277j1932j589M046n975j100J1746K877j2778l958Q639o96p342
$$ plain form
218 -21374 35597 32563 -22801 -27960 9142 9077 -7569 7771 15013 -12984 -18544 9018 6796 -16810
232 -16810 -1554 25860 2306 -31345 -13713 18054 11645 -3820 716 585 -8397 -1267 7971
245 7971 -2490 -2140 19785 12219 -26378 -23458 23211 28393 -13419 -17815 14987 10241 -20862 -12264
259 -12264 17147 11727 -8842 -6451 -1791 -9560 -3071 13539 6157 -11297 -5496 4726 -4405 -8269
273 -8269 8741 14327 -3543 -9107 2443 915 -5263 8206 17488 -2845 -17374 1672 12618
286 12618 -6060 -9359 13596 13394 -13722 -17790 5075 11038 -1996 -3689 1388 -3400 -6546 -578
300 -578 478 -993 6139 7495 -7758 -14347 3894 15500 1388 -7334 3708 6451 -6850 -7371
314 -7371 8569 10846 -1086 -2675 1371 -4604 -5704 6042 8919 -3859 -7817 822 126 -7216
328g216O031R485n319r250J306L789r7K929M448m583o699L441N178l708j216Q594
344G113J478j2198n669J0791N401o785j438N224k826p108J927O115L38j521K54
359A096l775m409M302N799j529l735K717J349m793k052O109M622k585l780o58
374a322o41M74N034K761n519l625M870R95o427r37Q522L406q105p370K360O614
390A090L715l161o130K56O699L19q221j927J0460P747j0017j1678N072J2732J477
405H433r685l082O400L322m765m089J356O046L128n497q293L12J0036M287p444
420D65o376K863N389j343n889K5P140L156o117n915K366O403K046k506k769r66
436b028J161K476O77j856j275K511L020l323n777J200Q486J968q244n583L605
$$ plain form
328 -7216 -1185 8300 2981 -6269 -4963 -1174 -1271 1658 6106 1523 -5176 -1735 3443 -265 -1481 7113
344 7113 8591 -3607 -9276 1515 6916 131 -1307 3917 1091 -6017 -4090 2025 2363 842 1096
359 1096 -2679 -7088 -2786 3013 1484 -2251 466 1815 -2978 -5030 1079 5701 3116 -664 -1322
374 -1322 -1963 -1489 3545 6306 787 -2838 2032 3027 -3400 -4337 4185 7591 -514 -7884 -5524 1090
390 1090 4805 1644 -4486 -4230 2469 2788 -5433 -7360 3100 10847 830 -10848 -5776 6956 8433
405 8433 -1252 -4334 2066 5388 623 -3466 -2110 3936 7064 1567 -6726 -6414 3622 7909 465
420 465 -5911 -3048 2341 998 -4891 -4866 2274 5430 -687 -6602 -4236 2167 4213 1707 -1062 -2028
436 -2028 -867 1609 2286 430 -845 1666 4686 1363 -4414 -3214 5272 7240 -1004 -6587 -2982
451b982N101J08j960l232j210N632L622p738q192Q563J4968o209j9874K09K2118
466H924O877j9800j0515J6979J3038j3012j5139P507J5426m50j1653o468M631
479c655Q544L086p751r076M946J2302j746j6062l222J7519R315j5645j5449J1032
493e862J8339m497j7643J058J5203K403j2982m153R366O738n048n170O8J992K385
508B197K588k498o192J525P480j998j0204J770J3272j947j4592Q26J4092j515
522D804j3550M202J4482o631j6494P040J8609o411j8260O375J8871n641j8701
535a1305L755J8132m26j5030j975Q889K005l212J82j675k519M599N261q081j0141
550a1541Q878J5349o959j9656J846K0745M557j9190q779J6507J2680j2339j5496
$$ plain form
451 -2982 2119 2227 267 -2965 -4175 1457 5079 -2659 -10851 -2288 12680 6471 -13403 -13194 8924
466 8924 15801 -3999 -14514 2465 15503 2491 -12648 -5141 10285 9835 -1818 -8286 -3655
479 -3655 4889 7975 224 -8852 -3906 8396 6650 -9412 -12634 4885 14200 -1445 -16894 -5862
493 -5862 12477 7980 -9663 -8605 6598 9001 -3981 -8134 1232 7970 2922 -2248 -2180 -188 2197
508 2197 4785 2287 -3905 -2380 5100 3102 -7102 -5332 7940 5993 -8599 -7773 6319 4804
522 4804 -8746 -4544 9938 3307 -13187 -6147 12462 6051 -12209 -5834 13037 7396 -11305
535 -11305 -7550 10582 10156 -4874 -6849 2040 4045 833 1015 -660 -3179 1420 6681 -1400 -11541
550 -11541 -2663 12686 5727 -13929 -12083 8662 13219 -5971 -14750 1757 14437 2098 -13398
563a3398P087J6640o68j3728m296Q632O610j768n694m329L100R063p2j3526n468
578a1815J5789J1359j6091j6477J3075J9318j0204j9555Q152J7754o978j5347
590a1020N908J2638n511q143P430M706r136k927J1268L011j1783l237J0848K800
604F852q996k596O953J986m234j041R48j542L60M448n73p637j352Q757L775q590
620b482n633P046Q036m065r440j3J0105N310q768q298N597R867j003q989k482
635e212O843N190l122p340k819P704Q196o419j3090K495J5754J570j6168n765
649a2183J4955Q459j3012j0249R766J0744n844q543K563N894k58j746n15j115
663a084Q66L913j058n413J97O249R95n667k222L306K797k051j918j48J031O45
$$ plain form
563 -13398 -6311 10329 9661 -4067 -8363 269 6879 5111 -583 -4912 -1812 7251 7179 -6347 -11815
578 -11815 3974 15333 -758 -17235 -4160 15158 4954 -14601 -6449 11305 4327 -11020
590 -11020 -5112 7526 2015 -6128 1302 6008 -3128 -6055 5213 8224 -3559 -6796 4052 6852
604 6852 -2144 -4740 2213 4199 -35 -1076 -128 -1670 -1310 3138 2565 -5072 -6424 2333 6108 -2482
620 -2482 -8115 -1069 6967 2902 -6538 -6551 3554 8864 96 -8202 -2605 7262 6259 -2730 -5212
635 -5212 1631 6821 3699 -3641 -6460 1244 9440 3021 -10069 -7574 8180 9750 -6418 -12183
649 -12183 2772 11231 -1781 -12030 -2264 8480 2636 -5907 -3344 2550 2292 546 31 -1084
663 -1084 -218 3695 2637 -2776 -2579 3670 4665 -1002 -3224 82 2879 828 -1090 -1238 -207 438
679D38o45k039J64K704J059k526j979K134K523j771j755J263K120j552j422J759
695D75R02n49n2j43j43P09O0j572J61J597l20k887L32L152l49l126k25K929l88
714E63l103M84K947k30k436N91J936m55j773J359J936p38k143P12J600k52o03
731C95m31L00J223m8k179l08K344J076l038k207K410J805j625j852J067K211p30
748D13k297Q3K088M26r37m68K40K81L64K51k55n4R05r3l66n2J79J26k07L79r89
769A7p21J117N28j013j097J050J061j458j130P07J309j054r40O60J055m36m38
786g83Q20Q95q40p29R45L00m74L64q7N08Q8n73k06K75J129p18j569O8J446q41
806A8j445j5J974J84k107l47J716Q08j696n87J078Q83o06o24N85M60N05j03r73
$$ plain form
679 438 -207 -2246 -2082 622 1681 -845 -2824 -690 1833 62 -1693 -430 1690 138 -1284 475
695 475 1377 828 776 633 490 1199 1259 -313 -152 1445 1125 -1762 -1430 1722 1373 -1753 -1978 951 563
714 563 -2540 -2056 891 661 -1775 -1184 752 297 -1476 -117 1819 1081 -1062 -350 1250 998 395
731 395 -36 264 1487 1439 -740 -1048 1296 2372 -666 -2873 -463 1342 -283 -2135 -1068 1143 413
748 413 -1884 -1801 287 713 -224 -692 -452 -171 193 444 189 135 1040 947 581 529 708 834 627 1006 17
769 17 -704 413 941 -72 -1169 -119 942 -516 -1646 -939 370 -684 -1624 -964 91 -345 -783
786 -783 37 932 92 -637 308 608 134 498 411 919 1007 434 228 503 1632 914 -655 -587 859 18
806 18 -1427 -1442 532 716 -1391 -1738 -22 786 -910 -1497 -419 464 -142 -766 -181 279 784 681 -292
825b92M10J532k32j469l99J735J01j757k95J258O79j057q07M8K39MM26o71j206
844a753J169Q30o14j173P47J873n28j891O07J654j58m45ql07L99O63J08j435j64
863d26K088n3k279m64K032Q9j658j42J279p21j151J046R10j555o21K077M77k241
881a313p03K594N98j587o91J346O35Q7Lj268JJ627J050k430k133K653K458k303
899F24k875J325K644r88j540L8j42O93Q56n99k417L37M050k98m278l81M995O75
917B719m161p66L617K86k451O24J355j587l0K789o58m019P98M237o08m168l90
934b413L816J86k911k34J777l42m03J214j656j614J951K840j915l194J467L388
950A957M2k408j315J181K820O95l441k839L752M654l540n605K133O098j149n713
$$ plain form
825 -292 118 1650 1418 -51 -450 1285 1386 -371 -666 592 1271 214 -593 -545 -306 -302 124 -547 -1753
844 -1753 -584 246 -368 -1541 -794 1079 551 -1340 -733 921 763 318 310 3 402 1065 1173 -262 -426
863 -426 1662 1609 -670 -1134 898 987 -671 -813 466 -255 -1406 -360 550 -1005 -1626 451 928 -1313
881 -1313 -2016 578 1176 -411 -1102 244 879 966 969 -299 -298 1329 2379 -51 -2184 469 2927 624
899 624 -2251 -926 1718 730 -810 -772 -914 -221 635 36 -2381 -2044 2006 1708 -2570 -2951 2044 2719
917 2719 -1442 -2208 1409 1695 -756 -132 1223 -364 -394 2395 1737 -2282 -1484 2753 2145 -2023 -2413
934 -2413 1403 1589 -1322 -1556 221 -121 -524 690 -966 -2580 -629 2211 296 -2898 -1431 1957
950 1957 1999 -409 -1724 -543 2277 2972 -469 -3308 444 5098 1558 -4047 -1914 4184 3035 -2678
966b678j1L904j73j438k68r67q21L357K525n354m632P232O158p222p073P073P580
983G192o061p073N358N445l895k981K588J053k416J238K375l064l011M142L527
998D417n376l852N014L755m272l516L369J970k207j033J486J75o89O71O45q46
1014b89k11J023K74J38k62j460k63L100R10m541r91N020J119m985j852N138J293
1031C161m500j145L198l38k638K656J864n211j028P040J133q972q99J0543O65
1046E529j0484o59R964O22q226J01O846p48m986K347K453l489j009M522n64n691
1062c472R65O393j737o459J646O045j813n057J316L685j185j952J123P57p84Q08
1078B79N10j694L49K455r34k495J634J813j641j412K464P76l263J65L147j204
$$ plain form
966 -2678 -2689 1215 1042 -396 -664 -1631 -2452 905 3430 -1924 -6556 676 6834 -388 -7461 -388 7192
983 7192 1131 -5942 -584 4861 966 -2015 573 1626 -790 448 2823 -241 -3252 890 4417
998 4417 -959 -4811 203 3958 -314 -3830 -461 1509 -698 -1731 -245 -70 -759 -88 557 -289
1014 -289 -500 523 797 935 673 -787 -1050 2050 2960 -1581 -2572 2448 3567 -1418 -3270 1868 3161
1031 3161 -1339 -2484 714 376 -2262 394 2258 -2953 -3981 3059 4192 -4780 -5679 4864 5529
1046 5529 -4955 -5614 4350 4972 -3254 -3153 3693 2945 -2041 306 2759 -730 -1739 2783 2219 -3472
1062 -3472 -2507 3886 2149 -4310 -2664 3381 1568 -3489 -2173 1512 327 -1625 -502 255 -529 279
1078 279 789 -905 -556 1899 965 -1530 104 1917 276 -1136 1328 2104 -1159 -994 2153 949
1094I49l133J673K725k806k498L808J244m526n06N533n70n995J917O352k895o171
1110d899L924N820m398m523M710L558m392k230M484N47m432J018L851k391l649
1125c002L480K538m576k210M871K179n304r16M344Q1m171J097K911j618j481K518
1141G41M22l134J013L645j834l331K648K919l015k294L430J461l539l34L056n96
1157A258k733J324K037k750j345L183N38l835L34M483j611l971K338L552k983
1172a81k772L437K239l965j024M052L13l977J416L577k506k610K773J984l474
1187g18j225L789L84m281N03L771j411l427K390K219l049j724L501P09l895Q10
1203a654L472q93l645K079L527k817k137L050J319l156k98L247p36k833J684K410
$$ plain form
1094 949 -2184 -511 2214 -592 -3090 718 1962 -2564 -3070 2463 1893 -4102 -2185 4167 1272 -4899
1110 -4899 -975 4845 447 -4076 634 4192 -200 -2430 2054 2601 -1831 -813 3038 647 -3002
1125 -3002 478 3016 -1560 -3770 1101 3280 -2024 -2940 1404 1485 -2686 -1589 1322 -296 -1777 741
1141 741 1163 -1971 -958 2687 853 -2478 170 3089 74 -2220 1210 2671 -868 -1202 1854 1258
1157 1258 -1475 -151 1886 -864 -2209 974 1512 -2323 -1989 2494 883 -3088 -750 2802 -181
1172 -181 -2953 484 2723 -1242 -2266 1786 2099 -1878 -462 3115 609 -2001 772 2756 -718
1187 -718 -1943 1846 2230 -2051 -1548 2223 812 -2615 -225 1994 -1055 -2779 722 1431 -2464 -1654
1203 -1654 1818 925 -2720 -641 2886 69 -2068 982 2301 -855 -1153 2094 1358 -1475 209 2619
1219B619k192k253K344J335l011p51L154m16k875J121K442j867k031K593J394
1234A606l270j51L274r4l191Q50L118j465k484K017J959k362q17K524K49l290
1250a527R15K668j497k605K273J879k432j573K343Q07k986K16K575p79k549J844
1266d28K198k262j664K617J387k786o89L131p9k705J050J862j169j305J796R03
1282A857k205o32K663o54k649P13K379j258k149J390J858k114p54K132J71k137
1298a389L98K008j024j800J684J654k089o69K191L46j873m2K092m96j366L42J048
1315A015j065p02J830k92j476J78J761r57j904J308J520j781q65J474J075k270
1331a151J14J553k3j675O19J767j201r55J401J240j902p52J863P37j872qJ246
$$ plain form
1219 2619 427 -1826 518 1853 -1158 -1909 1245 829 -2046 -925 1517 -350 -2381 212 1606
1234 1606 -1664 -1815 1459 1365 -1826 -976 2142 677 -1807 210 2169 -193 -1010 1514 1763 -1527
1250 -1527 -612 2056 559 -2046 227 2106 -326 -1899 444 1251 -1735 -1519 1056 277 -2272 -428
1266 -428 1770 -492 -2156 461 1848 -938 -1627 1504 1425 -1280 -230 1632 463 -842 954 1857
1282 1857 -348 -980 1683 1029 -1620 -907 1472 214 -1935 -545 1313 -801 -1555 577 748 -1389
1298 -1389 -991 1017 -7 -1807 -123 1531 -558 -1227 964 1310 -563 -605 1487 991 -375 -33 1015
1315 1015 -50 -752 1078 786 -690 -512 1249 292 -1612 -304 1216 -565 -1430 44 1119 -1151
1331 -1151 -1037 516 493 -1182 -563 1204 3 -952 449 1689 -213 -965 898 1635 -237 -245 1001
1348A001m20j313N29J101r43j140J227N33j260k85J159J83j271J82P32j11m47
1365e43K55O06o06L35L04k83k56N49N44m85n90P89K6p67M9R52l41r02O19R5l17
1386C3q04R60K7j356K54J514o19j267L86J575m02j057K99J001m41o27L78O36r7
1405C93k23J44L15n64J78L94Q8m41k94M29J50q40j12l4P80n66l76L99K29m06l83
1426g40L08K90j30k33L46M34l20k44N97L34m74k67O87M49p78n63P59M97p56p33
1446e37N85O88l32q50K22O29o36p38P70L42q72j58J123j44r12q6J539K84j788
1465h71k6J742Q0j781R7J684N66j763O5J184P4j565L92J064q40j003R23O24j106
1484d60p68J367N77j195j016J429L91r25m57J090P43r75m44P49O36q21k91P21
$$ plain form
1348 1001 581 -732 -203 898 -45 -1185 42 575 -685 -970 189 372 -899 -717 15 -96 -543
1365 -543 -288 318 -288 47 351 68 -188 361 905 420 -170 619 645 -122 -73 879 538 -364 255 350 33
1386 33 -771 189 216 -1140 -886 628 9 -1258 -872 703 301 -756 -457 544 103 -524 -146 490 393
1405 393 170 314 629 65 243 637 725 284 -10 419 569 -271 -383 -417 363 -203 -579 -180 49 -357 -740
1426 -740 -432 -142 -272 -505 -159 275 -45 -289 308 642 168 -99 588 1037 259 -304 455 952 196 -537
1446 -537 48 736 404 -446 -224 405 -231 -969 -199 143 -729 -887 236 92 -820 -906 633 917 -871
1465 -871 -897 845 925 -856 -759 925 1491 -272 -207 977 1051 -514 -122 942 102 -901 22 646 -460
1484 -460 -1228 139 716 -479 -1495 -66 325 -600 -1057 33 776 -199 -643 106 742 -79 -370 351
1502C51J48m68k43J097n8r92p8O83N35q90o44Q71M45r48r30J088N02j287k13J312
1522B81j31j235M80J516o73j273P09J481q46j638J143K111j109j666P28J681r43
1539F16j342P55J059j120p82J120L28j131k13J522k47j787N86J312l54j599O74
1556f03J034m31q49L62J004Pr08K35M81k1k40O8L59p5m22L61K43k31k67J0J49
1577B66j93m19o3M90j67o29J27Q97k96r10M18R05l09j043P92P30p41p45J171Q43
1597A124j334m67J285K51r06J02O90k4j088K3J023n33r83P23Q03n66j146J135
1615A12M97j141n10P11L78n66p9P64k40l19M23N82o28j19M73k9k33nJ32J41j44
1636B00K22m7k59l66O22k47n21N0M61k88l08K60N14q37k37R05k73q32J007N79
$$ plain form
1502 351 499 31 -212 885 827 -165 -243 440 975 85 -559 312 757 -191 -1121 -33 469 -818 -1031 281
1522 281 150 -1085 -605 911 238 -1035 -326 1155 309 -1329 -186 1925 816 -850 -122 1559 616
1539 616 -726 29 1088 -32 -814 306 634 -497 -710 812 565 -1222 -636 676 322 -1277 -603
1556 -603 431 0 -849 -487 517 524 -384 -149 332 311 71 139 498 423 1 362 605 374 107 117 266
1577 266 73 -346 -409 81 -86 -715 -588 309 13 -897 -479 426 117 -926 -134 596 -145 -890 281 1124
1597 1124 -210 -677 608 859 -47 55 745 721 -367 -344 679 146 -837 -114 689 123 -1023 112
1615 112 609 -532 -1042 -331 47 -519 -598 166 -74 -393 30 612 -16 -135 338 309 76 71 203 344 200
1636 200 422 375 116 -250 372 125 -396 -346 115 -173 -481 -221 293 -544 -781 124 -149 -981 26 605
1656F05r67l32R84P34j351LP19N77j158j85J166j66j127M29Q68p06o98Q52L94
1675F41r08n59J198J39j204N2R04l68n27J02M05k38j65N70K19m28q0O72K5n44
1695i4K21M18m84%O47k14n19K43M32n70o07P00K51r10j03P81K1r60M65O34n38
1716a86o79O74N84q90j50J006P3q78J76J073Qj064K00Q68m80p00N13P03o53o05
1736d07M88J89m23k23P38l14o33K04L92l72j98L34K27m10J09L66k49J08J11o1
1756b4j12J14K08J25l55J68O05l66j03Q1j29l32m1K12M37q05J29N14j78n89O5
1777c76N04k80m46M59K22n91q2P02L25r72K76O34l63n1J1P27m92k58K72J59l76
1798Dj03M34j10j24k39K21J51k60j50j0l98M91k16K0l4J14K28l69L7M71j50k14
$$ plain form
1656 605 -362 -694 290 1024 -327 -324 395 972 -186 -371 795 629 -498 -69 799 93 -605 247 641
1675 641 -267 -826 372 511 -693 -641 263 -105 -632 -530 -125 -363 -528 42 261 -167 -247 425 450 -94
1695 -94 127 545 61 61 708 494 -25 218 650 80 -527 173 424 -486 -589 192 213 -747 -282 352 -186
1716 -186 -865 -191 393 -497 -647 359 432 -446 -270 803 811 -253 -53 815 335 -365 148 851 198 -407
1736 -407 81 270 -153 -376 362 48 -585 -381 11 -361 -559 -225 2 -408 -299 67 -182 -74 37 -24
1756 -24 -136 -22 186 311 -44 124 729 363 260 341 212 -120 -161 51 488 -317 -188 326 148 -441 -376
1777 -376 128 -152 -598 -139 83 -508 -590 112 437 -535 -259 375 12 -39 -28 699 207 -51 221 380 4
1798 4 -99 335 225 101 -138 83 234 -26 -176 -186 -584 -93 -309 -289 -323 -209 19 -350 -313 158 8 -206
1820b06j8N14J19n60L31O84n23n37O90k0l71j98L09K47p14k71Q46k31n81K75N18
1841C03l06p17M39O82j078o9N64L50m84k47P86K02l14l35Q15r0l79J60L6L2q1
1862B69R9j53nQ8O5n43M75k9m01j87L37k6o24L1P37j29n72M30O28n61m76M70N93
1885E16n72j00M22K78l57j48M27K09r35M5Q35m65m07l0Q00m16m43k9N77j3p93
1906e99K52L76l67k4J0L51k53k81L66J65J3k36M22K30k9o5k13M31j50m26K23J89
1928C85J21p17n9O01r2o41J06N68j83p77M28L06m77l80P09M67o23l96P01N06j042
1949d89P4O76J47l38j85P20L82j324K73O02R0p34L3N63k34m68ON17k25o83L37
1970b60L47n7o20kO57k65k15N5N57Kn70M11N46l93k96J29N49m79k39J87K71po10
$$ plain form
1820 -206 -224 290 409 -151 180 864 341 -196 494 474 103 -95 214 461 -253 -524 322 91 -490 -215 303
1841 303 -3 -720 -281 401 -677 -746 -182 168 -316 -563 223 425 111 -224 591 501 122 282 318 350 269
1862 269 368 215 210 298 363 -180 295 266 -135 -322 15 -11 -635 -604 133 4 -568 -138 490 -71 -547 -77 516
1885 516 -56 -156 266 544 187 39 466 675 -260 -215 620 155 -252 -282 518 102 -341 -370 207 194 -599
1906 -599 -347 29 -338 -362 -352 -1 -254 -535 -169 -4 9 -227 195 425 396 331 118 549 399 -27 196 385
1928 385 506 -211 -270 331 239 -402 -296 272 89 -688 -260 46 -431 -811 -102 365 -258 -654 47 553 -489
1949 -489 -415 261 408 70 -115 605 987 -337 -64 538 628 -106 -73 490 256 -212 -206 311 86 -597 -260
1970 -260 87 30 -590 -592 65 -200 -415 -360 197 199 -371 40 586 193 -103 26 575 96 -143 44 315 308 -302
1993c02N84J19l84m23M00K20o10n3O15r8l18l65L99K36m47L12K16j87l31J22L30
2014C5O2O9j74M08J2k68p9M76k44k40k74O38q3m18j64N46P7p23j06Q31j65q54
2036f38J16O43k08o40K73P52l11m99M74N79m15n74P90L84q75J06M67R2n02K46
2056B60L32n24J34J0J86l93k31J11M7rj37Q9j15l6L2J4k2K98k13q7M3L84P0o04
2080c61L29P64k65p23L88M83l98o07R26J10r74j80J032j38q03L58N79m33q39O14
2100a38K90l18o60O96L21n05p1L61L23p00J38O90j63n05L05L72j88n77Q63P3p37
2121a30L13L11n78q4L24M4n17O3K44M5m26J55K44m00j89Q66r3q69L62P59l32m87
2143c75N32N04n77l82Q18L86r50n39J228k05p43L6P95l29o93L15Q32o35n37M66
$$ plain form
1993 -302 282 401 17 -406 -6 214 -396 -449 166 68 -250 -615 -216 20 -427 -115 101 -86 -417 -295 35
2014 35 97 166 -8 400 412 144 65 541 297 57 -217 421 338 -80 -244 302 379 -344 -450 381 216 -638
2036 -638 -522 121 -87 -727 -454 298 -13 -512 -38 541 126 -448 342 726 -149 -43 424 516 14 260
2056 260 592 68 202 212 398 5 -226 -115 -68 -77 -214 -125 -240 -276 -244 -230 -252 46 -167 -254 -211 173 243 -361
2080 -361 -32 732 467 -256 132 615 217 -390 536 646 -328 -508 524 386 -417 -59 520 87 -752 -138
2100 -138 152 -166 -826 -130 191 -314 -385 -24 299 -401 -263 427 264 -241 64 436 248 -329 534 607 -130
2121 -130 183 494 -84 -168 156 200 -317 -254 -10 35 -391 -236 8 -392 -581 285 192 -677 -315 444 112 -375
2143 -375 157 661 84 -298 520 906 -44 -583 645 440 -303 -267 528 199 -494 -179 653 18 -519 -53
2163e3L66q78j6N85k36k81J54M29J8m35L24L43p69J60O76Nm61L05L30k75j24P9
2185B46n3m49L05M30m75k98K32L13n80k17R27m88k93J92M36l86k80M77N52q84
2205b93l15Q30J40l14k94O85Qq44L04R39m68p28O86K52o35m29Q05K00r67J24P14
2226D00m69n34K67K81k80j91O44J2l25r6N63j94l95K16N19o10kL18N06r23M78
2247A85L03j11n74N86J24n81l71O22m4o13K72M81k91o64N13M75l77o80Q49J09
2267B13n15J20N67j0q07O50P6o3n29O84kk72j07M03k60l31K06K01o2m18M83J08
2289C35m45j65L89L4l97k45O78m45k78P49O2m68k27O66o2o05K67P45k29m96L71
2310B34N47o75k95P20K14r26M2M62k55n26J98M93l71l50N46O2m69m22O39M3k48
$$ plain form
2163 -53 313 -565 -581 4 -232 -513 -359 70 88 -347 -23 320 -449 -289 387 392 -69 236 566 291 167 246
2185 246 193 -256 49 479 4 -294 -62 251 -329 -546 381 -107 -400 -208 228 -158 -438 39 591 -293
2205 -293 -608 222 362 48 -246 439 447 -397 -93 846 378 -350 336 588 -47 -476 329 529 -438 -314 400
2226 400 -69 -603 -336 -55 -335 -526 118 130 -195 -291 272 78 -317 -101 418 -192 -194 124 630 -293 185
2247 185 488 377 -197 389 513 -68 -439 183 139 -474 -202 279 -12 -676 -163 312 -65 -745 104 213
2267 213 -302 -182 385 375 -432 218 294 231 -298 386 384 112 5 408 148 -183 23 224 162 -256 227 335
2289 335 -110 -275 114 148 -249 -494 184 -261 -539 210 272 -196 -423 243 181 -424 -157 588 359 -137 234
2310 234 781 106 -189 531 745 -181 -139 323 68 -458 -260 233 -138 -488 58 120 -349 -771 -132 -89 -337
2331c37J63N09m61m02O34K41k78l61N60J07l54j11K94l01Q4L41J61n38R5J97k22
2352B1l22L26M7j52l97M50K18o35J41J76K03m24L62K64n05j63L50J77m19J48M91
2373C57J27o15J26O30m62o10O21K64j91o90L77L52n52j71O74J23n59M2K31j93
2393a19j90J41L5J46l87N55o9j32O1J93P4j16J26m2k05p2K15J4l57M72K8m53J24
2416D2M2k9l63J85Q7k04R6K7N47n88k97L90J1l33K55J16K11m27K50M73j60k09
2438A22L99J0m60j03L41K73p83O5N53o7l74m18M38J42l31lL29j51l92j44M99j13
2460a68k17K70J92Q9k77M8L30m22K28n7O0J77k33l1K04RJ7Ol32K68l39L07j56
2483b7k89%R4L40p7k35L3J12k35j27N83j09j66J24K4Q8j10M2L19j04j26L9K35
$$ plain form
2331 -337 -174 335 -126 -528 106 347 69 -292 268 375 21 -90 204 -97 -13 328 489 -49 46 243 21
2352 21 -301 25 72 -80 -477 -27 191 -444 -303 -127 76 -348 14 278 -227 -390 -40 137 -282 -134 357
2373 357 484 -131 -5 625 163 -447 174 438 247 -443 -66 286 -266 -437 237 360 -199 -157 74 -119
2393 -119 -309 -168 -133 13 -374 181 112 -20 41 234 308 192 318 276 71 -1 214 228 -129 343 371 -82 42
2416 42 84 55 -308 -123 -36 -240 -144 -117 430 -158 -455 -65 -54 -387 -132 -16 195 -232 18 491 331 122
2438 122 521 531 71 -32 309 582 -201 -136 417 350 -24 -442 -4 138 -193 -196 133 -18 -410 -554 -55 -168
2460 -168 -385 -115 77 166 -111 -63 267 -155 73 16 76 253 20 -11 193 202 219 225 -107 161 -178 129 -27
2483 -27 -316 -316 -222 118 41 -194 -161 -49 -284 -411 172 63 -103 21 45 133 23 65 384 280 154 193 428
2506D28j36m60K91J24j44l27J25K79j47j00k85L03l3l85M02p7J69l27J42K02p4
2527c0p7J33L39n39M46j94j6J68m89N18m6k96m9K06J45k64M7l5p9j56J94j6j53
2550b43J73J39k59%N2J08k55K58k66K42j91j7J85J69k29L12l7l5k29o8K10J80
2572A99l1k16J76j85L36l33L4N2k78Q0J45o9j58j17K07j59M28K7l56J58P2n3j51
2595a92L22j47k42L33J89k95j78M54O5m8m23M17k22j26m5M42l71m90L55J09j4
2616a07j00K53J29n69J59K25j7o3j27N13j60j80m5N46l54n05P54l9j13J6M6Ll76
2639a11J86k4J46k19K1M17n37j65K17o4Q8k36K17r8j01J44K5R4k02J54L35l52
2661f5J59K36j36j65J64L13m92J09K23P5o45R2M84o30J30L0M76l58j95K54r2m01
$$ plain form
2506 428 292 -168 123 247 103 -224 -99 180 33 -67 -352 -49 -82 -467 -65 -142 27 -300 -158 44 -30
2527 -30 -107 26 365 -174 272 78 62 230 -259 259 213 -83 -132 74 219 -45 2 -33 -112 -268 -74 -90 -243
2550 -243 -70 69 -190 -190 -138 -30 -285 -27 -293 -51 -242 -259 -74 95 -134 178 141 106 -123 -191 19 199
2572 199 168 -48 128 -57 279 -54 -20 32 -246 -166 -21 -90 -248 -365 -158 -317 111 138 -218 -60 12 -41 -192
2595 -192 130 -17 -259 74 263 -32 -210 244 309 261 -162 255 33 -93 -138 304 -67 -557 -202 -93 -107
2616 -107 -207 46 175 -394 -235 -10 -27 -90 -217 296 136 -44 -89 457 103 -402 352 313 200 216 262 265 -111
2639 -111 75 51 197 -22 -1 416 -121 -286 -69 -133 -45 -281 -64 -162 -263 -119 -94 0 -202 -48 287 -65
2661 -65 94 330 194 29 193 506 14 123 346 421 -224 -132 352 -278 -148 -118 358 0 -195 59 -33 -434
2683d34J03N32q3n13J29M25j36l19M34J95n01n6P01k43l27P4N07l71l70K43K60
2704B50k70O0L3R7n5n12N09j55j28o8J02J3J8L4J38m1j86M01n15J09K61J93l13
2727b5o3K30J7j07k28N08l66m35P12N0o42O2O29k26k59k54O49j15o27J9O91l74
2749a54m11N40M12n12k57O29J57m60l01Q62j24m01r0M25j57J7O7O7m74R3M06n0
2771B84k45k24L03l55L5j42M95l27r3M64j37k62J58Q8l66K11M06l3l98L51J65
2792C78r2l44L63K26m45m16L89k8k64J66M21k87l96K02M63j89n84N04R4n51j21
2813e11P14l6n38L7O73m69J41j1J67k18J77N0J76m20Q0P5J56m18J64J26M0k78
2835a23rM61m13Nk6L8j4K4J0k4j62J00K02j61q2M35m37N6l9K29l67p5P24N0p21
$$ plain form
2683 -434 -331 201 118 -395 -266 159 23 -296 138 333 -168 -224 477 234 -93 -19 488 117 -253 -10 250
2704 250 -20 40 73 170 115 -397 112 -43 -171 -239 -137 -124 -106 -72 66 25 -161 240 -275 -166 95 288 -25
2727 -25 -88 142 159 52 -176 332 -34 -469 243 293 -349 -287 342 116 -143 -397 252 137 -490 -471 220 -154
2749 -154 -565 -25 387 -125 -382 247 404 -56 -357 505 381 -20 -110 315 158 175 242 309 -165 -72 334 284
2771 284 39 -185 118 -237 -202 -344 151 -176 -269 195 58 -204 -46 42 -324 -113 293 260 -138 213 378
2792 378 286 -58 305 531 86 -330 59 31 -233 -67 354 67 -329 -127 336 147 -437 67 161 -390 -511
2813 -511 203 167 -371 -334 339 -130 11 0 167 -51 126 176 352 -68 12 87 243 -175 -11 115 155 -123
2835 -123 -132 329 -84 -79 -105 -67 -81 -57 -47 -71 -233 -133 69 -92 -174 261 -176 -120 -159 70 -297 -372 352 402 -319
2860c19K11J82L32q25N75K39k16m18K53N65o30m03N16J55n81m3M16j00l59O5N31
2881A46o3l52K85L17m58k2O2L22m1k25J00Q4j19J26M4P3o5J21l31k08K17N5j54
2904h6k31K67j1k78L42K97m73K08pN6k75K9l2L82k48j92L54L8q0k44M69l19J92
2927A58L0J01n11J26J48K27l36j50L97q2k57j03M04k08k47K73L8p3r8j10N72k90
2949Ij06N7N61m02j10J54N3j62j66K62K83k60N6j59K1j69qK30l01k2r1K00K5j93
2973b38J95P4o8M0l15K03O7j18K05j47R9Q6j39K73K9m10K14L34n6m01J57J01l83
2996a98m6K84j06p2j14J36J46j75k37M73j59k54N0K81r9L1K8J16j37J24k52J88
3018Hl3J93O6k08k7J51j21J12j73p8K10k30J50k77J11J60J4RJ0nl18o1K69l6J23
$$ plain form
2860 -319 -108 74 406 -419 156 395 179 -239 14 579 -51 -454 62 217 -364 -407 9 -91 -450 -385 146
2881 146 83 -269 16 333 -125 -147 -85 237 196 -29 71 155 36 162 206 279 214 335 4 -204 13 68 -86
2904 -86 -317 -50 -61 -339 3 300 -173 35 28 84 -191 -162 -194 188 -60 -252 102 140 60 -184 285 -34 158
2927 158 188 289 -222 -96 52 279 -57 -207 190 108 -149 -252 152 -56 -303 -30 8 -65 -163 -273 299 9
2949 9 -97 -40 521 119 9 163 216 54 -112 150 433 173 229 70 91 -78 -86 144 -157 -179 -270 -70 -45 -238
2973 -238 -43 31 -37 3 -312 -109 -42 -160 45 -102 -3 83 -56 217 246 -164 50 384 328 -73 84 185 -198
2996 -198 -244 40 -66 -138 -252 -116 30 -145 -382 91 -68 -322 -272 9 -90 -59 -31 85 -52 72 -180 8
3018 8 -25 168 234 26 -1 150 29 141 -32 -110 100 -130 20 -257 -146 14 28 37 47 42 -276 -337 -68 -104 19
3043A9j60P8J81J2P3j93J97j07K55q5j03l9j11K60j71k05m9K92j30k12L09j44
3065c3J61k05j71K92l69J48K4n6J17k17Q9J93j90j0J03K13J40k4j01J88m28K06
3087G0J26J53j29j32qJ04l10r6J74K61l06R0j07K41j59J4Q9m65J72J27K24j69
3109c6P0P7O3m4k98L19j8j6K84k46k46K14j66J03j3j62m4L24l35Q7l1J92pk03
3133a32r5J33pj75J11m1K05k59J80J0K16J66m35J19K50J09m24L37L6m83J87M7
3155E5m1N6k52L24j13j13R7j02K54n64K67J78q9m32M28J89j43P9n4m2N6J5J11
3178A64j08k86M04M1l35n4K08J97k61J60j51K34l50N8L42k06l25K53q%p8Q4q4
3201a01m29N48J04j37n7L26k61o4Q2P6p9L04j65m5k22J25J98L7k51k45J40K35
$$ plain form
3043 19 -141 -63 118 130 203 10 207 100 355 270 167 128 17 277 106 -99 -148 144 14 -198 111 -33
3065 -33 128 -77 -248 44 -325 -177 -153 -209 -92 -309 -220 -27 -217 -227 -124 89 229 205 104 292 -136 70
3087 70 196 349 220 88 80 184 -126 -222 -48 213 -93 -3 -110 131 -28 -14 75 -390 -218 -91 133 -36
3109 -36 34 111 174 130 -168 151 133 117 401 155 -91 123 -43 60 47 -115 -159 165 -170 -83 -114 78 71 -132
3133 -132 -227 -94 -101 -276 -165 -206 -1 -260 -80 -70 146 312 -123 -4 246 355 -69 268 304 -179 8 55
3155 55 14 70 -182 142 29 -84 13 -89 165 -399 -132 46 -43 -475 -47 142 -1 78 24 -18 38 53 164
3178 164 56 -230 174 215 -120 -174 34 231 -30 130 -21 213 -137 -79 263 57 -268 -15 -23 -23 -101 -17 -101
3201 -101 -530 18 122 -15 -72 254 -7 -71 11 87 8 312 147 102 -120 5 203 240 -11 -256 -116 119
3223A19n50M29k17L07j87q1K60j56N4j3L8j71l8N28k76J54j90L38l91j0L34j6
3245B65k90J18M4o3J00J39l01k6j33M3J47m44L14j07K21l43K10M1jr4J31Rj03
3268a23K11J09k72j71L87k2p5j19L02l8K22m15J23k63M3J69J20m87J83M72l55
3289Al1j29K40o0l22kK16J73j53J76k92J76k55M20p9k54N15m11L1P6j9L71l80
3312HJ51J35k8k47J3Q9j00j45K52j28k73j7K39J50l10j9K38M1j42L12m65L28l00
3335b18J04O0j26L09j0j35J03K41k97l5j06K40L6l21J98m1O6k48Q8L04j89n30
3357e07O23k84J08k28Q4Q2k32L61r4L25l39Q6K37pj88L8L27k35j81m4O5N8L8k89
3381a96Mq0J09L01l09J08Kj66J25J73j52mQ2j15j39K52j93L56k82lK42J44j32
$$ plain form
3223 119 -431 -2 -219 88 -99 -180 80 -76 -22 -35 3 -168 -206 322 46 200 10 348 -43 -53 281 265
3245 265 -25 93 137 74 174 313 12 -14 -147 -104 43 -401 -87 -194 27 -316 -106 -65 -66 -160 -29 -20 -123
3268 -123 88 197 -75 -246 141 119 44 -75 227 189 411 -4 119 -144 -101 68 188 -299 -116 356 1
3289 1 -30 -159 81 21 -301 -303 -87 86 -67 109 -183 -7 -262 158 79 -175 340 -71 -40 36 17 388 8
3312 8 159 294 266 19 32 121 21 -124 128 0 -273 -290 -51 99 -211 -230 8 49 -93 219 -246 82 -218
3335 -218 -114 -54 -180 129 119 -16 87 328 31 -4 -110 130 166 -155 43 2 68 -180 -92 212 23 -507
3357 -507 116 -168 -60 -288 -204 -122 -354 7 -87 238 -101 -15 222 215 27 65 392 157 -24 -68 -3 55 93 -196
3381 -196 -192 -272 -163 138 -171 -63 -61 -227 -102 71 -81 -85 -3 -118 -257 -5 -198 158 -124 -127 115 259 127
3404A27n2Q0k14k26R5M41K2m8l61R2j39oL57j16l04J69n2J26j52K5m1J87l21K75
3428c6j11J01l17N49k62J1m7j1M42k70k32L85k22J9l3o5L59l56L0k5P4K13l83
3451a87J56j15K21k70M9p7p6j20K74J97k04JJ78j0j93J21K80j59J8j99J70np5
3474b5J44k81K09o4j02K73k37K74j15j28Q2k30J09R4k63J90O7J54k54K29J39k89
3496b4J08j87K3J48M0j05L58j61j66Q5n8J71l7j20P2L9j11k77J79n3L66k96n2
3519e8J06j69P7l35O40k73Q4K34k52l25K58L29j29m5O6rl50L06K14n33N67k77
3541A26k08K70l93K84j32J18k29J72j48M7k1K16l8j17j42R4J50MN2k35K43j74
3563f1K89k29n7qQ7K34j33j9o4q9L68m3j73p3J16k81K8O9j86J06j34K36O1l11
$$ plain form
3404 127 75 155 -59 -285 -190 251 273 225 -136 -44 -183 -189 168 52 -252 -83 -135 -9 -161 -136 -177 10 -311 -36
3428 -36 -147 -46 -363 186 -76 -65 -112 -123 319 49 -183 202 -20 -1 -34 -99 260 -96 -66 -91 -17 196 -187
3451 -187 -31 -146 75 -195 -146 -223 -299 -419 -145 52 -152 -151 27 17 -176 -55 225 66 84 -115 55 50 -25
3474 -25 119 -162 47 -17 -119 154 -83 191 76 -52 30 -200 -91 3 -260 -70 -3 151 -103 126 265 -24
3496 -24 84 -103 -80 68 108 3 361 200 34 119 61 232 195 75 147 186 75 -202 -23 -76 290 -6 -58
3519 -58 48 -121 -44 -379 261 -12 72 306 54 -271 -13 316 187 142 208 199 -151 155 369 -164 403 126
3541 126 -82 188 -205 79 -53 65 -164 8 -140 -93 -114 102 64 -53 -195 -101 49 53 105 -130 113 -61
3563 -61 228 -1 -58 -66 21 255 122 103 39 -50 318 275 102 29 145 -136 -108 -39 -225 -119 -253 -17 44 -267
3587b67J22K30n2l16L86m2K9o7M8J16p3k40J23J97k91Q7K2N7k87M43l35J93j69
3610h6P4K5K52j79r8l1K2l3R7J9ln8j47J04j62L71j08q1L34j52j24NK86k36l9
3635E2J09j24n3j7J00K99m08j19J42J18P5o5K0l9l69l3N17l55k8N2M47j8m02K67
3659A68J5k36K05n2l6l0j16m2JK60p5nj67J01o4P4j28P4J14j18q5j46L50P3p0
3684F5k17n1l9K69J16j17P1l36M38k90K48j49K34j42p5j01K18j16J1K83m93M57
3706B84k71P3j72j44M13j73k81L32lr7o0K13n14L01Q8R9j46J32k06K2J93M6q4
3729D5n7J50J9J3k25K01o8l41K73l25K69J57m7l17k8J78o6O3K93l31R7j7Qj21
3753a77K09J17%l9Rk66q8L26J21M4n21M11Q2Kk32p6K38j00J54k49m0K27j93R1
$$ plain form
3587 -267 -145 85 33 -283 103 61 90 23 71 187 114 -126 -3 194 -97 -10 12 69 -218 225 -110 83 -86
3610 -86 -12 13 265 86 -12 -43 -21 -54 43 62 59 1 -146 -42 -204 167 59 -22 312 160 36 41 327 91 52
3635 52 161 37 -16 -33 67 366 -42 -161 -19 99 174 109 129 90 -279 -312 205 -150 -178 -126 321 303 -99 168
3659 168 183 -53 152 100 64 34 -82 -124 -123 137 62 57 -110 -9 -73 1 -127 -53 61 -57 -142 -288 62 135 65
3684 65 -152 -203 -242 27 143 26 97 -239 199 -91 157 8 242 100 25 -76 142 26 37 320 -173 284
3706 284 13 86 -86 -230 183 10 -271 61 58 -39 -99 114 -400 -99 -11 88 -58 74 -132 -110 83 129 45
3729 45 -12 138 157 170 -55 146 78 -263 10 -315 -46 111 64 -253 -281 -103 -169 -106 187 -144 -47 -64 -56 -177
3753 -177 32 149 149 110 119 -147 -235 91 212 256 -265 146 228 230 -2 -78 160 60 214 -35 -75 152 -41 50
3777E0j2p0Q3j16K56k03O0P9J40j87R6j66j27L77j64L3j56L62l25K45k33j50L11
3800A83N9K1k20j97J87k24J02p6L9K9J42J61j32o7N3m17l4M25N0R6l98L85N9l31
3824a05K14l33M10j55J03m2J10l84J66j52L9K00J45l99K39K0r2J13k57L53l95
3845b02j7J11J62J30j85nk20K68K08l9n0l32K50j91K30m07M36l6K00k30o3Q1j21
3868b2q0J0O2K15r6k50p5K45P3l50K90M3l8j18O0J56l00Q5M70l69j39J20J2j36
3892a32J13J60p2j21Qj65R7K26p1J59Q3m48L2j83K44J39j93j3J33k00K73L6j77
3915g2q8L11J55n31L11J20j25L0k63J27K27k41O3L25j52k03k58k6J49Q5rj63K19
3938ir8O0P9l2n4J22j67N3J67J17j74k39K42k7k16K56q8j12J01P3J52m9j76J00
$$ plain form
3777 50 38 -32 51 -65 191 -12 48 127 267 80 176 10 -117 260 96 129 -27 335 10 255 22 -128 183
3800 183 242 263 43 -154 33 -191 -89 -165 -126 -97 45 206 74 7 60 -357 -391 34 84 180 -218 167 226 -105
3824 -105 109 -224 186 31 134 92 202 -182 -16 -168 -129 71 216 -183 56 76 -16 97 -160 193 -202
3845 -202 -219 -108 54 184 -1 -6 -226 42 250 211 161 -171 79 -112 118 -289 147 111 311 81 18 99 -22
3868 -22 -102 -92 -30 185 89 -161 -236 9 82 -268 22 65 27 -91 -31 125 -175 -90 380 11 -128 -8 4 -132
3892 -132 -19 141 69 -52 -44 -209 -112 114 43 202 285 -163 -131 -314 -70 69 -124 -137 -4 -204 69 105 -72
3915 -72 -160 151 306 -225 86 206 81 111 -152 -25 202 -39 24 349 197 -6 -264 -290 -141 -56 -65 -228 -9
3938 -9 -107 -47 32 0 -54 68 -99 -46 121 238 64 -175 67 40 -176 80 -8 -120 -19 54 206 157 -19 81
3962H1j12L8n7J68j88r7J22Q9l23K14r8K80k91J94J80j51J09j46L15j56j79j36
3984a44M27l19K43l02L23n1l38M39j16k77K47Kj22O4Q3j81j65N5Po3R1O0k5j14
4008a76K49r8j12J88J2J51k20L8M8K39m44K02K25m26j05J71J83k9k73J01K69n0
4030A43j59J47j27k72K96J51L3m00N2J85l6l7J60M2l09r1K50M9r3j37K92j70j04
4053a35K18J75l36J98k49K21Ok27mJ2K37k61L39n99M08l37L94o7j70O0J91J09
4075A83j09q7k6k17L17M8j43NJ22L6k51J17J48l6j31O9m3Q7l95K05J21j09J02
4098A3r7J01Q0m02K96K30l88R3J70k16Q9R9o4k7K52k28J26j60J59K54j67j34P8
4121A57O5n19K36K80l62Q5j07J90l49J06J90J79j75J8j63J11J46jJ6NK94k16j60
$$ plain form
3962 81 -31 7 -50 118 -70 -167 -45 44 -279 -65 -163 117 -174 20 200 49 158 12 327 171 -8 -144
3984 -144 283 -36 207 -95 228 177 -161 278 162 -115 132 134 12 76 159 -22 -187 -132 -125 -188 -97 -37 -62 -176
4008 -176 73 -25 -137 51 63 214 -6 32 80 319 -125 77 302 -124 -229 -58 125 96 -177 -76 193 143
4030 143 -16 131 4 -268 28 179 212 -188 -136 49 13 -24 136 178 -131 -222 28 77 -16 -153 139 -31 -135
4053 -135 83 258 -78 120 -129 92 98 -129 -133 -121 116 -145 194 -405 3 -334 60 -7 -177 -117 74 183
4075 183 74 -13 -39 -256 61 109 -34 -29 93 129 -122 -5 143 107 -24 45 2 89 -306 -101 20 -89 13
4098 13 -84 17 97 -305 -9 221 -167 -74 96 -120 -31 68 4 -23 229 1 127 -33 126 380 213 79 157
4121 157 222 -297 -61 219 -143 -58 -165 25 -324 -218 -28 151 -24 -6 -169 -58 88 87 103 108 402 186 26
4144B6K92l61N3K88L9k07k59K53j12r4R7K3k64J94K84k5m50J57j15J89j5J43k95
4167a59J17j92L77j24p0l2R9o2K03j89L1Q9p8M6k2Q2j31n4p0J96Q2j95Q9OM8j21
4193c4Lm9j2j90R5r5L43L2l77N13l62J97j36J5j76K53j22J75J54k9k55r0L13j37
4217B9j36K85M9m01J24M97n58K13L9j98r6J83N1k67J73p4J74j20J1k32K01k31
4239b84J82M48r1k98j10J92K41l17j81L78k31j12L40k83J96p3k2K65o6l76J71
4260c1r7n9Q8o7M1J6R0j27Lm5K60M4k58Q0J25n1J47j03L7J16j54K9J63k12j21
4285h6J08k09K51m3r2k0o3K69j57N4j11J50j63N1J10N5Q5j49K24m5l68j4L04J80
4309C21k37j60N3n7j1J3Km1M2K78j32J7J16l34m9P8J3M5R6k29L02j72K7pK18j94
$$ plain form
4144 26 318 -43 10 298 337 130 -129 124 12 -82 15 38 -226 -32 252 227 -223 -66 -181 8 -7 136 -159
4167 -159 -42 -234 143 19 -51 -83 16 -46 157 -32 -1 88 10 56 34 116 -15 -69 -139 57 139 -56 33 39 87 -34
4193 -34 -31 -80 -92 -282 -187 -282 61 93 -284 229 -133 64 -72 -57 -233 20 -102 73 227 198 -57 -147 166 29
4217 29 -107 178 227 -174 -50 447 -111 102 141 -57 -153 30 81 -186 -13 -87 87 -33 -22 -254 -53 -284
4239 -284 -102 346 255 -43 -153 39 280 -37 -218 160 -71 -183 157 -126 70 -3 -25 240 174 -202 -31
4260 -31 -128 -187 -99 -166 -125 -109 -19 -146 -143 -188 72 116 -142 -62 63 12 159 56 93 209 55 84 247 35 -86
4285 -86 22 -187 64 21 -71 -91 -154 115 -42 12 -99 51 -112 -61 49 104 189 40 264 219 -149 -163 141 321
4309 321 84 -76 -23 -80 -91 -78 -76 -117 -75 203 71 88 204 -130 -179 -101 -88 -43 53 -176 126 -46 -19 -26 192 -2
4335bj58K48m1k07J26K40Ol9k01J52j4k38n5L01p6j37K22k01J2j10N3j73P0L66
4359A44j27M1j08K0M6m3r1R1O4J40j12p4j23K35J12o26N63J1j11j74R6K29j51
4382E2j93J02j20J83j6K6k86J32J64r0L0j28n1k4K87m11J85L64k23J6M6Q9j33
4405AJ07R4j91n2J15NJ7J69j36k63J15L3L9j03Jl2j78K57k1p3k35J52J31J53K8
4430A33K6j76K18j35r5J08J57Q2k56r2J91j1j45j29J89p4l6J8M03l64N6j17J06
4453E7j77R9l16L83o2JK15l43K58Ko2l72K72N8J41k69J86Q7j42N3P6j31k8k99
4477c13K21n8j9J65M2j14K78k59N1o5j58L3K38j28O3J22k25J46lP8K8nK73k13
4501A78l2k06l6K14k28J25j73J22K6J01k27K00j99O4JK2kJ52j35K04j86nJ77j33
$$ plain form
4335 -2 -160 88 47 -160 -34 206 212 173 -28 124 110 -128 -183 118 42 -95 127 -74 -62 -172 -119 -292 -222 144
4359 144 17 58 -50 -30 16 -27 -118 -27 37 177 65 -9 -132 103 215 -411 152 163 52 -122 -26 203 52
4382 52 -141 -39 -159 24 8 34 -252 -120 44 -46 -16 -144 -195 -219 68 -343 -158 206 -17 -1 45 134 1
4405 1 108 202 11 -41 74 79 96 265 129 -134 -19 14 53 -50 -49 -81 -259 -2 -23 -96 -331 -179 -48 105 133
4430 133 159 -17 201 66 -29 79 236 318 62 -30 161 150 5 -124 65 -9 -45 -27 376 12 68 -49 57
4453 57 -120 -21 -337 46 -16 -15 200 -143 115 117 55 -317 -45 13 154 -115 71 158 16 69 145 14 -14 -313
4477 -313 -92 -150 -169 -4 38 -76 202 -57 -6 -71 -229 -196 42 -86 -23 99 -126 20 17 95 123 118 391 178
4501 178 146 -60 -96 118 -110 15 -158 -36 -10 91 -136 64 -135 -71 -70 -48 -50 102 -33 171 -15 -20 157 24
4525B4j88L42k38l88P51j84M9j57K7J35k95K62j49O2J18j20K0r7k22R6L17k70
4547a05K50p4k24k2L61k10J41L2l86R8k0L99k64P3J21j59m8o4M3O6J44k15Qj31
4571a86J37R1K1k66M4K50r6L09m94P0k58N6M68l80K45R9j46P9k80M36m26J92J56
4594A21j76l1M16j30k17J62j23J5J24Qk39J59Q4k74J11k04L04k45J91j78l7P5
4616h4J26K8j23O0mM5l35J32K55k31P0r3J96J87l1k09J82k24M9J71p7J04j96k06
4640b08J94j40q1L03l3J4J44j89J7J27j88k9Q4j55l3N7O1M16k97r6n3j1m8L49
4664B05j94j70M5M1j46L42k57J59J28l77K72J2k04J21M2O3n9k01L15j54j9j83
4686b19J35J2K22k06k18L8N3J26K17o2Q5k90J18K72l3m00J67N0p6K31k99j00K09
$$ plain form
4525 24 -164 178 -60 -448 303 119 168 11 38 173 -122 140 -9 53 171 51 71 -26 -248 -152 165 -105
4547 -105 145 71 -153 -175 186 -24 117 149 -237 -139 -159 240 -24 49 170 11 -37 -101 -58 8 152 -63 -55 -186
4571 -186 -49 42 63 -203 -159 91 -5 304 -190 -120 -378 -322 146 -234 11 110 -36 43 -237 199 -227 -35 121
4594 121 -55 -86 330 200 -17 145 22 37 161 169 -70 89 173 -101 10 -194 110 -135 56 -122 -159 -84
4616 -84 42 70 -53 7 3 48 -287 -155 100 -131 -61 -154 42 229 198 -11 171 -53 -4 167 90 194 -2 -208
4640 -208 -14 -154 -235 68 35 49 193 4 21 148 -40 -69 15 -140 -173 -116 -55 361 64 -32 -85 -96 -144 205
4664 205 11 -159 -114 -73 -219 123 -134 25 153 -224 48 60 -144 -23 19 82 23 -178 137 -17 -36 -219
4686 -219 -84 -72 150 -56 -274 -236 -183 -57 160 98 183 -107 11 283 250 -150 17 67 -9 222 -77 -177 32
4709C2j11J65r0q8R1j59K56M0M9k45j0p6J27j74J86o2Jj0j47M43k27J54j47k0
4733b2oJ29M5j47J99l07J98l36n3M2P1L42j27O6k23P7K15l28K5J64j83K93j63
4756b9J39k03J62j40q1K03N3j92K58l18P5K12j56l7N9j02J74j7j57J17k14J1N6
4779a27L03q7O5j11j10Pk27M49K0j45j75K33j00k05O9j25K55K9K31k01L6q4l6
4802c6j38P3j07J32M4l1k2Lk2nQK03J48p8k75Q1j62J89K0r3J05j1j12j58P8J09
4828e7o1J88R3j03k46J63R3q3j19N1K53k98J83j58J00N2j21J29m2m00J89L58j44
4851B0k74O38k58j10q6P3J97m0p4M8j3j85J94j78n2J87M3k5J58m27j19L12k76
4874b47n0K04K61j71J8K05j82L7o3Q6k02J68n1j59r3J29L9PK02l22L63j72kp9
$$ plain form
4709 32 -79 86 -4 -92 -1 -160 96 136 185 -60 -70 -146 -19 -193 -7 -69 -68 -78 -225 218 -9 145 -2 -22
4733 -22 -28 101 146 -1 198 -109 89 -247 -300 -258 -187 155 28 94 -129 -52 163 -165 -140 24 -159 134 -29
4756 -29 110 -93 69 -71 -152 51 104 -88 170 -148 -73 139 -17 -54 5 -97 77 60 -97 20 -194 -183 -127
4779 -127 176 89 154 43 -67 -60 -287 162 182 37 -138 95 -5 -210 -141 -266 -11 18 249 48 84 0 -36
4802 -36 -174 -101 -208 -76 -32 -63 -85 -82 -104 -109 -101 102 250 172 -103 -22 -184 5 25 -68 37 26 -86 -244 -166 -57
4828 -57 -118 70 163 60 -186 -23 70 -13 -132 -81 172 -126 57 -101 -1 51 -70 59 17 -383 -194 164 20
4851 20 -254 384 126 16 -70 3 200 160 86 134 121 -64 130 -48 -100 87 130 105 263 -164 -283 29 -247
4874 -247 -297 -93 168 -3 15 220 38 75 12 98 -104 64 13 -146 -239 -110 -71 -64 138 -184 179 7 5 -74
4898g4P5M8J17j93q9R2l6J42k27J16K1k2k84M08j09K59R1o81L28J15r7J94J10
4921C04l36m3n8P9O8j64Q6K35k38nO5o7rK9M78n54k49M60J1j79K71k30J39m2M4
4946I5k31M9Q2j03M7J49L1K3k83J20%J34N2J5k32Q7R5k91M8K90k54mJ03R9l14
4971a93L48r6m29L03j6j24J39R7R0j03k5J5J43k75J98J9j4J17k08N0J04k1k03
4994h4K34m36K69j8K34j28j83J47j34O3N2o8Q0m4K7j6J14N6j48o5qL79m19Q3K4
5019A1pm1J19K42l80j2K26m03O2K29k3l08L44j24O7l5j36K60J05q1j11k26K4L48
5043A50k20M2k59M92j43k2L2O5j13j00J27R2l49J91k0J7K50l23jO1J42K28m43
5066a04L03j43P2p8j42n7r1K65J12j33j66N8K75l52J27j67L55j03J24l54R2L28
$$ plain form
4898 -74 1 49 166 -27 -116 -24 -60 82 -145 -29 -8 -30 -314 94 -15 244 335 -346 -18 97 0 194 304
4921 304 -32 -75 -133 -54 14 -150 -64 171 -67 -72 -7 -74 -83 -54 424 -130 -379 81 92 -87 184 -46 93 51 95
4946 95 -136 -87 -5 -108 -61 88 119 142 -141 -21 -21 113 165 180 -52 35 130 -161 -113 177 -77 -81 22 121 -193
4971 -193 155 59 -370 -67 -83 -207 -68 29 119 16 -9 6 149 -126 72 91 77 194 -14 36 140 119 -84
4994 -84 150 -286 -17 -35 199 71 -112 35 -99 -36 16 -52 28 -16 11 -5 109 165 17 -48 -56 323 -96 -13 11
5019 11 4 -37 82 324 -56 -68 158 -245 -183 46 23 -285 59 -65 2 -33 -169 91 196 115 4 -222 -198 150
5043 150 -70 -28 -287 205 62 40 72 137 24 -76 51 143 -206 -15 -35 -18 232 -91 -92 -31 111 339 -104
5066 -104 199 56 128 50 -92 -149 -240 25 137 4 -162 -104 171 -181 -54 -221 134 31 155 -199 -107 221
5088B21j19N7o7k52K16m35L21J33o6L08l06P9m67M01j33K13k22J30j26n1L27j78
5110a6M5l20K74j62K27O6mj63L18m54m9N15j7j71k07J6l9l4M08l30N8J70j46J34
5134A19l08j50J03L19J9j84PqK16n0On6q9N7K69l1k62J78o6l9j7r4J14R1k03j76
5160b35J22K12j31J26m5k11K70o1k47n7N44j08j54j3O1l58L01R3k65K87l86K28
5182b7j34R4J4l9j47J54L55l72K03k61K61k5j83J02J40j03l20K51l4o9K11j24
5204e3j09K20j08Q9N4O0l00K63m6jm47N58j12J04j39j9r5J4o0J44j28k01J08K67
5228F3j44J32p6J9k7Q8q4j36K89k08J69j57K68j37K1j30J09r2L0K16m15J31K6
5251d5L3N3j49J34k06J9m3M1J18L1J16m8rJ64j97k29M87k69k33M32m95K79Q6l9
$$ plain form
5088 221 102 159 92 -160 56 -379 -58 75 9 317 11 90 -377 24 -109 104 -118 12 -114 -165 162 -16
5110 -16 29 -291 -17 -179 48 114 110 -53 265 -189 -238 277 260 89 -118 -102 -141 -175 233 -97 -39 131 -15 119
5134 119 -189 -339 -236 83 102 -82 -75 -83 133 83 89 33 -56 1 270 239 -23 155 89 50 33 -61 53 144 -59 -235
5160 -235 -113 99 -32 94 49 -162 108 47 -200 -257 287 179 25 12 73 -285 16 109 -156 131 -255 -27
5182 -27 -161 -67 -53 -92 -239 -85 270 -102 101 -160 101 76 -107 -5 135 32 -288 -37 -71 -140 71 -53
5204 -53 -162 58 -50 39 93 153 -147 116 70 69 -378 180 68 172 33 14 -81 -67 -127 17 -111 -312 -204 63
5228 63 -81 51 -25 -6 -33 55 -29 -165 124 -84 85 -72 196 59 80 -50 59 -33 -3 213 -202 -71 -45
5251 -45 -12 41 -108 26 -180 -161 -204 -163 -45 -14 102 54 45 209 12 -217 270 1 -232 200 -295 -16 70 31
5275C1k40J41K02k25K37M3J4l43JJ66j98J56j90J29n4P0J44K2o3n9m4J75l30k1
5299b36R3K1J71R1r3J8JP5J63m34J1p0K02J94k85m3J26j1P4l3L9r2Pj3l0J43j99
5326a10o6J52M3k24P6R7j6J12K70l5k93j8k32L40Qj10n8J67Q6l7Q4k60o6K37q1
5351F6J70k26n5J1r0J22P1l10L14l26M92r9j82j9K24l2k78J00L9P3l0j39J10J40
5375A46k13K51j26l93J92N6J39Rl1j55J22m0K63j94k26K6K45r8J42j66J60k08
5397i9N1J63k59K09oj66P4L8m7O7q4j09K17j59M25m70O4J56j35k9J18L6Mq8J63
5422A34J32m16J23L58k89o1j7K06j18k3O1q0j21J68m8P0p1N9k96J04L1K8O8j39
5446a37K64k50K32K6l85K58j74K24p8q6p4K71j01j20p8K12P6m4j35K69k51K33
$$ plain form
5275 31 -209 -68 134 -91 146 189 203 -140 -139 27 -171 -15 -205 -76 -130 -60 84 106 43 -16 -60 115 -215 -236
5299 -236 -143 -122 49 140 47 65 66 141 304 -130 -119 -189 13 207 -78 -121 5 -6 68 35 74 -18 -11 -24 -54 89 -110
5326 -110 -176 -24 19 -205 -129 -32 -48 64 334 299 6 -12 -244 96 104 -6 -64 103 189 152 236 -24 -90 147 66
5351 66 236 10 -45 -34 -124 -2 69 -241 73 -253 239 140 -42 -61 163 131 -147 -47 -8 65 35 -104 6 146
5375 146 -67 184 58 -335 -143 -87 52 61 30 -125 -3 -43 220 26 -200 -174 71 -27 115 -51 109 -99
5397 -99 -48 115 -144 65 59 -107 -33 5 -42 25 -59 -168 49 -110 315 -155 -91 65 -70 -99 19 55 59 -29 134
5422 134 266 -150 -27 331 42 -19 -36 170 52 29 90 10 -111 57 9 79 8 67 -229 -125 -94 -66 2 -137
5446 -137 127 -123 109 135 -250 8 -166 58 -20 -106 -180 91 -10 -130 -208 4 80 36 -99 170 -81 152
5468A52k20L12k37k1j70J36K6NJ81k12m0J87m02L01O2k52K08o3J2mk8L13j20k6
5492A00j14n1N6L1m2r4K29J07j54L9O1k34J00j59m1J10L3q4K63J31k55J27Q9j95
5516E3j16K2j51J4J71j52J13K2r0M95o89K76J22l32L93p0j69j5J23k0P8J03j91
5539a0j66K45N8J11j57j69N8K69j13k00J12K1l40L73p0L8J4o9M8m7m4K24j21k27
5563a62L58J12k96j85L11J1p8P4ok46mL30O2j84K3j28j2K8p5J48k48P0J11j0J84
5588A88j27K49k33r9j30J95j4J24j25J5j19J26%J5R0j34J51l55L21r7K39l68n2
5611a40l7L40l09J17j2J40j39J89k02J6K02r0k69J46k32K35J66l44L7J35J25j31
5633e7K91j50Lk30J78j61J96M1l07J96r6J61j8j81P0J0j80L82j20m3J49j61j40
$$ plain form
5468 152 -68 244 7 -14 -184 -48 -22 -17 164 -48 -88 99 -303 -2 60 -192 16 -47 -35 -39 -67 246 126 100
5492 100 -14 -65 -9 22 -20 -114 115 222 68 107 168 -66 34 -125 -166 -56 -23 -107 156 287 32 159 248 53
5516 53 -63 -41 -192 -178 -7 -159 -46 -24 -114 381 -308 -32 90 -242 151 81 -88 -103 20 0 78 181 -10
5539 -10 -176 69 127 238 81 -88 -30 239 126 -74 38 59 -281 92 22 60 74 5 53 6 -38 186 65 -162
5563 -162 196 308 12 -173 138 149 71 145 139 -107 -111 219 281 97 120 -8 -20 8 -67 81 -167 -97 14 4 188
5588 188 61 310 77 -22 -152 43 29 153 28 43 -76 50 50 65 155 21 172 -183 138 41 280 -88 -140
5611 -140 -177 163 -146 -29 -41 99 -40 149 -53 -37 165 75 -194 -48 -280 -45 121 -223 -186 -51 74 -57
5633 -57 234 84 87 -143 35 -126 70 111 -196 0 -96 65 47 -134 -64 -54 -234 148 28 -15 134 -27 -167
5656a67K23N2Pk60J09MJ3K1K2j51M17k91j34K04k30K31k9j45p2M08m82K19o2l2
5680a25K51r7j9o2J1K42k28j3j2N9j65L9K39Nk83J89j65K34Kk43J68q8q1J18J28
5705A04k85K01k24K28o7j62O8K0K8J02q6l3K2m1K40q7M2Mm09N83k83J56j1J47
5729B57k79RJ81j3k6q3l9j4K05l32j4P8k04K26j87L85j8k04O6j01o7J23J18j32
5753f5N5m4q4R7j56L24k81K57k11J38j53K89q1k8o5J19L9J54k50k2k35O2M3N6
5777d2Kk4m3J71J07j21Q1l54L64Mk96K32Nk96K80j64N2M4j90K83P3l68L28j65
5801c7L02j99j06j01K13J35k6j53j00J87J1j05QRl20K28p6P7j7R8l11M59j23j81
5825a28J08J37J5l32K38r4L7r9K23k76J03j5J00j78J23PM6j2l3L2k5J99J48n99
$$ plain form
5656 -167 56 108 115 -145 -36 -32 -19 2 24 -127 290 -1 -135 69 -161 70 41 -104 -176 232 -250 -31 -93 -125
5680 -125 126 29 10 -52 -41 201 -27 -40 -52 7 -158 -119 120 125 -158 31 -134 100 102 -141 27 -61 -142 -24 104
5705 104 -181 20 -204 24 -43 -205 -137 -117 -89 13 -73 -106 -84 -125 115 28 70 74 -335 248 -35 121 110 257
5729 257 -22 -13 168 155 129 46 7 -7 198 -134 -148 -70 -274 -48 -235 150 132 -72 -6 -107 -174 -51 67 -65
5753 -65 -10 -54 -138 -41 -197 127 -154 103 -108 30 -123 166 85 57 -8 111 150 304 54 32 -203 -141 -98 -42
5777 -42 -40 -64 -107 64 171 50 131 -223 141 145 -151 81 86 -210 70 -94 -42 2 -188 95 168 -200 128 -37
5801 -37 265 66 -40 -141 72 207 181 28 -72 115 126 21 29 38 -282 -54 -130 -53 -70 28 -283 176 53 -128
5825 -128 -20 117 132 -200 38 -56 -19 -118 105 -171 -68 -83 17 -161 -38 -31 15 3 -30 2 -23 176 324 -275
5849b75K28l1K01k68O3J56j24q6J59O0%J95l55k03L6K63M3j21J6p9K60k08R2k91
$$ plain form
5849 -275 -47 -78 123 -145 -82 74 -50 -136 23 83 83 278 -77 -280 -244 19 62 -59 -43 -122 138 -70 22 -269
$$ [...]
8191G6
##END NTUPLES=NMR FID
##END=
