##TITLE=1H_Pr F
 200.13MHz, CDCl3,
 8 sc
 
 5.8.2025
##JCAMPDX= 6.0         $$ Bruker NMR JCAMP-DX V2.0
##DATA TYPE= NMR FID
##DATA CLASS= NTUPLES
##ORIGIN= UXNMR, Bruker Analytische Messtechnik GmbH
##OWNER= pz
$$ XWIN-NMR		Version 3.5
$$ Tue Aug  5 14:30:09 2025 Russian Standard Time (UT+4h)  she@DPX200
##.OBSERVE FREQUENCY= 200.1313
##.OBSERVE NUCLEUS= ^1H
##.DELAY= (6, 6)
##.ACQUISITION MODE= SIMULTANEOUS
##.ACQUISITION SCHEME= undefined
##.AVERAGES= 8
##.DIGITISER RES= 18
##SPECTROMETER/DATA SYSTEM= spect
##.PULSE SEQUENCE= zg30
##.SOLVENT NAME= CDCl3
##.SHIFT REFERENCE= (INTERNAL, CDCl3, 0, 14.3821)
##AUDIT TRAIL= $$ (NUMBER, WHEN, WHO, WHERE, WHAT)
$$ ##TITLE= Audit trail, XWIN-NMR		Version 3.5
$$ ##JCAMPDX= 5.01
$$ ##ORIGIN= Bruker BioSpin GmbH
$$ ##OWNER= she
$$ F:/spectra/data/she/nmr/H-C/1/audita.txt
$$ ##AUDIT TRAIL=  $$ (NUMBER, WHEN, WHO, WHERE, WHAT)
(   1,<2025-08-05 14:28:53.56 +0400>,<she>,<DPX200>,
      <created by zg, POWCHK disabled, PULCHK disabled
       configuration hash MD5:
       00 E9 B6 7A A2 85 ED C7 34 08 36 98 17 FE 4E 26
       data hash MD5: 16K
       65 57 D6 C4 F5 CF 1A 53 02 6D FC E8 62 60 33 6B>)
$$ ##END=
$$ 
$$ hash MD5
$$ 58 FB 2B 2E E3 79 BB 49 93 55 82 BC B6 59 EC 3E
##$RELAX= 
##$RELAX= 
##$RELAX= 
##$RELAX= 
##$RELAX= 
##$RELAX= 
$$ Bruker specific parameters
$$ --------------------------
##$DU= <F:/spectra>
##$EXPNO= 1
##$NAME= <H-C>
##$PROCNO= 1
##$TYPE= <nmr>
##$USER= <she>
##$AMP= (0..31)
100 100 100 100 100 100 100 100 100 100 100 100 100 100 100 100 100 100 
100 100 100 100 100 100 100 100 100 100 100 100 100 100 
##$AQSEQ= 0
##$AQ_mod= 1
##$AUNM= <au_zg>
##$AUTOPOS= <>
##$BF1= 200.13
##$BF2= 200.13
##$BF3= 200.13
##$BF4= 200.13
##$BF5= 200.13
##$BF6= 200.13
##$BF7= 200.13
##$BF8= 200.13
##$BYTORDA= 1
##$CFDGTYP= 0
##$CFRGTYP= 5
##$CHEMSTR= <none>
##$CNST= (0..31)
1 1 145 1 1 1 1 1 1 1 1 1 1 1 1 1 1 1 1 1 1 1 1 1 1 1 1 1 1 1 1 1 
##$CPDPRG= <>
##$CPDPRG1= <>
##$CPDPRG2= <>
##$CPDPRG3= <>
##$CPDPRG4= <mlev>
##$CPDPRG5= <mlev>
##$CPDPRG6= <mlev>
##$CPDPRG7= <mlev>
##$CPDPRG8= <mlev>
##$CPDPRGB= <>
##$CPDPRGT= <>
##$D= (0..31)
0 0.7 0 0 0 0 0 0 0 0 0 0.03 0 0 0 0 0 0 0 0 0 0 0 0 0 0 0 0 0 0 0 0 
##$DATE= 1754389732
##$DBL= (0..7)
120 120 120 120 120 120 120 120 
##$DBP= (0..7)
150 150 150 150 150 150 150 150 
##$DBP07= 0
##$DBPNAM0= <>
##$DBPNAM1= <>
##$DBPNAM2= <>
##$DBPNAM3= <>
##$DBPNAM4= <>
##$DBPNAM5= <>
##$DBPNAM6= <>
##$DBPNAM7= <>
##$DBPOAL= (0..7)
0.5 0.5 0.5 0.5 0.5 0.5 0.5 0.5 
##$DBPOFFS= (0..7)
0 0 0 0 0 0 0 0 
##$DE= 6
##$DECBNUC= <off>
##$DECIM= 32
##$DECNUC= <off>
##$DECSTAT= 4
##$DIGMOD= 1
##$DIGTYP= 9
##$DL= (0..7)
0 120 120 120 120 120 120 120 
##$DP= (0..7)
150 150 150 150 150 150 150 150 
##$DP07= 0
##$DPNAME0= <>
##$DPNAME1= <>
##$DPNAME2= <>
##$DPNAME3= <>
##$DPNAME4= <>
##$DPNAME5= <>
##$DPNAME6= <>
##$DPNAME7= <>
##$DPOAL= (0..7)
0.5 0.5 0.5 0.5 0.5 0.5 0.5 0.5 
##$DPOFFS= (0..7)
0 0 0 0 0 0 0 0 
##$DQDMODE= 0
##$DR= 18
##$DS= 0
##$DSLIST= <SSSSSSSSSSSSSSS>
##$DSPFIRM= 0
$$ [...]
##$SUBNAM0= <"">
##$SUBNAM1= <"">
##$SUBNAM2= <"">
##$SUBNAM3= <"">
##$SUBNAM4= <"">
##$SUBNAM5= <"">
##$SUBNAM6= <"">
##$SUBNAM7= <"">
##$SUBNAM8= <"">
##$SUBNAM9= <"">
##$SW= 18.0517328524113
##$SWIBOX= (0..15)
0 0 2 0 0 0 0 0 0 0 0 0 0 0 0 0 
##$SW_h= 3612.71676300578
##$TD= 16384
##$TD0= 1
##$TE= 0
##$TE2= 300
##$TE3= 300
##$TEG= 300
##$TL= (0..7)
0 120 120 120 120 120 120 120 
##$TP= (0..7)
150 150 150 150 150 150 150 150 
##$TP07= 0
##$TPNAME0= <>
##$TPNAME1= <>
##$TPNAME2= <>
##$TPNAME3= <>
##$TPNAME4= <>
##$TPNAME5= <>
##$TPNAME6= <>
##$TPNAME7= <>
##$TPOAL= (0..7)
0.5 0.5 0.5 0.5 0.5 0.5 0.5 0.5 
##$TPOFFS= (0..7)
0 0 0 0 0 0 0 0 
##$TUNHIN= 0
##$TUNHOUT= 0
##$TUNXOUT= 0
##$USERA1= <user>
##$USERA2= <user>
##$USERA3= <user>
##$USERA4= <user>
##$USERA5= <user>
##$V9= 5
##$VALIST= <valist>
##$VCLIST= <CCCCCCCCCCCCCCC>
##$VD= 0
##$VDLIST= <DDDDDDDDDDDDDDD>
##$VPLIST= <PPPPPPPPPPPPPPP>
##$VTLIST= <TTTTTTTTTTTTTTT>
##$WBST= 1024
##$WBSW= 4
##$XGAIN= (0..3)
0 0 0 0 
##$XL= 0
##$YL= 0
##$YMAX_a= 188198
##$YMIN_a= -223549
##$ZGOPTNS= <>
##$ZL1= 120
##$ZL2= 120
##$ZL3= 120
##$ZL4= 120
##$ABSF1= 10
##$ABSF2= 0
##$ABSG= 5
##$ABSL= 3
##$ALPHA= 0
##$AQORDER= 0
##$ASSFAC= 0
##$ASSFACI= 0
##$ASSFACX= 0
##$ASSWID= 0
##$AUNMP= <proc_1d>
##$AZFE= 0.1
##$AZFW= 0.1
##$BCFW= 1
##$BC_mod= 2
##$BYTORDP= 1
##$COROFFS= 0
##$CY= -3
##$DATMOD= 1
##$DC= 2
##$DFILT= <>
##$DTYPP= 0
##$F1P= 0
##$F2P= 0
##$FCOR= 0.5
##$FTSIZE= 0
##$FT_mod= 4
##$GAMMA= 1
##$GB= 0.15
##$INTBC= 1
##$INTSCL= 1
##$ISEN= 128
##$LB= 0.25
##$LEV0= 0
##$LPBIN= 0
##$MAXI= 10000
##$MC2= 0
##$MEAN= 0
##$ME_mod= 0
##$MI= 1.114404
##$NCOEF= 0
##$NC_proc= 0
##$NLEV= 6
##$NOISF1= 3.799351
##$NOISF2= 2.8
##$NSP= 1
##$NTH_PI= 0
##$NZP= 0
##$OFFSET= 14.38212
##$PC= 1
##$PHC0= -1194.628
##$PHC1= 4.792299
##$PH_mod= 1
##$PKNL= yes
##$PPARMOD= 0
##$PSCAL= 0
##$PSIGN= 0
##$REVERSE= no
##$SF= 200.129724274929
##$SI= 16384
##$SIGF1= 3
##$SIGF2= 2
##$SINO= 400
##$SIOLD= 16384
##$SREGLST= <1H.CDCl3>
##$SSB= 0
##$STSI= 0
##$STSR= 0
##$SW_p= 3205.1282051282
##$SYMM= 0
##$S_DEV= 0
##$TDeff= 0
##$TDoff= 0
##$TI= <>
##$TILT= no
##$TM1= 0
##$TM2= 0
##$TOPLEV= 0
##$USERP1= <user>
##$USERP2= <user>
##$USERP3= <user>
##$USERP4= <user>
##$USERP5= <user>
##$WDW= 1
##$XDIM= 8192
##$YMAX_p= 0
##$YMIN_p= 0
$$ End of Bruker specific parameters
$$ ---------------------------------
##NTUPLES= NMR FID
##VAR_NAME=  TIME,          FID/REAL,        FID/IMAG
##SYMBOL=    X,             R,               I
##VAR_TYPE=  INDEPENDENT,   DEPENDENT,       DEPENDENT
##VAR_FORM=  AFFN,          ASDF,            ASDF
##VAR_DIM=   8192,          8192,            8192
##UNITS=     SECONDS,       ARBITRARY UNITS, ARBITRARY UNITS
##FACTOR=    0.0002768,     1,               1
##FIRST=     0,             0,               0
##LAST=      2.2672688,     0,               0
##MIN=       0,             -223549,         0
##MAX=       2.2672688,     188198,          0
$$ Real data points
##PAGE= N=1
##DATA TABLE= (X++(R..R)), XYDATA
$$ plain form
0 0 0 0 0 0 0 0 0 0 0 0 0 0 0 0 0 -1 8 -8 8 -8 8 -12 16 -16 16 -24 24 -32 32 -40 45 -51 56 -64 73 -84 93 -102
38 -102 116 -128 142 -158 176 -194 213 -237 260 -286 315 -346 383 -422 466 -513 567 -630 704 -784
58 -784 884 -1000 1143 -1321 1552 -1861 2300 -2971 4113 -6415 12850 -70098 -223549 -15509
72 -15509 137546 55773 -52757 -9747 60686 7572 -43067 19113 5275 -53345 4241 70302
84 70302 16327 -69669 -53690 53449 43187 -63757 -39635 51251 44757 -6652 -35737 -16654
96 -16654 7819 -528 26090 44759 -18726 -45391 -4657 19177 17558 -5782 -12406 12975 457
109 457 -12461 93 -20970 -17339 27007 30188 -11 -33835 -26311 30976 25887 -22883 -7681
122 -7681 19604 16370 1887 -16328 -7392 -2052 -9820 24507 25101 -33537 -30124 18166 21468 -16866
$$ packed form
0@%%%%%%%%%%%%%%%jRj6J6j6J6k0K8l2L2m0M8n6O4p2Q5r6J07j20J37j57J77j95
38a02K18k44K70l00L34l70M07m50M97n46O01o61P29q05Q88r79J080j197J334j488
58g84J668j884K143k464K873l413M161n271P084j0528J9265q2948j53451K08040
72a5509J53055q1773j08530M3010P0433n3114n0639O2180j3838n8620N7586O6061
84G0302n3975q5996J5979J07139j0262j06944K4122R0886o494n1409k9085J9083
96a6654K4473q347K6618J8669o3485k6665M0734K3834j619k3340o624K5381j2518
109D57j2918J2554k1063L631M4346L181l0199l3824P524N7287n089m8770J5202
122g681K7285l234j4483j8215Q936N340p768L4327N94n8638L413M8290L302l8334
$$ plain form
136 -16866 -37418 14875 51019 -8050 -36737 1375 11058 3808 6648 13309 9539 -22562 -18224
149 -18224 25651 10024 -21421 -4026 10389 5035 -12728 -18171 10738 9600 -14148 2078 10784
162 10784 -2806 -1511 -271 6039 4967 -9864 6994 18946 -5033 -11211 -6872 -2846 11380
175 11380 3654 -6425 -1689 -10427 -5494 6623 -3193 -34 6401 290 3925 -4888 -9109 11638
189 11638 9635 -1564 1912 -2360 711 1900 -9201 -142 3609 -5044 4581 -219 -12517 -3146
203 -3146 519 3388 4551 -5582 3602 10637 -5693 -4107 2350 2480 9850 1963 -4448 3234 -5699
218 -5699 -6164 4164 -3135 -1094 2671 -2855 1141 -6291 -11611 7162 8073 209 4043 -2504 -1071
233 -1071 3958 -3398 4526 6295 -4120 3455 2058 -7489 -1540 -3216 -907 5759 -6463 -4238 4683
$$ packed form
136a6866k0552N2293L6144n9069k8687L8112R683p250K840O661l770l2101M338
149a8224M3875j5627l1445J7395J4415n354j7763n443K8909j138k3748J6226Q706
162A0784j3590J295J240O310j072j4831J6858J1952k3979o178M339M026J4226
175A1380p726j0079M736q738M933J2117r816L159O435o111L635q813m221K0747
189A1638k003j1199L476m272L071J189j1101R059L751q653R625m800j2298R371
203c146L665K869J163j0133R184P035j6330J586O457J30P370p887o411P682q933
218e699m65J0328p299K041L765n526L996p432n320J8773R11p864L834o547J433
233a071N029p356P924J769j0415P575j397r547N949j676K309O666j2222K225Q921
$$ plain form
248 4683 -3454 9 517 -5703 5283 6344 2251 6257 -5651 -6129 7175 1324 1393 4114 -5650
263 -5650 -664 -873 -7468 1579 181 -2248 4978 -5297 -5972 5336 391 2520 3949 -4754 2983
278 2983 4726 -284 6191 -1745 -7114 4336 -150 -1234 3931 -5199 -2716 -523 -7527 2231 3619
293 3619 -3411 3740 -1490 -5199 4895 1389 3193 6701 -5610 -1270 4829 -1612 4333 991 -7294
308 -7294 423 -2283 -2323 5856 -3222 -4501 387 -5715 1647 6041 -1523 3886 605 -5787 4171 3003
324 3003 2148 5976 -4701 -3397 3041 -3778 2168 3121 -7608 -2153 -644 -1825 4953 -1864 -4122
339 -4122 3093 -3409 674 8034 -81 1379 1026 -4263 3555 2161 -1120 5600 -1836 -5909 473
354 473 -2904 566 2839 -5198 -593 251 -4685 3564 2129 -2541 2890 -1114 607 5873 -1955 661
$$ packed form
248D683q137L463N08o220J0986J061m093M006j1908m78J3304n851O9K721r764
263e650M986k09o595R047j398k429P226j0275o75J1308m945K129J429q703P737
278B983J743n010O475p936n369J1450m486j084N165r130K483K193p004R758J388
293C619p030P151n230l709J0094l506J804L508j2311M340O099o441N945l342q285
308g294P717k706m0Q179r078j279M888o102P362M394p564N409l281o392R958j168
324C003q55L828j0677J304O438o819N946R53j0729N455J509j181O778o817k258
339d122P215o502M083P360q115J460l53n289P818j394l281O720p436m073O382
354D73l377L470K273q037M605Q44m936Q249j435m670N431m004J721N266p828K616
$$ plain form
370 661 4158 -4095 258 1615 -2733 3328 -1715 -5476 707 -3182 -1726 4830 -1329 -1194 -370 -4276
386 -4276 4099 4330 -1616 3176 451 -2162 3078 -344 681 2795 -4543 -1027 1318 -4154 868
401 868 688 -3509 82 -2778 -1435 5488 50 -1097 782 -2100 3446 4551 -689 2423 -579 -3634
417 -3634 3463 447 -1561 1263 -3661 -1476 620 -3858 476 1424 -2544 1607 -720 -1903 4248
432 4248 792 -373 2191 -1600 1501 3702 -994 1257 -795 -3626 2267 24 -2549 410 -3148
447 -3148 -1196 1790 -3109 -190 1701 -1490 2278 659 -1743 3459 1032 -63 3083 -1945 -678
462 -678 1855 -1617 352 97 -3763 837 245 -2465 746 -2602 -696 3486 -1541 -35 2390 -905
478 -905 2411 2073 -1098 2243 -130 -1182 3394 -1728 -2239 622 -2343 469 522 -4038 162 289 -2219
$$ packed form
370F61L497q253M353J357m348O061n043l761O183l889J456O556o159J35Q24l906
386d276Q375K31n946M792k725k613N240l422J025K114p338L516K345n472N022
401H68j80m197L591k860J343O923n438j147J879k882N546J105n240L112l002l055
417c634P097l016k008K824m924K185K096m478M334R48l968M151k327j183O151
432D248l456j165K564l791L101K201m696K251k052k831N893k243k573K959l558
447c148J952K986m899K919J891l191L768j619k402N202k427j095L146n028J267
462f78K533l472J969k55l860M600n92k710L211l348J906M182n027J506K425l295
478i05L316l38l171L341k373j052M576n122n11K861k965K812N3m560M200J27k508
$$ plain form
495 -2219 1518 -907 -380 3475 -709 438 3035 -1968 1229 2957 -948 1079 -1618 -2799 3270
510 3270 -635 -2605 617 -2883 -463 1286 -3197 889 1388 -2007 2313 1142 -1052 2844 178
525 178 624 3015 -2427 19 2891 -1764 -131 -1144 -3457 1870 -283 -2349 1438 -2510 -1964 2577
541 2577 -1161 1582 2205 -2565 2529 1795 -1935 2471 1101 -608 1571 -2243 -1009 2069 -2825 -74
557 -74 621 -4066 529 795 -1785 1903 -1530 -1561 3453 -304 561 2973 -1570 791 1612 -1964 2164
574 2164 794 -2195 1851 -2285 -3054 1619 -1408 -374 1004 -3530 420 1266 -1533 2441 457 -1783
590 -1783 3331 467 -83 2644 -1505 448 1613 -2595 1119 1107 -3000 591 -1507 -3120 1709 -635
606 -635 -37 1960 -3091 -761 2477 -681 2184 1433 -1556 2462 107 -1263 2762 -1031 -1191 1285
$$ packed form
495b219L737k425N27L855m184J147K597n003L197J728l905K027k697j181O069
510C270l905j970L222l500K420J749m483M086M99l395M320j171k194L896k666
525A78M46K391n442K446K872m655J633j013k313N327k153k066L787l948N46M541
541B577l738K743O23m770N094p34l730M406j370j709K179l814J234L078m894K751
557g4O95m687M595K66k580L688l433l1N014l757Q65K412m543K361Q21l576M128
574B164j370k989M046m136p69M673l027J034J378m534L950Q46k799L974j984k240
590a783N114k864n50K727m149J953J165m208L714j2m107L591k098j613M829k344
606f35N98J997n051K330L238l158K865p51k989M018k355j370M025l793j60K476
$$ plain form
622 1285 -2475 -542 663 -2790 729 -27 -3276 1262 950 131 2212 -2076 -594 2889 -78 1634
638 1634 2268 -1445 663 278 -1723 2005 -1152 -2091 1327 -2259 -1503 476 -1567 716 258 -2092
654 -2092 1570 1376 -602 2434 -258 -838 2547 265 961 1407 -2501 -67 345 -1969 1289 -514
670 -514 -2255 794 -1685 -1660 1546 -971 968 1588 -1714 1042 1098 -61 2449 -29 -1232 1697 -636
687 -636 -460 1138 -2091 -426 504 -2150 677 -286 -2112 1230 -324 -410 1731 -319 778 2121 -1348
704 -1348 832 1646 -747 1400 279 -1254 887 -1508 -1043 1063 -1985 -851 845 -1723 285 -52
720 -52 -1224 1716 326 -517 2019 -94 405 2123 -887 302 1225 -1469 717 8 -2320 515 -1043
737 -1043 -1313 1100 -1690 -803 922 -1232 674 898 -1068 1922 927 -826 1748 41 -228 1936
$$ packed form
622A285l760J933J205l453L519p56l249M538l12q19K081m288J482L483k967J712
638A634O34l713K108l85k001L728l157r39L418l586P56J979k043K283m58k350
654b092L662j94j978L036k692n80L385k282O96M46l908K434M12k314L258j803
670e14j741L049k479K5L206k517J939O20l302K756N6j159K510k478j203K929k333
687f36J76J598l229J665R30k654K827r63j826L342j554q6K141k050J097J343l469
704a348K180Q14k393K147j121j533K141k395M65K106l048J134J696k568K008l37
720e2j172K940j390q43K536k113M99J718l010J189R23k694K186p09k328K835j558
737a043k70K413k790Q87J725k154J906K24j966K990r95j753K574j707k69K164
$$ plain form
753 1936 -1049 -2 853 -1916 247 222 -2270 540 -254 -1543 1310 -939 -806 1808 -710 724
769 724 1607 -1090 1627 900 -1292 1677 -175 -961 1472 -1173 -1005 716 -1881 -419 775 -2037
785 -2037 570 350 -1425 1533 -285 -551 2631 -89 392 1819 -941 373 1269 -1283 1428 -306
801 -306 -1968 1153 -1008 -1689 1062 -1517 -538 1415 -1604 662 989 -1317 1852 781 -1190 2058
817 2058 272 -291 1508 -1168 134 1354 -1843 497 248 -2760 388 -66 -1260 1132 -1009 -531
833 -531 1568 -1380 368 2469 -900 829 1208 -991 1419 -281 -1133 1836 -1370 -1599 931 -1530
849 -1530 -763 536 -2050 421 398 -1233 1637 309 -1500 1554 -375 260 2032 -945 85 1486
865 1486 -1405 491 11 -1170 983 -936 -1818 1364 -1331 -739 1291 -990 365 416 -1107 2004
$$ packed form
753A936k985J047Q55k769K163k5k492K810p94j289K853k249J33K614k518J434
769G24Q83k697K717p27k192K969j852p86K433k645J68J721k597J462J194k812
785b037K607k20j775K958j818k66L182k720M81J427k760J314Q96k552K711j734
801c06j662L121k161o81K751k579R79J953l019K266L27k306L169j071j971L248
817B058j786n63J799k676J302J220l197K340k49l008L148m54j194K392k141M78
833e31K099k948J748K101l369J729L79k199K410j700q52K969l206k29K530k461
849a530P67J299k586K471k3j631K870j328j809L054j929O35J772k977J030J401
865A486k891J896m80j181K153j919q82L182k695N92K030k281J355N1j523L111
$$ plain form
881 2004 967 -1334 1707 445 -519 1242 -859 175 1024 -1874 -81 544 -2027 429 61 -1202
897 -1202 477 -793 -546 1720 -877 -107 1361 -962 1325 1468 -762 518 186 -791 885 -589
913 -589 -699 1046 -1155 -609 610 -1444 275 527 -873 1150 -123 -627 1814 -34 101 1212 -712
930 -712 417 1127 -1028 243 -200 -1153 843 -422 -1028 471 -1561 -423 1108 -848 387 596 -351
947 -351 1400 228 -656 1854 163 -763 1309 -435 -136 329 -1180 552 136 -1929 232 66 -1279
964 -1279 480 -678 -208 1096 -765 571 1045 -753 658 794 -626 735 58 -641 1258 -772
980 -772 -692 872 -1183 46 273 -1599 408 127 -898 1001 -76 -461 1107 -88 457 1152 -1005
997 -1005 616 841 -662 646 -353 -1177 892 -734 -822 677 -1177 2 1009 -1212 292 562 -540
$$ packed form
881B004j037k301L041j262r64J761k101J034Q49k898J793O25k571K456l68j263
897a202J679j270K47K266k597P70J468k323K287J43k230J280l32r77J676j474
913e89j10J745k201N46J219k054J719K52j400K023j273n04K441j848J35J111j924
930g12J129P10k155J271m43r53J996j265o06J499k032J138J531j956J235K09r47
947c51J751j172q84K510j691r26K072j744K99M65j509J732m16k065K161j66j345
964a279J759j158M70J304j861J336M74j798J411J36j420J361o77o99J899k030
980g72Q0J564k055J229K27j872K007k81j025J899j077l85J568j195N45O95k157
997a005J621K25j503J308r99q24K069j626q8J499j854J179J007k221J504K70j102
$$ plain form
1014 -540 1233 276 -428 1105 -25 115 1368 -984 -107 645 -1043 210 -448 -1433 464 -651 -1148
1031 -1148 1011 -886 -294 980 -857 535 975 -769 1281 883 -629 1285 87 -566 1071 -1153
1047 -1153 -564 729 -1440 25 420 -1187 580 70 -1226 1315 -308 -670 1600 -364 -41 1114
1063 1114 -557 940 665 -1173 589 -193 -1165 594 -1032 -866 625 -1288 14 867 -819 156
1079 156 388 -830 1259 334 -422 1334 -320 -364 1202 -724 185 817 -1303 52 182 -1288 637
1096 637 -98 -959 990 -359 -491 1068 -836 267 1204 -1019 1027 1108 -987 1110 9 -572 799
1113 799 -611 -353 587 -1056 -184 660 -1314 241 202 -897 815 -208 -532 1361 -141 55 754
1130 754 -382 322 833 -817 632 -124 -1601 843 -472 -418 479 -933 -140 800 -1091 60 608
$$ packed form
1014e40J773r57p04J533j130J40J253k352Q77P52j688J253o58r85J897j115m97
1031a148K159j897N92J274j837J392M40j744K050l98j512J914j198o53J637k224
1047a153N89J293k169J465L95j607J767n10j296K541j623l62K270j964L23J155
1063A114j671J497k75j838J762p82r72J759j626J66J491j913J302Q53j686R75
1079A56K32j218K089r25p56J756j654m4J566j926R09O32k120J355J30j470J925
1096F37p35q61J949j349j32J559j904J103R37k223K046Q1k095K097j101n81J371
1113G99j410K58R40j643Q72Q44j974J555l9j099J712j023l24J893j502J96O99
1130G54j136P04N11j650J449p56j477K444j315N4Q97j412P93R40j891J151N48
$$ plain form
1147 608 -589 685 362 -241 1448 14 -290 1058 -607 46 430 -963 344 -51 -1296 559 -327
1164 -327 -1097 783 -640 -443 510 -583 85 846 -519 827 653 -511 735 156 -418 633 -502
1181 -502 -173 628 -1067 -152 192 -1198 203 21 -959 617 -66 -180 1001 -95 175 898 -504 430
1199 430 189 -539 552 47 -898 927 -415 -510 425 -646 -185 486 -749 314 391 -510 658 297
1217 297 -348 774 -242 4 1142 -547 109 44 -580 113 -205 -1105 253 -716 -457 617 -657 -494
1235 -494 590 -371 399 591 -451 842 507 -359 870 -409 -384 497 -836 -232 306 -959 26 112
1253 112 -1171 601 -61 -621 829 -325 -336 880 -230 551 787 -451 592 605 -651 581 22
1270 22 -650 468 -534 -511 230 -821 -188 351 -895 255 402 -794 1068 284 -152 1165 -147 265
$$ packed form
1147F08j197J274l23o03J689j434l04J348j665O53L84j393J307l95j245J855q86
1164c27p70J880j423J97R53j093O68P61j365J346j74j164J246n79n74J051j135
1181e02L29Q01j695R15L44j390J401j82r80J576o83j14J181j096K70P23j402R34
1199D30k41p28J091n05r45J825j342r5R35j071M61O71j235J063P7r01J168l61
1217B97o45J122j016K46J138j689O56o5o24O93l18r00J358r69K59J074j274J63
1235d94J084r61P70J92j042J293l35q66J229j279K5Q81j333O04N38j265R85Q6
1253A12j283J772o62n60J450j154j1J216j110P81K36j238J043J3j256J232n59
1270B2o72J118j002K3P41j051O33N39j246J150J47j196J862p84m36J317j312M12
$$ plain form
1288 265 883 -732 239 309 -996 502 81 -1064 614 -645 -539 248 -647 -210 726 -537 412 395
1306 395 -340 873 341 -204 1109 -249 -114 1061 -632 -168 82 -890 -74 -32 -1205 334 -270 -834
1324 -834 783 -260 -194 991 -308 410 629 -665 613 539 -541 409 -371 -634 289 -733 -413 202
1342 202 -1042 -290 339 -683 277 268 -502 778 23 -256 944 125 -218 906 -767 -83 490 -718
1360 -718 215 -227 -1096 478 -243 -886 514 -431 -469 481 -575 253 587 -563 729 452 -477 796
1378 796 21 -202 706 -243 -299 551 -643 -61 -16 -1073 302 -6 -475 909 -179 -475 543 -400 -35
1397 -35 728 -423 768 288 -477 307 129 -887 304 -419 -679 362 -432 -295 255 -759 297 136
1415 136 -667 548 26 -292 1243 -77 -134 794 -331 383 215 -539 84 -89 -704 140 -265 -465 448
$$ packed form
1288B65O18j615R71P0j305J498m21j145J678j259J06P87q95M37R36j263R49j7
1306C95p35J213n32n45J313j358J35J175j693M64K50r72Q16M2j173J539o04n64
1324h34J617j043O6J185j299P18K19j294J278p4j080R50p80k63R23j022L20O15
1342B02j244P52O29j022R60rp70J280p55k79J200q19l43J124j673O84N73j208
1360g18R33m42q69J574p21o43J400r45l8R50j056Q28L34j150J292k77r29J273
1378G96p75k23R08r49n6Q50j194N82M5j057J375l08m69J384j088k96J018r43L65
1397c5P63j151J191m80p65P84j78j016J191p23k60J041p94J37N50j014J056j61
1415A36q03J215n22l18J535j320n7R28j125P14j68p54O23j73o15Q44m05k00R13
$$ plain form
1434 448 -471 -152 404 -337 382 438 -396 459 387 -380 624 1 -442 623 -571 -177 244 -788 -211
1453 -211 -233 -726 -4 -45 -648 564 -174 5 694 -124 295 813 -337 295 429 -572 682 -88 -525
1472 -525 216 -577 -276 304 -908 -201 20 -455 118 -109 -493 568 -135 -126 935 -513 -100 541 -553
1491 -553 375 261 -629 274 -351 -535 182 -424 -541 365 -355 -137 498 -308 210 507 -529 630 242
1510 242 -15 980 -1 -135 814 -315 -215 249 -790 200 -102 -688 230 137 -247 461 -31 -80 789 -375
1530 -375 135 512 -339 798 299 -254 548 -116 -600 594 -588 -239 247 -715 -102 81 -352 165 -76
1549 -76 -620 565 56 -217 816 131 155 510 -396 330 394 -434 164 -121 -493 626 -345 -727 479 -541
1569 -541 -168 194 -593 90 526 -404 728 316 -239 894 -168 -148 456 -495 58 275 -747 -184 104
$$ packed form
1434D48r19L19N56p41P19N6q34Q55p2p67J004o23m43J065j194L94M21j032N77
1453b11k2m93P22m1o03J212p38J79O89q18M19N18j150O32J34j001J254p70m37
1472e25P41p93L01N80j212P07K21m75N73k27l84J061p03RJ061j448M13O41j094
1491e53R28j14q90R03o25j84P17o06j17R06p20K18O35q06N18K97j036J159l88
1510B42k57R95r81j34R49j129J00M64j039R90l02n86R18r3l84P08m92m9Q69j164
1530c75N10L77q51J137m99n53Q02o64m84J194j182L49M86r62O13J83m33N17k41
1549g6n44J185n09k73J033o85K4L55r06P26O4q28N98k85l72J119r71l82J206j020
1569e41L73L62p87O83M36r30J132m12n55J133j062K0O04r51N53K17j022N63K88
$$ plain form
1588 104 -611 389 -65 -550 458 -208 104 300 -173 255 829 -444 431 329 -400 573 -306 -524 403
1607 403 -423 -263 121 -804 -171 191 -472 170 521 -680 686 322 -193 620 -184 -39 681 -462 24
1626 24 225 -859 286 -152 -712 173 -300 -383 239 -159 -406 609 -409 209 431 -234 448 339 -404
1645 -404 747 -168 -327 459 -274 -61 286 -429 7 54 -392 252 -144 -453 376 165 -185 368 -78 188
1665 188 445 -416 308 366 -177 254 -54 -307 583 -344 -336 188 -474 -237 304 -526 -85 -45 -306 306 -169
1686 -169 -73 512 -186 -32 563 -18 -56 -20 -534 319 32 -269 343 -418 -600 193 -249 -256 568 -220 -103 169
1708 169 -97 563 355 -255 582 -281 -222 667 -514 -100 176 -289 13 57 -428 70 7 -243 331 -156 62
1729 62 386 123 248 551 -210 488 -13 -541 430 -189 -242 223 -307 -285 291 -561 -35 56 -417 192 200 -454
$$ packed form
1588A04p15J000m54m85J008o66L12J96m73M28N74j273Q75j02p29R73q79k18R27
1607D03q26J60L84r25O33L62o63O42L51j201J366l64n15Q13q04J45P20j143M86
1626B4K01j084J145m38n60Q85m73q3O22l98k47J015j018O18K22o65O82j09p43
1645d04J151r15j59P86p33K13L47p15M36M7m46O44l96l09Q29k11l50N53m46K66
1665A88K57q61P24N8n43M31l08k53Q90r27QN24o62K37N41q30M41M0k61O12m75
1686a69R6N85o98J54N95n81l8L6n14Q53k87l01O12p61j82P93m42pQ24p88J17K72
1708A69k66O60k08o10Q37q63N9Q89j181M14K76m65L02M4m85M98o3k50N74m87K18
1729F2L24k63J25L03p61O98n01n28R71o19n3M65n30K2N76q52N26R1m73O09Qo54
$$ plain form
1751 -454 306 17 -102 646 173 110 423 -257 157 191 -529 202 -6 -534 188 -417 -377 125 -467 87 9
1772 9 -78 257 400 -307 478 269 -83 416 208 8 325 -219 -251 80 -208 69 -72 -469 344 -108 -194 219
1794 219 -185 95 377 -171 -59 522 -205 477 170 -445 544 -262 -612 367 -249 -347 239 -576 -292 210
1814 210 -582 472 78 -354 203 210 68 500 -235 67 684 -575 15 456 -558 352 -149 -741 209 -191
1834 -191 -284 335 -228 86 207 -357 422 311 -469 347 257 -214 627 -114 -169 499 -233 45 340 -245 -36
1855 -36 -204 -728 101 94 -373 506 -137 12 568 -359 126 398 -148 333 227 -243 233 98 -431 751 -164
1876 -164 -312 342 -399 2 154 16 -191 157 -289 -56 9 -110 427 7 -156 584 -430 241 397 -252
1896 -252 -110 62 -355 80 -306 -521 86 -363 -339 173 -405 56 146 -214 339 122 -132 338 8 -116 425
$$ packed form
1751d54P60k89j19P48m73o3L13o80M14L4p20P31k08n28P22o05M0N02n92N54p8
1772Iq7L35J43p07P85k09l52M99k08k00L17n44l2L31k88K77j41l97Q13m52q6M13
1794B19m04K80K82n48J12N81p27O82l07o15R89q06l50R79o16r8N86q15K84N02
1814B10p92J054l94m32N57Pj42M32p35L02O17j259N90M41j014R10n01n92R50m00
1834a91r3O19n63L14J21n64P79j11p80Q16r0m71Q41p41n5O68p32K78K95n85K09
1855c6j68n24Q29pm67Q79o43J49N56r27M85K72n46M81j06m70M76j35n29J182r15
1876a64j48O54p41M01J52j38k07L48m46K33O5j19N37m20j63P40j014O71J56o49
1896b52J42J72m17M35l86k15O07m49K4N12n78M61R0l60N53k17k54M70l30j24N41
$$ plain form
1917 425 -435 -170 353 -561 -257 -104 -248 290 21 -487 401 -90 84 308 -72 355 477 -230 318 167
1937 167 -125 570 85 -500 248 -259 -8 50 -318 -153 -83 -364 100 156 -153 430 4 -388 432 -163 13
1958 13 286 -279 60 364 -131 -91 -17 -450 203 -78 -253 319 -330 -20 342 -394 172 251 -210 284 113
1979 113 4 397 331 -98 421 -59 43 316 -140 85 -270 -499 369 65 -277 202 -182 -223 125 -272 47
2000 47 236 -248 204 37 -228 286 -143 -323 73 -133 -221 76 -473 -198 -129 -161 141 34 -252 366 -48
2021 -48 109 605 -112 156 376 -275 250 291 -212 222 -262 -274 329 -81 -439 -104 -398 45 283 -483 269
2042 269 364 -356 507 226 -166 151 -98 -6 95 -242 -121 43 -231 263 -22 -257 436 -56 -311 494 -71
2063 -71 -19 325 -213 210 82 -105 323 379 -173 285 -170 -210 -65 -385 23 505 -464 -196 79 -443 130
$$ packed form
1917D25q60K65N23r14L04J53j44N38k69n08Q88m91J74K24l80M27J22p07N48j51
1937A67k92O95m85n85P48n07K51N8l68J65P0k81M64N6l09N83m26l92Q20n95J76
1958A3K73n65L39L04m95M0P4m33O53k81j75N72o49L10L62p36N66P9m61M94j71
1979A13j09L93o6m29N19m80J02K73m56K25l55k29Q68l04l42M79l84m1L48l97L19
2000D7J89m84M52j67k65N14m29j80L96k06q8K97n49K75O9l2L02j07k86O18m14
2021d8J57M96p17K68K20o51N25M1n03M34m84j2O03m10l58L35k94M43K38p66P52
2042B69R5p20Q63k81l92L17k49R2J01l37J21J64k74M94k85k35O93m92k55Q05n65
2063g1N2L44n38M23j28j87M28N6n52M58m55m0J45l20M08M82r69K68K75n22N73
$$ plain form
2084 130 -276 -183 341 32 -264 398 -177 245 302 -280 353 151 -230 203 -104 -354 318 -361 57 253 71
2105 71 145 266 -253 83 179 -88 394 -40 -221 574 107 -268 504 -170 -261 86 -84 60 -319 -380 -7 -66
2127 -66 -597 371 -177 -166 542 -217 -2 559 -482 269 184 -332 149 -203 -247 222 -253 -113 278 -331 -144
2148 -144 -50 -269 93 269 -547 218 30 -235 708 131 99 306 -224 11 181 -473 249 208 -635 272 -311
2169 -311 -385 179 48 235 283 -314 307 332 -56 221 -91 163 7 165 5 334 -208 -212 94 -507 139 106
2191 106 -452 172 48 -472 306 -4 -272 202 -498 176 388 -170 350 141 129 359 174 -304 0 -118
2211 -118 -222 -24 -372 -97 200 -369 26 -110 -213 189 274 -105 483 7 193 264 -227 141 31 -134 30
2232 30 -127 -358 -130 63 -190 163 -465 53 150 -167 373 160 -56 45 12 -167 516 -250 160 226 -263
$$ packed form
2084A30m06R3N24l09k96O62n75M22N7n82O33k02l81M33l07k50O72o79M18J96j82
2105G1P4J21n19L36R6k67M82m34j81P95m67l75P72o74r1L47j70J44l79o1L73n9
2127f6n31R68n48J1P08p59K15N61j041P51q5n16M81l52m4M69m75J40L91o09J87
2148a44R4k19L62J76q16P65j88k65R43n77l2K07n30K35J70o54P22m1q43R07n83
2169c11p4N64j31J87M8n97O21K5l88K77l12K54j56J58j60L29n42mL06o01O46l3
2191A06n58O24j24n20P78l10k68M74p00O74K12n58N20k09j2K30j85m78L04j18
2211a18j04J98l48K75K97n69L95j36j03M02Q5l79N88m76J86P1m91L68j10j65J64
2232C0j57k31K28J93k53L53o28N18R7l17N40k13k16J01l3j79O83p66M10O6m89
$$ plain form
2253 -263 194 157 -363 131 -129 -411 -60 -193 -1 432 39 -128 294 -144 457 164 -194 475 -33 -101 468
2274 468 -69 -48 93 15 -86 -121 -527 7 186 -335 203 28 -299 463 106 -212 428 -45 -139 317 59
2295 59 258 151 -153 425 82 -209 280 -150 41 183 -179 138 371 -382 -33 221 -179 313 20 -204
2315 -204 336 -170 19 229 -417 -264 -115 -224 -129 234 -525 162 -59 -416 124 -111 42 233 -224 99
2335 99 396 -188 14 247 -168 222 -219 -40 152 -329 -299 412 -591 -19 -28 -313 192 35 -156 365 -189
2356 -189 153 305 -114 -53 23 -57 146 234 -254 233 102 -116 218 -66 -110 138 66 -156 -22 47 106 268 -13
2379 -13 451 37 -276 264 -147 -95 514 -29 27 152 -314 209 -44 -482 -48 -112 -34 121 -121 111 554 -133
2401 -133 52 321 35 106 -15 -48 366 73 -17 158 -252 -73 318 -197 40 -215 -457 -22 -67 -163 352 -20
$$ packed form
2253b63M57l7n20M94k60k82L51j33J92M33l93j67M22m38O01k93l58O69n08o8N69
2274D68n37K1J41p8j01l5m06N34J79n21N38j75l27P62l57l18O40m73r4M56k58
2295E9J99j07l04N78l43k91M89m30J91J42l62L17K33p53L49K54m00M92k93k24
2315b04N40n06J89K10o46J53J49j09R5L63p59O87k21l57N40k35J53J91m57L23
2335I9K97n84K02K33m15L90m41J79J92m81L0P11j003N72rk85N05j57j91N21n54
2356a89L42J52m19O1P6q0K03Q8m88M87j31k18L34k84m4K48p2k22J34O9N9J62k81
2379a3M64m14l13N40m11N2O09n43N6J25m66N23k53m38M34o4P8J55k42K32M43o87
2401a33J85K69k86P1j21l3M14k93r0J75m10J79L91n15K37k55k42M35m5r6N15l72
$$ plain form
2423 -20 13 266 -76 10 263 -150 250 -107 -235 384 -128 -161 206 -91 -243 -63 -434 -33 77 126 146 67
2445 67 -109 155 -48 100 419 -42 107 166 -208 150 177 -182 1 41 -28 44 -59 -34 187 -146 -154 98 -128
2468 -128 45 350 -371 375 114 130 184 175 -284 -93 -168 -112 145 44 158 47 -384 -80 -179 -286 62 -314
2490 -314 179 339 128 -36 185 -333 215 -41 -271 125 13 -191 -60 -12 -124 -166 -507 54 -67 -132 204
2511 204 84 -140 17 -157 -277 383 -81 140 270 43 -191 -50 -49 -12 184 -284 -12 -92 -329 94 -143
2532 -143 -126 236 -10 355 26 -183 161 -8 43 77 -49 -113 -102 -154 -172 118 -45 143 -231 -2 124 132 -313
2555 -313 -36 -113 15 244 -62 127 265 233 360 234 139 16 -171 -67 292 -55 104 204 -484 -188 -173
2576 -173 -194 159 265 -317 2 113 -20 277 -236 -129 30 -29 268 7 -219 157 156 -208 -85 91 -232
$$ packed form
2423b0L3K53l42Q6K53m13M00l57j28O19n12l3L67k97j52J80l71M01J10M9K0p9
2445F7j76K64k03J48L19m61J49N9l74L58K7l59J83M0o9P2j03K5K21l33qK52k26
2468a28J73L05p21P46k61J6N4rm59J91p5N6K57j01J14j11m31L04r9j07L48l76
2490c14M93J60k11j64K21n18N48k56k30L96j12k04J31M8j12m2l41N61j21o5L36
2511B04j20k24J57j74j20O60m64K21J30k27k34J41JL7J96m68K72q0k37M23k37
2532a43J7L62k46L65l29k09L44j69N1L4j26o4J1n2j8K90j63J88l74K29J26Qm45
2555c13K77p7J28K29l06J89J38l2J27j26r5j23j87J04L59l47J59J00o88K96J5
2576a73k1L53J06n82L19J11j33K97n13J07J59n9K97k61k26L76jl64J23J76l23
$$ plain form
2597 -232 301 -120 148 348 -268 -27 -19 -21 136 -65 33 70 272 -116 217 -162 -1 179 -324 -194 77 70 26
2620 26 -140 -182 -85 -147 164 -368 -243 134 182 -139 346 120 23 26 -257 -241 -157 -173 -187 -12 -118 -267 417 -7
2644 -7 34 136 -100 142 109 -221 139 13 43 250 -273 190 169 -244 26 -106 -269 -77 -175 158 -169 -278
2666 -278 251 23 -96 163 123 -440 372 96 -72 115 -61 27 100 225 30 268 -221 -290 140 70 117 -3
2688 -3 -175 -27 -66 207 157 -341 291 -132 -81 273 -11 88 79 -337 7 161 -237 -100 223 -264 -141 -68 -199
2711 -199 109 -125 92 45 29 -9 120 114 33 -66 -47 -4 30 -26 -82 123 -311 35 53 -85 142 -171 43 170
2735 170 -367 77 -218 -328 -158 139 -132 125 -18 133 240 -283 -13 132 -353 -405 -68 -183 -59 132
2755 132 -20 70 -287 353 351 -163 158 265 -9 226 68 -170 121 -243 -64 159 -202 -141 12 -205 188
$$ packed form
2597b32N33m21K68K00o16K41QkJ57k01R8L7K02l88L33l79J61J80n03J30K71pm4
2620B6j66m2R7o2L11n32J25L77M8l21M85k26r7Lk83J6Q4j6j4J75j06j49O84m24
2644gM1J02k36K42l3l30L60j26L0K07n23M63k1m13K70j32j63J92r8L33l27j09
2666b78N29k28j19K59m0n63Q12k76j68J87j76Q8P3J25j95K38m89o9M30p0M7j20
2688cj72J48l9K73n0m98O32m23N1L54k84R9rm16L44J54l98J37L23m87J23P3j31
2711a99L08k34K17m7j6l8J29oq1r9J9M3L4n6n6K05m34L46J8j38K27l13K14J27
2735A70n37M44k95j10J70K97k71K57j43J51J07n23K70J45m85n2L37j15J24J91
2755A32j52R0l57O40kn14L21J07k74K35j58k38K91l64J79K23l61O1J53k17L93
$$ plain form
2776 188 180 -314 -208 12 -167 -3 -58 223 408 23 94 355 -54 -66 299 -55 357 142 -165 -56 -126 -135 -79
2799 -79 -93 -98 106 -240 94 -33 -116 130 -189 67 94 -75 193 54 -92 -68 310 -309 -11 -110 118 122 -30
2822 -30 31 106 -264 -12 50 3 112 -126 142 149 -34 23 338 -195 -41 292 -17 176 65 -85 -17 143 -240
2845 -240 182 2 -102 211 -191 -80 196 -116 395 352 -9 59 92 -79 239 -304 -349 44 -124 -106 32 -128
2867 -128 -60 9 -145 -79 1 -75 368 -20 -75 132 -334 -211 218 127 -96 -29 94 -139 -57 -30 310 -28 104
2890 104 195 -77 176 -142 -247 67 84 -137 247 7 79 61 74 -34 -103 71 3 95 -203 -66 -90 -35 170
2913 170 -120 -71 193 -154 244 -63 -153 -1 27 -81 -66 -52 -78 296 30 -9 -26 -201 -18 -67 -123 -101 -128 -487
2937 -487 160 -256 -188 -66 53 -11 34 -247 -154 178 -193 -23 91 -130 -7 -266 35 63 -180 245 -57 -249
$$ packed form
2776A88qm94J06K20j79J64n5K81J85l85P1K61m09j2L65l54M12k15l07J09p0rN6
2799g9j4nK04l46L34j27q3K46l19K56K7j69K68j39j46K4L78o19K98r9K28Mj52
2822c0O1P5l70K52O2m7J09k38K68Pj83N7L15n33J54L33l09J93j11j50O8J60l83
2845b40M22j80j04L13m02J11K76l12N11m3l61O8L3j71L18n43m5L93j68J8J38j60
2867a28O8O9j54O6Q0p6M43l88n5K07m66J23M29r1k23O7J23k33Q2K7L40l38J32
2890A04R1k72K53l18j05L14J7k21L84k40P2j8J3j08o9J74o8R2k98J37k4N5K05
2913A70k90M9K64l47L98l07r0J52K8j08J5J4k6L74k66l9j7j75J83m9n6K2k7l59
2937d87O47m16O8J22J19o4M5k81R3L32l71J70J14k21J23k59L01K8k43M25l02j92
$$ plain form
2959 -249 218 80 -46 45 102 -45 38 -153 -132 51 51 32 3 -46 -110 -29 113 325 151 45 220 -296 -158 529
2983 529 -13 -136 44 -129 -98 -209 -74 -64 -103 -66 442 -102 -77 311 -51 -440 -181 -108 24 -121 19 96
3005 96 203 -97 76 96 135 156 -53 115 -38 -12 -122 -92 131 -64 -320 -48 184 112 -411 167 -197 106
3027 106 -16 36 292 60 70 263 -105 15 152 -90 -53 -117 39 147 -182 -220 64 -222 -264 130 -89 62
3049 62 121 18 -70 150 -81 199 133 -145 321 -36 55 99 -67 -25 329 -346 -42 82 -234 20 -129 -238
3071 -238 66 178 45 191 -147 1 288 47 174 180 37 163 7 104 16 -137 -106 -3 12 -407 28 -134
3093 -134 -119 -28 -273 251 -44 -93 393 -162 19 -121 -84 -102 60 -58 -98 -40 -15 81 -71 301 203 -31 151
3116 151 -91 -79 237 113 -93 146 163 38 65 -82 -125 76 -92 -89 -56 -99 30 64 -26 -21 -74 -370 112 -98
$$ packed form
2959b49M67j38j26R1N7j47Q3j91K1J83%j9k9m9o4Q1J42K12j74j06J75n16J38O87
2983E29n42j23J80j73L1j11J35J0l9L7N08n44K5L88l62l89K59P3J32j45J40P7
3005I6J07l00J73K0L9K1k09J68j53K6j10L0K23j95k56K72K32p2n23N78l64L03
3027A06j22N2K56k32J0J93l68J20J37k42L7o4J56J08l29l8K84k86m2L94k19J51
3049F2N9j03q8K20k31K80o6k78M66l57R1M4j66M2L54o75L04J24l16K54j49j09
3071b38L04J12j33J46l38J48K87k41J27Oj43J26j56R7q8j53L1J03J5m19M35j62
3093a34J5R1k45N24k95m9M86n55J81j40L7j8J62j18m0N8K5R6j52L72r8k34J82
3116A51k42J2L16j24k06K39J7j25K7j47m3K01j68LL3m3J29L4r0Nn3k96M82k10
$$ plain form
3140 -98 55 -171 -122 76 132 114 -122 393 -31 -141 -69 71 82 158 132 -70 -5 -156 43 -114 165 342 57
3163 57 48 220 -186 232 40 -228 -12 -2 -360 -146 -157 105 89 -51 -251 -272 -24 -41 -77 37 -46 35 51 -40
3187 -40 161 182 266 155 255 -15 17 -48 -210 19 25 -105 117 -77 -15 29 29 -122 307 -150 13 -59 -241 14
3211 14 -106 -185 78 24 -413 269 114 -209 85 59 236 -82 -23 -120 7 -208 -25 145 -100 117 -79 -117
3233 -117 25 107 -14 117 -143 78 -95 43 -210 117 28 31 -2 -249 73 -383 195 93 25 -39 -218 -374
3255 -374 86 -123 -17 38 24 -35 -65 -238 400 -182 139 249 112 -8 -150 -170 -52 -84 15 21 210 247 186 143
3279 143 -115 131 47 -73 9 -80 -27 214 -93 -178 204 -70 -100 48 11 -84 40 -181 19 -30 -169 -64 -174
3302 -174 234 197 84 -24 175 111 39 -104 79 110 -244 -129 -70 125 -113 -159 130 190 -180 60 -170 -175 113
$$ packed form
3140i8J53k26M9J98N6j8k36N15m24j10P2J40J1P6k6k02O5j51J99j57K79J77k85
3163E7rJ72m06M18j92k68K16J0l58K14j1K62j6j40k00k1K48j7l6J14q3Q1J6r1
3187d0K01K1Q4j11J00k70L2o5j62K29Oj30K22j94O2M4%j51M29m57J63p2j82K55
3211A4j20p9K63n4m37O82j55l23K94k6J77l18N9r7J27k15J83J70k45K17j96l8
3233a17J42Q2j21J31k60K21j73J38k53L27q9Ll3k47L22m56N78j02o8o4j79j56
3255c74M60k09J06N5j4n9l0j73O38n82L21J10j37j20j42k0J18l2R9OJ89L7o1m3
3279A43k58K46q4j20Q2q9N3K41l07q5L82k74l0J48l7r5J24k21K00m9j39J05j10
3302a74M08l7j13j08J99o4p2j43J83L1l54J15N9J95k38m6K89O0l70K40k30nK88
$$ plain form
3325 113 63 43 -121 245 -203 73 183 -207 232 -115 -215 96 -166 84 89 -271 -207 113 -287 8 99 -89
3347 -89 27 65 -210 198 -200 -116 39 -392 -95 -48 -142 -87 -101 -44 -176 38 36 101 -200 -109 316 -72 99 -246
3371 -246 -179 175 185 -119 69 -42 12 -34 -16 14 33 -131 29 -157 -183 134 337 118 125 -151 -104 402 314 58
3395 58 54 -91 15 139 -78 155 211 134 264 -124 15 146 5 212 -42 -202 237 -148 -16 -47 12 128
3417 128 -89 118 -238 -68 -146 -121 169 -181 191 66 -185 230 -112 61 188 130 -78 -138 5 -130 86
3438 86 -55 53 3 -7 -62 26 135 28 82 27 87 46 -26 310 -190 140 -170 152 -28 -125 155 133 -7 132
3462 132 225 44 -49 -66 -238 -40 155 -308 -30 141 146 -183 -162 0 243 43 -64 -13 -10 63 134 126 -64 -101 286
3487 286 173 63 -47 -26 -5 -164 86 -199 -83 -46 17 47 -10 -14 96 -4 -188 118 -72 -1 43 -161 -127 -255
$$ packed form
3325A13n0k0j64L66m48K76J10l90M39l47j00L11k62K50Nl60O4L20m00K95R1j88
3347h9J16L8k75M08l98Q4J55m31K97M7r4N5j4N7j32K14kO5l01R1M25l88J71l45
3371b46O7L54J0l04J88j11N4m6J8L0J9j64J60j86k6L17K03k19Pk76M7N06q8k56
3395E8mj45J06J24k17K33N6p7J30l88J39J31j41K07k54j60M39l85J32l1N9J16
3417A28k17K07l56J70p8K5K90l50L72j25k51M15l42J73J27n8k08o0J43j35K16
3438H6j41J08n0j0n5Q8J09j07N4n5O0m1p2L36n00L30l10L22j80r7K80k2j40J39
3462A32R3j81r3j7j72J98J95m63K78J71Nl29K1J62K43k00j07N1LP3P1qj90l7L87
3487B86j13j10j10K1K1j59K50k85J16L7O3L0n7mJ10j00j84L06j90P1M4k04L4j28
$$ plain form
3511 -255 60 31 67 77 -28 40 -1 -45 -77 102 228 168 -97 -92 17 -12 -68 99 249 210 29 -72 150 37
3535 37 -172 172 206 -64 50 117 207 -277 148 38 -336 147 106 14 124 -216 240 72 -98 -141 -26 61 -10
3558 -10 69 -3 -137 180 -48 -40 265 -62 51 75 203 -137 65 156 168 15 57 -188 110 90 -44 155 89 -116
3582 -116 505 113 -25 116 -354 128 -89 -124 180 -289 31 -35 -135 71 111 -243 -78 154 -245 106 16
3603 16 -229 10 -126 -38 195 -93 52 223 -101 50 8 143 132 -242 249 177 -30 -68 -94 -73 66 -179 28
3626 28 12 -54 -191 -105 64 -134 195 -35 -267 277 193 -221 -261 -40 163 145 21 -97 -155 -19 14 110 -118
3649 -118 183 74 -75 -55 -180 196 -26 171 38 -137 4 107 -191 276 121 -163 293 -10 41 -192 -325
3670 -325 -26 35 16 176 -116 -209 103 -217 176 -123 11 108 -158 -60 -161 229 69 -353 -130 -53 188 -22
$$ packed form
3511b55L15k9L6J0j05O8m1m4l2J79J26o0k65NJ09k9n6J67J50l9j81j01K22j13
3535C7k09L44L4k70J14O7R0m84M25j10l74M83m1r2J10l40M56j68j70m3J15Q7p1
3558a0P9p2j34L17k28QL05l27J13K4J28l40K02R1J2j53M2k45K98k0j34J99o6k05
3582a16O21l92j38J41m70M82k17l5L04m69L20o6j00K06M0l54J65K32l99L51r0
3603A6k45K39j36Q8K33k88J45J71l24J51m2J35j1l74M91p2k07l8k6K1J39k45K07
3626B8j6o6j37Q6J69j98L29k30k32N44q4m14m0K21K03j8j24j18n8J36L3R6k28
3649a18L01j09j49K0j25L76k22J97j33j75J41J03k98M67j55k84M56l03N1k33j33
3670c25K99O1j9J60k92r3L12l20L93k99J34R7k66R8j01L90j60m22K23P7K41k10
$$ plain form
3692 -22 -141 55 242 110 229 -158 -45 135 8 -58 261 185 28 -169 -164 -65 -192 -91 -59 -294 22 98 140
3715 140 159 -40 333 118 35 166 46 -120 -25 155 41 109 72 198 77 -56 -198 -102 -128 250 -333 -56
3737 -56 135 372 -281 -203 -10 -24 2 200 64 134 140 -184 -220 37 108 128 -178 -255 28 -48 -46 26 95 -59 78
3762 78 17 140 75 133 -185 21 113 143 -138 21 -221 -132 67 -146 46 300 66 11 87 -72 272 -96 -114
3785 -114 -387 169 33 -27 -61 -186 93 154 170 -36 -121 186 -118 197 27 -11 64 -53 -125 -6 -291 -29 38
3808 38 201 -3 -75 -101 107 -18 35 54 -14 131 -4 43 -10 -96 268 11 -11 60 -9 -114 -95 -47 78 -114 -53
3833 -53 53 -30 -34 152 -184 -99 -146 186 116 -241 188 -21 -302 -180 77 423 -94 -164 75 155 169 291 -34
3856 -34 -84 173 53 163 -189 8 -83 151 203 -137 60 77 86 170 78 -43 -48 262 151 19 52 -129 -46 -130 248
$$ packed form
3692b2j19J96J87j32J19l87J13J80j27o6L19p6j57j97NR9j27J01L2k35L16P6M2
3715A40J9j99L73k15q3J31j20j66R5J80j14O8l7J26j21j33j42R6k6L78n83K77
3737e6J91K37o53P8J93j4K6J98j36P0Ol24l6K57P1K0l06p7K83p6KP2O9j54J37
3762G8o1J23o5N8l18K06R2L0k81J59k42Q9J99k13J92K54k34n5P6j59L44l68j8
3785a14k73N56j36o0l4j25K79O1J6k06q5L07l04L15j70l8P5j17p2J19k85K62O7
3808C8J63k04p2k6K08j25N3J9o8J45j35M7n3q6L64k57k2P1o9j05J9M8J25j92O1
3833e3J06q3mJ86l36Q5m7L32p0l57M29k09k81J22K57L46n17p0K39Q0J4J22l25
3856c4n0K57j20J10l52J97r1K34N2l40J97J7RQ4r2j21nL10j11j32L3j81Q3q4L78
$$ plain form
3881 248 -176 -179 -97 -37 -97 -20 -259 -75 84 1 63 -340 -226 -146 36 151 142 -61 -7 50 25 6 160 -233 231
3906 231 114 0 99 9 68 -49 20 292 -172 -287 178 273 112 -73 121 61 135 108 -57 123 -200 -101 -169
3929 -169 -28 70 8 -336 -57 166 36 -249 -47 18 -6 -2 -252 -244 -157 53 -77 95 461 -68 -152 -254 211
3952 211 -62 -87 149 -16 95 2 -94 -113 155 166 -45 76 -15 104 -38 20 -180 197 56 22 -50 -66 118
3975 118 15 -119 -72 109 118 250 -183 77 -74 -111 -6 281 -113 10 -15 -40 -50 169 35 -185 -21 -217
3997 -217 117 -54 192 13 61 174 -29 152 121 390 -139 95 -147 155 12 -29 -244 -11 125 -85 250
4018 250 -17 -47 -200 -27 -8 105 133 -31 -238 156 -159 -104 43 194 -2 -24 -3 212 53 -116 -215 -10
4040 -10 155 -49 -17 181 -76 30 35 24 -93 -17 43 5 -386 293 87 -101 -5 -144 167 122 110 -100 97 39
$$ packed form
3881B48m24lQ2O0o0P7k39J84J59q3O2m03J14Q0J82J15rk03N4N7k5j9J54l93M64
3906B31j17j14R9r0N9j17O9K72m64j15M65R5j61j85J94o0P4k7j65J80l23R9o8
3929a69J41R8o2l44K79K23j30k85K02O5k4Mk50QQ7K10j30J72L66n29q4j02M65
3952B11k73k5K36j65J11r3r6j9K68J1k11J21r1J19j42N8k00L77j41l4p2j6J84
3975A18j03j34M7J81RJ32m33K60j51l7J05K87l94J23k5k5j0K19j34k20J64j96
3997b17L34j71K46j79M8J13k03J81l1K69n29K34k42L02j43m1k15K33J36k10L35
4018B50k67l0j53J73J9J13K8j64k07L94l15N5J47J51j96k2K1K15j59j69r9K05
4040a0J65k04L2J98k57J06Nj1j17P6O0l8l91O79k06j88R6j39L11m5j2k10J97n8
$$ plain form
4064 39 -86 -26 -8 -11 23 122 -132 -27 -16 90 232 82 -115 172 -24 64 -58 76 -27 148 49 -238 0
4087 0 -68 217 43 -147 -82 -13 181 48 -98 263 -173 109 -51 -145 -46 44 -103 3 11 10 -75 -131 -9 151 11
4112 11 232 -174 87 113 24 89 27 -147 78 56 -101 -179 132 235 -31 -16 63 -238 -158 257 -45 -83 79 -87
4136 -87 -35 -113 60 73 -176 -193 184 -76 81 205 -127 -55 81 138 79 -253 290 223 125 -181 204 239 -74 61
4160 61 222 70 -269 -219 173 69 -109 -157 143 10 -38 110 132 67 -125 -30 -242 17 88 -173 111 232 -16
4183 -16 252 -100 45 -15 68 -118 -9 -101 90 -163 129 -221 -45 15 109 50 -11 -255 -82 81 27 70 -172
4206 -172 -48 -7 37 -146 -96 -286 -29 -193 242 52 0 -274 9 -14 -210 179 -137 57 337 98 165 36
4228 36 -36 -31 -139 21 71 53 89 -107 -54 -289 171 -221 -89 -269 217 166 -73 204 113 127 -115 -147 -107 254
$$ packed form
4064C9j25O0J8lL4R9k54J05J1J06J42j50j97K87j96Q8j22J34j03J75r9k87K38
4087@o8K85j74j90O5O9J94j33j46L61m36K82j60r4R9R0j47J06Qjq5n6J22J60j40
4112A1K21m06K61K6q9O5o2j74K25k2j57p8L11J03k66J5P9l01Q0M15l02l8J62j66
4136h7N2p8J73J3k49j7L77k60J57J24l32P2J36N7n9l32N43o7r8l06L85L5l13J35
4160F1J61j52l39N0L92j04j78m8L00j33m8J48K2o5j92R5k12K59P1k61K84J21k48
4183a6K68l52J45o0Q3j86J09r2J91k53K92l50J76O0R4n9o1k44J73J63n4M3k42
4206a72J24M1M4j83N0j90K57j64M35j90n2k74K83k3j96L89l16J94K80k39O7j29
4228C6p2Nj08J60N0j8L6j96N3k35M60l92J32j80M86n1k39K77r1J4k42l2M0L61
$$ plain form
4252 254 61 -15 -292 1 -8 14 77 -284 52 88 148 -48 124 93 10 -25 -13 83 146 -131 -75 -89 -66 93 -165
4277 -165 -383 -129 37 179 203 109 148 95 62 265 94 137 -282 196 -161 324 125 218 212 167 -40 -53 -205 -212
4301 -212 -140 40 2 -29 7 -164 -185 -132 -68 -251 73 -70 27 -52 173 -1 129 -5 81 -32 142 51 50 97 113
4326 113 93 -33 -26 -160 -304 37 -163 -68 -188 52 -9 -70 -189 -16 83 -79 -31 -186 -29 41 -71 61 -124
4349 -124 196 -170 -65 30 -308 -86 -132 49 58 -17 -177 17 -33 -178 -169 49 218 128 -100 -146 219 -119 35
4372 35 -93 109 -433 56 -41 338 50 -114 -208 113 -8 -113 -47 -183 -49 -207 27 7 -93 -97 -138 220 72
4395 72 73 -14 -300 -96 -21 203 160 141 -140 -253 -199 -24 -72 -97 -142 54 199 -65 44 55 59 -158 214 -165 -130
4420 -130 -135 218 127 1 -148 -158 -25 76 -18 -227 -52 -75 122 2 23 -180 188 -48 39 -122 -130 185 216 -162
$$ packed form
4252B54j93p6k77K93rK2O3l61L36L6O0j96J72l1q3l5J2R6O3k77N6j4K3J59k58
4277a65k18K54J66J42K4r4L9n3l3K03j71M3m19M78l57M85j99R3om5k07j3j52p
4301b12P2J80l8l1L6j71k1N3O4j83L24j43R7p9K25j74J30j34Q6j13J74r1jM7J6
4326A13k0j26Pj34j44L41k00R5j20K40o1o1j19J73R9j62M8j55J57P0j12J32j85
4349a24L20l66J05R5l38K22m6J81Rp5j60J94n0j45RK18J69r0k28m6L65l38J54
4372C5j28K02n42M89r7L79k88j64r4L21j21j05O6j36J34j58K34k0j00mm1L58j48
4395G2Jq7k86K04P5K24m3j9k81j13N4J75m8k5m5J96J45k64J09J1Mk17L72l79L5
4420a30nL53r1j26j49j0J33J01r4k09J75k3J97j20K1k03L68k36Q7j61qL15L1l78
$$ plain form
4444 -162 48 -212 52 -139 5 68 -166 261 -10 -343 184 137 -162 -9 164 -120 -105 96 143 78 -160 -125
4466 -125 118 -217 67 93 -74 -93 -394 -160 -144 -66 173 -6 77 19 32 154 82 -3 46 -22 -153 19 -131 131
4490 131 100 -187 -44 51 -60 79 -99 -209 176 -148 41 -69 263 -123 -190 20 125 -58 -70 142 -12
4511 -12 -26 157 125 -57 74 -89 -11 -22 -13 -306 -146 11 190 267 47 260 -35 32 -50 52 -51 -34 -189 42
4535 42 -157 -138 142 54 64 12 186 42 -99 -56 -219 -214 -175 190 -23 -116 -132 54 116 -131 156 29 -28 6 -223
4560 -223 -119 47 71 9 -133 31 -146 -271 -29 -64 147 -124 27 209 28 90 -4 -258 128 -80 64 -25
4582 -25 341 -112 -297 -94 -287 -184 36 4 -273 218 130 -92 -139 -87 -39 -37 -212 46 -65 147 38 -149 66
4605 66 55 5 -73 18 -234 -89 61 -16 266 107 -260 -64 33 87 110 42 116 17 211 45 -272 58 -82 -166
$$ packed form
4444a62K10k60K64j91J44O3k34M27k71l33N27m7k99J53J73k84J5K01M7o5k38L5
4466a25K43l35K84K6j67j9l01K34J6P8K39j79Q3n8J3J22p2q5M9o8j31J72j50K62
4490A31l1k87J43R5j11J39j78j10L85l24J89j10L32l86o7K10J05j83j2K12j54
4511a2j4J83l2j82J31j63P8j1Rk93J60J57J79P7k20K13k95O7q2J02j03J7j55K31
4535D2j99J9K80q8J0n2J74j44j41M3j63NL9L65k13r3j6J86O2k47K87j27n7L4k29
4560b23J04J66K4o2j42J64j77j25K42l5K11k71J51J82j81O2r4k54L86k08J44q9
4582b5L66m53j85K03j93J03K20l2k77M91q8k22m7N2M8Kj75K58j11K12j09j87K15
4605F6j1n0p8R1k52J45J50p7K82j59l67J96R7N4K3o8P4r9J94j66l17L30j40q4
$$ plain form
4629 -166 -44 232 -390 51 -69 -347 10 -263 -83 -121 147 243 -16 -136 -26 204 -280 18 375 318 72
4650 72 139 44 64 -261 -280 -156 -13 113 97 -185 -141 -24 121 -3 -5 16 54 170 -8 -102 11 -59 173 -38
4674 -38 189 -109 -251 -13 117 42 -103 196 -209 -52 -134 -66 262 165 79 -123 217 -85 -56 164 -40 -151
4696 -151 141 170 -210 -61 -63 245 57 72 71 -78 -63 138 58 71 33 42 -209 243 52 134 53 -156 119 296 57
4721 57 -230 218 22 21 64 -54 -198 -309 17 65 53 -194 100 -90 -251 65 88 20 -106 -125 -30 -70 49 -119
4745 -119 -7 -312 114 261 113 115 -333 -139 -195 -260 127 71 46 292 259 93 -42 126 -115 -321 -113 187
4767 187 -19 75 334 -96 329 94 215 73 -296 125 33 -181 -89 -191 93 64 42 89 4 102 -28 126 -75
4790 -75 -202 95 68 32 11 -45 -55 -294 32 -259 167 -146 -100 -48 -181 -66 -139 244 -30 155 98 -91 49
$$ packed form
4629a66J22K76o22M41j20k78L57k73J80l8K68R6k59j20J10K30m84K98L57n7k46
4650G2O7r5K0l25j9J24J43J26j6k82M4J17J45j24kK1L8J16j78r4J13p0K32k11
4674c8K27k98j42K38J30p5j45K99m05J57q2O8L28r7q6k02L40l02K9K20k04j11
4696a51K92K9l80J49kL08j88J5jj49J5K01q0J3l8Rk51M52j91Q2q1k09K75J77k39
4721E7k87M48j96jM3j18j44j11L26M8j2k47K94j90j61L16K3o8j26j9R5m0J19j68
4745a19J12l05M26J47j48Km48J94n6o5L87n6k5K46l3j66j35J68k41k06K08L00
4767A87k06R4K59m30M25k35J21j42l69M21r2k14R2j02K84k9k2M7q5R8j30J54k01
4790g5j27K97k7l6k1n6j0k39L26k91M26l13M6N2j33J15p3L83k74J85n7j89J40
$$ plain form
4813 49 105 151 -63 -219 -460 273 8 -138 -79 168 -9 93 90 104 -81 21 79 -41 -40 115 21 232 -104 166
4837 166 -90 170 -67 -88 -174 116 145 63 146 -34 269 -89 -11 -119 212 -106 -111 3 -24 78 110 -183 -103 246
4861 246 54 -38 43 -137 75 186 9 57 -67 -128 -17 -180 187 -72 118 -140 94 -133 -184 51 70 97
4883 97 -195 39 -48 -135 175 -27 -31 -75 64 2 -175 -79 145 41 63 -90 -286 116 -172 25 -87 -237 -112
4906 -112 -118 209 190 -75 -153 143 418 3 -79 142 62 -49 172 -98 -124 -302 -165 114 -149 -58 141 -204 -94
4929 -94 52 -209 176 -200 -114 27 178 -110 -34 -131 52 -368 -164 -140 -23 1 211 -51 -118 168 76 298 -89
4952 -89 -245 -22 -9 -140 -17 124 -11 18 126 -257 -95 88 113 166 -34 -123 -107 56 -190 112 93 -178 130
4975 130 -125 268 125 -203 -42 -115 93 135 -16 44 -233 79 -138 -154 -11 -17 -184 189 120 10 -114 -106 58
$$ packed form
4813D9N6M6k14j56k41P33k65j46N9K47j77J02lJ4j85J02N8j20JJ55r4K11l36K70
4837A66k56K60k37k1q6K90K9q2Q3j80L03l58P8j08L31l18nJ14k7J02L2k93Q0L49
4861B46j92r2Q1j80K12J11j77M8j24o1J11j63L67k59J90k58K34k27n1K35J9K7
4883I7k92K34q7q7L10k02mm4J39o2j77R6K24j04K2j53j96M02k88J97j12j50J25
4906a12oL27j9k65p8K96K75m15q2K21q0j11K21k70k6j78J37K79k63R1J99l45J10
4929i4J46k61L85l76Q6J41J51k88P6r7J83m20K04K4J17K4K10k62o7K86r2K22l87
4952h9j56K23J3j31J23J41j35K9J08l83J62J83K5N3k00q9J6J63k46L02j9k71L08
4975A30k55L93j43l28J61p3K08M2j51O0k77L12k17j6J43oj67L73o9j10j24QJ64
$$ plain form
4998 58 14 -52 -37 -21 -122 -43 172 64 62 224 -271 70 146 -56 -25 -169 -220 -141 270 139 192 -1 -32 203 -44
5023 -44 -69 4 11 -173 -130 126 207 260 104 127 -53 -186 102 -95 -5 102 3 -13 218 -148 -128 -103 79 224 -159
5048 -159 45 -97 -127 98 -63 -52 -141 58 112 -119 -17 -45 -45 45 60 -6 17 84 60 161 123 193 -252 -184 -207 7
5074 7 49 -128 98 132 23 133 -53 114 -132 181 -202 -85 286 17 29 -22 -26 -35 77 36 -118 -184 -76 -142
5098 -142 -183 243 -109 -176 -133 137 -11 184 1 -152 -213 -52 -10 -140 302 -131 128 121 -78 41 27 138 -158
5121 -158 269 105 -42 143 19 -123 -72 -101 -89 131 -73 -86 132 -42 180 91 -23 332 95 217 -52 -109
5143 -109 61 -35 -270 -186 22 131 -21 -109 -71 58 -52 -8 43 -114 -86 196 44 85 11 -232 -89 -142 247
5166 247 52 -265 4 -9 93 12 5 -54 174 -164 -275 -262 51 -192 -79 244 136 99 -28 77 -191 10
$$ packed form
4998E8m4o6J5J6j01P9K15j08kJ62m95L41P6k02L1j44n1P9M11j31N3j93l1K35k47
5023d4k5P3Pj84M3K56Q1N3j56K3j80j33K88j97R0J07r9j6K31l66K0K5J82J45l83
5048a59K04j42l0K25j61J1q9J99N4k31J02k8%R0J5o6K3O7k4J01l8P0m45O8k3K14
5074GM2j77K26L4j09J10j86J67k46L13l83J17L71k69J2n1mrJ12m1j54o6J08o6
5098a42m1M26l52o7M3K70j48J95j83j53o1J61M2j30M42m33K59pj99J19j4J11k96
5121a58M27j64j47J85j24j42N1k9J2K20k04j3K18j74K22q9j14L55k37J22k69n7
5143a09J70r6k35Q4K08J09j52q8L8J29j10M4N1j57K8K82j52M1p4k43J43n3L89
5166B47j95l17K69j3J02q1pn9K28l38j11J3L13k43J13L23j08l7j27J05k68K01
$$ plain form
5188 10 144 -195 -156 -45 9 -141 114 208 -178 156 -27 117 101 -301 233 -154 73 287 86 -73 210 7
5210 7 15 35 -145 146 -255 -24 145 -2 -339 43 -130 -4 261 -336 -99 232 -115 150 -64 101 -37 35
5232 35 -29 -20 -6 -81 185 -70 99 258 104 260 -73 -96 -54 -8 -323 65 -35 -160 89 -94 -95 111 -262 -44
5256 -44 90 31 78 88 139 -36 -13 114 -85 45 -79 97 -157 109 -209 -36 218 -258 -11 -67 -191 -12
5278 -12 -124 -406 134 -115 -97 58 -113 154 113 -90 158 88 81 13 149 -345 -41 -170 -228 98 -258 -26 51
5301 51 -80 -80 106 -24 -193 -180 -113 282 -107 -106 -168 129 202 -2 -54 -115 54 107 140 -422 -117 13 -272 69
5325 69 42 -97 184 -6 236 64 -159 35 -29 16 -7 -89 87 110 240 -144 -256 81 -98 -118 -116 20 211
5348 211 -172 2 -57 -90 187 108 -10 62 54 -124 -166 161 -34 42 -67 72 -256 -103 10 83 -12 39 96 239
$$ packed form
5188A0J34l39L9J11N4j50K55R4l86L34j83J44j6m02N34l87K27K14k01j59K83k03
5210GQK0j80K91m01K31J69j47l37L82j73J26K65n97K37L31l47K65k14J65j38P2
5232C5o4RJ4p5K66k55J69J59j54J56l33k3M2M6l15L88j00j25K49j83jK06l73K18
5256d4J34n9M7J0N1j75K3J27j99J30j24J76k54K66l18J73K54m76K47n6j24J79
5278a2j12k82N40k49J8J55j71K67m1k03K48p0po8J36m94L04j29n8L26l56K32P7
5301E1j31%J86j30j69J3O7L95l89Jo2K97P3k04n2o1J69N3L3n62L05J30k85L41
5325F9k7j39K81j90K42j72k23J94o4M5k3q2J76K3J30l84j12L37j79k0KJ36J91
5348B11l83J74n9l3K77p9j18P2qj78m2L27j95P6j09J39l28J53J13P3r5N1N7J43
$$ plain form
5372 239 -159 -89 217 -79 11 -305 123 -188 -1 30 -70 -139 163 41 57 186 -65 -70 -108 -172 -280 11 -223
5395 -223 16 93 189 -287 -393 -2 -61 -76 282 11 -97 -1 -64 -109 -24 -88 27 -125 40 -52 -122 -35 -11 228
5419 228 -78 -65 -204 -4 -228 183 -26 41 171 154 -57 -7 -181 -141 -87 374 233 15 78 -123 70 313
5441 313 -291 29 243 216 -192 -37 250 -217 -230 -251 20 -44 122 -202 -111 81 -102 -120 -9 -46 11 -193 106
5464 106 -29 12 63 132 -118 -12 88 -176 -85 26 -138 -235 99 20 -96 -9 -31 -18 -155 34 136 -108 138
5487 138 -39 -80 -191 57 -1 -287 -144 -11 57 -53 39 -106 -187 63 -227 26 -84 -28 -50 21 -64 334 221
5510 221 121 68 -23 -19 -200 -31 41 -124 51 -175 -35 -6 -128 116 5 -33 -27 -29 10 -97 -104 60 -18 259 52
5535 52 9 -443 -83 -256 62 92 12 -10 -85 16 -15 -56 12 115 82 -62 -107 211 -63 64 -13 141 148 -16 154
$$ packed form
5372B39l98P0L06k96R0l16M28l11J87L1j00o9L02j22J6J29k51nl8o4j08K91k34
5395b23K39P7R6m76j06L91n9j5L58k71j08R6o3m5Q5o4J15j52J65r2p0Q7K4K39
5419B28l06J3j39K00k24M11k09O7J30j7k11N0j74M0N4M61j41k18O3k01J93K43
5441C13o04L20K14k7m08J55K87m67j3k1K71o4J66l24R1J92j83j8J11l7N7k04K99
5464A06j35M1N1O9k50J06J00k64R1J11j64r7L34p9j16Q7k2J3j37J89J02k44K46
5487A38j77m1j11K48n8k86J43J33O8j10R2j45q1K50k90K53j10N6k2P1q5L98j13
5510B21j00n3r1Mj81J69P2j65J75k26J40K9j22K44j11l8OkL9j07pJ64p8K77k07
5535E2m3m52L60j73L18L0q0k2p5J01l1m1O8J03l3j44m5L18k74J27p7J54Pj64J70
$$ plain form
5560 154 55 13 42 11 75 -201 -217 -125 118 -45 254 -16 10 51 -21 -33 135 -196 147 101 -4 -179 -272 -119
5584 -119 89 63 46 -23 -120 -36 -154 -59 34 93 -14 -115 -54 153 154 107 63 29 -70 117 97 -177 -186 228 -39 -144
5610 -144 102 331 -161 -27 -191 174 25 -202 -19 -125 -311 -41 -58 -24 17 161 203 203 76 38 -56 158 127
5633 127 -8 116 231 -221 -222 210 -315 60 -74 -83 -45 21 -40 -122 -48 -86 -110 -256 -20 -97 16 -46 -225 -331
5657 -331 -28 9 27 141 31 -30 -108 -10 454 169 -197 -34 -81 -127 -248 140 -224 185 -145 47 122 -86 64
5680 64 17 -108 -5 -180 -61 12 191 -193 131 75 -52 -35 236 203 32 -155 -97 -345 27 247 -136 -103 191
5703 191 -109 -201 -37 -206 119 64 106 -123 175 -183 118 -267 -86 224 -58 207 -54 124 192 -227 -68
5724 -68 22 79 85 105 82 85 165 106 -11 -167 -7 159 -241 159 181 99 -66 142 108 -203 243 -36 132 -116 -206
$$ packed form
5560A54r9m2K9l1O4k76j6R2K43j63K99k70K6M1p2j2J68l31L43m6j05j75r3J53
5584a19K08k6j7o9r7Q4j18R5R3N9j07j01O1K07Jm7m4l4r9J87k0k74rM14k67j05
5610a44K46K29m92J34j64L65j49k27J83j06j86K70j7L4M1J44M2%j27l8r4K14l1
5633A27j35J24J15m52jM32n25L75j34rL8O6o1q2P4l8k4j46K36p7J13o2j79j06
5657c31L03L7J8J14j10o1p8R8M64k85l66J63m7m6j21L88l64M09l30J92P5k08J50
5680F4m7j25J03j75J19P3J79l84L24n6j27J7K71l3j71j87N8k48L72K20l83L3K94
5703A91l00r2J64j69L25n5M2k29K98l58L01l85J81L10k82K65k61J78O8m19J59
5724f8R0N7OK0k3LQ0n9j17j56J60J66m00M00K2q2j65K08l4l11M46k79J68k48r0
$$ plain form
5749 -206 -35 -19 -282 146 280 -164 136 -185 -32 -48 -394 -62 -49 190 31 110 52 -107 322 -59 178 -324
5771 -324 271 -29 -59 -74 166 39 251 -310 -85 -251 40 -47 58 -144 45 -59 -235 109 65 -296 80
5792 80 193 45 28 -181 153 74 -9 128 120 -196 188 74 -33 -20 -242 -115 0 201 57 77 1 298 -123
5815 -123 292 166 -40 -46 -2 -44 -32 10 -71 166 -264 81 -198 1 -10 -111 86 190 96 -130 -120 36 -90
5838 -90 100 48 -196 108 33 -160 -109 -42 -142 -79 -31 -125 -70 36 -144 -65 -230 241 49 31 100 -58 -98 15
5862 15 14 -15 128 -138 -43 63 205 101 102 125 -28 126 5 251 -43 -66 367 182 208 -26 -12 -123 -54 -78
5886 -78 -16 84 -143 279 223 222 366 -104 -117 74 110 24 -100 249 265 118 -74 25 -30 -94 -45 321 166 -45
5910 -45 -102 9 -53 -114 -270 80 -47 -189 -371 82 -23 232 194 234 -8 -148 -272 -114 224 -3 2 -200 -35
$$ packed form
5749b06J71J6k63M28J34m44L00l21J53j6l46L32J3K39j59P9n8j59M29l81K37n02
5771c24N95l00l0j5K40j27K12n61K25j66K91q7J05k02J89j04j76L44m4l61L76
5792H0J13j48j7k09L34p9q3J37ql16L84j14j07J3k22J27J15K01j44K0p6K97m21
5815a23M15j26k06oM4m2J2M2q1K37m30L45k79J99j1j01J97J04r4k26J0J56j26
5838i0J90n2k44L04p5j93N1O7j00O3M8r4N5J06j80P9j65M71j92j8O9j58m0J13
5862A5jk9J43k66R5J06J42j04JK3j53J54j21K46k94k3M33j85K6k34J4j11O9k4
5886g8O2J00k27M22n6jJ44m70j3J91L6q6j24L49J6j47j92R9n5o4M9L66j55k11
5910d5n7J11o2o1j56L50j27j42j82M53j05K55l8M0k42j40j24J58L38k27Nk02J65
$$ plain form
5933 -35 170 105 -42 -59 112 151 101 24 110 86 -215 183 108 6 -146 74 55 -272 -112 347 -169 -142 99 10
5957 10 52 8 94 -36 3 -200 62 -89 -31 -134 183 149 -85 31 -24 183 54 138 -247 95 -157 115 30
5980 30 -12 111 -145 -275 116 -52 -238 -143 -131 21 247 -218 -133 -221 -22 180 39 6 -210 -192 -231 71 -3
6003 -3 61 -32 48 -51 -121 139 -68 83 58 144 50 145 210 56 54 -29 -192 65 1 31 303 18 22 16 -197 -186 -52
6030 -52 -127 125 53 92 79 -186 73 -54 -279 -91 138 175 -24 3 -8 -130 -60 -99 -81 13 113 66 -145 12
6054 12 -117 -144 -220 -38 -77 145 160 83 125 -9 23 68 -288 50 60 -93 27 234 130 15 72 18 174 -160
6078 -160 -326 81 -149 -214 76 -105 120 67 -95 -62 -121 -260 118 35 -31 -25 -39 108 79 -57 -26 37 -389 40
6102 40 -268 -68 216 -15 30 72 -147 -155 72 -100 -179 21 -30 120 100 -99 37 119 -12 72 7 41 127 122 68
$$ packed form
5933c5K05o5j47j7J71L9n0p7Q6k4l01L98p5j02j52K20j9l27J60M59n16K7K41q9
5957A0M2m4Q6j30L9k03K62j51N8j03L17l4k34J16n5K07j29Q4l85L42k52K72q5
5980C0m2J23k56j30L91j68j86R5J2J52K26m65Q5q8J99K02j41l3k16J8l9L02p4
6003cO4r3Q0r9p0K60k07J51k5Q6r4R5O5j54kq3j63K57o4L0K72k85Mok13J1J34
6030e2p5K52p2L9j3k65K59j27k25J88K29L7j99K7j1j22P0l9J8R4J00m7k11J57
6054A2j29k7p6J82l9K22J5p7M2j34L2M5l56L38J0j53J20K07j04j15N7n4J56l34
6078a60j66M07k30o5K90j81K25n3j62L3n9j39L78q3o6Oj4J47k9j36L1O3m26M29
6102D0l08K00K84k31M5M2k19qK27j72p9K00n1J50k0j99J36Q2j31Q4o5L4Q6nn4
$$ plain form
6127 68 -61 88 119 -13 -106 -12 -53 268 -31 90 -145 56 -99 -41 -89 4 114 -129 -2 -218 209 -128 182
6150 182 -225 9 -146 -26 -149 -17 198 68 -49 124 161 59 -119 38 -311 161 57 72 15 -340 -192
6171 -192 -8 29 -178 157 -26 -124 94 144 202 -58 -251 351 36 -63 -35 -98 190 -18 -53 -92 112 8 7 -151
6195 -151 -38 187 93 196 -66 -140 -171 360 11 0 32 -180 41 -36 -35 11 -158 -123 486 117 51 311 -212 226
6219 226 9 169 -33 27 94 -88 73 -228 -136 138 97 -48 140 128 -105 -150 -351 -145 -151 -89 -57 -33 -256 231
6243 231 283 140 -31 138 48 -248 -67 26 -69 -46 116 -167 91 -62 22 43 156 -165 101 240 -138 -377
6265 -377 -155 -102 24 70 -30 -60 60 -98 130 48 29 85 274 -28 267 -86 92 21 -167 -160 39 147 -122
6288 -122 -56 70 26 -147 259 -101 255 -112 -191 -41 179 231 -116 47 36 -79 -28 79 -229 3 158 54
$$ packed form
6127F8j29J49L1j32r3R4m1L21k99J21k35K01j55N8m8R3J10k43J27k16M27l37L10
6150A82m07K34j55J20j23J32K15j30j17J73L7j02j78J57l49M72j04J5n7l55J48
6171a92J84L7k07L35j83r8K18N0N8k60j93O02l15r9K8o3K88k08l5l9K04j04jj58
6195a51J13K25r4J03k62p4l1N31l49j1L2k12K21p7JM6j69L5O09l69o6K60n23M38
6219B26k17J60k02O0O7j82J61l01R2K74m1j45J88j2k33m5k01K06oO2L2K4k23M87
6243B31N2j43j71J69r0k96J81R3r5K3J62k83K58j53Q4K1J13l21K66J39l78k39
6265c77K22N3J26M6j00l0J20j58K28q2j9N6J89l02K95l53J78p1j88PJ99J08k69
6288a22O6J26m4j73M06l60L56l67p9J50K20N2l47J63j1j15N1J07l08K32J55j04
$$ plain form
6310 54 130 304 248 33 48 -183 -274 45 -139 -140 -38 25 -44 189 147 69 68 -85 68 146 -56 175 -205 150 -14
6335 -14 295 252 95 -53 65 -177 -38 -88 -108 36 -3 146 55 -43 -330 -138 -10 -44 78 -113 117 126 39 25
6359 25 -47 265 -354 -169 -175 70 -58 17 75 195 45 -95 120 37 136 -135 -200 -21 -9 169 -82 129 216 189
6383 189 -45 17 -189 91 -203 6 -34 -75 5 -129 261 -168 -206 -159 -7 -49 -146 29 -182 154 90 -72 -5
6406 -5 60 -2 14 -224 -198 -70 -168 27 167 69 228 -12 33 55 -3 -52 267 163 -226 -64 115 -81 74 -105
6430 -105 67 136 -43 102 156 -11 111 -21 -397 -8 -44 -4 -68 17 -88 -93 181 152 18 -160 280 72 40
6453 40 -122 7 11 15 -20 157 170 -319 -34 -134 37 -26 58 129 73 -17 18 15 -94 -338 -29 -90 -137 -97 198 93
6479 93 -74 -35 156 202 343 77 6 68 170 243 -121 -191 -165 71 -174 16 20 -38 150 103 -182 48 -83 -187
$$ packed form
6310E4P6J74n6k15J5k31r1L19j84jJ02O3o9K33m2p8jj53J53P8k02K31l80L55j64
6335a4L09m3j57j48J18k42J39n0k0J44l9J49r1r8k87J92J28l4J22j91K30Rq7j4
6359B5p2L12o19J85oK45j28P5N8J20j50j40K15q3R9k71o5J79J2J78k51K11Q7k7
6383A89k34O2k06K80k94K09m0m1Q0j34L90m29l8M7J52m2r7J75k11L36o4j62O7
6406eO5o2J6k38K6J28r8J95J40r8J59k40M5K2n8m9L19j04l89J62J79j96J55j79
6430a05J72O9j79J45N4j67J22j32l76L89l6M0o4Q5j05nK74k9j34j78M40k08l2
6453D0j62J29MMl5J77J3m89K85j00J71o3Q4P1n6r0L5lj09k44L09o1m7M0K95j05
6479I3j67L9J91M6J41k66p1O2J02P3l64p0K6K36k45J90Mn8J88m7k85K30j31j04
$$ plain form
6503 -187 176 -9 171 11 85 73 67 -213 -96 -54 -109 41 -163 -262 -213 222 -27 50 272 95 -48 110 42
6526 42 -85 61 -50 369 -5 46 -84 -31 -42 110 133 236 -37 36 -200 78 115 -229 -36 -13 -36 100 194
6549 194 -245 -183 -69 -162 137 69 242 -103 -91 -189 215 25 4 -58 -12 -89 -113 -107 -204 -59 -161 4 -68 134 -1
6574 -1 26 -125 -16 -17 -5 -266 247 119 258 6 -305 -94 -68 19 -160 -11 67 138 85 -124 182 -105 -82 217
6598 217 100 134 170 -92 -36 30 131 -185 209 -215 -61 -61 70 92 -57 -131 -207 -330 -213 -1 -26 -174 -159 128
6622 128 -47 -76 122 67 142 8 133 9 -125 154 -55 -77 135 -412 33 157 -104 -27 127 -172 132 93
6644 93 -115 37 91 -151 151 -23 114 110 32 5 24 -145 -146 22 50 130 116 -102 48 -45 -139 94 -222 63 -75
6669 -75 -45 19 37 231 52 21 126 -144 -166 -221 205 115 -31 78 -180 140 183 -51 -99 -167 63 -15 144 225
$$ packed form
6503a87L63j85J80j60P4j2ok80J17M2n5J50k04r9M9M35k49P7K22j77j43J58o8
6526D2j27J46j11M19l74N1j30N3j1J52K3J03k73P3k36K78L7l44J93K3k3J36R4
6549A94m39O2J14r3K99o8J73l45J2r8M04j90k1o2M6p7k4Or7J45j02J65p2K02j35
6574aK7j51J09jJ2k61N13j28J39k52l11K11K6Q7j79J49P8P1n3k09L06k87K3K99
6598B17j17L4L6k62N6O6J01l16L94m24J54%J31K2j49p4p6j23J17K12k5j48J5K87
6622A28j75k9J98n5P5j34J25j24j34K79k09k2K12n47M45J24k61P7J54k99L04l9
6644I3k08J52N4k42L02j74J37mp8k7J9j69jJ68K8Q0j4k18J50r3r4K33l16K85j38
6669g5L0O4J8J94j79l1J05k70k2n5M26r0j46J09k58L20M3k34m8o8K30p8J59Q1
$$ plain form
6693 225 -127 -172 -217 -79 -40 -234 -287 104 20 -114 -75 11 155 180 164 94 -18 182 -17 -212 -78 24 -39 -68
6717 -68 25 -38 35 217 7 -17 17 -143 8 8 -166 -49 -155 143 125 -12 -155 163 -264 288 -196 -15 -140
6740 -140 201 -52 -278 70 -96 97 172 -92 142 177 -119 -67 -123 35 85 59 -34 150 107 367 120 153 63
6763 63 3 86 193 21 -106 167 -96 -181 72 3 42 150 -128 -178 172 2 286 289 -212 153 143 117 6 87
6787 87 -305 103 69 196 -46 148 -70 -63 158 -73 149 -27 164 -63 -337 -271 -83 79 44 66 -60 -92 108
6810 108 -77 -18 79 49 128 197 47 -267 109 -164 16 81 -104 -111 -73 -223 61 -68 65 83 96 13 126 -249
6834 -249 78 157 -71 -8 -83 14 -61 -162 241 155 -129 75 -234 153 74 -194 -64 56 268 -160 54 289
6856 289 168 -60 -106 182 19 128 -23 -254 61 200 -59 -58 104 -189 133 98 -73 -29 72 -240 86 37
$$ packed form
6693B25l52m5m5J38L9j94n3L91q4j34L9Q6J44K5j6p0j12K00j99j95J34J02o3k9
6717f8R3o3P3J82k10k4L4j60J51%j74J17j06K98j8j37j43L18m27N52m84J81j25
6740a40L41k53k26L48j66J93P5k64K34L5k96N2n6J58N0k6r3J84m3K60k47L3r0
6763F3o0Q3J07j72j27K73k63q5K53o9L9J08k78n0L50j70K84Ln01L65j0k6j11Q1
6787H7l92M08l4J27k42J94k18PK21k31K22j76J91k27k74O6J88J62l5K2j26l2K00
6810A08j85N9R7l0P9O9j50l14L76k73J80O5j85pL8j50K84j29J33J8J3q3J13l75
6834b49L27P9k28O3p5R7p5j01M03q6k84K04l09L87p9k68J30J20K12m28K14K35
6856B89j21k28m6K88j63J09j51k31L15J39k59JJ62k93L22l5j71M4J01l12L26m9
$$ plain form
6878 37 42 135 133 63 262 205 -8 -15 -53 22 178 -159 -326 21 65 -17 74 -22 101 193 174 177 85 107 14 77 -121 10
6906 10 -73 7 105 -336 -150 -47 -57 4 -101 45 -41 -76 -126 166 70 -197 -206 -133 197 169 -145 10 -18 34 -133
6931 -133 -87 -177 35 35 -40 129 179 -6 158 -63 49 171 312 96 -134 140 -48 -44 -110 362 219 -307 238
6954 238 -61 -46 -173 103 -52 246 295 -16 -48 -103 -303 -34 149 5 -97 341 -50 178 -215 2 68 -83
6976 -83 -290 11 38 -237 5 -21 70 276 -148 -16 214 -110 138 166 4 -42 194 101 313 202 52 251
6998 251 -73 -158 229 249 19 1 -126 -45 -304 -83 180 18 40 109 -100 -127 6 -265 -146 31 -44 57 -38
7021 -38 214 -11 -181 279 216 5 -73 47 -11 -10 144 76 -121 -221 -176 147 114 -196 140 -19 252 104 -114
7044 -114 -38 -34 159 -280 -34 -205 -116 -143 33 68 -135 -159 -93 20 -74 293 38 157 128 -199 -161 10 -172 150
$$ packed form
6878C7NR3kp0J99n7k13pl8P5J56l37j67L47M4q2R1r6J23R2j9Lr2K2r3O3j98J31
6906A0q3Q0R8m41J86J03j0O1j05J46q6l5n0K92r6k67rP3L30k8l14J55k8N2j67
6931a33M6r0K12%p5J69N0j85J64k21J12J22J41k16k30K74j88Mo6M72j43n26N45
6954B38k99J5j27K76j55K98M9l11l2n5k00K69J83j44j02M38l91K28l93K17O6j51
6976h3k07L01K7k75K42k6R1K06m24J32K30l24K48K8j62m6K36r3K12j11j50J99
6998B51l24q5L87K0k30j8j27Q1k59K21K63j62K2O9k09k7J33k71J19J77p5J01r5
7021c8K52k25j70M60o3k11p8J20n8JJ54o8j97j00M5L23l3l10L36j59K71j48k18
7044a14P6MJ93m39K46j71Q9k7J76L5k03k4O6J13r4L67k55J19k9l27L8J71j82L22
$$ plain form
7068 150 235 -134 51 83 215 -68 94 321 76 -139 -8 106 197 -232 -14 -57 -296 5 -289 198 -144
7089 -144 -126 51 -54 -48 73 156 126 -70 12 -284 461 -169 -39 -50 -57 32 118 35 -150 -47 201 44 -13 114
7113 114 -98 -28 156 44 92 0 -229 22 146 22 224 442 161 -222 36 -129 164 -9 272 -83 -152
7134 -152 -14 64 -317 17 234 0 -20 24 -2 26 -123 55 -158 -67 -18 -48 -87 -173 222 -19 68 -158 -74 -191
7158 -191 -103 -129 310 165 35 23 -211 20 201 32 -185 -330 -29 155 224 48 92 -72 -212 -154 72 -112
7180 -112 -85 98 35 -9 -5 -166 210 -17 139 -152 142 78 305 -108 170 -63 -68 -30 -49 -104 11 180 175 85 147
7205 147 -85 60 218 -168 29 67 -217 -80 3 47 258 -216 189 215 -245 -220 202 -9 -176 141 200 -164
7227 -164 -22 -164 59 -215 -46 -70 0 -38 236 100 158 24 -81 -93 -199 101 -109 67 -32 -86 -83 -35 -86 27
$$ packed form
7068A50Q5l69J85L2J32k83J62K27k45k15J31J14R1m29K18m3k39L01k94M87l42
7089a44J8J77j05OJ21Q3l0j96Q2k96P45o30J30j1pQ9Q6q3j85J03K48j57n7J27
7113A14k12P0J84j12M8r2k29K51J24j24K02K18k81l83K58j65K93j73K81l55o9
7134a52J38P8l81L34K17k34k0M4k6K8j49J78k13R1M9l0l9q6L95k41Q7k26Q4j17
7158a91Q8k6M39j45j30j2k34K31J81j69k17j45L01J84O9j76M4j64j40N8K26j84
7180a12K7J83o3m4Mj61L76k27J56k91K94o4K27m13K78k33nL8j9n5J15J69nr0O2
7205A47k32J45J58l86J97L8k84J37Q3M4K11m74M05K6m60K5M22k11j67L17N9l64
7227a64J42j42K23k74J69k4P0l8K74j36N8j34j05j2j06L00k10J76r9n4LM8n1J13
$$ plain form
7251 27 32 22 -168 51 17 14 -304 144 105 -112 176 -303 -28 242 -35 -45 -50 -105 -73 -153 -67 60 119 106 -213 15
7277 15 43 76 242 29 -66 -39 -111 133 -43 27 66 -319 81 90 -114 117 -68 16 -48 -108 102 -47 -195 -39
7301 -39 -65 -24 297 -24 -225 193 -29 281 6 -494 -12 222 0 16 -99 -187 -90 54 87 40 106 -170 327
7324 327 -78 -226 -27 106 38 74 -2 -51 106 128 87 -141 90 325 91 -89 99 22 -74 124 170 80 170 -74
7348 -74 102 -37 209 415 240 -34 -137 -58 95 131 39 15 -70 258 -39 198 79 -152 -95 63 5 -167 -22
7371 -22 -256 0 -152 -19 -84 8 -69 36 -5 194 -169 2 -85 -100 36 -106 56 -88 168 -180 -179 159 149
7394 149 113 80 163 -160 -289 124 78 84 -105 212 74 -150 -10 196 184 -271 18 -326 -85 119 264 130
7416 130 -163 -181 4 41 -340 156 34 7 -115 -79 -50 -265 -106 -16 -112 77 -37 216 50 78 55 -55 -104
$$ packed form
7251B7Nj0j90K19l4ll18M48l9k17K88m79K75K70k77j0nn5L2q0Q6J27N9j3l19K28
7277A5K8L3J66k13r5K7p2K44j76P0L9l85M00Rk04K31j85Q4o4o0K10j49j48J56
7301c9k6M1L21l21k01M18k22L10k75n00M82K34k22J6j15q8R7J44L3m7O6k76M97
7324C27m05j48J99J33o8L6p6m9J57K2m1k28K31K35k34j80J88p7r6J98M6r0R0k44
7348g4J76j39K46K06j75k74j03P9J53L6r2k4q5L28k97K37j19k31N7J58n8j72J45
7371b2k34K56j52J33o5R2p7J05m1J99l63J71q7j5J36j42J62j44K56l48JL38j0
7394A49l6l3Q3l23j29M13m6Oj89L17j38k24J40K06j2m55K89l44K41K04J45j34
7416A30k93j8J85L7l81M96j22k7j22L6K9k15J59R0r6J89j14K53j66K8k3j10m9
$$ plain form
7439 -104 143 236 114 -49 198 205 -53 234 -80 -121 11 1 125 15 -259 89 25 120 18 69 -245 22 142
7462 142 205 143 -349 86 -138 -202 -126 -111 111 41 41 -68 175 243 -166 -85 176 18 118 92 54 -9 -65 0 33
7487 33 -5 67 -134 -48 88 33 -36 -47 17 132 118 -230 55 312 35 -201 189 219 -3 188 51 49 66 -33 100
7512 100 89 114 24 139 -140 223 -147 -187 146 70 27 27 -44 207 10 -238 85 -117 8 -147 -182 -173 -25 1
7536 1 249 127 224 -42 -98 -116 68 -55 10 -129 57 50 153 -99 -9 -137 -73 -159 256 90 -189 86 221 -118
7560 -118 142 98 29 -107 76 -158 -8 209 351 62 99 315 -62 153 236 -113 -10 61 -97 -35 184 -109
7582 -109 -124 17 -100 80 117 149 -211 2 -123 -78 305 -80 -160 10 286 -38 133 -142 -4 -170 71 157
7604 157 -268 -99 40 222 -104 -197 -104 16 36 27 -252 3 -90 156 -145 -98 -318 67 -21 3 18 -345 -54
$$ packed form
7439a04K47R3j22j63K47Pk58K87l14m1J32j0J24j10k74L48o4R5j02N1l14K67J20
7462A42O3o2m92M35k24o4P6J5K22p0%j09K43O8m09Q1K61j58J00k6l8o3n6O5L3
7487C3l8P2k01Q6J36n5o9j1O4J15j4l48K85K57k77k36L90L0k22J91j37kJ7r9J33
7512A00j1K5r0J15k79L63l70m0L33p6m3%p1K51j97k48L23k02J25j55l5RJ48K6
7536AK48j22R7k66n6j8J84j23O5j39J86pJ03k52R0j28O4q6M15j66k79K75J35l39
7560a18K60m4o9j36J83k34J50K17J42k89L7K16l77K15Q3l49J03P1j58O2K19k93
7582a09j5J41j17J80L7L2l60K13j25M5L83l85q0J70K76l24J71k75J38j66K41Q6
7604A57m25J69J39J82l26r3R3J20K0rk79K55r3K46l01M7k20L85q8K4J5l63K91
$$ plain form
7627 -54 13 -120 -169 -66 85 41 -184 -90 207 176 26 160 -30 292 152 -114 112 -14 -43 98 -124 -77 26
7650 26 -206 -26 -52 -56 87 -29 -320 108 376 -130 183 -19 -36 -321 -19 -176 31 -58 282 -50 59 10
7672 10 -165 -346 -45 -25 84 -6 12 33 113 15 5 142 -178 210 152 -22 257 47 -201 201 -51 306 -222
7695 -222 -79 -87 -74 27 -306 -47 -214 60 -72 120 -209 -127 -131 143 -55 224 192 -33 31 -383 12 305 27
7718 27 -82 -57 291 -45 128 -210 -142 -122 -189 -268 111 321 -195 -148 312 99 -138 -34 1 31 -89 -24 -33 -71
7742 -71 -64 -5 -55 -299 34 184 -99 179 118 19 189 14 100 119 -154 -172 -16 137 -62 152 -83 217 -166
7765 -166 283 -147 -7 160 67 72 101 19 104 47 -205 123 56 -43 -384 0 -53 256 -60 -39 80 -111 -120 442
7789 442 -142 43 7 237 -58 75 -42 103 -107 225 -23 23 112 -184 -134 -279 75 -92 -290 -295 -214 50
$$ packed form
7627e4O7j33m9J03J51m4k25R4K97l1j50J34j90L22j40k66K26j26k9J41k22M7J03
7650B6k32J80k6mJ43j16k91M28K68n06L13k02j7k85L02j57K07q9L40l32J09m9
7672A0j75j81L01K0J09r0J8K1Q0r8j0J37l20L88n8j74K79k10k48M02k52L57n28
7695b22J43qJ3J01l33K59j67K74j32J92l29Q2mK74j98K79l2k25O4m14L95K93k78
7718B7j09K5L48l36J73l38O8K0o7p9L79K10n16M7M60k13k37J04L5L0j20O5rl8
7742g1PN9n0k44L33J50k83K78o1r9J70j75Q6J9k73j8J56J53j99K14k35L00l83
7765a66M49m30J40J67r3NK9q2Q5n7k52L28o7r9l41L84n3L09l16K1J19j91rN62
7789D42n84J85l6K30k95J33j17J45k10L32k48M6Q9k96N0j45L54j67j98nQ1K64
$$ plain form
7811 50 -104 198 206 -159 -54 31 -235 102 -88 -36 164 -80 -15 -11 -22 -160 -4 -140 133 -97 137 104 -90
7834 -90 99 242 36 42 -158 42 220 -110 124 45 257 -16 -192 146 218 209 -80 -73 -53 37 43 57 -103 -114 -29
7859 -29 98 164 -97 -86 -64 15 282 73 28 -150 -90 195 241 -85 -207 69 -143 -201 65 145 -137 -15 65 182
7883 182 -120 -249 -95 96 112 -25 -118 -151 -165 -132 -119 261 -191 64 181 -15 -151 -104 -224 195 -303 48
7905 48 -25 107 -90 115 191 -100 -7 253 -69 -61 15 46 -104 -232 75 -28 -241 71 337 133 1 -1 10 -21
7929 -21 -35 173 21 50 52 -50 93 -285 129 178 -194 -134 -81 53 273 -28 -87 -62 223 -64 39 -177 191
7952 191 156 76 135 -94 0 -49 -54 191 119 86 83 145 15 -393 -182 415 -136 -136 -180 -35 -86 -224 132 196 -84 143
7978 143 -107 67 -149 56 -105 -217 4 18 14 -80 -200 -134 -171 -238 -1 -69 -41 -346 49 -125 300 -162 159
$$ packed form
7811E0j54L02Ql65J05Q5k66L37j90N2K00k44O5Mj1j38J56j36K73k30K34l3j94
7834i0J89J43k06Ok00K00J78l30K34p9K12k73j76L38P2rk89PK0R0OJ4j60j1Q5
7859b9J27O6k61J1K2P9K67k09m5j78O0K85M6l26j22K76k12n8K66Q0k82J22Q0J17
7883A82l02j29J54J91J6j37r3l3j4L3J3L80m52K55J17j96j36M7j20M19m98L51
7905D8p3J32j97K05P6k91R3K60l22QP6L1j50j28L07j03k13L12K66k04j32kJ1l1
7929b1j4K08j52K9Kj02J43l78M14M9l72O0N3J34K20l01n9K5K85k87J03k16L68
7952A91l5q0N9k29R4m9nK45p2l3lO2j30m08K11N97n51%m4J45n1j38L56O4k80K27
7978A43k50J74k16K05j61j12K21J4mr4j20O6l7o7K37o8K8l05L95j74M25m62L21
$$ plain form
8001 159 -6 -110 -139 -140 73 -211 -46 222 -83 -77 244 360 -64 -49 -196 -60 196 128 91 -217 -38 43 191
8024 191 -88 -197 -44 72 427 -49 -168 -10 -128 247 48 28 -22 -99 -171 173 18 -313 307 99 105 33
8046 33 -50 -265 153 -4 126 78 39 -236 10 49 -75 296 39 12 85 20 38 50 145 202 -92 -267 68 107
8070 107 -76 247 51 -162 163 106 9 -71 -247 -115 -45 215 -69 56 -79 141 -53 -124 -248 -17 -68 235
8092 235 327 188 -92 49 22 -156 61 65 -76 -135 -216 61 115 64 62 -203 -45 45 53 0 18 38 216 -86 -58 167
8118 167 68 73 -91 36 50 128 35 81 -217 -203 228 -91 -77 103 -141 -58 -162 83 -76 -136 43 149 -161 -33
8142 -33 -307 -113 198 14 -28 -90 326 -35 136 5 -28 159 18 -10 -29 -39 -52 -156 -6 -11 -148 -77 105 116
8166 116 -23 -98 223 116 400 -140 -13 -18 -33 31 -38 29 22 122 -156 -251 148 143 121 -60 -135 -136 -47 -2 282
$$ packed form
8001A59j65j04k9jK13k84J65K68l05OL21J16m24J5j47J36K56o8l7l08J79Q1J48
8024A91k79j09J53J16L55m76j19J58j18L75j99k0n0p7p2L44j55l31O20k08Op2
8046C3q3k15M18j57J30m8l9k75K46L9j24L71k57k7P3o5J8J2R5N7k94j75L35L9
8070A07j83L23j96k13L25n7r7q0j76J32P0K60k84J25j35K20j94p1j24K31n1L03
8092B35R2j39k80J41k7j78K17Mj41n9q1K77N4n1kk65J58R0Qn3J8K0J78l02K8K25
8118A67r9Nj64J27J4P8r3M6k98J4M31l19J4J80k44Q3j04K45j59o0J79J06l10J28
8142c3k74J94L11j84m2o2M16l61J71j31l3J87j41k8j9j0j3j04J50nj37P1J82J1
8166A16j39p5L21j07K84n40J27nj5O4o9O7pJ00k78r5L99nk2j81p5jQ9M5K84
8191B82
$$ Imaginary data points
##PAGE= N=2
##DATA TABLE= (X++(I..I)), XYDATA
$$ plain form
0 0 0 0 0 0 0 0 0 0 0 0 0 0 8 -8 8 -8 9 -16 16 -24 24 -32 40 -41 48 -57 71 -80 94 -104 120 -137 158 -177
34 -177 200 -225 254 -286 318 -357 397 -439 487 -542 599 -661 732 -805 888 -978 1077 -1186
52 -1186 1308 -1443 1594 -1765 1958 -2180 2439 -2744 3107 -3551 4110 -4839 5826 -7253 9505
67 9505 -13616 23555 -103805 -19376 188198 24769 -86903 -43470 57166 6661 -46174
78 -46174 9534 37068 -29039 15594 69574 7716 -72863 -37928 56028 49049 -63353 -43276
90 -43276 56893 38394 -35198 -45370 -12868 23241 12803 12810 24723 -25291 -49329 9775 35517
103 35517 17138 -5945 -13683 10605 7713 -15695 -269 -3719 -8843 26553 21966 -20065 -37076
116 -37076 -19590 29835 27381 -28458 -16161 23201 11165 -7160 -15592 -4089 13001 4047 18204
$$ packed form
0@%%%%%%%%%%%%Qj6J6j6J7k5L2m0M8n6P2q1Q9j05J28j51J74j98K24k57K95l35
34a77L77m25M79n40O04o75P54q36R26j029J141j260J393j537J693j866K055k263
52a186K494k751L037l359L723m138M619n183N851o658P661q949J0665j3079J6758
67I505k3121L7171j27360Q4429K07574j63429j11672M3433J00636n0505n2835
78d6174N5708K7534o6107M4633N3980o1858q0579L4935R3956o979j12402K0077
90d3276J00169j8499p3592j0172L2502L6109j0438PJ1913n0014k4038N9104K5742
103C5517j8379k3083p738K4288k892k3408J5426l450n124L5396m587m2031j7011
116c7076J7486M9425k454n5839J2297L9362j2036j8325q432J1503J7090q954J4157
$$ plain form
129 18204 21807 -30798 -29350 26123 23431 -18365 -29896 12704 43064 -16085 -50701 1891 22378
142 22378 2270 1682 4684 1338 -16238 -12862 28800 19077 -21157 -3479 17598 3703 -11184
155 -11184 -13379 10109 13576 -15697 -6482 10109 -6991 -8125 -449 1540 4053 -6558 2175 17531
169 17531 -5232 -14065 2908 6614 13216 6817 -8939 -2507 -3416 -4141 8419 -551 -5837 3178
183 3178 -4128 -4877 -4201 -8890 9207 11365 -6516 -1441 1281 258 5392 -2760 1714 10095 -1508
198 -1508 863 2252 -11489 -3151 4945 595 794 -7069 -4135 6610 -7455 -8782 5605 3929
212 3929 6170 2600 -6517 3012 1750 -3347 8192 3833 -1642 4067 -2542 -2973 -3463 -9666 5369
227 5369 8909 -6400 -3454 -3497 -5475 3856 -231 1569 7785 -2464 466 5693 -4696 384 4599
$$ packed form
129A8204L603n2605J448N5473k692m1796j1531M2600L0360n9149l4616N2592K0487
142B2378k0108n88L002l346j7576L376M1662r723m0234J7678K1077j3895j4887
155a1184k195K3488L467k9273R215J6591j7100j134P676J989K513j0611Q733J5356
169A7531k2763q833J6973L706O602o399j5756O432r09p25J2560q970n286R015
183C178p306p49O76m689J8097K158j7881N075K722j023N134q152M474Q381j1603
198a508K371J389j3741Q338Q096m350J99p863K934J0745j4065j327J4387j676
212C929K241l570r117R529j262n097J1539m359n475N709o609m31m90o203J5035
227E369L540j5309K946m3j978R331m087J800O216j0249K930N227j0389N080M215
$$ plain form
242 4599 536 6071 -3115 -7160 4709 -2096 -5276 123 -5782 1104 5691 -3758 -514 -3841 -6408
257 -6408 9246 6164 -912 4631 -2327 -1547 4400 -2873 2477 5001 -3166 1555 -3267 -9045 3936
272 3936 1392 -4046 1492 -5432 -1474 5879 -1565 1716 907 -5805 6026 6421 -1139 4656 -1577
287 -1577 -3867 3068 -3555 887 5284 -5549 -2284 -1337 -7732 2468 2940 -2078 3252 -4760 -3819
302 -3819 7542 937 1893 4026 -5012 1607 4621 -1056 5341 -1056 -7394 1315 -2544 -1243 5460
317 5460 -4167 -3217 219 -7130 1760 5512 -816 3019 -1869 -3966 6656 1275 583 5489 -4454
332 -4454 -2186 4137 -1221 2223 -1321 -7354 1317 -1447 -3197 5218 -1564 -4380 925 -3094 2326
347 2326 5389 -1305 3857 1052 -5279 3297 2680 -49 4158 -3682 -2667 2706 -4426 17 2540
$$ packed form
242D599m063N535r186m045J1869o805l180N399n905O886M587r449L244l327k567
257f408J5654l082p076N543o958P80N947p273N350K524q167M721m822n778J2981
272C936k544n438N538o924L958P353p444L281q09o712J1831L95p560N795o233
287a577k290O935o623M442M397j0833L265R47o395J0200M72n018N330q012R41
302c819J1361o605R56K133r038O619L014n677O397o397o338Q709l859J301O703
317E460r627R50L436p349Q890L752o328L835m888k097J0622n381o92M906r943
332d454K268O323n358L444l544o033Q671k764j750Q415o782k816N305m019N420
347B326L063o694N162k805o331Q576o17k729M207p840J015N373p132M443K523
$$ plain form
362 2540 -5570 -1198 -212 -2579 4068 -1098 -2528 4708 -1574 -611 5114 27 2695 1582 -4822 1859
378 1859 1370 -2055 4136 -1532 -5281 -900 -3673 975 4089 -4431 -883 1335 -3092 3051 2362 -50
394 -50 3856 -1297 -875 4835 -1225 772 3098 -3628 -744 -371 -2780 3087 -1057 -5613 -212 -1597
410 -1597 675 3705 -1954 -716 1286 -2477 3794 3944 -1273 2289 -238 -1396 3044 -1538 -770 2244
426 2244 -3616 -1607 -289 -3362 2062 273 -3611 799 -1073 -367 4309 -485 26 2041 -1653 2906
442 2906 3045 -2084 720 -651 -1757 2247 -2110 -2413 1268 -2420 -1183 0 -3175 1299 1741 -2011
458 -2011 2125 -166 -1097 3889 641 630 2277 -2037 974 2565 -2280 382 -722 -2627 2278 -1715
474 -1715 -3551 1253 -1470 -526 1449 -2171 840 1599 -1348 3396 1234 -2117 3019 614 87 2060
$$ packed form
362B540q110M372R86k367O647n166j430P236o282R63N725n087K668j113o404O681
378A859m89l425O191n668l749M381k773M648L114q520L548K218m427O143o89k412
394e0L906n153M22N710o060J997K326o726K884L73k409N867m144m556N401j385
410a597K272L030n659J238K002l763O271J50n217L562k527j158M440m582P68L014
426B244n860K009J318l073N424j789l884M410j872P06M676m794N11K015l694M559
442B906J39n129K804j371j106M004m357l03L681l688J237J183l175M474M42l752
458b011M136k291r31M986l248j1J647m314L011J591m845K662j104j905M905l993
474a715j836M804k723R44J975l620L011P59k947M744k162l351N136k405n27J973
$$ plain form
490 2060 -2702 -552 1967 -2919 -400 -468 -2878 1365 -1245 -2725 2207 -1162 -634 3720 -577 92
506 92 1337 -1485 3885 2030 -2549 1550 -182 -1114 2186 -2335 -1173 1453 -3330 -714 895 -3159
522 -3159 959 301 -1662 2400 -1312 -856 4670 115 -689 1804 -1710 2128 2291 -2469 874 -788
538 -788 -3198 1822 -806 -1895 805 -3164 -503 2059 -2844 1227 2600 -1430 1807 -11 -719 4142
554 4142 -33 -893 2704 -2737 -83 2200 -2610 -411 -1241 -3461 1981 39 -2501 1891 -1374 -1135
570 -1135 2577 -928 1404 2931 -1437 1775 1072 -1922 2992 843 -1626 1389 -2762 -1367 1782
585 1782 -2284 -464 508 -3508 971 1198 -1986 2009 -138 -615 2871 -612 980 3423 -1894 229
601 229 1287 -2148 1576 1183 -2180 863 -2649 -2667 2346 -1069 -729 1070 -2600 633 2014 -1802
$$ packed form
490B060m762K150K519m886K519o8k410M243k610j480M932l369N28M354m297O69
506I2J245k822N370j855m579M099j732r32L300m521J162K626m783K616J609m054
522c159M118o58j963M062l712M56N526m555q04K493l514L838J63m760L343j662
538g88k410N020k628j089K700l969K661K562m903M071J373m030L237j818p08M861
554D142m175q60L597n441K654K283m810K199q30k220N442j942k540M392l265K39
570a135L712l505K332J527m368L212p03k994M914k149k469L015m151J395L149
585A782m066J820R72m016M479K27l184L995k147m77L486l483J592K443n317K123
601B29J058l435L724l93l363L043l512j8N013l415L40J799l670L233J381l816
$$ plain form
617 -1802 2383 1174 -1182 2552 226 -492 2122 -1244 -438 1125 -2860 16 1169 -2213 7 -1993
633 -1993 -2470 2785 8 -975 1977 -1725 4 1928 -274 2177 1225 -1695 1938 144 -1793 1496
649 1496 -666 -641 343 -2815 -485 1046 -2015 268 -235 -1859 2187 933 -213 2349 -892 -142
665 -142 2590 -263 884 1178 -1711 528 -268 -2271 1148 -798 -988 742 -2149 -1167 1218 -897
681 -897 1040 880 -1583 2022 1282 -456 1996 13 -345 2103 -631 -39 989 -2437 -161 -7 -1999
698 -1999 638 -710 -1109 1091 -1610 -873 2243 -338 725 1421 -1036 1382 888 -685 2226 -569
714 -569 -1310 1314 -1148 -1106 263 -1665 -61 86 -2133 565 -19 -992 1379 -314 -237 2047 20
731 20 829 2004 -1212 811 1364 -1365 1013 -487 -1670 1074 -1190 -979 431 -1855 37 877 -1968
$$ packed form
617a802M185j209k356L734k326p18K614l366Q06J563l985K876J153l382K220k000
633a993m77N255k777r83K952l702J729J924k202K451r52k920L633j794j937L289
649A496k162K5R84l158K330J531l061K283n03j624M046j254j146K562l241P50
665a42K732k853J147K94k889K239p96k003L419j946j90J730k891R82K385k115
681h97J937j60k463L605p40j738K452j983l58K448k734N92J028l426K276J54j992
698a999K637j348l99K200k701P37L116k581J063O96k457K418m94j573K911k795
714e69p41K624k462M2J369j928J604J47k219K698n84r73K371j693P7K284k027
731B0Q09J175l216K023N53k729K378j500j183K744k264K11J410k286J892Q40k845
$$ plain form
748 -1968 630 903 -697 1824 420 -357 1979 -522 301 1956 -1113 411 823 -1833 403 -596
764 -596 -2228 1031 -755 -1303 1186 -1345 -390 1264 -1114 1065 1682 -1087 1914 772 -1289 1785
780 1785 -419 -356 1680 -1629 -543 662 -2041 -9 -12 -1852 1170 -230 -1658 1659 -609 -599 2097
797 2097 -47 800 1634 -1495 1227 1033 -1539 1294 134 -1514 766 -1593 -1193 1031 -1965 -274
813 -274 1030 -1891 827 900 -1220 1390 212 -324 2443 -172 131 1829 -1640 -180 1465 -1292
829 -1292 471 -335 -1854 938 -1427 -1588 1820 -974 -385 1548 -1142 549 1305 -728 1917 640
845 640 -1519 1966 244 -716 1096 -1280 -544 996 -2091 -104 420 -2107 431 41 -1002 1749
861 1749 -709 -746 2248 -623 -8 1656 -751 1211 782 -1880 1275 66 -1792 705 -846 -1679
$$ packed form
748a968K598K73j600K521j404p77K336k501Q23J655l069J524M12k656K236r99
764e96j632L259j786n48K489k531R55J654k378K179O17k769L001j142k061L074
780A785k204O3K036l309J086J205k703K032lj840L022j400j428L317k268J0K696
797B097k144Q47Q34l129K722j94k572K833j160j648K280k359M00K224k996J691
813b74J304k921K718P3k120K610j178n36K767k615L03J698l469J460J645k757
829a292J763q06j519K792k365j61L408k794N89J933k690J691P56k033K645j277
845F40k159L485j722r60J812k376P36J540l087J987N24k527K538l90j043K751
861A749k458l7K994k871O15J664k407J962m29k662L155j209j858K497j551q33
$$ plain form
877 -1679 276 -1526 68 910 -2030 480 1317 -773 1176 564 -201 1825 -380 27 1937 -1486
893 -1486 -146 1324 -1451 -143 48 -1390 943 -605 -1437 915 -1031 -223 1900 -813 150 1105
909 1105 -711 1469 641 -817 1500 -221 -807 1194 -881 -568 556 -1549 -17 56 -1829 342
925 342 52 -1323 879 -270 3 1368 -524 70 1206 -906 1093 837 -826 690 -593 -962 1377
942 1377 -577 -1085 445 -1150 -454 302 -1462 1007 870 -1310 1293 502 -331 1368 97 340 1225
959 1225 -1126 452 1161 -1332 175 -266 -1012 359 -903 -957 723 -1169 -506 1065 -683 631 747
976 747 -715 1483 352 -554 1422 -25 -90 776 -1142 -508 414 -1651 327 -164 -1438 333 -304
993 -304 -838 1001 -653 -445 1473 -596 440 963 -901 850 826 -984 852 -257 -764 634 -1164
$$ packed form
877a679J955j802J594Q42k940K510Q37k090J949o12p65K026k205M07J910l423
893a486J340J470k775J308J91j438K333j548q32K352j946Q08K123k713R63R55
909A105j816K180q28j458K317j721n86K001k075L13J124k105J532P3j885K171
925C42k90j375K202j149K73J365j892N94J136k112J999k56j663J516j283l69K339
942A377j954n08J530j595O96P56j764K469j37k180K603p91q33J699j271K43Q85
959A225k351J578P09k493J507m41p46J371j262n4J680j892O63J571j748J314J16
976G47j462K198j131r06J976j447o5Q66j918O34R22k065J978m91j274J771o37
993c04n34J839j654K08J918k069J036N23j864J751k4j810J836j109n07J398j798
$$ plain form
1010 -1164 -856 586 -1131 -94 336 -1224 413 346 -780 1338 81 -537 1532 -88 440 1271 -856
1027 -856 653 345 -1150 437 -314 -1281 409 -856 -737 912 -1228 21 955 -670 582 739 -748
1044 -748 1425 213 -853 1403 -191 -71 1000 -1135 -320 580 -1482 229 38 -1720 587 -201
1060 -201 -906 861 -546 -31 1232 -618 565 1142 -658 1038 740 -962 1153 -135 -1028 1188
1076 1188 -1189 -977 578 -1112 -135 659 -1268 551 371 -727 1038 -99 -193 1666 -453 137 1230
1093 1230 -796 496 646 -1169 620 -399 -1372 765 -360 -754 852 -1119 -180 799 -692 352
1109 352 437 -537 1077 484 -304 1503 -595 -336 1305 -880 -309 224 -1189 41 152 -1654 476
1126 476 -305 -1096 444 -591 -3 1039 -558 364 1083 -580 678 881 -818 644 -130 -578 977
$$ packed form
1010a164L08J442j717J037M30j560J637o7j126K118j257o18K069j620N28Q31k127
1027h56J509l08j495J587p51r67J690j265J19J649k140J249R34j625J252J57j487
1044g48K173j212j066K256j594J20J071k135Q15R00k062J711j91j758K307p88
1060b01p05J767j407N15J263j850J183N77j800J696k98j702K115j288q93K216
1076A188k377K12J555j690R77P94j927J819j80j098J765j137r4J859k119N90J093
1093A230k026J292J50j815J789j019r73K137j125l94J606j971R39R79j491J044
1109C52Q5r74J614n93p88J807k098K59J641k185N71N33j413J230J11j806K130
1126D76p81p91J540j035N88J042j597R22P19j663J258K03j699J462p74m48J555
$$ plain form
1143 977 -838 -726 580 -953 -246 278 -927 286 450 -777 912 252 -273 1145 -214 -36 952
1160 952 -542 124 566 -1012 461 -181 -1170 392 -705 -845 627 -871 100 777 -838 286 801
1177 801 -407 1065 318 -566 1220 -116 -313 1099 -817 -267 247 -1342 -118 -3 -1105 376 -248
1194 -248 -719 808 -210 -99 823 -410 577 914 -781 686 424 -518 690 -75 -760 470 -749
1211 -749 -476 296 -1014 -10 64 -904 340 110 -710 873 47 -41 1083 -46 312 773 -625 270
1229 270 447 -734 373 208 -856 274 -517 -619 347 -969 30 457 -548 529 500 -157 975 322
1247 322 -97 1130 -188 -49 867 -797 -242 406 -978 287 -71 -1023 322 -289 -491 595 -322 25
1265 25 892 -396 273 873 -638 933 199 -559 834 -257 -606 528 -845 -454 432 -1044 174
$$ packed form
1143I77j815J12J306j533P07N24j205J213J64j227J689o60n25J418j359J78R88
1160I52j494O66M42j578J473o42r89J562j097j40J472j498R71O77j615J124N15
1177H01j208J472p47q84J786j336j97J412j916N50N14j589J224J15j102J481o24
1194b48m71J527j018J11R22j233R87L37j695J467k62r42J208p65o85J230j219
1211g49K73P72j310J004P4r68J244k30q20J583q26q8J124j129L58M61j398Q95
1229B70J77j181J107j65j064J130p91j02R66j316R99M27j005J077k9o57J132o53
1247C22m19J227j318J39R16j664N55O48j384J265l58r52J345o11k02J086r17L47
1265B5Q67j288O69O00j511J571p34p58J393j091l49J134j373L91Q86j476J218
$$ plain form
1282 174 298 -1065 597 201 -621 722 -57 66 1019 -431 547 729 -911 514 -2 -781 362 -525
1300 -525 -944 189 -726 -799 702 -772 155 588 -715 497 391 -445 1124 164 -261 830 -253 -173
1318 -173 570 -803 -48 144 -767 110 -107 -835 447 -398 -545 607 -430 -172 826 -385 288 871
1336 871 -714 679 362 -661 717 -384 -750 528 -782 -460 367 -1162 26 219 -875 410
1352 410 88 -809 449 195 -29 980 45 278 804 -585 545 361 -945 178 -301 -824 151 -545
1370 -545 -486 335 -1089 -130 440 -626 166 281 -584 780 279 -315 972 -72 -399 801 -433 89
1388 89 357 -871 108 -1 -960 82 -208 -699 614 -537 11 1013 -220 541 707 -278 485 357
1406 357 -587 624 69 -477 528 -395 -621 348 -587 10 243 -663 296 167 -395 617 -88 -36 827
$$ packed form
1282A74J24j363J662l96q22J343p79J23R53j450R78J82j640J425n16p79J143q87
1300e25m19J133r15p3J501j474R27M33j303J212j06q36J569r60m25J091j083Q0
1318a73P43j373P55J92r11Q77k17p28J282q45j47J152j037K58R98j211O73N83
1336H71j585J393l17j023J378j101l66J278j310L22Q27j529J188J93j094J285
1352D10l22q97J258k54k24J009r35K33N26j389J130j84j306J123m79n23R75o96
1370e45N9Q21j424R59N70j066P92J15q65J364n01n94J287j044l27J200j234N22
1388H9K68j228R79j09r59J042k90m91J313j151N48J002j233P61J66r85P63j28
1406C57r44J211n55n46J005r23k26R69r35N97K33r06R59j29n62J012p05N2Q63
$$ plain form
1425 827 -184 39 833 -286 350 312 -434 660 -156 -718 180 -607 -405 375 -727 -42 371 -464 450
1444 450 141 -319 589 273 -368 855 -3 -125 401 -696 49 62 -476 217 147 -352 268 -343 -384 582
1464 582 -397 -101 348 -109 191 605 -329 233 288 -425 401 44 -310 152 -565 -400 194 -563 -139 158
1484 158 -642 251 -79 -458 607 143 150 711 -109 31 696 -254 350 220 -823 462 56 -681 178 -639
1504 -639 -563 245 -223 18 289 -418 655 321 -367 821 66 -192 785 9 33 776 -513 17 361 -686
1524 -686 50 -331 -647 381 -542 -426 674 -617 -397 434 -336 310 564 -443 519 390 -340 590 -144
1543 -144 -351 338 -568 -389 372 -745 -14 -8 -641 442 -91 -356 528 -6 -115 916 42 340 475 -305
1563 -305 156 -74 -575 500 -332 -626 519 -601 -123 276 -665 -135 498 -556 503 63 -419 509
$$ packed form
1425H27j011K23P94j119O36l8p46J094q16n62Q98p87K02P80j102O85M13q35R14
1444D50l09m60R08l16o41J223q58j22N26j097P45J3n38O93p0m99O20o11m1R66
1464E82r79K96M49m57L00M14r34N62N5p13Q26l57l54M62p17J65N94p57M24K97
1484A58q00Q93l30l79J065m64PN61q20J40O65r50O04j30j043J285m06p37Q59q17
1504f39P6Q08m68K41K71p07J073l34o88J188p55k58R77p76K4P43j289N30L44j047
1524f86P36l81l16J028r23J16J100j291K20Q31p70O46K54j007R62j29p30R30p34
1543a44k07O89r06J79P61j117P31Oo33J083n33k65Q84n34j09J031q74K98J35p80
1563c05M61k30n01J075q32k94J145j120M78L99r41N30O33j054J059m40m82R28
$$ plain form
1581 509 194 -231 668 -291 -77 695 -583 10 96 -873 102 -81 -666 437 -176 -320 459 -286 -200 532
1601 532 -517 115 516 -255 584 456 -405 471 -57 -265 196 -682 -129 148 -547 64 -23 -631 325 200
1621 200 -251 363 -194 -75 825 -333 20 406 -368 225 245 -311 262 -52 -637 324 -358 -277 506 -454
1641 -454 -44 179 -643 193 479 -378 384 28 -26 703 -47 -4 295 -366 -11 2 -619 160 -102 -610 173
1662 173 -343 -312 234 -241 -79 419 -274 513 350 -208 322 319 -226 235 164 -601 542 -231 -103 214 -631
1683 -631 -225 12 -420 58 84 -540 529 191 -37 348 118 61 399 -115 319 72 -457 330 26 -257
1703 -257 74 -366 -322 179 -468 -187 158 -542 188 228 -413 494 232 -106 463 105 -64 631 -186 -125 60
1724 60 -484 -30 -161 -390 -76 6 -469 499 -107 -169 260 -130 8 520 -83 245 249 -136 532 -3 -340 438
$$ packed form
1581E09l15m25Q99r59K14P72j278N93Q6r69R75j83n85J103o13j44P79p45Q6P32
1601E32j049O32M01p71Q39j28q61Q76n28k08M61q78N53K77o95O11q7o08R56j25
1621B00m51O14n57J19R00j158L53L86p74N93K0n56N73l14n85R61o82Q1P83r60
1641d54M10K23q22Q36K86q57P62l56n4P29p50M3K99o61L55J3o21P79k62n08P83
1662A73n16L1N46m75J62M98o93P87j63n58N30ln45M61p1p65J143p73J28L17q45
1683f31M06K37m32M78K6o24J069l38k28L85k30n7L38n14M34k47n29P87l04k83
1703b57L31m40M4N01o47K81L45p00P30M0o41R07k62l38N69l58j69O95q17O1J85
1724F0n44M54j31k29L14Q2m75R68o06o2M29l90J38N12o03L28Ml85O68n35l37P78
$$ plain form
1746 438 -419 -397 386 -584 138 98 -426 186 -1 -343 208 -220 -28 491 84 133 525 -49 298 222 -355
1767 -355 209 -123 -470 57 -263 -110 302 -287 205 163 -543 50 92 -121 449 10 65 594 -137 -16 582
1788 582 -232 26 -21 -773 -17 -68 -561 4 -243 -347 482 -250 35 320 -363 309 360 -45 249 443 -117
1809 -117 424 -71 -134 66 -365 -213 5 -357 121 -30 -703 200 -150 -570 411 -176 -218 161 -255 316 576
1830 576 -261 272 212 -516 187 -140 -393 279 -434 -247 244 -186 121 150 -521 52 132 -152 399 174 -46
1851 -46 533 -39 -95 286 -439 20 184 -480 -76 -93 -466 415 -230 -186 246 -353 -58 413 -221 403 333 -299
1873 -299 176 -102 -243 518 -70 -114 557 -587 -370 43 -619 -52 167 -307 459 -10 -141 596 221 153
1893 153 496 -66 90 539 -264 401 264 -162 112 -158 -551 -182 -336 -442 355 -216 -178 348 -463 374
$$ packed form
1746D38q57K2P83r70P22m0n24O12j87l42N51m28J92N19m07M9L92n74L47p6n77
1767c55N64l32l47N27l20J53M12n89M92m2p06N93M2k13N70m39N5N29p31J21N98
1788E82q14K58m7p52P56n1m93N65k47j04Q29p32K85K85o83O72N1m05K94J94n60
1809a17N41m95o3K00m31J52K18l62M78j51o73R03l50m20R81n87m2L79m16N71K60
1830E76q37N33o0p28P03l27k53O72p13J87M91m30L07K9o71N73Q0k84N51k25k20
1851d6N79n72n6L81p25M59J64o64M04j7l73Q81o45M4M32n99K95M71o34O24p0o32
1873b99M75k78j41P61n88m4O71j144K17M13o62N67K19m74P66m69j31P37l75o8
1893A53L43n62J56M49q03O65j37m26K74k70l93L69j54j06P97n71L8N26q11Q37
$$ plain form
1913 374 294 -100 508 -173 34 300 -10 -177 482 -401 -46 210 -470 153 12 -644 275 3 -257 270
1933 270 -299 23 151 -484 322 409 -337 421 124 -448 237 38 -331 230 -124 -198 255 -375 -6 425 -432
1954 -432 288 163 -544 282 -88 -6 209 -274 61 215 -354 90 239 -361 -31 -149 -456 514 -176 -68
1974 -68 245 -281 -73 298 -387 308 107 -3 457 -127 -91 391 -49 58 157 -227 15 366 -270 134 -105
1995 -105 -470 137 -333 -294 420 -276 242 209 -146 125 251 -58 218 218 -24 256 -96 -46 105 -396 20 -181
2017 -181 -666 101 111 -312 193 -130 -33 579 30 -255 277 -193 243 11 -149 329 154 -454 90 -16 -382
2038 -382 236 -153 90 162 -690 -3 138 -264 427 87 -253 546 111 -49 650 -72 5 580 -284 192 269
2059 269 -274 218 -298 -309 311 -131 -251 259 -635 -37 265 -90 151 439 -202 117 -106 6 277 -133
$$ packed form
1913C74q0l94O08o81K07K66l10j67O59q83L55K56o80O23j41o56R19k72k60N27
1933B70n69L22J28o35Q06Q7p46P58k97n72O85j99l69N61l54p4M53o30L69M31q57
1954d32P20j25p07Q26l70Q2K15m83L35J54n69M44J49o00L30j18l07R70o90J08
1974f8L13n26K08L71o85O95k01j10M60n84L6M82m40J07R9l84K42L51o36M04k39
1995a05l65O07m70L9P14o96N18l3l55K71J26l09K76%k42K80l52N0J51n01M16k01
2017a81m85P67J0m23N05l23R7O12n49k85N32m70M36k32j60M78j75o08N44j06l66
2038c82O18l89K43P2q52O87J41m02O91l40l40P99m35j60O99p22P7N75q64M76P7
2059B69n43M92n16j1O20m42j20N10q94N98L02l55K41K88o41L19k23J12K71m10
$$ plain form
2079 -133 3 116 -280 41 -122 -523 100 -143 -312 327 101 -145 262 -51 26 554 -114 53 484 -234
2099 -234 252 126 41 100 -115 -208 454 -167 -36 73 -286 72 -61 -596 116 271 -259 148 -190 -291 517
2120 517 -189 6 341 -350 -47 139 -177 129 -115 -297 355 -368 -374 299 -244 -189 265 -13 130 405 -143
2141 -143 525 92 -389 427 243 -278 382 -385 -238 34 -488 -81 -63 -476 78 -66 -150 247 -30 -47 472
2162 472 -103 136 401 -251 541 326 -207 83 -52 -100 219 -557 -165 397 -310 -64 173 -140 342 66
2182 66 -347 187 -121 -69 -19 185 -1 344 -234 269 85 -329 -64 -112 -232 247 -248 -262 156 -326 -223 231
2204 231 -104 328 205 -225 138 57 36 312 91 -19 -55 -90 115 -138 -303 332 -19 -432 139 -72 -242
2225 -242 350 -271 10 114 -129 293 496 -211 303 -81 -169 155 -311 -116 10 -195 -358 -34 -428 -210
$$ packed form
2079a33J36J13l96L21j63m01O23k43j69O39k26k46M07l13P7N28o68J67M31p18
2099b34M86j26q5N9k15r3O62o21J31J09l59L58j33n35P12J55n30M07l38j01Q08
2120E17p06J95L35o91L03J86l16L06k44j82O52p23oO73n43N5M54k78J43K75n48
2141a43O68m33m81Q16j84n21O60p67J47K72n22M07J8m13N54j44q4L97k77j7N19
2162D72n75K39K65o52P92k15n33K90j35m8L19p76L92N62p07K46K37l13M82k76
2182F6m13N34l08N2N0K04j86L45n78N03j84m14K65m8j20M79m95j4M18m82J03M54
2204B31l35M32j23m30L63q1k1K76k21j10l6l5K05k53j65O35l51m13N71k11j70
2225b42N92o21K81J04k43M22K03p07N14l84q8L24m66J95J26k05j63L24l94K18
$$ plain form
2245 -210 60 -290 154 87 -78 0 94 29 355 -341 -183 231 -447 96 359 -236 -39 -279 7 55 -208 -70
2267 -70 -64 -253 -36 58 -445 228 23 -231 379 46 -153 316 -485 149 459 -246 -63 241 -545 514 -180
2288 -180 -303 197 -78 88 584 -302 -168 392 -45 75 42 -220 239 143 -304 495 -242 -177 154 -501 -236
2309 -236 176 -345 58 -14 -113 430 23 -16 317 59 -37 366 25 115 255 -96 173 -56 -468 0 121 -198
2331 -198 77 -210 -366 69 -442 53 119 -162 297 12 70 258 181 -220 213 -196 117 82 -214 -98 87
2352 87 -384 140 60 -348 318 -113 -50 179 -239 263 466 -145 157 8 -377 360 60 -360 304 -6 312
2373 312 428 -272 -165 111 -100 327 -44 -20 40 144 -374 380 -296 -284 347 -177 85 49 -175 20 193
2394 193 -58 222 -224 -145 97 -260 -392 -55 -301 17 109 -222 71 1 -120 136 31 -228 192 27 13
$$ packed form
2245b10K70l50M44o7j65P8R4o5L26o96J58M14o78N43K63n95J97k40K86M8k63J38
2267g0Oj89K17R4n03O73k05k54O10l33j99M69q01O34L10p05J83L04p86J059o94
2288a80j23N00k75J66M96q86J34N60m37J20l3k62M59r6m47P99p37O5L31o55K65
2309b36M12n21M03p2r9N43m07l9L33k58r6M03l41R0J40l51K69k29m12M68J21l19
2331a98K75k87j56M35n11M95O6k81M59k85N8J88p7m01M33m09L13l5k96J16J85
2352H7m71N24q0m08O66m31O3K29m18N02K03o11L02j49l85P37l00m20O64l10L18
2373C12J16p00J07K76k11M27l71K4O0J04n18P54o76J2O31n24K62l6k24J95J73
2394A93k51K80m46P9K42l57j32L37k46L18R2l31K93p0j21K56j05k59M20j65j4
$$ plain form
2415 13 198 -153 45 -27 -419 -7 245 -356 238 20 -98 140 28 108 301 -257 214 159 -5 146 86 179
2437 179 -77 141 -93 268 -51 -46 54 -181 -212 257 -89 21 121 -137 216 25 131 101 -190 -140 376 -314
2459 -314 44 -45 -370 383 1 -344 230 -56 0 269 -224 120 245 -92 75 71 -179 232 -201 29 72 -119
2481 -119 80 -19 -267 -49 29 -20 14 39 -267 348 -111 250 225 -385 -239 50 -208 391 139 12 374 194
2503 194 -161 28 -232 -3 388 -385 -205 -36 -136 213 -90 -236 265 232 -13 110 -33 -107 246 -190 72
2524 72 207 73 262 13 -102 256 -108 -137 205 -219 -68 45 -167 73 -58 -172 222 90 -252 171 117
2545 117 12 121 -101 -34 50 -302 -168 -284 -273 -5 -66 -325 126 -361 -273 91 -137 162 357 -133 203 80
2567 80 -54 265 95 -87 258 20 -171 314 -127 -8 -30 -295 -209 -4 -260 486 223 -76 156 161 75 300
$$ packed form
2415A3J85l51J98p2l92M12K52o01N94k18j18K38j12Q0J93n58M71n5j64J51o0R3
2437A79k56K18k34L61l19NJ00k35l1M69l46J10J00k58L53j91J06l0k91N0N16o90
2459c14L58q9l25P53l82l45N74k86N6K69m93L44J25l37J67mk50M11m33K30M3j91
2481a19J99r9k48K18P8m9L4K5l06O15m59L61k5o10J46K89k58N99k52j27L62j80
2503A94l55J89k60K29L91p73J80J69j00L49l03j46N01l3k45J23j43p4L53m36K62
2524G2J35j34J89k49j15L58l64k9L42m24J51J13k12K40j31j14L94j32l42M23n4
2545A17j05J09k22O7Q4l52J34j16J1K68o1k59M51m87Q8L64k28K99J95m90L36j23
2567H0j34L19j70j82L45k38j91M85m41J19k2k65Q6K05k56P46k63k99K32Nq6K25
$$ plain form
2589 300 -239 196 330 -373 179 78 -215 60 -41 -414 214 -299 77 7 -188 -35 76 -91 271 -38
2609 -38 -239 297 141 -175 55 31 -148 93 -235 -175 -142 10 262 -25 -3 165 -95 -6 42 98 73 57 -303
2632 -303 118 14 -247 161 37 -92 59 -214 -178 78 -319 11 216 -341 -3 129 -319 56 35 -163 278
2653 278 -169 -56 256 -385 160 355 -359 125 -117 -157 126 5 -333 181 -5 12 254 -71 86 181 131
2674 131 424 -32 -177 65 -85 -182 495 83 199 -13 48 -53 76 -191 234 -101 -625 163 -119 -160 244
2695 244 4 -234 -178 -141 142 211 -141 98 142 123 252 -374 -36 202 -107 25 -240 -259 56 94 -248 278
2717 278 -62 180 91 -58 -29 159 164 216 148 -85 -110 176 -147 40 106 190 163 5 -43 -14 -106 -69 81 -175 -256
2742 -256 137 50 286 -100 36 75 -101 -190 94 -106 357 103 -61 198 -196 -435 -132 8 -180 253 113
$$ packed form
2589C00n39M35J34p03N52j01k93K75j01l73O28n13L76p0j95J53J11j67L62l09
2609c8k01N36j56l16K30k4j79K41l28O0L3J52K52k87K2J68k60Q9M8N6k5j6l60
2632c03M21j04k61M08j24j29J51k73L6K56l97L30K05n57L38J32m48L75k1j98M41
2653B78m47J13L12o41N45J95p14M84k42m0K83j21l38N14j86J7K42l25J57R5n0
2674A31K93m56j45K42j50r7O77m12J16k12O1j01J29k67M25l35n24P88k82m1M04
2695B44k40k38N6L7K83O9l52K39M4j9J29o26L38K38l09J32k65j9L15L8l42N26
2717B78l40K42q9j49K9J88NN2o8k33k5K86l23J87O6Q4k7j58m8K9r2L7J50k56q1
2742b56L93q7K36l86J36L9j76q9K84k00M63k54j64K59l94k39L03J40j88M33j40
$$ plain form
2763 113 267 -187 -81 -204 193 -210 459 112 -152 -75 -101 -38 107 -25 15 -26 -101 150 152 122 159 -77 -183
2786 -183 99 -7 226 -44 -299 -96 -13 -50 -19 34 -106 160 -77 -6 77 -336 -239 -173 -219 -285 -4 22 191 -32
2810 -32 -209 16 -288 -93 218 53 40 190 -62 -224 159 18 145 73 -256 3 -219 -47 104 124 74 377
2832 377 -24 297 168 138 320 -228 34 259 167 -127 136 -90 46 -20 -96 187 -97 42 46 -118 -74 36
2854 36 -219 -63 55 45 269 74 259 198 -33 22 48 -131 126 -42 -244 -94 3 -318 274 0 -90 -86 -38
2877 -38 -203 -114 -97 209 113 229 -55 -143 110 -32 -147 68 241 -156 -48 111 -94 -86 142 -256 -94 268
2899 268 -96 -29 -106 -56 233 -121 -264 -75 -47 114 250 102 -47 135 -198 114 61 -235 147 -45 79 168
2921 168 55 -46 55 77 3 25 -140 12 -69 95 -44 -298 -49 82 -71 -9 -165 -166 167 17 27 123 -87
$$ packed form
2763A13J54m54J06j23L97m03O69l47k64P7k6O3J45j32M0m1p5K51Kl0L7k36j06
2786a83K82j06K33k70k55K03Q3l7L1N3j40K66k37P1Q3m13R7O6m6o6K81K6J69k23
2810c2j77K25l04J95L11j65j3J50k52j62L83j41J27p2l29K59k22J72J51K0n0L03
2832C77m01L21j29l0J82n48K62K25r2k94K63k26J36o6p6K83k84J39Mj64M4J10
2854C6k55J56J18j0K24j95J85o1k31N5K6j79K57j68k02J50R7l21N92k74r0MM8
2877c8j65Q9J7L06r6J16k84q8K53j42j15K15J73l97J08J59k05QK28l98J62L62
2899B68l64O7p7N0K89l54j43J89K8J61J36j48j49J82l33L12n3k96L82j92J24Q9
2921A68j13j01J01K2p4K2j65J52q1J64j39k54K49J31j53O2j56jL33j50J0R6k10
$$ plain form
2944 -87 -95 77 12 20 -49 -347 -75 31 -326 163 -196 -329 131 -225 -67 56 120 -152 -142 -149 -135 189 22 217
2968 217 4 -173 277 168 -147 98 112 42 90 2 109 71 -125 -105 41 58 -61 -129 65 -114 -136 91 113
2991 113 -169 574 66 -82 204 -164 -189 179 -291 129 57 -239 -126 -40 45 -123 64 35 311 -203 -85 -114
3013 -114 20 -77 309 -79 176 269 11 152 -27 -19 20 -255 -99 -84 -464 -200 -11 -197 -45 7 -98 156
3035 156 99 160 10 67 99 -106 -130 -179 4 -93 264 115 -215 91 -45 -528 186 113 50 73 -253 66 -56
3058 -56 48 182 165 3 130 -56 -219 27 -110 57 60 -79 5 78 96 55 74 85 191 -290 -141 112 14 100
3082 100 82 39 -5 226 -305 155 46 -133 80 47 -438 -22 -35 52 223 80 -206 -174 -57 -6 -354 -202 46
3105 46 -108 -39 -262 -27 200 257 -84 21 -231 -195 -61 -44 -183 173 -128 -25 -75 -271 -39 284 106 5
$$ packed form
2944h7qJ72o5Qo9k98K72J06l57M89l59j33M60l56J58J23O4k72J0pJ4L24j67J95
2968B17k13j77M50j09l15K45J4p0M8q8J07l8j96K0J46J7j19o8J94j79k2K27K2
2991A13k82P43n08j48K86l68k5L68m70M20p2k96J13Q6Q5j68J87k9K76n14J18k9
3013a14J34r7L86l88K55R3k58J41j79QL9k75J56J5l80K64J89j86J52N2j05K54
3035A56n7O1j50N7L2k05k4m9J83r7L57j49l30L06j36m83P14p3o3K3l26L19j22
3058e6J04J34j7j62J27j86j63K46j37J67Lj39Q4P3J8m1J9J1J06m81J49K53r8Q6
3082A00j8m3m4K31n31M60j09j79K13l3m85M16j3Q7J71j43k86L2J17N1l48J52K48
3105D6j54O9k23K35K27N7l41J05k52L6J34J7j39L56l01J03n0j96K32L23j78j01
$$ plain form
3127 5 142 -58 -135 -221 -30 14 110 -56 -204 40 -13 -151 -43 -198 3 -210 71 -139 -228 344 81 14 -17
3150 -17 -169 -25 -109 -16 220 -63 50 3 207 -248 -260 -81 179 19 -250 -207 38 198 342 -135 17 63
3172 63 -155 -160 195 -275 -163 -168 -188 -67 -307 -175 -183 -100 -32 234 -72 -228 7 58 14 -4 -15 222 84 96 150
3197 150 -21 61 -19 -76 30 3 -204 -62 -157 -79 214 160 -167 11 -141 -144 59 -130 -314 -12 -60 124 117 -94
3221 -94 -73 67 -20 -21 -157 55 -217 -214 201 13 -99 -72 -67 -115 153 -7 -101 28 176 34 -74 -253 -55 178
3245 178 -165 -102 -64 22 -28 -75 -118 65 -15 29 87 90 55 -132 50 -69 -174 -358 -36 -217 -102 140 58 -201
3269 -201 -1 -190 28 -148 -212 97 -82 -401 -83 1 -61 180 -13 -26 9 41 53 -98 -353 129 -12 201
3291 201 74 19 125 24 -172 25 34 -3 -19 -197 53 53 -73 52 -67 36 -6 331 11 -70 -14 -241 183
$$ packed form
3127EJ37k00p7q6J91M4R6j66j48K44n3j38J08j55K01k13K81k10q9N72k63o7l1
3150a7j52J44q4R3K36k83J13m7K04m55j2J79K60j60k69M3K45J60J44m77J52M6
3172F3k18nL55m70J12nk0J21k40J32qQ3O8K66l06j56K35N1m4j8j1K37j38J2N4
3197A50j71Q2q0n7J06k7k07J42r5P8K93n4l27J78j52lK03j89j84L02m8J84pk11
3221i4K1J40q7jj36K12k72LM15j88j12K7Nm8K68j60r4J29J48j42j08j79J98K33
3245A78l43O3L8Q6n0m7m3J83q0M4N8Ll5j87J82j19j05j84L22j81J15K42q2k59
3269b01K00j89K18j76o4L09j79l19L18Q4o2K41j93j3L5L2J2j51k55M82j41K13
3291B01j27n5J06j01j96J97Rl7j6j78K50%j26J25j19J03m2L37l20q1N6k27M24
$$ plain form
3314 183 98 -124 108 -43 -192 -10 -89 -125 -538 -38 202 -96 176 -6 -59 -201 226 -162 45 155 -159
3335 -159 92 18 -350 -5 -73 -169 92 -107 34 103 -218 29 -163 46 126 14 -187 -15 -195 -118 29 139
3357 139 197 33 24 -24 23 -36 -75 38 64 94 -29 -326 -70 -186 19 67 110 2 94 -107 46 -114 -192 -28
3381 -28 -227 -126 232 -8 -103 315 -99 -156 89 -260 111 -32 -144 58 -55 -181 -208 -56 71 258 -190
3402 -190 80 244 122 123 -255 57 71 -58 -155 16 -9 -55 21 104 212 25 -19 90 162 -63 7 288 114 52
3426 52 -118 -256 18 80 -64 -162 -132 137 130 -60 -338 -136 310 20 54 -34 107 -100 322 -155 -344 147 103
3449 103 41 101 -122 -199 173 -162 12 29 29 55 -142 -182 96 87 -290 -150 -5 -162 31 20 106 95 -37 242
3473 242 -82 101 60 19 -53 297 -1 9 74 102 111 111 -77 -47 201 -217 57 32 -137 14 -47 75 -107 64
$$ packed form
3314A83q5k22K32j51j49J82p9l6m13N00K40k98K72j82n3j42M27l88K07J10l14
3335a59K51p4l68L45o8r6K61j99J41O9l21K47j92K09Q0j12k01J72j80P7J47J10
3357A39N8j64rm8M7n9l9J13K6L0j23k97K56j16K05M8M3j08R2k01J53j60p8J64
3381b8j99J01L58k40r5M18m14n7K45l49L71j43j12K02j13j26k7J52J27J87m48
3402a90K70J64j22Jl78L12J4j29r7J71k5m6P6Q3J08j87m4J09P2k25P0K81j74o2
3426E2j70j38K74O2j44r8L0K69pj90k78K02M46k90L4q8J41k07M22m77j89M91m4
3449A03o2O0k23p7L72l35J74J7%K6j97m0K78rl77J40J45j57J93j1Q6j1j32K79
3473B42l24J83m1m1p2L50k98J0O5K8R%j88L0K48m18K74k5j69J51o1J22j82J71
$$ plain form
3497 64 111 -117 57 87 38 -10 237 180 12 -208 -230 176 176 -112 -164 3 -155 130 -74 21 -155 -188 67 5
3521 5 -551 -94 -201 -72 107 -135 -248 -22 312 12 122 -262 -24 -100 -33 -43 -387 40 140 -131 22 186
3543 186 -59 129 186 -312 180 -1 -26 114 35 -146 177 -344 64 87 -170 -153 9 -182 41 144 -221 -197
$$ packed form
3497F4M7k28J74L0m9m8K47n7j68k20k2M06%k88n2J67j58K85k04R5j76l3K55o2
3521En56M57j07J29J79k42j13K26L34l00J10l84K38p6O7j0l44M27J00k71J53J64
3543A86k45J88N7m98M92j81k5J40p9j81L23n21M08K3k57J7J62j91K23J03l65K4
$$ [...]
8191b
##END NTUPLES=NMR FID
##END=
