##TITLE=1H_Pr F-Q
 CDCl3,8 sc, 
 28.9.2021
##JCAMPDX= 6.0         $$ Bruker NMR JCAMP-DX V2.0
##DATA TYPE= NMR FID
##DATA CLASS= NTUPLES
##ORIGIN= UXNMR, Bruker Analytische Messtechnik GmbH
##OWNER= root
$$ XWIN-NMR		Version 3.5
$$ Tue Sep 28 13:18:36 2021 Russian Standard Time (UT+4h)  she@DPX200
##.OBSERVE FREQUENCY= 200.1314
##.OBSERVE NUCLEUS= ^1H
##.DELAY= (6, 6)
##.ACQUISITION MODE= SIMULTANEOUS
##.ACQUISITION SCHEME= undefined
##.AVERAGES= 8
##.DIGITISER RES= 18
##SPECTROMETER/DATA SYSTEM= spect
##.PULSE SEQUENCE= zg30
##.SOLVENT NAME= CDCl3
##.SHIFT REFERENCE= (INTERNAL, CDCl3, 0, 15.7039)
##AUDIT TRAIL= $$ (NUMBER, WHEN, WHO, WHERE, WHAT)
$$ ##TITLE= Audit trail, XWIN-NMR		Version 3.5
$$ ##JCAMPDX= 5.01
$$ ##ORIGIN= Bruker BioSpin GmbH
$$ ##OWNER= she
$$ F:/spectra/data/she/nmr/H-F/1/audita.txt
$$ ##AUDIT TRAIL=  $$ (NUMBER, WHEN, WHO, WHERE, WHAT)
(   1,<2021-09-28 13:17:00.54 +0400>,<she>,<DPX200>,
      <created by zg, POWCHK disabled, PULCHK disabled
       configuration hash MD5:
       00 E9 B6 7A A2 85 ED C7 34 08 36 98 17 FE 4E 26
       data hash MD5: 16K
       A6 4B FD 59 1B 7F AD F2 51 D1 98 AF 9C C6 40 9F>)
$$ ##END=
$$ 
$$ hash MD5
$$ 9A D1 03 56 D0 C8 56 2F 0C 9A F7 8B 9E 60 38 8D
##$RELAX= 
##$RELAX= 
##$RELAX= 
##$RELAX= 
##$RELAX= 
##$RELAX= 
$$ Bruker specific parameters
$$ --------------------------
##$DU= <F:/spectra>
##$EXPNO= 1
##$NAME= <H-F>
##$PROCNO= 1
##$TYPE= <nmr>
##$USER= <she>
##$AMP= (0..31)
100 100 100 100 100 100 100 100 100 100 100 100 100 100 100 100 100 100 
100 100 100 100 100 100 100 100 100 100 100 100 100 100 
##$AQSEQ= 0
##$AQ_mod= 1
##$AUNM= <au_zg>
##$AUTOPOS= <>
##$BF1= 200.13
##$BF2= 200.13
##$BF3= 200.13
##$BF4= 200.13
##$BF5= 200.13
##$BF6= 200.13
##$BF7= 200.13
##$BF8= 200.13
##$BYTORDA= 1
##$CFDGTYP= 0
##$CFRGTYP= 5
##$CHEMSTR= <none>
##$CNST= (0..31)
1 1 145 1 1 1 1 1 1 1 1 1 1 1 1 1 1 1 1 1 1 1 1 1 1 1 1 1 1 1 1 1 
##$CPDPRG= <>
##$CPDPRG1= <>
##$CPDPRG2= <>
##$CPDPRG3= <>
##$CPDPRG4= <mlev>
##$CPDPRG5= <mlev>
##$CPDPRG6= <mlev>
##$CPDPRG7= <mlev>
##$CPDPRG8= <mlev>
##$CPDPRGB= <>
##$CPDPRGT= <>
##$D= (0..31)
0 1.2 0 0 0 0 0 0 0 0.06 0 0.03 0 0 0 0 0.0002 0 0 0 0 0 0 0 0 0 0 0 0 
0 0 0 
##$DATE= 1632820619
##$DBL= (0..7)
120 120 120 120 120 120 120 120 
##$DBP= (0..7)
150 150 150 150 150 150 150 150 
##$DBP07= 0
##$DBPNAM0= <>
##$DBPNAM1= <>
##$DBPNAM2= <>
##$DBPNAM3= <>
##$DBPNAM4= <>
##$DBPNAM5= <>
##$DBPNAM6= <>
##$DBPNAM7= <>
##$DBPOAL= (0..7)
0.5 0.5 0.5 0.5 0.5 0.5 0.5 0.5 
##$DBPOFFS= (0..7)
0 0 0 0 0 0 0 0 
##$DE= 6
##$DECBNUC= <off>
##$DECIM= 32
##$DECNUC= <off>
##$DECSTAT= 4
##$DIGMOD= 1
##$DIGTYP= 9
##$DL= (0..7)
0 120 120 120 120 120 120 120 
##$DP= (0..7)
150 150 150 150 150 150 150 150 
##$DP07= 0
##$DPNAME0= <>
##$DPNAME1= <>
##$DPNAME2= <>
##$DPNAME3= <>
##$DPNAME4= <>
##$DPNAME5= <>
##$DPNAME6= <>
##$DPNAME7= <>
##$DPOAL= (0..7)
0.5 0.5 0.5 0.5 0.5 0.5 0.5 0.5 
##$DPOFFS= (0..7)
0 0 0 0 0 0 0 0 
##$DQDMODE= 0
##$DR= 18
##$DS= 0
##$DSLIST= <SSSSSSSSSSSSSSS>
$$ [...]
##$SUBNAM2= <"">
##$SUBNAM3= <"">
##$SUBNAM4= <"">
##$SUBNAM5= <"">
##$SUBNAM6= <"">
##$SUBNAM7= <"">
##$SUBNAM8= <"">
##$SUBNAM9= <"">
##$SW= 20.0188988654967
##$SWIBOX= (0..15)
0 0 2 0 0 0 0 0 0 0 0 0 0 0 0 0 
##$SW_h= 4006.41025641026
##$TD= 16384
##$TD0= 1
##$TE= 0
##$TE2= 300
##$TE3= 300
##$TEG= 300
##$TL= (0..7)
0 120 120 120 120 120 120 120 
##$TP= (0..7)
150 150 150 150 150 150 150 150 
##$TP07= 0
##$TPNAME0= <>
##$TPNAME1= <>
##$TPNAME2= <>
##$TPNAME3= <>
##$TPNAME4= <>
##$TPNAME5= <>
##$TPNAME6= <>
##$TPNAME7= <>
##$TPOAL= (0..7)
0.5 0.5 0.5 0.5 0.5 0.5 0.5 0.5 
##$TPOFFS= (0..7)
0 0 0 0 0 0 0 0 
##$TUNHIN= 0
##$TUNHOUT= 0
##$TUNXOUT= 0
##$USERA1= <user>
##$USERA2= <user>
##$USERA3= <user>
##$USERA4= <user>
##$USERA5= <user>
##$V9= 5
##$VALIST= <valist>
##$VCLIST= <CCCCCCCCCCCCCCC>
##$VD= 0
##$VDLIST= <DDDDDDDDDDDDDDD>
##$VPLIST= <PPPPPPPPPPPPPPP>
##$VTLIST= <TTTTTTTTTTTTTTT>
##$WBST= 1024
##$WBSW= 4
##$XGAIN= (0..3)
0 0 0 0 
##$XL= 0
##$YL= 0
##$YMAX_a= 34433
##$YMIN_a= -52477
##$ZGOPTNS= <>
##$ZL1= 120
##$ZL2= 120
##$ZL3= 120
##$ZL4= 120
##$ABSF1= 10
##$ABSF2= 0
##$ABSG= 5
##$ABSL= 3
##$ALPHA= 0
##$AQORDER= 0
##$ASSFAC= 0
##$ASSFACI= 0
##$ASSFACX= 0
##$ASSWID= 0
##$AUNMP= <proc_1d>
##$AZFE= 0.1
##$AZFW= 0.1
##$BCFW= 1
##$BC_mod= 2
##$BYTORDP= 1
##$COROFFS= 0
##$CY= 11.3945322036743
##$DATMOD= 1
##$DC= 2
##$DFILT= <>
##$DTYPP= 0
##$F1P= 2.36226072786647
##$F2P= -0.459571619588291
##$FCOR= 0.5
##$FTSIZE= 0
##$FT_mod= 4
##$GAMMA= 1
##$GB= 0.15
##$INTBC= 1
##$INTSCL= 1
##$ISEN= 128
##$LB= 0.24
##$LEV0= 0
##$LPBIN= 0
##$MAXI= 10000
##$MC2= 0
##$MEAN= 0
##$ME_mod= 0
##$MI= 1.114404
##$NCOEF= 0
##$NC_proc= 0
##$NLEV= 6
##$NOISF1= 3.799351
##$NOISF2= 2.8
##$NSP= 1
##$NTH_PI= 0
##$NZP= 0
##$OFFSET= 15.70392
##$PC= 1
##$PHC0= -14076.78
##$PHC1= 12.00087
##$PH_mod= 1
##$PKNL= yes
##$PPARMOD= 0
##$PSCAL= 0
##$PSIGN= 0
##$REVERSE= no
##$SF= 200.130013532006
##$SI= 16384
##$SIGF1= 3
##$SIGF2= 2
##$SINO= 400
##$SIOLD= 16384
##$SREGLST= <1H.CDCl3>
##$SSB= 0
##$STSI= 0
##$STSR= 0
##$SW_p= 3612.71676300578
##$SYMM= 0
##$S_DEV= 0
##$TDeff= 0
##$TDoff= 0
##$TI= <>
##$TILT= no
##$TM1= 0
##$TM2= 0
##$TOPLEV= 0
##$USERP1= <user>
##$USERP2= <user>
##$USERP3= <user>
##$USERP4= <user>
##$USERP5= <user>
##$WDW= 1
##$XDIM= 8192
##$YMAX_p= 0
##$YMIN_p= 0
$$ End of Bruker specific parameters
$$ ---------------------------------
##NTUPLES= NMR FID
##VAR_NAME=  TIME,          FID/REAL,        FID/IMAG
##SYMBOL=    X,             R,               I
##VAR_TYPE=  INDEPENDENT,   DEPENDENT,       DEPENDENT
##VAR_FORM=  AFFN,          ASDF,            ASDF
##VAR_DIM=   8192,          8192,            8192
##UNITS=     SECONDS,       ARBITRARY UNITS, ARBITRARY UNITS
##FACTOR=    0.0002496,     1,               1
##FIRST=     0,             0,               0
##LAST=      2.0444736,     0,               0
##MIN=       0,             -52477,          0
##MAX=       2.0444736,     34433,           0
$$ Real data points
##PAGE= N=1
##DATA TABLE= (X++(R..R)), XYDATA
0@%%%%%%%%%%%%%%%%%Qj6J6j6J6j6K4l2L2l5M3m9N7o7P5q8R9j10J25j41J58j75
$$ 0 0 0 0 0 0 0 0 0 0 0 0 0 0 0 0 0 0 8 -8 8 -8 8 -8 16 -16 16 -19 24 -25 32 -35 40 -48 51 -59 66 -75 83 -92
39i2J97k21K46k73K99l31L71m09M50m98N48o05O65p32Q10q92R83j091J214j354
$$ -92 105 -116 130 -143 156 -175 196 -213 237 -261 287 -318 347 -385 425 -467 516 -575 639 -715
59g15J520j716J953k247K622l123L828m900O754j0854M1311l3389m4314N5291
$$ -715 805 -911 1042 -1205 1417 -1706 2122 -2778 3976 -6878 34433 1044 -43270 12021
73A2021J8415j9992l2421J2077K1212j3248n681K1224j1977j4373J2692K2357
$$ 12021 30436 10444 -21977 -9900 11312 -1936 -7617 13607 1630 -12743 -51 22306
85B2306o880k3452K779K0929n135j4608J613P509j4245m219J9092j852k0535P4
$$ 22306 15426 -8026 -5247 15682 10547 -4061 -2448 5061 -9184 -13403 5689 3837 -16698 -16624
99a6624J7835J0580j8988r193K5185J399j8803N457J1365l359j5091j393J8639
$$ -16624 1211 11791 -7197 -16390 8795 10194 -8609 -3152 8213 4854 -10237 -11630 7009
112G009l406j9974M406J3689m418o927P548N505p406k323J2599Q882j4382j2875
$$ 7009 3603 -16371 -11965 1724 -2694 -9621 -2073 3432 -3974 -6297 6302 15184 802 -12073
126a2073J8461J1910j6957j0978O377J1684j681j5577J322J3166j827m050q12
$$ -12073 6388 18298 1341 -9637 -3260 8424 6743 -8834 -7512 5654 3827 -223 -1035
139a035J015Q900O38q058m63M690M160k583r336j847Q274L36p960r05J123K30
$$ -1035 -20 8880 9518 1460 997 5687 9847 7264 -2072 -3919 4355 4691 -3269 -4174 -3051 -2821
155b821K952Q1l80n55l682O003O992o939n135n96K888P618l838j3069o42Q902
$$ -2821 131 212 -168 -723 -4405 1598 8590 1651 -3484 -4080 -1192 6426 2588 -10481 -11123 -2221
171b221O654n079j3384K314J5336J686r289j700M641L543Q28k077k27k917k797
$$ -2221 4433 -646 -14030 -11716 3620 5306 -3983 -5683 -1042 2501 3329 1252 1025 -1892 -4689
186d689P366K932j1040j717P608J319k936j817M510L105o983J427J1810l356j1112
$$ -4689 2677 5609 -5431 -7148 460 1779 -1157 -2974 1536 4641 -2342 -915 10895 7539 -3573
201c573K954R369L3r321m362Q310J727p453J299M064n092p85O960R25m982l328
$$ -3573 -619 8750 8783 -538 -4900 3410 5137 -2316 -1017 3047 -2045 -2830 4130 5055 73 -3255
217c255N792N788p483m292P654j100p219L015L866m214o604K217J0258l128j2680
$$ -3255 2537 8325 842 -3450 4204 3104 -4115 -1100 2766 -1448 -8052 -5835 4423 1295 -11385
232a1385N694J1726m100q158K425O694r6n938L44M978m508k950O573j100p269
$$ -11385 -5691 6035 1935 -6223 -3798 2896 2800 -3138 -2794 2184 -2324 -5274 1299 199 -7070
247g070K893N482N1o104o34R388J145r281K954P882l781m844L324L316k523n542
$$ -7070 -4177 1305 1356 -4748 -5382 4006 5151 -4130 -1176 6706 2925 -1919 1405 4721 2198 -3344
263c344L028O521n860n340O621K624m224l40K797J230j985j315M753n15o793L057
$$ -3344 -316 6205 345 -4995 1626 4250 26 -314 2483 3713 1728 413 5166 4651 -2142 915
279I15N571n074m798K762L193j127n469J397N841m095l502N456J043m186mK935
$$ 915 6486 1412 -3386 -624 2569 1442 -4027 -2630 3211 -884 -4386 1070 2113 -2073 -2077 858
295H58J036k705k556L331R13n137J554K776l738j015L430Q89j776k358L164M612
$$ 858 1894 -811 -3367 -36 877 -4260 -2706 70 -3668 -4683 -1253 -364 -2140 -4498 -1334 3278
311C278m384k682N115R56l316J76J351K5j060j032K611l36l614K756L359l415
$$ 3278 -1106 -3788 1327 2283 -1033 -857 494 519 -541 -1573 1038 702 -2912 -156 3203 -212
327b12p06L253L46r47j035J887J980l788j170M960j392m346J511K055q57k093
$$ -212 -918 2335 2681 1734 699 2586 4566 778 -392 4568 3176 -1170 341 2396 1539 -554
343e54o01L128k88l316K444K561m255j55L094n96j818j299K133J282m263j112
$$ -554 -1155 1973 1685 -1631 813 3374 -881 -1036 2058 1462 -356 -1655 478 1760 -2503 -3615
359c615M967j794l816K430J892j729j537J259L231j568l685L399K765m388r89
$$ -3615 1352 -442 -4258 -1828 64 -1665 -3202 -1943 1288 -280 -3965 -566 2199 -2189 -3178
374c178L459j49j912q72J988J414l324p8M922j870l718L719K433j479k161P70
$$ -3178 281 132 -1780 -2652 -664 750 -2574 -2652 2270 400 -3318 401 2834 1355 -806 -36
390c6L590j243l748K797K477m167n48L224l47k154m67K638J422l915m0M505j503
$$ -36 3554 2311 -1437 1360 3837 -330 -878 2346 1999 -155 -622 2016 3438 -477 -517 3988 2485
407B485l517K735J614k278j765R00K992k431m294L166L012l891j028K428K7j182
$$ 2485 -1032 1703 3317 1039 -726 174 3166 735 -3559 -393 2619 -1272 -2300 128 155 -1027
423a027n57K100O24l872L0N014k204l662J901J808j144j546L15K242j183k792
$$ -1027 -1584 516 1140 -2732 -2702 2312 108 -3554 -1653 155 -989 -2535 -2220 22 -1161 -3953
439c953L844J804m141k12L280M43j701j034K358J404l317k32L856j480l175K336
$$ -3953 -109 1695 -2446 -2658 622 1065 -636 -1670 688 2092 -1225 -1457 2399 919 -2256 80
455H0J676p80j268k3K178m50k124K835J083m019R62L060n35k323r36J880J723
$$ 80 1756 976 -292 -315 1863 1413 -711 2124 3207 -812 150 3210 2675 352 -584 1296 3019
472C019k664j130K393j340j418L045J16l015n26J938K401k600l009K798J891l201
$$ 3019 355 -775 1618 278 -1140 1905 2021 -994 -1520 418 2819 219 -2790 8 1899 -1302
488a302k31J701r02j104N4J477P52l043l85L586q60k342K143J84j171J01P86J385
$$ -1302 -1533 168 -734 -1838 -1784 -307 445 -2598 -2983 603 -257 -2599 -456 -272 -1443 -1342 -556 829
506H29j690k144K504J764k383N29J100k021M54J982P88j597k844K937M476l290
$$ 829 -861 -3005 -501 1263 -1120 -591 509 -1512 -1058 924 1712 115 -2729 208 4684 1394
522A394m134L088K529j026j701j94J439l75j169K507O7l630M59L315k46j962q89
$$ 1394 -2740 348 2877 1851 150 -44 1395 1020 -149 2358 2425 -1205 -746 2569 2323 361 -528
539e28J280J370j622p14J796j644j082K449m02k153L83M45O00o81o43J504o91
$$ -528 752 2122 500 -214 1582 -62 -1144 1305 903 -1250 -867 -422 178 -503 -1146 358 -333
556c33l080K328L096k440k473J166K278K89k884j01K173j666m72L044o50l209
$$ -333 -3413 -1085 2011 -429 -2902 -1736 542 831 -2053 -2154 19 -1647 -2119 925 275 -2934
572b934N98K778K227l197l202L480L198k631j034M15J65J298J87r48j50n42O55
$$ -2934 -2336 442 2669 -528 -3730 -250 2948 317 -717 -302 -137 1161 1348 400 250 -292 363
589C63K178k293o56K485r22j047J063R88n18j759N0K878p43l303J278K409j840
$$ 363 2541 248 -408 2077 1155 108 1171 2159 1641 -118 -68 2810 2067 -1236 42 2451 611
606F11j305J339R32j070k654J610L288k278l119K057J399l83o92j230M91Q06m93
$$ 611 -694 645 1577 507 -2147 -537 2751 473 -2646 -589 810 427 -265 -1495 -1004 -198 -691
623f91Q95j138k166K105J715j550j061M83N64O49q89L48Q16j791K50L047j727
$$ -691 204 -934 -3100 -995 720 -830 -1891 -1408 -844 -195 -1084 -736 80 -1711 -1461 1586 -141
640a41k040J178J505L14j925K44K248n01k683K304K110k385j493J338J845j6k038
$$ -141 -2181 -1003 502 816 -1109 -865 1383 882 -1801 503 2613 228 -1265 73 1918 1902 -136
657a36O7K234j283n90J561m80k043Q81J427J89j603j526K060J232k036K80N0j168
$$ -136 -69 2165 882 292 1853 1373 -670 211 1638 1827 224 -1302 758 1990 -46 234 284 -884
675h84J292J520j396j823o92K851J527l811j814L881K90j854m84P29O05p89r53
$$ -884 408 1928 532 -1291 -1983 868 2395 -1416 -3230 651 941 -913 -1397 -668 -63 -852 -1805
692a805K020j00k546J324J745j197r34N65N74Q5j145P30J428j637o12J961O9j563
$$ -1805 215 115 -2431 -1107 638 -559 -1493 -928 -354 -269 -1414 -684 744 -893 -1505 456 525 -1038
710a038O40O26O39p12o31J704n12j574J083J658j284m31K25N58M18j186K90J230
$$ -1038 -398 228 867 155 -476 1228 716 -858 225 1883 599 168 393 951 1369 183 473 1703
728A703j298L6J436o93j463J095K07j8j023n35J831j14k174J175Q88j374j42J5
$$ 1703 405 441 1877 1184 -279 816 1023 1005 -18 -553 1278 1164 -1010 165 1053 -321 -463 -448
746d48K87N80n81n42Q09j088n9J159q34r80R93P56p15m60m21J560j57j456J248
$$ -448 -161 419 -162 -704 105 -983 -1042 117 -717 -1697 -704 52 -663 -1123 -1544 16 -141 -1597 -349
765c49m7o21o3J248l05n08j7N49Q72j217l49J363m30n85J260o29j99L50J64Q13
$$ -349 -396 -1017 -1080 168 -137 -645 -662 -113 759 -458 -807 556 126 -459 801 172 -27 323 487 1300
785A300p82j194J933L49j509N26N87k13j95n28O86K95j070l39J579q05j116Q68
$$ 1300 518 -676 1257 1606 97 623 1210 997 802 274 960 1255 185 -154 1425 620 -496 372
803C72M32m93j75p5M43n74m82Q27K04j551K32J330p55o85l25Q89R95k071LJ627
$$ 372 804 311 136 61 504 -70 -552 275 479 -1072 -840 490 -265 -950 -1275 -386 609 -1462 -1459 168
823A68p51o13R18M1m84j12P7J064q45r18J560K35j532M35R27J28o38J5P22M80
$$ 168 -583 -1196 -278 -237 -721 -833 -756 308 -537 -1455 105 340 -1192 -757 170 298 -340 -325 397 877
843H77j509M67J471p46j030Q04M33j95l45k29J088j69j042J131N04j543O14N95
$$ 877 -632 -165 1306 560 -470 334 767 572 227 -2 1086 917 -125 1006 1510 -33 581 1176
861A176o67j97kK74M84j226N0J404j095r40R23K42k60n53j07J051m10j504J057
$$ 1176 509 312 310 584 1068 -158 -108 1296 201 -739 184 426 166 -387 -494 557 147 -1357 -300
880c00M24p68K14K87k59j2k07J97N38j244J61J368p72q12P59J95j86k40O6L80
$$ -300 124 -644 -430 -143 -402 -414 -621 -424 114 -1130 -969 399 -373 -1185 -426 -231 -417 -657 -591 -211
900b11R4p80J259J48j368O34N15j89J74l70N16M53n73l11R80q81KQ90m18k67K22
$$ -211 -117 -897 362 510 -858 -224 291 102 276 -94 422 875 302 -9 971 90 92 982 564 297 519
921E19k17O74k38p47J045J35j034L47N09p00j82N7K38N12j049L9N03p70j25P11
$$ 519 302 976 738 -9 1036 1171 137 484 993 293 111 168 406 918 -131 -92 411 -359 -484 227
941B27k56m10J85J42K97m04r27J175q4q44K27P52q03n0J29K8M94q85J19J177r71
$$ 227 -29 -439 -254 -112 185 -219 -1146 29 -55 -899 -672 80 -723 -773 -644 -616 -122 -1007 -888 289 -682
962f82l90Q41j79K4K3ON29k95n48J116J11r64L87O13l31j16M5l0M62o96N85Q39
$$ -682 -1072 -231 -410 -386 -363 -357 172 -123 -671 445 556 -408 -21 592 261 145 190 160 622 -74 511 1350
984A350j113j42P28j20j54j29j65N62r4n90P96k35j039P14Q7k93l1L2r8J05n17
$$ 1350 237 95 823 703 549 420 255 817 723 133 929 694 -345 369 456 163 132 164 66 171 -346
1005c46RM84n77j43J116q08m55L20j80M18j62o27M39K26o80M55L43p45N19j0M60
$$ -346 -337 147 -430 -573 543 -265 -720 -400 -580 -162 -324 -951 -512 -286 -966 -511 -168 -913 -394 -404 56
1026E6j64p58o3J362r29pO04j59k30L60k66M39L8o27J148j01q80P58N8n78M94
$$ 56 -108 -866 -929 433 -496 -503 101 -58 -288 72 -194 245 283 -344 804 703 -177 581 639 61 555
1047E55L3l03J60j20Q5P55j035q0P84l21k23K62l47J45Ll33P12J93j384K86Q10
$$ 555 588 285 445 325 410 1165 130 50 834 513 290 552 205 350 353 20 732 925 -459 -173 637
1068F37o92M2l11o2K74j97j53P37j180M25M62l42j33l2p8M35q2o64O68k75k47
$$ 637 -55 -13 -324 -386 -112 -309 -462 275 -905 -480 -18 -360 -493 -525 -603 -168 -250 -914 -246 -521 -768
1089g68M79L2n42L77K33N2j28k99L39N44o55j29J095l24m58J30L40L82l70p34
$$ -768 -289 -257 -799 -422 -189 -137 -265 -564 -225 319 -336 -465 630 306 -152 -22 318 700 330 -404
1109d04Q67L18r21O22L70o44J00J53K27L55r44k46J122k31o29L92m15K77J36k67
$$ -404 463 781 -140 482 852 208 308 461 688 1043 99 -147 975 744 115 507 92 369 505 238
1129B38r6j64qP06j60j396Q20K83o21M4J85rqm29K32N88j033J7R70m61l44K38
$$ 238 142 -22 -30 676 516 -880 -60 223 -398 -354 -169 -178 -186 -615 -383 205 -828 -811 159 -302 -646 -408
1151d08kJ96J47r57R34M59j303M96J69k7N05q69L76L34j33P8K31l81P0O19m91
$$ -408 -410 -214 -67 -1024 -90 369 -934 -438 -269 -296 209 -660 -284 50 -83 -5 226 -155 -85 534 43
1172D3rJ74j91M03J00o13M97l2l17P25m4q74M33L49j49Q1n44J91N03m38k64K67
$$ 43 34 208 17 420 520 -93 404 372 55 780 736 -138 295 644 495 576 32 223 726 288 24 291
1194B91k17j1l1q6P64o35k62M61q5o87L92K9m33L14Mj84J20m13J79N11q23K21
$$ 291 74 63 32 -54 710 75 -187 274 189 -498 -106 -77 -510 -196 -192 -376 -256 -669 -490 21 -802 -581
1216e81L17l92M9J57o1J36L36n17M75K01j035P87L48n35J70L5j33N07l36O7M75
$$ -581 -264 -656 -607 -450 -511 -375 -39 -556 -81 120 -915 -128 220 -315 -145 -110 -243 264 -72 -5 470
1237D70o56L04N36k31j76R2j54N45l22o1L23q2n92O23j88k46K68k50l52N29k43
$$ 470 -186 118 654 423 247 339 185 730 408 347 670 588 -4 619 431 185 453 203 -149 380 137
1258A37j5O19o78J57N0j04j95J81l84K47j25m11O61k76m17N43l00j45L47j47j49
$$ 137 122 741 63 220 270 166 -29 152 -232 15 -110 -521 140 -136 -553 -10 -310 -455 -108 -255 -404
1279d04L26n49K51K68n69J25M35j69j59J79j48M04j91m15O48J42p68P03K64n76
$$ -404 -78 -627 -376 -108 -677 -552 -117 -286 -445 -266 -414 -10 -201 -616 32 174 -594 109 373 -203
1299b03K64K29l1K05l20J87L19l01j88P23n21q7K63j90Q5l84j37P84p3o21N27
$$ -203 61 290 259 464 144 331 650 349 161 884 363 276 539 349 434 50 -87 697 624 3 530
1320E30k18m03K08o8q2N23o75K14M62q12M8N32m36j31J20q8K4nk39N10j02o16
$$ 530 312 -91 117 49 -33 490 -185 29 491 -321 -273 259 -177 -308 -188 -276 -252 -257 -496 14 -88 -704
1342g04J98L67l82J71R8L45m6o17P0N01k68p8N12l12l68N39l79M35O3p16J044
$$ -704 -506 -139 -521 -350 -252 93 47 -570 -500 1 -267 -345 167 -145 -513 26 -353 82 145 -571 473
1363D73k82m15M84J55n19J70R4j26L63l41K86K08r7j16K74m24J09j4q9J32j7K
$$ 473 191 -224 260 415 -104 66 160 34 397 56 342 550 453 337 611 187 296 282 193 325 308 310
1385C10K14j26m82N78k51k97K42j53J73J36l51j69K76m81K56K30l42q8L92o79
$$ 310 524 398 -84 494 243 -54 188 35 208 344 -7 -176 100 -381 -125 105 -237 -325 67 -612
1405f12O07k85o1M17l89l30N09j09n30O62m8j01L00l52l07N21l96Q7N16j86m31
$$ -612 -5 -290 -351 66 -323 -653 -144 -253 -783 -121 -169 -270 30 -322 -629 -108 -504 -417 99 -87 -518
1426e18M43L1N1Rm7J32K94n01N32l89p6L08J88l24K05j45P0L39n37J42L06l21
$$ -518 -75 -44 7 16 -31 101 395 -106 426 37 -39 269 457 133 338 193 263 602 65 207 513 192
1448A92j41M42k83j09L75l38K39m17O3K03J48o37L61rk50K91m51L12K42o29J38
$$ 192 51 493 210 101 476 138 377 -40 23 226 374 -263 98 89 -161 130 -321 -9 233 -396 -258
1469b58L64m60j87J05J16J11k97j15N31j18n51K46J86j09J07K29j18R7N9oK30
$$ -258 106 -354 -541 -436 -320 -209 -506 -621 -90 -208 -759 -513 -327 -436 -329 -100 -218 -121 -62 -68 162
1490A62m55O0N50n97N4N26k95L09op14N21K65p91R04K0l93L15k09m7J30k38J12
$$ 162 -293 -233 317 -280 -226 300 5 314 308 -406 115 380 -411 493 513 120 435 226 179 309 71 183
1512A83J07q3l6M13m71l2L20k27O1P9k99j62J10j27L37k85j79M89l37K18k07j76
$$ 183 290 207 171 584 113 81 401 174 235 314 15 -147 -37 -164 173 -112 -291 198 -139 79 -128 -304
1534c04J34J75n44k3P40m05l35O23j83k52K26k99M92k85p4K39J48l71J32L27n35
$$ -304 -170 5 -539 -562 178 -227 -562 61 -122 -374 -148 -447 45 -240 -314 -75 73 -298 -166 161 -374
1555c74N29k54J89K27n36K26Q6l90M78K71k68k61N5K37J43k44m6M55j96l41M59
$$ -374 155 -99 90 317 -219 7 93 -297 181 452 184 -77 -22 215 358 114 68 523 327 -14 445
1576D45k1j57O6l12M43J14n16N9K17k97j15M08j69m4j20j76k2K70l57K94J25m25
$$ 445 424 267 333 21 464 578 62 121 338 41 -74 334 165 121 1 -175 -197 73 -284 10 135 -290
1598b90j22L57l99L14l82K12N27n42M3Q7k40j70P31l42k14J48j37L49k37r9M33
$$ -290 -412 -55 -454 -140 -522 -310 217 -325 -282 -195 -435 -605 126 -216 -430 -282 -419 -70 -307 -406 27
1619B7m4m3NQ7j30j02R6J32J9M5q9L98o56L49L43n18L28J9J21J03j21j47J19L5
$$ 27 -17 -60 -55 32 -98 -200 -104 28 47 92 3 401 -255 94 437 -81 247 266 387 490 369 222 341 376
1643C76Nj9K7k38J36k40O6J06j02J46O3l52J44K29m12n4Q5k7J37n9n09N53J47
$$ 376 381 362 389 151 287 47 113 219 117 263 326 -26 118 347 -65 -119 -34 -61 76 17 -492 61 208
1666B08n15j7K80q9j68Q7q8J53l77K66L27o73K38L97l23J38J49k78K04k34qN91
$$ 208 -307 -324 -44 -133 -301 -214 -302 -149 -526 -260 67 -606 -368 29 -294 -156 -7 -285 -81 -315 -323 268
1688B68l02r3K61J09k23M9J99J79k85l15J69L95m39J47L93k32O0l4j71J77K09
$$ 268 -34 -127 134 243 20 69 268 447 162 -153 16 411 -28 119 512 280 340 306 135 312 521
1709E21l70L00p7k55k2J86l30M16m64O8K35m79L57J60n26J22k6J64k30J79l9K31
$$ 521 151 451 374 119 97 283 -47 369 -95 -27 208 -271 86 246 -280 -158 -184 -20 -250 -71 -110 121
1731A21m09k50O18k52l37M90l28j13K50Q1j66J20k55kN92m31L00Q7K1l61Rl35
$$ 121 -288 -538 80 -172 -509 -19 -347 -460 -210 -129 -295 -175 -430 -432 160 -271 29 116 137 -224 -215 -550
1753e50N84j03j26L01l13j27J76K76j02J66P9j22J97j63K69m4n18p9O74l62K15
$$ -550 34 -69 -195 106 -207 -334 -158 118 16 182 261 139 336 173 442 398 -120 -199 475 113 328
1774C28L4k85J62R8l00L79l53j47J57J43k88N2J99j65k69L9K03k33J13j44M67
$$ 328 362 77 239 337 37 416 63 -84 73 216 -72 -20 179 14 -255 -216 -13 -246 -133 -277 190
1795A90m76j23L01k58K53nl26M80m81l0L34O2m66J78J31jR7L3l17L02j2J20P8
$$ 190 -286 -409 -108 -366 -113 -118 -444 36 -445 -475 -141 -79 -545 -367 -236 -237 -140 -107 -424 -122 -134 -14 64
1818F4m55L02K38l22M84k32j78J65K73n18M81lj11N8k20k7M12k62J70J81l50m8
$$ 64 -391 -89 149 -173 311 79 -99 66 339 -179 302 299 188 246 26 -1 411 149 319 500 150 102
1840A02J22N9p2N3Rk47J36j72O0J24n65O52p6j73O4j06J50j18j51L4K98n05K53
$$ 102 224 283 211 264 273 26 162 -10 50 174 -391 261 185 12 76 -30 120 2 -149 -115 183 -322 -69
1863f9K20k08j45q2P8J23j30j40O10n18r7L32k6k99J80J9K11l32j51L20L60m37
$$ -69 151 -57 -202 -284 -206 -83 -213 -353 257 -261 -358 -26 -52 -351 -171 -152 59 -273 -424 -104 256 -181
1885a81J40J27k73K16K88r6j30P3K1J34j45k3L25m61K12j55L30k40m3k7K82L0
$$ -181 -41 86 -187 29 317 221 91 164 185 319 174 151 476 15 227 72 402 162 119 92 374 404
1907D04m07MN84l84j65l4K12J56l02j12M14j25m28M57j04l34O1J83l19J0j58K70
$$ 404 -3 1 585 201 36 2 214 370 68 -44 370 245 -183 274 170 -164 -103 80 -239 -229 -387 -117
1929a17K44m44J51M07l09j37J73l42L45j31k42K27j71M2L70j96k02L21N6k89o
$$ -117 127 -317 -166 241 -68 -205 -32 -374 -29 -160 -402 -175 -346 -304 66 -130 -332 -11 45 -244 -250
1950b50L01J48k33k34L54L15l72Pj3K09L34l59k83K18K4Q0K0k01j0Q1L81j91J5
$$ -250 51 199 -34 -268 86 401 29 36 23 232 566 207 -76 142 166 246 266 65 55 136 517 326 341
1973C41j55K14j63l20J29K09k24j77K85k5j95J36L3n2j8l13R0R8n5L74n09j58
$$ 341 186 400 237 -83 46 255 31 -146 139 114 -81 55 88 36 18 -295 -205 -107 -162 212 -297 -455
1995d55L27k66J85K85l39J00J07n7j80l9Q8P6J11q4J51k51l4M26l20j92N61k90
$$ -455 -128 -394 -209 76 -263 -163 -56 -113 -293 -332 -244 -168 -57 -141 10 -241 -275 151 -169 -361 200 -90
2017i0j4L09k29Qj86K48J76J12l01O6l3J69K4k78K26K02k40n6L22o13M23O6j45
$$ -90 -104 205 -24 -16 -202 46 222 334 33 99 66 235 259 -19 207 409 169 113 435 -178 245 311 166
2040A66j27N7o3J20M8j62K4J29m03L01k47Q1J11o3p5K20n8m23L93k67K81Om14
$$ 166 39 96 33 153 201 39 63 192 -211 90 -157 -76 35 -28 -103 117 59 -364 29 -238 43 49 -365
2063c65L13O1k35L5K0K8Qj5j35J42J44m1k51Q5Q8O3l3J78Np4R6j28J78j99K30
$$ -365 -52 9 -226 -191 -171 -143 -135 -150 -285 -143 1 -40 -291 -206 -118 -55 -88 90 95 21 117 -11 167 -32 198
2088A98l2k17L43k44J50k3o1QJ18pO5k39K40p6K36p57O43l69l2O6o9J25j56J05
$$ 198 166 -51 292 48 198 175 114 122 240 233 298 59 299 223 459 -298 345 -24 -56 10 -59 66 -90 15
2112A5J60q9n23N57j40j75Q4j2L4j31J66N8l2J2J23k8q8l15J03j78J72J47k27
$$ 15 175 86 -437 120 -20 -195 -111 -123 -89 -220 -54 4 -28 -16 107 79 -9 -324 -221 -399 -227 -80 -307
2135c07n9J67k13M62l32P6M02k49k69M51j28k6J14l91L40n5j18o5M23J44j92k
$$ -307 -366 -199 -412 50 -282 -206 196 -53 -322 129 1 -25 89 -302 38 -17 -135 -200 223 367 175 173
2157A73k8L4J99m21K33K5j19K41k4j38L7l44J71K90j69m04J95K69j45N8j19l31
$$ 173 145 179 378 -43 190 215 96 337 313 175 212 -132 39 329 160 -244 -49 220 75 133 14 -317
2179c17N69l08k05L10k73J52j70L46j90l34K97M1P3k38J14j3k44L32k2J37j25
$$ -317 252 -56 -261 49 -224 -72 -242 104 -86 -420 -123 -82 -9 -247 -133 -146 -390 -58 -80 57 -68
2200f8q1k30M26k81K36j50M9m7Q5j07K44J0k25J29j62L46k0k60L7m0K19j0P2p4
$$ -68 -149 -379 47 -234 2 -148 -99 -146 -61 -168 76 86 -139 -10 -172 174 154 -106 -69 -109 110 100 172 98
2224I8m9K61j57l2k91K51n5J88j74J33j18j43K79K26k71P9k29l0K22k65r7K14
$$ 98 49 310 153 121 -170 81 26 214 40 173 55 -88 191 417 146 225 -4 -34 188 -77 -174 40
2246D0l6M8j49j08J09j7K0K9J32j63J82o5m07N06k47r9J00p5r6L36l13KJ44j1
$$ 40 4 52 -97 -205 -96 -113 -93 -64 68 -95 87 22 -385 121 -126 -225 -125 -200 -296 40 -273 -271 -127 -138
2270a38J43O6K4m9J00k99K46j51r6J73K30k62K21q6p3J41P8k89L03l99M4L04j32
$$ -138 5 71 95 46 146 -153 93 -58 -154 19 249 -13 208 122 49 190 268 -21 282 -117 -73 231 99
2293I9n9R1K63k45JJ68K7m06J56J10r5q5J48K58m22m0j70Q5R5l76K25K2k2o2M24
$$ 99 40 131 394 149 150 318 345 -61 95 205 110 25 173 431 9 -31 -201 -116 -21 -397 -172 -150 -172 -234 190
2318A90k91K46q0j68j4R6l0o5pj43L76k42k12N19l75P7M9k59K96q6j69J77M92
$$ 190 -101 145 65 -103 -117 -21 -51 -116 -123 -266 110 -132 -344 175 -200 -123 -74 -333 -37 -123 -292 -115 377
2341C77l67o9P3L3j00Q2j56J69J71k25K54l19L77j19QJ31K6m6Jk2j3k22L80l58
$$ 377 10 -59 14 47 -53 29 -127 42 213 -12 242 -77 300 181 189 320 346 300 301 279 266 44 424 66
2365F6J4L10k98M3j1J24k4j4k00P2O7j93Q8r8JK21k84J13Q2k67J16K24k36NJ45
$$ 66 80 390 92 135 124 248 224 210 10 82 149 -44 44 -54 -53 168 -116 -3 79 -188 -72 152 -84 -79 66
2390F6p7O2k37k04L92N1m87J93J28j90J99J42j41n3J30l0j10K21k02M05k59nn2
$$ 66 -11 51 -186 -390 2 53 -434 -241 -113 -303 -104 38 -103 -156 -26 -56 -166 55 -147 258 -1 -6 -58
2413e8M8K21k25j36K00J55j72O2l3P6l25J98J73j24j87O9L05r3j39N91m60Q3j3
$$ -58 -10 211 -14 -150 50 205 33 95 62 138 -187 11 184 60 -127 -58 247 154 15 606 146 229 216
2436B16k89j26K64k03J01J17k42P6J94j13Q9j95k2P1o9K0J6Jok52O6L35n1j76
$$ 216 -73 -199 65 -138 -37 80 -162 -86 108 -5 84 -111 -133 -62 -131 -111 -95 -94 -100 -352 -286 49 -2 -178
2460a78K6J24m00J19K54k40M08j25p7m4J58k18J71J2j86L33k44n2J64K71k59K81
$$ -178 -152 -28 -428 -309 -55 -295 113 -12 -89 -133 25 -193 -22 -10 -196 137 -107 -159 5 276 17 298
2482B98m34K03K04l48K55m2N2k1k57J7K05m5j47K49j13j09L10j54j00J35j64Q0
$$ 298 -136 67 271 -77 178 136 188 167 -90 -73 132 87 -60 189 76 -33 277 123 23 158 -6 74
2504G4J73r7j61J06j89J74p8r2J91j25J11k34r3L74N1l53j9L57l32l5M13l12j13
$$ 74 247 150 -11 95 -94 80 2 -90 101 -24 87 -147 -240 134 185 -168 -187 170 -162 -197 216 -96 -209
2527b09K70l16K90r6l58K49L33n28L86l2k7k58K01J45K26n22L26K39m42K0M1L53
$$ -209 61 -255 35 -61 -419 -170 163 -365 21 -11 -38 -296 -95 50 276 -246 80 319 -123 -103 -62 291
2549B91j55j17l0J25K33p08O49l78J29J22k19K36l35J94j50J25k40L11J78m31
$$ 291 136 19 -11 114 347 -361 288 -90 39 161 -58 178 -157 37 -113 12 -228 83 261 -170
2569a70K57J94m49qL01J50m80Q5J16L6pk90K97pj87R9j03q3L18k20j36M06m95
$$ -170 87 281 -168 -176 125 275 -205 -120 -4 32 25 -265 32 25 -162 -63 -166 -249 69 -151 -287 119 -376
2592c76K4J17l92O23j67q2K83o1L1j11K2j82M03l56K26P0J4K76j61L0j42Rk17
$$ -376 -352 -235 -627 -4 -171 -253 30 -31 0 -111 -89 -271 132 -224 2 72 86 362 201 231 89 98 -119
2615a19L41k54J35J90m8m32L53L8n15L89K32o39O12Ol57J74J38L1r1l83J21M04
$$ -119 222 -32 103 293 245 -187 166 204 -311 78 310 -329 283 289 -68 106 244 275 184 -199 -78 326
2637C26m29L23n5l92K16k8J0N0k74J1M11o1j94k27L53R5j49P4J64k49j21L7R1
$$ 326 -103 220 165 -227 -11 -39 -29 21 -253 -242 169 108 -86 -313 40 135 -14 60 224 -25 -146 -109 -18
2660a8p6l3j19O5N0J18O7k36L45l52K84j25j54J75K03n4N4j49M2K45l12R2m8o6
$$ -18 -94 -127 -246 -181 -131 -13 54 -182 163 -189 95 -30 -184 -9 194 140 194 45 87 332 20 112 64 -2
2684bN4L2r3J48q8j10J06M9j28rK73n32L78j62R0q1J70k9r2j02K57k09pJ74j22
$$ -2 52 84 -9 139 51 -59 47 96 -32 -41 232 -300 78 -84 6 -75 95 66 -26 -128 129 -80 -87 87 -35
2709c5qO5J90l19J78N2k09K51k82j30L41m45J16N45m86J15j69K5J45K06k74L12
$$ -35 -43 22 212 -107 71 123 -86 165 -117 -247 94 -351 -235 310 -176 -61 -230 -205 -60 146 -128 184
2731A84p2O5j87J2k21K24J03k41L23k99L47q5q8r4j41j06J12J78Mj54L47k39N9
$$ 184 112 177 -10 2 -219 5 108 -133 190 -109 238 153 65 -29 -170 -276 -164 14 18 -136 211 -28 31
2754C1J69J08j31r6k09l9L70j00o3K37k35j7Nl16M73k43k13L03l48J99J6M50k59
$$ 31 200 308 177 81 -128 -167 203 103 40 277 42 25 30 -286 187 -56 -269 34 -314 -115 -99 351 92
2777I2k61Q4J40L1j85J58m3m41L77l6k81L32N3L4l08P0j14R1K90j30J52j61KO0
$$ 92 -169 -85 55 86 -99 59 16 -425 -48 -84 -365 -33 20 54 -254 -184 -298 -207 83 -47 105 -56 -54 6
2801Fn0J30n5N9K33m30J17J20q2Q2mK4n3P3k45R4j68L55k07Q5k40j7L98k16K00
$$ 6 -44 86 31 90 323 -107 10 130 48 130 126 150 97 170 -75 19 -149 206 -1 84 -156 -173 225 9 209
2826B09j02R5r3j76k7J81J9l39K52om3K91k66pm0m8K41k14j1n3J96r9L0L7j16
$$ 209 107 202 109 -67 -94 87 106 -233 19 13 -30 261 -5 -12 -52 -100 141 -73 -84 -137 59 -40 -10 27 -89
2851h9n3J92k45q4L62k85J35J31m7j19q9k6K0O9K64p8M7r3R9r6J07k39K82j72
$$ -89 -142 50 -195 -279 83 -202 -67 64 17 -102 -191 -217 -197 -128 136 58 105 12 111 15 122 -117 165 -7
2875gK47l40J40N7j18R2p0r0N03r8k23J79l12O2LM18m09j71J76M0r3m5J70Q1p8
$$ -7 240 -100 40 97 -21 71 1 -89 414 316 93 272 -40 22 25 443 34 -137 39 79 -14 -59 111 192 114
2900A14k32K2j75J34L5J11j4P5k21O5qO6ol15L60M9j42l53N18k64L35k13l3j34
$$ 114 -118 -96 -271 -137 -102 9 -5 70 -151 -86 -94 -28 -34 -349 11 60 -82 -435 83 -181 154 -59 -92 -226
2924b26J68k56L21M8j24J70l4k86L5L4J11K05l53J04L8qn6P2k7K04k17j06J31
$$ -226 -58 -314 7 55 -69 101 67 -219 -184 -150 -39 166 -187 -83 -45 -53 -109 -37 -64 140 -77 -183 -52
2947e2K61K7q0p1K81r2k18nK6j15J67j83J98p6J57k68J06l2j13O4M1r5J49K1j31
$$ -52 209 236 156 85 366 274 56 51 77 -38 129 -54 144 68 225 -43 63 31 -82 -18 23 -72 77 98 -33
2972c3k4P6j11K37k88j91K32l28L38J19j13k05L5L14j16J71j20l12L47j23j64
$$ -33 -57 19 -92 145 -143 -334 -102 -430 -92 27 -86 -291 -256 58 -58 113 -7 -319 28 -95 -259
2993b59K70m7K16r4j35J89lk39M5j6K96J5n0l13j84L94O1M5k27k0J80j46pJ83
$$ -259 11 -36 180 86 -49 140 137 -102 -57 -73 223 238 188 -125 -309 85 146 191 -36 -56 124 -22 -29 154
3017A54j65J88N5k62j15K39r6RN7l1pO5l3J9j03R3m5j46N4m0J5J6K8j5K51l27
$$ 154 -11 177 232 -30 -145 94 -2 7 64 33 26 91 58 77 -26 67 22 -124 -70 -110 -95 -79 -51 -66 185 -142
3043a42n8J12O7J22j45k00n8J11R8J91j45j24J52J30l79J67K61k02K44m25K50
$$ -142 -200 -88 -21 101 -44 -244 -302 -191 -93 98 -47 -171 -19 111 -268 -101 160 -42 202 -223 27
3064B7R1j6Q8k8j63r6L88l49LM33k22k38L51q7l65L99j13L5m5J00J60n18R4R2
$$ 27 118 102 190 162 -1 -97 291 -58 -55 378 156 -82 269 182 -183 216 103 138 93 193 353 -165 -71 21
3088B1J13p5q9j61K02j40M3k05L04R9l2J54l13J91K6k21J23J6q8p5K10j64o9J77
$$ 21 134 59 -30 -191 11 -129 -86 -291 13 112 80 234 -79 112 138 -83 40 56 -32 -107 103 -61 -130 47
3112D7rj03j06K24j3k43K69P8k48L7N3J79j87J67k53J91p1Nj30N3k8p0k27K27
$$ 47 38 -65 -171 53 40 -203 66 144 -104 -67 -14 165 -22 145 -108 83 12 17 -113 -60 -88 -158 -385 -158
3136a58J6L06k3j10j08J42K11L4j37m4J27R4m08j28J33r6K97o9K24m05J67J30
$$ -158 -142 164 141 31 -77 65 276 310 173 129 256 350 -58 -186 -53 -149 148 79 303 -102 65 195
3158A95l93L27j13j56RJ93k82L07r5J7L4k81K30J03k38J30J9j95L38r9l32L79
$$ 195 -198 129 16 -140 -131 62 -220 87 -8 9 43 -238 -8 95 -143 -13 6 -189 149 50 -282 97
3180I7m19K74K21o3J3j8j72k9R7R2m9qM8k07J37P0M1K0j02j14p2K43j82j11J92
$$ 97 -322 -48 173 110 123 105 -67 -96 1 93 44 36 84 -123 14 84 125 145 43 -71 -143 100 -82 -193 -1
3205aK06j07m01M25J04k89J40k22P2LK8m3J94k08J04J44r5K61j12k12K44k79j2
$$ -1 205 98 -303 122 226 -63 77 -145 -73 -70 -42 -85 109 -99 5 149 54 315 203 -9 235 -44 -56
3228e6K2K67j46K3j04p8L1j14J41m2J73l36R5Q4Q1j56p6L08k21j62K51l5J23J6
$$ -56 -34 233 87 110 6 -72 -41 -155 -14 -56 117 -219 -124 -40 41 -115 -191 117 -104 -266 -15 -50 73 89
3252H9j85k07M74k76p9L24r2r1j66L87n8N6r8L7j63n0R4L36l00r8L6R7k5Lj17
$$ 89 -96 -303 171 -105 -184 140 48 -43 -209 178 120 176 78 115 -48 -98 -4 332 32 -66 -30 67 42 45 -72
3277g2L46l10%K31J26k35L3Oj07J14QJ68l39J1%k0nM8P2j67J37r7j72K5M3l2K73
$$ -72 274 -36 -36 195 321 86 119 125 18 132 140 308 -31 -20 -20 -40 -45 3 75 -92 45 -52 -224 -199 -156 -188 85
3304H5l22K14P7l34J84Q2J34j14j74J65qm6k43L67o4m6l09L35L19N7k38N4r8q
$$ 85 -237 -23 54 -280 -96 -14 120 6 -168 -3 -11 -57 -300 67 3 -43 -352 -17 302 359 121 175 77 69
3328F9R8m00M33k96J35N8j31j37J16M42k64pp6R1O4m11K99N8l80J79K42j84K62
$$ 69 167 -233 200 -96 39 97 -34 -171 -55 387 123 116 40 131 195 -216 83 141 -239 -60 182 -2 260
3351B60o04M57k35r3J98K17r4K21m19J53l87L03J18j55K0j71Q8r7R9L1n2J67J42
$$ 260 -344 113 -122 -215 -17 200 106 327 -92 61 -326 -23 95 -60 -40 -211 -123 -220 -121 -90 -142 25 167
3374A67j60N4k47M7m0q2J52o2j14K67l1J28n1j95J71p4j73K51J62l45L72l35K13
$$ 167 7 61 -186 -139 -179 -261 -109 -171 -285 -18 -49 79 28 -167 4 -70 -243 8 170 -175 197 -138 75
3397G5k30J97r1L01j57j28K07j73R3M1m3j78J42p2k20L04l1J48Ko2r3Q3n9q8P8
$$ 75 -155 42 -49 252 95 -33 174 1 94 135 92 -86 56 -16 -236 68 37 185 187 125 32 115 56 -32 46
3422D6n8j4J88j25k31J61J02J52k79R6R9k13k67N20k32L2R7j23j80J25O2P0J41
$$ 46 -12 -26 162 37 -194 -33 69 221 -58 38 137 -76 -343 177 -55 -23 74 -49 -229 -104 -42 28 169
3445A69m82K74J2J8k22L77m82J25M20l95L36Qm08K56J75r4L6j05R7j1j44k40K53
$$ 169 -313 -39 -27 -9 -231 146 -336 -211 209 -186 150 158 -250 6 181 87 123 18 115 104 -40 -280 -27
3468b7L80l70r0O3k34L15l5L12k81j83L65J7l23K4J99j78J78j35J60k05m4P4j17
$$ -27 353 -17 -107 -44 -278 37 2 314 33 -150 215 232 -91 -67 132 -46 132 -3 157 -48 -92 -18 -135
3491a35j44J41K48k98J53q4r5L27j02Q7k19J2L41o6j64J01k28j02L11N5r1J44
$$ -135 -279 -138 110 -188 -35 -119 -214 113 11 98 -121 -109 232 166 2 103 -125 -227 84 139 48 192
3513A92j78j26J53j63J57j71K58o4J1k6k95J60P6m2J82j61j57J42k2r7J63o3p7
$$ 192 14 -112 41 -122 35 -136 122 58 69 43 -252 -92 -16 -58 124 -37 -194 -52 -74 -171 -8 -71 -148
3536a48L84m20K01r5J27j9j52n4M46k80r4L26j39j9j03M3p9N9l6K10j89k5k8j45
$$ -148 236 -184 17 -78 49 30 -122 -176 270 -10 -104 222 83 64 -39 4 -75 -16 -52 158 -31 -56 -84 -229
3560b29P6k34L02Q3K7j64J76J02k11o8k9K39k32j1J20k9K18l62J05N0N3J55k1
$$ -229 -153 -387 -85 -2 25 -139 37 139 -72 -140 -169 70 -162 -173 -53 -82 136 -226 -121 -71 -18 137 116
3583A16j62L1K7J51j71K5j23K42j37o9J79j14J90q6k12J11L93l00j52M3J50j41
$$ 116 -46 -15 12 163 -8 17 -106 136 -1 -70 109 -5 185 99 -113 -2 391 91 -61 -18 132 -9
3605iJ8l7J10J86m3J99n01n2N25m02j25K70k14J42j20m3J20j15P0j3J41j83k24
$$ -9 9 -28 82 268 225 424 -77 -129 396 -6 -131 139 -75 67 -53 -96 24 -91 -21 -34 107 -76 -300
3628c00K41J47j83j64K50n1j55j91K82K87k94o9L1K69k8j05L95n04J81M9k4j72
$$ -300 -59 88 -95 -259 -9 -60 -215 -406 -124 163 -131 -200 -169 100 72 -33 362 -142 39 88 64 -108
3650a08o0J36J89L9m25p1M23j40J90q4J59k79L5R1j43J30k0K4j8q2K56j39j25
$$ -108 -168 -32 157 196 -229 -300 123 -17 173 89 248 -31 4 95 -48 82 62 86 68 -14 242 103 -22
3673b2K4J52k14%P4k6J75L4L7k38n5m2J68K6k95L41k98R9K59j52k02O0l0n9K74
$$ -22 2 154 -60 -60 14 -12 163 197 234 -4 -59 -101 67 93 -202 139 -159 -60 199 47 -155 -95 -125 -184 90
3698I0k40J28J57k97P6M1j17L41k69J65j19J86j65NK3K3k06J55j61P8k2L2J5L
$$ 90 -150 -22 135 -162 -86 -45 -162 179 -90 75 -44 142 -23 -18 5 28 -178 -23 -184 -106 -128 -96 -81 -78
3722g8K76j35j7Q4k8R5k31K06J1j93N1k1K09j39M1K11l96L12j05m0%j26J36j62
$$ -78 198 63 46 130 102 197 -34 172 183 -10 41 20 229 90 131 342 -54 258 153 113 113 -13 123 -39
3746c9K4m3J30P5m14J67J12j21J94m8j99L31k29p0l9J61l8l2q6Q9J15n9p3l5J93
$$ -39 -15 -58 72 147 -267 -100 12 -109 85 37 -162 169 -60 -130 -169 -8 -46 -78 -164 -75 40 -19 -92 -127 66
3771F6M1n9j61L1J11p8j76L96m60L49k76M99m76K13j80J93j27J10J6o0L08k87
$$ 66 107 48 -113 -82 29 -49 -225 171 -289 60 -216 283 -193 20 -160 33 -94 16 32 -28 280 -7
3793gJ31l0J74j78j18N8K37l11J76qm88P34l72K34m8k42l20M10q4J75k63Q9L02
$$ -7 124 94 268 90 -28 30 267 -44 132 124 -364 370 -2 232 184 -58 -378 32 -52 123 -140 -51 251
3816B51l63J10j95K56n2J86k31K52k49n2k05K47K22k03J9q3j41K0n9J59L2KK00
$$ 251 -112 -2 -197 59 7 193 -38 214 -35 -87 -292 -45 177 -26 -7 -90 -231 -211 -270 -111 -79 -77 123
3839A23j74K33l02K09K6l4j16m3N7j9k2L25l69J88r2L9N1k4p1m4J18J5r7O3Q9
$$ 123 -51 182 -120 89 115 81 -35 -78 -21 -40 -62 263 -106 82 -10 29 80 56 -15 -59 59 74 -23 40 129
3864A29j00J34J9l03n0J87P2j86j12J47K79o9q1L33j27l56R9ML9J64J00o69L23
$$ 129 29 163 182 -121 -171 16 88 -98 -210 -63 216 147 66 399 272 -84 15 19 58 222 322 -347 -24
3887b4q6K76j42k36J68q2K02m04J97L01j87N4m4j99J10P5l3K3j1N9J13j49K4l6
$$ -24 -110 166 24 -212 -44 -126 76 -328 -131 170 -17 37 -7 -206 -96 -21 -54 -31 -42 17 130 -19 5 -31
3911c1N1Rn9nl9L9Mj09L25r2J49k37l6J51O7j75J19M6q2j27n0J57J36l56K43l
$$ -31 20 29 -30 -35 -74 -35 -31 -140 185 93 242 5 -31 120 187 12 131 177 95 -32 -82 75 211 -145 98 95
3937I5N8j7j76j42J87k8J58P0k21J16k79M4K76j60L61m36p4L5J03J72n2m5q9M9
$$ 95 153 136 -40 -182 5 -23 135 205 -16 100 -179 -135 141 -19 342 -94 -168 -133 -30 142 90 45 -44 5
3961EN2q5Jl3J82mk28J30l33K44j51O6k5N4L8P1K27k19J55j90J00j05j17J92k5
$$ 5 57 -28 -27 -60 122 118 -110 20 -313 -69 -220 -154 -179 -125 -87 -16 211 -8 147 -43 57 -48 -165 27 2
3986BJ3J93q8k29J7K78j5K1q9P4j75lM4l5j80L71P5k99K18j86J40j90j58j2L50
$$ 2 15 208 120 -109 -92 186 171 192 103 177 2 -1 43 8 -172 199 274 -25 193 7 147 -43 -201 -213 137
4011A37j05oo3K22n14J81L21k38K96l38J76j1j27O0K08L3k58l04L92n4J39j28
$$ 137 32 26 -37 185 -329 -148 173 -65 231 -107 69 58 -69 -9 199 232 -26 -330 62 8 147 19
4033A9j14Q0O1j48R2J27q4m1r0N3P3M8mj10L09q7J7l40J83k47K03O6l26K13K10
$$ 19 -95 -15 46 -102 -10 117 33 -8 -98 -45 28 76 72 -38 271 184 201 -139 44 -203 0 66 -260 -47 163
4058A63j44L18l06Q6M7l41M68l72m3R1L5j67K18J29j82Q0l47J67R5J33k53K8J67
$$ 163 19 337 31 117 164 -177 291 -81 -124 -33 2 -165 53 182 0 80 -267 -100 -5 128 -125 -97 70
4081G0j61L6l5L64j58j18L1J27k55K02l17J01K48q4k55P9J94j31N6j67J69J80
$$ 70 -91 -55 -90 274 116 -2 29 156 -99 103 -214 -113 135 51 -204 -125 69 -62 -6 -173 -4 176
4103A76l56K65j35J62q8q1K73m61K68j08K13r1Q0k79N23n33J45J49j07Q1j17j16
$$ 176 -180 85 -50 112 24 -57 216 -245 23 -85 128 37 117 -162 361 -172 -27 122 15 96 -21 -137
4125a37j8k8L77J5j20%j46j8jL58m60K20Nk19L42l08Q8J26J71j55j79J18O0J84
$$ -137 -155 -183 194 209 89 89 -57 -75 -76 282 -178 42 47 -172 170 -138 -50 76 247 92 -87 31 91 275
4149B75j26j57Q0j96K71j69L33l81J19LJ1l37K15M6j68J42L1o0j09J28J16Q2m
$$ 275 149 -8 72 -124 147 -22 311 -70 49 52 63 -274 -59 -13 -181 -39 -8 -68 -177 -49 67 149 145
4172A45l06Q2n4Q6j72J91j17J25J74Q8k44k26L43j07K13l47j17R8K44Q7k9l83
$$ 145 -161 -79 -133 -47 -219 -28 -145 -20 154 242 -2 -228 115 8 221 -126 -243 -145 99 186 157 -226
4194b26L62J70k80k16L30J93l27P8k24J13j25K49j18l7J9j08K15K6O1k91K8J61
$$ -226 136 306 26 -190 140 333 6 84 -140 -27 -152 97 -21 -58 -39 -147 68 94 155 -136 -108 53
4216E3o2K01k82l2r3J00N3n0N6l2J05j24O8n5Q0q9j84K01J76k2J73k96q8K6K78
$$ 53 -9 192 -90 -122 -215 -115 -62 -112 -56 -88 17 -107 -39 -94 -14 -103 -287 -86 90 68 241 -55 -143 -117 161
4241A61o9j43J06O8o0pj60j8M4K68m55J69J87l11M02m3j69%KL96l64o2K03k97
$$ 161 92 -51 55 123 63 56 -104 -122 -78 190 -265 -96 91 -220 182 139 -30 -30 -28 368 4 -58 145 -152
4265a52k44M45l46K02m4J25Q9k6k21J56j90r2J86J41k8l5L1k5J30k6L7p9k01K02
$$ -152 -396 49 -297 -95 -139 -14 75 49 -172 -16 -206 -298 -112 29 1 -34 -3 -28 102 76 113 34 -167 35
4289C5j59m1K43O5j58k67J13J16J25K00l03K24o8O2k39K23j39O0j35RJ60K6N1
$$ 35 -124 -165 78 143 -15 -282 -169 -53 72 272 -31 193 125 187 -52 171 32 92 -43 -34 126 152 203
4312B03k90R1L49k42k34L41k34m5J0j2M1J2j9n4J82J7m2K79n11P1P0j39r6M09
$$ 203 -87 4 353 111 -123 218 -16 -61 -51 -63 -22 -10 -29 -83 99 116 74 353 -158 -87 -17 -156 -252 157
4336A57k87M02j86q9q9P6K0k7J88k26j54K94k7k51J49J58l16L20j58j48m0K10
$$ 157 -130 272 86 -3 -92 -16 4 -23 165 -61 -215 79 52 -199 -50 108 -208 112 -46 -194 -234 -24
4358b4qK46J53J04l83l2j86o8L49k28l4J92j60l2L51l40J86r1P6j9k74j4L19j41
$$ -24 -32 214 367 471 88 56 -130 -198 151 -77 -111 81 -79 -111 240 -100 86 -5 71 52 -222 -236 83 -58
4382e8j22R0J19j97J75L3J91k5L7k0Q2l16m7O0n2J63p9J25l09K73j58K16j64j60
$$ -58 -180 -90 29 -168 7 40 231 206 243 223 305 -11 -58 2 -50 113 34 159 -150 123 -35 181 17 -143
4406a43K6L54m11K30J42L9m81J17k0K14o2K7M1J2j21Qj69P7q9O7j11L91r9k75
$$ -143 -117 237 -174 56 198 237 -244 -127 -147 67 5 32 73 85 -36 -28 -197 -120 -209 -142 -253 138 39 -236
4430b36L40l23J97K52j32n6o0L49j97m2j11J28r9J9j62J32N7q6M35k51m8o8k05
$$ -236 104 -219 -22 230 98 42 -18 331 134 92 -19 109 10 29 -133 -1 56 -30 405 154 106 38 -167
4453a67L37l66P7O9J46J62k80q8J47k82J09J71m8j06K09k4m47R2L60l9k39L67
$$ -167 170 -196 -119 -50 96 258 -22 -110 37 -245 -136 35 -13 -119 90 66 -381 -289 71 32 -207 160
4475A60j53lj89J92j90L16j10j23M0J21j23J48j11j48J06j32J83L88l47j73P2
$$ 160 7 4 -185 7 -183 133 23 -100 -60 61 -62 86 -25 -173 -67 -199 -16 372 25 -148 -76
4496g6J8K36k58n2R6j07M57n6j51jK56l66o6j62N03k67J53M2n6O2k64R3j04L97
$$ -76 -58 178 -80 -132 -36 -143 314 258 107 106 362 -4 -70 -232 271 4 157 199 143 205 -59 34 -70 327
4520C27j60j9K4j8j48j68K10O2l18L26l30J96j60K21Mm81O81k10O8j2q1j06L13
$$ 327 167 148 172 154 6 -162 48 110 -208 118 -212 -16 -176 45 49 -432 249 39 107 95 14 -92 221
4543B21l29J71J45l12L07j99J2P1q4m1K32k20k1M2K4R8l79O52m91J35j31P5J88
$$ 221 -108 63 208 -104 203 4 16 87 3 -38 194 -26 -47 -5 19 117 -262 390 -101 34 -97 -22 166
4566A66k63J77J67m55L47r2K0M4J3l09L37J59k74m8j08J60J14K5j23J41l77K23
$$ 166 -97 80 247 -208 139 47 67 111 124 -185 152 311 37 -11 -119 41 155 180 57 198 -179 44
4588D4l40J55K37k02R7Q4L7j04r2K68k51O1K09l43J51R0q6p8q1K41m1M9k41J85
$$ 44 -296 -141 96 -106 -9 75 112 8 -84 184 -67 -6 203 -140 11 101 15 -63 -144 97 56 105 -136 49
4612D9J52j77q4j68J51K8q9K78k41j99L93K9k29P5m1P8L5K6j80J61J47k86j29
$$ 49 201 24 -60 -228 -77 -49 -138 140 -101 -300 93 122 -107 -32 -73 5 40 66 -114 47 194 -92 -221
4635b21l1K66J31J26k22Q2J16k57J14n0m5p5J46J00qn3m3p8J17j34J05J01l42
$$ -221 -252 14 145 271 49 131 247 -10 104 54 9 -66 80 180 172 119 76 -2 115 -19 86 187 -155
4658a55K39k7O8j96L41j91k31Q9J60k89K04k03L4Q1J73P4n6j67k13K40J27q3j13
$$ -155 84 57 125 -71 270 79 -152 -63 97 -192 12 -191 -157 -76 97 171 115 -52 -265 -25 102 19 -94
4681i4M2O9j14j42L10k20L7L44l65L5M2J55O6n0j23o3J61k25M3J92k01j25L66
$$ -94 -52 17 -97 -239 71 -149 -112 232 -133 -98 -56 99 165 115 -8 -71 90 -135 -92 100 -101 -226 140
4704A40K46l55m2K3K10k66j85J68J02j4j98L06P3k9n33L47K62k00k42L35O8j98
$$ 140 386 31 -11 12 222 -44 -229 -61 41 27 -171 135 208 179 -354 -7 255 55 -187 148 216 18
4726A8J55q2j15J10j48k01M41l68K23n8K23m08K29o4L39m48K54Q2m4k67P7K23
$$ 18 173 91 -24 86 -62 -263 178 -190 33 -25 198 -210 19 -45 294 -154 100 182 138 -129 -52 171
4748A71q6k0K90l60J69k18L7K40k73J91k75K13j46J85j20K72k35j34K53l3l1l87
$$ 171 85 65 355 -5 164 -54 -17 223 -50 141 -134 79 -67 118 -2 270 35 -99 154 121 90 -297
4770b97M37m25K91P0J8K4k38j2J20Q8m5j13r8M51k45j24J98j14J24K35k40k64
$$ -297 140 -285 6 76 94 118 -120 -132 -12 76 31 -82 -180 271 26 -98 100 -14 110 345 105 -159
4792a59O9J70n1l8J3P0j59J28k3K00l04K87k83j09K77j30J2l8R6P5k39J30k73
$$ -159 -90 80 29 -9 4 74 -85 43 20 220 -84 203 -80 -189 88 -42 -30 -68 28 103 -136 -6 -279
4815b79K92k1j57J53O5o7j1K15k83k6o8K50j70J11K77m43m7L61J16m92J45K95
$$ -279 13 -8 -165 -12 53 -14 -25 190 -93 -119 -187 63 -107 4 281 -162 -209 152 268 -224 -79 216
4837B16r2k68K22q0j55K88m1n8j2J77k49j57L87k23N7k6Kk05K83Nk50Q5K21p3
$$ 216 124 -144 78 -2 -157 131 90 32 20 197 -52 -209 178 -45 12 -14 -12 -217 66 71 -179 -94 127 54
4861E4%k55K82M4j78j65N46k19j46n1K87l6p1k9n4j08j72L16j75QJ10m6j46K36
$$ 54 54 -201 81 125 -53 -218 328 109 -37 -88 199 163 92 63 9 -99 -271 45 -130 -122 -12 -58 -204 32
4885C2M7M7j03n4J48j19kj36K60l69K34J04k29PJ52J47j14j22J64q7j35J31l9
$$ 32 79 126 23 -31 117 -2 -4 -140 120 -249 -15 89 -140 -133 19 166 52 -70 94 7 -128 3 -36
4908c6J46J8l5O1K0R6l09n5K46L01n18Q7J65j73n7K6L4K8l70N55k45j05K20k2
$$ -36 110 128 93 154 174 270 -39 -94 152 453 -65 22 187 14 -43 -17 17 45 -325 230 -15 -120 100 78
4932G8l02K16k11n8L45l22L50j24n6O5J59l23K05J33l10J76K47m18J30q3K81j87
$$ 78 -224 -8 -219 -277 68 -254 96 -28 -84 -19 140 -183 22 155 -155 21 268 -150 -20 -103 178 -9
4954iK5p8L14K8r8k31m5K09j50j0J80j59l7K35R0j58j19J02l02L43k76J70j9J56
$$ -9 16 -62 252 280 182 -49 -94 115 -35 -45 135 -24 -61 174 264 106 -13 89 -213 130 -146 24 5 161
4978A61Q9j95j00Q6P8j02J46j90L6J18k40j2J52j49J69k8%q3p4mj10J45K01j81
$$ 161 250 55 -45 41 119 17 163 -27 9 127 -113 -125 27 -122 47 19 19 -64 -138 -142 -252 -107 94 -87
5002h7J60Mm4j50n9K03j31J33j50J62k1q2j95J5K52n9L3n4R5pn0R8R1k47J21j72
$$ -87 73 77 33 -117 -176 27 -104 29 -121 41 20 -62 -257 -242 10 -49 -16 -70 25 18 -32 66 157 -90 31 -141
5028a41J76m7R5J19L9k98P3k4qJ66o6k7j39J00J06M3k17J17o3J75l72J86k9m9
$$ -141 35 -12 83 202 241 -57 16 -8 -16 150 84 57 -82 18 124 167 -50 67 4 179 -193 -7 -36 -85
5052h5j16K43k4N3K0J43k15K16l12K13l12J39J4L43j93j91Q5k5npJ58m08L83k8
$$ -85 -201 42 18 71 91 234 19 235 -77 136 -176 -37 -23 320 127 -64 21 -4 -9 -16 142 -266 117 89
5076H9J3J93o28K23K78p0k43O2jo1L09j65k66L50m0R1j94j12K97l63J28J51lK6
$$ 89 102 295 -333 -110 168 98 -145 -83 -84 -145 164 -1 -267 83 43 134 -60 -172 125 -238 -110 41 38 64
5100F4K15l87K22k54K74r0j32R5j36N9O4m7Q8P0j78L7j06K87l96l9K47l8K14j41
$$ 64 279 -108 114 -140 134 44 -88 7 -129 -70 -6 -53 35 105 -73 -36 -142 145 -251 -290 -43 -81 133 -8
5124hJ87l03K00K5j38M3r8K49l11N2J59o9j18R5l7J85L7j52K2j6r9q9K82k60l9
$$ -8 179 -124 76 101 -37 6 -92 157 -154 -102 57 -12 -130 -35 -72 113 150 -2 20 4 -95 -184 98 -162 -201
5149b01L75l04QR0O2o1o2j60K82o0K26j56l14M09j38N2R0j24r2L3J68m1N3j34
$$ -201 174 -130 -122 -32 30 -31 -93 -253 29 -31 195 39 -275 134 -4 48 138 14 -78 -45 123 82 135 1
5173AJ65R1j56l33J36o1M28k33l34L03R3j42K2M81m13l19M63n7j15j58J25lo4
$$ 1 166 257 101 -232 -96 -157 271 38 -296 7 100 -42 -20 461 48 -271 192 135 20 -138 -13 -16 -80
5196h0M40n85M11j70o9J02j01j54O2L02j70l5PN9Qj62P0q0q3K64j74K75j52J54
$$ -80 360 -225 186 16 -53 49 -52 -206 -144 158 -12 -47 -40 19 27 -135 -65 -145 -228 36 -138 137 -15 139
5220A39N6k69M23l89K05k12J36J92l08J12j3K2l54L53l5j20O4J09J9j72J19J10
$$ 139 195 -74 349 -40 165 -47 89 281 -27 85 72 94 -260 93 58 -62 2 111 130 -42 77 187
5242A87Qj18K0L0j64J81J8L5n3j55O2L45l92J79j41m1K16k17R5k04P9n3J04J91
$$ 187 195 77 97 127 -37 144 162 197 144 -11 51 396 4 183 42 1 217 0 95 -109 -30 -83 21 212
5266B12n48J74K46rq4N3j47N9J51m6l5l3l4k70n0L72J86j48m7k41m3J28J10L58
$$ 212 -336 -162 84 75 -9 44 -103 -44 107 61 26 -7 -41 -311 -361 11 197 49 2 -239 -282 -154 -44 314
5290C14l45K57k54NJ08K0k10m4K04l02K07K64k21R6j10P1J59k91P3l40K14K30
$$ 314 -31 226 -28 -23 85 105 -105 -149 55 -247 -40 224 3 99 -11 60 219 -72 1 -339 -125 105
5312A05J27l48O6K20M2k98q6p6L03m2j53K1K59m43K85J17q4j84O3j03N0j8J08
$$ 105 232 -116 -50 170 212 -86 -172 -248 55 13 -140 -119 140 -303 -18 99 15 -169 -106 -209 -159 -177 -69
5335f9q4N35l00l70L29o8o0k93M15Q7j42%M9M2l9J29k16J58O4k50N3Q7j82J25
$$ -69 -153 382 82 -288 41 -27 -87 -380 35 122 -20 -20 29 71 32 161 -55 103 167 -83 -30 57 -125 0
5359@%k00K12j41J81l96N14j13J30k08j8J59M1rj12n1n2L18l68L52l40J99Kk45
$$ 0 0 -200 12 -129 52 -344 170 57 187 -21 -39 120 161 152 40 -11 -63 255 -113 239 -101 98 100 -145
5383a45q6q4L71k07J67m7J23oj27K6O5m0L79n40K57k85M93m59L42l4m44L35j05
$$ -145 -231 -315 56 -151 16 -31 92 86 -41 -15 50 10 389 -151 106 -179 314 -145 197 163 -281 54 -51
5406e1j36N58l01j37K31k14K6J89k57j48q2M30n9j6J12k81K32l17K46r2K80k99
$$ -51 -187 371 70 -67 164 -50 -24 165 -92 -240 -322 108 49 33 145 -136 96 -221 25 -67 213 -86
5428h6L78l32K9K3J85m16J71J49j38J26M1k93L21k66J34J08k63J43j49K21k82
$$ -86 292 -40 -11 12 197 -219 -48 101 -37 89 130 -163 158 -108 26 134 -129 14 -135 86 -196
5449a96J38L1N5k26L25n4j79P1j3J03Rk04NN3k89L35J80j30k35J34N5L4k9n4J01
$$ -196 -58 -27 28 -198 127 73 -106 -35 -48 55 64 -140 -135 -82 -371 -36 144 14 -221 -87 -32 2 -27 -81 20
5474B0j52L9M5j2L9j0oO3N9k40J31q7M5O6K8j8K05r6k6r1mK9j92L28P8j14o7q4
$$ 20 -132 -93 -48 -60 -21 -31 -37 26 85 -155 -24 -111 -66 0 28 10 215 119 93 2 -2 27 -165 163 241 127 60 -24
5502b4j53K50L2r8K01m24L89k59M6m6J27J65m15N5n1J46J68k54J70q7k0o4K96
$$ -24 -177 73 105 7 208 -216 173 -86 -40 -86 41 206 -209 -154 -205 -59 109 -145 25 -62 -82 -146 150
5525A50R7l35O1j35r6j17N44m6j70K65j90r4J51N5p5N1k8J08k28J54O7j71j74
$$ 150 247 -88 -27 -162 -258 -375 169 123 -47 218 28 -66 85 140 65 116 88 196 -32 122 189 18 -156
5548a56K55Kp1K00k85O7O7J06j43P5k90J88j52J39K98j17J78m58O2J09Q5K9Nj33
$$ -156 99 101 30 230 -55 12 79 185 42 117 -173 15 -137 2 300 183 361 -97 -35 74 159 188 193 60
5572F0p4j31K33l4M5n5j22L8O5J18r9k09m4R8o3j12R0j9J55J16J6j9J07qj50K81
$$ 60 -14 -145 88 54 99 44 -78 -40 25 143 44 -165 -209 -111 -174 -286 -196 -215 -60 56 72 53 160 152 2 283
5598B83l31LM4q9K04R7j39j40J08n5m9J28j90K09l52K78K7j41m1k3L21l46J65
$$ 283 -48 -45 -1 -90 114 211 72 -68 40 -15 -64 64 -126 83 -269 9 36 -105 -146 -169 152 -194 -29
5621b9L31l50q5K20P3%l39L17k17K07k5j10M18k75l70L00N6j54j0o8J68P7p4J12
$$ -29 302 -48 -133 87 160 160 -179 138 -79 128 103 -7 411 136 -234 66 122 -32 -42 -110 58 135 61 173
5645A73n32L33K95k03k08J19J35k24K88k13j3j6k08L85k56J7M79l95o6K0m0R5
$$ 173 -359 -26 269 66 -142 -23 112 -112 176 -37 -50 -66 -274 111 -145 -128 351 -44 -110 -90 -130 -35
5667c5n7K16k9k19L49k95J85j30J21l98J89O7j60L51J66L4l49M5r8N0J37l1p9
$$ -35 -92 124 95 -124 225 -70 115 -15 106 -292 -103 -36 -196 155 321 355 6 51 -47 3 140 109 30
5690C0O7j56J11j54L87N1l44p1J00l0k20J46J93k08l4K92j00k4N2n3K20n36K20
$$ 30 97 -59 52 -102 285 336 -8 -79 21 -9 -229 -83 110 -98 -132 160 60 36 88 35 255 -281 -61
5713f1J96Q8p2j20P9m2k30J62J79k14p1j90J88J32mq2R4Oj18n2J38j27J86ql43
$$ -61 135 223 151 31 110 68 -162 0 179 -35 -106 -296 -108 24 20 -62 32 38 -80 -132 6 -121 65 57 -286
5738b86L15o3J82M6j96k00L47J1J51n37M73m6m46qL91J99m08J90M0J3r8l13N53
$$ -286 29 -34 148 194 -2 -202 145 156 307 -230 243 197 -249 -257 134 333 -75 115 155 168 70 -243 310
5761C10k08j71j9J55Oj6p6N1j44M6J10L24n08K11lk35J57J49k17m7K11L6R9k00
$$ 310 102 -69 -88 67 73 57 -19 32 -112 -66 44 368 -140 71 68 -167 -10 139 -78 -125 86 122 221 21
5785B1k9j45J18J36q4l42L70k5k93L26j07n6L33Q9l84j39L56K4k73J94k20L56
$$ 21 -8 -153 -35 101 17 -325 45 20 -273 53 -54 -110 223 312 -72 -211 145 169 -104 90 -130 226
5807B26j93J7k08K77k87Q2L91k36k75K33J62n1q4l9J32j72M9j78K52k05J69p8
$$ 226 33 50 -158 119 -168 -86 305 69 -206 27 189 138 54 15 147 -25 24 -154 98 -107 62 -16
5829a6K68nl00j8P9n5j23K26j8Pr3K39r4j85K44m97L04n1L7r3O1J68j33j06NK53
$$ -16 252 247 -53 -71 8 -47 -170 56 38 45 -48 191 97 -88 156 -341 -37 -88 -51 -144 -83 85 -48 -154 -149 104
5855A04j66K27k39J37J8M6k21J45j7p6o8J8j00R8Q1k03M17L5l29N6J12m63M71
$$ 104 -62 165 -74 63 81 127 -94 51 34 -42 -110 -92 -192 -94 -13 -216 201 236 -93 -37 75 -388 83
5878H3m6r1J51l70K06j04L99j7k64j08K47k79K42J9j67J32J13j93k35J85J52Q9
$$ 83 37 -54 97 -273 -67 -171 228 211 -53 -161 86 -193 49 68 -99 33 146 -47 -282 -97 55 144
5900A44l22L53Q2k35l38J77l05M06R5J67l04J67J9k54J66J77n29K66K86k53J19
$$ 144 -178 175 257 22 -316 -139 -444 -38 57 224 -80 87 106 -148 18 195 -334 -68 218 -35 84
5921H4l05J45J2K67m07L51M2M7r5k73rK17k13L16j04M6k6k5k02K35P2j55m9j21
$$ 84 -221 -76 -64 203 -204 147 189 236 141 -132 -141 76 -137 179 75 121 95 70 -132 103 175 20 -29 -150
5945a50K45k84J87L15k29J6j89J29N1l28M14j90K51o2j69Q0r3r6L33M9j58r6j0
$$ -150 95 -189 -2 313 84 100 -89 40 91 -237 177 -13 238 176 7 87 -6 -102 231 280 122 26 16
5968A6m8Q2N8j30L49n25J07R6J6k22K67j82J41j61J73o1o2J54j6k83M37k79J38
$$ 16 -32 50 108 -22 327 -198 -91 5 21 -201 66 -116 25 -136 37 -24 -86 68 52 -231 206 -73 65
5991F5j21k00J56J56k1j54l07K35K38m06M80r3K9k7j16J96o0l3m3k36K93n4J83
$$ 65 -56 -256 -100 56 35 -119 -426 -191 47 -359 121 28 57 30 -86 110 50 17 -26 -262 31 -23 160
6014A60k11l1p1L44j59lN3j67J51J98k31j53l2O5j15L70M5j77p3j40L07p6q8K82
$$ 160 -51 -82 -153 191 32 29 82 -85 66 264 33 -120 -152 -87 -202 168 213 36 -37 -177 130 54 -34 248
6038B48m21J79K5j36L0M2O1j19J81n39M55mk0K73j92m9J40N0k02J29k4l83J71
$$ 248 -173 6 31 -105 -75 -33 28 -91 90 -449 6 2 -18 255 63 14 154 204 2 131 107 -276 -105
6061a05o6J29P2R7k79O2m8j17K87jL6j74K72N9N2l24R5K1n1L44l25J19k24k5p
$$ -105 -171 -42 30 127 -152 -90 -138 -255 32 31 67 -107 165 224 276 -48 47 68 17 361 36 155 -69 -94 -101
6086a01K46o8j36K67l53l7K54N7k35lK7k1K67j71R7J71l39L28k27j39n7j84K16
$$ -101 145 77 -59 208 -145 -182 72 129 -106 -109 -82 -103 164 -7 90 261 -78 250 23 -116 -173 -357 -141
6109a41K32k08R7KK0q3K0Rk30J92k8o6r1L59J13j13j30K29k01k05L75j1k13L33
$$ -141 91 -117 -20 -18 2 -81 -61 -52 -282 -90 -118 -184 -275 84 197 84 -46 183 -18 -223 152 141 -72 261
6133B61j78P1r5m7k0k4J0O3j65J42J06k97M13j16k04j07on1K02L29l33J06J13
$$ 261 83 154 59 12 -8 -32 -22 41 -124 18 124 -173 240 124 -80 -187 -193 -244 -42 287 -46 60 173
6156A73k37N02m47R3J38oj30N9k17M8q4l0r7M34q2k12J1k90K10J86m1K05k66J87
$$ 173 -64 438 -9 84 222 216 86 145 -72 -24 -108 -138 -235 199 117 -95 -84 -374 -164 22 -19 186 -80 107
6180A07r7j57J39L2R3k23k86L90K2J45J70l34J95j48j1O7K51l86K1k28J82p7J10
$$ 107 10 -147 -8 24 117 -106 -392 -2 20 165 335 1 196 48 37 104 355 -31 -10 -238 -56 -133 -23
6203b3j14J77j5j2J27pk29J09j00K16J5j29P3M6p5r0K07k32J55K2k92J15NM4J
$$ -23 -137 40 25 13 140 133 -96 13 -87 129 144 15 88 134 59 -31 176 -56 99 121 -171 -56 -51 -7 -6
6228fl%o2o6J37J50j27o0n1K18j76M9k07R0j39J71K29m03R1J85j43L29m22L14
$$ -6 -9 -9 -71 -137 0 150 23 -37 -88 130 -46 3 -204 -114 -253 -82 147 -256 -165 20 -123 206 -216 98
6252I8l38L97j13J02j17j71q4L52q9N9P1j72j24L87k87k4J28m8R1l7k68M25k07
$$ 98 -240 157 44 146 29 -142 -226 126 37 96 167 -5 -129 258 -29 -53 75 27 118 81 -187 238 31
6275C1j53l5M04k42j83J86l9R7j71L53o0J7q3l15n9K29J44J08j87Q3j37j37J85
$$ 31 -122 -157 247 5 -178 8 -31 66 -105 248 188 205 122 -193 -252 -23 121 229 42 125 -12 -149 36
6298C6k35N0L16ok50p6L9K48j28o5J6o5KR4Q7M3o0J9k72J36K11l51J38J00Q3j01
$$ 36 -199 -149 167 161 -89 -165 -126 122 -6 -71 -55 -120 -118 -24 63 106 46 65 -207 -71 140 -211 -73 27 110 9
6324IL14k78L4j73j41K39r1n7L24k93K9P4j01K3K11p6j5j52j14J71K27l40K16
$$ 9 323 45 79 -94 -235 4 -87 -144 180 -113 -84 -10 -111 -88 123 47 32 -120 -234 -63 164 -176 40
6347D0Qj1j25J82k28l0J95p5k2j23J82o2n0j3L23l86lJ46j06L41l44r7J81J28
$$ 40 48 37 -88 94 -134 -164 31 -44 -66 -189 -7 -69 -119 -132 191 -195 -198 -52 -158 183 -161 -258 -77 51
6371E1O6j34O6R3j76q1K81l36K01L12k63j33J61j07k1O5Qp0j83J14K08k5j70p7
$$ 51 117 -17 49 142 -34 -115 166 -170 31 343 80 -53 108 1 -20 45 53 -17 -200 -86 122 97 -73 -150
6395a50K7K35J62k58L2l3j16M2j85Q0p1M50k87r2K62P1N5j65k03P4R0j21K07J02
$$ -150 -123 112 274 16 48 15 -101 -59 -244 -164 -235 215 -72 -164 98 169 224 59 -144 -70 20 -101 106 208
6419B08k30q4K91k77J69P2k17M6j13K05k16J37m3j18K89l68L07j13J52J66l12
$$ 208 -22 -106 185 -92 77 149 -68 -22 -135 70 -146 -9 -52 -170 119 -249 58 -55 97 263 -49
6440d9j8r5M05k69q9N6J08j15P7j85J46j42J16K62m09J00o7J19p0J40o9J87o6
$$ -49 -67 -162 243 -26 -115 -59 49 -66 11 -174 -28 -170 -54 208 -201 -101 -168 -49 -119 21 -48 139 73
6463G3l54K38J2o7j5J67O0m4k49K23J0j77L34m71K02O1L7J43k21J33J26k20r1
$$ 73 -281 -43 -31 -98 -113 54 114 70 -179 44 54 -123 211 -260 -58 3 40 183 -38 95 221 1 -90
6486i0J17J36k9l54N7L87J13m87N4K99j18o7R6j33J55j48R2k04K45j66l1Qo1K58
$$ -90 27 163 134 -220 -163 224 337 -150 -96 203 85 18 114 -19 136 -12 80 -124 121 -45 -76 -68 -129 129
6510A29j82O5P3r2J3j42o7rO1M36r0q8M6n6l2j30K14j53K02j37j31k3K53k94J34
$$ 129 -53 12 85 -7 6 -136 -203 -212 -151 285 195 107 153 97 65 -65 149 -4 198 61 -70 -93 160 -134 0
6535@J32j37J54K9j96P1m4r6k6K32k31o8K41l91J99K84j12j74N8o1J15o3J09K13
$$ 0 132 -5 149 178 -18 53 9 -87 -113 119 -112 -180 61 -330 -131 153 41 -133 -75 -136 -21 -84 25 238
6559B38k04j4L33n78J73J51j98J85j54O7k68J51L8J26l1Q1q0j73K83j3k90J94
$$ 238 34 20 353 -225 -52 99 -99 86 -68 -1 -269 -118 -80 46 15 96 16 -157 126 113 -177 17
6581A7K3k90N6L14k15j38L16j89K11n4N7j24j04J1J85j22o2l8J91k97L38J0q3
$$ 17 40 -250 -194 120 -95 -233 83 -106 105 51 108 -16 -120 -109 76 -46 -108 -146 45 -252 86 96 13
6604A3J83j32j12j17Q6R1p2j72L86o3J0k73L34j10P9l34L62j54J4p9J75J15j21
$$ 13 196 64 -48 -165 -79 12 -60 -232 154 91 101 -172 162 52 131 -203 159 5 19 -60 115 230 109
6627A09j65l05L10K41k54P3n7j35K97L3j05l9J8O8j64k3J20q3R0n7p1J68P2l74
$$ 109 -56 -361 -51 190 -64 9 -48 -183 114 147 42 3 21 89 -75 -98 22 -61 29 -28 -99 69 141 -233
6651b33l7M12j19P3j16QK9k43L20J74l44J27m1J01j07J05n5j65M4M52m99R9P6
$$ -233 -270 142 23 96 -20 -12 17 -226 94 268 -76 51 10 111 4 109 54 -111 -67 385 -114 -15 61
6674F1k1J2j28j8K2M8n5J23K47l74R9J52L4r0j56p5L84l02J5J5O6j34N0K61l25
$$ 61 40 52 -76 -94 -72 -24 -79 44 291 -83 16 168 202 112 -44 -119 265 -37 -22 -7 59 -75 -25 236 -89
6699h9L47m88K33J05K6j27j48K13j23l1K82j31l25k3j3j18M26j05L3m1o2J46r5
$$ -89 258 -230 3 108 134 7 -141 72 -51 -82 200 69 -256 -279 -292 -410 16 -89 -56 -97 -159 -13 -108
6722a08J01K39k03L2r3q0j05J57n7o5K32J70j28j24n6K54j78P9k0L0J3K8l99M64
$$ -108 -7 232 29 61 -32 -112 -217 -60 -117 -182 50 220 92 -32 -88 166 -12 67 47 77 90 118 -281 183
6746A83qk4j06j61K89l38L55k30J21n8k7J25k06j37K08j16QK41k24K6N9K24j01
$$ 183 175 151 45 -116 173 -165 190 -40 81 23 -4 121 -85 -222 -14 -130 -122 119 -105 -79 -20 204 103
6769A03o7q4J57m4k78K77j90l2K88r7j77J18k50L40L3Q1k07n3r8l9M34P2k03K25
$$ 103 36 -48 109 65 -213 64 -126 -158 130 33 -144 -26 -276 64 97 178 -29 -82 -180 -219 215 287 84 309
6793C09j25rj29P5J9k84J58q9pK05k14J56j67J70k0l78L82O5k70N9J54k25L48
$$ 309 184 175 46 121 140 -144 14 -75 -82 123 -91 65 -102 68 48 -330 52 117 -153 -94 60 -165 183
6816A83k40K44k08j29J56R8m72J85K12J4P8j59p5n5J70J40k39l3K51k91J80k3
$$ 183 -57 187 -21 -150 6 104 -368 -183 29 43 121 -38 -113 -168 2 142 -97 -130 121 -170 10 -13
6838a3J11J28j47Nk10J07N7J6P9n52M38L16n66J33L58L3j11k34K49n27L80Q2j75
$$ -13 98 226 79 84 -126 -19 38 54 133 -419 19 335 -231 -98 260 293 182 -52 197 -330 50 132 -43
6861d3J44k60j55J94J98k01k1o9L32J03k04k1l3K18j41J75j47l08M73j52N1j84
$$ -43 101 -159 -314 -120 78 -123 -144 -213 119 222 18 -3 -36 182 41 216 69 -239 234 82 133 -51
6883e1J25j04J26o2k17L5J64k83K02K63k70q9K41J65l09P5Qj51J7K42k6k11K73
$$ -51 74 -30 96 34 -183 -148 16 -267 -65 198 -72 -161 80 245 -64 11 19 -132 -115 127 101 -110 163
6906A63j85q9K05Q0J1l22J45n04O21j68Q1l11M29p9k15K11O8m44K25L2Q3M2k0
$$ 163 -22 -111 94 174 185 -137 8 -496 125 -43 38 -273 156 77 -138 73 141 -303 -78 -46 37 79 59
6929E9K16l13J86j08j02J21N7j10K41l26m8l2L20k53J42j21j00M2J48P7M0m05
$$ 59 275 -38 148 40 -62 59 116 6 247 -79 -127 -159 161 -92 50 -71 -171 -129 19 96 136 -269
6951b69K03Oj07O8J04m1j7K47p8j44Q5k22K6L65M8j63j95M5L1Kn3Q9J98k96K68
$$ -269 -66 -60 -167 -99 5 -36 -53 194 116 -28 57 -165 -139 226 274 111 -84 -39 -8 -6 -59 30 228 -68 200
6976B00j18N2n4j88J81K20j99j41J40k31K30k0j81J78J09%k21o6j50J93j11K11
$$ 200 82 134 80 -108 73 293 94 -47 93 -138 92 72 -109 69 178 178 -43 -109 -259 -66 -177 34
6998C4P3k0k2Q3n6j98J52J92l66K83j74L0k07J36R6j10J73l13L59j94Q9m4r7L71
$$ 34 107 87 65 148 92 -106 46 238 -128 155 -19 11 -196 -60 36 -74 99 -214 145 -49 40 -4 -101 270
7022B70k27Mj75J19r7m0l8R5j33j05K09N8J08j72K09P5k85j37L32k00J61l15J49
$$ 270 43 47 -128 -9 -106 -146 -184 -89 -222 -327 -118 -60 48 -124 85 160 -125 -262 70 -130 31 -284 -135
7045a35l4J40N3k39J48J43l6k77L33j73q5l2K41J44k69L5J9k42J75M7M4J31k92
$$ -135 -169 -29 24 -215 -67 76 40 -237 96 -77 -162 -194 47 191 -78 -43 -24 -266 -91 -44 0 131 -161
7068a61K9J65j12p2K46%K6p2j06J05J10o7J46n07K46J05k2N0l15K34j44L19j31
$$ -161 -132 33 -79 -151 95 95 121 49 -57 48 158 91 237 -270 -24 81 59 109 -206 28 -116 203 72
7091G2j9l03J86p4J30Q5o1J26J5l79J78J3o2Q8M0j9j77L83j22N0k79P0j22j70
$$ 72 53 -250 -64 -138 -8 77 16 142 157 -222 -44 -31 -93 -5 35 16 -161 222 100 150 -129 -59 -181 -351
7115c51M46j56K57k61K98k39%m2K3P7j23N2j6K66l16j19j05L45J84J02m17O3j44
$$ -351 95 -61 196 -65 233 -6 -6 -48 -25 52 -71 -19 -35 231 -85 -204 -309 36 220 322 -95 -32 -176
7138a76K6L74o0m1N6j03k9k7k33J80K1j67K45k22j1K66j89J52j13k1P1p2l23N03
$$ -176 -150 224 164 123 179 76 47 20 -213 -33 -12 -179 66 -156 -167 99 -90 62 -51 -72 -1 -73 -396 107
7162A07J6k3k17K23j08l2j48N4p3K83k94L47j52Q1J36j81J83k37K7j78L01m8K38
$$ 107 123 100 -117 106 -2 -34 -182 -128 -201 82 -212 135 -17 64 200 19 202 -35 -8 -186 115 67 305
7185C05k83rQ0o5r0P7M0j39K0J7J2J9k10M84j93j52K17l14K80m6k58K98k73L12
$$ 305 22 13 93 28 -62 15 55 -84 -64 -47 -35 -16 -226 258 65 -87 130 -184 96 50 -208 90 -183 129
7209A29j05kK17k04j09j37L15k48J3J82L0r7J57j20rp4k5J35J42l39j83K59J21
$$ 129 24 22 239 35 -74 -211 104 -144 -131 51 81 -16 141 21 12 -62 -87 48 190 -149 -332 -73 48
7232D8J68k45L34l65J91Rk49K09J57j91k71L33j11p9k34J86L49k59J92k53K24
$$ 48 216 -29 305 -60 131 140 -109 100 257 66 -205 128 17 -62 -296 -110 239 -20 172 -81 143
7253A43L0k3k35K55o9q5n0j27P2j98J04J1J64pR3j50N0q2J53J37l56K10o1O5R1
$$ 143 173 150 -85 170 101 16 -34 -161 -89 -287 -183 -172 -8 -15 78 -72 -22 -104 49 186 -170 40 -21 44 135
7278A35k02m5j7L05q0j18L3J2k09JJ59O7l29K85j38R5J53j90J92r9J54k56J25
$$ 135 -67 -112 -129 176 96 -22 11 23 -186 -185 -26 41 -288 -3 -141 -46 107 -83 109 10 164 -92 33
7301C3j84N4j13K02r8J18j22L50k89J35k1J6n2j33ML57k18o3J52k62L3K41J6J7
$$ 33 -151 -97 -210 -8 -106 12 -110 240 -49 86 65 81 29 -104 -100 257 39 -24 128 -134 -101 140 156 173
7325A73k62J66K16j84j05j43J54j0P0j43M37j64l79M4K23O7K5j72J61j63J43l34
$$ 173 -89 77 293 109 4 -139 15 5 75 -68 369 205 -174 -130 93 160 185 13 174 11 154 -180
7347a80K19j24K9J85j47J40q9j59K33k31K67l53M87j96l76L64j03J43Q5k07k46
$$ -180 39 -85 -56 129 -18 122 33 -126 107 -124 143 -210 277 81 -295 69 -34 109 194 -13 -259
7368b59L13M6j81J64J15k09R9l35L74q3j74n5J48J3K53j94K1K41k58r5JQ9m1q4
$$ -259 54 100 -81 83 198 -11 88 -247 127 44 -130 -185 -37 -24 229 35 56 297 39 -56 -55 34 -7 -91
7392i1R1k8j5N9J2j15N7O3m4N9q7q5K49N1l64j2L55l33L62o7k17K63l10R7j16
$$ -91 0 -28 -43 16 28 -87 -30 33 -11 48 -39 -124 125 176 -188 -200 155 -178 184 117 -100 163 -147 -50 -166
7417a66RJ57m0k9K88q2q4q3j32K55o3l02K16m4j70J45M14l20L8j36P6p4J47N0
$$ -166 -157 0 -40 -69 219 137 53 -30 -162 93 30 -272 -56 -100 -270 -125 289 -31 7 -129 -53 -127 20 70
7441G0m1k37r1J40L15j33M8l8K0l06N3MJ57J6k1J0K73k95o8P5J04N1q9L2k54L60
$$ 70 29 -208 -299 -159 156 23 71 33 53 -253 -200 -196 -39 -23 -44 -34 239 -56 -124 -49 55 106 17 49 -205 155
7467A55k91Nr1K92P9Lk5j60j07J89l4k20L2J24k34J68J70k72J34r7J81j9k24j13
$$ 155 -136 -131 -222 70 149 152 127 -33 -140 49 15 -205 -173 -49 -283 -115 55 -217 -83 -180 1 -18 -242 -355
7491c55J87J45j00k30M43r8r7M47l80R9k35J47J91l58K84R9k64r3L05K2m0k85
$$ -355 -168 -23 -123 -353 90 -8 -105 342 -38 61 -174 -27 164 -194 90 189 -75 -168 137 159 119 -166
7513a66L26o8P2l9l20K51n3Rr6N7O6O8K6n48M17K5LM3j76K38n6j94M1p7K15L1
$$ -166 160 92 164 125 -195 56 3 12 -84 -27 39 107 133 -415 2 27 30 73 -103 135 79 -115 -74 -151 64 95
7539I5k11p6K77r3l4QQ6qKj19j25J47j71M62k11j98L38j42j40Q6k17R3j00j5K51
$$ 95 -116 -192 85 -8 -42 -34 52 44 46 -73 -198 -51 -222 240 29 -169 169 27 -113 -27 -244 -151 -251 -266 -15
7564a5J18O6j71l1L11k68P4j85j9K10j40J18k33J54O4J03k94Q7J91k76J44KM2
$$ -15 103 169 -2 -33 278 10 84 -101 -120 90 -50 68 -165 -11 53 156 -138 -51 140 -136 8 10 52
7587E2Ol9o3N5j67o0J55J08j06J01J15l01L88j59m09K46M9n1K4Kk22J98j04L15
$$ 52 58 19 -44 11 -156 -216 -61 47 -59 42 157 -144 244 85 -324 -78 -29 -80 -56 -54 -276 -78 -182 133
7611A33j00Mj83JM5J61J01k72m2R8P9n4J16j03j09r9K97M2k5P2j45j56K02j39
$$ 133 33 37 -146 -145 -100 61 162 -110 -152 -54 25 -29 87 -16 -125 -224 73 115 90 162 17 -139 63 -76
7635g6J48k35K55m50L84j3j86o2J16N3r2K05k4J02%k4k28J53j79J23k68K85N4
$$ -76 72 -163 92 -358 26 13 -173 -235 -119 -66 -158 47 23 125 125 101 -127 26 -153 -30 -298 -13 41
7658D1l37L57J47m11J3J89j47J40n0q5K65l38J01K73p6k10R6K0o2P1P0k0j87M53
$$ 41 -296 61 208 -203 -190 -1 -148 -8 -58 -143 122 -216 -115 158 82 -128 -32 -12 -74 -3 67 47 -140 313
7682C13l64J11J97n34K31J2J71k30q3L75j81k19L92j20L9j3j38l2K36k40N3K68
$$ 313 -51 60 257 -277 -46 -34 137 -93 -176 199 18 -201 191 71 110 97 -41 -73 163 -77 -24 244
7704B44j38k01N3J26K4k47J76K03j49j36j56J85N1J59k89K6m9M28l39N5q0o5R5
$$ 244 106 -95 -42 84 108 -139 37 240 91 -45 -201 -16 35 194 -95 -69 -118 310 -29 26 -54 -119 -24
7727b4K20j91mM76n95r3J42j15J17Q5j36J09J4K21k94K56m2l04J49JR0N7o2q9
$$ -24 196 5 1 477 -118 -211 -69 -184 -67 18 -118 -9 5 226 -68 188 146 -158 -9 -8 82 139 77 -12
7751a2J56l75L81j4j32K2j7J27p4%r7Q2K8j80P1j00L48k94m8MP0J7j34J01q9M33
$$ -12 144 -231 150 136 4 26 9 136 62 62 -35 47 75 -105 -34 -134 214 -80 -128 -124 -54 -37 -171 -70 -159 274
7777B74j32l00p4Q6n6K43mo2o1o3J03J61k26K12o7K61l64M0J35j16L6o9K5j07
$$ 274 142 -158 -232 -146 -202 41 37 -25 -86 -149 -46 115 -111 101 34 295 -69 -29 106 -10 26 -43 -18 -125
7801a25L21k58K5kK06n6k37K51l17K46p4j27K51k08J83K6K19o01K68J28k84K23
$$ -125 196 -62 -37 -39 167 111 -126 125 -192 54 -20 -147 104 -104 79 105 324 -277 -9 119 -165 58
7823E8K56k36j2j73O3K6J87q1l12K5L69p4N5l09K34j14J17q7o2K79N8l32K02j12
$$ 58 314 78 66 -107 -44 -18 169 88 -224 -199 170 96 151 -158 76 -38 79 -8 -70 209 267 -65 137 25
7847B5Q1k98J41j7NJ56L0j98R6J21j48R6l79L49k00J7Rn7P5K61m33L66n3j26K83
$$ 25 106 -192 -51 -68 -63 93 123 -75 21 142 -6 90 -289 60 -140 -123 -114 -171 -96 165 -268 98 45 -81 202
7872B02Jl27j14K68J11k9m8Nml3k94M18j24J14j62j2K7n2K27l86K94k19L65j33
$$ 202 203 -124 -238 30 141 112 64 69 65 32 -262 156 32 146 -16 -28 -1 -53 174 -212 82 -137 228 95
7896I5l10O%K14K74l28K8j93NK13L3j18J38m8l33K29L43N9l72J39j53J6k1k8J83
$$ 95 -215 -209 -209 5 279 -49 -21 -214 -209 4 37 -81 57 9 -324 -95 248 307 -65 74 -79 -63 -84 -112 71
7921G1j37M3K97n58J79M0J85k79K67k75L60j49m13L02L44m06J52r7J52k12L07
$$ 71 -66 -23 274 -284 -105 -65 120 -159 108 -167 193 44 -369 -67 277 -129 23 -74 78 -134 173
7942A73k55K9o1m7J43O6o7Mj08k0K91r2p0J45j06j30NJ52j80M1k33J34K69l6J24
$$ 173 -82 -53 -114 -161 -18 48 -19 -15 -123 -143 148 56 -14 131 25 -105 -100 52 -128 -87 -320 -186 83 47 171
7967A71k75J59k96L44j4L0j21p0J65j64R6J49q5m46K18o2K83J10k2j89J05j14
$$ 171 -104 55 -241 103 89 119 -2 -72 93 -71 25 174 89 -357 -139 -201 82 192 170 -19 86 -28
7989b8K03j40j70J91j21N3j91J44n0J62o5KQ4k06J33K10k83K38l72J54J89k41
$$ -28 175 35 -135 56 -65 -12 -203 -59 -109 53 -12 -10 74 -132 1 211 -72 166 -206 -52 137 -104
8011a04M8M6j5k5p2n2J1R5J5j37K49j51j55K90J92k57j35J42J4K07k53J72j04
$$ -104 -56 -10 -25 -50 -122 -174 -163 -68 -53 -190 59 -92 -247 43 235 -22 -157 -15 -1 206 -47 125 21
8034B1J0p5rk9N2p0J22j36l8R5Kk6K42j02l4l1O0j13K89l40J8o4M3J90j26Ok08
$$ 21 31 -44 -53 -82 -30 -100 22 -114 -152 -57 -55 -81 161 59 25 -6 54 -59 230 -110 -92 -156 -113 77 -49 -43 -251
8061b51M49k09R5m5K3k96L83l40K36R5k31O6K14m03P9L41k18J60j60k05L1K58
$$ -251 198 -11 84 39 62 -234 149 -191 45 140 -91 -25 189 -214 -135 206 -12 148 -12 -217 -186 72
8083G2J35j57j17n5J23N4KM3Q6l83Q5n2q6K12J21n4k3k95J37L57k21j8j07r1K34
$$ 72 207 50 -67 -122 1 55 57 100 186 -197 -112 -164 -250 -38 83 29 6 -289 -152 205 -16 -34 -141 -232 2
8108BQ8o4p2K16O8k89k37J30L79j32J62k75k24K79L4k31J02J33j85P3l0J7P4J93
$$ 2 90 26 -46 170 238 -51 -288 -158 221 89 251 -24 -248 31 65 -166 -64 69 -116 -43 -73 -56 18 211
8132B11k97j88K46K3O6j92J21q9J86J30l82J59n0m6K5N0o3J69j93J22J00j70j1
$$ 211 -86 -274 -28 -5 61 -131 -10 -99 87 217 -165 -6 -56 -102 -77 -27 -90 79 -114 8 108 -62 -73
8155g3K82j96K65l77P1l2p7J56J1L0k50L6J62j30M9j52L83j27j98K64k98L21N
$$ -73 209 13 278 -99 -28 -60 -137 19 30 60 -190 -154 8 -122 -73 -225 158 31 -167 97 -201 120 125
8178A25j93j3K86l05Q5L3%j28J61L25m16J47O4
$$ 125 -68 -81 205 -100 -15 18 18 -110 51 376 -40 107 171
8191A71
$$ Imaginary data points
##PAGE= N=2
##DATA TABLE= (X++(I..I)), XYDATA
0@%%%%%%%%%%%%%%%%%%%%Lj1J6j6J6j6J6k0K8l2L2l7M5m9N5o2O9p8Q7r9J12j22
$$ 0 0 0 0 0 0 0 0 0 0 0 0 0 0 0 0 0 0 0 0 0 3 -8 8 -8 8 -8 8 -12 16 -16 16 -21 24 -25 30 -32 37 -41 46 -53 59 -63
42f3J32j46J63j82K01k22K45k70K99l30L62l99M40m87N41o01O73p57Q58r82J137
$$ -63 69 -77 86 -96 105 -117 128 -142 157 -173 189 -210 230 -257 284 -317 356 -401 457 -525 612
63F12j341J617k017K652l816O646k6588l0242N4732K9523l2646l3186K5602K1490
$$ 612 -729 888 -1129 1523 -2293 4353 -22235 -52477 2255 31778 -868 -34054 -8452 13038
77A3038p184r752J2427K431j8951J0766K5137j7556j9797M310J6596J739k1722
$$ 13038 5854 -3898 8529 10960 -7991 2775 27912 10356 -9441 -5131 11465 13204 -8518
90h518Q83J5182j3245j231J7435k106j4518j503K0667Q410k2496p320K0119L481
$$ -8518 -7635 7547 -5698 -6929 10506 8400 -6118 -7621 13046 21456 -1040 -8360 11759 15240
104A5240j9618k770J5700n745j6746M388J3739q91j7436P51K0533m386j1242R468
$$ 15240 -4378 -7148 8552 2807 -13939 -9551 4188 3297 -14139 -13388 7145 2759 -8483 985
118I85L404n904k455O563P653j5362j2565J8676R500j7781j1194J0327J3374m133
$$ 985 4389 -1515 -3970 2593 10246 -5116 -17681 995 10495 -7286 -18480 -8153 5221 1088
132A088j3129L589J3908O59q637N23M825L388P00q435k255Q066O30l805o232j793
$$ 1088 -12041 -8452 5456 6115 -2522 -1999 2826 6214 6914 -1521 -3776 4290 4920 1115 -5117 -6910
148f910J0912J683r123J338L874J370L107p45j095n33k227M341L924p049o834
$$ -6910 4002 5685 -3438 -2100 1774 3144 6251 5506 4411 3878 1651 5992 9916 2867 -3967
163c967K051M490K825l786j0470P34J2178L650p297q988K773J5580M0j3999q53
$$ -3967 -1916 2574 5399 1613 -8857 -8123 4055 7705 408 -8580 -5807 9773 9813 -4186 -5039
178e039O042K140j400m588j498j50k245N404K843r663j747R749K412n066j521
$$ -5039 1003 3143 1743 -2845 -4343 -4493 -6738 -1334 1509 -8154 -9901 -152 2260 -2806 -4327
193d327M635K758n203j221R687k613j2449L655J0437k298r180j913Q472M002p488
$$ -4327 308 3066 -2137 -3358 6329 3716 -8733 -5078 5359 3061 -6119 -8032 440 4442 -3046
208c046m8O790l549j018O841L50n210k255N353M621p363n147O967J079p350K062
$$ -3046 -3094 3696 147 -871 5970 6320 1110 -1145 4208 8829 1466 -3681 3286 4365 -2985 -923
224i23N545m061m767L776Q300k396j1759M598J2763n461j0471L725N942j438o485
$$ -923 4622 561 -4206 -430 7870 5474 -6285 -1687 11076 5615 -4856 -1131 4811 3373 -3112
239c112p00N360l022m446O126J96o860K591O505j188o009l1Q006O36r536Q93Q458
$$ -3112 -3812 1548 -1474 -5920 206 402 -6458 -3867 2638 1450 -4559 -4590 3416 4052 -5484 -4591 3867
256C867l554o471L388L374k654m226K584O316l905n870P099M918n574q54L480
$$ 3867 313 -6158 -2770 604 -2050 -6276 -3692 2624 -1281 -7151 -52 4866 -708 -1562 1918
271A918Q14j607j792L385N19o160J551O875m560n062M279L514j359l694J332N397
$$ 1918 2732 1125 -667 2718 3237 -2923 -1372 5503 943 -4119 160 3674 2315 -1379 -47 5350
287E350j985m466M867J993n235k78K926n6k908k066K395J952m598l6M591l345
$$ 5350 3365 -1101 3766 5759 524 246 3172 3116 208 -1858 537 2489 -2109 -2145 2446 -899
303h99j729L801M44k148j637J858L913l889m333M668J803m889l23K134q24n78
$$ -899 -2628 1173 1617 -531 -2168 -310 3603 -286 -4619 49 1852 -3037 -3360 -1226 -2050 -2628
319b628q79J964J109l354J599M409l607j373L737J22j893m76J045J580k767j662
$$ -2628 -3507 -1543 -434 -3788 -2189 2220 -1387 -2760 977 1099 -794 -1270 -225 1355 -1412 -3074
335c074M826n54m377J808L319r71j355L91K726L09l453J798L328l795r72L420
$$ -3074 1752 1198 -3179 -1371 1948 977 -378 13 2739 3048 -405 1393 4721 926 -46 3374
351C374p46k712k9J701J349l330j607M956m79m424K424K708k006j689R55K322
$$ 3374 2628 -84 -113 1588 2937 -393 -2000 2956 2477 -1947 477 3185 1179 -510 445 2767
367B767j394l819K247L392m778k140L966J48k713k48J729J039k648p79M577r36
$$ 2767 1373 -2446 -199 3193 -1585 -3725 241 389 -2324 -2572 -843 196 -2452 -3231 1346 410
383D10m498K867L134k787k489J326K714o76l708J968L338l559j339M323l47k153
$$ 410 -4088 -1221 1913 -874 -3363 -2037 677 1 -3707 -1739 1599 -1960 -3299 1024 677 -1476
399a476J44K272J695l194j134M565j92m340J989K553k327j670J946K236j337l870
$$ -1476 -1332 940 2635 -559 -1693 2872 2680 -1660 329 2882 555 -1115 831 3067 1730 -2140
415b140K661L895l928j502L291M18j934J29J271L01k688n99M247j432m616J938
$$ -2140 521 4416 488 -1014 2277 2695 761 890 2161 2462 -226 -825 3422 1990 -2626 -688
431f88K733k079j534R57J380p44k330K137K473m273p32L676j58k715n63J882J100
$$ -688 2045 -34 -1568 -611 769 25 -2305 -168 2305 -1968 -2700 976 818 -1897 -2460 -578 522
448E22k795j081L960r08l639K088K640j583j413Q87J594l3j974J720J475l666
$$ 522 -2273 -3354 606 -302 -3941 -1853 787 -796 -2209 -1322 272 239 -1735 -15 1460 -2206
464b206M31L786l80k905k55K088J746k148j099K700m86j847K645R67l011l12K524
$$ -2206 -1775 2011 1631 -1274 -1529 559 2305 157 -942 1758 1272 -575 2070 3037 26 -286 2238
481B238J244j758l262K563K692l423j233K864n14j889O40J456P2k232r53L312
$$ 2238 3482 1724 -1538 1025 3717 294 -939 1925 1411 -478 162 1618 1690 -542 -1495 1817
497A817l19k831J668M51j601k57R70Q18j581k146K075K003k751o31J920j238k09
$$ 1817 1498 -1333 335 786 -815 -1072 -102 716 -865 -3011 -936 1067 -1684 -2315 -395 -1633 -1842
514a842K182l00j704j652K303L912l195m613L566L346j907k051L40J393J15j112
$$ -1842 340 40 -1664 -3316 -1013 2899 -296 -4909 -1343 2003 96 -1955 -1615 -222 -107 -1219
530a219J865M97l048O52M078p34k718j05J237J613r10j358J930j069j139K406
$$ -1219 646 1143 -1905 -1253 2825 2091 -627 -732 505 2118 1208 -150 1780 711 -428 1978
546A978L84k488L45J181j20k04q81J274J53k646J403K955k628k865J746K300l0
$$ 1978 2362 -126 219 1400 1280 1076 195 1469 1622 -1024 379 3334 706 -2159 -413 1887 1857
563A857l022p11K635o23j766K434m18l026M81K988R56l032k527K744L566l113
$$ 1857 -1165 -1876 759 136 -1630 804 386 -2640 -2159 829 1785 -1247 -3774 -1030 2536 -577
579e77k310J605N99N55m16q60k49L91O50J460j653j192K596J38j898J240P78n85
$$ -577 -2887 -1282 -683 -128 -544 -1404 -1653 -1262 -612 848 -805 -1997 599 737 -1161 79 857 272
597B72r39j0K138K16l265J190K880j706j619J671J001q70j885J339L297k136l390
$$ 272 -667 -677 1461 1677 -1588 -398 2482 776 -843 828 1829 959 -926 413 3710 1574 -1816
614a816K456K071j307q76o20M71J201o93J95p38j975K040J911k495j149J160N00
$$ -1816 640 2711 1404 528 -92 379 1580 887 1082 344 -1631 409 2320 -175 -1324 -164 336
631C36j18r34j59Q13r00n59K501p48l164J438J775n87j181m77J876L0k172J369
$$ 336 218 -716 -875 -62 -962 -1521 980 232 -2932 -1494 281 -306 -1487 -1964 -88 -58 -2230 -861
649h61K508k644j676J905J816p08k331L98K688p05j935J812K1j686J286J421k84
$$ -861 1647 -997 -2673 -768 1048 340 -1991 -1593 1095 390 -1545 267 288 -1398 -112 1309 1025
666A025r01r60J928J049j795n50J182j044R88J439j505j427L06K391O84l054j724
$$ 1025 124 -836 1092 2141 346 -204 978 -66 922 2361 856 -571 -265 2126 2810 -244 -1968
683a968L503J037k384m23R63L68p09p61R92L69k264P97J977j483j272J045L41
$$ -1968 1535 2572 188 -235 728 1096 387 -374 618 987 -1277 -480 1497 14 -1258 -213 128
700A28k69p12j04J447j160j320K165p3j774L84P23j20j63m87Q16N53j856P73J752
$$ 128 -141 -853 -957 490 -670 -1990 175 102 -1672 -1288 -565 -685 -848 -1335 -519 34 -1822 -1049 703
719G03j572m79J074M10o1m75l94J565o21q13J882q54j304J190P39k88o53k40J430
$$ 703 -869 -1348 -274 136 75 -400 -794 771 150 -663 1219 365 -939 251 990 702 49 -191 1239
738A239K33j805N13J511q20o94O00R8M27o72n65Q59L1r32J174m82j554J421K66
$$ 1239 1472 -333 180 1691 871 177 777 875 1302 630 65 924 955 23 1197 715 -839 582 848
757H48o97q01L02O08Q6j330O26O58r65L9O30m99n78P4K36P83q64j043J818j95
$$ 848 151 -650 -348 260 346 -984 -358 300 -665 -626 4 -495 -1073 -999 -763 20 -844 -1887 -69 -264
777b64p84P66j5j044R12jN94q59p44J263J348j948l03J518k78l05l8L67N76q16
$$ -264 -1048 -282 -297 -1341 -429 -430 164 -695 -1439 -176 1172 -776 -1079 439 161 -144 -182 185 761 -55
797e5l07J899r24r73J265Q1l37j69p7N09O5q93R15L77j640M39J602j016o50J64
$$ -55 -362 1537 613 -360 905 986 649 480 403 912 977 84 999 1376 -264 175 1777 761 111 275
817B75L36P78j462m99J496k03j378Q26L13q87k45M75K28l00j301R47J269j735
$$ 275 611 1389 -73 -572 924 721 -657 169 482 -405 -650 -175 53 -247 -1548 -601 668 -1067
835a067j75J235m69m78n6L92N16r07l70J851n07j449Q62M29k66m1k03R96j70j309
$$ -1067 -1242 -7 -476 -954 -1010 -618 -102 -1009 -1379 472 -35 -1484 -622 -193 -459 -500 -703 293 123 -1186
855a186O80J386j538J41J365l43m62J98qP86q97n17J704l14j227Q16O21o52l19
$$ -1186 -506 880 -658 -517 848 505 43 241 233 1019 122 -395 1309 995 -232 584 1205 553 234
874B34P6R50l5j298O85O63j045k62R28p95K19j0j38J91o35n76J525n63j108J098
$$ 234 310 1260 1225 -73 612 1275 230 -32 896 101 320 310 172 363 -272 -848 677 114 -994 104
894A04O5k86j72k84J38J98q98N68O21j127K69O06l85l38R9J45N12k64q99J277
$$ 104 169 -117 -289 -573 -435 -237 -1135 -567 54 -1073 -804 -198 -583 -921 -822 -677 -165 -429 -1328 -51
914e1l47o30Q46K19n32j1N60K06p4o86O77M08r17K96P21j91n28J59L19P01p52
$$ -51 -398 -1028 -182 37 -495 -506 54 260 186 -500 177 585 -332 -36 685 494 -34 125 444 1145 393
935C93k45J022m78p28J087l24l58M59k76P4j50n38M31P51j259J24N44m20n94P47
$$ 393 148 1170 692 -36 1051 727 369 828 552 626 476 -62 369 1120 -139 -15 529 109 -485 262
955B62q5rn94M6J042q32n02N51o1m66K37J66j55l09m60P18N72j281J25J053n62
$$ 262 177 168 -426 -380 662 -170 -672 -121 -182 -648 -411 -245 -400 -709 -1169 -451 121 -1160 -1035 18 -544
976e44K2O5L6O6r4Q9O55n91o59J153K01n35j75J86L50N29r12N07L65p32M91O67
$$ -544 -522 -457 -421 -355 -449 -360 295 -296 -955 198 399 -136 -311 -125 225 754 -158 349 714 -18 473 1140
998A140o87n53P79k74M95n79k73Q79m76l27R24k31p99K51Q6J61O8p16L58J37m87
$$ 1140 453 -100 679 405 900 321 48 927 451 124 1048 817 18 269 355 516 584 -132 226 363 -124
1019a24J6N43j060K00L39k4K51q15l17J185j39j244Q72j91j14K76k29nP2k89K81
$$ -124 -108 435 -625 -425 -86 -110 141 -674 -991 194 55 -1189 -317 -508 -622 -346 -575 -580 -508 -797 -516
1040e16Q79j210K3Q52o53L93R1k34j20L85RP23j007k53J009J7o25L84K92k54P7
$$ -516 363 -847 -824 28 -625 -232 -141 -375 -495 -110 -101 622 -385 -638 371 388 -237 147 439 185 262
1061B62j95R76k48j061J84J085k45m06J01j65J39J25n03Q97o56n73J074j14q31
$$ 262 67 1043 795 -266 -82 1003 758 352 453 288 427 552 49 946 290 -283 791 677 -154
1080a54Q6L42L17m7q61L47J28l29M31nr12K72J68p2M4n04K83N33n45p92J208j56
$$ -154 -68 274 591 544 -317 30 158 -171 260 255 -657 -385 -217 -289 -245 -749 -466 67 -478 -1270 -62 -218
1102b18q60N31J16K40k86l35M57N54p38J48N50l77o5K66K73k22m49p2J119j86
$$ -218 -1078 -547 -431 -191 -477 -812 -355 199 -539 -391 159 -218 -283 -17 256 34 -415 -487 632 446
1122D46n22L82r2RO49n13l14K09n8N28Lj017O35M71m69k15L02j19J46j16j63N99
$$ 446 -76 306 214 223 872 359 45 254 196 724 727 -290 345 816 347 132 434 315 461 345 182 781
1144G81m70o18O82K33o80M9L69k61j42l45K76N11j270L25N75n17l0K7k7N66k89
$$ 781 311 -307 375 608 -72 -23 346 85 -57 -402 -126 385 -885 -560 15 -502 -532 -505 -532 34 -255
1165b55l47N44p03K55K28R6p44N82Mj05K12m00K13L86o81O42M46p47K01M63j29
$$ -255 -602 -58 -761 -506 -278 -182 -926 -344 -340 -445 -233 -633 -420 -34 -715 -73 373 -374 -173 290 161
1186A61q3j47N3R23o32l43O80p0l54L44l19M59k02j51J39L98p99L23K18m63k5
$$ 161 78 -69 -16 907 275 -68 612 542 188 532 213 672 470 319 458 856 57 380 598 135 110
1207A10P32o05J6k70k00N72l88L2J02l3l46O43o28j20L91k32O3p4k71K82L83j015
$$ 110 842 237 253 -17 -217 355 -33 -1 101 68 -278 365 -263 -383 8 -224 -161 -235 -506 -224 159 -856
1229h56J35M77k56K6P3j17K54k68k83J132o46j81O41k44qJ15k10N1L05o74M95
$$ -856 -721 -244 -500 -474 -401 -518 -264 -532 -815 317 -329 -510 131 -113 -121 -6 -216 -165 140 -534 -39
1250c9N81m45R2jJ37j05j31J2O40n66k95Q13l2p09N33o5j02k8k06L07L6n26J86
$$ -39 542 97 189 188 325 220 89 101 741 175 -120 693 661 -48 485 420 318 290 84 391 427 -99 87
1273H7P34p74J89J28k07J5k45M5L91m13k95O46n31k06L74o7j18K11m48J53J34
$$ 87 821 47 236 364 157 172 -73 -28 363 -50 -345 301 -230 -436 -62 -129 -247 -36 -484 -331 -197
1294a97p29M83N09n31k66N58k98K70j60O6L69l74k71L52n1m91O42P4J33K1k43
$$ -197 -926 -443 66 -465 -731 -173 -471 -201 -361 -295 74 -300 -571 -219 -270 -761 -119 -45 88 109 -134
1315a34K51K62n79K14N42n43k8M98j04J27k29k42O89m46l11O34j35j34O4j72N
$$ -134 117 379 -200 14 556 13 -15 483 379 506 277 35 724 278 -33 601 466 332 396 224 229
1336B29K59n07K93P6n78K47L66n15K52L01j33k83j94j56M23l9l63J47m1k06L41
$$ 229 488 -19 274 350 -228 19 385 -130 122 423 290 7 -187 -343 80 41 -322 -175 -216 -422 -81
1357h1k44k51K87k82L60K17l63J86J05m56L32K38m06M3l4K7L77l07j71L93j56
$$ -81 -325 -576 -289 -571 -211 6 -357 -171 -66 -522 -190 48 -358 -315 -349 -322 55 -252 -423 -30 -186
1378a86j10L21J2j84K73J14oj1m74N83L17p48K72K70m1k58J65k99O91p98J37O59
$$ -186 -296 25 37 -147 126 240 234 223 -251 332 649 -99 173 443 402 144 309 10 701 -97 40 699
1400F99m62K9L89k74J2j80m02K13M19p41K16L93l22J55J9k97n9l45L94K24j50
$$ 699 237 266 655 381 393 213 -189 24 443 -298 -82 311 -11 144 163 -134 -193 -538 -144 80 -70
1421g0l62L08k82j55O64n48r8K10k84M52q9n94R40r5m45j3M34k68J02J22p8J49
$$ -70 -432 -124 -406 -561 103 -445 -543 -333 -617 -165 -254 -848 92 -3 -448 -461 -27 -295 -193 -71 -149 0
1443@m36j29R00j83l52M80K2k57J67n3L1M8j39K24L66l25m2J41j98k63J12J93
$$ 0 -436 -565 335 152 -200 280 302 45 212 159 190 238 99 323 689 364 322 463 265 2 114 307
1465C07Q5k59j25M52j26l10J63M7j12j96J3R1p6k29L41K35p26K80O1J46j40k76
$$ 307 392 133 8 460 334 24 187 234 122 -74 -61 30 -46 -275 66 301 -425 -145 -84 62 -78 -354
1487c54j57L70k98R2M51m66m57K34M77k27K00l57n8J29k1K26K36j87k40K90R6
$$ -354 -511 -141 -439 -347 104 -362 -819 -585 -108 -335 -135 -492 -550 -421 -442 -216 20 -167 -407 -117 -21
1508b1J5J12m21M41l60J42L16j75j9K6k6J50N5q3K58o5m60K83N91n28P4L11k95
$$ -21 -6 106 -315 126 -234 -92 224 49 30 56 30 180 235 152 410 345 -115 168 759 231 305 616 321
1531C21j78n0R7K00k21P4L32n23K9J23J1m32N28m22L02q6o62O84j29m8j24J14
$$ 321 143 93 190 390 169 243 575 52 81 204 215 -217 311 -111 191 105 -557 127 -2 -50 -174 -60
1553f0l75J64P9l80M17j09l23O63m71K34N8o7qQk70L63R8l44L33K41o41J40O64
$$ -60 -435 -271 -192 -572 -155 -264 -587 76 -395 -161 -103 -170 -178 -170 -440 -77 21 -323 10 251 -390 -250 414
1576D14n22K77q2n6R6l20K42M71j60l10M33l81M4jm1K02O8j78J67J57o27M51J27
$$ 414 -108 169 87 31 127 -193 49 520 360 50 483 102 146 145 104 306 374 196 363 520 -107 344 471
1599D71k85J50n12J66L91k21k71O70n00o7J48m56j99L28P0l5n5j48L24l85L9K23
$$ 471 186 336 -176 -10 381 160 -111 559 59 -8 140 -316 -515 -187 -117 -152 -207 -355 -31 -416 -377 -154
1621a54J9k81J81q3K57Q3p8n27N76k36j34M46l23M8L83k14k33N95o19P21l00k31
$$ -154 -135 -416 -235 -318 -61 22 -56 -583 -7 -243 -377 69 -254 -206 177 -37 -270 325 -294 427 127 -104
1643a04J65L03m69L5Q0J44l0k94L96K06l50P9K85N6j96O0k02K1O7k98P5K11k13
$$ -104 61 364 -105 -70 10 154 124 -170 226 432 82 161 446 502 306 366 164 185 252 -46 29 240 27
1666B7j55O24j48n17K46k5L30n12J89J80j77m56N03k41k24L07k88L56k98j49L15
$$ 27 -128 496 348 -169 77 52 382 -130 59 239 62 -394 109 -132 -356 -49 -337 19 -279 -428 -113
1687a13N6l57L23O1l92J35k52J65J40k94L3P38j90m35N85k88l54M13jj58M33k87
$$ -113 -57 -414 -91 -30 -422 -287 -539 -374 -234 -528 -495 243 53 -382 203 -85 -439 -26 -27 -185 248 -39
1709c9o8L41n8J2Q7l19L63j68J03q4J43j06L4l28K21L02R8l55q0O2J81J18k91
$$ -39 -107 234 176 188 275 -44 319 151 254 170 313 207 241 -87 134 436 534 179 99 161 342 460 169
1732A69K83m47l06K04L74k19j78p7k44K16j88K38N14m96m28L39R5j75J10o8R1
$$ 169 452 5 -301 -97 277 58 -120 -197 -441 -225 -413 -175 339 -157 -585 -246 -151 -326 -216 -284 -193
1753a93k76Q9K76N6l87N21k52n02N03M0j74j5Q9L22m1j04k04L07q2j00R4K22r0
$$ -193 -469 -380 -104 -48 -435 86 -166 -668 -165 -125 -299 -314 -225 97 56 -48 -252 55 -27 -127 -33 189 99
1776I9P4m65O87k49k91L65J54l81J99n7l1J3l4j67N07m88J04N79n43K74l20J00
$$ 99 173 -292 395 146 -145 220 374 -7 192 135 104 117 83 -84 423 -65 39 618 75 349 29 129
1798A29J08k76k26M87m6m03M79j66k29K11j92K39l82J91k17J26j38n0K75Q6p36
$$ 129 237 -39 -265 222 176 -227 252 86 -143 68 -124 115 -267 -76 -293 -167 -305 -355 -80 6 -730
1819g30M74m4J13L3j07J00J73l78L67J22k35o7nR5O3n7k40N48k88l1J50j10oM54
$$ -730 -256 -300 -187 -154 -261 -161 12 -366 1 123 -112 -179 -184 -89 -26 -83 -323 225 -63 -94 56 -54 -60 394
1843C94k63p9L2l01L03J74m74M45n9m11O13m1j15M5j95L51j02l93k2M24N8m90
$$ 394 131 52 84 -217 86 260 -214 231 172 -239 374 333 218 263 68 419 317 -76 -98 326 384 -106
1865a06J60l8j13L50l35J72J89n29J57m6r7L99k92M6l5k45J63L12j26N3j48k96
$$ -106 54 16 -97 253 -82 90 279 -250 -93 -139 -236 163 -129 -83 -118 -363 -200 112 -14 39 -109 -405
1887d05K96j09P1M2j78k2L09j60r5J98L1m48N77J07l10M34k78J4j78qJ73N3Q6
$$ -405 -109 -218 -147 -105 -283 -305 4 -156 -251 -53 -22 -470 107 214 -96 338 60 74 -104 -112 61 114 200
1910B00l57L33P6m4M9OP6j0l06K15K66k92K13k73N6n2K95j80Q4k97m73Q65k36
$$ 200 -157 176 252 208 257 263 339 329 23 238 504 212 425 152 208 156 451 271 355 58 -415 450 214
1933B14l16J16q3r3J75J07K12k64l82R1L66n87JL81k36M36l74j8P6l20J84L04
$$ 214 -102 14 -69 -162 13 120 332 68 -314 -223 143 -444 -443 -62 -298 138 -236 -254 -178 -498 -314 -10
1955a0l66J42N2j73N4M37l99L70l19l25O87m45K99J26j91O4M7L88n25M05o9j09
$$ -10 -376 -234 -182 -355 -301 136 -263 107 -212 -537 150 -295 4 130 -61 3 50 438 -87 318 249 140
1977A40J75m01o5P10m12l9j11j13L48jj82K57L6k88J72j17j24j0J5J39Q2k82K01
$$ 140 315 -86 -151 559 147 108 -3 -116 232 231 49 306 342 54 226 109 -15 -25 -10 129 211 -71 130
2000A30J16p5l05K84l07K66r5k62j38mJ49R4R3n12M83j1j04K59k37K54r0k56n7
$$ 130 246 171 -134 150 -157 109 14 -248 -386 -390 -241 -147 -54 -566 -83 -94 -198 61 -176 78 -12 -268 -325
2023c25K37j04q9K49K9r9n4N9K58j75l11O02j32k56L69J20n28J84R2r6M11p50
$$ -325 -88 -192 -281 -32 -3 -102 -156 -97 161 -14 -325 277 145 -111 258 378 -150 34 126 30 441 -309
2045c09K74M04k27p9J07K11k45J9k55M52L5m07L23k03k09M10q6k13L5Q5m27J59
$$ -309 -35 369 142 63 170 381 136 155 -100 352 387 -20 303 100 -109 301 215 2 37 122 -305 -146
2067a46o9K71J68l57l22K35J02j67k7K39m7K74m92L66J67l86k6J42j02P3R3pK37
$$ -146 -215 56 224 -133 -455 -220 -118 -285 -312 -73 -120 154 -338 28 195 -191 -217 -75 -177 -104 -11 -18 219
2090B19l87R6L63o10K33K09n9%l6k24K55O6k89J70J94k07j9L93m43K85J19m45
$$ 219 -168 -72 291 -319 -86 123 64 64 28 -196 59 125 -164 6 200 -7 -26 367 -76 209 328 -117
2112a17L05p4j54M93j76r4K09j98j92K82j54l4J21m46L20l3N8j50L00m42K77o3
$$ -117 188 114 -40 453 277 183 392 194 2 284 130 96 217 -229 91 58 116 -34 266 -176 101 38
2134C8L4M1j68o7j9m1p8L66j96n5J54K2o5j81K95j03j85J94J55k56RJ54n75L73
$$ 38 72 113 -55 -122 -141 -182 -260 106 -90 -145 9 31 -34 -215 80 -23 -208 -14 141 -115 -106 48 -527 -154
2158a54Q3O4J09r6j69R6J78K53k35j79k70N83j90l78O33l82N8N58k68l28L00L6
$$ -154 -71 -7 102 6 -163 -67 111 364 129 -50 -320 263 73 -305 328 -54 4 562 294 -34 266 302
2180C02k42Q1J83k91J33j43J63k8k06j3J05J10l94L33k99J34q0j53O11k42k25
$$ 302 60 141 324 33 166 23 186 158 -48 -61 44 154 -240 93 -206 -72 -152 -305 306 64 -161
2201a61L01m33J13J22l87J78K96o6j99K6l06J32L04j06M29l79r4K61l04M2K77
$$ -161 140 -293 -180 -58 -445 -267 29 -37 -236 -210 -516 -384 -80 -186 243 -136 -230 31 -273 -231 46
2222D6q7k91L60N9k53J45L9n2K94l05K06P3k50K2Q9p4k50M76k51Q4o8j0R8k2R2
$$ 46 -41 -332 28 87 -166 -21 18 -34 260 -45 161 234 -16 6 95 21 -229 247 -4 80 12 2 100 78 170
2247A70K15j78j91L71k50k1o0q2L82p5m12N3J32k6P8N3O1l54%j02R5j9k75P01
$$ 170 385 207 16 387 137 116 56 -26 356 281 -131 -78 54 28 106 159 220 -134 -134 -236 -141 -160 -435 266
2271B66l37j6R4j61J61o3k09L9J93k23K60l54K55j80J98j41K53m8P5l5j01K36
$$ 266 -71 -87 7 -154 7 -56 -265 -226 -33 -256 4 -350 -95 -275 -77 -218 35 -13 62 27 -74 162
2293A62j82m3k05K18O0J24j71n8L79j93l05L14K18k25n4J99j48J10P4l10K63M
$$ 162 -20 -63 -268 -50 10 134 -37 -95 284 91 -214 100 318 93 39 238 90 200 274 -36 227 231
2315B31l26P9J03j33J99k71M19j1l67K11l1j37J35j66J34l86M76l02K1L24k66
$$ 231 -95 -16 87 -46 153 -118 301 290 -77 134 103 -34 101 -65 69 -317 159 -143 -122 202 -64
2336f4K74n01J4M45m91J81N9O3j99l1J33O5k15R7J9j11O9L78k26j17J53J43j83
$$ -64 210 -291 -277 168 -323 -142 -83 -20 -219 -250 -117 -52 -267 -170 -151 -262 -193 185 -41 -158 -5 138 -45
2359d5J02J17k03J48j34j22J57L2J75o8j40M6O3j82L36N3n4j56M10o64K28j43
$$ -45 57 174 -29 119 -15 -137 20 52 227 159 19 65 128 -54 282 335 281 125 535 -129 99 -44
2381d4J02L33n47K99M5j13q2K63l40L09J34m52M2pm7k03K21K3j97O4k4o2K31K01
$$ -44 58 391 -156 143 188 75 -7 256 -84 225 359 -93 -51 -58 -105 -308 -87 -64 -261 -197 -221 -283 -52 149
2405A49m7o5r5J10l60L51j28j48K0L75j58j23n8n3M6O7r%K9Q5Np0K23k12J92r0
$$ 149 102 37 -58 52 -308 43 -85 -233 -213 162 4 -119 -177 -230 -184 -117 -126 -126 -97 -12 -7 -77 146 -66 126 36
2431C6M89l55k55o9K42k67L49k03Q5K3J52j4J54j34n4j49k0m2J44j02J22l20M48
$$ 36 525 170 -85 -154 88 -179 170 -33 52 75 227 213 367 233 179 30 10 -32 112 10 132 -188 260
2454B60K4j03l98N64k46k26K91l12J73K8k40K47l7l95N54l85M7J26j22k4J11j31
$$ 260 284 181 -217 347 101 -125 166 -146 27 55 -185 62 25 -370 184 -201 -154 -28 -150 -174 -63 -194
2476a94k73P41k38j62O1J43k23K61l01O1J1p6K00k2j28K89j40J9M3J28m8J51j78
$$ -194 -467 274 36 -126 -65 78 -145 116 -185 -124 -113 -189 11 -11 -139 150 10 29 72 200 152 303 125
2499A25P4K74n99LK68K3k6Q5j36N2J23m19K85J43l01l8K96j04k22j4L41k27Or
$$ 125 199 473 -126 -123 145 168 142 227 91 143 266 -153 132 275 -26 -64 232 128 -94 -108 233 6 12 3
2523CK04k34K21j20k73M69l40r9j6L01k27j41J00J97j2J74m10K00m2P0j78J37
$$ 3 207 -27 194 74 -199 270 -70 -169 -185 116 -111 -252 -152 45 33 207 -203 -3 -45 25 -153 -16
2545a6k90L38j96O4L0J95j78k03J19m7J39q1J44L9r1K20k42K03j83j3Q9K97k60
$$ -16 -306 32 -164 -100 -70 125 -53 -256 -137 -184 -45 -126 18 57 -34 186 -56 147 -36 -49 40 337 77
2568G7j00N3P1l04N07j23k58L91l06K40k39O2J13K0k16PL02n28L81o8n2K20k44
$$ 77 -23 30 101 -203 304 181 -77 314 8 248 9 71 184 204 -12 -5 297 -231 150 82 30 250 6
2591Fk47J77J94k53J33k03L3K69k98Q0J53j36R5j10J32l98K13j04J56jJ04l20
$$ 6 -241 -64 130 -123 10 -193 -160 109 -189 -109 44 -92 3 -107 25 -373 -160 -264 -108 -109 -5 -325
2613c25K19R8K49N4m59L56k38L6q1L5J97k06j84L92R7kk44J64k09K44K5k30K69
$$ -325 -106 -8 241 295 -164 192 -46 -10 -91 -56 141 -65 -249 143 240 238 -6 158 -51 193 218 -12 257
2636B57k16J39K8j56R6J4j96j28K11N2L7j48M05k13j73Q5j38o0Q9K34j21l58K72
$$ 257 41 180 208 52 148 162 -34 -162 49 101 138 -10 395 182 9 94 -44 -104 -15 219 98 -260 12
2659A2o7j09K78l86j2J71K10l02K09J23o3O3l84K36J98k41K3M49m26r6Rl25L00
$$ 12 -55 -164 114 -272 -284 -113 97 -205 4 127 64 127 -257 -21 177 -64 -41 408 -18 -114 -105 -430 -130
2682a30r1L26J26k47Q6J33L4j26K28l41q8K11n1N7J12j88j82L64n5K8Pk02J76
$$ -130 -221 105 231 -16 70 203 237 111 339 -2 -90 121 70 127 239 51 -131 233 178 206 213 11 187
2705A87p7O2J46K6l98L46o4R7q0k63J86j8l15K0L01Lj04k16j21L79k23R5M4k03
$$ 187 110 172 318 344 -54 292 228 325 245 -18 168 150 -165 -145 156 159 55 -161 -282 97 -126 -31 13 -190
2729a90J49j40J47Qj69L58k58J66k49R6K29k15j45K16l13K75p5j6j24J79LO9j29
$$ -190 -41 -181 -34 -26 -195 163 -95 71 -178 -82 147 -68 -213 3 -310 -35 -110 -126 -250 -71 -68 1 -128
2752a28J82nJ34l59K48j40J71J27l04J83j32j59M25j80K9J25j96j84L31j5l7J69
$$ -128 54 49 183 -176 72 -68 103 230 -74 109 -23 -182 243 63 92 217 21 -163 168 153 116 285
2774B85m30P9j0j64L24j38o5J39n2Q8O7K71o14K12Q8k21Q3j43m8K57j99J01l3
$$ 285 -145 -66 -76 -240 84 -54 -119 20 -32 56 123 394 -220 -8 80 -141 -58 -201 -249 8 -191 -90 -123
2797a23Q6j64L54j07p1K23l62n6K19l3j64R6k37M73j28L9j7P5k15P1J54q2K02
$$ -123 -37 -201 153 46 -25 198 -164 -220 -1 -34 -198 -102 -339 134 6 45 28 103 -112 -41 113 31 233
2820B33j86k94J89J10J3o2l87L83J01nJ23N6k77j45K74q0L20l11L1k4p7R5J62
$$ 233 47 -247 -58 52 65 3 -384 -1 100 95 218 274 -3 -148 126 46 366 55 86 62 -15 80 242
2843B42l78mQ8O9N7M8j77O6J32k43K95j49o8M4K11m59L28n0j00J28j83N3jJ12
$$ 242 -136 -140 -52 17 74 122 -55 11 143 -100 195 46 -22 22 233 -226 102 52 -48 80 -103 -50 -51 61
2867F1j4n1J3k02K33j86N0M55p27L06R6j61O6L1R5o0j14J69N4J34k91jL0J46k1
$$ 61 47 -4 9 -193 40 -146 -96 359 -368 -62 34 -127 -61 -30 65 5 -109 60 114 248 -43 -44 -14 132 111
2892A11RJ27J3l32N9J23Qj86M8j51K18J17k25K13Rk96Q3l7J82ll4J25o6n28P70
$$ 111 120 247 260 -72 -13 110 118 -68 -20 -171 47 164 -61 152 161 -135 -52 -89 93 90 56 181 115 -413 357
2917C57k64Q9j49J19l16J39K04n26K28%P2J00o2o1J9op5j47K20J8R4m41J71K47
$$ 357 93 182 33 152 -164 -25 179 -347 -119 -119 -47 53 -9 -70 -51 -57 -132 -279 -59 -41 53 -388 -217 30
2941C0j25K7J38n8P8J14l95L04ro1J10j14k95M02j13Q1L7j60J73L9k1j90K00L0
$$ 30 -95 -68 70 12 90 204 -191 113 104 43 153 39 -256 146 33 114 151 -9 164 203 182 -8 192 222
2965B22k72pr6J26n9J05o8K40m19J38n6J41K15j21O0k2j31O0m7j9J65k00j02J9
$$ 222 -50 -57 -153 -27 -86 19 -49 191 -228 -90 -146 -5 210 89 149 127 -4 56 9 -10 155 -45 -147 -128
2989a28n5r3Q5K02m16L06j94J36J08L03l91P2R6O0l1j41p4J06j53L39k77K2L05
$$ -128 -183 -276 -191 11 -405 -99 -293 -157 -49 254 -137 -65 31 91 60 -81 -155 -49 -202 137 -140 -118 187
3012A87j67J55j73M1J15k62J46j41L24k0l85L41o6j67J00R8%m0P2J7M1j32j68
$$ 187 20 175 2 43 158 -104 42 -99 225 205 -180 161 95 -72 28 126 126 86 158 175 216 84 -84
3035h4O2J87P1l14Q5K40J9j38J56k49N8j66J08N4K44n56J63L49l75m7R4K9j53
$$ -84 -22 165 236 -78 7 247 266 128 284 35 93 -73 35 89 333 -223 -60 289 -86 -133 -39 -10 -163
3058a63K68l69J65J43j63K06j47j19J68j37Q3m1J9M2J6N8J36j59j89L29j27P2
$$ -163 105 -264 -99 44 -119 87 -60 -179 -11 -148 -65 -106 -87 -45 -29 29 165 6 -183 146 19 91
3080I1k27L20r6m9O2N3k24oJ76j64L26k76K29j7k94J97J50N4k23M0o6J28l50J32
$$ 91 -136 184 88 39 101 154 -70 -76 100 -64 262 -14 215 198 -96 101 251 305 82 122 56 184 -166 -34
3104c4R7j57O6Q9p4P5j42L5l7k66N48l28j35J72m2k12K35J68J33j40k08K4k2K51
$$ -34 63 -94 -28 61 -13 62 -80 -45 -82 -348 200 -128 -263 -91 -133 -345 -110 58 191 51 -157 -133 -155 96
3128I6j04J3p6K17r1q0m5j23J48rj34K14j50lOJ88j65q2r1K39J11k9J21l18K12
$$ 96 -8 5 -71 146 55 -25 -70 -193 -45 -54 -188 26 -124 -127 -121 67 -98 -180 -271 -32 79 50 171 -147 65
3153F5k69M22k32J72P6j09j8j68m8J86j79K74j98K59N3k79j04j18K01Q0P8k3o0
$$ 65 -204 218 -14 158 234 125 107 -61 -109 77 -102 172 -26 233 286 7 -97 -215 -14 66 144 121 61
3176F1k16K5J28M9j52M4k03J47M6Rk05J77O8l94N54q5K98n09q5J68J26k04j31
$$ 61 -155 -130 -2 47 -105 -61 -264 -117 -71 -62 -267 -90 -22 -416 138 53 351 -158 -243 -75 51 -153 -284
3199b84J71j12Q4J93n4l47L61n2K26k97J88J69m17o3M90j86J80m54K00Q6j0P7
$$ -284 -113 -225 -141 52 -2 -349 12 -40 186 -111 77 246 -171 -234 256 70 250 -204 -4 82 72 149
3221A49l09L98p2R7j73R2k40P8P8n1K19l12K39j52l6J90m10M65r6O1p5jP1k64
$$ 149 -160 238 166 263 90 182 -58 20 98 47 266 -46 193 41 5 195 -215 250 154 215 140 139 210 -54
3245e4J62k64K3q5Q7J13p5K75j62l12K31J12M0j23j71J38J7r8M7k59J90m5L08
$$ -54 108 -156 -133 -218 -131 -18 -93 182 20 -292 -61 51 91 -32 -203 -65 -48 -146 -99 -358 -168 -213 95
3268I5R8n05L11j74J54O2oJ70K7j62j50J41r8k7K89l46L24j42O3m3j76L05J55
$$ 95 193 -312 -1 -175 -21 41 35 205 232 70 -80 61 -37 -64 225 -121 203 61 124 81 -95 210 365
3291C65j60m9j50M1k17J82P5j91L52j97l1K86j86n7J10R9n30Q9L32m5Mk27J38
$$ 365 205 156 6 47 -170 12 87 -104 248 51 20 306 120 63 173 272 -258 -169 163 118 122 -105 33
3314C3K9r5j16K18m76L78M9k29K10r3k28K56k94K50l8J08m5o7K24k63J10k32J90
$$ 33 62 -33 -149 69 -407 -29 20 -209 1 -92 -320 -64 -358 -108 -146 -38 -83 -150 74 -189 -79 -311 -121
3337a21K84k72K0J94p1J28m46L22l7l00P2K87o8L0j06n1K41O8j84r9M69m81J36
$$ -121 163 -109 -89 105 34 162 -284 38 1 -299 -227 60 -8 22 -84 -135 106 174 -10 -109 360 -121 15
3360A5j06R1K03j5k86N6K67q2ol6m2J38k11K5J89r2k32m4L00m42M05k56J85L2
$$ 15 -91 0 203 188 -98 -42 225 143 137 101 59 197 -14 11 200 108 -124 -168 132 -310 95 -161 24 56
3384E6k91J31K26p1jr8q1L67j19l36L47j45Q6M5o4q6J13j87l4j28M18j26k03L83
$$ 56 -235 -104 122 51 50 -48 -129 238 119 -217 130 -15 71 116 52 -34 79 -108 -142 -270 148 22 -181 202
3408B02j98M0j82K88l25J3J77j1j95J64j65M63j99j8L3J17j60j08J07L3j13J03
$$ 202 4 44 -138 150 -175 -162 15 4 -191 -27 -192 271 72 54 87 204 44 -64 43 76 -37 66
3430F6j94J92L5m07J10PK99l0j61p2N3J57j64j69L15j00Q2O7j33J25j17L50k93
$$ 66 -128 64 99 -308 -198 -191 108 78 -83 -155 -102 55 -109 -278 37 -63 19 86 -47 78 -39 311 18
3453A8j32J12p9J02k71J61J25M3m0J70l39K67j72J39l43K75J58j78l9J75q6r5
$$ 18 -114 -2 -81 21 -250 -89 36 79 39 209 -130 137 -35 104 -239 36 194 16 -23 152 66 -29
3475b9K04l64J44j9j15J82J07j72j61N60m53M53k85L3Q0j32K9Jj7L7j4K26l84
$$ -29 175 -189 -45 -64 -179 3 110 -62 -223 337 -116 337 52 85 165 33 62 63 46 83 69 295 -89
3498h9J56l5m8L3p8J26K8j01J0J53j06M8Jk81L18q0j06J6j65L39j61l2k88N46
$$ -89 67 32 -16 17 -61 65 93 -8 2 155 49 97 98 -183 135 55 -51 -35 -200 139 -22 -54 -342 204
3522B04k66J68k83N7K23j68j02K29j46K17m5k58J87j65M60j83k4j75J39m6q1J9
$$ 204 -62 106 -177 -120 103 -65 -167 62 -84 133 88 -170 17 -148 312 129 105 -70 69 23 -58 -39
3544c9L5j83NK16n6m5J52O4l9l66N37j02k90K81m7k13n1N03p6l71j4r8L50p4j03
$$ -39 -4 -187 -182 34 -22 -67 85 149 110 -256 281 179 -111 170 123 -90 -141 362 286 -85 -99 -197 153 79 -24
3569b4N0q4J80J80k97j97L56j46R9J2j78J16j05k7k62K11R2k39M04l73J44m5L07
$$ -24 26 -58 122 302 5 -192 164 18 117 129 -49 67 -38 -65 -327 -116 -24 -263 141 -232 -88 -133 174
3592A74n55M72l51o0L71r4J56J07j46j95L92j60L5P1k02j11K2L10l73K69O9k63
$$ 174 -381 91 -260 -320 51 -43 113 220 74 -121 271 111 146 217 15 -96 -74 236 -137 132 201 -62
3614f2NR9j07O9q1J12J33j23K6p3j27K96J5m61K77j03M23l24R9j30K33j85q1j5
$$ -62 -57 42 -65 4 -77 35 168 45 71 -2 -129 167 182 -279 -2 -105 318 -6 93 -37 196 11 -70 -85
3638h5L66l16N3q1J43j16J16l85K97m4l81L39K33k75J86l11K31p3P7J45r3j14
$$ -85 281 -35 18 -63 80 -36 80 -305 -8 -52 -433 -94 139 -136 50 -261 -30 -103 -26 119 26 -88
3660h8J02j92J07R3r4K23k72J32m5L15k55O1j7J7k44j65M48p3o1J48L4j80J87
$$ -88 14 -178 -71 22 -72 151 -121 11 -34 281 26 87 70 87 -157 -322 126 53 -8 140 174 -6 181
3683A81j99L04l27N0K04k93K45k28O3K0K98l57J29R1j11M9M7j91J7j67k1K67o0
$$ 181 -18 286 -41 9 213 -80 165 -63 0 20 318 -39 90 181 70 119 166 -25 -8 -175 -196 71 11
3706A1j63J8M78m17k06K31k18K68j59M8q2N05k64j32J41K64k80l28L48j26j75
$$ 11 -152 -134 344 -73 -279 -48 -266 2 -157 -109 -191 314 50 -82 59 323 43 -285 63 -63 -238
3727b38K51p7k38K07M03l61J64m9j5k1j54p0J50%o5J10j30R4J61l54K42Q4k0J52
$$ -238 13 -64 -302 -95 308 -53 111 62 47 26 -128 -198 -48 -48 -113 -3 -133 -39 122 -232 10 94 74 226
3751B26k92J50J68k34o2k58J78J56O1k34J42J25p5j29N7J38q4J34p8p6PP9R0k31
$$ 226 -66 84 252 18 -44 -302 -124 32 93 -141 1 126 51 -78 -21 117 33 167 89 13 20 99 189 -42
3775d2NJ3l05K38K26l6k43R2j06K61J01l34L78N6m11K29j23k00P1J71j54M2j45
$$ -42 -37 -24 -329 -91 135 99 -144 -52 -158 103 204 -130 248 304 -107 122 -1 -201 -130 41 -113 -71 -216
3798b16o8L47j2o3o5J62k63K78j53RK62j57pK23n13K40J74l86K82J26j85Q4o2
$$ -216 -284 63 51 -12 -77 85 -178 100 -53 -44 218 61 54 277 -236 4 178 -208 74 200 15 99 37
3821C7l08N66j44j64k3j45K88j70N88m19k03Q6r6K50j77k4Q5J39k8J75k8l13P8
$$ 37 -271 295 151 -13 -36 -181 107 -63 525 106 -97 -11 -107 143 -34 -58 27 166 138 313 285 -28 50
3844E0rj10L50m18J23n9j68K40j4L1J33r2q1J83l9k9j28K70l60J91J11l19K22
$$ 50 41 -69 281 -137 -14 -73 -241 -1 -15 16 149 57 -24 159 120 91 -37 233 -127 64 175 -144 78
3867G8j61j56L32m5J57o0k14M46n22L01k2j55J91L0j60o9J47K2l19K22K33k57
$$ 78 -83 -239 93 48 205 145 -69 377 -145 156 134 -21 170 200 40 -29 118 140 -179 43 276 19
3889A9k40L34m8m7k6%J48j68P2R1r5Q4l33o6K33k1k3J06K46l43K97l82l7P1l4
$$ 19 -221 113 65 18 -8 -8 140 -28 44 135 40 124 -209 -275 -42 -63 -86 20 266 -77 220 -162 -199 -128 -162
3914a62J42j47J33J20k09L3R8m4Pj05j57J46Q5j89L93k52J01j84L07k67R2N0k2
$$ -162 -20 -167 -34 86 -123 -90 8 -36 -29 -134 -291 -145 -60 -249 144 -108 -7 -191 116 -151 -59 -9 -31
3937c1R3j03P3p2K42k19o1J67k74L13k66M13k76j89K32l6r0M6q8J56J77j63j07
$$ -31 62 -41 32 -40 202 -17 -78 89 -185 128 -138 275 -1 -190 42 6 -84 -38 -126 30 207 44 -63
3960f3k50M66n36K91L13k39l3K52j23k04J08j64J10J82p8j02K28n6l12R6J74r1
$$ -63 -313 153 -383 -92 221 -18 -51 201 78 -126 -18 -182 -72 110 32 -70 158 102 -210 -114 60 -31
3982c1k62Q8J67l1j17J96q7j79K80j61K49j03L4J17l54J34j64L53m46N75l62J7
$$ -31 -293 -205 -38 -69 -186 10 -77 -256 24 -137 112 9 43 160 -194 -60 -224 129 -317 258 -104 -87
4004h7K35q7j18M1m5K82J4k79J74k6j21K05o0J89k99J83k98K6n0J78N4j60J86
$$ -87 148 61 -57 -16 -61 221 235 -44 130 104 -17 188 128 317 18 201 -97 -71 -121 57 111 -49 137
4027A37l10LJ97K5q3j1O9q8P5L5j0J46k07Q1j22J34k94J64J0J2J02l34J23J47
$$ 137 -173 -170 27 52 -31 -42 27 -61 14 49 39 185 -22 59 -63 71 -223 -59 -49 -37 65 -269 -146 1
$$ [...]
8191A95
##END NTUPLES=NMR FID
##END=
