##TITLE=1H_Pr F-2
 CDCl3
 8 sc, 
 4.04.2022
##JCAMPDX= 6.0         $$ Bruker NMR JCAMP-DX V2.0
##DATA TYPE= NMR FID
##DATA CLASS= NTUPLES
##ORIGIN= UXNMR, Bruker Analytische Messtechnik GmbH
##OWNER= root
$$ XWIN-NMR		Version 3.5
$$ Mon Apr  4 15:12:07 2022 Russian Standard Time (UT+4h)  she@DPX200
##.OBSERVE FREQUENCY= 200.131346
##.OBSERVE NUCLEUS= ^1H
##.DELAY= (6, 6)
##.ACQUISITION MODE= SIMULTANEOUS
##.ACQUISITION SCHEME= undefined
##.AVERAGES= 8
##.DIGITISER RES= 18
##SPECTROMETER/DATA SYSTEM= spect
##.PULSE SEQUENCE= zg30
##.SOLVENT NAME= CDCl3
##.SHIFT REFERENCE= (INTERNAL, CDCl3, 0, 15.7039)
##AUDIT TRAIL= $$ (NUMBER, WHEN, WHO, WHERE, WHAT)
$$ ##TITLE= Audit trail, XWIN-NMR		Version 3.5
$$ ##JCAMPDX= 5.01
$$ ##ORIGIN= Bruker BioSpin GmbH
$$ ##OWNER= she
$$ F:/spectra/data/she/nmr/H-F/1/audita.txt
$$ ##AUDIT TRAIL=  $$ (NUMBER, WHEN, WHO, WHERE, WHAT)
(   1,<2022-04-04 15:11:13.31 +0400>,<she>,<DPX200>,
      <created by zg, POWCHK disabled, PULCHK disabled
       configuration hash MD5:
       00 E9 B6 7A A2 85 ED C7 34 08 36 98 17 FE 4E 26
       data hash MD5: 16K
       A8 7A D5 18 68 D1 01 8A 42 1A 40 45 5F 2B 1F 8E>)
$$ ##END=
$$ 
$$ hash MD5
$$ CE BA 27 15 33 D1 0E C5 EC D3 CE 64 B5 E6 F9 31
##$RELAX= 
##$RELAX= 
##$RELAX= 
##$RELAX= 
##$RELAX= 
##$RELAX= 
$$ Bruker specific parameters
$$ --------------------------
##$DU= <F:/spectra>
##$EXPNO= 1
##$NAME= <H-F>
##$PROCNO= 1
##$TYPE= <nmr>
##$USER= <she>
##$AMP= (0..31)
100 100 100 100 100 100 100 100 100 100 100 100 100 100 100 100 100 100 
100 100 100 100 100 100 100 100 100 100 100 100 100 100 
##$AQSEQ= 0
##$AQ_mod= 1
##$AUNM= <au_zg>
##$AUTOPOS= <>
##$BF1= 200.13
##$BF2= 200.13
##$BF3= 200.13
##$BF4= 200.13
##$BF5= 200.13
##$BF6= 200.13
##$BF7= 200.13
##$BF8= 200.13
##$BYTORDA= 1
##$CFDGTYP= 0
##$CFRGTYP= 5
##$CHEMSTR= <none>
##$CNST= (0..31)
1 1 145 1 1 1 1 1 1 1 1 1 1 1 1 1 1 1 1 1 1 1 1 1 1 1 1 1 1 1 1 1 
##$CPDPRG= <>
##$CPDPRG1= <>
##$CPDPRG2= <>
##$CPDPRG3= <>
##$CPDPRG4= <mlev>
##$CPDPRG5= <mlev>
##$CPDPRG6= <mlev>
##$CPDPRG7= <mlev>
##$CPDPRG8= <mlev>
##$CPDPRGB= <>
##$CPDPRGT= <>
##$D= (0..31)
0 1.2 0 0 0 0 0 0 0 0.06 0 0.03 0 0 0 0 0.0002 0 0 0 0 0 0 0 0 0 0 0 0 
0 0 0 
##$DATE= 1649070672
##$DBL= (0..7)
120 120 120 120 120 120 120 120 
##$DBP= (0..7)
150 150 150 150 150 150 150 150 
##$DBP07= 0
##$DBPNAM0= <>
##$DBPNAM1= <>
##$DBPNAM2= <>
##$DBPNAM3= <>
##$DBPNAM4= <>
##$DBPNAM5= <>
##$DBPNAM6= <>
##$DBPNAM7= <>
##$DBPOAL= (0..7)
0.5 0.5 0.5 0.5 0.5 0.5 0.5 0.5 
##$DBPOFFS= (0..7)
0 0 0 0 0 0 0 0 
##$DE= 6
##$DECBNUC= <off>
##$DECIM= 32
##$DECNUC= <off>
##$DECSTAT= 4
##$DIGMOD= 1
##$DIGTYP= 9
##$DL= (0..7)
0 120 120 120 120 120 120 120 
##$DP= (0..7)
150 150 150 150 150 150 150 150 
##$DP07= 0
##$DPNAME0= <>
##$DPNAME1= <>
##$DPNAME2= <>
##$DPNAME3= <>
##$DPNAME4= <>
##$DPNAME5= <>
##$DPNAME6= <>
##$DPNAME7= <>
##$DPOAL= (0..7)
0.5 0.5 0.5 0.5 0.5 0.5 0.5 0.5 
##$DPOFFS= (0..7)
0 0 0 0 0 0 0 0 
##$DQDMODE= 0
##$DR= 18
##$DS= 0
##$DSLIST= <SSSSSSSSSSSSSSS>
$$ [...]
##$SUBNAM2= <"">
##$SUBNAM3= <"">
##$SUBNAM4= <"">
##$SUBNAM5= <"">
##$SUBNAM6= <"">
##$SUBNAM7= <"">
##$SUBNAM8= <"">
##$SUBNAM9= <"">
##$SW= 18.0517287032376
##$SWIBOX= (0..15)
0 0 2 0 0 0 0 0 0 0 0 0 0 0 0 0 
##$SW_h= 3612.71676300578
##$TD= 16384
##$TD0= 1
##$TE= 0
##$TE2= 300
##$TE3= 300
##$TEG= 300
##$TL= (0..7)
0 120 120 120 120 120 120 120 
##$TP= (0..7)
150 150 150 150 150 150 150 150 
##$TP07= 0
##$TPNAME0= <>
##$TPNAME1= <>
##$TPNAME2= <>
##$TPNAME3= <>
##$TPNAME4= <>
##$TPNAME5= <>
##$TPNAME6= <>
##$TPNAME7= <>
##$TPOAL= (0..7)
0.5 0.5 0.5 0.5 0.5 0.5 0.5 0.5 
##$TPOFFS= (0..7)
0 0 0 0 0 0 0 0 
##$TUNHIN= 0
##$TUNHOUT= 0
##$TUNXOUT= 0
##$USERA1= <user>
##$USERA2= <user>
##$USERA3= <user>
##$USERA4= <user>
##$USERA5= <user>
##$V9= 5
##$VALIST= <valist>
##$VCLIST= <CCCCCCCCCCCCCCC>
##$VD= 0
##$VDLIST= <DDDDDDDDDDDDDDD>
##$VPLIST= <PPPPPPPPPPPPPPP>
##$VTLIST= <TTTTTTTTTTTTTTT>
##$WBST= 1024
##$WBSW= 4
##$XGAIN= (0..3)
0 0 0 0 
##$XL= 0
##$YL= 0
##$YMAX_a= 50950
##$YMIN_a= -61959
##$ZGOPTNS= <>
##$ZL1= 120
##$ZL2= 120
##$ZL3= 120
##$ZL4= 120
##$ABSF1= 10
##$ABSF2= 0
##$ABSG= 5
##$ABSL= 3
##$ALPHA= 0
##$AQORDER= 0
##$ASSFAC= 0
##$ASSFACI= 0
##$ASSFACX= 0
##$ASSWID= 0
##$AUNMP= <proc_1d>
##$AZFE= 0.1
##$AZFW= 0.1
##$BCFW= 1
##$BC_mod= 2
##$BYTORDP= 1
##$COROFFS= 0
##$CY= 11.3945322036743
##$DATMOD= 1
##$DC= 2
##$DFILT= <>
##$DTYPP= 0
##$F1P= 2.36226072786647
##$F2P= -0.459571619588291
##$FCOR= 0.5
##$FTSIZE= 0
##$FT_mod= 4
##$GAMMA= 1
##$GB= 0.15
##$INTBC= 1
##$INTSCL= 1
##$ISEN= 128
##$LB= 0.24
##$LEV0= 0
##$LPBIN= 0
##$MAXI= 10000
##$MC2= 0
##$MEAN= 0
##$ME_mod= 0
##$MI= 1.114404
##$NCOEF= 0
##$NC_proc= 0
##$NLEV= 6
##$NOISF1= 3.799351
##$NOISF2= 2.8
##$NSP= 1
##$NTH_PI= 0
##$NZP= 0
##$OFFSET= 15.70392
##$PC= 1
##$PHC0= -17310.66
##$PHC1= 11.40078
##$PH_mod= 1
##$PKNL= yes
##$PPARMOD= 0
##$PSCAL= 0
##$PSIGN= 0
##$REVERSE= no
##$SF= 200.130013532006
##$SI= 16384
##$SIGF1= 3
##$SIGF2= 2
##$SINO= 400
##$SIOLD= 16384
##$SREGLST= <1H.CDCl3>
##$SSB= 0
##$STSI= 0
##$STSR= 0
##$SW_p= 3612.71676300578
##$SYMM= 0
##$S_DEV= 0
##$TDeff= 0
##$TDoff= 0
##$TI= <>
##$TILT= no
##$TM1= 0
##$TM2= 0
##$TOPLEV= 0
##$USERP1= <user>
##$USERP2= <user>
##$USERP3= <user>
##$USERP4= <user>
##$USERP5= <user>
##$WDW= 1
##$XDIM= 8192
##$YMAX_p= 0
##$YMIN_p= 0
$$ End of Bruker specific parameters
$$ ---------------------------------
##NTUPLES= NMR FID
##VAR_NAME=  TIME,          FID/REAL,        FID/IMAG
##SYMBOL=    X,             R,               I
##VAR_TYPE=  INDEPENDENT,   DEPENDENT,       DEPENDENT
##VAR_FORM=  AFFN,          ASDF,            ASDF
##VAR_DIM=   8192,          8192,            8192
##UNITS=     SECONDS,       ARBITRARY UNITS, ARBITRARY UNITS
##FACTOR=    0.0002768,     1,               1
##FIRST=     0,             0,               0
##LAST=      2.2672688,     0,               0
##MIN=       0,             -61959,          0
##MAX=       2.2672688,     50950,           0
$$ Real data points
##PAGE= N=1
##DATA TABLE= (X++(R..R)), XYDATA
$$ plain form
0 0 0 0 0 0 0 0 0 0 0 0 0 0 0 0 0 0 -8 8 -8 8 -8 8 -16 16 -16 24 -24 29 -32 39 -42 48 -56 63 -71 80 -90 101
38 101 -113 126 -140 155 -173 192 -213 235 -258 285 -313 345 -381 421 -463 510 -566 624 -694 771
58 771 -862 971 -1100 1257 -1454 1712 -2063 2570 -3377 4857 -8491 40782 20338 -32753 28419
73 28419 50950 18110 -8953 14753 20592 7615 1583 1266 -9947 841 16428 7106 -21461
86 -21461 -20478 7212 12398 -16334 -21894 -1231 4728 -11089 -15494 -5395 -619 268 8718 1366
100 1366 -12881 589 21244 9547 -10034 -4900 8774 3202 -6969 -8179 -10362 -5335 3471
113 3471 -8660 -23964 -10886 9190 708 -20956 -16318 4968 3969 -11711 -12254 -201 4054 -3222
127 -3222 -4122 3832 5124 5355 11495 10016 2297 5438 16550 16272 2846 1158 9361 5631 -948
$$ packed form
0@%%%%%%%%%%%%%%%%qJ6j6J6j6J6k4L2l2M0m8N3o1P1q1R0j04J19j34J51j70J91
38A01k14K39k66K95l28L65m05M48m93N43n98O58p26Q02q84R73j076J190j318J465
58G71j633J833k071K357k711L166l775M633n947Q234j3348M9273k0444n3091O1172
73B8419K2531l2840k7063K3706N839j2977o032l17j1213J0788J5587r322k8567
86b1461R83K7690N186k8732n560K0663N959j5817m405J0099M776Q87Q450p352
100A366j4247J3470K0655j1697j9581N134J3674n572j0171j210k183N027Q806
113C471j2131j5304J3078K0076q482k1664M638K1286r99j5680n43J2053M255p276
127c222r00P954J292K31O140j479p719L141J1112k78j3426j688Q203l730o579
$$ plain form
142 -948 1509 2578 238 131 151 -4194 -5976 1511 5666 -1765 -7350 -4634 -1045 -803 -4377 -5713
158 -5713 -551 2266 -1910 -6087 -1076 7244 6780 1180 22 1400 3927 2768 -157 -423 1967 778
174 778 -3608 -5476 -2354 1789 -195 -2955 -4106 -2423 475 -2193 -3702 -1363 708 -1726 -5313
189 -5313 -4627 68 2107 1056 -113 -571 2477 4954 1540 635 3872 4428 571 -2005 -237 2059
205 2059 230 -1398 -2789 -3266 -1028 -11 -1099 -2084 -1206 308 -1143 -3196 -733 886 -90 -1425
221 -1425 -1850 -1066 -63 1187 3033 2026 -293 2554 4490 2708 947 2278 4691 1482 -3141 -1260
237 -1260 1779 449 -1017 -1922 -1233 -928 -619 -92 -628 -577 1568 -64 -2747 -1387 1492 1682 -897
254 -897 -1009 1735 666 -308 1672 2997 2055 525 33 1246 -6 -628 496 -729 -2355 -3071 -2829
$$ packed form
142i48K457J069k340j07K0m345j782P487M155p431n585K716L589K42l574j336
158e713N162K817m176m177N011Q320m64n600j158J378K527j159k925k66K390j189
174G78m386j868L122M143j984k760j151J683K898k668j509K339K071k434l587
189e313O86M695K039j051j169m58L048K477l414r05L237N56l857k576J768K296
205B059j829j628j391m77K238J017j088r85Q78J514j451k053K463J619r76j335
221a425m25P84J003J250J846j007k319K847J936j782j761J331K413l209m623J881
237a260L039j330j466r05O89L05L09N27n36N1K145j632k683J360K879J90k579
254h97j12K744j069r74J980J325r42j530m92J213j252o22J124j225j626p16K42
$$ plain form
271 -2829 -2234 -2189 -1097 -890 -3063 -2197 320 -322 -1291 191 1717 286 -1840 310 3325 1668 470
288 470 2030 2316 1505 1365 2511 3186 1454 830 848 -340 -6 12 -469 -1097 -1869 -1593 -1587 -2362 -561 301
308 301 -1169 -1433 -625 648 276 -594 1158 1223 -520 -154 981 1084 1475 1240 1066 336 41 1331 555
327 555 -571 32 -566 -1580 -2164 -2313 -1048 -1292 -2524 -1640 -1662 -1848 -1199 -527 436 -12 -728 602 807
346 807 287 1389 1809 1707 1293 1011 1890 2353 2516 1885 724 838 1050 75 131 470 -457 -639 -1649 -1736
366 -1736 -769 -819 -864 -692 -1233 -429 -480 -235 819 235 321 485 408 602 958 1548 1492 568 811 1207 199
387 199 778 1332 195 -95 -954 -1450 -1123 -1458 -1399 -1741 -2064 -1987 -2414 -1851 -340 -998 -1191 -318 -569 -942
407 -942 -189 913 1287 251 313 1052 889 1620 1637 1066 1714 1528 -162 101 303 829 153 -1300 -1166 -1495
$$ packed form
271b829N95M5J092K07k173Q66K517o42r69J482J526j431k126K150L015j657j198
288D70J560K86q11j40J146O75j732o24J8j188L34J8m81o28p72K76Op75J801Q62
308C01j470k64Q08J273l72q70J752O5j743L66J135J03L91k35j74p30k95J290p76
327E55j126O03n98j014n84j49J265k44j232Q84k2j86O49O72R63m48p16J330K05
346H07n20J102M20j02m14k82Q79M63J63o31j161J14K12r75N6L39r27j82j010q7
366a736R67n0m5J72n41Q04n1K45J054n84Q6J64p7J94L56N90n6r24K43L96j008
387A99N79N54j137k90q59m96L27l35N9l42l23P7m27N63J511o58j93Q73k51l73
407i42P53J102L74j036O2P39j63P31J7n71O48j86j690K63K02N26o76j453J34l29
$$ plain form
427 -1495 -833 -248 -1914 -1786 -139 -344 -1221 -848 176 779 366 179 107 487 1919 1731 -125 1341
445 1341 1998 1779 1161 867 1386 1369 1287 172 -1262 291 1492 -991 -2632 -1435 -700 -813 -1372 -1642
463 -1642 -1229 -476 -286 -1121 -1337 725 902 -3 350 -338 112 1721 1183 122 329 1565 1119 -669
481 -669 -180 1086 442 11 130 -1945 -1825 -463 -371 -1061 -1739 -1233 -1439 -1135 -392 -1021 -459 1572 467
500 467 -1396 -217 795 1226 1158 1012 907 366 1352 1674 279 782 2073 1261 435 -197 -363 539 916
519 916 -49 -1591 -1265 298 -76 -1749 -638 -173 727 896 -954 -1387 838 1836 93 -1042 547
536 547 2012 70 -791 559 602 1233 867 -497 -728 116 635 -557 -1245 -595 -337 -1111 -1313 -2402 -1839
555 -1839 -94 -455 -1361 -476 -354 -582 -809 302 1244 303 430 945 84 56 907 984 1564 1284 328 -282
$$ packed form
427a495O62N85j666J28J647k05q77L73J024O03m13j87p2L80J432j88j856J466
445A341O57k19o18k94N19j7q2j115j434J553J201k483j641J197P35j13n59k70
463a642M13P53J90q35k16K062J77r05L53o88M50J609n38j061K07J236m46j788
481f69M89J266o44m31J19k075J20J362R2o90o78N06k06L04P43o29N62K031j105
500D67j863J179J012M31o8j46j05n41R86L22j395N03J291q12q26o32j66R02L77
519I16r65j542L26J563l74j673J111M65R00J69j850m33K225R98j743j135J589
536E47J465j942q61J350M3O31l66j364k31Q44N19j192o88O50K58p74k02j089N63
555a839J745l61r06Q85J22k28k27J111R42r41J27N15q61k8Q51P7N80k80r56o10
$$ plain form
575 -282 450 1040 -260 -43 1180 -88 -1987 -713 -267 -1155 -506 320 -621 -2107 -884 1380 639 -372
593 -372 439 869 1422 592 -314 857 2156 993 230 297 631 -73 101 1124 -296 -895 744 -276
611 -276 -2348 -1847 -123 -335 -1416 -1805 -1486 -1255 -458 -430 -1432 450 1365 -405 -233 1129 1236 996
629 996 1358 1683 363 500 1701 1104 -28 925 1059 524 40 -780 -524 -99 -534 -1242 -1001 -323 -1387
648 -1387 -2076 -331 -151 -1895 -494 917 -161 -998 98 1579 1242 533 1049 431 971 1343 354 340
666 340 1407 1085 79 -407 -86 154 -254 -24 -657 -1286 -459 -690 -1806 -1054 -662 -713 -843 -1156 -918 33
686 33 457 614 183 555 1396 286 795 1181 1032 1031 1303 929 16 182 1168 917 -394 -254 -24 -297 -260
707 -260 -788 -1279 -603 -879 -1089 -1407 -1235 -276 -665 -887 -160 -250 548 416 300 818 936 756 611 985 972
$$ packed form
575b82P32N90j300K17J223j268j899J274M46q88O49Q26r41j486J223K264p41j011
593c72Q11M30N53q30r06J171J299j163p63O7L34p04J74J023j420n99J639j020
611b76k072N01J724k12j081l89L19K31P97K8j002J882R15j770J72J362J07k40
629I96L62L25j320J37J201n97j132R53J34n35m84q20K56M25m35p08K41O78j064
648a387o89J745J80j744J401J411j078q37J096J481l37p09N16o18N40L72r89j4
666C40J067l22j006m86L21K40m08K30o33o29Q27k31j116P52L92n1j30l13K38R51
686C3M24J57m31L72Q41j110N09L86j49jK72l74r13J66R86k51j311J40K30k73L7
707b60n28m91O76k76k10l18J72R59l89k22P27r0P98j32j16N18J18j80j45L74j3
$$ plain form
728 972 628 515 1013 532 -74 508 210 -385 -201 -536 -309 -222 -918 -615 -1049 -513 -501 -831 -764 15 -336
749 -336 156 -70 -96 415 551 937 556 682 1007 575 359 738 674 378 124 -304 105 25 -236 -442 -746
770 -746 -368 -472 -1018 -734 -461 -928 -577 -275 -235 -15 -86 194 660 252 487 729 552 1366 673 705 938
791 938 239 277 371 118 162 -171 -24 -56 -337 -407 -119 -457 -380 -805 -738 -199 -567 -823 -109 -196 116 -46 -71
814 -71 487 173 608 560 216 385 206 180 345 143 -153 169 -150 -203 -287 -633 -91 -437 -754 -351 -502 -620
836 -620 -454 -848 -143 -670 -525 -67 -149 188 417 203 615 553 492 901 834 583 524 478 708 554 27 298
858 298 325 34 -71 -36 -11 143 -97 -130 -188 -629 -104 10 -298 -305 -326 -58 403 140 302 524 710 922 365
881 365 570 740 381 310 286 -83 284 80 -101 -388 -556 -270 -633 -868 -617 -856 -984 -542 -983 -730 -496
$$ packed form
728I72l44j13M98m81o06N82k98n95J84l35K27Q7o96L03m34N36J2l30O7P79l51
749c36M92k26k6N11J36L86l81J26L25m32k16L79o4k96k54m28M09q0k61k06l04
770g46L78j04n46K84K73m67L51L02M0K20p1K80M66m08K35K42j77Q14o93L2K33
791I38o99L8R4k53M4l33J47l2k81p0K88l38P7m25O7N39l68k56P14q7L12j62k5
814g1N58l14M35m8l44J69j79k6J65k02k96L22l19n3q4l46N42l46l17M03j51j18
836f20J66l94P05n27J45M58q2L37K29k14M12o2o1M09o7k51n9m6K30j54n27K71
858B98K7k91j05L5K5J54k40l3n8m41N25J14l08pk1K68M61k63J62K22J86K12n57
881C65K05J70l59p1k4l69L67k04j81k87j68K86l63k35K51k39j28M42m41K53K34
$$ plain form
902 -496 -597 -435 -784 -442 -2 -334 -143 199 289 425 418 224 379 376 502 429 262 214 -227 275 265 -290 -243
925 -243 146 26 -145 -234 -205 5 -216 -94 115 0 393 519 140 452 720 578 832 775 461 920 905 843
947 843 466 526 811 170 -102 145 -86 -154 30 -595 -635 -261 -550 -844 -814 -210 -702 -1066 -461 -612 -569 -176
969 -176 49 -93 -209 318 335 58 120 559 385 164 70 -329 232 194 -727 -442 134 -411 -919 -443 -266 -651
991 -651 -753 43 -51 -789 -112 60 -455 32 501 492 183 309 541 635 1036 1032 321 908 843 -10 206 643 146
1014 146 -288 117 -86 -608 -497 74 -347 -821 -456 -687 -585 -398 -655 -695 -257 289 -131 -381 359 458 110
1035 110 941 707 232 506 629 494 202 469 640 265 -14 -137 -482 -59 142 -511 -704 -75 -746 -838
1055 -838 -445 -335 -625 -493 67 -223 -691 572 807 145 434 889 731 711 302 743 921 774 654 14
$$ packed form
902d96j01J62l49L42M40l32J91L42R0J36pj94J55lJ26p3j67m8m41N02j0n55M7
925b43L89j20j71q9K9K10k21J22K09j15L93J26l79L12K68j42K54n7l14M59j5o2
947H43l77O0K85o41k72K47k31o8J84o25m0L74k89k94L0O04m92l64O05j51M3L93
969a76K25j42j16N27J7k77O2M39j74k21r4l99N61l8r21K85N76n45n08M76J77l85
991f51j02P96r4p38O77J72n15M87M69rl09J26K32R4M01mp11N87o5q53K16M37m97
1014A46m34M05k03n22J11N71m21m74L65k31J02J87k57m0M38N46m20k50P40R9l48
1035A10Q31k34m75K74J23j35k92K67J71l75k79j23l45M23K01o53j93O29o71r2
1055h38L93J10k90J32N60k90m68J263K35o62K89M55j58k0m09M41J78j47j20o40
$$ plain form
1075 14 142 272 -494 -13 351 -380 -655 -514 -710 -797 -518 -41 -505 -836 -480 -116 -821 10 258 -26 575
1096 575 520 -23 167 575 989 567 555 640 110 -127 465 339 113 69 -250 -201 -642 -552 -853 -445 -129 -453
1118 -453 -848 -422 -531 -614 -203 315 -122 -200 246 610 206 529 1067 690 397 827 195 426 506 527 259
1139 259 94 205 -129 -316 -234 -141 -710 -276 -510 -652 -619 -536 -641 -192 -104 -119 -439 -231 276 -185 444 903
1161 903 238 167 675 518 -64 523 797 525 -345 507 111 -628 -2 120 -363 -243 -634 -748 -824 -512 -191
1182 -191 -377 -348 -379 -358 166 383 -228 149 714 523 54 567 859 260 305 533 269 -1 43 232 -438 25
1204 25 -416 -633 -674 -558 -582 -615 -648 -406 -773 -354 -60 -240 -43 420 176 494 523 252 269 750 617 493
1226 493 578 1118 502 242 637 187 346 251 330 80 -166 -247 -91 -306 -298 -220 -317 -276 -210 -407 -53 -113 -199 125
$$ packed form
1075A4J28J30p66M81L64p31k75J41j96q7K79M77m64l31L56L64p05Q31K48k84O01
1096E75n5n43J90M08M14m22j2Q5n30k37N92j26k26m4l19M9m41R0l01M08L16l24
1118d53l95M26j09q3M11N18m37p8M46L64m04L23N38l77k93M30o32K31Q0K1k68
1139B59j65J11l34j87Q2R3n69M34k34j42L3Q3j05M49Q8j5l20K08N07m61O29M59
1161I03o65p1N08j57n82N87K74k72q70Q52l96p39O26J22m83J20l91j14p6L12L21
1182a91j86K9l1K1N24K17o11L77N65j91m69N13K92n99M5K28k64k70M4J89o70M63
1204B5m41k17m1J16k4l3l3K42l67M19K94j80J97M63k44L18K9k71J7M81j33j24
1226D93Q5N40o16k60L95m50J59r5P9k50k46q1J56k15QP8r7M1O6j97L54o0q6L24
$$ plain form
1250 125 238 216 253 38 532 384 405 639 -79 306 406 153 18 -175 -331 -465 -663 -447 -477 -1073 -877
1271 -877 -587 -735 -777 -670 -568 -683 -523 -405 -47 84 -3 -89 381 122 182 552 691 389 576 768 554
1292 554 713 408 348 306 -105 176 237 -123 -168 -227 -205 -81 -402 -237 -246 -148 -63 -22 -40 77 249 362 436 537
1316 537 667 463 610 557 299 376 493 14 128 97 -104 164 -463 -493 -300 -596 -692 -699 -826 -499 -604 -690 -453
1339 -453 -396 -539 -384 -471 110 170 209 170 249 249 354 293 605 748 79 308 3 207 94 62 -20 -301 -282 -201
1363 -201 -204 -355 -201 -744 -475 -321 -418 -105 -293 -68 135 246 197 441 459 643 687 201 618 359 312 519
1385 519 201 390 467 252 130 1 -228 -294 -749 -32 -296 -366 -525 -333 -231 -107 -328 -182 -108 -188 -211 71
1407 71 147 244 376 275 246 385 257 494 410 275 121 101 450 -175 -72 -93 -136 -564 -191 -374 -358 -546 -376
$$ packed form
1250A25J13k2L7k15M94j48K1K34p18L85J00k53j35j93j56j34j98K16l0n96J96
1271h77K90j48m2J07J02j15J60J18L58J31q7q6M70k59O0L70J39l02J87J92k14
1292E54J59l05o0m2m11K81O1l60m5n9K2J24l21J65rR8Q5M1j8J17J72J13P4J01
1316E37J30k04J47n3k58P7J17m79J14l1k01K68o27l0J93k96r6pj27L27j05q6K37
1339d53N7j43J55q7N81O0L9l9P9%J05o1L12J43o69K29l05K04j13l2q2k81J9Q1
1363b01lj51J54n43K69J54r7L13j88K25K03J11m9K44J8J84M4m86M17k59m7K07
1385E19l18J89P7k15j22j29k29o6m55P17k64p0j59J92J02J24k21J46P4q0k3K82
1407G1P6R7J32j01k9J39j28K37q4j35j54k0L49o25J03k1m3m28L73j83J6j88J70
$$ plain form
1430 -376 -323 -186 -7 -351 -138 288 115 55 387 279 529 339 365 309 188 467 528 37 439 259 -156 205
1452 205 145 -24 -308 -339 -520 -270 -493 -267 -634 -566 -245 -141 -293 0 -49 77 112 52 392 354 367 127 243
1475 243 402 520 384 334 246 -100 -64 81 -10 -199 -35 -126 -221 -311 -145 -453 -302 2 -280 6 109 -374
1497 -374 -36 -39 319 236 190 364 336 211 241 398 238 135 289 60 -84 68 -74 -237 -449 -173 -345 -523
1519 -523 -288 -312 -535 -142 -435 -445 -579 -106 -373 -271 139 325 -86 192 427 36 416 436 83 250 174
1540 174 -11 -68 278 260 -201 -42 -42 -568 -416 -181 -248 -262 -328 137 -158 -612 -224 -70 -364 288 331 89 237
1563 237 459 264 676 507 388 -23 252 215 -427 256 408 -166 -45 135 -498 -402 64 -292 -426 -258 -526
1584 -526 -509 -715 -139 -68 -205 252 108 -235 85 350 475 277 507 338 189 168 342 217 247 589 228
$$ packed form
1430c76N3J37J79l44K13M26j73o0L32j08K50j90K6n6j21K79O1m91M02j80m15L61
1452B05o0j69k84l1j81K50k23K26l67O8L21J04j52K93m9J26L5o0L40l8J3k40J16
1475B43J59J18j36n0q8l46L6J45r1j89J64r1r5r0J66l08J51L04k82K86J03m83
1497c74L38lL58q3m6J74k8j25L0J57j60j03J54k29j44J52j42j63k12K76j72j78
1519e23K35k4k23L93k93j0j34M73k67J02M10J86m11K78K35l91L80K0l53J67p6
1540A74j85n7L46j8m61J59%n26J52K35o7j4o6M65k95m54L88J54k94O52M3k42J48
1563B37K22j95M12j69j19m11K75l7o42O83J52n74J21J80o33R6M66l56j34J68k68
1584e26J7k06N76P1j37M57j44l43L20K65J25j98K30j69j49k1J74j25L0L42l61
$$ plain form
1605 228 -74 -60 -183 -276 -489 -308 -157 -386 -323 -546 -701 -72 -215 -612 -206 -39 -53 -125 170 436 152 470
1627 470 513 311 446 448 262 802 549 362 139 453 95 -210 -11 -15 -156 -460 -229 -497 -531 -398 -309 -457
1649 -457 -716 -463 -318 -225 21 123 157 261 419 98 423 564 458 604 443 534 186 -13 525 21 -146
1670 -146 293 -36 -222 -37 -438 -495 -526 -592 -362 -771 -614 -577 -475 -73 82 -368 -127 146 97 90 392 626
1692 626 511 470 509 446 220 96 385 57 168 97 -226 -217 -249 -30 -343 -280 -336 -367 -425 -328 -514 -272 -66 -324
1716 -324 -123 -25 -12 235 387 415 447 394 609 427 358 783 342 276 223 121 181 -93 -24 -240 60 -375 -553
1739 -553 -159 -411 -488 -465 -284 -498 -287 -257 -232 -75 -79 -36 295 123 39 297 460 243 446 235 342 65 347
1762 347 368 -26 113 -10 -356 -230 -119 -321 -286 -222 -386 -383 -524 -262 -186 -390 -236 -294 -27 170 41 218
$$ packed form
1605B28l02J4j23r3k13J81J51k29O3k23j55O29j43l97M06J67j4p2K95K66k84L18
1627D70M3k02J35Kj86N40k53j87k23L14l58l05J99mj41l04K31k68l4J33Q9j48
1649d57k59K53J45R3K46J02L4J04J58l21L25J41j06J46j61R1l48j99N38n04j67
1670a46M39l29j86J85m01n7l1o6K30m09J57L7J02M02J55m50K41K73m9pL02K34
1692F26j15m1L9o3k26j24K89l28J11p1l23Rl2K19l13O3n6l1n8R7j86K42K06k58
1716c24K01R8J3K47J52K8L2n3K15j82o9M25m41o6n3j02O0k74O9k16L00m35j78
1739e53L94k52p7K3J81k14K11L0K5J57mM3L31j72q4K58J63k17K03k11J07k77K82
1762C47K1l94J39j23l46J26J11k02L5O4j64Lj41K62P6k04J54n8K67J97j29J77
$$ plain form
1784 218 266 211 365 518 339 328 -31 213 202 -4 86 245 -162 103 -196 29 -143 -94 -160 -373 -36 -4 -48
1807 -48 19 -102 -171 123 -126 -121 116 161 142 273 202 304 226 190 170 -6 162 333 -110 -404 129 4 70 -357
1831 -357 15 -23 -222 -246 -154 -267 -409 -165 -339 71 -194 106 4 92 44 -4 352 380 282 56 445 233 3
1854 3 375 51 110 136 -70 -50 -87 -39 13 -369 -251 -205 -358 186 -287 -164 -65 52 -226 -129 -128 292 511 -185
1878 -185 292 201 302 348 115 316 44 148 281 -86 163 -88 -43 -194 -197 -424 -275 -191 -298 -247 -258 -78 -367
1901 -367 -130 -164 -64 -6 115 -51 152 120 196 238 156 65 211 307 88 154 -55 118 -129 -319 184 -361 191
1924 191 -32 -158 -279 -333 -283 -135 -175 -156 -22 -281 -157 -87 65 -61 103 130 276 157 450 308 160 213
1946 213 -101 194 -71 187 125 -221 -12 -165 -252 -414 -32 -126 -230 -61 -563 -374 -20 -504 -16 -249 -171
$$ packed form
1784B18M8n5J54J53j79j1l59K44j1k06R0J59m07K65k99K25j72M9o6k13L37L2m4
1807d8O7j21o9K94k49NK37M5j9J31p1J02p8l6k0j76J68J71m43k94N33j25O6m27
1831c57L72l8j99k4R2j13j42K44j74M10k65L00j02Q8m8m8L56K8r8k26L89k12k30
1854CL72l24N9K6k06K0l7M8N2l82J18M6j53N44m73J23R9J17k78R7JM20K19o96
1878a85M77r1J01M6k33K01k72J04J33l67K49k51M5j51lk27J49Q4j07N1j1J80k89
1901c67K37l4J00N8J21j66K03l2P6M2q2r1J46R6k19O6k09J73k47j90N03n45N52
1924A91k23j26j21n4N0J48m0J9J34k59J24P0J52j26J64K7J46j19K93j42j48N3
1946B13l14K95k65K58o2l46K09j53q7j62L82r4j04J69n02J89L54m84M88k33P8
$$ plain form
1967 -171 196 -71 61 340 206 353 311 37 61 457 221 455 150 274 117 -189 -109 -50 -137 44 -282 -106
1989 -106 18 -308 -130 13 -38 -167 -106 79 136 -271 83 104 316 253 129 96 262 241 200 300 344 -32 96
2012 96 -47 -219 -123 -16 73 -26 -227 -102 122 -461 -354 -31 -10 -216 -312 -31 -166 -315 124 121 23 170 -11
2035 -11 281 312 237 162 44 123 31 -82 85 97 153 44 90 -135 -2 -117 -269 -526 -44 -211 -503 -144 -112
2058 -112 -193 -60 -28 -49 130 228 145 -150 297 594 15 263 189 -186 -61 13 -44 39 247 173 -96 -154 62 34
2082 34 3 -69 -238 -209 10 -34 -105 -31 -84 90 188 212 53 25 350 145 297 86 97 78 282 145 249 -82
2106 -82 -76 -28 -149 14 155 -95 -242 127 -70 -405 -397 -314 -289 -109 29 -126 -494 98 -267 -66 395 185 114
2129 114 312 198 61 89 129 146 75 155 -35 -129 -106 142 -142 -76 -141 -143 -217 -446 63 -65 -125 112 -23 -345
$$ packed form
1967a71L67k67J32K79j34J47m2k74K4L96k36K34l05J24j57l06Q0N9q7J81l26J76
1989a06J24l26J78J43n1j29O1J85N7m07L54K1K12o3j24l3J66k1m1J00M4l76J28
2012I6j43j72R6J07Q9r9k01J25K24n83J07L23K1k06r6K81j35j49M39lr8J47j81
2035a1K92L1p5p5j18P9r2j13J67J2N6j09M6k25J33j15j52k57M82j67k92L59L2
2058a12q1J33L2k1J79R8q3k95M47K97n79K48p4l75J25P4n7Q3K08p4k69n8K16k8
2082C4l1p2j69K9K19m4p1P4n3J74R8K4j59k8L25k05J52k11J1j9K04j37J04l31
2106h2OM8j21J63J41k50j47L69j97l35QQ3K5J80J38j55l68N92l65K01M61k10p1
2129A14J98j14j37K8M0J7p1Q0j90r4K3K48k84O6o5kp4k29N09j28o0K37j35l22
$$ plain form
2153 -345 140 157 6 21 150 -145 87 275 296 237 33 515 -43 76 324 40 -96 -89 -17 -226 215 133 -256
2176 -256 -211 0 -21 -186 56 -175 -273 -19 110 -94 39 259 12 -193 161 -4 160 265 440 4 -107
2197 -107 115 62 -174 -73 62 -309 -171 -252 -330 -305 -71 -141 -158 -219 -324 -81 50 20 11 -182 -23 222 301 444
2221 444 255 -46 -63 29 -114 190 292 263 136 143 51 177 41 3 -42 43 -167 -442 -400 -196 -207 -211 -119 -68 -126
2246 -126 -95 6 -25 -44 -69 171 87 122 104 129 388 7 210 -71 252 30 -179 -20 -97 -53 -145 -252 -416 -298
2270 -298 -53 -117 -34 87 -342 134 66 52 -80 124 -154 239 202 39 243 158 35 25 359 233 21 247
2292 247 -13 -63 -17 13 -85 -452 -225 -25 -217 24 -59 -203 -101 -207 -378 -106 159 247 -473 103 95 113 -118
2315 -118 -89 324 232 98 130 41 222 140 48 110 -50 45 205 -20 -36 -58 -252 53 -132 30 -179 -13 -14 -234
$$ packed form
2153c45M85J7j51J5J29k95K32J88K1n9k04M82n58J19K48k84j36PP2k09M41q2l89
2176b56M5K11k1j65K42k31r8K54J29k04J33K20k47k05L54j65J64J05J75m36j11
2197a07K22n3k36J01J35l71J38q1p8K5K34p0j7o1j05K43J31l0rj93J59K45P9J43
2221D44j89l01j7R2j43L04J02k9j27Pr2J26j36l8m5Q5k10k75M2K04j1mR2N1n8
2246a26L1J01l1j9k5K40q4L5j8K5K59l81K03k81L23k22k09J59p7M4r2j07j64J18
2270b98K45o4Q3J21m29M76o8j4j32K04k78L93l7j63K04q5j23j0L34j26k12K26
2292B47k60n0M6L0r8l67K27K00j92K41q3j44J02j06j71K72K65Q8p20N76qJ8k31
2315a18K9M13r2j34L2q9J81q2r2O2j60R5J60k25j6k2j94L05j85J62k09J66jk20
$$ plain form
2339 -234 -47 -150 -319 -119 -164 170 259 253 219 273 57 126 27 107 118 -126 101 -88 26 76 58 -348 38 -263
2363 -263 -332 -112 -185 -118 -207 -55 54 -17 -3 105 255 176 126 -20 252 -61 72 -42 156 103 64 132 -32 6
2387 6 -21 225 -12 92 -84 -18 -135 7 -176 -266 -258 -171 -266 -145 -179 -111 -169 26 -27 8 -9 -92 -19 264 -125 -21
2413 -21 -30 92 88 -157 105 114 99 4 64 -82 -134 -93 -125 105 -364 -64 12 -100 51 -44 -16 -287 248 12 216
2438 216 -78 -7 120 -108 -30 -63 118 304 -59 -5 115 -117 11 38 -210 0 -181 -214 16 -99 -196 -170 -170
2461 -170 38 -8 -72 -72 -23 54 -36 79 85 141 0 97 187 289 201 118 108 -20 169 77 29 83 23 -160 109 -17
2487 -17 -32 -180 100 -384 -80 63 61 -259 -90 93 112 143 339 323 66 164 160 312 -11 113 143 -191 80 80
2511 80 -44 209 -154 -141 -54 -56 -21 -156 -89 -70 -171 20 105 -164 -225 -32 60 -133 238 -180 -166 -18 -104 6
$$ packed form
2339b34J87j03j69K00m5L34Q9ol4N4k16O9r9Q0J1k44K27j89J14N0j8m06L86l01
2363b63o9K20p3O7q9J52J09p1J4J08J50p9n0j46K72l13J33j14J98n3l9O8j64L8
2387Fk7K46k37J04j76O6j17J42j83r0QQ7r5J21l4O8n8J95n3L5j7q3P3K83l89J04
2413b1rJ22mk45K62Rj5r5O0j46n2M1l2K30m69L00P6j12J51r5K8k71N35k36K04
2438B16k94P1J27k28P8l3J81J86l63N4J20k32J28K7k48K10j81l3K30j15r7K6%
2461a70K08m6o4%M9P7r0J15ON6j41R7R0J02q8q3j0j28J89r2m8N4o0j83K69j26
2487a7j5j48K80m84L04J43kl20J69J83J9L1J96j6k57R8mJ52l23J24L0l34K71%
2511H0j24K53l63J3Q7kL5j35O7J9j01J91Q5k69o1J93R2j93L71m18J4J48q6J10
$$ plain form
2535 6 142 317 -39 3 72 269 -22 27 -40 -201 -234 17 171 52 169 -205 -161 -286 13 -127 -7 -1 -230
2558 -230 -175 19 159 -28 -159 152 -25 44 193 82 238 50 168 77 -65 45 157 -238 82 17 -146
2579 -146 -268 -31 38 22 -24 -134 -242 -20 -28 -81 -309 -108 -61 84 135 226 150 134 22 95 278 252 -65 163
2603 163 158 108 37 -78 62 -222 139 -11 104 64 97 18 -69 -275 -131 -117 -47 -136 -88 -87 92 196 -12 12 86
2628 86 62 258 130 140 74 211 -168 -266 292 -339 -54 264 -7 -134 -30 -206 -120 -33 -159 -101 -54 -315 -150
2651 -150 -169 -91 -100 108 92 -81 109 33 -316 -126 92 73 92 141 -107 268 30 172 24 -165 -98 -142 -84 106
2675 106 35 -82 138 -93 -71 -18 27 -100 -43 106 -63 -255 100 -221 44 -47 53 40 -64 -113 59 44 286
2698 286 7 17 85 9 -210 135 126 -106 -95 -117 -61 -17 -59 132 -31 153 11 63 -27 -9 127 -206 140 187 83
$$ packed form
2535FJ36J75l56M2O9J97k91M9o7j61l3K51J54j19J17l74M4j25K99j40J20Ok29
2558b30N5J94J40j87j31L11j77O9J49j11J56j88J18r1j42J10J12l95L20o5j63
2579a46j22K37O9j6m6j10j08K22qn3k28K01M7J45N1R1p6j6j12P3J83k6l17K28
2603A63nn0p1j15J40k84L61j50J15m0L3p9q7k06J44J4P0q9M8JJ79J04k08K4P4
2628H6k4J96j28J0o6J37l79r8N58o31K85L18k71j27J04j76Q6Q7j26N8M7k61J65
2651a50j9P8rK08j6j73J90p6l49J90K18j9J9M9k48L75k38J42j48j89O7m4N8J90
2675A06p1j17K20k31K2N3M5j27N7J49j69j92L55l21K65r1J00j3j04m9J72j5K42
2698B86k79J0O8p6k19L45rk32J1k2N6M4m2J91j63J84j42N2r0J8J36l33L46M7j04
$$ plain form
2723 83 147 285 -297 108 86 84 71 94 27 124 155 155 152 -119 8 77 -188 -217 -158 -74 -11 -13 163 -161 -93 81 -317
2750 -317 -97 253 17 78 -144 151 112 52 -54 26 108 32 22 33 -390 23 -17 77 133 -353 47 -160 -107 -214
2774 -214 -8 -112 -114 -97 -188 -79 117 -161 92 -26 153 142 115 185 309 118 133 58 18 107 -26 -50 1 6 -126
2799 -126 -190 -325 37 -40 -38 -229 -120 82 -93 -49 35 -51 -178 213 -254 205 -7 -111 -94 -86 170 228 -1 111
2823 111 65 40 -22 -65 -152 -50 -33 -30 -268 -119 170 -348 16 -86 -95 -189 -452 -110 40 -111 152 33 138 150
2847 150 -2 157 98 222 221 235 334 -100 146 80 -51 -27 55 110 -69 44 -2 -166 -198 -340 -2 201 -263 -40
2871 -40 -22 4 -210 21 30 147 -108 -391 65 320 294 97 54 -57 58 -8 -174 -136 111 151 -227 -65 68
2894 68 -252 -51 -166 -263 -262 84 -270 -43 -96 -211 -5 0 235 76 53 164 106 -132 54 139 73 129 2 239
$$ packed form
2723H3O4J38n82M05k2kj3K3o7R7L1%lk71J27O9k65k9N9Q4O3kJ76l24O8J74l98
2750c17K20L50k36O1k22K95l9o0j06Q0Q2p6j0J1m23M13m0R4N6m86M00k07N3j07
2774b14K06j04kJ7r1J09J96k78K53j18J79j1k7P0J24j91J5p5m0Q9j33k4N1Nj32
2799a26o4j35L62p7Kj91J09K02j75M4Q4q6j27L91m67M59k12j04J7QK56N8k29J12
2823A11m6k5o2m3q7J02J7Lk38J49K89n18L64j02rr4k63L42J50j51K63j19J05J2
2847A50j52J59n9J24jJ4R9m34K46o6j31K4Q2N5j79J13m6j64l2j42L38K03m64K23
2871d0J8K6k14K31RJ17k55k83M56K55k6j97m3j11J15o6j66L8K47M0l78J62J33
2894F8l20K01j15r7JL46l54K27n3j15K06NK35j59k3J11n8k38J86Q5o6N6j27K37
$$ plain form
2918 239 -51 111 100 -27 167 -104 -188 -265 -224 -182 -436 24 -252 32 -46 -90 -64 -107 -214 169 210 251 -34 44
2942 44 84 102 397 190 85 341 127 133 5 53 130 105 89 132 36 -29 -29 -125 51 -123 -266 -211 126 -29 -214
2967 -214 -156 87 -79 67 25 296 -2 111 102 107 191 5 249 -57 18 -210 -58 135 8 -119 52 -136 -34
2990 -34 -70 30 82 78 90 10 -124 0 -83 -41 31 -180 -108 -40 180 -61 -21 -45 -211 36 182 78 -28 -89 39
3015 39 132 0 6 -7 -59 -62 36 366 84 -28 70 45 -140 370 210 -112 9 49 168 -208 -6 251 -29 9
3039 9 30 47 204 403 178 -158 -25 232 -14 78 99 -168 -38 -121 -175 83 70 210 -47 -117 -90 17 -71 114
3063 114 -10 -95 179 376 116 396 321 -95 -272 588 442 542 145 -114 -328 -378 -307 127 72 92 -231 226
3085 226 667 -271 185 168 -408 265 286 118 -46 108 -266 -6 126 184 157 -57 -35 -42 151 -125 -122 133 36
$$ packed form
2918B39k90J62j1j27J94k71q4p7M1M2k54M60k76K84p8m4K6m3j07L83M1M1k85P8
2942D4M0J8K95k07j05K56k14Oj28M8P7k5j6M3r6o5%r6J76j74j43N5L37j55j85
2967b14N8K43j66J46m2K71k98J13rNQ4j86K44l06P5k28J52J93j27j27J71j88J02
2990c4l6J00N2mJ2q0j34J24q3M2P2k11P2O8K20k41M0k4j66K47J46j04j06o1J28
3015C9R3j32Oj3n2lR8L30k82j12R8k5j85N10j60l22J21M0J19l76K02K57k80L8
3039IK1J7J57J99k25l36J33K57k46R2K1k67J30q3n4K58j3J40k57p0K7J07q8J85
3063A14j24q5K74J97k60K80p5m16j77Q60j46J00l97k59k14n0P1M34n5K0l23M57
3085B26M41r38M56j7n76O73K1j68j64J54l74K60J32N8k7k14K2pJ93k76LK55r7
$$ plain form
3108 36 -147 175 -14 -141 -122 19 15 -286 -207 5 -66 -13 -3 -133 -48 226 37 194 56 258 -17 111 215
3131 215 463 -240 328 -145 147 59 5 54 -339 257 494 10 -309 70 301 -492 437 -205 -175 229 190 -338
3153 -338 146 -51 239 599 206 168 -240 -9 -145 156 191 841 80 36 -513 180 -271 79 86 -179 -107 -154
3175 -154 -202 63 -201 23 -105 -34 -245 -266 78 -84 143 -1 191 14 295 84 157 -54 -44 -19 31 65 69
3198 69 44 -280 -18 -139 -6 218 85 8 -183 -12 -59 18 78 -9 -53 -71 201 12 -196 159 101 -191 253
3221 253 181 -69 249 157 229 44 -237 124 -66 -70 -251 -404 269 -477 -219 383 -209 157 14 -152 63 -96
3243 -96 -241 -189 70 -99 49 236 -32 -108 -6 -173 -232 25 113 75 201 -11 186 165 -182 -92 -51 -261 103
3266 103 -254 -98 -161 -47 -57 -35 -220 -84 -164 155 101 -252 -53 50 -106 460 129 -49 51 115 34 142
$$ packed form
3108C6j83L22j89j27J9J41ml01P9K12p1N3J0j30Q5K74j89J57j38K02k75J28J04
3131B15K48p03N68m73K92q8n4M9l93N96K37m84l19L79K31p93R29o42L0M04l9n28
3153c38M84j97K90L60l93l8m08K31j36L01L5O50p61m4n49O93m51L50Pk65P2m7
3175a54m8K65k64K24j28P1k11k1L44j62K27j44J92j77K81k11P3k11J0K5N0L4M
3198F9k5l24K62j21J33K24j33p7j91J71m7P7O0q7m4j8K72j89k08L55n8k92M44
3221B53p2k50L18r2P2j85k81L61j90mj81j53O73p46K58O02n92L66j43j66K15j59
3243i6j45N2K59j69J48J87k68p6J02j67n9K57Q8l8J26k12J97k1l47R0M1k10L64
3266A03l57J56o3J14j0K2j85J36q0L19n4l53J99J03j56N66l31j78J00O4q1J08
$$ plain form
3288 142 17 -7 143 152 142 86 130 86 -193 -116 43 -149 -100 -113 -75 -22 -167 -65 -126 25 149 -56 53 -287
3312 -287 94 133 -46 114 179 120 91 341 -46 58 -16 159 53 10 109 41 20 97 -56 -193 -222 -66 -42 139
3336 139 -113 -127 0 -122 84 -5 59 159 358 106 318 -48 31 126 376 -22 21 325 79 139 7 203
3358 203 126 221 100 165 100 -325 -173 -188 311 -245 251 -258 -9 -496 31 375 437 284 -156 311 117 38
3380 38 6 -346 -25 411 -251 295 -64 230 -306 446 97 -34 -132 -260 32 116 -171 101 69 -103 3 -162
3402 -162 -191 6 -57 -198 109 18 236 167 122 117 184 -96 92 151 45 150 -116 40 77 4 -196 -96 -99 -172 -69
3427 -69 -220 -126 52 -167 48 -58 34 -344 223 -13 181 223 206 -78 -150 10 106 -95 -101 191 -72 12 296
3450 296 -116 -104 455 202 146 -1 -88 138 275 -67 -90 -78 -6 -194 -101 -63 -21 -23 -99 157 157 109 -53 -124 142
$$ packed form
3288A42j25k4J50Rj0n6M4m4k79P7J59j92M9j3L8N3j45J02o1J51J24k05J09l40
3312b87L81L9j79J60O5n9k9K50l87J04p4J75j06m3R9o8k1P7j53j37k9J56K4J81
3336A39k52j4J27j22K06q9O4J00J99k52K12l66P9R5K50l98M3L04k46O0j32J96
3358B03p7R5j21O5o5m25J52j5M99n56M96n09K49m87N27L44O2j53m40M67j94p9
3380C8l2l52L21M36o62N46l59K94n36P52l49j31r8j28K92Q4k87K72l2j72J06j65
3402a62k9J97o3j41L07r1K18o9m5nO7k80J88N9j06J05k66J56L7p3k00J00lp3J03
3427f9j51R4J78k19K15j06R2l78N67k36J94M2j7k84p2J60R6k01oK92k63Q4K84
3450B96m12J2N59k53n6j47q7K26J37l42k3J2P2j88R3L8M2kp6K56%m8j62p1K66
$$ plain form
3475 142 4 193 -61 -21 -72 -10 -31 75 15 164 168 -166 4 -171 10 -370 40 60 -118 -256 -138 -305 47
3498 47 148 79 -149 -152 -122 53 14 117 -97 -337 207 38 -116 203 179 -99 -158 -100 -6 92 -195 126 -443 37
3522 37 -66 120 -25 -521 274 -317 535 357 -17 106 650 56 -25 359 672 724 -386 318 237 9 151
3543 151 683 630 77 488 -18 -148 -113 -4 151 -33 410 36 -43 -219 -296 -162 -252 73 190 331 100 -271
3565 -271 105 101 -112 -2 -690 407 580 -338 -148 40 241 32 -542 -265 67 109 -15 -54 -265 -14 29
3586 29 44 -137 43 -52 73 14 -110 7 189 -97 -88 -95 40 12 -38 -130 -127 62 307 -25 -78 53 22 -116 -27
3611 -27 14 -161 -24 -184 4 210 -6 -233 0 138 -91 -44 2 -4 -27 183 -95 54 -201 -323 149 43
3633 43 158 122 -20 76 40 -171 -231 144 159 -143 -9 -107 -151 -256 -68 -57 -107 7 -235 -153 227 -103 -51 -221
$$ packed form
3475A42j38J89k54M0n1O2k1J06o0J49Ml34J70j75J81l80M10K0j78j38J18j67L52
3498D7J01o9k28lL0J75l9J03k14k40N44j69j54L19k4k78n9N8R4R8k87L21n69M80
3522C7j03J86j45m96P95n91Q52j78l74J23N44n94q1L84L13N2j110P04q1k28J42
3543A51N32n3n53M11n06j30L5J09J55j84M43l74p9j76p7J34r0L25J17J41k31l71
3565b71L76mk13J10o88J097J73r18J90J88K01k09n74K77L32M2j24l9k11K51M3
3586B9J5j81J80r5J25n9j24J17J82k86RpJ35k8n0r2LJ89K45l32n3J31l1j38Q9
3611b7M1j75J37j60J88K06k16k27K33J38k29M7M6ok3K10k78J49k55j22M72j06
3633D3J15l6j42R6l6k11o0L75J5l02J34r8m4j05J88J1n0J14k42Q2L80l30N2j70
$$ plain form
3657 -221 137 266 163 288 -78 148 200 102 248 -142 233 89 -44 77 -44 -36 107 28 -10 57 -233 -33
3679 -33 -134 -160 -176 65 54 95 32 -26 291 -140 89 -33 156 -4 -154 158 -15 -99 15 41 -36 -2 41 -21
3703 -21 37 161 -139 -7 -381 30 -143 170 99 98 66 80 -105 -46 -105 -19 -146 -129 34 -223 108 199 9 -164
3727 -164 -211 25 194 134 -87 93 -44 163 3 136 39 89 -171 -193 -158 118 -11 -31 55 -206 -98 -125 197
3750 197 -87 250 66 92 -71 -56 -92 160 107 -64 158 -72 -64 81 153 70 -170 -14 -3 -220 7 -296 90
3773 90 -140 -114 48 258 10 211 -86 34 -20 -204 130 29 -109 -8 -60 -116 -77 69 59 -87 72 49 159
3796 159 -118 126 34 -82 -140 -25 -294 -71 -76 59 103 -125 -25 6 -26 47 -158 66 -15 -105 -16 167 -11 254
3820 254 4 -233 314 245 161 18 -69 -42 -46 36 32 -155 -174 -191 61 -123 -56 -58 -15 6 155 64 -32 -181 97 52
$$ packed form
3657b21L58J29j03J25l66K26N2r8J46l90L75j44j33J21j21QJ43p9l8O7k90K00
3679c3j01k6j6K41j1M1o3n8L17m31K29j22J89j60j50L12j73q4J14K6p7L4M3o2
3703b1N8J24l00J32l74M11j73L13p1jl2J4j85N9n9Q6j27J7J63k57L31R1j90j73
3727a64m7K36J69o0k21J80j37K07j60J33r7N0k60k2L5K76j29k0Q6k61J08k7L22
3750A97k84L37j84K6j63J5l6K52n3j71K22k30QJ45P2q3k40J56J1k17K27l03L86
3773I0k30K6J62K10k48K01k97J20n4j84L34j01j38J01n2n6L9J46j0j46J59k3J10
3796A59k77K44r2j16n8J15k69K23nJ35M4k28J00L1l2P3k05K24q1r0Q9J83j78K65
3820B54k50k37N47o9q4j43q7K7mQ2mj87j9j7K52j84O7kM3K1J49r1r6j49K78m5
$$ plain form
3846 52 -128 72 -27 121 135 293 84 304 107 44 120 110 -2 -48 235 -78 -56 30 155 5 -69 -66 -168 -143
3870 -143 -58 50 -7 84 49 108 -75 -76 348 -36 51 53 17 187 30 -122 25 35 -197 -154 -25 -147 -126 -110 141
3895 141 -5 -177 -45 -155 -24 -188 -134 133 -98 76 -111 266 -19 104 41 46 -25 80 76 -2 78 -97 -111
3918 -111 246 39 65 78 54 133 136 -213 114 51 -71 -138 -47 114 -186 -141 -274 -9 -4 6 -14 -74 -230 -23 44
3943 44 219 78 94 152 -77 150 -42 -162 77 -89 128 -95 164 10 -20 -177 184 153 -8 -113 -161 17
3965 17 46 84 146 -30 -198 12 -242 69 288 -193 -32 -34 -64 115 101 -164 59 -73 80 -234 -52 -85 -40
3988 -40 26 51 48 -48 -144 76 -101 -225 -186 124 -78 141 25 173 211 62 -60 0 218 318 -7 70 -163 -57
4012 -57 55 -170 392 280 2 34 -47 -10 -40 -215 -127 -83 147 -298 -44 -168 -134 81 -17 67 161 165 14 104 166
$$ packed form
3846E2j80K00r9J48J4J58k09K20j97o3P6j0j12m6K83l13K2Q6J25j50p4Lj02K5
3870a43Q5J08n7R1l5N9j83jM24l84Q7Kl6J70j57j52J47J0k32M3J29j22K1J6K51
3895A41j46j72J32j10J31j64N4K67k31J74j87L77k85J23o3Np1J05mp8Q0j75j4
3918a11L57k07K6J3k4P9Ll49L27o3j22o7R1J61l00M5j33K65NJ0k0o0j56K07O7
3943D4J75j41J6N8k29K27j92j20K39j66K17k23K59j54l0j57L61l1j61j05m8J78
3965A7K9L8O2j76j68K10k54L11K19m81J61kl0J79j4k65K23j32J53l14J82l3M5
3988d0O6K5lr6r6K20j77j24L9L10k02K19j16J48L8j49j22O0K18J00l25P7k33J06
4012e7J12k25N62j12k78L2q1L7l0j75Q8M4K30m45K54j24L4K15r8Q4R4Mj51R0O2
$$ plain form
4037 166 -227 -69 -36 160 9 -123 99 -62 -124 -177 125 49 30 37 -82 -59 343 -116 -4 86 -37 -66 -14 -81
4061 -81 -83 -69 158 -80 28 106 -62 45 153 -13 13 392 149 -68 -181 285 -28 -17 148 43 -310 9
4083 9 40 -152 -459 53 408 80 -177 34 180 102 -92 109 -202 92 -3 -20 109 4 7 -108 110 -61 243
4106 243 61 368 0 319 27 -5 -226 -264 -61 51 -104 -49 7 -36 128 30 65 -133 -161 72 182 -68 -14
4129 -14 121 126 -252 -90 56 -68 -13 -220 46 107 -95 34 26 -87 15 64 -106 104 282 -65 -140 -103 -290
4152 -290 78 68 145 66 185 112 -173 116 118 235 -12 220 -17 165 -180 -169 -12 -28 182 116 108 29 -37 -57 75
4177 75 -229 -142 34 -82 73 36 -127 -135 102 -207 -160 29 77 209 36 -218 -25 376 35 -69 -53 44 -125
4200 -125 -3 162 -2 -198 291 -37 -190 139 -240 -209 -116 -233 -174 -140 177 45 -80 118 -5 -145 -64 2
$$ packed form
4037A66l93J58L3J96j51j32K22j61o2n3L02p6j9Pj19K3M02m59J12R0j23k9N2o7
4061h1kJ4K27k38J08P8j68J07J08j66K6L79k43k17j13M66l13J1J65j05l53L19
4083IL1j92l07N12L55l28k57K11J46p8j94K01l11K94r5j7J29j05Lj15K18j71L04
4106B43j82L07l68L19k92l2k21l8K03J12j55N5N6m3J64r8L5j98k8K33J10k50N4
4129a4J35Nl78J62J46j24N5k07K66O1k02J29qj13J02M9j70K10J78l47p5L7j87
4152b90L68j0P7p9J19p3k85K89KJ17k47K32k37J82l45J1J57j6K10o6qp9o6k0J32
4177G5l04Q7J76j16J55l7j63qK37l09M7J89M8J32j73k54J93M01l41j04J6R7j69
4200a25J22J65j64j96M89l28j53L29l79L1R3j17N9L4L17j32j25J98j23j40Q1O6
$$ plain form
4222 2 80 179 132 141 142 -12 90 -140 16 143 -200 -297 -41 -188 -204 -48 -247 106 38 -186 -272 -16 224 90
4246 90 49 -61 31 -16 325 151 -131 14 84 -116 85 269 159 56 61 -27 -209 3 -89 -159 35 -64 19 16 -391
4271 -391 31 -63 -241 -48 -10 20 -123 79 19 -142 93 84 -137 72 -102 -72 96 200 22 25 -17 -3 -11 173
4295 173 102 35 19 60 33 -227 -90 -50 30 -2 -137 -119 225 51 43 -242 -9 -529 -574 140 -77 265 -79 -2
4319 -2 54 -129 88 -146 161 97 18 -54 -181 109 -268 -269 -58 59 -74 -47 22 -46 -34 -111 73 39 -156 1 -28
4344 -28 69 -241 -20 -8 169 134 -61 182 -45 38 159 -36 24 -142 -140 -53 -202 -107 30 -179 -326 126 25
4367 25 125 -134 54 -116 81 9 -27 -47 -185 147 79 45 -125 130 168 131 -76 -131 -187 178 51 123 189 -72
4391 -72 -55 69 -144 -112 -197 -162 184 -93 -12 70 -6 139 201 -42 130 103 -53 6 13 215 -111 167 243 -81 197
$$ packed form
4222BP8R9m7RJj54J02k30J56J27l43r7K56j47j6J56j99L53o8k24q6K56K40j34
4246I0m1j10R2m7L41j74k82J45P0k00K01J84j10j03Nq8j82K12r2p0J94r9Q3lm07
4271c91M22r4j78J93L8L0j43K02o0j61K35rk21K09j74L0J68J04j78Lm2J4qJ84
4295A73p1o7j6M1k7k60J37M0Q0l2j35J8L44j74qk85K33n20m5P14k17L42l44P7
4319bN6j83K17k34L07o4p9p2j27K90l77jK11J17j33K7O9o8J2p7J84l4j95J57k9
4344b8R7l10K21J2J77l5j95K43k27Q3J21j95O0j66KQ7j49R5J37k09j47M52j01
4367B5J00k59J88j70J97p2l6k0j38L32o8l4j70K55L8l7k07n5n6L65j27P2O6k61
4391g2J7J24k13L2q5L5L46k77Q1Q2p6J45O2k43J72k7j56N9PK02l26K78P6l24K78
$$ plain form
4416 197 71 -30 69 143 91 110 -182 -128 202 -66 -208 15 95 62 36 106 -55 200 -46 -182 316 61 -70
4439 -70 -88 68 68 173 113 110 98 163 211 142 -155 227 -52 -214 89 -159 37 -94 -161 -77 156 -110 295 -160
4463 -160 -118 181 -158 -78 139 -17 -52 6 -49 59 99 93 145 143 -36 221 3 -13 -166 -232 146 -22 0 -55 117
4488 117 251 198 23 -117 -169 288 12 -106 -88 -173 26 71 21 136 -274 59 126 -273 34 -126 -137 -106 136
4511 136 -155 -9 -122 -133 -51 -133 -198 -80 -188 7 162 -60 -308 17 -85 -130 -159 -208 16 144 -7 -289
4533 -289 -34 86 166 4 -30 93 -26 -52 -64 -106 -7 -178 -26 17 -87 -65 42 -145 -6 -2 70 -241 -131 84
4557 84 -22 -27 -355 -43 -44 154 92 -22 113 -93 -31 62 -184 -28 173 33 18 -60 -64 44 215 -95 -198 58
4581 58 193 30 33 102 21 -19 -411 189 -173 290 -37 68 190 82 -64 31 115 53 210 -159 -192 70 96 54
$$ packed form
4416A97j26j01R9P4n2J9k92N4L30k68j42K23Q0l3k6P0j61K55k46j36M98k55j31
4439g0j8J56%J05o0lj2O5M8o9k97L82k79j62L03k48J96j31o7Q4K33k66M05m55
4463a60M2K99l39Q0K17j56l5N8n5J08M0oN2kj79K57k18j6j53o6L78j68K2n5J72
4488A17J34n3j75j40n2M57k76j18J8q5J99M5n0J15m10L33O7l99L07j60j1L1K42
4511A36k91J46j13j1Q2q2o5J18j08J95J55k22k48L25j02m5k9m9K24J28j51k82
4533b89K55J20Q0j62l4J23j19k6j2m2R9j71J52M3j04K2J07j87J39MP2l11J10K15
4557H4j06nl28L12jJ98o2j14J35k06O2R3k46J56K01j40j5p8mJ08J71l10j03K56
4581E8J35j63LO9q1m0l92O00l62M63l27J05J22j08j46R5Q4o2J57l69l3K62K6m2
$$ plain form
4605 54 33 -13 -47 208 -24 64 -64 -53 102 -63 -172 74 -17 -148 -60 95 332 -150 -156 -120 -125 158 -45 71
4629 71 184 -9 74 -282 37 148 74 -261 55 -139 187 -13 137 166 -97 97 -106 47 -110 93 -183
4650 -183 -14 -211 565 439 -263 91 -12 87 -174 -14 -148 154 77 10 51 108 -93 -13 14 4 -57 275 -297
4673 -297 -155 11 -61 -25 246 -89 218 31 198 -121 50 -245 -38 -21 -82 -295 -711 -171 214 524 -147
4694 -147 255 272 409 80 195 12 208 281 -298 77 253 148 302 -117 190 -151 246 -172 -480 436 -164
4715 -164 921 257 119 428 126 -133 99 -660 179 -258 116 457 460 1038 143 120 16 -46 -90 -42 251 -11
4737 -11 -298 -198 -210 -312 52 67 -61 72 -32 -198 -317 250 190 201 -28 122 30 32 -12 -191 79 -133 -21
4760 -21 64 -59 -169 108 37 48 -207 -3 -112 34 -78 136 15 -125 -129 -85 -84 -185 -273 5 -92 95 -69 22
$$ packed form
4605E4k1m6l4K55k32Q8j28J1J55j65j09K46r1j31Q8J55K37m82oL6nK83k03J16
4629G1J13j93Q3l56L19J11p4l35L16j94L26k00J50K9k63J94k03J53j57K03k76
4650a83J69j97P76j26p02L54j03R9k61J60j34L02p7o7M1N7k01Q0K7j0o1L32n72
4673b97J42J66p2L6K71l35L07j87J67l19J71k95K07J7o1k13m16N40L85L10o71
4694a47M02J7J37l29J15j83J96P3n79L75J76j05J54m19L07l41L97m18l08R16o00
4715a64J085o64j38L09l02k59K32p59Q39m37L74L41LN78q95k3j04o2m4M8K93k62
4737a1k87J00j2j02L64J5j28J33j04j66j19N67o0J1k29J50r2Km4j79K70k12J12
4760b1Q5j23j10K77p1J1k55K04j09J46j12K14j21j40mM4Jj01q8K78r7J87j64R1
$$ plain form
4784 22 -82 -11 54 -46 90 -141 -26 92 -104 -220 -68 174 0 17 233 -49 145 -145 67 -156 45
4805 45 -126 -170 -105 -224 50 -9 -274 4 -44 -163 -19 507 329 -25 50 283 -195 -320 -480 -384 -169 543
4827 543 -50 348 241 -149 309 174 -408 -299 -70 -39 186 233 -423 -139 317 402 233 13 377 -53 -179
4848 -179 -501 348 20 -326 -252 -419 -11 505 -46 -137 340 44 -232 -29 156 122 750 511 76 7 496
4869 496 338 -164 154 221 -87 -275 391 -498 133 -161 126 -180 101 161 448 -235 -142 108 -458 -103 341
4890 341 303 -712 -286 278 -186 -103 156 55 220 309 303 -25 -197 86 -163 -178 -61 -60 55 48 87 44 -15 -205
4914 -205 20 150 -27 -220 -40 -65 -256 92 -217 -140 9 -42 68 -11 -141 127 -28 -61 -87 7 -86 14 -86
4937 -86 -60 8 51 -28 -45 259 78 -9 -1 63 -131 29 -62 -61 41 132 192 -62 -38 -166 146 -124 -63 93 6 -121
$$ packed form
4784B2j04P1O5j00J36k31J15J18j96j16J52K42j74J7K16k82J94k90K12k23K01
4805D5j71m4O5j19K74n9k65K78m8j19J44N26j78l54P5K33m78j25j60R6K15P12
4827E43n93L98j07l90M58j35n82J09K29L1K25M7o56K84M56Q5j69k20L64m30j26
4848a79l22Q49l28l46P4j67M08N16n51r1M77k96k76K03J85l4O28k39m35o9M89
4869D96j58n02L18O7l08j88O66q89O31k94K87l06K81O0K87o83R3K50n66L55M44
4890C41l8j015M26N64m64Q3K59j01J65Q9ol28j72K83k49j5J17JJ15pL9m3n9j90
4914b05K25J30j77j93J80k5j91L48l09P7J49n1J10p9j30K68j55l3k6R4r3J00j00
4937h6K6O8M3p9j7L04j81q7QO4j94J60r1JJ02R1O0k54K4j28L12k70O1J56q7j27
$$ plain form
4963 -121 -184 34 -59 -92 75 168 8 -237 -96 -137 5 13 -33 -15 183 58 95 -50 127 -166 -27 -123 142 -14
4987 -14 -197 165 -25 138 -64 31 -409 -125 -179 3 -322 -168 135 -153 -17 31 -41 24 68 -164 158 221 -308
5010 -308 240 -3 263 -108 243 31 -3 129 74 222 264 -75 -83 86 67 -16 -57 9 81 113 -93 -9 35 195
5034 195 146 132 -232 8 98 -188 -354 -109 -164 160 -114 -86 202 78 -27 -58 230 78 70 148 -174 134 -190
5057 -190 113 202 78 28 -229 -37 -79 -18 -52 100 148 212 183 54 -195 8 -37 44 104 -44 42 -65 -47 37 10
5082 10 74 65 8 195 -17 64 242 115 128 -58 21 -107 77 -79 140 240 -35 -146 -27 -7 -125 262 -184
5105 -184 -10 -189 24 -42 -7 208 132 -13 120 -217 68 10 61 -23 -66 -54 37 181 3 68 -194 59 241
5128 241 -63 100 205 177 131 40 -86 22 26 -63 -21 -55 -87 -25 -29 -121 258 -100 60 48 42 -253 -141 -3 -69 212
$$ packed form
4963a21o3K18r3l3J67R3j60k45J41m1J42Qm6J8J98j25L7j45J77k93J39r6K65j56
4987a4j83L62j90J63k02R5m40K84n4J82l25J54L03k88J36M8p2O5M4k32L22O3n29
5010c08N48k43K66l71L51k12l4J32n5J48M2l39qJ69j9q3m1O6P2L2k06Q4M4J60
5034A95m9j4l64K40R0k86j66K45n5L24k74K8K88j24j05l1K88j52qP8l22L08l24
5057a90L03Q9j24n0k57J92m2O1l4J52M8O4k9j29k49K03m5Q1O0j48Q6j07J8Q4k7
5082A0O4rn7J87k12Q1J78j27J3j86P9j28J84j56K19J00k75j11J19K0j18L87m46
5105a84J74j79K13o6L5K15p6j45J33l37K85n8N1q4m3J2R1J44j78O5k62K53J82
5128B41l04J63J05k8m6r1j26J08Mq9M2l4l2O2mr2L79l58J60j2ok95J12J38o6K81
$$ plain form
5154 212 131 180 -921 -42 -86 -129 345 0 58 -77 77 -72 101 207 -80 -27 -220 -151 -126 175 92 136 173
5177 173 -221 -119 -398 268 -136 57 198 -131 642 117 205 -40 166 473 -341 -819 689 -300 -153 616
5197 616 413 420 145 236 -116 69 396 -257 294 101 -261 -241 -52 -20 38 -97 -77 -156 -134 -36 -91 99 233 -67
5221 -67 127 -272 21 146 0 76 132 -74 47 25 391 115 321 -165 523 -432 -593 803 -119 -134 121
5242 121 -47 -123 116 -203 55 41 -22 -40 50 -7 -93 154 -12 128 -58 -7 79 -3 -233 -229 -75 152 95 5 10
5267 10 7 -281 -41 25 -187 20 10 -18 211 5 -5 -49 -5 -17 50 -46 26 12 -67 183 -95 110 -93 -76 91
5292 91 10 -98 -159 92 75 16 98 49 162 75 32 260 39 -168 -42 188 215 -175 -115 -42 148 171 334 -512
5316 -512 148 -94 33 -386 -510 -108 519 -277 106 282 16 643 314 101 16 323 16 -675 263 245 -143
$$ packed form
5154B12q1M9j101Q79m4m3M74l45N8j35J54j49J73J06k87N3j93O9K5L01q3M4L7
5177A73l94J02k79O66m04J93J41l29P73n25Q8k45K06L07q14m78J508r89J47P69
5197F16k03Pk75R1l52J85L27o53N51j93l62K0J89L2N8j35K0p9K2R8n5J90J34l00
5221f7J94l99K93J25j46P6N6k06J21k2L66k76K06m86O88r55j61J396r22j5K55
5242A21j68p6K39l19K58j4o3j8R0n7q6K47j66J40j86N1Q6q2k30MJ54K27n7r0N
5267A0lk88K40O6k12K07j0k8K29k06j0m4M4j2O7r6P2j4p9K50k78K05k03J7J67
5292I1q1j08o1K51j7n9Q2m9J13q7m3K28k21k07J26K30K7l90O0P3J90K3J63q46
5316e12O60k42J27m19j24M02O27p96L83J76k66O27l29k13q5L07l07o91R38j8l88
$$ plain form
5337 -143 306 -239 341 -209 -606 288 16 258 111 116 -437 275 23 287 -164 52 534 28 -96 -200 -608
5358 -608 -30 -804 -270 -170 -112 -137 -78 89 -329 184 -91 235 283 336 -60 400 -297 -317 282 -124 388 150
5380 150 -96 -222 207 -66 -352 -114 -3 -155 -117 -240 -119 -149 -101 309 49 32 85 -214 -162 -106 205 89
5402 89 -389 50 -211 19 353 -113 -12 -3 -186 -55 -179 1 181 -161 250 291 -15 231 127 -163 -89 -369
5424 -369 35 -423 -625 663 120 -206 -318 78 169 494 752 -354 10 -409 -246 188 275 -206 -408 70
5444 70 -489 -151 163 -342 -351 371 405 -412 -153 -231 114 280 80 446 -13 -201 -682 -739 232 -248 259 309
5466 309 -856 231 314 -470 258 66 141 171 56 -29 -232 -164 -180 34 351 -181 -420 -235 22 -166 -80 71
5488 71 -449 150 -68 -210 204 213 -54 -65 213 109 58 12 -30 -182 -29 40 35 105 35 223 -49 114 -98 -35
$$ packed form
5337a43M49n45N80n50l97Q94k72K42j47Nn53P12k52K64m51K16M82n06j24j04m08
5358f08N78p74N34J00N8k5N9J67m18N13k75L26M8N3l96M60o97k0N99m06N12k38
5380A50k46j26M29k73k86K38J11j52L8j23J21l0M8M10k60j7N3k99N2N6L11j16
5402H9m78M39k61K30L34m66J01Rj83J31j24J80J80l42M11M1l06K46j04k90P4k80
5424c69M04m58k02J288n43l26j12L96R1L25K58j106L64m19J63M34Q7m81k02M78
5444G0n59L38L14n05rP22L4q17K59p8L45J66k00L66m59j88m81n7R71m80N07N0
5466C09j165J087Q3p84P28j92P5L0j15q5k03O8j6K14L17n32k39J85K57j88Q6J51
5488G1n20N99k18j42M14Rk67j1K78j04n1m6m2j52J53O9nP0p0J88k72J63k12O3
$$ plain form
5512 -35 -189 26 77 -34 90 -350 -66 112 9 49 -7 98 133 -38 -124 71 -189 -302 221 64 69 -170 -35
5535 -35 104 -15 -90 76 -235 -165 -74 -42 17 -49 39 174 5 -185 -105 -6 -12 -53 -161 4 68 -170 56 172 125
5560 125 87 -21 301 -34 -41 42 -50 -8 137 93 -43 175 7 -207 141 19 -275 90 131 -107 -211 -19 168
5583 168 7 -17 -6 -136 55 0 -160 349 -51 -163 181 34 158 -111 73 115 130 115 13 217 -99 319
5605 319 56 14 114 129 184 -127 26 66 243 -67 94 -134 -63 26 -165 -37 -113 -162 -56 -155 9 -103 -212
5628 -212 204 53 -117 114 -12 18 -127 -35 -46 -29 172 -70 -82 144 -55 71 37 -137 -38 -68 47 7 45
5651 45 35 190 -10 76 22 124 49 45 88 76 -104 -146 44 -98 118 86 -67 122 -228 49 101 -57 -277 349
5675 349 83 113 -82 -14 -114 -198 67 137 -156 24 80 188 -153 -128 206 107 255 49 -65 77 -133 -155 167
$$ packed form
5512c5j54K15N1j11J24m40K84J78j03M0n6J05L5j71q6J95k60j13N23j57Nk39J35
5535c5J39j19p5J66l11P0R1L2N9o6Q8J35j69j90Q0R9om1j08J65O4k38K26J16m7
5560A25l8j08L22l35pQ3r2M2J45m4j36K18j68k14L48j22k94L65M1k38j04J92J87
5583A68j61k4J1j30J91n5j60N09m00j12L44j47J24k69J84M2J5j5j02K04l16M18
5605C19k63m2J00J5N5l11J53M0J77l10J61k28P1Q9j91J28p6m9J06r9J64j12j09
5628b12M16j51j70K31j26L0j45R2j1J7K01k42j2K26j99J26l4j74R9l0J15m0L8
5651D5j0J55k00Q6n4J02p5mM3j2j80m2J90j42K16l2j53J89l50K77N2j58k20O26
5675C49k66L0j95O8j00q4K65P0k93J80N6J08l41K5L34r9J48k06j14J42k10k2L22
$$ plain form
5698 167 -49 -3 172 -129 -43 279 3 -30 101 -126 -54 -148 -149 -195 226 104 -79 -26 -32 117 50 41 302 113 -66
5723 -66 -24 92 188 175 269 104 318 47 -188 163 -108 59 5 38 94 40 -19 -257 82 56 -106 -261 81 107
5747 107 -52 -308 -123 5 389 -133 47 -99 -80 83 107 280 -56 -89 -76 -72 34 55 -42 127 46 -27 -61 21
5771 21 162 -97 -71 138 -92 248 -191 102 -127 -169 63 -130 -214 -133 22 90 16 84 90 -68 247 -22 -48 -2
5795 -2 28 110 102 10 292 -4 66 4 45 11 18 67 200 -190 32 113 -58 104 19 63 -163 156 229 74 -163 -39
5821 -39 138 113 -78 69 67 10 -74 -123 -69 4 47 -76 6 -47 94 -18 34 -76 5 80 57 -95 -98 -32 96 17 -67
5848 -67 82 -132 -163 -59 -48 15 80 -50 9 102 -40 16 -55 57 -87 25 82 -225 -77 -64 213 -152 223 -88
5872 -88 -79 77 -73 -67 -137 129 71 90 -162 -162 65 60 17 -131 60 -18 -3 85 91 249 30 34 131 -168 94 -86 155
$$ packed form
5698A67k16M6J75l01Q6L22k76l3J31k27P2r4jm6M21j22j83N3oJ49o7rK61j89j79
5723f6M2J16R6j3R4j65K14k71k35L51k71J67n4L3N6n4n9k38L39k6j62j55L42K6
5747A07j59k56J85J28L84n22J80j46J9J63K4J73l36l3J3MJ06K1r7J69q1p3l4Q2
5771B1J41k59K6K09k30L40m39K93k29m2K32j93q4Q1J55O8p4O8Oj58L15k69k6M6
5795bL0Q2qr2K82k96P0o2M1l4PM9J33l90K22Q1j71J62q5M4k26L19P3j55k37J24
5821c9J77k5j91J47kn7q4m9N4P3M3j23Q2n3J41j12N2j10Q1P5k3j52lO6J28p9q4
5848f7J49k14l1J04J1O3O5j30N9R3j42N6p1J12j44J12N7l07J48J3K77l65L75l11
5872h8RJ56j50Op0K66n8J9k52%K27nm3j48J91p8J5Q8OJ58k19MR7k99K62j80K41
$$ plain form
5899 155 -85 -145 151 52 -164 49 -91 -67 71 83 -34 94 -249 3 39 -24 -95 128 94 107 217 91 -95
5922 -95 126 -277 -17 -185 -191 315 -272 548 220 309 -553 -239 132 352 775 -352 -102 459 -309 -24 178
5943 178 572 101 -12 -311 -130 -123 -186 -342 193 297 74 -371 430 112 359 44 146 282 23 -314 -46
5964 -46 124 -315 -35 -121 14 -41 -119 99 7 -35 -153 -141 11 -126 176 51 30 -3 -57 -4 146 347 -59 -86
5988 -86 139 122 -174 -20 209 76 -110 -33 -113 -68 -61 -97 -154 -64 199 -79 -27 61 -115 -19 145 213 28 -86 0
6013 0 6 -4 -79 -23 84 125 158 88 -21 -20 -41 -5 63 6 -270 153 -74 -63 -115 43 125 271 -217 22 -185 -193 1
6040 1 74 -80 -79 -35 90 36 -93 246 40 20 -27 66 -86 -84 38 -69 -226 94 -102 44 53 154 43 124 87
6065 87 191 -10 118 3 -63 235 -1 258 38 193 223 53 246 -6 133 -94 243 -102 274 138 -212
$$ packed form
5899A55k40o0K96r9k16K13j40K4J38J2j17J28l43K52L6o3p1K23l4J3J10j26j86
5922i5K21m03K60j68oN06n87Q20l28Q9q62L14L71K20M23j127K50N61p68K85K02
5943A78L94m71j13k99J81Po3j56N35J04k23m45Q01l18K47l15J02J36k59l37K68
5964d6J70m39K80q6J35n5p8K18r2m2j18J2J52j37L02j25k1l3n4N3J50K01m06k7
5988h6K25j7k96J54K29j33j86P7q0M5Pl6n7R0K63k78N2Q8j76R6J64O8j85j14Q6
6013@Oj0p5N6J07M1L3p0j09Jk1L6O8n7k76M23k27J1n2J58Q2J46m88K39k07qJ94
6040AP3j54JM4J25n4j29L39k06k0m7R3j52KJ22j07j57L20j96J46RJ01j11Q1l7
6065H7J04k01J28j15o6K98k36K59k20J55L0j70J93k52J39k27L37l45L76j36l50
$$ plain form
6086 -212 -188 -47 93 27 217 50 -43 55 60 -41 -31 124 158 -45 241 16 1 -138 -43 152 -48 76 -114
6109 -114 12 -71 -41 -129 98 -13 -181 -233 -81 71 -218 102 4 67 202 -36 79 -3 -203 -148 -47 69 -429
6132 -429 13 -55 -116 52 -56 48 -133 -86 225 135 8 -167 -127 -90 109 192 -193 111 -247 48 41 14 198
6155 198 162 -32 -33 -223 -52 9 158 85 -220 -38 178 102 -133 -312 585 -232 -273 5 214 -74 -115 138 -59
6178 -59 85 28 374 459 -181 -127 -373 113 176 -71 168 137 -389 -354 -238 -53 -112 -120 31 7 4 66 -33 -99 118
6203 118 -72 17 82 -26 -126 189 208 -202 73 -64 152 105 200 46 129 101 65 -69 -160 -58 21 -55 121 -263
6227 -263 -92 -180 -119 75 410 -109 -450 -455 269 65 -44 241 -23 -41 -54 136 2 161 348 -175 -274 638
6249 638 952 789 -734 819 -448 -581 -28 -68 509 108 429 -323 -111 26 17 -103 -335 -752 6 -126
$$ packed form
6086b12K4J41J40o6J90j67r3R8Nj01J0J55L4k03K86k25j5j39R5J95k00J24j90
6109a14J26q3L0q8K27j11j68n2J52J52k89L20r8O3J35k38J15q2k00N5J01J16m98
6132d29M42o8o1J68j08J04j81M7L11r0j27j75M0L7J99Q3l85L04l58K95pk7J84
6155A98l6j94jj90J71O1J49p3l05J82K16p6k35j79Q97q17m1K78K09k88m1K53j97
6178e9J44n7L46Q5o40N4k46M86O3k47K39l1n26L5J16J85n9qJ51k4lO2r9o6K17
6203A18j90Q9O5j08j00L15J9m10K75j37K16m7R5j54Q3k8l6j34r1J02P9p6J76l84
6227b63J71q8O1J94L35n19l41nP24k04j09K85k64j8j3J90j34J59J87n23r9R12
6249F38L14j63j523J553j267j33N53m0N77m01L21p52K12J37rj20k32m17P58j32
$$ plain form
6269 -126 364 -66 -189 51 137 84 -35 -227 -556 -195 713 -327 33 338 -417 -516 91 203 -100 -438 250
6290 250 547 -780 271 401 -315 -173 -494 -344 467 -355 -160 -36 -404 -34 79 232 -161 -330 143
6309 143 193 131 132 97 101 395 17 47 -66 -135 122 106 150 85 238 -91 144 -238 114 -47 2 77 124 110 -270
6334 -270 181 153 -87 55 -31 81 -166 103 84 -57 -130 242 -34 -12 -167 1 -124 71 -123 50 -83 99
6356 99 145 88 212 183 -61 -88 -210 -31 -174 -114 -75 169 -93 8 95 101 -44 -76 -492 -241 -48 -39 112 -68
6380 -68 97 -56 193 97 116 162 6 -129 -80 34 379 -23 278 11 160 -28 18 112 -4 190 -129 84
6402 84 -86 27 -38 35 -80 37 171 -89 78 10 20 313 -87 228 -36 142 67 -32 -85 49 38 31 17 -245
6426 -245 21 -92 -27 142 -87 21 84 -211 -114 7 79 0 -166 131 79 106 -122 -181 -193 210 -45 -275 -54
$$ packed form
6269a26M90m30j23K40Q6n3j19j92l29L61R08j040L60L05p55r9O07J12l03l38O88
6290B50K97j327J051J30p16J42l21J50Q11q22J95J24l68L70J13J53l93j69M73
6309A43N0o2Jl5MK94l78L0j13o9K57j6M4o5J53l29K35l82L52j61M9P5M7j4l80
6334b70M51k8k40J42q6J12k47K69j9j41p3L72k76K2j55J68j25J95j94J73j33J82
6356I9M6n7J24k9k44k7j22J79j43O0L9K44k62J01Q7Oj45l2m16K51J93RJ51j80
6380f8J65j53K49r6J9M6j56j35M9J14L45m02L01k67J49j88M6R4j16J94l19K13
6402H4j70J13o5P3j15J17J34k60J67o8J0K93m00L15k64J78p5r9n3J34j1pj4k62
6426b45K66j13O5J69k29J08O3k95R7J21P2p9j66K97n2K7k28n9j2M03k55k30K21
$$ plain form
6449 -54 -234 313 -50 48 45 -12 102 138 126 81 -128 -14 104 86 131 -308 406 -24 289 77 9 -82 -305 229
6473 229 -323 -296 254 377 221 -112 558 124 71 262 281 214 247 -539 157 -418 -264 307 109 146 -531 -235
6495 -235 15 -209 246 731 -246 -638 154 389 185 119 30 180 866 291 -141 -1006 -270 -490 507 -755
6515 -755 -660 444 -710 413 -149 636 -157 -258 -860 190 56 -67 305 136 932 774 447 -578 -76
6534 -76 155 432 227 410 233 -585 -270 668 -399 -313 459 413 -538 273 609 -325 -323 -243 20 -67 -123 639
6556 639 137 84 63 230 -273 643 -317 -361 858 -198 -249 232 -212 72 316 -99 -74 57 373 155 -6
6577 -6 268 137 113 -25 100 -55 -89 6 -156 -313 -17 -271 10 83 312 588 104 198 50 429 12 -447
6599 -447 253 97 -402 -167 333 196 -193 230 171 -447 -241 302 -50 227 -402 -269 477 -514 506 -106
$$ packed form
6449e4j80N47l63R8ln7J14L6j2m5k09J14J18j8M5m39P14m30L13k12o8r1k23N34
6473B29n52K7N50J23j56l33O70m34n3J91J9o7L3p86O96n75J54N71j98L7o77K96
6495b35K50k24M55M85r77l92P92K35k04o6q9J50O86n75m32q65P36k20R97j262
6515g55R5J104j154J123n62P85p93j01o02J050j34j23L72j69P96j58l27j025N02
6534g6K31K77k05J83j77q18L15R38j067Q6P72m6r51Q11L36r34KQ0K63q7n6P62
6556F39n02n3k1J67n03R16r60m4J219j056n1M81m44K84K44m15K5J31L16k18j61
6577fK74j31k4j38J25j55l4R5j62j57K96k54K81P3K29K76m84R4j48L79m17m59
6599d47P00j56m99K35N00j37l89M23n9o18K06N43l52K77o29J33P46r91J020o12
$$ plain form
6619 -106 273 670 150 -309 -766 96 630 -20 -609 352 -43 -125 93 -393 364 -81 -10 -104 436 25 -517
6640 -517 -19 -82 -36 501 362 -73 41 12 253 -159 37 9 -52 86 -24 -155 -41 42 73 -263 -34 -108 -231
6663 -231 96 228 12 33 78 221 268 49 14 -21 81 -46 -83 53 156 109 -120 35 -109 -10 97 -286 118
6686 118 -216 20 84 81 136 -50 234 198 3 -195 -81 -156 116 -133 -135 -119 89 208 -9 -35 69 -229 38
6709 38 -145 388 92 87 9 -282 35 -128 -452 -411 199 -168 -97 -65 31 -97 25 14 -2 43 -106 309 -57 65
6733 65 -537 -309 95 -7 120 -59 -63 -178 163 -102 -85 335 5 -243 -295 -141 26 262 2 -19 46 59 44
6756 44 27 179 -101 60 -308 20 -9 -42 290 -53 29 153 -248 368 45 120 -338 186 -140 20 64 57 -9
6779 -9 -171 -113 -142 143 283 129 -185 86 -41 -242 145 21 203 45 257 -90 50 -60 -44 137 -129 60
$$ packed form
6619a06L79L97n20m59m57Q62N34o50n89R61l95q2K18m86P57m45P1r4N40m11n42
6640e17M98o3M6N37j39m35J14k9K41m12J96k8o1J38j10j31J14Q3L1l36K29p4j23
6663b31L27J32k16K1M5J43M7k19l5l5J02j27l7J36J03m7k29J55j44R9J07l83M04
6686A18l34K36O4lN5j86K84l6j95j98J14p5K72k49kJ6K08J19k17k6J04k98K67
6709C8j83N33k96np8k91L17j63l24M1O10l67P1L2R6j28J22j1j6M5j49M15l66J22
6733F5o02K28M04j02J27j79mj15L41k65J7M20l30k48n2J54J67K36k60k1O5J3j5
6756D4j7J52k80J61l68L28k9l3L32l43Q2J24m01O16l23P5m58N24l26J60M4po6
6779ij62N8k9K85J40j54l14K71j27k01L87j24J82j58K12l47J40j10J6J81k66J89
$$ plain form
6801 60 193 54 130 -312 -141 -244 120 74 -312 83 151 -65 -55 158 -158 -25 11 -16 94 -93 -271 -172 126
6824 126 252 58 -21 -16 106 137 -45 -43 -79 -164 166 217 38 116 -140 167 -69 251 124 -121 248 212 77 95
6848 95 31 20 -2 -167 -98 -99 191 353 60 77 43 41 55 -15 -225 -154 186 -123 221 -26 -150 -7 339 186 -82
6873 -82 -375 -5 -24 -207 44 184 -49 -23 -132 85 -29 100 182 -471 82 -49 208 -91 -32 93 -218 192
6895 192 -22 -201 -205 38 -19 170 -36 178 44 140 -265 -121 70 -328 111 -273 -41 -217 74 91 64 82
6917 82 127 66 168 124 45 140 66 -101 -176 -386 -132 68 -17 -419 16 207 -17 39 -31 -13 -105 -153 -96 -177 -77
6942 -77 -249 -347 179 -317 -124 -583 -381 291 -334 -382 307 -231 820 -150 5 -5 -65 436 134 -416 -256
6963 -256 -3 -165 -290 301 -41 -356 -206 -48 212 268 25 142 -217 100 -120 -51 -127 -162 17 -128 -87 164
$$ packed form
6801F0J33j39P6m42J71j03L64m6l86L95O8k16J0K13l16J33L6k7J10j87j78R9K98
6824A26J26j94p9NJ22L1j82Kl6q5L30N1j79P8k56L07k36L20j27k45L69l6j35J8
6848I5o4j1k2j65O9jK90J62k93J7l4kJ4p0k10P1L40l09L44k47j24J43L46j53k68
6873h2k93L70j9j83K51J40k33K6j09K17j14J29Q2o53N53j31K57k99N9J25l11M10
6895A92k14j79mK43n7J89k06K14j34R6m05J44J91l98M39l84K32j76K91J7k7J8
6917H2M5o1J02m4p9R5p4j67p5k10K54K00q5m02M35J91k24N6p0J8r2m8N7q1J00
6942g7j72r8N26m96J93m59K02O72o25m8O89n38J051r70J55j0o0N01l02n50J60
6963b56K53j62j25N91l42l15J50J58K60N6k43J17l59L17k20O9p6l5J79j45M1K51
$$ plain form
6985 164 94 -166 168 71 -93 83 13 -113 -108 -25 90 106 8 30 48 -136 154 154 -31 153 -42 94 12 137
7009 137 -138 53 152 127 171 56 55 126 -279 203 106 -108 -152 -79 -156 96 126 -58 -38 -114 125 21 -187 -84
7033 -84 117 -63 150 -115 260 -77 60 -26 176 223 -191 -181 -276 -166 79 11 -71 66 -118 -290 58 -67
7055 -67 -92 105 -9 98 -16 50 -146 112 -8 -89 178 -137 108 -21 153 -3 18 -206 -196 -197 -116 -170 -3
7078 -3 -175 -68 57 2 -61 -27 169 13 -140 132 -170 -12 -29 -189 -116 -136 338 316 -5 -85 224 45 -18 64
7102 64 -23 112 -33 50 -15 -198 10 200 -29 12 133 -127 121 -7 -24 332 -29 38 -124 11 -21 74 -1
7125 -1 139 -270 176 -24 -33 -53 35 -12 23 167 -19 93 -161 18 -11 185 84 72 -5 264 -101 13 53 25
7149 25 50 -94 -298 53 -173 63 115 102 -74 133 198 -69 229 -22 209 -151 -57 -75 163 -151 -147 89 -123
$$ packed form
6985A64p0k60L34r7j64J76p0j26NQ3J15J6r8K2J8j84K90%j85J84j95J36q2J25
7009A37k75J91R9k5M4j15jP1m05M82r7k14m4P3p7K52L0j84K0p6K39j04k08J03
7033h4K01j80K13k65L75l37J37q6K02M7m14J0r5J10K45o8q2J37j84j72L48j25
7055f7k5J97j14J07j14O6j96K58j20q1K67l15K45j29J74j56K1k24J0jQ1n4J67
7078cj72J07J25n5o3L4J96j56j53K72l02J58j7j60P3k0M74k2l21q0L09j79o3Q2
7102F4q7J35j45Q3o5j83K08J90k29M1J21k60K48j28j7L56l61O7j62J35l2R5p5
7125aJ40m09M46k00rk0Q8m7L5J44j86J12k54J79k9J96j01j2p7K69l65J14M0k8
7149B5K5j44k04L51k26K36N2j3j76K07O5k67K98k51K31l60R4j8K38l14MK36k12
$$ plain form
7172 -123 18 -142 18 181 336 -80 5 68 -31 68 111 -9 272 52 119 101 201 58 -76 -15 -270 -10 -178
7195 -178 155 44 -243 68 -32 187 -173 121 -2 6 168 141 -13 74 356 -267 -216 153 -106 -13 -35 -133 60
7218 60 100 -62 173 -112 -81 -18 -7 -118 102 97 -23 88 -115 -270 42 61 115 -144 20 -34 -137 102 -141
7241 -141 -12 25 28 113 30 -36 158 -4 80 10 -54 -117 -104 -168 243 178 115 14 -2 -34 96 -81 3 89 -150 34
7267 34 46 41 65 -123 273 6 26 -10 -140 -28 98 -46 243 -129 -39 -50 -72 146 -143 49 52 70 172 104 130
7292 130 198 224 149 -67 -55 -54 -83 178 -124 -148 0 -101 95 -42 98 121 -170 -52 -30 -294 -88 -177 -31 -62
7316 -62 -14 64 -98 179 -226 -202 69 108 124 137 -76 14 -65 -84 0 -118 82 -16 -171 -186 -227 -43 -48 110 -57
7341 -57 89 -31 12 -326 109 -128 -22 48 -216 55 -32 -59 -27 -45 12 -71 6 -126 -181 22 -244 -66 23 194
$$ packed form
7172a23J41j60J60J63J55m16Q5O3r9R9M3j20K81k20O7j8J00j43j34O1k55K60j68
7195a78L33j11k87L11j00K19l60K94j23QJ62k7j54Q7K82o23N1L69k59R3k2r8J93
7218F0M0j62K35k85L1O3J1j11K20nj20J11k03j55L12J9N4k59J64n4j03K39k43
7241a41J29L7LQ5q3o6J94j62Q4p0o4o3J3o4M11o5o3j01j6l2J30j77Q4Q6k39J84
7267C4J2nK4j88L96k67K0l6j30J12J26j44K89l72R0j1k2K18k89J92LJ8J02o8K6
7292A30O8K6p5k16J2Jk9K61l02k4J48j01J96j37J40K3k91J18K2k64K06q9J46l1
7316f2M8P8j62K77m05K4K71L9J6J3k13R0p9j9Q4j18K00r8j55j5m1J84nJ58j67
7341e7J46j20M3l38M35k37J06P0k64K71q7k7L2j8N7q3P7j32n5K03k66J78Q9J71
$$ plain form
7365 194 69 -205 -48 150 122 20 83 37 -136 -67 -124 115 1 -109 53 -66 173 37 44 24 176 88 169
7388 169 244 -131 206 -162 -66 171 194 26 74 -90 -297 156 157 -141 -387 -82 2 17 207 -169 -168 -200 -17 68
7412 68 48 153 -156 237 139 12 -184 -156 180 -123 46 -139 -3 -93 -64 116 -79 -97 159 101 -4 -131 104
7435 104 6 -152 -80 -184 -91 36 44 37 212 -63 -18 1 -164 -105 31 -219 -12 80 -195 -174 104 -102 -30 -55 -51
7460 -51 63 48 20 6 205 -47 113 61 -110 -101 139 169 -32 166 205 -44 -253 -132 -83 100 -37 -114 18 84
7484 84 -56 -129 -3 -94 -97 134 39 -30 -178 -275 13 108 -172 -2 -171 -107 -299 -128 -256 53 -165 -247 89 43
7508 43 41 64 97 -207 5 120 -9 -188 86 -11 -171 11 -195 118 -89 -153 -69 70 90 185 68 71 78 273 148
7533 148 -111 169 25 -37 -110 -92 169 -172 170 227 -9 50 -134 -145 133 54 60 134 -128 -148 -26 -50 -200 261
$$ packed form
7365A94j25k74J57J98k8j02O3m6j73O9n7K39j14j10J62j19K39j36Pk0J52q8Q1
7388A69P5l75L37l68R6K37K3j68M8j64k07M53Jk98k46L05Q4J5J90l76Jl2J83Q5
7412F8k0J05l09L93r8j27j96K8L36l03J69j85J36r0K9J80j95j8K56n8j05j27K35
7435A04r8j58P2j04R3J27QpJ75k75M5J9j65N9J36k50K07R2k75K1K78k06P2k5M
7460e1J14j5k8j4J99k52J60n2j71RK40L0k01J98L9k49k09J21M9J83j37p7J32O6
7484H4j40p3J26r1lK31r5o9j48r7K88R5k80J70j69O4j92J71j28L09k18q2L36m6
7508D3kK3L3l04K12J15j29j79K74r7j60J82k06L13k07o4Q4J39K0R5j17LPJ95j25
7533A48k59K80j44o2p3J8K61l41L42N7k36N9j84j1K78p9OP4k62k0J22k4j50M61
$$ plain form
7557 261 0 41 -97 74 -51 -137 -65 -108 -101 -67 11 71 -226 130 44 73 -13 28 24 11 115 193 106 -44 -42 16 53
7584 53 -12 160 24 284 -111 47 -83 -35 139 96 43 -47 44 -63 -74 86 -146 57 256 21 -20 36 151
7607 151 -220 127 57 -60 -159 -187 0 158 -166 32 14 83 189 64 -174 158 -104 41 -127 -88 38 137
7629 137 -52 -165 -29 -120 -136 4 223 -52 118 38 -120 140 -73 -130 -98 -21 33 -340 -361 -37 -125 21 35
7652 35 -36 216 -125 132 121 223 108 -183 34 -135 -120 105 22 104 236 -145 -43 260 -165 132 -9 -60
7674 -60 -70 135 98 -66 18 13 -147 -56 48 34 -68 118 -91 280 187 40 -191 174 15 -63 72 -136 5
7697 5 -65 -57 -193 -34 108 -237 180 -12 -36 194 119 -166 -17 262 27 -84 3 -405 -240 57 12 107 45 110
7721 110 71 309 -111 -105 -151 137 70 -35 50 61 228 108 2 -89 101 -111 90 -109 13 179 -99 -4 -105
$$ packed form
7557B61k61M1j38J71j25q6P2m3PL4P8O0k97L56q6K9q6M1mj3J04P8q7j50KN8L7
7584E3o5J72j36K60l95J58j30M8J74m3n3r0R1j07j1J60k32K03J99k35m1N6J15
7607A51l71L47p0j17r9k8J87J58l24J98j8O9J06j25k38L32k62J45j68L9J26R9
7629A37j89j13J36r1j6J40K19k75J70q0j58K60k13n7L2P7N4l73k1L24q8J46J4
7652C5p1K52l41K57j1J02j15k91K17j69J5K25q3Q2J32l81J02L03m25K97j41n1
7674f0j0K05l7j64Q4nj60R1J04j4j02J86k09L71r3j47k31L65j59p8J35k08J41
7697Ep0Qj36J59J42l45M17j92k4K30p5k85J49K79k35j11Q7m08J65K97m5R5o2O5
7721A10l9K38m20Om6K88o7j05Q5J1J67j20j06r1J90k12K01j99J22J66k78R5j01
$$ plain form
7744 -105 145 118 43 -11 -64 -14 7 -10 -105 47 244 -40 197 163 -57 41 -235 -44 75 65 -111 114 23 173
7768 173 334 105 119 -102 43 -61 -92 -41 62 81 -88 7 -131 -207 -11 161 106 39 -30 67 19 240 -123 221
7792 221 171 174 219 57 -83 100 25 -66 44 57 -229 -48 80 21 15 167 -134 121 -48 -20 4 -10 34 -25 -57
7817 -57 -87 145 157 15 -66 -219 131 -112 -144 99 -63 -7 78 53 -12 -20 209 -92 -12 15 72 -171 165 44 8
7842 8 -275 -90 11 -119 219 -34 -24 -138 178 -48 -84 -189 -70 -109 45 80 114 -116 20 -27 275 173 -91
7865 -91 99 81 -95 -86 54 -123 -268 11 84 -142 116 -76 -20 140 85 150 248 7 182 65 181 53 -150
7888 -150 -25 49 -194 150 -50 192 49 168 212 -194 -59 -44 66 -60 -25 -41 -76 -64 -1 279 -64 -103 32
7911 32 -20 -289 -212 218 -195 174 -17 -55 -40 287 92 -326 151 -4 -77 -53 27 -33 -129 -70 23 -20 35 -120 -43
$$ packed form
7744a05K50k7p5n4n3N0K1j7r5J52J97k84K37l4k20R8k76J91J19j0j76K25r1J50
7768A73J61k29J4k21J45j04l1N1J03J9j69R5j38p6J96J72n5o7o9R7m8K21l63L44
7792B21n0LM5j62j40J83p5r1J10J3k86J81J28n9oJ52l01K55j69K8K4j4M4n9l2
7817e7l0K32J2j42q1j53L50k43l2K43j62N6Q5k5o5qK29l01Q0K7N7k43L36j21l6
7842Hk83J85J01j30L38k53J0j14L16k26l6j05J19l9J54L5L4k30J36m7L02j02k64
7865i1J90j8j76RJ40j77j45K79P3k26K58j92N6J60n5O5R8k41J75j17J16j28k03
7888a50J25P4k43L44k00K42j43J19M4m06J35J5J10j26L5j6l5J2O3K80l43l9J35
7911C2n2k69P7M30m13L69j91l8J5L27j95m18M77j55p3K4Q0o0r6N9R3m3N5j55P7
$$ plain form
7936 -43 -114 49 14 104 130 -84 39 50 -261 105 -83 129 19 -40 6 -30 186 -5 -94 -336 83 123 -273 -193
7960 -193 33 -143 -92 -110 -2 118 -17 -19 -58 -34 -102 -126 62 -73 -234 -35 75 14 -23 193 74 -218 173
7983 173 14 123 161 -172 -19 -23 88 -33 34 -76 -177 -76 74 -242 -71 -23 54 8 247 -97 -79 126 252
8006 252 36 286 7 64 -119 77 -136 47 -14 85 80 -49 43 -78 -22 25 -10 158 64 78 -80 -123 -143 -25
8030 -25 -222 -338 55 -64 -133 -139 -7 236 28 45 -198 98 105 -90 118 59 25 18 121 215 241 -166 -48 -38 -11
8055 -11 -16 72 35 158 -26 -92 -62 -87 34 -71 44 73 -202 128 -150 -35 210 160 -135 232 117 78 -49 -8
8079 -8 -131 128 1 163 196 357 -75 8 222 92 -165 -236 99 43 31 159 -43 52 55 152 375 -168 157 105
8103 105 304 98 -6 -307 -83 -223 -99 138 147 -70 431 -419 104 400 389 -42 -530 206 249 -13 11 -510
$$ packed form
7936d3p1J63l5R0K6k14J23J1l11L66j88K12j10n9M6l6K16j91q9k42M19M0l96Q0
7960a93K26j76N1j8J08J20j35kl9K4o8k4J88j35j61J99J10o1l7K16j19k92L91
7983A73j59J09L8l33J53mJ11j21O7j10j01J01J50l16J71M8P7m6K39l44J8K05J26
8006B52k16K50k79N7j83J96k13J83o1R9nj29R2j21N6M7l5J68r4J4j58m3k0J18
8030b5j97j16L93j19o9oJ32K43k08J7k43K96Pj95K08n9l4pJ03R4K6m07J18J0K7
8055a1nQ8l7J23j84o6L0k5J21j05J15K9k75L30k78J15K45n0k95L67j15l9j27M1
8079hj23K59j27J62L3J61m32Q3K14j30k57p1L35n6j2J28k02R5LR7K23n43L25n2
8103A05J99k06j04l01K24j40J24K37Rk17N01q50N23K96j1m31m88P36M3k62K4n21
$$ plain form
8125 -510 -200 603 -165 -478 -877 -419 -259 -217 -264 -122 -45 135 35 -97 183 34 19 97 -27 -206 74 49
8147 49 89 33 166 97 -23 -92 407 -103 69 36 -111 -25 93 -61 -10 64 74 -175 2 111 13 -19 15 -524
8171 -524 207 55 54 27 24 144 -132 -133 54 -66 -142 37 51 -46 -51 -35 -30 161 109 89
$$ packed form
8125e10L10Q03p68l13l99M58J60M2m7J42P7J80j00j32K80j49j5P8j24j79K80k5
8147D9M0n6J33o9j20o9M99n10J72l3j47Q6J18j54N1P4J0k49J77J09r8l2L4n39
8171e24P31j52jk7lJ20k76jJ87j20p6J79J4r7nJ6NJ91n2k0
8191H9
$$ Imaginary data points
##PAGE= N=2
##DATA TABLE= (X++(I..I)), XYDATA
$$ plain form
0 0 0 0 0 0 0 0 0 0 0 0 0 0 0 0 0 0 0 0 0 0 0 -6 8 -8 8 -8 8 -8 14 -16 16 -16 22 -24 25 -30 32 -38 41 -46 52 -56 63
43 63 -70 77 -86 95 -104 113 -126 139 -152 168 -185 204 -228 253 -283 316 -359 410 -472 553 -662
64 -662 814 -1045 1432 -2204 4310 -21413 -61959 7983 44357 5230 -18779 13024 29107 12419
78 12419 5279 12180 7932 14097 26157 14376 -9749 -4341 23694 26142 -4079 -11094 11307 15652
92 15652 -5081 -12726 -1360 2482 -3133 -2383 -6566 -16854 -4006 16260 5408 -12414 -2089
105 -2089 16170 12167 359 2168 5426 6971 11125 491 -13882 -1906 15125 2820 -19238
118 -19238 -13302 8013 5232 -14864 -15512 -2688 -1778 -12173 -16067 -8395 -6897 -11287 -7559 -7147 -12147
133 -12147 -7140 5281 5871 -4338 -3230 8482 8728 1879 5136 8029 4548 3443 3681 1511 418
$$ packed form
0@%%%%%%%%%%%%%%%%%%%%%oJ4j6J6j6J6j6K2l0L2l2L8m6M9n5O2p0P9q7R8j08J19
43F3j33J47j63J81j99K17k39K65k91L20l53L89m32M81n36N99o75P69q82J025j215
64f62J476j859K477l636O514k5723m0546O9942L6374l9127k4009L1803J6083j6688
78A2419p140O901m248O165J2060j1781k4125N408K8035K448l0221p015K2401M345
92A5652k0733p645J1366L842n615P50m183j0288J2848K0266j0852j7822J0325
105b089J8259m003j1808J809L258J545M154j0634j4373J1976J7031j2305k2058
118a9238N936K1315k781k0096o48J2824R10j0395l894P672J498m390L728M12n000
133a2147N007J2421N90j0209J108J1712K46o849L257K893l481j105K38k170j093
$$ plain form
148 418 6183 9399 1887 -3942 349 5216 3700 -1036 -3306 1161 1181 -4932 -8116 -3295 3382 1258
164 1258 -5095 -4562 -126 3077 4295 1451 1938 5176 4350 565 -560 2838 5895 2478 -2221 -1861
180 -1861 166 2617 1034 -1989 130 1616 8 -3254 -3720 -127 1258 -3102 -4811 -4725 -1878 695
196 695 -2074 -2314 1262 2662 308 -731 2601 5438 3122 649 711 233 1511 2292 -142 -1056 -605
213 -605 548 -211 -2106 -533 1578 -666 -2396 -2768 -2083 -1217 -1775 -1486 -2301 -4195 -1854 1123 -46
230 -46 -1063 1173 3999 2259 -1360 1313 5140 3203 232 -282 197 648 161 210 -248 -611 1066 -144
248 -144 -2716 -839 1849 1404 -1655 -2894 42 -54 -2130 74 1470 264 -604 -77 2084 2101 1576
265 1576 3339 2886 556 1061 1416 1357 362 21 -535 -2184 -2418 -132 -845 -2804 -1577 -826 -2155 -3525
$$ packed form
148D18N765L216p512n829M291M867j516m736k270M467K0o113l184M821O677k124
164A258o353N33M436L203J218k844M87L238q26l785j125L398L057l417m699L60
180a861K027K451j583l023K119J486j608l262m66L593J385m360j709Q6K847K573
196F95k769k40L576J400k354j039L332K837k316k473O2m78J278P81k434r14M51
213f05J153p59j895J573K111k244j730l72O85Q66n58K89q15j894K341K977j169
230d6j017K236K826j740l619K673L827j937k971n14M79M51m87M9m58l63J677j210
248a44k572J877K688m45l059j239K936r6k076K204J396j206q68N27K161J7n25
265A576J763m53k330N05L55n9r95l41n56j649k34K286p13j959J227P51j329j370
$$ plain form
283 -3525 -1966 1002 -1099 -3148 -1362 -625 -1073 -682 673 1726 653 420 1751 1594 2049 3087 2014
300 2014 1187 892 603 983 -354 324 748 -1506 -2064 -1053 -178 -558 -1536 -634 395 -1721 -1620 -38
318 -38 -33 16 112 25 13 277 1699 2301 1076 1712 1857 1005 937 1256 1499 843 -852 -834 -898 -1423 -1275 -1252 -1174
341 -1174 -2183 -2851 -1883 -1365 -1907 -1140 -1171 -1376 -1234 -1377 -172 374 238 399 473 321 1754 1435 1346 2199
361 2199 1737 1200 836 761 1460 729 21 -74 -1001 -541 -461 -903 -319 -620 -1129 -890 -847 -926 -24 293 -136 -315
383 -315 -281 1122 616 1153 2395 1550 1319 1341 1433 1826 1734 1458 952 53 -407 -433 -835 -178 -880 -2023 -1379
404 -1379 -1584 -1970 -1678 -1011 -612 -1670 -1872 -750 -992 -324 97 -576 199 503 14 822 1556 1861 1519
423 1519 624 785 863 790 1074 -248 -933 424 -476 -1694 -1449 -795 -484 -1231 -1859 -1634 -941 -56 -228 -1555
$$ packed form
283c525J559K968k101k049J786P37m48L91J355J053j073k33J331j57M55J038j073
300B014q27k95k89L80j337O78M24k254n58J011Q75l80r78R02J029k116J01J582
318c8NM9R6q7j2K64J422O02j225O36J45q52o8L19K43o56j695J8o4n25J48K3P8
341a174j009o68R68N18n42P67l1k05J42j43J205N46j36J61P4j52J433l19q9Q53
361B199m62n37l64p5O99p31p08r5r27M60Q0m42N84l01n09K39M3p9R02L17m29j79
383c15L4J403n06N37J242q45k31K2R2L93r2k76n06q99m60k6m02O57p02j143O44
404a379k05l86K92O67L99j058k02J122k42O68M21o73P75L04m89Q08P34L05l42
423A519q95J61P8p3K84j322o85J357r00j218K45O54L11p47o28K25O93Q85j72j327
$$ plain form
443 -1555 -782 905 441 -186 -31 804 1795 1413 1125 622 1678 3216 1462 -449 1320 1772 704 18
461 18 -491 -268 -91 -146 -1178 -1533 -100 55 -1178 -1370 -883 -1087 370 277 -1089 -732 643 595 -398 324
481 324 1804 1495 970 1287 155 361 1900 1737 375 -221 -161 -316 -902 -514 -855 -1123 -428 -905 -3135
500 -3135 -1657 -214 -340 -927 -1031 -1052 -1086 -401 471 -379 -239 1109 838 -56 285 726 1768 2059 719
519 719 -331 8 1592 868 -1058 -57 583 350 20 -1404 -1888 616 1551 -636 -1596 -259 1527
536 1527 -226 -1201 644 1080 903 833 107 94 1512 1721 979 578 1315 1575 248 -164 -188 139 487 -244
556 -244 -1434 -1405 -988 -1445 -1585 -859 -174 -1277 -1775 -682 -927 -1054 -89 186 333 -29 -923 -193 723 1535
576 1535 581 184 1834 948 -756 398 1403 86 118 769 -369 -2079 -1193 889 13 -1745 -861
$$ packed form
443a555P73J687m64o27J55Q35R91l82k88n03J056J538j754j911J769M52j068o86
461A8n09K23J77n5j032l55J433J55j233j92M87k04J457r3j366L57J375m8r93P22
481C24J480l09n25L17j132K06J539j63j362n96O0j55n86L88l41k68O95m77k230
500c135J478J443j26n87j04k1l4O85Q72q50J40J348k71q94L41M41J042K91j340
519G19j050L39J584p24j926J001O40k33l30j424m84K504R35k187r60J337J786
536A527j753r75J845M36j77p0p26j3J418K09p42m01P37K60j327m12k4L27L48p31
556b44j190K9M17m57j40P26O85j103m98J093k45j27R65K75J47l62q94P30R16Q12
576A535r54l97J650q86j704J154J005j317L2O51j138j710Q86K082q76j758Q84
$$ plain form
593 -861 -446 -222 -823 -1102 345 1300 394 -667 -59 1017 862 666 1817 661 86 1878 1633 -462
611 -462 197 1977 1635 -415 -1055 -432 -146 -308 -898 -2200 -921 -191 -2139 -2312 -705 -474 -894 -543
629 -543 -21 -713 -877 716 641 -226 802 1362 996 935 430 904 1615 1228 758 568 880 83 -833 300
649 300 380 -1609 -1241 -10 -1129 -2247 -1183 187 -598 -1254 -649 -379 -526 463 120 -290 1240 877
667 877 -3 169 971 1342 1238 1079 650 367 894 881 -383 -193 823 -66 -863 -1093 -1410 -929 -713 -846
687 -846 -1733 -1464 -330 -865 -756 -27 24 -85 614 222 92 198 1287 1348 339 937 1286 775 1067 891
707 891 615 804 752 26 -606 -328 245 -457 -1326 -1047 -832 -821 -936 -1194 -723 -216 -909 -465 -99 187 128
728 128 -57 754 560 -72 431 876 559 700 730 894 737 586 470 538 -93 185 -429 -690 -422 -716 -605
$$ packed form
593h61M15K24o01k79J447R55r06j061O08J076j55j96J151j156n75J792k45k095
611d62O59J780l42k050o40O23K86j62n90j302J279P30j948j73J607K31m20L51
629e43N22o92j64J593p5q67J028N60l66o1n05M74P11l87m70j90L12p97r16J133
649C00Q0j989L68J231j119j118J064J370p85o56O05K70j47R89l43m10J530l63
667H77q80J72Q02L71j04j59m29k83N27j3j264J90J016q89p97k30l17M81K16j33
687h46q87K69J134n35J09P29N1j09O99l92j30J06J089O1j009N98L49n11K92j76
707H91k76J89n2p26o32K78N73p02q69K79K15J1j15k58M71N07o93M44L66K86n9
728A28j85Q11j94o32N03M45l17J41L0J64j57j51j16O8o31K78o14k61K68k94J11
$$ plain form
749 -605 -691 -845 -399 -368 -446 -268 -301 33 212 -409 476 712 423 475 406 530 867 352 484 585 529 548 71
772 71 -59 427 -97 -556 -166 -740 -636 -659 -859 -491 -819 -912 -623 -521 93 18 -91 230 212 207 778 533 550
795 550 682 513 950 567 395 796 355 576 -206 47 145 -397 -214 -67 -507 -670 -530 -492 -204 -337 -485
816 -485 -213 -239 -33 8 201 286 675 450 422 440 128 467 558 343 259 97 240 191 -280 257 -18 -389 -280
839 -280 -998 -816 -527 -741 -577 -868 -837 -428 -625 -396 -8 -246 -40 167 282 235 15 289 575 379 485
860 485 719 352 572 223 -11 107 -107 39 173 -246 -203 -302 -244 -22 -347 -157 -156 -176 -33 -146 -170 286 448
883 448 528 467 504 923 597 421 604 768 672 717 419 521 302 136 302 -170 -193 43 -235 -458 -430 -657 -661
906 -661 -703 -693 -501 -701 -679 -300 -809 -390 -285 -382 204 22 -145 117 375 629 -77 -440 387 323 -423 -196
$$ packed form
749f05q6j54M46L1p8J78l3L34J79o21Q85K36k89N2o9J24L37n15J32J01n6J9m77
772G1j30M86n24m59L90n74J04k3k00L68l28r3K89J02O14p5j09L21j8nN71k45J7
795E50J32j69M37l83j72M01m41K21p82K53R8n42J83J47m40j63J40L8K88j33j48
816d85K72k6K06M1J93Q5L89k25k8J8l12L39R1k15q4j62J43m9m71N37k75l71J09
839b80p18J82K89k14J64k91L1M09j97K29L88k38K06K07J15m7k20K74K86j96J06
860D85K34l67K20l49k34J18k14J46J34m19M3r9N8K22l25J90Jk0J43j13k4M56J62
883D48Q0o1L7M19l26j76J83J64r6M5k98J02k19j66J66m72k3K36k78k23K8k27m
906f61m2J0J92k00K2L79n09M19J05r7N86j82j67K62K58K54p06l63Q27o4p46K27
$$ plain form
928 -196 -13 184 24 -535 -276 -614 -424 -684 -703 -177 -317 -487 -599 -246 -294 180 493 249 326 515 1185
949 1185 927 563 1102 967 1043 806 484 531 641 576 104 263 293 -109 -466 -111 -227 -780 -378 -171 -488
970 -488 -652 -403 -5 -363 -458 261 315 -333 -33 -99 347 920 -260 110 547 221 -81 16 251 -254 -425
991 -425 158 -85 -1149 -450 -491 -955 -692 -401 -587 -1089 -896 -545 -395 -129 209 -230 92 453 -135 327
1011 327 1275 796 412 546 808 276 351 930 637 178 331 101 -626 -211 -56 -448 -485 -170 -585 -1111 -510
1032 -510 -211 -844 -187 124 -570 -182 410 30 265 305 798 423 518 620 265 545 1220 281 -14 370 187
1053 187 -618 -35 375 -266 -725 -351 -405 -1222 -302 -112 -984 -684 -73 -24 -611 -462 34 538 573 291 -53
1074 -53 86 896 929 619 1019 564 51 516 147 133 174 410 24 -690 -48 -2 -950 -524 -374 -669 -545 -565
$$ packed form
928a96J83J97j60n59K59l38J90k60j9N26j40j70j12L53m8M74L13k44P7J89O70
949A185k58l64N39j35P6k37l22M7J10o5m72J59L0m02l57L55j16n53M02K07l17
970d88j64K49L98l58r5P19N4o48L00o6M46N73j180L70M37l26l02R7K35n05j71
991d25N83k43j064O99m1m64K63K91j86n02J93L51J50K66L38m39L22L61n88M62
1011C27R48m79l84J34K62n32P5N79k93m59J53k30p27M15J55l92l7L15m15n26O01
1032e10K99o33O57L11o94L88N92l80K35M0M93l75R5J02l55K80O75r39k95L84j83
1053A87q05N83M10o41m59L74n4q17R20J90q72L00O11M9n87J49M96N04L5k82l44
1074e3J39Q10L3l10M00m55n13M65l69j4M1K36l86p14O42M6r48M26J50k95J24k0
$$ plain form
1096 -565 -721 -826 -485 241 -96 -380 229 85 167 443 835 460 634 327 492 347 396 423 268 417 -64
1117 -64 -289 -190 -87 -573 -234 -290 -624 -993 -722 -357 -787 -750 274 -266 -621 176 14 -72 301 434 733
1138 733 636 12 457 390 698 644 327 315 81 -369 -46 331 -288 -310 39 -331 -450 -416 -98 -548 -592 380
1160 380 -591 -485 136 -9 44 343 607 309 18 460 804 384 576 884 124 361 309 -140 -38 22 -143
1181 -143 -80 -412 -448 -868 -566 -230 -555 -570 -103 -369 -475 -15 -111 63 246 540 440 195 448 499 323 723
1203 723 657 406 335 464 284 68 -35 77 -501 -309 -343 -618 -834 -457 -666 -869 -374 -878 -513 -408 -569
1224 -569 -565 -289 59 130 49 603 769 481 811 662 645 691 782 771 263 185 345 83 316 10 -77 146 4
1247 4 -249 31 -251 -323 -21 -246 41 107 118 355 201 67 629 695 490 731 659 579 595 483 641 535 169
$$ packed form
1096e65j56j05L41P26l37k84O09j44Q2K76L92l75J74l07J65j45M9K7j55J49m81
1117f4k25R9J03m86L39n6l34l69K71L65m30L7J024n40l55P97j62q6L73J33K99
1138G33r7o24M45o7L08n4l17j2k34m50L23L77o19k2L49l70j19L4L18m50m4R72
1160C80r71J06O21j45N3K99K64k98k91M42L44m20J92L08p60K37n2m49J02O0j65
1181a43O3l32l6m20L02L36l25j5M67k66j06M60r6J74J83K94j00k45K53N1j76M00
1203G23o6k51p1J29j80k16j03J12n78J92l4k75k16L77k09k03M95n04L65J05j61
1224e69MK76L48P1q1N54J66k88L30j49j7M6R1j1n08p8J60k62K33l06q7K23j42
1247Dk53K80k82p2L02k25K87O6J1K37j54j34N62O6k05K41p2q0J6j12J58j06l66
$$ plain form
1270 169 307 -225 -304 -419 -394 -166 -597 -678 -562 -854 -903 -797 -860 -517 -774 -547 -296 -419 -337 -44 108 111 -12
1293 -12 393 430 162 384 474 230 272 226 199 172 158 -17 -160 -79 -353 -271 -264 -60 -343 -346 -109 -278 -13 -287 -143
1318 -143 248 65 255 306 437 459 468 688 764 631 569 702 467 287 598 236 345 -40 -308 -151 -315 -589
1340 -589 -499 -555 -332 -466 -494 -369 -419 -690 -417 -343 -225 -30 -88 289 418 66 447 376 193 546 296 354 380
1363 380 -19 262 83 -79 19 -279 -149 -322 -410 -586 -442 -232 -329 -581 40 230 -312 -56 -135 293 99
1384 99 57 387 546 368 -87 468 112 466 449 289 371 313 74 117 -116 -251 -457 -271 -116 26 -462 -492
1406 -492 -286 -79 -187 -512 -99 -136 -1 196 129 217 367 41 299 219 332 311 317 355 360 128 216 200 -50 -278
1430 -278 -231 -158 -476 -373 -77 -184 -690 -400 -205 -299 -1 -118 50 152 -83 124 224 255 314 193 462 460
$$ packed form
1270A69J38n32p9j15K5K28m31q1J16k92m9J06o3L43k57K27K51j23Q2K93J52Lj23
1293a2M05L7k68K22R0k44M2m6k7k7j4j75j43Q1k74Q2PK04k83lK37j69K65k74J44
1318a43L91j83J90N1J31K2RK20P6j33o2J33k35j80L11l62J09l85k68J57j64k74
1340e89R0n6K23j34k8J25n0k71K73P4J18J95n8L77J29l52L81p1j83L53k50N8K6
1363C80l99K81j79j62R8k98J30j73q8j76J44K10r7k52O21J90n42K56p9M28j94
1384I9m2L30J59j78m55N55l56L54j7j60Q2n8k39M3k33j35k06J86J55J42m88l0
1406d92K06K07j08l25M13l7J35J97o7Q8J50l26K58q0J13k1OL8Nk32Q8j6k50k28
1430b78M7P3l18J03K96j07n06K90J95r4K98j17J68J02k35K07J00L1N9j21K69k
$$ plain form
1452 460 303 480 502 365 455 87 226 -137 -363 91 -111 -397 -377 -349 -513 -290 -639 -494 -426 -475 -349 -337
1474 -337 -34 158 -128 230 233 -14 283 427 408 473 434 269 217 112 143 334 -203 -91 -217 -491 -119 -398
1496 -398 -492 -504 -57 -188 -383 -312 -33 -201 28 382 10 185 543 318 400 430 627 605 266 487 222 230 297
1519 297 8 -149 225 -47 -174 -127 -168 -192 -546 -97 -91 -535 -463 100 -288 -61 68 259 248 122 209 35 294
1542 294 445 421 49 412 145 6 245 497 161 -8 71 -278 -362 -253 -31 -397 -233 -167 -526 -430 -85 -372
1564 -372 -230 133 129 -197 42 156 -48 72 614 352 369 474 167 175 593 420 274 -125 162 -226 -598 66
1586 66 18 -486 -284 -383 -726 -540 -302 -264 -296 -331 -307 -314 43 398 -9 80 557 424 383 342 327 340 460 746 260
1611 260 115 269 92 -166 106 96 -517 -337 -295 -661 -415 -374 -243 -678 -504 -247 -266 -366 111 64 -29 160
$$ packed form
1452D60j57J77K2j37R0l68J39l63k26M54k02k86K0K8j64K23l49J45O8m9J26J2
1474c37L03J92k86L58Lk47K97J44j9O5l9j65n2j05L1J91n37J12j26k74L72k79
1496c98r4j2M47j31j95P1K79j68K29L54l72J75L58k25Q2L0J97k2l39K21k65QO7
1519B97k89j57L74k72j27M7m1k4l54M49Om44P2N63l88K27J29J91j1j26Q7j74K59
1542B94J51k4l72L63k67j39K39K52l36j69P9l49q4J09K22l66J64O6l59R6L45k87
1564c72J42L63ml26K39J14k04J20N42k62J7J05l07QM18j73j46l99K87l88l72O64
1586F6m8n04K02r9l43J86K38L8l2l5K4pL57L55m07Q9M77j33m1m1j5J3J20K86m86
1611B60j45J54j77k58K72j0o13J80M2l66K46M1J31m35J74K57j9j00M77m7r3J89
$$ plain form
1633 160 265 273 388 481 663 594 651 447 72 302 338 125 303 80 -191 -294 -299 -277 -574 -268 -287 -554 -399
1656 -399 -339 -548 -283 -70 -208 20 103 298 389 338 570 581 401 542 517 399 445 623 425 436 101 27 -253
1679 -253 -373 -319 -171 -559 -169 -621 -754 -118 -413 -443 -145 -17 -265 -278 9 78 169 292 168 459 154 224
1701 224 355 570 556 642 310 170 141 203 -76 -132 -133 70 -114 -296 -434 -311 -281 -425 -401 -369 -470 -315 71
1724 71 -76 -263 183 285 276 143 579 386 351 439 676 490 301 577 233 175 177 60 -194 117 -190 -267 -378
1747 -378 -124 -440 -395 -89 -310 -284 158 -382 -119 -77 -102 -22 416 70 196 227 243 350 226 215 147 44 69
1770 69 20 -24 -132 -255 25 -85 -227 -68 -389 -180 -333 -253 -370 -441 -205 -483 -41 3 145 208 52 114 -130
1793 -130 210 151 -8 391 128 311 224 130 207 34 -251 -192 81 -128 -464 28 -120 -325 -215 -102 -137 -149
$$ packed form
1633A60J05QJ15R3J82o9N7k04l75K30L6k13J78k23k71j03nK2k97L06j9k67J55
1656c99O0k09K65K13j38K28Q3J95R1n1K32J1j80J41k5j18M6J78j98J1l35p4k80
1679b53j20N4J48l88L90m52j33O36k95l0K98J28k48j3K87O9R1J23j24K91l05P0
1701B24J31K15j4Q6l32j40k9O2k79n6jK03j84j82j38J23L0j44K4L2j01J55L86
1724G1j47j87M46J02rj33M36j93l5Q8K37j86j89K76l44n8Kj17k54L11l07p7j11
1747c78K54l16M5L06k21K6M42n40K63M2k5Q0M38l46J26L1J6J07j24j1o8j03K5
1770F9m9m4j08j23K80j10j42J59l21K09j53Q0j17p1K36k78M42M4J42O3j56O2k44
1793a30L40n9j59L99k63J83q7r4P7j73k85N9K73k09l36M92j48k05J10J13l5j2
$$ plain form
1815 -149 -5 -226 126 99 219 174 146 83 82 402 278 268 319 104 108 282 192 46 -133 72 142 -26 -182 -88
1839 -88 -39 -158 -532 -112 -497 -286 -197 -170 194 -5 -336 26 40 13 381 0 105 23 305 367 321 13 258
1862 258 98 137 112 -50 -46 108 -149 -142 -24 -251 -166 -381 -83 -34 -11 -145 -178 -115 43 19 349 320 4 325
1886 325 283 38 228 147 538 175 -23 184 147 -31 13 41 -42 -289 -262 -75 -110 -15 -294 -224 -158 -141 10 -173
1910 -173 -75 -307 -86 293 290 364 71 24 331 390 212 169 276 316 253 175 -20 97 -164 -43 -162 -204 -189 -336
1934 -336 -319 -344 -324 20 -235 -199 -21 -26 49 52 137 197 -246 281 320 57 347 283 61 -79 167 124 57 40 12 104
1960 104 -169 -85 -146 -187 -330 -289 -168 -196 -98 -115 -262 -135 13 -118 -41 -96 -159 78 379 217 379 292 51 242
1984 242 161 252 229 30 -65 100 -235 280 -184 -90 -175 66 -233 -206 -130 -67 -149 -116 -87 -161 -13 53 -152 -61 -158
$$ packed form
1815a49J44k21L52k7J20m5k8o3jL20j24j0N1k15MJ74r0j46j79K05P0j68j56R4
1839h8M9j19l74M20l85K11Q9K7L64j99l31L62J4k7L68l81J05q2K82O2m6l08K45
1862B58j60L9k5j62MJ54k57PJ18k27Q5k15K98M9K3j34l3O3J58k4L30k9l16L21
1886C25m2k45J90q1L91l63j98K07l7j78M4K8q3k47K7J87l5R5k79P0O6J7J51j83
1910a73R8k32K21L79lP4k93m7L07N9j78m3J07M0o3p8j95J17k61J21j19m2J5j47
1934c36J7k5K0L44k55L6J78nP5LQ5O0m43N27L9k63K90o4k22j40K46m3o7j7k8R2
1960A04k73Q4o1m1j43M1J21k8R8j7j47J27J48j31P7n5o3K37L01j62J62q7k41J91
1984B42q1R1k3j99r5J65l35N15m64R4q5K41k99K7P6O3q2L3K9p4J48O6k05R1r7
$$ plain form
2009 -158 65 111 -60 362 218 417 294 34 -142 172 183 4 -269 -136 18 -253 -123 -70 -413 -131 123
2030 123 -332 -119 -213 15 18 1 43 60 266 344 152 48 264 266 218 223 136 5 -186 138 -55 52 139 105 -137
2055 -137 -87 -28 -396 -98 -318 -353 -224 -208 -362 -205 -123 7 -190 106 106 -85 68 2 427 53 200 29 96
2078 96 20 102 27 -144 -25 -128 53 -121 -94 -258 -39 -51 -211 -184 -166 -206 7 -120 218 -176 -161 -170 -210 -144 66
2103 66 389 244 179 76 178 94 325 109 177 -80 107 41 -99 171 -84 17 -18 0 -221 -189 50 -440 -209
2126 -209 -34 -154 -291 -105 -78 16 0 173 -283 135 61 -131 3 218 372 -84 320 130 -209 33 81 -121
2148 -121 -405 -179 -118 -469 -416 -41 -407 -35 -174 -75 -391 -20 250 -80 15 139 262 -70 127 124 83 520
2170 520 196 49 125 353 -13 6 236 3 -190 3 18 -180 20 -210 -197 -135 -314 -18 69 -72 219 -7
$$ packed form
2009a58K23M6j71M22j44J99j23k60j76L14J1j79k73J33J54k71J30N3l43K82K54
2030A23m55K13r4K28Lj7M2J7K06P8j92j04K16Km8Nq7j31j91L24j93J07Q7l4k42
2055a37N0N9l68K98k20l5J29J6j54J57Q2J30j97K96%j91J53o6M25l74J47j71O7
2078I6p6Q2p5j71J19j03J81j74K7j64K19j2j60K7J8m0K13j27L38l94J5rm0O6K10
2103F6L23j45o5j03J02q4K31k16O8k57J87o6j40K70k55J01l5J8k21L2K39m90K31
2126b09J75j20j37J86K7R4j6J73m56M18p4j92J34K15J54m56M04j90l39K42M8k02
2148a21k84K26O1l51N3L75l66L72j39R9l16L71K70l30R5J24J23l32J97lm1M37
2170E20l24j47P6K28l66J9K30k33j93J93J5j98K00k30J3O2j79K96Q7j41K91k26
$$ plain form
2192 -7 61 168 277 61 66 1 179 -53 184 48 117 172 139 36 20 11 -266 -52 -225 -497 -68 -333 -55 8
2216 8 -157 -139 -345 -239 -237 -153 -197 -257 -174 -106 213 130 62 253 177 127 86 262 163 84 146 63 82 -42 -140 -264 -130
2243 -130 -100 -130 -207 -24 -92 -161 -279 -194 -37 5 -374 -104 184 -150 37 8 367 262 65 -180 407 195 88
2266 88 177 172 246 -120 152 45 -100 -207 -61 -142 -251 -167 -339 -37 -193 -17 -265 47 -188 -197 -18 206 134
2289 134 107 46 94 304 122 484 -52 274 71 275 140 66 45 39 131 -7 -171 -84 -136 -119 57 -211 -31 -327
2313 -327 -237 -257 60 -36 -53 -45 -185 -3 -141 143 150 262 249 246 83 355 -63 -98 255 -25 12 151 -63 -8 -92
2338 -92 -102 -84 341 -159 -274 -189 -128 -208 -209 403 -106 -58 57 -47 76 -28 56 -8 194 151 90 149 182 26 -96
2363 -96 109 -147 1 -182 -127 103 17 30 -6 101 -56 -171 -241 144 64 -140 91 -31 90 8 -22 181 156
$$ packed form
2192gO8J07J09k16No5J78k32K37j36O9N5l3j03j6rk77K14j73k72M29k65K78O3
2216Hj65J8k06J06KQ4m4o0Q3O8L19q3o8J91p6n0m1J76r9p9O2q3J9j24r8j24J34
2243a30L0l0p7J83o8o9j18Q5J57M2l79K70K88l34J87k9L59j05j97k45N87k12j07
2266H8Q9nP4l66K72j07j45j07J46q1j09Q4j72L02j56J76k48L12k35rJ79K24p2
2289A34k7o1M8K10j82L62n36L26k03K04j35p4k1oR2j38j64Q7n2J7J76k68J80k96
2313c27R0k0L17r6j7Qj40J82j38K84PJ12j3lj63K72m18l5L53k80L7J39k14N5q4
2338i2j0J8M25n00j15Q5O1q0jO12n09M8J15j04J23j04Q4o4K02m3o1N9L3j56j22
2363i6K05k56J48j83N5K30q6J3l6J07j57j15p0L85q0k04K31j22J21q2l0K03k5
$$ plain form
2386 156 -224 105 194 110 258 231 -13 23 156 4 -185 -21 110 68 -44 -228 26 -223 73 -424 -102 -356
2408 -356 -5 -51 -44 34 -64 -99 -142 213 51 33 269 59 21 94 -251 206 81 -24 -23 118 138 -103 73 11 146
2433 146 39 -335 -270 -177 -191 -87 -156 -24 -57 16 -65 298 -43 47 -16 77 370 253 192 147 31 -9 100 -80
2457 -80 -304 210 -2 -185 -25 -3 74 60 -201 -224 -223 96 -41 -138 96 -82 65 -108 32 83 -204 -102 267
2480 267 89 90 27 -38 -14 297 -25 113 -125 -177 184 177 75 -88 -191 119 54 -287 -263 -136 -349 -13 -174
2503 -174 270 -100 105 32 209 150 302 8 34 195 -16 98 245 302 47 327 17 -277 75 108 60 -177
2525 -177 -66 -70 -337 -188 36 -186 -380 7 -99 109 -36 -173 187 49 49 210 214 86 100 174 205 115 73 -23
2549 -23 299 -220 23 129 73 -42 43 167 -414 24 74 -215 -76 61 -309 -99 36 94 119 371 -239 -1
$$ packed form
2386A56l80L29Q9q4J48k7k44L6J33j52j89J64J31m2j12j84K54k49K96m97L22k54
2408c56L51m6PP8r8l5m3L55j62j8K36k10l8P3l45M57j25j05JJ41K0k41J76o2J35
2433A46j07l74O5R3j4J04o9J32l3P3q1L63l41R0o3R3K93j17o1m5j16m0J09j80
2457h0k24N14k12j83J60K2P7j4k61k3JL19j37r7K34j78J47j73J40N1k87J02L69
2480B67j78Jo3o5K4L11l22J38k38n2L61pj02j63j03L10o5l41K4J27k13L36j61
2503a74M44l70K05p3J77n9J52k94K6J61k11J14J47N7k55K80l10k94L52L3m8k37
2525a77J11mk67J49K24k22j94L87j06K08j45j37L60j38%J61Mj28J4P4L1r0m2r6
2549b3L22n19K43J06n6j15Q5J24n81M38N0k89J39J37l70K10J35N8K5K52o10K38
$$ plain form
2571 -1 108 -21 -28 -106 -19 168 136 -99 136 -71 156 185 28 -198 -153 136 -140 -137 191 -61 -136 -290 -186 -206
2595 -206 157 59 -39 -37 94 -145 33 -41 316 -3 48 199 63 -45 304 283 61 117 -31 20 -166 44 -281
2618 -281 59 145 -185 -257 -78 -232 -226 23 -62 -177 -28 -164 121 110 247 -68 134 -316 124 19 -48 19 28
2641 28 385 203 151 96 -95 34 242 14 -73 3 -121 -211 79 -347 -3 -257 -90 -115 -242 155 -70 -83 122
2664 122 -66 -237 -48 216 144 -14 -32 -92 42 85 203 -60 -107 80 -134 202 28 -102 45 -197 145 -183
2686 -183 0 -96 -112 -138 13 -118 208 29 -4 27 138 142 122 38 115 190 18 -171 42 61 44 208 -24 20 14
2711 14 -12 -63 -15 72 111 -302 -226 -330 60 63 -81 -45 -139 -163 54 -43 -27 194 76 -145 149 38 130 174 13
2736 13 218 -12 114 55 164 120 7 35 68 -88 0 -279 -57 -393 -192 -125 -9 -121 -118 46 -88 145 -12
$$ packed form
2571aJ09j29pp8Q7J87l2k35K35k07K27K9j57k26M5K89k76LL28k52p5j54J04k0
2595b06L63r8r8KJ31k39J78p4L57l19N1J51j36j08L49k1k22N6j48N1j86K10l25
2618b81L40Q6l30p2J79j54OK49q5j15J49j36K85j1J37l15K02m50M40j05o7O7R
2641B8L57j82n2n5j91J29K08k28q7P6j24r0K90m26L44k54J67k5j27L97k25j3K05
2664A22j88j71J89K64p2j58j8o0J34M3J18k63m7J87k14L36j74j30J47k42L42l28
2686a83J83r6j6k6J51j31L26j79l3L1J11Mk0q4P7P5j72j89K13J9j7J64k32M4o
2711A4k6n1M8Q7L9m13P6j04L90Lj44L6r4k4K17r7J6K21j18k21K94j11R2M4j61
2736A3K05k30J26n9J09m4j13K8L3j56Q8k79K22l36K01O7J16j12LJ64j34K33j57
$$ plain form
2759 -12 215 113 138 200 247 13 205 -79 197 136 96 9 299 -36 22 -65 -171 -183 40 -79 -138 -24 -70 -110
2783 -110 123 314 42 -100 -254 -15 -72 -46 153 84 2 143 111 264 171 -122 -113 -7 101 -136 -38 -189 -27
2806 -27 59 134 -96 -319 21 -136 -20 54 83 32 -159 45 41 149 -197 -16 126 162 295 -1 27 22 166 253
2830 253 74 159 263 0 -195 -132 -77 1 291 147 142 -14 -175 -110 -258 -84 -230 82 -52 -38 35 -97 127
2853 127 -6 86 0 90 11 -62 168 -16 -98 30 35 65 -19 70 -141 35 -277 -193 -127 -191 -25 110 -259 195 -39
2878 -39 10 -140 -95 119 69 21 131 205 216 206 34 54 203 36 -131 99 -112 185 -146 168 -137 -3 12
2901 12 -18 -75 -158 -1 -142 -145 -140 -16 -182 -26 -167 81 -67 63 -116 104 79 75 150 162 -110 191 15 124
2925 124 110 105 14 -173 271 -127 -58 -73 -150 -65 -121 0 -110 -15 -74 -17 -84 -123 -225 58 42 -103 50 156 37
$$ packed form
2759a2K27j02K5O2M7k34J92k84K76o1m0q7K90l35N8q7j06j2K23j19n9J14m6m0
2783a10K33J91k72j42j54K39n7K6J99o9q2J41l2J53r3k93RJ06J08k37R8j51J62
2806b7Q6P5k30k23L40j57J16P4K9n1j91K04mJ08l46J81J42L6J33k96K8nJ44Q7
2830B53j79Q5J04k63j95O3N5P8K90j44nj56j61O5j48J74j46L12j34J4P3j32K24
2853A27j33R2q6R0p9p3K30j84q2J28NL0q4Q9k11J76l12Q4O6o4J66J35l69M54k34
2878c9M9j50M5K14n0m8J10P4J1j0j72K0J49j67j67K30k11K97l31L14l05J34J5
2901A2l0n7q3J57j41lNJ24j66J56j41K48j48J30j79K20k5mP5J2k72L01j76J09
2925A24j4nr1j87M44l98O9j5p7Q5n6J21j10R5n9N7o7l9j02K83j6j45J53J06j19
$$ plain form
2950 37 -61 84 149 208 153 -40 -60 374 123 -136 -75 -137 -67 -73 -99 4 -211 -219 67 -27 -124 28 -191 -27 191
2975 191 -15 107 -127 87 -15 291 250 -116 157 180 115 225 8 103 -263 -230 -34 104 -226 -178 -106 75
2997 75 -381 48 -28 -369 -509 -11 -93 -25 -24 75 50 -193 123 38 45 194 232 105 -24 -124 75 3 133 81 30
3022 30 -168 139 -56 24 -81 -87 -224 -29 -273 -157 -69 79 -226 152 -342 160 53 52 -161 -97 147 139 -4
3045 -4 76 193 7 127 85 -247 -15 -158 8 -87 93 -6 -143 -400 209 -338 28 199 69 -46 -382 -50
3067 -50 -369 -120 25 -10 497 130 126 -51 287 31 307 438 144 17 503 604 295 17 149 133 -260 -103
3089 -103 86 72 541 343 6 86 -22 58 52 -5 -263 5 123 -76 384 32 118 404 -56 56 72 64 -14 95
3113 95 -37 202 114 -86 -173 -86 60 -303 -82 -205 162 179 -282 -2 22 214 51 142 -99 -331 354 -566
$$ packed form
2950C7r8J45O5N9n5j93k0M34k51k59O1o2P0ok6J03k15qK86r4r7J52k19J64K18
2975A91k06J22k34K14j02L06m1l66K73K3o5J10k17R5l66L3J96J38l30M8P2J81
2997G5m56M29p6l41j40M98q2O8JR9k5k43L16q5PJ49L8j27j29j00J99p2J30n2n1
3022C0j98L07j95Q0j05oj37J95k44J16Q8J48l05L78m94N02j07jk13O4K44qj43
3045dQ0J17j86J20m2l32K32j43J66r5J80r9j37k57O09n47L66J71j30j15l36L32
3067e0l19K49J45l5N07l67mj77L38k56K76J31k94j27M86J01l09k78J32j6l93J57
3089a03J89j4M69j98l37Q0j08Q0on7k58K68J18j99M60l52Q6K86m60J12J6qp8J09
3113I5j32K39q8k00q7Q7J46l63K21j23L67J7m61K80K4J92j63R1k41k32O85r20
$$ plain form
3135 -566 -248 282 -196 -508 -171 493 173 634 -598 -70 973 -285 306 -32 129 164 -222 -94 74
3154 74 -83 168 67 673 811 -379 -35 -144 15 333 392 500 -96 195 -105 -24 -133 197 -189 94 110
3175 110 -15 -183 220 59 -203 -160 56 1 72 -150 -184 -166 195 83 32 -133 -56 -44 -21 148 -1 93 80 82
3199 82 -27 175 -103 -43 4 28 201 -27 -135 -153 -103 -107 2 -60 70 -143 -315 -230 -197 -18 12 72 -129 -384
3223 -384 -8 -364 117 -157 -410 629 -180 87 670 42 7 479 -17 283 -7 -157 -273 320 -13 -193
3243 -193 -483 -401 -216 -59 207 32 -127 21 -41 279 -120 -15 -197 60 152 165 6 -75 66 -1 -50 159
3265 159 240 5 72 44 -117 128 -77 29 143 -31 38 56 65 -269 -221 -60 -98 -104 40 62 165 74 27 -159 -199
3290 -199 52 59 458 55 94 -54 -99 111 252 100 -24 71 114 56 39 -67 -137 83 3 92 -38 6 -292 -85
$$ packed form
3135e66L18N30m78l12L37O64l20M61j232N28J043j258N91l38J61L5l86J28J68
3154G4j57K51j01O06J38j190L44j09J59L18N9J08n96K91l00Q1j09L30l86K83J6
3175A10j25j68M03j61k62M3K16n5P1k22l4J8L61j12n1j65P7J2K3J69j49R4j3K
3199H2j09K02k78O0M7K4J73k28j08j8N0mJ09o2J30k13j72Q5L3J79L0O0k01k55
3223c84L76l56M81k74k53J039q09K67N83o28l5M72m96L00k90j50j16N93l33j80
3243a93k90Q2J85J57K66j75j59J48o2L20l99J05j82K57R2J3j59q1J41o7m9K09
3265A59Q1k35O7k8j61K45k05J06J14j74O9J8Rl34M8J61l8oJ44K2J03r1m7j86m0
3290a99K51PL99m03L9j48m5K10J41j52j24R5M3n8j7j06p0K20q0Q9j30M4k98K07
$$ plain form
3314 -85 242 93 129 -136 -64 150 177 103 113 -6 -28 365 74 207 -69 130 41 -82 162 -122 -31 55 230
3337 230 39 -178 13 -17 -9 -437 -141 -22 -272 -224 -209 -79 84 276 81 -228 250 -88 58 62 339 291 271
3360 271 -122 97 98 -48 -71 -42 -146 -177 8 323 86 161 24 403 -641 -443 156 86 155 -209 -299 -244 -82
3383 -82 -340 -558 123 49 210 193 -52 225 -48 22 -172 57 -67 -55 82 -281 -162 129 -41 161 -13 -164
3405 -164 -60 37 94 -186 -142 148 10 -29 94 43 -208 275 231 7 65 -21 -72 -29 23 286 12 -41 3 -111
3429 -111 20 -230 -13 -99 -41 -74 84 -223 -65 -200 -109 48 34 48 -168 -183 169 27 -71 -60 115 117 422 8
3453 8 115 -181 179 -14 103 -72 19 -154 60 132 -181 108 45 -165 200 -68 -16 -242 -157 -155 76 237 82
3476 82 -95 39 82 99 1 -77 82 -92 24 39 98 180 94 -144 -62 109 -82 -151 -51 -83 -107 16 229 -151
$$ packed form
3314h5L27j49L6k65P2K14K7p4J0j19k2L93k91J33k76J99q9j23K44k84R1Q6J75
3337B30j91k17J91l0Qm28K96J19k50M8J5J30J63J92j95l09M78l38J46MK77m8k0
3360B71l93K19Jj46k3K9j04l1J85L15k37P5j37L79j044J98N99p0O9l64r0N5J62
3383h2k58k18O81p4J61j7k45K77k73P0j94K29j24J2J37l63J19K91j70K02j74j51
3405a64J04R7N7k80M4K90j38l9J23n1k51M83m4k24N8q6n1M3N2K63k74n3M4j14
3429a11J31k50K17q6N8l3J58l07J58j35R1J57j4J4k16j5L52j42r8J1J75KL05m14
3453HJ07k96L60j93J17j75R1j73K14P2l13K89o3k10L65k68N2k26Q5KK31J61j55
3476H2j77J34M3J7r8p8J59j74J16J5N9Q2q6k38Q2J71j91o9J00l2k4J23K13l80
$$ plain form
3500 -151 -87 47 60 94 -131 110 -100 186 176 111 -55 487 -32 14 494 103 -520 258 62 353 43 4
3522 4 42 286 -50 -166 294 -427 41 3 -511 -634 720 -328 -147 342 87 -314 91 403 -138 -524 -621
3543 -621 149 -214 -128 -260 52 -271 -56 41 -410 -37 -241 -92 -59 -204 36 -209 93 50 202 32 108 21
3565 21 103 -157 -78 57 507 -48 306 -229 -150 -16 157 183 339 330 258 -42 -83 40 -52 -163 -244 131 139 -87
3589 -87 83 23 -170 -1 -45 124 5 -263 84 -231 -75 -17 95 105 174 135 -44 -218 58 46 -18 474 -108
3612 -108 40 -86 165 -39 28 -107 -114 -54 3 -75 99 253 -283 -131 37 65 -60 56 1 56 90 116 150 -193
3636 -193 -115 52 41 -41 50 -31 -102 145 116 115 -87 -219 -41 97 217 64 -108 -187 -45 -70 -49 -69 -6 -49 -63
3661 -63 -104 50 -15 138 102 34 161 -253 218 -171 131 71 41 44 -83 -185 33 159 -10 177 -420 -317 54
$$ packed form
3500a51O4J34J3L4k25K41k10K86j0o5j66N42n19M6M80l91o23P78j96K91l10l9
3522DL8K44l36j16M60p21M68l8n14j23J354j048J81M89k55m01M05L12n41l86r7
3543f21P70l63Q6j32L12l23K15R7m51L73k04J49L3j45K40k45L02m3J52j70P6q7
3565B1Q2k60P9J35M50n55L54n35P9J34J73K6J56rp2l00m1J23r2j11q1L75Qk26
3589h7J70o0j93J69m4J69j19k68L47l15J56N8J12J0O9l9j79j74K76j2o4M92n82
3612a08J48j26K51k04O7j35pO0N7p8J74J54n36J52J68K8j25J16n5N5L4K6L4l43
3636a93P8J67j1q2R1q1p1K47k9jk02j32J78J38J20j53j72p9J42k5K1k0O3m3j4
3661f3m1J54o5J53l6o8J27m14M71l89L02o0l0Lj27j02K18J26j69J87n97J03L71
$$ plain form
3684 54 -285 -88 131 -155 -77 9 -94 12 124 -110 -208 78 -148 72 101 -7 25 80 -140 49 -9 37 21
3707 21 -44 178 137 -118 -162 302 169 4 -263 106 -56 -66 -282 -181 32 -60 148 94 -35 9 -12 155 -76
3730 -76 109 115 -87 183 67 18 52 188 126 -44 210 151 91 -60 -80 18 16 -178 -265 -66 13 24 -74 -116 -35 96
3756 96 45 161 99 -205 -92 174 131 89 -111 219 -29 211 -140 113 -120 -205 -62 -269 -36 204 -156 0
3778 0 -160 -19 49 -51 129 -46 101 51 -167 -203 264 -55 -31 44 -51 -98 -50 -22 170 -128 80 164 -203 -234
3802 -234 31 -60 -80 196 -39 -239 -232 1 41 -63 -60 54 -76 170 -118 -350 -124 -9 -225 -102 150 -31
3824 -31 67 186 207 109 108 -68 -50 -203 -19 -242 -68 -112 -357 -205 13 57 -188 154 -46 -8 46 -5 -225 78
3848 78 4 -207 63 116 -23 -88 -71 0 241 -224 158 98 -77 56 210 -30 78 241 -95 -48 -48 -268 -163
$$ packed form
3684E4l39J97K19k86P8Q6j03J06J12k34r8K86k26K20K9j08L2N5k20J89n8M6j6
3707B1o5K22m1k55m4M64j33j65k67L69j62j0k16J01K13r2K08n4j29M4k1J67k31
3730g6J85Ok02K70j16m9L4J36o2j70K54n9o0j51k0R8kj94q7J99P9J1r8m2Q1J31
3756I6n1J16o2l04J13K66m3m2k00L30k48K40l51K53k33q5J43k07K33K40l60J56
3778@j60J41O8j00J80j75J47n0k18l6M67l19K4P5r5m7M8K8J92k98K08Q4l67l1
3802b34K65r1k0K76k35k00PK33M0j04LJ14j30K46k88k32K26J15k16J23K52j81
3824c1R8J19K1r8jj76J8j53J84k23J74m4k45J52K18M4k45L42k00L8N4n1k20L03
3848G8p4k11K70N3j39o5J7P1K41m65L82o0j75J33J54k40J08J63l36M7%k20J05
$$ plain form
3871 -163 50 14 18 -113 -161 -224 -27 117 36 -101 203 16 -152 54 -22 -67 3 32 389 -11 49 178 -106 153
3895 153 89 140 48 -80 12 50 -4 -8 -290 -153 -142 -36 -19 163 -241 -32 225 -13 39 143 227 -31 -6 97
3919 97 -128 5 -14 17 162 -94 116 84 -35 -294 50 3 30 -148 -199 -209 -56 -58 -221 75 31 -127 28 -6
3943 -6 37 -38 195 141 -63 161 125 110 42 54 93 244 66 234 -88 142 -95 -7 -72 -92 51 203 389 3
3967 3 -227 167 74 -119 -268 64 114 31 92 65 66 -211 -116 -126 -94 31 109 -8 119 35 -110 84 121 129 79 -17
3993 -17 -96 28 -45 -155 -55 1 -238 -45 -80 215 -40 -160 -64 -316 162 -46 159 -64 36 49 2 0 30 140
4017 140 -62 -43 87 -34 4 -10 -148 54 -150 192 80 -113 -125 -33 -2 13 19 -28 145 -162 -43 9 7 132
4041 132 -42 -77 159 17 81 23 19 64 202 137 111 -199 -24 -399 -133 31 -44 -192 38 -107 -56 -49 -187 -249
$$ packed form
3871a63K13l6Mj31m8o3J97J44q1j37L04j87j68K06p6m5P0K9L57m00O0J29k84K59
3895A53o4N1r2j28R2L8n4mk82J37J1J06J7J82m04K09K57k38N2J04Q4k58K5J03
3919I7k25J33j9L1J45k56K10l2j19k59L44m7K7j78n1j0J53kj63K96m4j58J55l4
3943fM3p5K33n4k04K24l6j5o8J2L9J51j78J68l22K30k37Q8o5k0J43J52J86l86
3967Ck30L94r3j93j49L32N0q3O1k7Jk77R5j0L2J25P8j17J27q4j45J94L7Qn0r6
3993a7p9J24p3j10J00N6k39J93l5K95k55j20R6k52M78k08K05k23J00J3m7kL0J10
4017A40k02J9J30j21L8j4j38K02k04L42j12j93j2R2L1J5Om7J73l07J19N2kJ25
4041A32j74l5K36j42O4n8mM5J38o5k6l10J75l75K66J64p5j48K30j45N1Pj38o2
$$ plain form
4065 -249 -289 -129 20 -121 221 97 -272 289 199 189 -188 22 272 99 -14 49 -61 48 13 1 -57 -49 -217
4088 -217 -93 57 -51 28 -255 -38 128 54 13 103 -201 133 -25 66 138 61 -248 -246 -43 138 236 401 56
4111 56 227 218 50 55 -84 22 232 -201 -94 183 -156 -203 28 -116 -62 119 21 23 -65 26 -27 182 110 -15 19
4136 19 -204 -240 202 -59 -8 112 7 6 290 -64 80 -31 -50 -118 -138 306 64 75 125 -48 -71 -100 -302 106
4160 106 -126 -220 176 -2 15 -68 -131 -22 -27 -106 152 10 64 -33 93 31 -29 19 -99 47 35 -152 122 -25
4184 -25 54 50 -49 -327 -275 -2 103 63 -239 -102 -122 -126 -13 138 -4 137 -81 209 32 -29 -80 62 171 -5
4208 -5 37 -82 191 193 -438 -51 -69 228 -183 18 38 -117 134 151 -230 18 92 146 -127 -33 -189 -174 271 104
4232 104 123 239 261 -21 7 163 76 -45 -90 68 -72 30 72 -47 -11 130 -130 -186 -140 -161 -88 -93 -18 -54 207
$$ packed form
4065b49m0J60J49j41L42j24l69N61r0j0l77K10K50j73j13O3j10J09l5j2n8Qj68
4088b17J24J50j08P9k83K17J66p4m1R0l04L34j58R1P2p7l09KK03J81R8J65l45
4111E6J71rj68Nj39J06K10m33J07K77l39m7K31j44N4J81r8Kq8R1n3K09p2j25L4
4136A9k23l6M42k61N1J20j05jK84l54J44j11j9o8k0M44k42J1N0j73k3k9k02M08
4160A06k32r4L96j78J7q3o3J09np9K58j42N4r7J26o2o0M8j18J46j2j87K74j47
4184b5P9mr9k78N2K73J05m0l02J37k0mJ13J51j42J41k18K90j77o1n1J42J09j76
4208eM2j19K73Ko31L87j8K97m11K01K0j55K51J7l81K48P4N4k73R4j56J5M45j67
4232A04J9J16K2k82K8J56q7j21m5J58j40J02M2j19L6J41k60n6M6k1P3nP5l6K61
$$ [...]
8191c2
##END NTUPLES=NMR FID
##END=
