##TITLE=1H_Pr Eth
 CDCl3
 8 sc, 
 13.05.2022
##JCAMPDX= 6.0         $$ Bruker NMR JCAMP-DX V2.0
##DATA TYPE= NMR FID
##DATA CLASS= NTUPLES
##ORIGIN= UXNMR, Bruker Analytische Messtechnik GmbH
##OWNER= root
$$ XWIN-NMR		Version 3.5
$$ Fri May 13 13:40:29 2022 Russian Standard Time (UT+4h)  she@DPX200
##.OBSERVE FREQUENCY= 200.1313499996
##.OBSERVE NUCLEUS= ^1H
##.DELAY= (6, 6)
##.ACQUISITION MODE= SIMULTANEOUS
##.ACQUISITION SCHEME= undefined
##.AVERAGES= 8
##.DIGITISER RES= 18
##SPECTROMETER/DATA SYSTEM= spect
##.PULSE SEQUENCE= zg30
##.SOLVENT NAME= CDCl3
##.SHIFT REFERENCE= (INTERNAL, CDCl3, 0, 15.7039)
##AUDIT TRAIL= $$ (NUMBER, WHEN, WHO, WHERE, WHAT)
$$ ##TITLE= Audit trail, XWIN-NMR		Version 3.5
$$ ##JCAMPDX= 5.01
$$ ##ORIGIN= Bruker BioSpin GmbH
$$ ##OWNER= she
$$ F:/spectra/data/she/nmr/H-F/1/audita.txt
$$ ##AUDIT TRAIL=  $$ (NUMBER, WHEN, WHO, WHERE, WHAT)
(   1,<2022-05-13 11:42:34.51 +0400>,<she>,<DPX200>,
      <created by zg, POWCHK disabled, PULCHK disabled
       configuration hash MD5:
       00 E9 B6 7A A2 85 ED C7 34 08 36 98 17 FE 4E 26
       data hash MD5: 16K
       C0 89 19 76 F1 C8 8C 1F C2 48 5D 08 4D 6D F3 C2>)
$$ ##END=
$$ 
$$ hash MD5
$$ 42 37 75 C0 06 FE 13 A8 70 8B 72 BE B9 6B DB F0
##$RELAX= 
##$RELAX= 
##$RELAX= 
##$RELAX= 
##$RELAX= 
##$RELAX= 
$$ Bruker specific parameters
$$ --------------------------
##$DU= <F:/spectra>
##$EXPNO= 1
##$NAME= <H-F>
##$PROCNO= 1
##$TYPE= <nmr>
##$USER= <she>
##$AMP= (0..31)
100 100 100 100 100 100 100 100 100 100 100 100 100 100 100 100 100 100 
100 100 100 100 100 100 100 100 100 100 100 100 100 100 
##$AQSEQ= 0
##$AQ_mod= 1
##$AUNM= <au_zg>
##$AUTOPOS= <>
##$BF1= 200.13
##$BF2= 200.13
##$BF3= 200.13
##$BF4= 200.13
##$BF5= 200.13
##$BF6= 200.13
##$BF7= 200.13
##$BF8= 200.13
##$BYTORDA= 1
##$CFDGTYP= 0
##$CFRGTYP= 5
##$CHEMSTR= <none>
##$CNST= (0..31)
1 1 145 1 1 1 1 1 1 1 1 1 1 1 1 1 1 1 1 1 1 1 1 1 1 1 1 1 1 1 1 1 
##$CPDPRG= <>
##$CPDPRG1= <>
##$CPDPRG2= <>
##$CPDPRG3= <>
##$CPDPRG4= <mlev>
##$CPDPRG5= <mlev>
##$CPDPRG6= <mlev>
##$CPDPRG7= <mlev>
##$CPDPRG8= <mlev>
##$CPDPRGB= <>
##$CPDPRGT= <>
##$D= (0..31)
0 1.2 0 0 0 0 0 0 0 0.06 0 0.03 0 0 0 0 0.0002 0 0 0 0 0 0 0 0 0 0 0 0 
0 0 0 
##$DATE= 1652427753
##$DBL= (0..7)
120 120 120 120 120 120 120 120 
##$DBP= (0..7)
150 150 150 150 150 150 150 150 
##$DBP07= 0
##$DBPNAM0= <>
##$DBPNAM1= <>
##$DBPNAM2= <>
##$DBPNAM3= <>
##$DBPNAM4= <>
##$DBPNAM5= <>
##$DBPNAM6= <>
##$DBPNAM7= <>
##$DBPOAL= (0..7)
0.5 0.5 0.5 0.5 0.5 0.5 0.5 0.5 
##$DBPOFFS= (0..7)
0 0 0 0 0 0 0 0 
##$DE= 6
##$DECBNUC= <off>
##$DECIM= 32
##$DECNUC= <off>
##$DECSTAT= 4
##$DIGMOD= 1
##$DIGTYP= 9
##$DL= (0..7)
0 120 120 120 120 120 120 120 
##$DP= (0..7)
150 150 150 150 150 150 150 150 
##$DP07= 0
##$DPNAME0= <>
##$DPNAME1= <>
##$DPNAME2= <>
##$DPNAME3= <>
##$DPNAME4= <>
##$DPNAME5= <>
##$DPNAME6= <>
##$DPNAME7= <>
##$DPOAL= (0..7)
0.5 0.5 0.5 0.5 0.5 0.5 0.5 0.5 
##$DPOFFS= (0..7)
0 0 0 0 0 0 0 0 
##$DQDMODE= 0
##$DR= 18
##$DS= 0
##$DSLIST= <SSSSSSSSSSSSSSS>
$$ [...]
##$SUBNAM2= <"">
##$SUBNAM3= <"">
##$SUBNAM4= <"">
##$SUBNAM5= <"">
##$SUBNAM6= <"">
##$SUBNAM7= <"">
##$SUBNAM8= <"">
##$SUBNAM9= <"">
##$SW= 18.0517283424761
##$SWIBOX= (0..15)
0 0 2 0 0 0 0 0 0 0 0 0 0 0 0 0 
##$SW_h= 3612.71676300578
##$TD= 16384
##$TD0= 1
##$TE= 0
##$TE2= 300
##$TE3= 300
##$TEG= 300
##$TL= (0..7)
0 120 120 120 120 120 120 120 
##$TP= (0..7)
150 150 150 150 150 150 150 150 
##$TP07= 0
##$TPNAME0= <>
##$TPNAME1= <>
##$TPNAME2= <>
##$TPNAME3= <>
##$TPNAME4= <>
##$TPNAME5= <>
##$TPNAME6= <>
##$TPNAME7= <>
##$TPOAL= (0..7)
0.5 0.5 0.5 0.5 0.5 0.5 0.5 0.5 
##$TPOFFS= (0..7)
0 0 0 0 0 0 0 0 
##$TUNHIN= 0
##$TUNHOUT= 0
##$TUNXOUT= 0
##$USERA1= <user>
##$USERA2= <user>
##$USERA3= <user>
##$USERA4= <user>
##$USERA5= <user>
##$V9= 5
##$VALIST= <valist>
##$VCLIST= <CCCCCCCCCCCCCCC>
##$VD= 0
##$VDLIST= <DDDDDDDDDDDDDDD>
##$VPLIST= <PPPPPPPPPPPPPPP>
##$VTLIST= <TTTTTTTTTTTTTTT>
##$WBST= 1024
##$WBSW= 4
##$XGAIN= (0..3)
0 0 0 0 
##$XL= 0
##$YL= 0
##$YMAX_a= 134470
##$YMIN_a= -107427
##$ZGOPTNS= <>
##$ZL1= 120
##$ZL2= 120
##$ZL3= 120
##$ZL4= 120
##$ABSF1= 10
##$ABSF2= 0
##$ABSG= 5
##$ABSL= 3
##$ALPHA= 0
##$AQORDER= 0
##$ASSFAC= 0
##$ASSFACI= 0
##$ASSFACX= 0
##$ASSWID= 0
##$AUNMP= <proc_1d>
##$AZFE= 0.1
##$AZFW= 0.1
##$BCFW= 1
##$BC_mod= 2
##$BYTORDP= 1
##$COROFFS= 0
##$CY= 11.3945322036743
##$DATMOD= 1
##$DC= 2
##$DFILT= <>
##$DTYPP= 0
##$F1P= 2.36226072786647
##$F2P= -0.459571619588291
##$FCOR= 0.5
##$FTSIZE= 0
##$FT_mod= 4
##$GAMMA= 1
##$GB= 0.15
##$INTBC= 1
##$INTSCL= 1
##$ISEN= 128
##$LB= 0.24
##$LEV0= 0
##$LPBIN= 0
##$MAXI= 10000
##$MC2= 0
##$MEAN= 0
##$ME_mod= 0
##$MI= 1.114404
##$NCOEF= 0
##$NC_proc= 0
##$NLEV= 6
##$NOISF1= 3.799351
##$NOISF2= 2.8
##$NSP= 1
##$NTH_PI= 0
##$NZP= 0
##$OFFSET= 15.70392
##$PC= 1
##$PHC0= -18036.84
##$PHC1= 14.60074
##$PH_mod= 1
##$PKNL= yes
##$PPARMOD= 0
##$PSCAL= 0
##$PSIGN= 0
##$REVERSE= no
##$SF= 200.130013532006
##$SI= 16384
##$SIGF1= 3
##$SIGF2= 2
##$SINO= 400
##$SIOLD= 16384
##$SREGLST= <1H.CDCl3>
##$SSB= 0
##$STSI= 0
##$STSR= 0
##$SW_p= 3612.71676300578
##$SYMM= 0
##$S_DEV= 0
##$TDeff= 0
##$TDoff= 0
##$TI= <>
##$TILT= no
##$TM1= 0
##$TM2= 0
##$TOPLEV= 0
##$USERP1= <user>
##$USERP2= <user>
##$USERP3= <user>
##$USERP4= <user>
##$USERP5= <user>
##$WDW= 1
##$XDIM= 8192
##$YMAX_p= 0
##$YMIN_p= 0
$$ End of Bruker specific parameters
$$ ---------------------------------
##NTUPLES= NMR FID
##VAR_NAME=  TIME,          FID/REAL,        FID/IMAG
##SYMBOL=    X,             R,               I
##VAR_TYPE=  INDEPENDENT,   DEPENDENT,       DEPENDENT
##VAR_FORM=  AFFN,          ASDF,            ASDF
##VAR_DIM=   8192,          8192,            8192
##UNITS=     SECONDS,       ARBITRARY UNITS, ARBITRARY UNITS
##FACTOR=    0.0002768,     1,               1
##FIRST=     0,             0,               0
##LAST=      2.2672688,     0,               0
##MIN=       0,             -107427,         0
##MAX=       2.2672688,     134470,          0
$$ Real data points
##PAGE= N=1
##DATA TABLE= (X++(R..R)), XYDATA
0 0 0 0 0 0 0 0 0 0 0 0 0 1 -8 8 -8 8 -16 16 -16 24 -25 32 -40 48 -56 64 -73 88 -97 113 -129 147 -169 192
34 192 -217 242 -273 306 -342 380 -424 471 -524 580 -641 709 -781 862 -949 1044 -1150 1269
52 1269 -1398 1543 -1705 1888 -2094 2331 -2609 2933 -3326 3805 -4405 5187 -6255 7800 -10255
67 -10255 14777 -25932 118025 120036 -1583 132891 100439 12407 -33751 -1999 -39556 -80222
79 -80222 -42305 -23181 -61049 -20704 -19202 -29527 -5882 -3336 -6182 -11905 -27906 -3664 -29520
92 -29520 -38703 14067 19363 8020 27287 46142 73596 46584 30956 60069 18399 -22880 -3004
105 -3004 -14267 -42830 -56138 -29919 -15001 -60407 -33373 21658 -12964 -3610 32328 7757
117 7757 4016 21095 26728 10385 -15604 1515 868 -10673 22374 10809 -3917 31253 27505
130 27505 16906 13650 -1849 200 -28731 -50141 -26891 -34848 -39083 -27411 -22440 9459 12512
143 12512 9936 44554 36360 21406 33117 23323 14927 -1628 -11424 -2054 -24129 -17646 5699
156 5699 -18420 -5652 18522 183 1426 1375 -7185 -10809 -23657 -15298 -19905 -29001 1655 -822
170 -822 -7697 23284 19693 16852 30687 25549 30785 19958 6265 11818 -8776 -14318 -10925 -30056
184 -30056 -19305 -15085 -20369 827 -3744 -7426 5429 -3942 -1335 -2887 -11047 342 -9628 -4778
198 -4778 13867 -1658 10214 26417 10971 19765 26151 19478 15569 1342 5747 -544 -22074
211 -22074 -13845 -24049 -32970 -12019 -19657 -19289 162 -41 8571 9958 7282 15974 1279 1680 8975
226 8975 -6756 2203 5310 -4219 10898 9679 6576 13376 2248 6438 5436 -7534 -1496 -11882
240 -11882 -15373 -5094 -20230 -12628 -191 -10738 -172 4677 3060 13179 7173 9142 7633
253 7633 -3790 10308 1890 -12024 3834 -2885 -5698 4899 -3119 1604 3409 75 7031 -4694
267 -4694 -2552 6331 -8390 -2168 445 -10135 2731 601 -3647 6406 632 4305 5773 -557
281 -557 9171 -195 -5807 5506 -7016 -5927 1025 -10162 -2603 -739 -5208 3030 -2148 2666 6408
296 6408 -4238 6296 4768 -3691 8744 884 -3910 5585 -1371 2500 1542 -4598 5246 -1204 -2239
311 -2239 3973 -7496 670 2298 -11537 -134 158 -5824 315 -4977 351 3138 -3918 5533 1179
326 1179 -1834 9987 -523 786 8392 -2989 2217 2290 -4051 2442 -3468 -2264 996 -6742 3426
341 3426 2252 -6487 5086 -369 -3566 4707 -3920 -1070 1637 -3642 2653 -3012 -1947 5217 -6337
356 -6337 -1053 3977 -5838 3292 2069 -3404 5247 668 1428 2834 -2427 6222 -56 -4770 6360
371 6360 -1701 -171 7101 -2920 2258 4289 -2403 1351 -5556 -5256 -1341 -9507 -2871 -2989 -7788
386 -7788 4266 -1640 -4677 8019 2610 2802 5872 2115 7766 1637 410 5609 -6062 -363 4827
401 4827 -6243 1044 3978 -1044 3895 -1146 565 978 -7702 -2194 -6351 -10611 438 -5840 -4550
416 -4550 4718 -642 4357 4771 -254 7224 3004 405 4976 286 5920 3039 -4888 4813 -1341
431 -1341 -6010 2138 -4804 -3205 1958 -2052 1504 -1887 -1262 2772 -8621 -3716 1059 -9194 -793
446 -793 2645 -2664 4761 4990 6456 5184 -637 8137 3163 -5401 3588 -1534 -4171 514 -5548 -288
462 -288 864 -4434 3370 928 189 5626 -611 1077 -1405 -7296 192 -6374 -7445 4961 -1103
477 -1103 107 7814 5264 7153 2631 573 2861 -6944 -1622 948 -12138 -3934 498 -6713 -1413
492 -1413 -405 1706 2430 -1650 8144 5856 125 9476 2218 -1956 4805 -311 472 326 -3052 4112
508 4112 -1227 -4537 1022 -5717 -3829 -4054 -9058 -1627 -4867 -4817 3882 -4224 -2206 6909 2304 4734
524 4734 6376 8501 10456 981 5873 8518 -6584 -2781 -1142 -10222 -4070 -1088 -957 -1831 -4312
539 -4312 4849 515 -7343 3178 -1345 -7082 966 -1807 -89 678 -2548 3573 -369 392 8716
554 8716 1700 2462 6529 3138 6167 -1256 -4769 2658 -5959 -7026 -256 -4528 -110 1799 618
569 618 3013 -2904 568 1549 -9100 134 3881 -4212 2250 4060 1732 953 -2353 3014 -2075 -6428
585 -6428 5992 1438 -3425 5773 2431 -473 -343 -2325 898 -4441 -2673 6014 -430 1377 5478
600 5478 -1552 1243 44 -3267 -612 -6356 -2017 4265 -3015 -262 904 -2288 1386 -2396 671
615 671 3221 -2914 4090 4536 -2416 4177 946 -4577 -2256 -2970 1369 -821 -2946 6442 1972 -482
631 -482 6413 -647 -2659 656 -2045 -676 -2911 -609 3512 -5143 -1566 3752 -4637 -1546 114
646 114 -1928 2363 -390 2033 3294 -2853 2757 3144 -2504 1541 -326 1705 3699 -1683 3573 2424
662 2424 -4892 1861 -78 -3687 102 -2657 -505 -359 -2449 2722 -3705 -5277 3721 -1838 -2480 2361
678 2361 2 2418 910 888 3736 -3328 1047 4244 -3687 1397 3323 -1611 1739 -525 596 2126
694 2126 -3134 617 195 -2328 3877 -943 -2994 1091 -3138 2 -373 -5028 1387 -40 -2019 2629
710 2629 -254 953 598 -2811 3224 -337 -2282 3873 -1483 -687 3738 30 2166 874 655 4467
726 4467 -1851 958 4335 -3564 -399 -268 -4682 -712 -3555 -4020 -839 -3944 776 1149 -2434 3237
742 3237 877 228 3458 -2327 1106 3236 -1946 2160 914 -290 4616 448 1719 2834 -1101
757 -1101 3103 -440 -3283 1542 -3793 -4028 -1381 -5318 -1773 -1351 -3159 996 -1127 1438 4730 -1244
773 -1244 3210 3768 -1303 2727 227 -831 1394 -2485 639 1774 -771 3812 -428 -1006 4022 -1608
789 -1608 -1072 -181 -4978 -777 -1921 -3668 56 -2263 525 2413 -1498 4139 2843 -441 3720 -807
805 -807 -524 2288 -3080 -1184 -1355 -2719 1331 -2283 -896 3308 -1453 1976 2169 -1553 2843 -283
821 -283 -2438 1027 -2549 -272 723 -1616 2742 639 290 4601 -1091 847 2553 -3214 -805 -1763
837 -1763 -3469 -324 -4024 -2590 -276 -3066 1845 769 -860 5008 1634 1663 5005 381 2039 1307
853 1307 -2528 1088 -1145 -473 1753 -2697 1996 2801 -2335 1269 -1337 -3124 -78 -4776 -3276 -1832
869 -1832 -3989 502 -1728 -1585 4631 643 2603 4334 349 4089 3037 -298 2151 -877 -13 927
885 927 -3111 994 79 -2500 2238 -1409 -826 2158 -2944 -1325 -944 -3405 -476 -3049 -2230 929
901 929 -2370 1664 2409 -1127 4353 2305 -482 3511 677 1423 1177 -1340 2383 -375 -1790 2163
917 2163 -2684 -1018 1662 -2741 98 24 -1279 1862 -2268 -1179 1319 -2861 -401 -923 -2282 2784
933 2784 -122 323 3811 -664 2043 2371 -1816 566 -810 -997 517 -3139 1420 2086 -1966 2864
949 2864 720 -1013 2923 -622 -361 788 -1178 1748 -1451 -1515 2419 -3034 -2696 836 -3216 -242
965 -242 348 -1248 1784 -943 870 2281 -2399 1452 1975 -653 3090 1163 1554 3217 -2515 -284
981 -284 692 -3417 330 -638 -905 1859 -858 1616 441 -4060 1093 -1504 -4754 550 -906 -613
997 -613 886 -623 2960 800 -55 3808 -1270 327 4079 -1131 -43 325 -1711 -290 -3279 -1540
1013 -1540 969 -2797 1072 1935 -1343 3123 1443 -600 996 -1642 559 633 -2625 2341 574 -664
1029 -664 2259 -446 695 773 -2629 883 -1435 -3333 974 -2913 -3446 -631 -1766 293 -676 597
1045 597 5662 1445 3070 6904 2160 2414 2095 -1612 -1173 -3293 -2035 -1044 -5156 -599 682 -3882
1061 -3882 -214 -753 -1849 298 -2228 252 571 -2225 1426 -607 -2138 2471 1131 3092 4872
1076 4872 3456 7086 4252 854 3835 -1892 -4032 -2482 -5297 -3860 -3667 -3216 -310 -4303 -1231
1091 -1231 2632 -2831 -528 2300 -116 1415 195 1116 1872 -1999 2059 2535 -883 4276 4575 2328
1107 2328 4091 2542 2614 -648 -5212 -1690 -4767 -7531 -3215 -4668 -3280 -223 -964 2660 1676 1132
1123 1132 5617 1551 770 3639 553 747 -166 -1131 1661 -1935 -866 3044 -1001 2077 3806 -512
1139 -512 280 -984 -2570 -3512 -7014 -3221 -2698 -5117 1148 2144 1093 5424 4470 4850 4393 2003 4082
1156 4082 -52 -2140 1691 -3157 -4827 -2394 -3683 -1259 -1810 -1807 2343 -147 471 2655 -1818 -1100
1172 -1100 -1587 -3188 -494 -2317 627 4390 651 4169 6847 3533 4750 3098 1108 551 -3182
1187 -3182 -1930 -4099 -8022 -3620 -4524 -6268 -1630 -1497 -117 1933 1209 4393 2440 715 3567 -790
1203 -790 -68 2315 -622 1523 2817 2222 5001 2225 2359 3722 -871 -569 -1969 -5289 -3881 -6238
1219 -6238 -6306 -3826 -5962 -2180 59 -1139 3485 3896 3625 5407 3217 4210 3230 -863 1336 -560
1235 -560 -2151 1735 -473 -216 2110 163 2095 -159 -1781 428 -3534 -4629 -2741 -5479 -3227
1250 -3227 -2826 -3398 834 602 2534 5272 2887 5210 5322 2332 3434 381 -1339 -144 -3668 -2691
1266 -2691 -1114 -3237 -167 -497 -685 2189 -191 238 109 -2551 51 -2017 -3833 283 -1198 74
1282 74 2116 1050 4059 4050 2366 4252 1249 858 1469 -3216 -2276 -2776 -4802 -2435 -3767 -2708 603
1299 603 -927 1518 2002 849 3887 1570 -148 1956 -871 206 933 -1715 1104 1044 529 2911
1315 2911 703 1372 1606 -2082 -499 -1691 -4351 -1906 -4729 -4312 -1657 -2685 -86 851 373 3846
1331 3846 2424 2884 4632 1528 2727 1873 -1291 1158 -884 -1881 107 -1956 332 837 -1120 592
1347 592 -1016 -1499 6 -3568 -2590 -1505 -3986 -1275 -1196 -1293 2513 1184 2147 3999 2092 4430 2649
1364 2649 371 2406 -179 -926 303 -2635 -1064 -810 -2044 111 -1477 -325 1285 -1816 -524
1379 -524 146 -2194 -31 -1198 -1828 610 -1190 715 1781 400 3064 1675 892 2820 215 727
1395 727 976 -2043 -67 -833 -2200 33 -1538 -641 832 -1233 1035 968 -499 1933 -841 -464 1509
1412 1509 -1488 -532 -235 -1001 1621 -523 -1 1723 -1027 943 1065 -1798 987 61 -1365 35
1428 35 -1725 18 500 -1446 1045 806 150 2299 373 522 957 -671 783 -641 -1723 1213 -1057
1445 -1057 -1407 75 -1378 48 -777 -1662 1416 -811 -447 1670 -642 272 1084 -337 1050 -72
1461 -72 714 1534 -1342 1161 2077 -994 1034 447 -668 434 -943 65 -508 -1723 1232 -398 -2028
1478 -2028 982 -718 -865 -207 -1173 647 209 -580 1663 -465 -60 1876 -903 34 248 -479 1086
1495 1086 -986 99 2173 -900 270 1339 -707 658 -85 352 1271 -1332 914 1087 -2399 -424
1511 -424 -212 -1727 -760 -723 826 368 -1108 1802 -225 -2092 1215 -1243 -1323 733 -83 1075 146
1528 146 124 2294 -467 -195 2276 282 671 989 -328 625 -1374 -1094 -430 -3472 -1432 340 -1696
1545 -1696 -484 120 377 828 -1035 619 944 -1745 709 679 -1105 1568 1119 825 705 96 2572
1562 2572 399 -1073 2269 124 -1170 448 -1044 -1168 -2010 -2379 -774 -2554 -1100 1749 -880 425
1578 425 1735 508 783 -357 -301 988 -1346 133 1678 -252 1506 864 245 922 -202 1054 41
1595 41 -1844 979 242 -2157 -793 -1541 -1687 -1372 -1627 1090 462 39 3132 465 -177 1721 -10
1612 -10 -634 -841 -540 721 -1201 -282 1445 -1462 -26 940 -1200 245 -43 487 410 -1179 715 793
1630 793 -2112 -291 238 -689 992 174 1885 1908 -348 1607 505 -1748 245 -983 -1626 -1105 -1243
1647 -1243 640 -1071 -1311 1868 -137 -404 1567 -228 381 930 311 1101 -243 445 1600 -1451 209
1664 209 1722 117 832 643 366 1040 -1270 -380 -984 -3370 -980 -886 -2128 -259 -339 498 552 -700
1682 -700 1963 1322 -504 1887 762 30 1329 -195 393 -1 -513 1242 -747 -409 1913 -492 -312
1699 -312 -2 -983 -593 -1787 -1762 -185 -2205 -351 722 -949 818 845 -216 1285 461 1044 1305 -973
1717 -973 1250 222 -322 956 -645 -499 262 -471 794 74 -775 1265 -282 -870 168 -1082 -165
1734 -165 -710 -1562 748 -249 -346 1244 -618 556 956 -445 556 -126 138 840 -1029 98 526 -1398
1752 -1398 803 182 -603 860 -330 454 828 -306 1259 207 -1148 833 -294 -534 195 -1270
1768 -1270 557 -90 -1190 621 -593 -540 734 -957 139 221 -802 645 -454 -461 1252 -563 122
1785 122 742 -130 1284 124 -292 858 -398 785 320 -1222 452 -53 -1199 122 -943 -348 86
1802 86 -1120 236 122 -709 576 -848 -401 1116 -768 592 460 -574 1186 -30 -240 1048 -481
1819 -481 598 248 -524 1171 42 -441 517 -1135 -193 112 -1106 107 -519 -591 521 -912 -57 884
1837 884 -1011 444 -118 -886 1286 -212 -218 654 -706 471 -40 -716 1010 41 54 858 -454 781
1855 781 677 -850 562 -132 -412 1042 -1051 -192 -47 -1003 488 -593 -853 695 -998 -537 271
1872 271 -1008 559 -320 -917 484 -118 261 786 -730 1552 1149 -159 1336 115 -39 947 -625
1889 -625 153 8 -1131 527 -815 -781 1044 -1154 -117 23 -1066 718 -688 -1018 528 -670 -141
1906 -141 212 -825 933 419 72 1516 -57 998 1457 -485 806 317 -604 461 -873 -506 -118
1923 -118 -1425 348 -248 -1171 563 -364 -1098 178 -490 455 -39 -1142 1111 -451 -494 1380 -523
1940 -523 344 1078 -128 1177 342 230 820 -816 -259 470 -1095 -43 -472 -510 716 -689 277 838
1958 838 -645 755 318 -918 619 -227 -160 -99 -1232 553 176 -1407 554 -320 -438 886 -136
1975 -136 411 -66 -497 1088 -808 -841 1202 -612 -115 933 144 1360 171 60 1103 -879 81
1992 81 514 -1474 -97 -25 -831 162 -801 -339 101 -1546 216 484 -486 820 -153 -139 320 -412 880
2011 880 -14 -585 1427 438 -242 1601 537 542 181 -395 830 -1147 -1134 283 -1663 -628 484 -1086
2029 -1086 -655 -491 -473 200 -1152 583 1178 -609 676 508 -471 631 -137 85 585 -397 1498 682
2047 682 -615 1018 -122 -823 -75 -1042 -38 -544 -1069 676 -608 -952 878 -731 -704 92 -125 759
2065 759 -479 377 1486 -982 -172 1035 -857 54 133 100 765 -104 1039 767 -1390 911 286 -1323
2083 -1323 189 -65 32 200 -667 829 25 -1022 496 -777 -725 862 -309 14 58 -319 1233 -898
2101 -898 -1197 663 -560 -166 955 -202 1090 55 281 684 -1062 201 1139 -847 439 799 -44
2118 -44 542 -733 121 114 -1652 48 51 -1356 603 -52 -475 280 -506 356 -216 -857 1054 -115 -214 1506
2138 1506 122 374 537 -394 495 -366 104 1340 -670 -174 979 -601 -29 -1176 -640 479 -1198
2155 -1198 -25 720 -544 711 276 -590 127 -331 -170 119 -974 908 388 -757 582 -204 -257 703
2173 703 -590 675 422 -190 1239 -102 -339 1134 -750 -304 -321 -502 776 -211 18 1207 -544
2190 -544 -225 717 -1141 -131 -515 -884 -144 -1131 -274 123 -1184 286 616 -320 950 447 715 1056
2208 1056 -102 956 493 -663 904 -57 -813 785 -83 519 -59 -594 470 -734 -1356 -30 -1333
2225 -1333 -748 -195 -1114 -66 -259 319 1237 -76 687 1710 553 1372 826 56 803 -586 -184 232
2243 232 -1083 211 -116 -841 653 -33 -391 224 -1016 70 -672 -1786 -228 -859 -603 343 -556 597
2261 597 925 245 1723 521 1062 1952 -159 347 421 -832 -49 -1011 -1170 187 -893 -226 440 -973
2279 -973 694 482 -347 515 -382 -246 266 -1292 208 342 -394 1034 419 417 1618 285 925 487 -706
2298 -706 214 -938 -1396 -514 -1305 -686 -80 -826 941 557 537 1307 399 1047 1160 -622 495 -51 -891
2317 -891 277 -722 26 625 -464 338 60 -261 772 -825 -1032 -415 -1591 -726 -731 -1412 321 -179 -24
2336 -24 1292 648 1875 1846 709 1592 755 -65 564 -1170 -720 -455 -1255 -180 -579 -689 392 -620
2354 -620 -301 265 -963 -55 -550 -1170 44 -806 -475 355 116 1263 1395 883 2121 1077 991 1358 -440
2373 -440 192 -206 -1764 -1084 -1643 -1597 -492 -1380 -198 215 -514 652 152 -314 625 -547 58 189 -746
2392 -746 573 249 31 1355 827 1230 1456 111 808 485 -846 -229 -1380 -1232 -641 -1686 -579 -678
2410 -678 -812 759 14 110 1448 264 731 458 -551 543 -70 -642 281 -567 192 460 -507 945
2428 945 243 -187 617 -765 -582 -97 -1256 -382 -1006 -913 535 -384 327 1092 331 1226 1183 485 1052 -31
2448 -31 -554 -77 -962 -467 -298 -1430 159 -433 -337 438 -586 -47 457 -505 485 -135 -309 561 -486
2467 -486 -70 971 70 1281 409 369 1648 599 422 365 -296 -351 -452 -1236 -836 -1428 -715 -76 -1162
2486 -1162 364 664 -498 859 -84 176 657 -241 312 484 -479 937 131 -11 1003 277 513 610
2504 610 -211 443 293 -777 90 -1197 -889 -218 -1356 -189 -334 -396 626 -441 262 828 -622 144
2522 144 56 59 824 -204 124 196 -310 716 480 -770 603 232 -66 326 -402 139 -206 -1087 288 -576
2542 -576 -791 558 -434 16 493 232 231 -214 -111 954 -421 -319 578 -559 -50 -206 -61 309 -261
2561 -261 157 680 -599 766 579 -307 322 -67 35 87 -761 203 173 -601 353 -219 -180 619 -380 -137
2581 -137 -432 -659 661 -180 -479 938 -157 -266 286 -406 339 -344 8 871 -160 262 1290 -433
2599 -433 403 175 -321 245 -520 279 464 -796 505 44 -950 76 -419 -199 7 -256 501 342 -516
2618 -516 613 170 -625 166 -15 54 347 -164 876 -325 -314 654 -782 -317 525 -313 104 -292 -57
2637 -57 651 -651 -109 306 -639 222 316 -159 653 231 31 171 -878 -84 -200 -1029 -2 -225 -169 236
2657 236 27 648 243 -65 915 -113 -20 755 -251 133 288 -249 395 -577 -575 409 -761 -489 234 -577
2677 -577 -23 78 -675 -56 -732 -177 211 -885 287 673 194 699 512 338 674 -262 617 415 -185
2696 -185 635 -268 -369 91 -268 -151 -79 -762 605 -103 -546 117 -686 -361 -83 -733 -11 -580 -135 582
2716 582 -134 563 1002 120 536 636 164 625 -278 26 181 -904 -152 -430 -739 261 -193 -188 281 -361
2736 -361 192 170 -793 337 -125 -428 126 -340 -122 290 -243 624 277 91 948 -14 114 370 -447 252
2756 252 -258 -411 336 -300 -236 338 -351 256 327 -36 358 -59 102 248 -633 -29 -305 -556 262 -458 -73
2777 -73 389 -396 139 97 -338 337 -217 -380 47 -358 -61 -300 -170 534 123 30 841 181 376 718 -196
2798 -196 463 169 -453 26 -680 -443 -98 -1235 -183 106 -286 259 -274 -311 -10 -251 162 -41 -362 509
2818 509 128 37 630 99 270 678 -95 655 177 171 328 -539 -405 -111 -934 -286 -353 -682 326 -477 -293
2839 -293 185 -213 442 -259 -386 478 83 -17 526 -69 644 447 -170 592 118 41 625 -196 249 198 -471
2860 -471 154 -421 -272 79 -785 -228 -118 -317 125 -113 -369 473 -435 20 341 -232 332 -41 -410 -182
2880 -182 64 194 677 -367 452 445 4 631 -146 -235 327 -831 -129 103 -411 277 -343 -301 516 -109 420
2901 420 115 -483 355 -170 -465 327 -731 -25 -77 -521 392 -83 -251 812 -362 277 491 -161 111
2920 111 107 86 547 -327 -118 406 -271 312 252 -55 520 -215 -242 76 -585 81 69 -724 129 156 -333 60
2942 60 -161 326 432 0 541 -15 57 563 -124 -64 320 -40 175 -169 -341 522 -126 237 158 -679 183
2963 183 93 -408 72 -199 -301 -129 -788 3 152 -543 278 43 -216 445 -162 152 149 -198 598 342 -335
2984 -335 517 -90 50 307 -446 528 -153 -339 534 -15 -278 235 -547 -238 -320 -206 398 -607 -75 456
3004 456 -344 -147 258 -247 397 -128 -5 350 -448 82 207 -391 401 310 6 399 -105 398 275 -486
3024 -486 234 -34 -352 -22 -257 -84 -116 -395 250 -241 -462 539 -345 -387 216 -126 -40 -118 -232 741 -341
3045 -341 -183 893 -550 110 235 -67 84 -121 118 533 -484 401 585 -771 -257 -317 -902 -195 -425
3064 -425 32 -46 -202 551 85 -246 735 194 -82 434 47 569 107 -197 713 -354 -178 441 -656 47
3084 47 29 173 280 -265 -88 370 -878 -276 238 -404 154 35 7 421 -366 417 62 -972 567 65
3104 65 -383 351 -19 -55 -226 -562 251 195 -12 511 180 220 652 -103 228 6 -238 343 -561 -204 625
3125 625 -599 -109 195 -280 215 -420 70 46 -744 49 114 -541 18 -33 -292 -65 -35 738 392 19 806
3146 806 235 -254 504 -234 -349 199 0 67 -161 -509 672 -216 -141 84 -431 -200 -55 -469 -9 -471
3166 -471 -265 722 -745 87 233 -153 133 -71 224 509 -70 334 171 -240 557 173 -284 416 11 174
3186 174 -11 -225 428 -66 -751 -49 -233 -311 -21 -397 45 -353 -456 363 -360 -232 735 77 391 360 472
3207 472 567 -129 -186 78 -296 238 143 -246 137 -141 -51 145 -474 143 286 -664 179 83 -372 172 -24 -43
3229 -43 94 -377 450 -154 -220 653 -99 31 394 -18 246 -196 -263 460 -232 -183 539 -291 251 129 -73
3250 -73 365 -123 -130 142 -637 12 238 -359 286 16 -153 347 -375 -90 147 -494 761 -16 -162 425 -94
3271 -94 168 227 -230 358 81 -184 282 -28 126 283 -325 -13 196 -64 323 -164 -71 119 -516 211 -78
3292 -78 -215 266 -96 -136 209 -218 255 297 -575 509 224 -148 308 -136 429 261 -337 498 212 -329 247
3313 247 -207 -22 387 -305 -38 -90 -332 66 -487 -238 286 -583 122 -27 -197 206 -236 -208 266 -219 370
3334 370 136 -202 295 -131 24 296 -198 -36 186 -206 304 -86 16 536 -233 149 162 -520 214 -460
3354 -460 -300 134 -321 -266 73 -190 173 94 -173 324 -147 232 429 -150 170 74 -225 274 -62 -9 505
3375 505 -93 417 226 -422 368 -498 -493 -107 -630 -111 -99 -567 341 11 -301 42 -196 254 159 -58 505
3396 505 131 -193 18 -226 67 282 -135 327 77 42 534 5 -174 372 -502 -54 -115 -535 -74 -692 -167
3417 -167 61 -525 88 317 -223 520 341 240 465 -342 87 -71 -416 -8 37 20 286 -184 71 452 -153
3438 -153 139 -212 -334 68 -349 -296 138 -153 279 34 99 377 211 283 222 -398 40 299 -316 -117 -408
3459 -408 -660 -102 -483 131 82 -381 675 359 40 420 -45 134 53 -227 473 -79 -212 318 156 133 89
3480 89 45 307 -24 -241 76 -332 -473 277 -507 -210 -310 -167 -6 -360 180 368 95 415 130 38 587
3501 587 -3 221 22 -57 284 197 -285 209 152 -105 88 -514 145 -167 -534 -178 -417 -536 250 -305 -77
3522 -77 589 48 504 82 278 526 68 51 368 -183 101 342 -357 56 -269 -287 168 -351 22 224 -337
3543 -337 -147 -43 -220 254 -615 -301 -246 -366 214 -21 -57 555 361 98 181 -165 235 -41 -537 346 -33
3564 -33 6 303 -354 177 5 -133 -21 -300 59 506 -331 73 111 -280 102 -276 -235 398 -271 412 464 -418
3586 -418 173 -20 -211 -306 -258 11 -54 -416 455 86 -181 372 -74 -127 175 109 331 153 60 401 -288 -274
3608 -274 120 -453 -301 -127 -175 144 -51 119 343 -131 39 23 -524 -102 -414 40 49 56 332 312 -104 0
3630 0 342 -112 229 44 187 198 -45 157 -187 -582 173 -279 -142 0 -126 -17 15 -228 206 -497 -145
3651 -145 101 -315 -299 442 21 245 419 -1 561 -231 326 321 19 84 213 -168 -21 -112 126 127 -232 352
3673 352 -214 -130 437 -59 -121 -126 -453 294 -287 -49 194 -244 -98 293 -133 4 73 116 432 -135 220 213 -175
3696 -175 60 116 -393 186 -174 -167 82 -103 218 69 -372 152 10 -237 -149 -166 156 236 -75 57 81 -404
3718 -404 275 -204 -244 24 -239 10 156 -103 620 -139 114 304 -239 272 97 -169 284 -217 -83 99
3738 99 -204 289 74 -269 83 -48 -128 -46 -33 -106 125 -176 268 -3 -79 547 -109 161 281 -30 294 100
3760 100 -478 58 -175 278 220 -103 118 98 -343 65 -305 -27 194 -525 -178 96 -248 162 -336 -133 114
3781 114 -378 94 110 -314 273 104 -152 471 54 273 -64 -121 326 -168 -194 319 -183 216 252 -200 -163 114
3803 114 -56 216 38 -151 209 -174 -110 -257 -359 217 -368 -228 -116 -155 74 421 -148 233 0 -66 166
3824 166 -153 286 223 30 138 38 -120 191 -28 207 160 -263 449 -141 -72 36 -384 -344 -38 -204 129
3845 129 121 -152 391 -104 33 128 -6 244 174 -94 294 348 48 403 -288 -62 195 -147 48 -254 -178 -59
3867 -59 -184 -245 -145 -441 3 -110 -146 259 155 -38 189 -164 8 127 -100 290 -244 26 95 -236 261
3888 261 322 -95 362 179 -29 61 -410 52 214 -308 156 -303 -353 230 -142 -14 -54 -7 260 -172 -71 206
3910 206 -81 14 -37 -254 145 12 -143 295 -158 87 248 25 200 20 -90 37 -159 -75 -52 -274 -107
3931 -107 -234 -108 149 119 54 91 117 159 177 -111 119 -177 25 101 -72 -13 228 -86 -25 -147 66 484 29
3954 29 216 78 -64 307 103 -233 208 -123 192 145 -151 251 -114 -387 -108 -192 -227 11 -234 -204 -38 5
3976 5 89 -20 -59 274 -141 240 142 118 382 132 172 429 -129 147 -27 -133 -138 -51 -132 -153 -137 147 65 -190 212
4001 212 20 -390 28 -74 2 182 -40 193 49 33 380 48 -90 363 -47 145 17 -299 128 -173 -167
4022 -167 219 -105 54 117 28 253 359 -120 76 -153 168 -23 -257 119 -153 -131 68 -212 -57 28 -41 207
4044 207 97 -204 -54 63 -90 -82 24 246 365 143 283 150 198 118 -72 -35 193 -368 16 -127 -66 141
4066 141 -253 -125 -71 -189 -14 -3 -178 261 -397 181 138 -188 231 -21 -234 219 24 185 -47 29 311
4087 311 188 -218 248 11 -143 83 -94 -208 -84 83 -162 -197 -39 20 -105 -202 103 -381 301 56 41
4108 41 226 -210 72 4 -186 264 224 54 140 -265 -23 221 -197 51 -115 -50 203 9 -152 -29 -171 152
4130 152 -152 -234 386 -375 -38 18 -193 -22 -14 -407 107 -41 -141 104 -54 293 17 -209 78 -80 97
4151 97 -9 -231 240 167 41 128 -68 30 283 -185 -15 230 -61 409 -266 -18 177 -228 136 1 -290
4172 -290 -51 -65 -90 170 -6 19 296 -228 237 94 -10 196 -31 58 216 -411 38 83 -285 91 21 -11
4194 -11 19 -28 -116 -42 -119 93 -218 -191 187 -96 133 -33 61 79 182 -50 432 -150 186 133 -16 130 -166
4217 -166 72 -50 -243 -147 15 -125 61 263 56 318 27 -91 114 33 -44 184 -314 81 236 -152 442
4238 442 -461 259 360 59 604 -182 -85 142 -51 49 -34 -267 188 131 -65 169 -325 -98 141 -45 85
4259 85 -54 -111 19 -309 -75 140 -134 79 54 -196 145 -79 89 -28 -17 159 103 -288 50 38 -317 268
4281 268 -84 39 137 81 327 134 10 250 -321 -148 224 -441 -124 -223 -203 72 -102 -132 87 135 106 49 -219
4304 -219 166 -191 -101 50 -102 66 416 -173 225 131 104 12 -117 122 -175 -103 84 -191 -39 3 -414 -208
4326 -208 33 -354 242 17 -136 370 -73 -42 151 11 106 278 -155 61 85 -225 38 63 128 -9 -48 177
4348 177 -111 -151 95 -40 -271 -111 -194 10 -133 -8 -87 -67 -97 233 -96 300 -110 -124 89 -153 -70 72
4370 72 -172 230 -113 -121 232 273 268 113 -306 -169 -48 -163 560 -256 127 259 -150 80 20 -402 -65 -204
4392 -204 168 172 22 125 177 -272 330 129 -357 156 -18 -64 -10 -44 304 -21 18 -56 -77 139 155 45 69 63
4416 63 -168 329 -60 225 399 -248 222 138 -346 256 -169 -103 2 -175 -48 161 -298 226 -11 -5 153 -159
4438 -159 74 357 -178 290 80 -157 316 85 131 48 -303 237 -94 -128 59 -91 15 137 -156 363 -79
4459 -79 -108 180 253 -47 200 -224 -102 40 -11 13 97 -11 154 -106 -114 269 -128 282 71 -316 -160 223 29
4482 29 58 -109 77 -38 -162 -21 -250 -90 -3 -321 236 42 -90 302 -189 -79 169 -12 363 138 279
4503 279 215 71 -35 86 -235 144 135 -180 55 93 -6 40 -162 -66 -52 -340 3 -28 -126 15 -181 -259 93 68
4527 68 21 -248 64 214 -3 187 117 -61 283 44 33 103 -151 -75 -7 -205 -22 -102 28 98 -175 -90 47
4550 47 -15 139 198 -120 -20 -212 -65 -54 193 -20 226 -19 -10 57 30 489 -63 1 -44 -118 167 44 -137 116
4574 116 -42 60 281 -257 -219 -195 -236 144 -289 8 90 -66 30 -74 -147 74 -81 33 -29 10 103 81 -190
4597 -190 -8 -94 -150 -198 -64 -11 35 -71 -93 13 -78 28 -65 -54 234 -14 52 -191 -35 200 -60 -164 44
4620 44 95 -122 66 -255 142 -112 -5 -3 -259 -210 78 -101 163 85 54 319 -336 47 167 -4 517 185
4642 185 121 -73 35 47 -63 -121 76 21 -386 158 297 -62 120 -95 151 -252 18 176 68 -12 184 63
4664 63 3 214 162 161 87 64 58 -112 280 278 -315 -49 -113 -142 -107 -74 34 189 -190 117 68 -346 37 124 -69 131
4690 131 39 3 130 -187 292 165 105 265 -3 56 93 22 61 -200 -199 68 -229 -93 -219 -157 -178 86 163 -7
4714 -7 42 86 71 -172 -170 403 219 -28 -67 133 388 -143 161 174 -284 103 -339 -459 4 73 161 -318 -85 210
4738 210 -193 -236 57 -9 74 70 4 165 -167 -18 -98 -105 -283 -56 27 54 -38 -58 235 17 37 9 37 34 179 -140
4764 -140 149 -144 -63 -77 -403 132 -153 54 -7 19 -70 281 -127 142 -170 58 157 -243 -226 -86 -118 130 22
4787 22 47 274 106 -32 489 -206 -70 156 -149 162 -73 -219 300 221 118 194 -186 14 -121 134 -51
4808 -51 -52 105 11 -278 130 -153 25 167 -135 73 148 10 52 79 33 84 12 -148 244 -101 155 -267 -119
4831 -119 -188 69 -75 76 81 -219 7 -246 234 -258 -171 175 -219 -290 12 6 330 79 -249 64 -7 106 31
4854 31 -306 77 -29 -40 308 -56 -258 36 79 64 130 -290 159 33 -58 142 76 49 116 -380 -63 28 -87
4877 -87 -25 -202 -41 109 -261 -78 -78 -92 -48 135 115 217 -141 207 276 149 -146 22 -282 35 220 4 112
4900 112 -269 -51 9 -93 128 20 -34 -90 -52 53 -245 -4 -34 -7 142 42 -15 227 63 155 330 -74 -119
4923 -119 410 63 27 80 -66 -7 -222 39 133 -21 -86 -35 12 82 -65 -74 107 -150 141 86 87 43 225 262 118
4948 118 18 -117 386 -55 278 16 74 223 274 270 121 -7 -82 137 -110 -145 38 -245 87 -392 -262 -87
4970 -87 25 28 32 -70 -4 -260 -89 -34 -114 222 74 -61 3 -80 62 159 319 267 7 -70 182 -135 445 194
4994 194 -17 285 -10 -5 -28 -27 89 -139 -236 15 -175 -225 103 -44 177 -127 -244 180 -151 -95 174 -222 51
5017 51 -12 16 273 89 54 105 72 -12 158 -11 0 74 -233 128 -72 67 27 129 -34 79 -24 93 -20
5040 -20 -176 145 -191 -15 -181 -165 156 27 104 216 -60 269 95 92 73 224 29 208 170 -32 125 83 -27
5063 -27 339 -131 245 -177 -16 45 -7 -86 103 89 20 10 -58 158 -255 103 189 -55 285 47 179 -415 35
5086 35 199 -264 22 81 67 -67 103 28 93 25 -270 -97 -45 -287 165 -261 -196 28 103 -89 -74 -56 174 161
5110 161 -231 219 -239 100 -50 5 -183 -143 49 32 -205 -16 -151 -176 140 -62 203 -276 -180 -150 56 76
5132 76 -175 100 -95 119 -54 -95 201 -116 160 -234 53 33 108 -245 177 13 -134 -192 -44 -6 165 -106
5154 -106 273 37 -8 -178 16 134 76 71 -304 -274 -53 50 -281 -79 -48 -121 145 -188 -91 223 10 152 -178
5177 -178 -150 10 -35 -83 209 -58 -139 186 -203 148 135 -115 -23 -145 -56 22 27 -291 55 -64 -71 -120 163 75 -66
5202 -66 -8 80 173 -1 -183 281 297 -14 242 185 12 296 -122 24 -2 -33 -69 180 7 46 110 -191 210 32
5226 32 -21 121 -64 219 -287 -135 47 41 60 17 126 72 -38 -289 -46 -62 118 167 115 97 -146 -190 -75 -145
5250 -145 17 -130 -163 -105 239 -23 76 -131 48 150 244 -7 258 -154 -18 100 123 138 -331 -242 -213 151 148
5273 148 -53 274 69 129 226 -64 -36 348 30 13 164 45 201 132 -390 99 163 60 73 234 -73 82
5295 82 -140 100 101 -154 11 -82 48 175 112 112 161 98 122 -62 -51 30 -114 310 -31 102 62 -98 -147 41 -188
5320 -188 -10 -26 111 -27 198 79 -247 68 -38 114 -134 79 -148 27 6 56 -35 45 -214 -98 27 -209
5342 -209 -113 -2 -32 -127 19 10 73 -20 116 -183 -37 -9 -283 -69 -38 -15 -38 26 38 -203 -83 153 273 -21
5366 -21 91 -152 -262 27 -46 104 206 -201 -77 162 -163 -44 -48 -8 74 -155 319 34 37 288 -132 -98 169
5389 169 -60 49 93 -107 259 27 110 -66 44 -94 4 -171 87 148 -74 39 10 243 -10 -64 90 -313
5411 -313 52 538 146 -39 -83 -15 160 -247 69 16 30 -118 162 -20 15 128 5 -125 -130 -44 -88 -51 159
5434 159 76 -22 -112 30 259 98 239 -23 188 58 101 55 -122 212 50 -120 -37 -225 96 -118 -51 -57 -235
5457 -235 92 153 -373 -198 -93 -38 128 33 105 111 -13 -148 -148 37 25 20 19 202 -105 -50 69 -41 146 296 2
5482 2 30 30 30 -157 -60 -64 -146 -161 -194 222 -91 98 109 131 -253 -224 29 96 -10 38 -151 310 39 273 177 107 81
5509 81 -173 -194 150 -98 -251 -203 -300 -279 183 143 53 -86 -142 114 -128 -149 -101 177 256 -40 8 -132 39 146
5533 146 222 -123 37 134 -177 -159 -12 -45 -108 91 -3 -84 -131 166 -2 69 269 -322 38 135 -63 -69 -145 -185 12
5558 12 -186 38 273 -3 -67 330 -66 -44 -25 6 170 -183 230 53 87 -17 -65 123 209 168 -75 180 141
5581 141 162 -323 -83 -191 -135 166 -173 -181 -4 -119 172 22 -136 -191 -100 -74 -13 -45 -30 16 -152 -51 162 6
5605 6 83 167 162 99 48 134 -59 -211 108 -25 15 138 196 -53 40 -266 -259 230 301 -138 82 -7 -19 -90 -185 260
5631 260 100 -83 81 -159 -210 -142 168 96 -22 277 23 61 -69 76 -32 -147 140 41 -283 54 -76 -136
5653 -136 159 65 -306 85 -132 -19 119 290 6 171 32 107 82 94 -23 -125 148 128 76 -81 58 -115
5675 -115 -259 -31 30 -63 -52 4 229 -96 75 31 -221 156 50 27 -39 -140 2 289 -280 169 157 -116 249
5698 249 254 120 45 -203 11 109 60 148 -150 105 121 -234 167 -79 -116 126 5 17 152 -91 68 -180 -83
5721 -83 -278 -31 46 -80 -249 -163 -185 -70 -55 -7 0 50 -28 124 -86 -321 126 27 43 -75 -94 -179 85 -222 -206
5746 -206 181 -132 -23 13 176 -1 18 82 109 -162 64 52 66 -105 -191 89 218 164 177 81 8 103 -97 35
5770 35 7 262 43 317 -52 249 111 193 84 -208 -47 187 76 -34 -241 86 93 -174 -78 -335 186 191 64
5793 64 112 56 99 -96 112 -139 56 169 -75 -22 -78 -126 -55 -250 -43 -254 165 -17 -97 104 102 13 -97 -17
5817 -17 98 106 6 -128 -2 -64 -54 -67 -19 -153 15 125 8 -142 242 38 -150 51 -261 47 3 48 272
5840 272 -2 -213 110 -7 28 -87 152 162 11 -200 138 -39 38 102 -141 -279 156 -163 179 107 -11 24
5862 24 8 -15 -83 -121 -172 196 -37 132 -22 207 14 171 -226 37 -13 -198 100 73 -632 -43 -111 -306 45
5885 45 81 35 -207 -25 -18 164 -121 -369 108 36 -51 -84 39 -42 -188 -76 -75 56 37 79 -310 -73 193 -276
5909 -276 -104 -1 94 147 -194 -72 -67 -19 108 350 124 -182 -125 -40 -42 67 -174 -9 145 90 -104 56 170
5932 170 293 62 211 48 16 80 194 -73 -118 -22 197 -211 -19 120 118 -109 -153 -140 -151 24 93 44 45 80 169
5957 169 268 159 -71 109 119 42 326 14 -236 179 -74 -205 30 -97 36 45 215 112 215 -91 302 -227
5979 -227 -31 199 5 210 -127 37 -45 107 -247 19 174 52 -147 112 65 160 33 59 54 42 -91 -29 27
6002 27 10 258 169 -131 -44 -122 -275 215 73 237 -83 -195 91 32 -183 37 112 11 -135 -193 194 -140 198
6025 198 191 -83 135 -1 98 66 51 37 59 82 151 228 -110 -213 -193 -221 -18 -20 -136 -189 113 -115 179 -103 102
6050 102 153 121 106 -25 299 -100 466 33 -23 -214 -27 -21 33 -57 -19 -3 330 -180 2 -231 -7 -50 44 -26
6074 -26 49 -77 -53 148 -38 74 -330 -121 -106 159 -105 85 -186 70 47 45 -181 -242 95 56 38 -60 -223 74
6098 74 91 76 -61 40 -138 -4 182 -131 1 -57 186 -193 272 39 -100 -24 -31 174 69 103 170 138 -304
6121 -304 -123 218 -199 -73 -111 11 -54 176 55 138 76 -32 69 -171 94 80 -234 -102 215 -148 -144 -296
6143 -296 8 199 -113 4 183 72 3 338 95 0 -111 159 -78 246 149 -95 55 -93 12 50 -307
6164 -307 104 80 45 -5 270 -136 -66 -59 -269 134 88 -246 79 55 190 234 -12 -35 99 -40 35 171 -122 -135
6188 -135 7 48 -98 321 113 82 215 36 -160 79 27 -181 104 -177 78 17 -155 -79 -161 23 -137 -217
6210 -217 117 -84 -81 25 -106 -39 32 73 238 64 -79 203 84 -123 106 -104 358 -53 -103 216 172 -207
6232 -207 -41 57 -232 -18 -103 14 -6 163 114 15 -54 -12 -211 171 7 -135 239 -28 61 -155 96 -26 -59
6255 -59 -150 64 122 86 208 -13 281 118 -158 -24 -151 71 -81 7 -131 -158 50 95 -152 -110 49 10 -183
6278 -183 -73 157 116 -40 -113 -155 46 -260 -125 -25 49 142 6 168 107 -559 140 94 -253 127 -110 40
6300 40 -3 13 -28 25 -248 -68 -42 -1 72 189 -43 -46 -139 -136 -58 310 60 -187 -312 -29 -66 -21 -299 -83 49
6325 49 -175 99 -188 53 15 1 -121 -82 165 267 63 -90 88 -185 -166 -67 154 80 -167 45 208 244 -1
6348 -1 196 -96 226 99 253 -167 35 -39 1 186 90 16 43 254 -23 71 -107 -52 35 -54 40 143 60 -176
6372 -176 64 92 -24 60 -308 -265 -242 45 61 -28 -6 230 23 231 -31 -31 -107 -32 -95 -72 -355 -138 -192 -163 -51
6397 -51 -151 -37 -43 214 38 218 -157 105 130 -32 -10 -126 -83 176 37 -241 -98 -45 65 -78 82 53 -56
6420 -56 -91 -139 -93 24 -209 121 -278 -89 -300 115 -204 -17 -95 -45 65 65 164 -125 -143 77 77 38 -60 -24 -60
6445 -60 106 -144 -1 172 21 30 -84 83 5 -97 -2 -32 -156 -190 -114 103 -7 -11 -64 228 -255 197 -179 181
6469 181 34 297 152 -178 -28 172 53 7 113 -144 73 -172 -187 30 -22 3 47 -137 67 -272 -31 159
6491 159 -39 79 50 179 -57 254 -196 121 -60 -29 23 205 239 243 56 -95 -95 103 -183 -5 41 198 -83
6514 -83 2 42 -83 -167 -30 3 -6 -185 3 275 -321 -103 -157 -287 -227 -75 12 221 132 265 80 -120 -38 360
6538 360 43 125 -210 91 -150 17 56 51 150 87 -39 127 43 -78 247 128 -257 -144 -16 3 78 111 -20
6561 -20 -167 -172 8 -83 -82 -146 -169 41 6 -4 124 -53 175 48 -54 47 5 -157 64 -37 -138 39 -104 329
6585 329 127 95 142 -25 47 28 7 11 -15 -217 -99 -162 -158 -41 -30 -2 178 -71 184 -43 72 -4 -29 -86 -25 11
6611 11 -2 83 41 218 -49 -87 126 -86 169 -18 -32 -97 143 70 -237 134 -45 -42 111 30 103 -189 -92 47
6635 47 -47 -114 -188 -1 68 -167 44 -265 95 -8 -67 5 -68 97 114 -144 -54 61 -213 0 129 27 39 93
6659 93 51 163 -195 190 37 -197 152 103 172 271 -83 34 275 -187 61 232 10 22 143 217 27 -40 -6
6682 -6 58 363 17 -314 99 -18 -25 113 41 -27 18 -30 99 267 86 28 -88 17 232 -253 -226 57 -286 128
6706 128 -76 89 82 -122 53 92 -190 220 335 70 121 -68 119 -51 100 -165 74 238 -74 27 59 -245
6728 -245 71 264 8 72 174 -101 30 -155 -9 201 78 -11 88 140 -40 85 15 80 124 -131 117 -38
6750 -38 92 -2 -91 -112 68 -68 94 96 -157 170 -230 -167 153 -20 121 -248 -55 206 -99 -15 46 2 175
6773 175 -17 2 -149 -139 -62 137 -25 20 366 54 -18 -103 158 -130 104 -171 -200 81 238 -122 211 347
6795 347 -144 146 115 248 146 139 294 43 161 242 -4 -105 -20 66 -18 -73 79 3 -20 -20 -150 112 -49 37
6819 37 -10 39 -2 10 108 44 157 51 237 -41 172 121 187 36 67 12 47 -177 -18 329 37 4 -249 211
6843 211 -29 175 71 27 -44 -6 -9 -82 20 112 122 29 -92 183 2 -73 -29 -179 26 -113 46 320 269 144
6867 144 -278 23 45 -25 83 89 77 -79 -168 50 138 -147 -121 -148 215 -269 -200 -211 104 50 4 -23 -282 -76 -155
6892 -155 -48 68 94 93 -20 104 54 345 263 -136 -179 -221 24 -175 113 43 -74 53 -92 94 -15 311 20
6915 20 154 47 63 -64 -169 -122 335 171 63 -324 20 -34 -165 36 55 -302 12 -119 -213 81 102 18 -35
6938 -35 -91 -69 77 -96 280 -59 122 -172 -265 253 78 39 5 26 88 -25 34 346 72 -178 142 -19 -47
6961 -47 -136 -4 -131 284 -86 -160 -16 -328 174 -68 5 -27 -185 -9 80 -83 7 -169 -198 -51 -238 -103 -150
6984 -150 -62 162 -85 -239 65 -168 77 159 -91 -16 144 -93 -14 71 330 -114 -64 74 51 75 217 -239 59
7007 59 172 -13 -60 -222 -200 -220 110 -125 41 -124 -25 4 -192 -70 -106 33 54 -35 -9 -306 12 17 -28 -133
7031 -133 71 -92 70 122 217 6 95 -42 -120 158 23 42 144 209 -256 16 -41 -251 148 -44 -41 -51 118
7054 118 264 124 -55 93 -35 -212 -110 8 7 -87 37 -56 -135 36 -22 -30 38 305 266 21 112 -92 115 59
7078 59 -167 -56 -175 -144 -148 -261 25 -20 121 -67 65 127 -69 -271 -188 -33 65 -99 -139 -88 85 -27 -228
7101 -228 28 -11 93 -36 -318 111 -126 -117 198 18 -84 -37 263 -104 -84 -58 -107 -115 29 -24 -39 95 -95 -84
7125 -84 107 64 190 -136 -69 -17 -88 182 91 -65 -57 217 -29 22 33 56 -19 -103 -14 -104 -242 153 53 -132 97
7150 97 -168 -87 -3 -105 127 0 -129 -51 -115 -169 1 -156 14 -203 -50 -118 -134 -108 553 -183 122 -96 -67
7173 -67 -152 -10 213 -25 -21 -226 101 3 -22 40 140 -14 120 85 18 341 126 -189 -101 179 -216 -83 34
7196 34 -53 -10 -72 -270 -220 34 52 -110 -79 77 -216 -249 181 46 175 -74 -345 36 85 104 -93 -66 2 307
7220 307 -12 -76 -19 171 -57 -102 112 208 -21 77 -8 -239 147 -21 34 23 -302 -298 67 71 -166 145 210 191 -94
7245 -94 135 -32 -66 63 -38 -207 70 65 255 104 -25 223 89 200 -9 179 -128 49 -41 169 -154 93
7267 93 80 -48 130 146 -38 62 -38 -327 -177 109 -123 15 56 -19 38 202 -23 87 -64 -24 117 -52
7289 -52 -45 140 -173 116 160 40 -144 -108 -148 372 87 2 310 122 -244 79 15 -125 -2 -138 -122 -75 113
7312 113 -202 -14 -203 -105 96 -83 -121 123 -98 36 -79 -20 7 -113 53 -23 30 -83 -33 -103 81 82 -93
7335 -93 -173 21 -60 -12 25 201 -266 221 117 -183 151 -73 -158 147 30 -92 -23 6 46 19 -390 -11 58 39
7359 39 -73 18 329 0 -197 106 -78 -17 9 46 14 83 69 179 -337 -372 -59 -22 -122 258 18 93 5 69
7383 69 -113 146 153 -283 -96 -135 -163 104 33 -25 -88 69 53 219 78 -106 -1 -159 65 -93 -41 76 -38
7406 -38 115 62 -77 -112 107 89 199 151 -272 -30 39 155 197 187 198 32 72 47 -10 163 -85 126 81 142 -40
7431 -40 127 -10 -213 -115 -279 148 118 -49 -63 24 150 206 -178 17 -53 157 -102 96 54 -98 -85 -64 31 5
7455 5 -4 4 -46 -8 -269 -198 -19 -148 27 -7 84 -102 75 -100 -20 -161 5 -166 -181 64 53 -99 241 -28 6
7480 6 -134 -287 299 33 -14 244 -112 -49 28 -80 62 109 38 64 -148 -33 380 -130 -72 -26 161 -12 -35 -183
7504 -183 19 -276 -165 -93 -82 196 22 -297 111 -107 48 164 1 102 -116 -217 228 63 -40 -7 106
7525 106 105 131 34 193 -28 72 131 -140 254 89 140 87 52 -87 -11 -57 20 -62 -251 34 -14 109 110 -259 156
7550 156 -25 -169 170 76 1 9 -1 -102 191 -112 105 -28 112 70 42 62 128 121 -29 60 47 191 141 85 124
7575 124 93 240 -73 -149 5 164 156 186 -135 -106 35 -17 66 -116 41 -102 -85 -123 -159 -106 170 11 166 257
7599 257 42 167 105 -23 88 165 -11 106 -27 231 46 -68 -202 285 216 -36 39 -237 43 193 157 -44
7621 -44 -151 -86 -105 21 -123 -31 -32 -101 335 119 90 -142 139 67 152 40 64 145 -167 39 18 97 -197 -23 -137
7646 -137 8 -188 -86 17 -166 39 59 -75 11 -153 -3 205 78 248 183 -347 75 168 141 -158 -60 52
7668 52 90 -60 162 -172 -77 39 70 -160 -58 113 -45 84 -128 40 -13 101 171 -8 18 126 174 -4 -37
7691 -37 -132 21 110 -13 177 65 15 -103 24 -75 44 57 304 -6 -87 88 -85 158 10 298 -57 -139 111
7714 111 109 -70 81 102 30 -96 -38 -103 135 101 71 8 -14 135 -54 139 57 133 87 206 2 -20 107 -25 53
7739 53 -108 81 -255 -8 202 217 126 13 60 120 38 4 23 63 189 79 35 -93 -28 91 118 50 136 44 -101
7764 -101 -166 -22 219 228 -193 -188 13 367 218 221 146 -4 198 -159 222 130 2 98 -184 -1 -44 -51 -117 125 -277
7789 -277 -162 32 -31 240 49 -45 -18 -20 -147 19 -18 34 -146 -153 -238 -35 94 123 -25 -5 -117 -127 17 -19 49
7814 49 200 -106 41 129 30 -79 -139 -32 59 -104 141 -10 75 153 8 28 -88 -78 148 190 65 32 -5 266
7838 266 157 -38 166 191 138 272 -103 116 -90 160 -37 -101 -78 45 32 -278 91 -22 132 142 -28 -210
7860 -210 -136 125 -47 -107 11 -73 -280 136 122 -8 -15 -3 190 167 77 169 -46 -8 -44 -128 217 -18 -107 124 -40
7885 -40 -241 53 78 -36 -17 -47 -76 -60 126 190 -332 7 11 -157 39 -193 145 73 -28 121 -30 -158 -26
7908 -26 86 -230 124 78 72 108 -220 -67 -94 -228 -182 -75 -59 -12 260 -52 -171 87 199 -1 34 -180 -134 -13
7932 -13 109 218 -143 168 27 -128 219 280 94 154 20 62 -78 230 89 120 93 -35 -7 20 138 145 -23
7955 -23 -133 168 37 169 -25 -54 -151 -40 136 -45 -3 229 -324 227 -17 53 -114 -148 -21 -227 79 -247
7977 -247 -45 -170 27 4 22 63 205 -266 114 24 134 177 231 86 16 82 159 -165 62 134 163 -82 258 -224
8001 -224 85 120 -33 327 216 -161 37 78 -79 301 223 -151 -284 -144 60 65 -21 384 -78 64 -119 102
8023 102 29 -209 200 7 -117 -197 -74 -72 147 120 167 -161 -26 97 -21 -158 257 129 14 -215 4 8 -116
8046 -116 -68 -177 -157 -198 -107 -1 260 -141 74 -169 93 -13 -70 -52 142 -58 -106 -49 -25 97 -165 -33 -151
8069 -151 -15 247 -119 64 135 349 -26 -7 -234 -128 175 -6 81 -9 26 6 247 44 227 81 136 16
8091 16 -24 -22 87 46 -200 222 -35 -123 -112 89 -49 -142 77 -15 -204 -437 185 87 8 150 -90 118 -202 92
8115 92 -121 24 -13 -105 141 -166 -180 -65 -273 -31 126 -25 229 77 62 198 -19 -165 23 -42 107 -1
8137 -1 -84 178 184 60 102 113 15 76 -92 -196 157 146 -93 46 -360 57 94 -112 -125 -35 -42 283 -4 33 -257
8162 -257 135 133 -13 -200 -127 128 178 57 78 194 37 -85 184 37 24 -3 80 236 244 -119 8 -30 -258 354
8186 354 7 21 179 121 147
8191A47
$$ Imaginary data points
##PAGE= N=2
##DATA TABLE= (X++(I..I)), XYDATA
0 0 0 0 0 0 0 0 0 0 0 0 0 0 0 0 0 -8 8 -8 8 -8 16 -16 16 -24 24 -32 33 -40 48 -53 60 -68 78 -88 99 -111 124
37 124 -140 156 -174 193 -216 239 -264 292 -321 357 -390 431 -476 523 -578 637 -702 778 -863
56 -863 956 -1067 1199 -1352 1536 -1769 2061 -2449 2988 -3784 5092 -7593 14056 -65265 -107427
71 -107427 83357 77961 41926 105884 134470 57793 23085 78673 54980 -63559 -28599 29835
83 29835 -24661 -38672 7139 32510 6195 -43190 -5094 6289 -56857 -48825 -22693 -39121
95 -39121 -47885 -46101 1915 16187 -16615 20875 49079 33802 54376 54885 44071 38467 20705
108 20705 9898 -27134 -35335 -6078 -46722 -49459 2491 -24956 -32650 17059 24278 -958 -20260
121 -20260 5448 16955 -19845 -3940 6462 -22907 -414 14463 8803 21696 15810 28291
133 28291 35961 14424 27760 23012 -5305 -14546 -37642 -37225 -34953 -56839 -32047 -13899 -17424
146 -17424 12300 23412 24813 29333 17045 21119 8901 -1664 15331 -8867 -13468 18666 522
159 522 -7566 10678 7870 8093 2758 5885 7444 -16656 -7778 -9281 -37387 -22460 -21146 -32638
173 -32638 -9787 -3453 5720 19100 16252 31585 29270 20681 29375 7866 1821 8773 -9617 -4179
187 -4179 -4435 -16650 -1350 -4156 -7277 1526 -8303 -2768 -6065 -15143 -909 -16788 -22394 -1526
201 -1526 -16517 -13935 6526 5076 12190 15520 24786 35448 17777 21119 20771 -1326 6296 -4055
215 -4055 -24289 -11929 -15968 -19397 -11154 -13897 -1606 -2729 -5333 10373 -1431 -3243 6475 -8950
229 -8950 -2870 2743 -7226 3221 2308 4752 17205 8414 14173 14992 4015 12498 -763 -9516 2200
244 2200 -13712 -16194 -6799 -13902 -4904 -4401 -5404 3846 -1856 8422 12082 -6051 6666 7604 -6238
259 -6238 3436 -2198 -5700 2552 -2731 3379 712 -2669 11155 325 -2609 7123 -6169 -1304
273 -1304 2157 -9686 -788 -2571 -5246 2743 -2617 4800 5973 -3465 10295 5309 -2387 8270
287 8270 -2489 -3799 2849 -7302 -2773 -3746 -6281 1589 -7331 -2340 5156 -6656 3454 4172 -6129
302 -6129 5807 2573 -720 4033 -3670 3451 4150 -3210 6362 -250 264 8891 -5568 -184 7068
317 7068 -5868 -1105 -2356 -4773 1856 -6902 -2504 -108 -7863 3204 -567 -5833 6841 -501
331 -501 -750 7164 -685 4509 3269 -1894 4084 -3367 -346 4938 -7446 1329 3997 -4940 4235
346 4235 279 -3055 3830 -2729 218 701 -3477 5476 -2904 -4506 5732 -4856 -2252 2572 -6897
361 -6897 688 1122 -3387 2169 -2122 2573 3393 -6088 4281 1767 -4924 5265 -1940 -1586 8046
376 8046 859 4572 4658 1181 6978 -1032 -1595 2247 -7851 -1426 -2469 -12217 -851 -2655 -8119
391 -8119 -843 -2668 1834 2929 -631 7542 758 -774 8417 -3695 -2796 5034 -2545 1765 3076
406 3076 2101 7665 1087 3224 5031 -4352 2552 -1791 -10112 -1021 -6247 -7405 -1150 -6994 -551
421 -551 1600 -3898 3191 850 2354 5771 -2797 5255 6608 -3502 5104 2156 -2845 4420 -614
436 -614 -400 736 -1590 4785 -1948 -2412 6870 -4585 -4354 1658 -9104 -6260 -3221 -5539 -1379 -3652
452 -3652 4593 8676 -1418 6641 7001 -1740 3727 -1222 -2216 2140 -5549 -897 1603 -3210 4046
467 4046 1501 9 4658 -997 3595 1651 -6793 2185 -2772 -10042 -700 -2653 -2537 311 -196 7620
483 7620 4210 5165 12013 -1356 -1576 5445 -6982 -7435 -4022 -6518 -3326 -6045 663 3730 -4910
498 -4910 2274 1694 -6219 3607 3257 1550 6492 2607 7072 5703 -2199 4009 738 -1636 3288 -1635
514 -1635 2219 2929 -4848 153 -6679 -13005 -3706 -8017 -9126 -2391 -576 4842 1613 4364 12856
529 12856 1029 1087 9149 -567 1504 6614 1423 -343 -3795 973 1231 -9178 225 3399 -5337
544 -5337 2871 3426 -1197 28 -5662 -3418 -4692 -8867 538 -2168 -3921 5895 4103 5609 4554
559 4554 -763 7470 2303 -4251 4170 -135 -1228 2628 -1466 334 -2227 -2484 2743 -5897 -2296
574 -2296 6047 -4026 -1480 3993 -1309 -1090 -2526 174 494 -5999 3235 4273 -5439 3757 3992 -2541
590 -2541 577 -1100 942 -845 -3382 5275 702 -2986 4250 -1618 -1280 2922 -1647 2226 579
605 579 102 6816 -987 -3634 493 -4299 -2290 -2606 -3303 2077 -2980 328 5347 -3016 1695 3653
621 3653 -4399 -404 905 977 1170 -4451 1907 1453 -5590 2799 572 -3560 4134 2908 2389 2529 742
638 742 4284 -2936 -4699 3266 -3870 -4024 2362 -1735 978 -38 -2610 1070 -4523 -2274 2556 -3760
654 -3760 -169 2126 291 4175 -825 487 3912 -3958 1103 4593 -1386 2692 1917 588 2376
669 2376 -1596 1039 -1255 -6436 2874 332 -4923 1382 -899 -1399 -292 -2471 883 -2605 -2207 4987
685 4987 -1755 -678 5217 -1633 134 986 -1326 2273 -1885 -570 3384 -885 3825 2306 -3066
700 -3066 2647 383 -1001 1689 -3756 280 1929 -3419 1035 -273 -2607 179 -2960 667 1350
715 1350 -4025 2264 387 -3175 2454 -1139 -2192 441 -1563 2543 -46 -244 6683 572 596 5286
731 5286 -368 2007 1780 -2415 1040 -2077 -2166 -140 -5535 -925 -88 -3973 1040 -1958 -1510 3576
747 3576 -2181 -871 1318 -2728 1989 47 -1599 2934 -18 3072 4242 -71 5185 3256 -1373
762 -1373 3439 -767 -1347 565 -4432 -1933 -2665 -4200 533 -4483 -2615 2749 -2219 1163 2572 -868
778 -868 2729 -281 -834 1827 -2254 766 298 -2128 4774 1819 -36 4616 -105 985 2351 -3064
794 -3064 -375 -1914 -3492 -258 -4458 -1136 1588 -2968 1952 1489 -574 4752 544 -357 2602 -895
810 -895 1241 -887 -3721 1235 -2308 -1940 1698 -1954 1590 2722 -1611 2485 5 -1395 1132 -2908
826 -2908 -800 -86 -2641 2373 102 -318 5023 617 1436 3732 -82 2231 -303 -2829 709 -3265
842 -3265 -2432 -1256 -5843 -871 -1037 -3586 2335 241 415 3767 -230 2520 2266 -835 1713 -1862
858 -1862 -263 3983 -1148 1561 3567 313 3752 958 -886 1420 -2601 -1910 -2510 -5974 -872 -3138
874 -3138 -4426 549 -2364 275 3338 -931 2542 2513 615 3617 -329 901 2648 -2000 1488 1014
890 1014 -1691 3303 494 -240 3234 -333 944 -2 -2905 -58 -3634 -2907 -240 -4460 -861 792
906 792 -3496 1060 1197 -386 2097 -212 2138 2668 -825 3344 571 -1282 2974 -1314 -1113 1676
922 1676 -1402 1434 -7 -1457 3226 -642 -1052 454 -3139 -79 -842 -3372 1058 -1326 -1069 3415
938 3415 -1147 602 2135 -653 1382 -1527 -437 1970 -3207 -349 1153 -2698 1856 1071 -1056
953 -1056 2160 764 1507 1307 -1208 3094 -151 -2668 2717 -889 -1261 1083 -2310 -283 -754 -2582
969 -2582 340 -3118 -1632 1826 -2383 311 1755 -922 2900 -696 -303 3399 -1068 704 1980
984 1980 -1199 1764 -79 -148 1727 -2734 1340 2754 -2946 1438 1425 -2574 -698 -2704 -1778 -1534 -3499
1001 -3499 1436 -59 -915 5369 1220 -75 3169 -152 555 -127 -1057 2225 -1994 -1207 1650 -3040
1017 -3040 -419 946 -2602 425 14 259 2302 -1474 1041 1600 -2430 717 -240 -1161 1822 -836
1033 -836 2153 3333 -393 3357 706 -3343 -750 -2727 -3413 -3294 -4594 -80 -1794 -3046 2958 217
1049 217 -195 4120 1663 3445 4038 2942 4648 -418 234 2363 -3633 -2806 -331 -2707 300 -366
1065 -366 272 2102 -2315 -904 -1722 -6273 -2546 -2965 -4059 -147 -1224 1881 3219 399 5228 4539
1081 4539 2059 5460 3636 2517 2984 -527 28 -3461 -5000 32 -4585 -4504 1071 -1080 -366 445
1097 445 -624 414 -3389 -2687 -137 -4425 -693 2322 -1187 2237 3810 4038 4895 1965 5057 4912
1113 4912 -273 2036 168 -3558 -2154 -5160 -4640 -3857 -5946 -798 -476 -1899 3574 2347 1391 2378
1129 2378 -245 1375 -1024 -2841 1810 -1203 -301 4173 1046 2149 4043 2048 2467 -438 357 1123
1145 1123 -5111 -3138 -2497 -7016 -4031 -2835 -3355 70 466 3960 5021 2503 6765 4372 -437 1937
1161 1937 -605 -1250 -1046 -3380 422 -293 -1973 2304 -429 -1246 1193 -1737 -604 -1656 -3506 -591
1177 -591 -4716 -4332 827 -1694 374 3654 3336 6405 5866 6100 6297 873 2239 1300 -4775 -3170 -3268
1194 -3268 -5708 -3244 -4274 -1676 -616 -2678 1214 237 -1535 2042 -1075 -1738 612 -1348 519
1209 519 139 273 4851 2812 3878 6781 3855 4666 3413 -305 487 -3654 -4946 -3770 -7760 -5453
1225 -5453 -3307 -4821 -1628 -572 523 3141 533 2573 3531 -162 2957 1064 -1302 1509 305
1240 305 982 2082 994 4309 3382 594 3664 345 -1129 -1141 -5194 -3977 -4406 -5894 -3137 -4113 -2303
1257 -2303 1659 497 3194 3822 2342 5002 2492 1243 3007 -1190 -764 -239 -2683 166 -493 -730
1273 -730 1486 -327 1568 1262 -2366 -155 -1264 -4245 -1923 -3791 -2553 -208 -1382 1848 2442 2213
1289 2213 5495 3075 2826 4316 639 784 -404 -3159 -1442 -3347 -3897 -1538 -3164 -103 459 -1537
1305 -1537 1577 899 125 1900 -1112 -403 379 -1750 714 48 466 3198 1262 2782 4146 1377
1321 1377 2782 806 -1939 -72 -2882 -3711 -2935 -5328 -2690 -2283 -2683 588 -578 905 3313 806
1337 806 2776 2943 45 2007 429 -175 1811 -897 680 1559 304 2649 398 -181 2096 -1753
1353 -1753 -1995 -1555 -4167 -1942 -3056 -4008 -1093 -1795 66 1706 -83 3129 3046 1159 3771 1577
1369 1577 721 1942 -704 145 -212 -1233 1696 -873 -876 1715 -644 391 242 -1902 210 -1651 -2110
1386 -2110 -525 -2574 -1090 71 -1439 1378 1066 634 3002 793 1292 2355 -594 919 -256 -1383
1402 -1383 554 -1652 -948 459 -1668 459 141 -1091 2279 173 -685 1031 -875 293 -405 -1937
1418 -1937 643 -1185 -436 1780 -870 751 1979 -640 491 -263 -384 667 -1985 -821 302 -2130
1434 -2130 633 442 -1029 1277 -22 1034 1478 -402 1975 1177 -839 1122 -238 -322 159 -1810
1450 -1810 349 -282 -1903 983 -698 -1470 702 -1253 -617 123 -672 1030 -1181 -221 2084 -633
1466 -633 271 1469 -634 682 915 292 1305 -609 1346 1121 -1801 628 619 -1654 56 -804 -290
1483 -290 380 -1296 849 -251 -1715 1505 -630 -1370 839 -227 533 -161 -732 1655 -874 -1531 876
1500 876 -893 -67 568 173 1646 68 578 2183 -1584 -103 1645 -1179 -203 458 97 343 -1765
1517 -1765 329 344 -2356 686 606 -1501 923 162 -493 -275 -1554 175 -1367 -2148 1777 490 235
1534 235 2341 1039 1575 1293 512 1521 -819 -549 1917 -1211 -1385 198 -970 -454 -1579 -999 861
1551 861 -1864 -432 1168 -1667 51 424 -1366 -871 -1253 704 672 -1092 2648 2439 298 2808 1983
1568 1983 343 626 -837 121 -1015 -1814 838 -1209 -1863 343 -1187 -931 -724 -953 1169 -240 -210
1585 -210 1555 -615 -492 252 -1343 173 -259 664 2150 -225 2122 3099 -668 310 255 -1032 -834
1602 -834 -1468 -549 -466 -2049 512 -295 -2236 1298 509 -307 1146 605 1463 257 -820 1438 -1220
1619 -1220 -1638 829 -1374 -323 1115 350 812 -205 424 1442 -1882 -1219 159 -1505 -105 -320
1635 -320 -422 1042 -950 771 1754 -529 1260 1942 -72 890 292 187 -432 -2476 -320 -741 -2742
1652 -2742 147 -345 -749 1155 -165 514 326 -596 873 -1475 -1397 1609 -238 98 1373 466 1841
1669 1841 487 544 1728 -471 620 1242 -1422 -450 -693 -1996 -1289 -2441 -966 -42 -1999 454 742
1686 742 -651 1389 668 1 363 -558 1128 -65 -680 2462 606 -288 1379 791 657 343 -201 940
1704 940 -726 -793 624 -1970 -1245 -501 -1879 -678 -591 -293 1046 -562 589 1527 -504 815 79
1721 79 -668 896 -351 185 908 -740 1173 448 -992 1224 352 -63 226 -653 264 -108 -1524 179
1739 179 -1179 -1084 798 -641 -293 638 -309 870 -192 -235 1330 -920 -181 421 -1238 330 121 -716
1757 -716 1093 -511 393 1028 -924 954 688 -265 882 -329 128 704 -1514 321 207 -854 579
1774 579 -446 -470 765 -771 -233 -248 -1296 551 -865 -777 968 -566 276 807 -876 793 316 268
1792 268 1285 -284 565 1225 -567 784 321 -472 824 -762 -176 710 -883 -86 -296 -1076 477
1809 477 -402 -605 241 -1038 299 312 -783 534 -118 -405 1060 -511 589 840 -278 998 230
1826 230 -194 1124 -629 126 744 -875 394 -335 -629 659 -665 -375 416 -787 671 138 -1014
1843 -1014 563 -427 -156 220 -1348 229 299 -792 365 -448 47 1103 -630 570 697 9 1066
1860 1066 229 -293 1122 -454 160 333 -817 873 17 -409 710 -715 -177 -52 -1265 367 -398
1877 -398 -1168 -101 -1313 -232 745 -1181 580 618 -435 1117 263 318 1110 -450 996 406 -628
1894 -628 1046 -312 -624 518 -557 360 35 -1033 287 -114 -725 307 -1202 -396 256 -1417 5
1911 5 -283 -286 1398 -480 154 1335 56 1077 476 0 1092 -391 111 626 -1118 178 465 -1218
1929 -1218 386 -317 -310 297 -1135 272 -24 -1210 380 -703 -1161 695 -680 122 654 -204 1177
1946 1177 -111 127 1497 -563 -37 455 -381 437 -287 -709 589 -796 -146 860 -755 450 583
1963 583 -297 665 -449 293 494 -1670 -67 187 -1005 488 289 -55 616 -632 438 81 -1171
1980 -1171 1166 -475 -1144 659 -245 57 -43 -415 910 72 173 1951 -270 752 1792 -518 115
1997 115 -510 -556 475 -1174 -379 647 -765 -2 203 -974 -74 -405 -160 -134 -1397 793 338 -1258
2015 -1258 1150 653 -282 599 -52 1422 751 -54 2022 157 -578 1004 -720 -1041 -222 -758 62 -953
2033 -953 -759 1072 -1238 -674 641 -889 -20 23 -615 464 -205 492 765 -1048 337 790 -692 884
2051 884 364 573 901 -443 735 378 -1162 425 -483 -1510 275 -134 52 166 -511 1175 -672
2068 -672 -1033 674 -919 -623 593 -324 640 -111 -194 785 -1059 411 1363 -705 667 1328 299 710
2086 710 -443 113 319 -1288 294 262 -751 787 134 -389 397 -623 409 -362 -1524 1011 89
2103 89 -412 506 -330 -120 46 -869 466 -457 -335 1472 -512 -26 1336 -49 344 -200 36 686 -873
2122 -873 215 1145 -885 664 576 -839 -295 -738 -515 -286 -1338 681 548 -1030 553 2 -367 -37
2140 -37 -521 62 211 -113 1837 80 -539 1514 -26 -348 82 -231 770 -280 -297 1380 -642 -374
2158 -374 377 -1268 19 105 -353 444 -714 390 863 -1209 -176 -16 -1115 28 -415 -207 728 -559
2176 -559 820 523 -842 787 34 -764 591 -103 349 213 -787 622 -245 -502 1106 -252 -29
2193 -29 874 -358 573 -306 -320 249 -1659 -1248 327 -1360 -655 -199 -674 748 -218 129 1053 -542 873
2212 873 868 -665 841 376 43 518 -263 868 514 -674 1020 477 -201 766 -782 -569 -568 -1427 -491
2231 -491 -1365 -1232 430 -511 -134 745 -182 945 647 -6 1545 -245 431 597 -750 240 796 -595
2249 -595 578 139 272 645 -544 370 37 -951 -167 -1157 -1461 -396 -1734 -528 -79 -819 985 511
2267 511 464 1692 567 796 564 -318 768 -246 -611 448 -1305 -502 348 -890 346 77 -243 660
2285 660 -884 -532 435 -945 -191 -355 -1170 611 -38 130 1118 266 1403 1150 -127 1110 -136 -692
2303 -692 -39 -1416 -1006 -495 -1504 -153 -453 -138 1140 -42 602 1444 208 772 -18 -721 548 -555
2321 -555 -61 452 -482 1113 819 -297 1126 154 116 31 -1219 -573 -956 -1858 -798 -1465 -932 229 -700
2340 -700 862 1247 769 1851 809 607 1447 83 219 153 -971 297 -210 -384 491 -541 -133 173
2358 173 -718 -71 -346 -1306 -541 -1658 -1408 -425 -1308 -157 162 126 1419 1115 1404 2398 862 1279 942
2377 942 -228 660 -566 -992 -298 -1204 -530 -75 -1121 338 -64 -489 253 -829 -438 -373 -1360 -130
2395 -130 -530 -313 850 -33 834 1549 591 1650 1216 288 1171 -317 -582 -283 -1432 -553 -1095 -1515 125
2414 125 -454 -300 680 -221 669 849 -93 726 -259 -382 761 -608 82 625 -431 896 468 127 1372
2433 1372 -203 -163 55 -893 -347 -1051 -1222 -113 -1001 -482 482 -139 1020 835 497 1419 520 926 935 -627
2453 -627 -64 98 -766 -85 -696 -537 312 -445 124 226 -377 321 -492 -792 23 -812 -211 -219 -702 807
2473 807 419 281 1598 500 1071 1314 142 504 -3 -523 209 -1264 -655 153 -1310 -458 -186 -883
2491 -883 441 -52 -240 395 -881 418 165 -843 736 435 -88 920 187 1128 830 63 1101 597
2509 597 -141 704 -512 -113 69 -890 -171 -1020 -1189 455 -734 -458 474 -261 248 422 -72 141 -762
2528 -762 -302 641 -989 627 1076 -428 796 632 405 694 -465 170 418 -863 388 -130 -925 -210
2546 -210 -471 -336 -142 -375 627 60 -584 983 -19 -256 89 -564 -47 -569 -459 541 -410 -188 960
2565 960 -374 196 257 -155 307 -551 294 645 -552 447 522 -556 593 -77 -446 126 -360 399 21
2584 21 -612 889 -109 -783 51 -410 -142 196 -581 598 -167 -16 952 -451 -366 597 -71 240 300 330
2604 330 936 -174 78 761 -874 82 400 -606 -4 -35 -39 305 -1113 125 168 -1364 359 172 -149
2623 -149 577 19 632 60 -502 620 -60 -399 581 376 153 452 -184 147 -643 -579 424 -505 52 551
2643 551 -177 244 382 -66 493 -123 283 305 -1044 -242 301 -644 -204 -350 -679 -168 -956 77 301 -397
2663 -397 749 374 14 728 -7 558 64 -472 642 34 -446 754 41 -336 474 -592 -45 -468 -420
2682 -420 230 -810 -377 596 -538 -211 -303 -690 309 -181 -56 798 -106 613 582 -44 713 189 -27 233
2702 233 -177 488 675 -566 598 -148 -212 70 -474 -280 72 -763 -71 -792 -997 444 -773 -228 285
2721 285 -6 645 416 130 1088 -258 180 460 -617 -3 110 -514 230 -52 173 567 -375 156 353
2740 353 -645 101 -65 -509 -44 -579 -246 -270 -651 494 -335 -254 752 197 365 441 -99 439 474 -670
2760 -670 33 -549 -260 380 -414 311 251 -151 549 -309 45 319 -735 47 -2 -511 296 -324 -351 216 -317
2781 -317 321 374 -473 468 -67 -313 171 -724 -108 72 -713 97 -98 -40 534 76 271 587 84 652 402
2802 402 188 513 -397 -303 306 -592 -170 196 -588 198 -266 -86 96 -571 9 -122 -837 83 -170 -528
2822 -528 634 -185 377 887 227 531 317 374 844 -53 44 102 -681 -81 21 -606 50 -56 30 -88 -507
2843 -507 176 22 -500 217 -467 -427 133 -555 25 -10 139 581 96 175 958 -58 360 484 -385 453 -33
2864 -33 -376 12 -552 -16 1 -631 303 -94 -466 328 -253 80 0 -211 147 -430 -430 280 -489 -108 454 -160
2886 -160 429 348 10 941 16 -175 360 -417 326 120 -300 342 -21 -313 279 -187 283 415 -485 247
2906 247 -16 -299 274 -287 -261 73 -494 89 -141 -464 877 -255 -132 360 -359 560 70 -506 343 -481
2926 -481 91 623 -255 354 323 -5 536 -234 -74 537 -518 -65 161 -548 -67 -170 -253 204 -454 -113
2946 -113 272 -377 558 70 -263 538 -157 225 13 -418 155 9 -80 443 -88 116 680 -479 313 -59
2966 -59 -129 -102 -397 -194 101 -491 -97 -142 -601 169 -307 -147 438 -545 271 401 3 568 14 -158 363
2987 363 -479 253 362 -324 702 223 -72 548 -93 41 260 -240 167 -288 -268 543 -493 -307 306 -300
3007 -300 -141 -107 -273 159 -269 -54 578 -600 39 313 -580 10 11 -80 469 -469 234 568 -303 444 11
3028 11 -367 402 83 268 164 -494 489 -104 -430 480 -623 -586 -5 -294 225 -51 -295 276 -480 -526 316
3049 316 -371 79 91 242 325 -103 105 788 -378 77 507 2 332 32 -219 -70 -740 -227 -415 -785
3069 -785 167 -21 -356 302 -48 -120 -2 -559 443 -101 -126 850 198 -35 452 -1 92 -201 -341 593 -390
3090 -390 -357 449 -657 -98 254 -403 317 -212 -135 71 -413 430 817 -120 390 -112 -282 -279 -794 -289 205
3111 205 -532 419 338 -421 368 -25 -108 115 -36 354 -38 -230 642 -41 -328 450 -332 -213 -56 85 567
3132 567 -70 163 552 -305 -164 305 -576 -160 -267 -252 27 -438 109 272 -230 440 312 -283 317 90
3152 90 518 421 -119 429 38 -593 328 54 -306 245 -406 273 61 -128 374 -736 -492 317 -344 -246 156
3173 156 152 515 -168 157 664 -705 -51 293 -282 515 439 47 359 -178 451 302 -647 492 177 -260
3193 -260 459 29 -4 49 -600 89 -396 -969 212 -268 -363 -1 -36 395 141 -195 375 -11 73 542 -460
3214 -460 18 200 -401 -53 -131 78 491 -215 12 348 -240 53 -5 -221 328 -411 -153 -56 -629 293 -107
3235 -107 -289 472 77 -196 251 -188 436 122 -239 378 -306 60 155 -283 369 232 -150 341 -206 -59
3255 -59 473 -443 -22 31 -349 -28 -87 -81 152 -233 21 20 -571 205 -29 -322 168 -184 256 323 -217 266 166
3278 166 -44 297 -96 212 355 -168 370 439 -197 427 -398 -284 124 -406 7 62 -438 131 -259 -200 409
3299 409 -234 185 134 -341 -244 -25 -193 444 -244 156 372 -279 258 1 -75 591 -224 311 509 -292 148
3320 148 -38 -295 559 -67 69 298 -329 211 -23 -431 368 -288 -77 276 -207 158 246 -92 365 -3
3340 -3 -272 235 -476 -124 35 -177 359 -30 -68 485 90 236 383 -288 202 -76 -281 30 -233 34 166
3361 166 -187 -72 -104 -282 15 -417 -120 87 -407 -107 -61 -125 165 -131 183 474 -144 43 637 -61 526
3382 526 203 6 311 -391 -43 215 -607 -15 -261 -383 179 -261 62 378 -193 335 -94 -260 257 -303
3402 -303 114 83 -14 133 61 -76 625 16 160 272 -360 152 218 -499 119 -311 -557 110 -629 134 -21
3423 -21 -144 514 129 29 347 -423 -154 277 -312 156 -101 -376 489 -190 89 132 -290 688 50 -347 281
3444 281 267 -260 -204 -623 184 121 -323 339 -82 271 495 -59 51 94 -160 68 -273 -609 56 -371 -175
3465 -175 172 -515 281 -76 30 390 -100 91 -61 -412 105 -188 -319 245 -256 213 552 -37 497 427
3485 427 -114 563 -139 3 141 -350 -212 -586 -521 -280 -343 -392 -96 -357 54 105 -89 178 -56 71 444
3506 444 -331 242 597 78 372 176 166 620 -68 186 132 -353 115 -276 -727 115 -510 -419 -99 -662 100
3527 100 207 23 669 40 200 484 166 -26 273 -155 144 -359 -117 344 -11 96 316 28 63 -173
3547 -173 -145 94 -467 110 -2 -678 98 -56 -147 199 -58 218 221 -69 174 108 -165 194 -95 -104 -72 -97 109
3570 109 -129 -134 473 -243 -190 526 -189 -43 -148 -381 223 -378 -158 189 -62 5 63 -158 40 287 -109 263
3592 263 -412 29 196 -610 -295 -124 -300 186 59 -3 578 254 419 20 -157 542 298 -258 250 -176
3612 -176 -152 -271 -187 146 -233 -51 53 -172 253 404 -188 -4 -57 -219 179 -563 -158 373 -211 243 93
3633 93 -125 452 -143 -2 76 -138 488 161 14 59 257 10 103 -55 337 -191 -313 32 -61 -200 0 -126
3655 -126 -178 -367 -381 163 -198 -144 647 -161 441 457 41 182 -179 184 287 -65 93 515 -250 70 150 -194
3677 -194 -8 -182 -197 -233 -421 17 -75 -292 274 -433 -323 48 -121 238 2 102 407 177 -28 479 -243
3698 -243 329 -96 -133 175 25 -2 216 -417 61 449 169 65 223 169 482 -120 4 163 -278 26 -181
3719 -181 -257 5 3 -31 102 -217 340 -141 -237 494 161 -2 242 -6 207 -41 85 190 -163 -65 60 -146
3741 -146 124 233 -60 263 -92 -260 306 -68 79 184 -643 -7 -137 -16 71 -41 48 136 -333 301 -1
3762 -1 -94 401 100 -19 14 -409 247 97 -199 110 -155 -245 138 46 214 108 14 -70 -243 -17 24 -127 46
3785 46 114 -463 168 96 -358 70 -19 -11 112 -333 154 9 -128 184 -72 -37 10 -292 122 257 -121 198 -255
3808 -255 -134 201 -144 -19 61 -438 63 -3 -91 -98 -214 0 -201 -210 -94 -13 -34 159 45 183 43 -83 504
3831 504 22 -103 211 -94 145 88 64 358 147 -62 138 -56 -79 -9 -268 -28 -181 -212 -104 -210 -44 216
3853 216 -342 -70 -36 -45 374 -149 27 141 -125 48 368 -271 413 -2 -204 263 -207 112 160 -392 -21
3874 -21 -71 -146 -263 -424 62 41 -148 127 80 -233 473 310 -61 207 -141 -7 271 76 43 19 0 314 305
3897 305 8 -28 -59 147 -10 -69 -113 -252 -145 -21 -319 21 -79 -122 445 91 -37 205 -235 90 -190 -294
3919 -294 126 -233 88 482 -16 285 -8 -86 147 5 -188 -114 -10 127 116 -124 62 -9 261 82 -405
3940 -405 128 -236 -176 61 -138 -33 49 -492 -185 -44 -203 99 -130 -96 176 -129 327 217 -400 142 -58
3961 -58 -62 229 57 116 257 156 326 302 -78 303 -153 -159 28 -397 -388 -80 -444 137 -314 -205 -85 -418 -107
3984 -107 -35 -222 -41 89 26 324 -25 305 416 -127 -44 -258 170 261 -123 153 118 -107 -22 67 -225 -227 -256
4007 -256 -104 -81 -140 59 -118 179 229 -62 -45 227 206 192 30 -57 161 -184 12 25 -399 -100 -51 -93 277
4030 277 63 119 280 -260 -309 59 -319 -117 1 -58 135 77 70 -33 -283 55 105 -465 -77 65 -142 29
4052 29 -207 -1 259 -236 237 -155 -112 382 -28 101 219 -9 326 -97 -101 8 -410 1 337 -286 313
4073 313 -96 -221 72 -290 12 156 -286 -19 58 -302 154 -330 -63 114 65 189 -108 -328 347 120 -45
4094 -45 81 -98 37 42 -35 367 -50 -200 95 -394 -73 379 -211 80 -243 -141 219 -252 -54 150 57 208
4116 208 -92 -260 119 -203 238 57 -150 391 82 -48 -11 -103 -151 6 -188 110 234 -105 220 -153 -20
4137 -20 -55 -69 43 73 233 347 -129 -164 342 -141 -100 85 59 60 220 64 262 -34 206 125 -353 102 -71
4160 -71 -225 -38 -16 379 135 -138 256 164 -24 31 130 -286 155 -160 -70 -71 -246 54 -147 -43 -36 -3 -124 4
4184 4 214 36 104 213 163 -273 309 233 -293 113 -88 37 270 -287 27 35 -202 135 164 82 -40 -211 -138
4207 -138 -92 -117 -19 123 -99 279 -8 -152 271 -156 65 -87 -73 172 73 -16 255 -228 1 -110 -105 60 54
4230 54 -205 223 -194 91 230 -336 140 -249 -154 129 -440 3 -70 -338 334 217 -230 68 -159 301 279
4251 279 -131 -50 20 -71 -7 -34 -124 291 19 62 78 18 338 -83 -81 244 -361 7 36 -250 -194 77 46 241 -80
4276 -80 -111 319 -124 -80 163 -194 166 19 152 113 -83 99 145 -56 559 -99 -160 177 117 87 9 -215 -51
4299 -51 -166 113 -52 -218 235 112 98 55 -314 -172 98 -178 223 287 -90 290 -101 -3 344 -24 62 119
4321 119 -209 57 99 68 -85 15 41 -24 -160 15 83 -394 -54 -266 -263 191 -265 73 -4 -195 189 94 -167
4344 -167 258 -97 135 278 25 311 56 -188 357 -10 7 9 -313 106 -165 24 75 -338 -131 95 -126
4365 -126 -115 84 10 115 -66 78 296 -49 -49 213 -44 231 15 66 91 -194 -15 124 -16 190 -120 -175
4387 -175 160 -103 173 37 -40 -32 -69 -94 31 -278 144 203 -108 185 -174 -155 169 -211 -52 39 -108 1 70
4410 70 -44 245 -307 67 260 42 -187 -30 -31 -47 72 -80 77 -13 95 187 31 149 -30 -14 107 -183
4432 -183 96 15 -222 56 -206 -154 325 -196 -195 164 -206 94 141 -63 203 -80 -45 167 -111 -19 362 10
4454 10 89 -104 211 -38 -377 43 -110 -397 148 -339 -66 46 -129 -63 74 -283 111 -177 78 -35 -151
4475 -151 94 103 -311 24 -113 -50 86 -107 88 330 178 -62 266 -105 182 -100 58 218 -112 103 -77
4496 -77 -317 219 -174 238 22 -225 162 -12 -426 228 -102 -67 157 -55 54 85 -73 192 45 -138 207
4517 207 -233 74 257 -37 122 120 25 73 -133 4 -54 -280 86 191 -277 84 -19 86 369 -154 136 -3
4539 -3 24 334 150 -90 170 41 -187 231 -94 230 -139 39 265 -229 -75 147 -244 109 18 9 -94 -168
4561 -168 -18 -35 -471 -84 0 -59 168 -41 178 143 -121 68 -20 -290 287 7 176 158 -12 -110 -37 -264 -52
4584 -52 3 -340 21 44 -58 -53 -26 182 -65 79 101 -224 -285 264 -71 135 27 -202 19 -148 -152 -294 -63
4607 -63 114 -66 -138 353 279 17 -15 118 169 -171 -240 168 102 23 214 -27 22 -211 -233 90 -236 -266 156 -308
4631 -308 -203 214 203 72 -38 -154 215 58 -121 510 94 48 121 -32 147 261 -51 153 -339 119 43
4652 43 -3 168 -214 -5 -219 -7 223 -14 -90 -158 -114 -61 -125 -90 103 31 -66 363 68 177 94 -46 212 -150
4676 -150 -173 56 -58 -105 180 -13 -106 -182 -148 -52 126 63 -79 -271 -241 278 -133 0 28 -329 114 -12 -39
4699 -39 51 341 113 48 -36 -21 -192 62 245 -36 -68 104 96 260 -99 -204 24 52 91 49 53 142 82 -411 133
4724 133 -314 245 -66 -143 189 150 -85 208 -190 102 160 -140 -194 71 -60 -60 -122 -141 84 -74 115 114 -5
4747 -5 132 -22 -159 136 -179 -206 -151 -45 -2 -144 -205 270 -198 58 100 -8 92 -70 -103 26 -62 -138 175
4770 175 -171 -220 114 -109 85 68 113 -91 -129 25 254 -406 150 76 -250 175 30 -252 -151 -152 123 -98
4792 -98 -189 -79 -140 -108 82 -238 105 10 -178 173 -268 -137 20 -302 19 18 -7 372 -11 170 -48 35 160
4815 160 37 -122 136 227 76 -189 -264 -2 213 -218 126 131 222 147 -129 252 62 -113 -46 -57 -24 58 -116
4838 -116 261 272 -278 257 76 -128 263 -60 73 -221 -330 -3 15 -11 -169 -84 41 62 41 -101 137 -90
4860 -90 -156 -40 -37 7 89 143 92 -168 -148 56 -56 131 -39 219 374 58 40 -22 72 171 -272 227 93 -96
4884 -96 108 -75 44 105 -48 51 -302 46 102 -37 133 99 43 -51 19 97 300 -72 -270 154 40 -203 8
4907 8 -168 -33 131 -63 -5 -187 -61 -39 -267 -49 -7 171 -3 -131 -121 185 29 -142 -149 159 16 -108 -104
4930 -104 89 -32 -44 137 -188 169 37 -42 -38 -343 -82 -67 -55 -149 12 190 154 117 -193 59 -274 43 -22
4953 -22 -7 -153 33 58 -6 -45 247 328 -59 146 -86 -44 254 13 45 136 45 30 -75 242 198 -129 -264 138
4977 138 -125 127 -117 -277 12 -176 -181 104 -86 72 32 -70 -37 79 -167 38 -8 -60 255 -247 108 -206
4999 -206 -106 344 -186 1 193 -110 -173 20 239 47 -237 -132 113 -83 -40 22 -134 37 168 -127 59
5020 59 -100 45 -102 -114 224 -13 -8 231 -83 -196 -187 65 -208 94 -109 -150 -243 6 -2 -168 103 -206 -114 -87
5044 -87 -312 -135 -115 -253 133 -127 184 87 8 -96 -7 55 39 70 -69 127 -48 -47 -142 -283 -51 110 284 344
5068 344 11 -149 220 46 -32 -228 -74 20 -67 -152 -11 -290 -193 27 236 238 -81 -131 -45 -186 -38 342 -112
5091 -112 243 12 -315 -166 47 93 167 109 241 7 -15 5 -10 -141 24 -51 51 252 44 42 -22 -117 150 -40
5115 -40 -157 -182 84 279 -98 -84 269 -109 75 60 33 120 -165 82 -61 251 -23 37 -231 43 143 -12
5137 -12 -332 17 -101 65 264 40 29 -174 19 -54 -151 23 84 166 170 203 -35 -128 46 76 -13 -40 105 145 168
5162 168 -150 9 168 -263 -125 -146 -7 -84 59 -229 -60 57 23 104 -144 241 24 -150 85 38 72 -39
5184 -39 -151 55 66 -142 161 -9 150 183 -131 14 189 -107 -5 -184 -150 225 -39 -42 63 -49 -140 -22
5206 -22 11 191 -8 -259 115 -127 -164 231 -112 -130 218 95 76 66 105 -209 -171 34 -170 -58 -83 -87 145 -23
5230 -23 53 -149 -194 -144 -32 -32 104 -145 -83 110 -127 -308 -60 -81 3 14 106 80 196 -239 -39 -134 -103 50 -226
5255 -226 59 87 254 289 243 195 -13 -84 -138 -99 28 145 -274 -283 42 -55 -119 81 7 94 -49 -45 -145 -148 352 164
5281 164 -210 79 -190 -253 69 64 -110 211 -229 86 -168 -85 339 -61 -46 37 105 91 -80 -267 124 -7 -42
5304 -42 74 -124 -313 -282 -104 189 -136 -66 254 -114 -217 -1 -151 -72 78 -22 84 8 19 249 117 190
5326 190 22 119 126 -29 -73 92 51 76 184 -234 32 0 17 -171 -299 164 -73 85 135 -32 -129 -27 36 59
5350 59 151 118 207 223 138 35 -252 65 86 -246 7 1 -97 -151 -206 116 142 -251 -214 56 -96 117 -122 116 -32
5375 -32 -57 105 -230 79 2 -94 -10 228 15 -213 86 142 40 -9 227 259 -178 -111 240 -211 -69 -165 93
5398 93 -45 -13 205 -52 -254 91 -27 -225 -94 -59 -32 -198 -359 -129 127 -6 -129 -116 -125 -138 -107 82 -72
5421 -72 -272 115 90 60 -13 -140 62 -187 -177 137 -78 -3 176 -398 -86 116 -97 -117 52 -228 0 -81 -31
5444 -31 111 -147 259 -42 78 55 -129 159 151 -180 234 246 116 -382 -83 255 92 -66 386 -69 -166 79
5466 79 -42 -17 -121 -37 97 -243 -376 128 -30 -25 -134 29 -44 35 -22 21 29 15 -95 -89 51 -4 -16 93 -61
5491 -61 -4 -156 -137 -28 24 -27 -133 -68 -139 -9 59 -64 138 -165 151 -3 98 84 -169 196 58 -26 9 -2
5515 -2 -94 151 -47 -263 147 -21 -183 283 -167 -289 -70 -216 -25 -61 -31 -101 -222 13 -119 -145 169 -89
5537 -89 305 90 -81 -174 84 -120 58 -169 18 55 26 51 -112 -56 231 78 -248 94 -267 214 295 -177
5559 -177 129 243 -13 -68 -229 -146 204 -85 -139 179 166 -110 -152 -78 -44 -258 -36 176 14 84 49 19 86 -12
5583 -12 -111 37 -134 100 115 18 242 -434 86 -168 -131 123 84 -139 32 16 -114 84 135 183 -107 -11 193
5606 193 98 -234 -24 104 153 -193 -185 47 -247 50 13 -70 91 37 -156 -175 -70 -9 129 -178 -48 -1 98 122
5630 122 75 80 165 -102 -327 -17 -35 380 -160 207 149 -173 -76 204 153 -28 143 55 379 2 6 169 -184 173
5654 173 -26 -19 -56 -213 -43 -197 -47 -7 64 -38 -97 99 -49 -117 21 -260 55 -175 248 145 72 86 71
5677 71 188 -113 -110 411 -252 -51 -48 -186 -17 -216 -112 51 -33 17 -145 -110 26 39 156 57 35 -78 203 -54
5701 -54 175 137 -193 -86 -19 -100 7 68 90 53 -179 -31 41 -390 14 -48 -3 273 -33 189 60 -2 153 -4
5725 -4 -160 222 -163 -80 -189 122 94 149 -63 5 52 -59 83 -155 404 54 -125 60 -87 -43 52 -11 27 79
5749 79 -200 -123 186 131 -111 32 202 -109 -16 113 -85 0 6 -283 15 238 -90 -24 75 145 -38 -34 162 41
5773 41 50 369 55 186 9 62 37 90 -30 265 133 -192 236 -155 24 -157 -28 208 -61 52 -182 -70
5795 -70 -27 94 -161 105 127 -69 48 348 233 71 -143 -56 -187 -37 54 34 -88 84 44 -150 -92 13 292
5818 292 8 -196 -38 -73 114 -38 -241 224 74 -167 -42 -131 -44 8 -266 68 -174 -64 -142 89 -62 -253
5840 -253 -2 130 -87 7 -78 112 0 189 -57 -161 249 42 -20 99 56 -3 -159 149 -121 100 -46 22
5862 22 9 -57 40 -54 105 37 -98 71 80 66 230 -228 85 102 48 -58 1 85 -104 86 188 -145 -40 476
5886 476 -58 94 50 -33 -26 89 210 36 64 34 -74 -40 80 11 165 -64 -77 296 7 -145 284 -150 -140
5909 -140 -40 -63 -210 58 100 21 -103 -243 -100 73 -237 8 -168 -145 11 16 112 -61 22 -21 -20 71 -18 -158
5933 -158 134 -98 -114 0 170 97 262 -203 -223 -82 5 4 102 -41 139 -59 -8 16 18 64 -24 26 -244 85 98
5958 98 -1 -132 95 -125 19 -115 -134 172 92 39 -88 -111 4 75 50 -105 -244 203 123 19 -84 -11 5 -14
5982 -14 -91 82 -103 -264 -75 233 32 326 50 62 -17 92 128 -84 36 116 164 -96 45 -279 -179 -102 65
6005 65 111 -88 124 250 71 -195 84 -62 -56 -132 -88 147 -250 106 -55 -137 266 -11 -173 -23 -33 -135 7
6028 7 22 67 195 22 102 -20 9 95 219 -126 13 -171 -28 -80 42 127 88 144 338 143 69 171 137 30
6052 30 -32 -254 151 -149 -190 173 -94 -112 176 175 280 -108 -51 117 180 194 -17 10 40 120 -195 -110 -159 -77 59
6077 59 -294 283 -99 66 290 -219 -206 58 26 -178 104 97 -51 -209 21 -114 -40 196 -248 -149 -28 -52 202
6100 202 112 -18 -27 -1 -55 3 -31 -35 -39 -106 40 -229 -295 56 -78 -536 59 -114 25 121 -259 -91 177 -138 -102
6125 -102 -59 48 -4 -144 135 36 120 16 118 -28 163 -92 263 46 -402 -55 -7 -190 300 -5 -97 38
6147 38 38 45 -18 -30 72 -2 6 -54 -43 239 -26 -143 57 39 -96 -106 -145 149 44 -222 -193 -1 -39 -166 -257 -2
6173 -2 -337 84 68 107 -250 106 -35 118 -6 -190 98 -176 81 -88 -41 -128 181 100 163 176 -9 93 25
6196 25 158 99 -250 12 -60 -25 138 -104 57 -53 -102 -46 -97 51 34 -252 -254 159 -207 16 9 -105 72 -137
6220 -137 229 -44 -8 195 188 -14 -140 75 -125 -26 196 191 -25 5 136 -108 -153 146 -175 125 -110 60 -148
6243 -148 84 129 -14 -149 -109 218 215 79 -58 81 -227 -209 259 54 -300 -57 80 202 -68 -271 199 -10
6265 -10 -190 -101 -243 -352 32 -91 26 93 -160 -54 15 -2 -157 -114 -89 184 -119 132 -105 94 -26 -52 -341
6288 -341 180 2 44 -11 -148 -29 193 87 -88 -78 121 -193 -148 25 24 -235 86 107 109 23 -155 50 199
6311 199 -54 12 -94 -170 65 -302 79 408 152 163 -3 -172 109 -186 145 -91 -9 41 89 -67 59 -96
6333 -96 -234 -91 -62 25 26 237 9 15 2 -282 -98 74 55 -242 4 -117 19 -55 -15 32 296 -21 -51 -26 -91
6358 -91 -182 15 62 351 -236 -159 142 -16 351 74 39 60 -153 98 57 -238 58 4 -148 -89 -4 -75 -153 -145 234
6383 234 215 12 154 6 -192 81 -45 -85 -183 -232 -100 -207 190 -201 -96 89 49 102 -195 101 220 -62
6405 -62 84 -91 42 -181 -222 3 -59 7 169 -75 -110 41 12 -196 185 15 -167 -225 12 -60 -137 3 147
6428 147 287 -32 130 279 -212 -132 11 57 17 12 -280 -19 -112 -87 168 14 102 136 165 -44 -216 93 117 84
6452 84 -49 -342 -143 94 34 244 62 -1 -17 -151 -137 -158 -200 46 208 228 90 -145 227 177 -37 -11 129
6475 129 239 92 -92 301 218 -123 -21 -260 -218 6 -74 192 62 -77 -220 20 -21 35 101 62 65 87 -8 -83
6499 -83 -165 -25 -217 57 -70 -66 -59 196 74 36 187 24 41 -114 -202 -152 -94 96 -139 -74 -58 -203 173 14
6523 14 -10 -39 186 217 2 164 -85 78 67 -75 -162 208 6 150 201 111 -108 -16 11 -81 20 -199 147 162
6547 162 173 -243 -149 147 10 -271 -91 228 8 -236 -22 -82 24 -19 5 25 -49 -14 31 105 -65 65 -21 29
6571 29 249 116 213 49 63 -36 145 -152 -167 -193 63 -161 -189 25 -11 274 -208 57 143 -103 277 -44 30
6594 30 -79 -27 -113 -75 -86 111 -50 -70 -57 -50 -77 39 -146 -54 -75 57 91 104 -192 -44 -159 -67 -103 -145 73 129
6620 129 161 -22 193 -158 -94 -26 -250 -93 -7 103 79 28 -27 209 -123 49 -73 -2 -85 -52 100 98 -104 -226
6644 -226 -158 -108 -23 -144 151 -123 143 71 -250 179 -171 72 -59 2 -206 53 12 39 214 -211 107 -155
6666 -155 -112 -58 -61 11 7 -136 -178 1 142 -240 71 254 -33 -145 127 215 -231 51 -294 -7 211 45 -34
6689 -34 18 -96 23 -128 -43 -69 -31 45 -95 23 178 -207 -5 56 177 73 69 -6 261 141 -15 -96 93 30
6713 30 -190 -107 123 54 -102 141 49 87 -93 -143 387 -89 -182 58 48 206 99 -163 -48 21 -81 160 -4
6736 -4 -2 -64 30 -36 165 -30 -51 14 199 51 -43 -191 200 -198 -47 15 86 28 -291 4 -44 -107 45 -149 -31
6761 -31 119 -235 112 -193 49 225 26 -23 -31 -244 7 145 223 -213 148 93 -375 133 -38 59 -274 -43
6783 -43 263 149 -175 160 -55 114 -234 50 107 80 -23 -103 -155 -23 -98 101 -3 185 102 -40 29 -1 -49
6806 -49 -152 137 88 189 40 101 -34 -74 119 14 -23 -36 64 114 44 89 194 -129 -146 43 -153 72 349
6829 349 -236 -63 8 -61 -49 316 -35 -59 57 87 190 114 -34 97 -164 41 77 -43 115 -102 -189 -139 181
6852 181 74 -120 -116 -329 -57 21 -190 -255 -173 101 -83 160 -100 59 151 143 15 -3 34 10 11 -2 244 -43 -48
6877 -48 224 168 76 -208 -11 218 -109 -251 -1 -86 -249 45 108 -8 7 110 178 -293 -157 172 -59 94
6899 94 -1 69 -19 -61 -104 301 -140 -26 -73 -265 73 -187 255 37 -4 -172 -244 -282 101 -1 -2 -85 -50 -47 -161
6924 -161 7 48 -269 217 132 70 158 -192 81 217 80 -278 159 -231 233 -129 18 -152 -104 -52 -18 -21 192
6947 192 -88 -71 110 -33 2 -99 10 -201 98 -93 -46 280 89 84 -7 200 139 88 26 73 -180 186 87 -81
6971 -81 -222 78 -52 -105 -28 -58 61 27 85 -101 -71 118 150 -156 80 109 -59 234 -65 -5 -135 128 6
6994 6 118 95 71 37 151 102 155 54 -351 102 30 22 -13 -133 68 251 -29 25 -53 -20 36 160 -210 -39 68
7019 68 -67 -96 -218 -266 -57 195 -99 126 7 -36 -92 81 22 -39 -305 81 -10 -199 -111 283 69 -52 -109
7042 -109 -210 204 -231 180 22 -79 76 246 73 96 -83 127 -20 -166 -201 36 193 53 -217 -2 179
7063 179 -78 -66 38 59 -136 -94 31 -80 -45 -102 44 -12 -135 60 -177 173 -9 54 242 142 20 -98
7085 -98 -6 167 63 -39 172 -60 -8 204 -10 15 147 20 108 -33 46 -174 -11 193 17 -112 -267 -305
7107 -305 -42 16 -152 197 -73 9 -58 -119 101 -79 -196 -221 79 -6 -68 -38 -153 -160 -136 54 -157 56 40 91
7131 91 -131 13 80 161 182 -26 -159 -71 -25 -173 -129 -128 32 -4 -46 -29 -111 264 -41 -116 13 -7 68 -51 -370
7156 -370 77 -99 -144 -94 108 -49 -55 -6 137 -1 40 -47 -28 85 -8 -111 -62 109 18 51 70 -15 198 -82 -10
7181 -10 55 -70 -120 -153 -272 115 3 124 127 -119 72 50 93 54 7 93 -241 108 -122 69 -239 -229 -385 86
7205 86 190 86 79 61 -152 148 120 -124 -34 196 0 59 38 393 93 -255 132 -96 -93 29 118 193 124 -129
7229 -129 48 -67 36 138 -101 -36 -136 -112 -49 73 -83 -134 -33 -107 90 -45 13 -35 179 -244 118 84 -63
7252 -63 -237 -67 -61 -2 74 -5 178 19 -39 252 -214 -8 208 -200 49 96 -74 39 129 106 5 57 -238 99
7276 99 256 -57 -155 118 -5 160 37 -61 105 18 29 -39 241 -296 137 -29 148 -9 35 37 136 95 200 134
7300 134 -91 82 158 13 -40 40 -11 26 55 -162 126 -159 52 -53 -166 -156 -140 60 43 -173 -31 -244 -2
7323 -2 80 -61 -261 -102 9 -197 -11 149 72 69 -49 -92 49 304 53 -147 211 -117 -94 33 -6 -136 157
7346 157 -222 56 -94 -313 91 74 -180 -248 265 133 -31 113 -142 -87 -105 16 -225 261 87 -182 131
7367 131 -165 -138 -13 17 -8 -55 244 78 -20 131 -28 15 70 -98 -294 118 -142 -9 64 26 -202 221 -139
7390 -139 147 -35 -134 -160 -68 -176 -128 38 -22 -32 -189 16 -76 248 139 -14 75 272 23 92 34 -50 24 109
7414 109 156 113 -143 7 223 302 133 -131 -90 -83 68 50 -17 48 47 254 -85 -155 260 -19 92 15 -136 258
7438 258 76 92 -19 90 174 52 226 -242 -3 -48 -124 -126 -257 21 -86 157 -147 -40 21 -178 149 -81
7460 -81 -68 -190 0 107 -140 21 -79 116 -188 14 -34 -24 81 -65 11 -61 -15 64 -143 -111 -124 108 364
7483 364 -39 -20 43 -309 -6 161 51 23 -118 328 -194 77 27 19 -51 -59 46 -115 -131 -13 -298 11 159
7506 159 -104 -11 -135 112 117 -199 8 92 85 -94 167 136 -213 -95 51 -72 -54 118 13 -11 120 -115 -131
7529 -131 -55 161 29 60 -178 21 31 -98 -68 -47 221 -83 -23 -122 120 109 9 -192 -240 -153 -70 -207 -175 -146
7553 -146 -137 -58 106 -24 -54 165 -265 84 93 164 51 -39 260 47 -45 -43 101 15 80 71 -48 -31 -169 42 57 113
7579 113 -121 -24 -109 227 -157 -67 68 -78 52 -165 -59 -90 45 -24 -118 -115 -245 -190 -69 124 4 -148 -22
7602 -22 -211 176 25 -159 -52 176 70 -79 -15 24 11 116 -62 -89 -21 -60 -300 88 -42 -184 240 93
7624 93 -5 302 -35 30 -128 108 54 -101 106 -151 -209 -154 151 -5 12 -101 -44 -140 -76 136 -127 -104 98 256
7648 256 31 64 13 59 -19 150 66 -170 105 157 -123 -2 26 -126 36 46 -18 -82 191 44 -201 -78 -226
7671 -226 202 -143 -199 -63 216 -64 153 -41 136 -1 -183 -60 207 149 -37 -211 79 161 57 287 -3
7692 -3 187 47 202 -145 -83 93 -14 135 251 -103 220 -231 42 75 -50 -54 53 48 182 -97 116 -25 77
7715 77 -9 -129 70 -114 88 195 113 -94 15 138 -82 294 121 9 -27 -222 45 -74 79 -120 12
7736 12 30 -28 -101 -45 -183 -70 -36 -14 253 -61 13 -109 33 -124 64 -114 -229 -26 76 88 143 61 -93 37
7760 37 -371 -38 68 -30 80 -42 27 -163 53 143 -154 3 -48 -64 56 33 98 -128 246 61 70 5 -36 32
7784 32 83 -20 88 -96 -12 -85 -211 203 -41 121 -26 6 -101 87 87 26 -279 -157 -98 -40 4 355 114 -78
7808 -78 165 106 325 59 71 224 -193 90 140 -332 -98 330 162 162 -32 93 -113 -16 21 183 -12 80 -88
7831 -88 -33 305 -24 60 106 116 40 -1 -248 -140 -167 4 41 -153 47 22 211 29 -235 45 70 14 134 -191
7855 -191 -162 -96 -107 7 -39 -62 72 -121 -5 -51 177 191 4 12 216 33 -41 -177 -207 -116 35 -45 94 -48
7879 -48 -18 129 -174 -52 86 -32 116 28 -90 161 27 -80 281 -205 99 -84 -7 -101 -12 242 -59 -54 139
7902 139 9 -24 -53 -14 -10 -57 -43 23 381 -211 100 -90 52 -71 -110 187 -78 -102 365 -3 -385 -117 194
7925 194 32 104 3 -233 -23 -72 -107 -66 -111 -240 -64 -6 202 25 11 -114 -101 83 -244 -63 135 162 -98
7948 -98 92 166 248 86 -127 138 -372 -142 51 -94 -110 108 43 67 96 300 279 -146 150 -50 27 -24 75 -34
7972 -34 160 70 -44 -100 -174 119 -111 -157 135 -23 149 -141 79 -53 -70 -81 24 -117 24 148 135 -10 -104
7995 -104 151 39 -41 214 -4 -117 120 36 38 -124 19 -6 -65 -71 -111 72 277 -184 449 159 -40 138 39
8018 39 -183 -23 235 -179 254 -91 -170 -224 -89 131 6 -56 210 -170 65 -69 179 -78 106 -412 122
8039 122 -88 144 -110 -28 41 37 17 -237 38 -153 -72 18 110 -79 336 203 138 71 139 -42 -17 -46 -159 -26
8063 -26 66 -117 86 -161 -106 -1 74 189 160 -27 308 32 -13 -103 -3 -122 19 -104 -28 43 155 333 -136
8086 -136 13 22 -98 -173 113 -73 51 143 104 -5 -209 79 -37 -92 221 53 20 73 -124 57 13 -111 62
8109 62 74 105 149 53 -230 -209 36 270 214 -146 88 -166 55 -50 -196 68 -26 -14 -36 -146 -3 10 186 -284
8133 -284 127 184 -256 -59 82 -121 -113 -26 229 -43 44 143 -135 164 -99 64 -200 2 9 -374 33 -37 -177
8156 -177 -121 329 81 79 -96 328 176 32 -158 177 216 -42 32 -58 161 279 -83 22 -86 -176 97 -60
8178 -60 -53 -12 -236 -144 -55 165 8 144 -146 -48 -193 -378 4
8191D
##END NTUPLES=NMR FID
##END=
