##TITLE=1H_Pr Eth-dep
 CDCl3
 8 sc, 
 25.10.2022
##JCAMPDX= 6.0         $$ Bruker NMR JCAMP-DX V2.0
##DATA TYPE= NMR FID
##DATA CLASS= NTUPLES
##ORIGIN= UXNMR, Bruker Analytische Messtechnik GmbH
##OWNER= root
$$ XWIN-NMR		Version 3.5
$$ Tue Oct 25 15:23:14 2022 Russian Standard Time (UT+4h)  she@DPX200
##.OBSERVE FREQUENCY= 200.1313499994
##.OBSERVE NUCLEUS= ^1H
##.DELAY= (6, 6)
##.ACQUISITION MODE= SIMULTANEOUS
##.ACQUISITION SCHEME= undefined
##.AVERAGES= 8
##.DIGITISER RES= 18
##SPECTROMETER/DATA SYSTEM= spect
##.PULSE SEQUENCE= zg30
##.SOLVENT NAME= CDCl3
##.SHIFT REFERENCE= (INTERNAL, CDCl3, 0, 15.7039)
##AUDIT TRAIL= $$ (NUMBER, WHEN, WHO, WHERE, WHAT)
$$ ##TITLE= Audit trail, XWIN-NMR		Version 3.5
$$ ##JCAMPDX= 5.01
$$ ##ORIGIN= Bruker BioSpin GmbH
$$ ##OWNER= she
$$ F:/spectra/data/she/nmr/H-F/1/audita.txt
$$ ##AUDIT TRAIL=  $$ (NUMBER, WHEN, WHO, WHERE, WHAT)
(   1,<2022-10-25 15:22:14.65 +0400>,<she>,<DPX200>,
      <created by zg, POWCHK disabled, PULCHK disabled
       configuration hash MD5:
       00 E9 B6 7A A2 85 ED C7 34 08 36 98 17 FE 4E 26
       data hash MD5: 16K
       5C 7D 8D 57 AC 4D A9 08 95 C4 0A C6 58 1B B0 4F>)
$$ ##END=
$$ 
$$ hash MD5
$$ 48 4E DE 63 89 EF 3F F1 64 D7 BD 2C 37 11 73 73
##$RELAX= 
##$RELAX= 
##$RELAX= 
##$RELAX= 
##$RELAX= 
##$RELAX= 
$$ Bruker specific parameters
$$ --------------------------
##$DU= <F:/spectra>
##$EXPNO= 1
##$NAME= <H-F>
##$PROCNO= 1
##$TYPE= <nmr>
##$USER= <she>
##$AMP= (0..31)
100 100 100 100 100 100 100 100 100 100 100 100 100 100 100 100 100 100 
100 100 100 100 100 100 100 100 100 100 100 100 100 100 
##$AQSEQ= 0
##$AQ_mod= 1
##$AUNM= <au_zg>
##$AUTOPOS= <>
##$BF1= 200.13
##$BF2= 200.13
##$BF3= 200.13
##$BF4= 200.13
##$BF5= 200.13
##$BF6= 200.13
##$BF7= 200.13
##$BF8= 200.13
##$BYTORDA= 1
##$CFDGTYP= 0
##$CFRGTYP= 5
##$CHEMSTR= <none>
##$CNST= (0..31)
1 1 145 1 1 1 1 1 1 1 1 1 1 1 1 1 1 1 1 1 1 1 1 1 1 1 1 1 1 1 1 1 
##$CPDPRG= <>
##$CPDPRG1= <>
##$CPDPRG2= <>
##$CPDPRG3= <>
##$CPDPRG4= <mlev>
##$CPDPRG5= <mlev>
##$CPDPRG6= <mlev>
##$CPDPRG7= <mlev>
##$CPDPRG8= <mlev>
##$CPDPRGB= <>
##$CPDPRGT= <>
##$D= (0..31)
0 1.2 0 0 0 0 0 0 0 0.06 0 0.03 0 0 0 0 0.0002 0 0 0 0 0 0 0 0 0 0 0 0 
0 0 0 
##$DATE= 1666696934
##$DBL= (0..7)
120 120 120 120 120 120 120 120 
##$DBP= (0..7)
150 150 150 150 150 150 150 150 
##$DBP07= 0
##$DBPNAM0= <>
##$DBPNAM1= <>
##$DBPNAM2= <>
##$DBPNAM3= <>
##$DBPNAM4= <>
##$DBPNAM5= <>
##$DBPNAM6= <>
##$DBPNAM7= <>
##$DBPOAL= (0..7)
0.5 0.5 0.5 0.5 0.5 0.5 0.5 0.5 
##$DBPOFFS= (0..7)
0 0 0 0 0 0 0 0 
##$DE= 6
##$DECBNUC= <off>
##$DECIM= 32
##$DECNUC= <off>
##$DECSTAT= 4
##$DIGMOD= 1
##$DIGTYP= 9
##$DL= (0..7)
0 120 120 120 120 120 120 120 
##$DP= (0..7)
150 150 150 150 150 150 150 150 
##$DP07= 0
##$DPNAME0= <>
##$DPNAME1= <>
##$DPNAME2= <>
##$DPNAME3= <>
##$DPNAME4= <>
##$DPNAME5= <>
##$DPNAME6= <>
##$DPNAME7= <>
##$DPOAL= (0..7)
0.5 0.5 0.5 0.5 0.5 0.5 0.5 0.5 
##$DPOFFS= (0..7)
0 0 0 0 0 0 0 0 
##$DQDMODE= 0
##$DR= 18
##$DS= 0
##$DSLIST= <SSSSSSSSSSSSSSS>
$$ [...]
##$SUBNAM2= <"">
##$SUBNAM3= <"">
##$SUBNAM4= <"">
##$SUBNAM5= <"">
##$SUBNAM6= <"">
##$SUBNAM7= <"">
##$SUBNAM8= <"">
##$SUBNAM9= <"">
##$SW= 18.0517283424941
##$SWIBOX= (0..15)
0 0 2 0 0 0 0 0 0 0 0 0 0 0 0 0 
##$SW_h= 3612.71676300578
##$TD= 16384
##$TD0= 1
##$TE= 0
##$TE2= 300
##$TE3= 300
##$TEG= 300
##$TL= (0..7)
0 120 120 120 120 120 120 120 
##$TP= (0..7)
150 150 150 150 150 150 150 150 
##$TP07= 0
##$TPNAME0= <>
##$TPNAME1= <>
##$TPNAME2= <>
##$TPNAME3= <>
##$TPNAME4= <>
##$TPNAME5= <>
##$TPNAME6= <>
##$TPNAME7= <>
##$TPOAL= (0..7)
0.5 0.5 0.5 0.5 0.5 0.5 0.5 0.5 
##$TPOFFS= (0..7)
0 0 0 0 0 0 0 0 
##$TUNHIN= 0
##$TUNHOUT= 0
##$TUNXOUT= 0
##$USERA1= <user>
##$USERA2= <user>
##$USERA3= <user>
##$USERA4= <user>
##$USERA5= <user>
##$V9= 5
##$VALIST= <valist>
##$VCLIST= <CCCCCCCCCCCCCCC>
##$VD= 0
##$VDLIST= <DDDDDDDDDDDDDDD>
##$VPLIST= <PPPPPPPPPPPPPPP>
##$VTLIST= <TTTTTTTTTTTTTTT>
##$WBST= 1024
##$WBSW= 4
##$XGAIN= (0..3)
0 0 0 0 
##$XL= 0
##$YL= 0
##$YMAX_a= 87822
##$YMIN_a= -145477
##$ZGOPTNS= <>
##$ZL1= 120
##$ZL2= 120
##$ZL3= 120
##$ZL4= 120
##$ABSF1= 10
##$ABSF2= 0
##$ABSG= 5
##$ABSL= 3
##$ALPHA= 0
##$AQORDER= 0
##$ASSFAC= 0
##$ASSFACI= 0
##$ASSFACX= 0
##$ASSWID= 0
##$AUNMP= <proc_1d>
##$AZFE= 0.1
##$AZFW= 0.1
##$BCFW= 1
##$BC_mod= 2
##$BYTORDP= 1
##$COROFFS= 0
##$CY= 11.3945322036743
##$DATMOD= 1
##$DC= 2
##$DFILT= <>
##$DTYPP= 0
##$F1P= 2.36226072786647
##$F2P= -0.459571619588291
##$FCOR= 0.5
##$FTSIZE= 0
##$FT_mod= 4
##$GAMMA= 1
##$GB= 0.15
##$INTBC= 1
##$INTSCL= 1
##$ISEN= 128
##$LB= 0.24
##$LEV0= 0
##$LPBIN= 0
##$MAXI= 10000
##$MC2= 0
##$MEAN= 0
##$ME_mod= 0
##$MI= 1.114404
##$NCOEF= 0
##$NC_proc= 0
##$NLEV= 6
##$NOISF1= 3.799351
##$NOISF2= 2.8
##$NSP= 1
##$NTH_PI= 0
##$NZP= 0
##$OFFSET= 15.70392
##$PC= 1
##$PHC0= -18036.94
##$PHC1= 13.8007
##$PH_mod= 1
##$PKNL= yes
##$PPARMOD= 0
##$PSCAL= 0
##$PSIGN= 0
##$REVERSE= no
##$SF= 200.130013532006
##$SI= 16384
##$SIGF1= 3
##$SIGF2= 2
##$SINO= 400
##$SIOLD= 16384
##$SREGLST= <1H.CDCl3>
##$SSB= 0
##$STSI= 0
##$STSR= 0
##$SW_p= 3612.71676300578
##$SYMM= 0
##$S_DEV= 0
##$TDeff= 0
##$TDoff= 0
##$TI= <>
##$TILT= no
##$TM1= 0
##$TM2= 0
##$TOPLEV= 0
##$USERP1= <user>
##$USERP2= <user>
##$USERP3= <user>
##$USERP4= <user>
##$USERP5= <user>
##$WDW= 1
##$XDIM= 8192
##$YMAX_p= 0
##$YMIN_p= 0
$$ End of Bruker specific parameters
$$ ---------------------------------
##NTUPLES= NMR FID
##VAR_NAME=  TIME,          FID/REAL,        FID/IMAG
##SYMBOL=    X,             R,               I
##VAR_TYPE=  INDEPENDENT,   DEPENDENT,       DEPENDENT
##VAR_FORM=  AFFN,          ASDF,            ASDF
##VAR_DIM=   8192,          8192,            8192
##UNITS=     SECONDS,       ARBITRARY UNITS, ARBITRARY UNITS
##FACTOR=    0.0002768,     1,               1
##FIRST=     0,             0,               0
##LAST=      2.2672688,     0,               0
##MIN=       0,             -145477,         0
##MAX=       2.2672688,     87822,           0
$$ Real data points
##PAGE= N=1
##DATA TABLE= (X++(R..R)), XYDATA
0 0 0 0 0 0 0 0 0 0 0 0 0 0 0 0 -8 8 -8 8 -8 16 -16 16 -24 24 -32 40 -41 48 -56 64 -77 88 -97 112 -128 144
36 144 -160 180 -201 224 -249 277 -309 341 -377 417 -461 508 -559 616 -678 749 -826 910 -1004
55 -1004 1114 -1235 1376 -1537 1729 -1959 2237 -2590 3046 -3668 4562 -5971 8531 -14690 64736
70 64736 -572 -117740 19591 80987 -2494 -72968 -18831 14189 11800 10649 5008 -28518
82 -28518 -6925 48459 36853 -38998 -42034 22284 33778 -26064 -42752 -5876 10762 -2544
94 -2544 -1846 -4036 -12078 8874 37476 9778 -26777 1063 36887 5328 -27919 -3016 14800
107 14800 -9544 -12020 12267 3642 -14833 9388 27509 -4453 -19983 14091 19413 -22106 -25010
120 -25010 14812 5309 -36543 -17125 27788 5241 -33231 630 40413 6133 -27152 7942
132 7942 33914 -2792 -25702 3287 17028 -7059 -13821 4368 6618 -771 7163 8496 -5167
145 -5167 -320 17307 5778 -20158 -11927 10983 -374 -22195 -11780 5458 -1341 -6230 4832
158 4832 3515 -6380 6453 20384 176 -19002 1727 19934 -777 -19212 -3644 10914 3787
171 3787 41 4328 -243 -135 15316 14415 -12343 -16906 10714 14962 -16106 -24918 1382 10007
185 10007 -8060 -11105 3429 3765 -2879 5270 9499 -4672 -8927 6710 10722 -6419 -12217 1251
199 1251 7497 1359 -330 1350 1047 6815 13229 3051 -10331 -881 13845 2275 -17455 -10640
213 -10640 6334 1245 -11169 -6673 2254 707 155 3640 75 -4378 1899 7345 -2360 -9831 -851
228 -851 5882 -624 -4891 1659 5697 2659 4175 6705 1924 -603 6469 6317 -5465 -8804 2261
243 2261 3984 -8130 -10199 1393 3991 -3645 -3808 2231 2023 -963 942 455 -4148 -2454 2295
258 2295 -985 -5731 -893 5227 2015 -1051 4033 6917 2510 1708 5347 3023 -2877 -1437 3333
273 3333 -1360 -7294 -3042 2563 -795 -5178 -1246 2633 137 -1817 11 -1210 -2595 -654 7
288 7 -4291 -4155 1611 2482 -2073 -1037 5373 5521 898 1996 5078 2781 -325 797 1547 -2206 -2706
305 -2706 277 89 -2963 -1807 2049 695 -2345 -715 1042 -1257 -2916 -1152 -1624 -3692 -2459 -317
321 -317 -1392 -2446 1270 3969 1765 497 3951 5017 1593 504 2131 2119 -791 -1276 539 -154
337 -154 -1411 -194 929 -444 -739 961 118 -1790 -1809 -316 -2570 -4127 -1989 -779 -2524 -2351 389
354 389 1729 577 940 2719 2906 1465 2121 2197 877 18 725 787 -345 -793 586 797 -9 83 780
373 780 56 -911 -707 -973 -2433 -2739 -1830 -2405 -3171 -1811 131 -329 -935 753 2715 1727 669 1028
391 1028 2051 1702 900 -61 57 762 1528 919 -266 279 1832 2201 -143 -1093 -493 292 -695 -2522
409 -2522 -3601 -2548 -1173 -1261 -2213 -2782 -708 1641 1492 -179 -137 1290 2267 1844 201 -771 57 2386
427 2386 2444 -250 -1358 1210 4056 2100 -1040 -866 1360 1549 -575 -2447 -2757 -2187 -578 -27 -2714
444 -2714 -4692 -1270 3200 1766 -3261 -2982 2307 4722 903 -3181 -1376 2975 3610 182 -1829 -90
460 -90 3154 3997 1504 -1394 -842 2807 3746 -647 -4637 -2427 2055 1201 -4185 -5546 -437 2635 -1131
477 -1131 -3847 -1524 1931 649 -469 -552 -387 -539 1105 1626 -376 -1526 1555 4038 1267 -1651
493 -1651 1225 4931 2328 -2425 -370 3537 806 -3712 -2138 1724 -421 -3924 -2609 704 -2
508 -2 -2052 -1319 204 -491 -1251 -22 940 -1234 -2508 1021 3165 -10 -2361 1045 4786 2452 -876
525 -876 401 3289 2189 -632 -590 705 -471 -1310 141 559 -3012 -3485 1110 2522 -2736 -4973 -250
542 -250 3265 -187 -4026 -2274 1205 1132 -560 -344 -194 -182 2555 4611 734 -3746 347 7651 4306
559 4306 -4571 -4475 3721 5646 -1388 -6023 -1811 3358 2121 -2917 -3855 -918 1141 911 -1187 -3519
575 -3519 -3239 1223 3607 -1475 -5557 -1185 5260 3382 -3008 -2866 3550 6006 1333 -2699 -9 3762
591 3762 2470 -993 -1170 -50 437 968 24 -2220 -1903 952 1523 -1906 -3224 -771 1103 -1030 -2878
608 -2878 -1222 1167 -237 -1931 -166 1979 1042 -556 997 2489 1078 298 1268 1561 802 165 594
625 594 834 136 -827 186 973 -487 -1729 -439 655 -1045 -2210 -1333 -298 -1405 -1945 -1085 -128
642 -128 -447 -632 296 1017 601 83 1022 1861 1281 105 598 1777 1646 728 -202 96 1401 1261 -324
661 -324 -1419 -51 1333 377 -2058 -2437 -698 336 -813 -2905 -2263 280 723 -756 -1568 117 1360
678 1360 1335 -72 -169 940 1752 1170 485 396 409 1441 1597 90 -661 755 1635 374 -1222 -1231 30
697 30 65 -1312 -2042 -1612 -664 -603 -907 -1385 -529 200 149 -326 -212 568 875 493 465 1056 737 714 936 1431
719 1431 748 359 1124 1190 237 -345 339 352 -574 -1393 -1221 -631 -801 -1034 -1502 -1150 -216 -340 -639 -962 -32
740 -32 1118 294 -455 186 1220 917 142 759 933 954 1326 1181 616 671 700 751 -28 -402 -197 -159 -376 -1158
762 -1158 -867 -839 -709 -742 -1085 -974 -565 -11 -423 -718 -421 396 186 -357 -21 1257 912 413 415 1068 1437
783 1437 1003 709 799 784 278 176 -388 -65 23 -531 -906 -815 -540 -726 -1234 -914 -401 -780 -850 -594 -321 11
805 11 -469 205 487 370 423 604 835 888 1130 1145 905 604 679 741 390 -48 -298 -161 -171 -473 -537 -722 -635
828 -635 -666 -930 -1181 -964 -353 -445 -791 -637 -141 236 -103 65 171 776 779 638 559 971 860 1015 850 928
850 928 202 -31 399 228 -18 -403 -670 -561 -650 -645 -837 -1009 -509 -695 -838 -913 -518 -99 -294 -443 20 494
872 494 416 555 554 685 959 815 673 625 511 811 615 267 55 318 229 -379 -702 -323 -239 -807 -1196 -972
894 -972 -585 -673 -988 -815 -1335 -686 -20 -64 -578 40 969 982 305 122 1095 1154 486 765 709 454 747 777
916 777 385 -498 -114 727 500 -816 -735 -295 75 -879 -802 -1198 -575 -417 -548 -586 -833 -331 510 548 -208
937 -208 -264 593 1207 942 266 -84 727 1609 827 -410 -205 741 614 -123 -707 -14 -362 -271 -284 -756 -1458
958 -1458 -794 535 -393 -1848 -1394 663 779 -1290 -1199 620 1168 -113 -257 529 607 363 938 1026 207
977 207 -11 1295 1285 -465 -958 380 1076 -373 -1379 -411 658 -726 -1358 -333 -331 -641 -838 -568 -351
996 -351 -210 -528 -7 192 365 97 413 670 407 28 682 1624 593 -343 950 1440 109 -794 422
1015 422 1183 80 -1419 -464 382 -724 -1632 -203 282 -1244 -1333 -31 163 -1216 -606 922 654 -1019
1033 -1019 -384 1295 931 -70 81 1174 429 199 929 1110 124 -382 708 1057 -288 -1066 52 359
1051 359 -250 -937 -1006 -755 -31 -513 -1103 -807 85 -15 -702 -516 164 249 262 727 218 -258 503 1673 1033
1072 1033 -255 20 1451 1156 -503 -578 1022 697 -571 -522 192 -357 -744 69 -152 -1444 -899 440
1090 440 -149 -1226 -704 431 138 -823 30 602 551 103 281 802 283 686 884 684 -4 371 740 205
1110 205 -193 224 109 -219 -449 70 -588 -585 -396 -186 -689 -834 -4 -306 -1054 -583 205 -35 -600 341 553
1131 553 366 -158 722 1012 442 98 940 848 -71 267 835 121 -256 100 214 -308 -528 12 -87 -844 -819
1152 -819 -340 -300 -1204 -466 -35 -163 -283 -158 290 -116 -193 560 416 157 487 1053 452 97 913 776 294
1173 294 244 625 197 -121 -26 -45 -515 -729 -287 -154 -813 -820 -415 -521 -892 -379 -125 -300 -476 -284 343 101
1195 101 138 370 471 248 530 975 801 319 539 693 151 -44 462 502 -97 -392 15 -266 -787 -469 -266
1216 -266 -692 -855 -227 -74 -379 -898 182 -121 -68 6 319 346 77 585 667 237 465 692 724 249 239 536
1238 536 151 -65 -87 147 -1 -421 -353 -22 -456 -654 -363 -405 -1020 -567 -139 -290 -383 7 326 -33 -141
1259 -141 388 241 148 407 656 672 189 507 734 296 127 650 339 -69 -13 182 -120 -357 -255 -364 -716
1280 -716 -694 -445 -407 -475 -605 -314 -340 -642 -84 175 -57 -111 465 473 363 199 661 811 469 251 478 386 18
1303 18 263 197 31 -405 47 -14 -607 -375 -130 -458 -749 -577 -584 -735 -529 -345 -70 -186 -199 387 322 144
1325 144 494 716 160 210 378 498 524 574 493 435 352 -106 85 278 -153 -243 -186 -364 -708 -521 -414 -645 -199
1348 -199 -479 -624 -296 -366 29 -47 -124 241 346 212 600 688 470 463 285 568 446 380 425 425 128 45 -151 72
1372 72 -98 -186 -245 -547 -448 -438 -352 -303 -571 -234 -165 -270 -279 47 -76 56 120 375 421 500 254 581 373 167
1396 167 673 469 154 138 384 91 -111 -34 -51 110 -791 -293 9 -560 -499 -535 -333 -548 -488 -409 -199 40
1418 40 -71 -79 162 185 304 363 498 238 209 359 532 473 151 334 554 157 -181 -283 171 148 -59 -342 -180
1441 -180 -553 -626 -421 -307 -203 -451 120 -46 -725 -418 116 165 315 2 210 731 334 369 269 478 459
1462 459 80 213 415 106 2 -84 -24 -164 -436 -390 -38 -516 -853 -432 -17 -505 -501 -288 -109 -62 -192 231
1484 231 333 136 -44 651 260 75 341 826 663 251 4 718 549 -238 -4 136 48 -139 -441 -165
1504 -165 -212 -459 -381 -255 -490 -531 -241 -148 -288 -495 -72 -99 346 -22 240 456 496 -2 192 687 758 296
1526 296 -21 637 231 -45 155 444 -360 -317 88 31 -363 -708 -204 -143 -575 -582 -254 -184 -518 -286 -208 86
1548 86 -403 -37 337 202 158 191 586 541 233 309 368 263 393 486 230 81 -257 -160 -343 -11 -298 -373 -523
1571 -523 -416 -303 -408 -137 -375 -222 -429 -287 21 133 140 314 454 245 356 543 458 353 402 449 317 2
1593 2 117 48 -128 -199 224 -7 -351 -394 -198 -49 -443 -440 -96 -215 -678 -340 -127 -91 -123 -2 136 72 -12 219
1617 219 660 255 435 670 392 241 349 351 133 -88 -28 79 17 -132 -57 -262 -578 -241 33 -456 -503 -206
1639 -206 -58 -472 -189 -169 121 -309 306 380 -114 100 312 202 323 208 406 461 420 362 393 -67 16 -47 139
1662 139 -119 -300 13 -453 -469 -287 -170 -276 -593 -453 -258 -192 -217 122 262 -162 125 142 173 218 525 381
1684 381 99 172 363 280 164 -10 65 108 -187 -68 -115 -289 -135 -610 -164 -330 -309 -113 -339 -554 -213 -308
1706 -308 -288 -309 -61 130 -27 -175 222 361 275 633 423 413 430 470 619 111 97 103 47 -39 -109 -128 -250 -434
1730 -434 -116 -323 -417 -435 -261 -85 -681 -258 -79 -211 -259 46 -10 132 377 234 422 472 184 453 369 246
1752 246 230 407 264 70 197 -97 121 -199 -79 -85 -266 -12 -261 -416 -358 -396 -297 -471 -233 232 5 -30
1774 -30 -141 88 27 45 246 277 166 187 298 382 343 147 100 24 -167 -73 3 -129 -192 -238 -148 -178 -358 -289 -243 -491
1800 -491 -180 -89 -383 -146 -219 118 55 -17 246 230 -86 67 230 416 274 308 318 37 78 256 215 208 -122 -140
1824 -140 37 -259 -310 -289 -175 -365 -211 -238 -302 -23 -202 -99 -273 -165 -47 -173 161 268 276 -3 105 302
1846 302 332 230 314 133 308 194 133 302 -346 -61 88 -86 -315 -276 -171 -459 -105 -328 -313 -50 -204 -81
1868 -81 -142 -21 -95 41 571 43 163 252 229 255 173 302 181 95 141 266 47 91 126 -56 -210 -137 -126 -224 -654
1893 -654 -184 -435 -300 -263 -223 -395 -275 -146 -107 -122 -3 27 38 -8 120 370 116 183 187 216 372 404 233 274
1917 274 241 -3 -138 -428 -125 -5 -152 -168 -282 -493 -212 40 -248 -324 -172 -171 -177 -187 242 -62 270 122 -48
1940 -48 302 310 222 221 256 120 235 8 281 311 4 -294 98 -70 -484 -121 -117 -572 -467 -214 -132 -324 -368 -310
1964 -310 -346 -104 -129 -95 282 216 22 324 271 379 202 317 469 352 382 276 101 -178 10 208 -34 -44
1986 -44 -146 -202 -185 -162 -286 -224 98 5 -225 -230 -109 -170 -82 41 223 83 40 232 361 -72 279 228 286 47
2010 47 159 200 160 -85 -158 -185 -146 -54 -144 -51 -36 -253 -222 -72 -426 -246 14 17 -7 -259 135 -233 2 42 164
2035 164 158 236 177 121 387 463 129 -39 272 178 -72 156 -76 -37 -54 78 -78 -124 -437 -323 -489 -392 -227 -160
2059 -160 24 -241 -58 -9 12 -143 42 -73 192 207 51 276 274 198 205 28 98 236 -60 -87 41 -137 82
2082 82 -8 58 -137 -280 -54 -26 -69 -440 -43 -199 -95 -154 -242 73 -91 61 53 219 38 89 97 116 425 191
2106 191 570 20 -38 110 416 46 -12 21 -206 91 -76 24 -145 -442 -222 103 -123 -52 -91 -110 -67 -305
2128 -305 95 36 7 230 33 53 183 279 267 380 296 324 17 -76 96 105 291 -415 148 -56 -208 -100 -11 -134
2152 -134 -532 -390 -193 -141 -372 -113 -115 -194 -58 164 30 3 135 235 262 251 -147 247 188 63 55 366 -323
2175 -323 172 -136 -5 -106 -283 -53 -47 -152 -71 -66 -264 -371 -310 56 -36 -217 -212 87 15 115 179 50 90 471
2199 471 308 415 278 486 247 -119 159 58 114 45 73 -182 -381 47 25 -89 -315 -382 41 -288 -152 38
2221 38 -11 -61 -80 -35 286 -48 27 195 -46 331 212 383 336 326 326 226 -59 215 108 189 66 7 169 -120
2245 -120 -199 -68 -165 -163 -471 -215 -269 -347 1 -48 -57 -314 -131 162 120 329 89 41 34 72 344 98 -145 127 186
2270 186 185 -121 96 93 18 -171 -16 -277 40 -147 -205 -122 -315 -74 -242 70 -269 -18 -217 -37 32 155 123
2293 123 84 225 242 193 289 186 341 191 93 60 109 -17 89 -194 -107 -255 -83 -167 -38 -140 -382 -394 -60
2316 -60 -147 -295 -447 -230 118 -132 112 225 239 369 161 437 216 135 275 273 243 201 -60 222 150 62 214
2339 214 -11 222 -86 -46 6 -385 -396 -113 -352 -264 -292 -111 -37 -271 -76 -39 -31 12 272 329 191 192 230 10 -38
2364 -38 176 59 239 -82 167 171 54 183 -139 -192 -204 -58 -183 -27 -292 -53 -77 -183 78 -22 -1 -7 -156
2387 -156 22 -396 216 290 241 146 147 226 198 -110 195 138 35 -12 161 -2 -195 -302 -58 -179 -482 -283 -249
2410 -249 -38 -181 -82 -204 -44 -82 -219 77 -217 51 72 73 -92 171 135 129 320 476 459 366 280 -172 190 -118
2434 -118 -128 0 28 -253 -88 8 -187 -11 -215 -86 -72 3 -142 -288 28 -81 198 156 24 -48 189 39
2456 39 -61 146 212 113 68 80 192 274 24 18 168 172 25 -109 -398 -96 -153 -84 -3 19 -46 124 -280 -173 -3
2481 -3 -209 136 40 95 98 -30 374 205 356 74 144 161 204 140 221 55 -92 -43 -220 47 -23 -18 68 88 19 -208
2507 -208 -114 -281 -29 -77 -58 -140 -170 -173 154 92 46 203 138 5 107 -18 318 120 -42 120 120 64 103 -68 -142
2532 -142 78 24 4 -106 -200 -167 -136 -137 -118 -355 -282 -145 -8 54 133 -85 134 -251 188 219 18 10 327 19 278
2557 278 96 -109 203 121 -13 -62 140 248 -100 -376 -30 -44 -409 -292 -34 -19 22 12 20 -92 -95 36 91 -159
2581 -159 -5 130 84 292 200 37 -16 69 51 324 -159 247 258 -131 86 8 -226 -144 49 56 -19 -404 -122 -120
2605 -120 -94 -144 -53 -152 -310 32 62 -91 -123 128 -154 391 231 326 139 69 271 261 259 -147 122 188 -8 3
2629 3 189 -212 -150 -161 -65 -75 -106 -247 10 -187 -186 -219 -187 -41 -137 -142 104 70 150 100 -9 -60 177 240 141 120 219
2656 219 116 -134 209 44 18 291 76 -103 -37 -28 50 -312 -134 -147 31 -129 -284 -3 -202 -54 -103 111
2678 111 -16 162 153 233 127 118 -15 -15 -101 -116 208 42 59 54 -11 67 35 -326 -81 -108 -260 -64 182 -19 -79 -160
2704 -160 -60 28 -175 -82 108 5 173 -8 163 137 104 -73 184 188 290 214 -137 89 153 93 -56 46 60
2727 60 -182 -254 -55 -153 44 -76 -303 -235 -39 -252 59 -42 -180 -1 -128 -200 6 -11 48 232 36 -65
2749 -65 -198 -118 184 199 190 -10 151 143 -1 -47 -167 -162 -121 -58 135 44 -363 -235 -122 -22 -14 27 6 63 -73 239
2775 239 -121 -46 177 36 106 254 284 106 138 -125 164 67 -30 113 45 97 -304 -37 -376 -177 -71 -334 -281
2798 -281 -381 -245 -121 66 10 255 33 -28 -29 273 -49 -36 185 133 253 85 -43 -19 269 300 132 59 152
2821 152 -247 145 -28 182 192 -236 -93 -40 -56 -215 -80 -50 98 -101 -181 -41 183 50 -33 53 47 401 352
2844 352 57 -56 -183 105 413 53 231 45 129 -23 275 -68 -317 -95 47 -88 -109 -231 -228 -60 9 30
2866 30 -101 -249 -43 38 -41 42 84 91 133 197 275 202 74 11 -101 119 141 292 -24 -114 118 102 38 -69 105
2891 105 -108 217 86 -303 -238 13 -66 -283 -238 -226 -109 127 -118 77 187 213 -207 138 -104 -126 -31 167
2913 167 9 -115 241 191 -44 119 -4 -102 -122 -222 -239 64 -352 -9 -209 -260 65 -374 -186 -179 -276 -289 44
2936 44 128 90 -80 96 -37 -136 83 285 380 147 -16 -40 106 -34 190 -93 75 271 268 38 -154 1 12
2959 12 -74 -183 -142 -194 -302 -131 -35 -373 39 0 99 -137 -82 281 407 178 67 171 106 -30 -68 33 365
2982 365 1 -245 53 -35 -185 -76 125 -75 -271 -190 -8 -391 163 -286 -98 -146 -39 26 -6 52 143 211 173
3005 173 215 128 -3 247 6 185 163 176 30 75 90 77 -15 137 76 -63 37 212 163 -230 -185 -63 29 -43
3029 -43 106 -71 369 -36 187 15 127 -22 49 -28 -165 -374 45 55 -7 -167 -180 -133 -34 14 -290 -81 68
3052 68 -90 82 -341 -211 83 -209 69 28 148 11 -202 83 -128 -100 320 282 -1 -20 26 11 162 -45
3074 -45 124 275 226 40 -83 36 -99 -43 -40 43 33 67 -19 -32 -52 -1 -40 -370 29 -263 66 -153 -112 40 158
3099 158 -139 100 204 -102 403 -52 3 175 -10 317 191 164 -200 -39 108 -192 107 -90 24 -215 142
3120 142 -150 -51 -107 194 35 -176 -152 329 -198 49 56 -190 -246 -69 -11 134 44 289 301 -12 84 262 14
3143 14 154 21 -114 115 -73 134 27 19 -347 -263 -203 -105 -102 -225 29 -99 139 -9 -88 -238 -16 176 -16
3166 -16 208 210 -68 -13 85 73 22 184 101 124 -142 -160 177 -14 8 -113 -32 -101 -319 -321 -200 31 -216 -74 339
3191 339 -19 66 67 201 200 353 111 97 121 331 -138 -21 154 286 47 47 82 -22 35 26 53 198 -247 -148 142
3216 142 -211 -125 -244 168 -258 -1 142 -78 -57 3 -81 296 -159 28 274 144 168 73 75 -62 332 225 307
3239 307 -4 164 -136 62 5 140 -105 130 -81 57 -202 -248 -144 -167 -154 -262 -98 82 -132 -134 -20 -280
3261 -280 121 -138 -69 -51 63 104 -40 286 50 12 152 26 -82 151 26 -253 5 -108 44 60 -142 42
3283 42 -123 -98 95 -162 123 -153 -177 120 -144 137 163 144 50 38 133 -173 19 19 15 97 -7 -87 -50 -70 -84 9
3309 9 -214 48 53 61 -5 -57 99 -244 -51 117 -280 -175 -114 -30 17 -84 197 -117 -10 131 287 127 138 95
3333 95 -35 -84 -90 -76 141 126 -11 180 -60 -144 -211 -16 119 -126 -180 -48 -95 -158 -102 42 31 -108 -119 20 97
3358 97 217 -151 209 -82 172 52 -211 140 93 63 -22 19 -49 109 -11 -139 147 -66 -280 -85 -359 35
3380 35 -45 119 -1 -238 144 59 61 108 303 -211 -256 -18 -177 185 -98 -77 103 -24 155 158 -7 -12 77 38 -56
3405 -56 163 -89 -54 10 -99 33 -51 -118 -39 -396 107 58 266 -11 -53 -19 245 -73 137 175 273 -200 -206 -135 145
3430 145 20 -209 120 -39 -8 -136 -119 70 203 -159 -322 273 22 -155 56 -90 67 -140 -137 -49 -124 -92
3452 -92 -156 126 152 48 -10 -39 214 -97 144 176 -177 -139 141 159 186 -197 189 1 -77 -230 -95 -99 -222 -228 -153
3477 -153 -165 83 11 -119 12 181 131 55 228 60 142 73 139 7 96 115 70 5 -242 123 287 -285 -269 93
3501 93 16 -193 8 -90 53 115 -24 109 -51 -34 100 92 -150 -64 -104 28 -46 149 -40 -194 -24 80 -15 171
3525 171 89 228 149 47 -51 -149 -77 -91 -92 -145 100 -452 76 -199 -63 -238 -286 155 -44 41 -110 15 -109 -2
3549 -2 -136 201 -50 186 -30 -118 158 22 267 261 104 295 33 -30 39 -118 -148 -215 61 -228 -130 -231 -45
3572 -45 -271 25 -27 -63 -205 -78 -30 -111 149 55 198 -160 156 -80 -27 93 333 217 120 -208 86 273 10
3595 10 -41 -61 -31 -2 -33 -46 27 -25 -196 107 205 58 -90 -117 9 97 -11 -14 62 71 34 -194 153 120 27 68 267
3622 267 -5 111 206 -157 65 -16 -53 44 20 -259 -165 73 -11 -158 -229 -305 -79 -115 47 -11 -14 -194 -94 26
3646 26 -277 -120 78 -146 229 154 -95 202 -62 -161 150 -105 50 -47 179 -67 18 -114 -107 -128 -60 -253 -220
3669 -220 -119 -219 -122 71 -198 -39 -64 -76 -2 36 -66 17 -138 248 294 -18 175 -127 -119 -13 354 34 4
3692 4 0 -187 66 -128 -31 39 -38 -134 -46 -7 -244 -44 -1 -52 -9 171 48 96 -99 -13 26 -319 190 -141 158
3717 158 124 38 83 56 -64 173 -58 29 80 -90 -167 -247 -67 5 71 -224 321 143 -86 -96 -85 -40 -131 103 162
3742 162 -53 -133 132 86 -83 163 31 128 -51 48 -49 271 82 30 57 80 -85 -48 33 18 57 -159 -176 154
3766 154 40 77 -125 -52 -115 -106 71 -207 79 23 157 287 242 6 157 24 67 -53 -345 -185 37 -26 138
3789 138 -39 -40 -24 51 96 -74 -146 60 -119 21 125 9 -10 45 -412 6 -52 72 33 -57 -50 53 131 46 -27
3814 -27 92 -3 -68 -1 -9 45 160 19 37 127 46 245 -90 28 -36 -88 -42 -243 -56 -10 92 216 128 152 -214
3839 -214 168 -25 16 -21 -8 180 29 90 90 139 270 -37 -22 -64 -47 -26 3 -89 62 -151 -69 -104 3 -143 -15
3864 -15 139 -7 -232 33 -149 -123 124 154 180 -65 -128 -151 -110 214 196 276 -2 23 82 278 318 78 -265 -38
3888 -38 -72 -133 -110 -55 105 30 -170 -99 79 -48 -55 43 -66 132 27 139 -54 -17 -130 -45 -103 37 85 -218 105
3913 105 -143 54 -9 76 105 213 109 -122 -293 -228 -129 -257 65 -46 161 -186 48 -1 203 12 -114 -182
3935 -182 -354 5 -66 -39 -61 88 113 -52 -57 253 10 306 -71 -39 -3 213 -4 41 23 -87 28 239 58
3958 58 -170 -368 72 -113 -25 -192 -143 -137 -71 56 208 -14 32 226 295 116 110 -15 -97 -119 23 16 117 206 31
3983 31 -92 -25 7 -43 -98 307 2 96 59 -72 -275 -11 133 -39 -114 120 29 -75 -53 -7 -229 -122 206 -74
4007 -74 -180 191 -7 -110 96 68 53 -215 -132 -299 -151 153 136 81 -115 -28 -156 -2 -94 297 -125 103 -94
4030 -94 -280 -126 -272 2 76 -129 183 -31 -108 30 123 95 -70 -68 -196 -8 -30 170 40 -138 179 -33 -116
4053 -116 -67 77 -116 -4 -66 -25 25 76 -357 -132 -73 -178 113 -247 21 54 103 116 223 -71 -153 -14 115
4076 115 -8 -86 108 141 -151 38 -4 -47 -84 197 -147 -258 189 -176 133 115 183 -102 14 -41 -281 199 -175
4099 -175 15 232 31 -26 213 -96 23 258 72 140 101 -364 -19 -51 248 103 -17 -53 -115 61 -52 -344
4121 -344 -62 -142 -262 21 40 74 -45 53 101 -4 -43 99 -118 208 22 146 -122 -111 8 90 136 15 -9
4144 -9 -103 -266 25 -59 57 -119 0 38 -254 95 -117 234 -193 -146 27 106 -225 -62 42 -80 -95 120 210
4167 210 -51 -3 63 28 95 -27 225 -1 -69 -182 -72 -9 77 -178 -222 10 -32 60 -34 126 -18 -19 -143 -181 -244
4192 -244 -20 -30 -169 122 -15 -89 128 -81 -139 -68 148 -73 -7 40 37 47 60 -2 -6 -22 -27 77 -49 58 -17 309
4218 309 160 -35 127 149 107 27 79 124 -131 41 150 1 184 -129 -66 -116 359 189 -129 71 -21 -50 28
4241 28 -85 65 208 -44 -7 -51 -68 -309 11 38 -186 -116 179 27 -101 -179 10 -50 -66 49 175 -20 20
4264 20 199 51 207 194 159 100 -19 -21 -156 213 2 -133 36 -218 -47 -54 137 -79 -160 -215 -71 -265 306
4287 306 -92 55 54 -187 -18 -215 179 98 -226 47 151 29 331 -48 -81 41 -48 -126 -69 -174 14 157
4309 157 129 -124 31 -80 -101 -139 -7 54 -105 -38 83 -40 -122 56 -223 175 -103 14 242 184 28 -85
4331 -85 -79 185 -75 8 -160 -67 -297 -188 -224 83 -62 262 142 -247 22 -23 -106 -183 121 -60 -112 -40 -102 -15
4355 -15 145 -3 -42 -109 44 187 113 -72 31 153 1 -270 74 37 -118 -62 4 -238 108 81 -138 156 81
4378 81 -64 -223 1 86 -40 -7 -56 103 237 -113 151 27 8 103 157 47 -4 126 -14 78 159 104 -86 -224
4402 -224 107 13 -136 250 29 -40 46 99 11 -145 28 -69 -64 -125 314 -85 -130 -44 43 232 45 22 -26 120 10
4427 10 214 8 40 -50 -61 157 180 159 -248 -26 -88 -117 -41 52 -30 -141 -30 -4 -79 -101 -17 144 86 121 -112 17
4453 17 44 -113 -3 -227 125 63 -58 129 117 100 74 5 -51 -32 -14 -63 258 -78 -73 166 -223 -129 -58 87 -100
4478 -100 -4 273 -202 -127 -122 260 48 -271 -112 -86 10 108 200 -81 -105 23 94 10 -148 62 192 -143 11 -198
4502 -198 -110 91 30 103 -45 -144 43 134 -26 -111 -9 69 62 -189 131 -138 -265 -163 -75 66 119 144 50 -283
4526 -283 105 -20 -81 173 -14 52 27 -153 -171 -33 -19 -135 -200 13 119 112 -192 -72 -216 93 -74 -221 -84
4549 -84 149 119 -94 -213 -61 -12 -20 -231 225 100 -136 -140 0 -122 215 9 -128 174 -187 208 1 -150
4571 -150 385 -50 173 49 219 160 73 273 -148 100 73 1 -247 -204 41 -83 111 54 66 -175 -126 -73 -116
4594 -116 -64 -79 -96 83 125 -316 188 61 -48 -7 174 -11 -227 -127 -276 143 109 -66 2 71 324 87 -121
4617 -121 57 18 -102 -128 -19 157 15 -144 -77 -15 -59 -7 2 1 71 118 70 68 -48 329 99 89 -23 -17 120 54
4643 54 -74 -88 272 -11 -294 -22 105 -93 -100 -73 207 66 -52 -74 -134 363 -31 -85 -118 -196 -102 -96 -301 -8
4667 -8 -61 195 -62 -120 186 -91 -127 -6 61 55 83 145 -165 74 -31 202 23 -191 -86 103 -70 88 -113
4690 -113 191 87 170 -10 213 -199 -58 -194 -131 151 -77 37 -161 -138 -120 -249 -22 -98 165 -95 126 22
4712 22 -101 -7 -23 123 49 -14 197 27 70 110 46 128 26 66 -17 -42 103 -14 68 -142 -162 -242 -81 186 -3
4737 -3 -26 -72 350 -96 -130 -159 -47 292 29 40 -103 -146 -66 101 48 -53 -28 94 118 0 23 170 -127 63
4761 63 -243 -61 -129 -169 73 -95 104 -162 131 -165 -35 16 -87 -48 33 63 -25 81 142 -88 86 -70 127
4784 127 34 99 33 -122 -30 -83 41 -45 190 70 90 70 -48 -226 55 -211 -164 20 67 -151 95 98 -38 32
4808 32 6 -133 -36 -159 25 113 -89 156 111 205 74 -80 8 -92 -16 -179 -101 68 -177 -205 -113 -100 -153 58
4832 58 110 -217 -241 110 9 -44 43 -43 53 42 -96 9 -137 222 -102 -5 -112 -56 94 263 30 73 92 72
4856 72 -33 -95 129 48 -133 119 -49 31 11 -212 76 -14 100 -114 -88 -25 170 -47 74 13 182 -169 22
4879 22 -36 -12 1 211 166 41 63 80 -10 39 -75 129 -37 60 -147 -22 -64 -110 -55 -145 120 -397 16 53 -45
4904 -45 -145 -127 94 -180 157 2 322 173 101 -17 3 -102 -10 185 171 152 74 -140 2 60 -78 5 -373
4927 -373 -40 28 -347 -98 -129 -94 85 62 165 -210 -62 -31 -11 -13 184 -57 -47 170 17 -12 88 99 -32 125
4951 125 73 -209 -110 -37 -56 -135 -71 124 38 -65 -35 -166 -62 -171 34 93 50 93 -79 -149 -207 153 -13 118
4975 118 -139 -160 290 49 -8 150 177 58 95 -99 -35 47 -150 -100 -160 -93 -106 234 -110 140 36 -121 167
4998 167 -91 80 -38 -166 -123 267 193 -27 258 -17 138 -106 -64 200 -47 -73 -126 -7 185 26 -235 232
5020 232 232 -10 14 90 123 21 -81 13 -150 62 -56 -131 -118 98 17 -57 -48 0 131 109 113 -83 -51 88 -39 165
5046 165 75 -215 -48 -109 132 -48 -5 -164 -33 327 60 0 73 146 12 97 -144 78 -90 116 -59 -62 52
5069 52 54 -208 239 -251 94 -13 132 12 43 37 -7 110 52 66 51 -199 -30 -16 -114 -75 -246 -148 83 -132 -185
5094 -185 -51 -177 -26 -65 -38 246 102 41 17 -298 -36 104 32 -57 99 -108 -37 15 -40 -86 -119 -134 178 -123
5118 -123 193 -5 -241 117 53 -204 95 -74 -138 17 -14 -167 -86 -43 188 51 21 -193 -44 -111 127 122 89
5141 89 175 -124 234 -56 82 -47 -30 -210 23 54 -91 -4 -121 -12 -97 59 -64 -99 -72 -91 -86 54 -158 -131
5165 -131 272 -80 -63 -29 57 109 -45 19 -85 69 38 69 -7 -399 -178 -133 -202 -231 -137 -39 -163 -70 -60 -126 31
5190 31 42 -233 -11 -30 49 84 13 33 167 88 190 28 76 -61 54 125 -66 156 28 36 -83 -388 107 -91
5214 -91 168 -118 -335 -90 92 -34 27 427 -91 227 158 -302 -43 228 -66 -254 157 107 -169 -186 -54 -126
5236 -126 -48 67 -106 117 -133 83 -119 3 51 -235 -49 -38 -4 -2 -187 -156 56 23 -4 204 76 5 305
5259 305 -89 -251 -284 35 180 -81 25 129 -193 71 -24 156 61 -226 -81 1 -53 96 -225 -161 66 -27
5281 -27 -111 -233 149 -56 -95 -177 -144 95 -203 216 -71 209 15 -107 103 333 -129 109 153 -207 -134 163
5303 163 -122 112 -154 28 -98 331 -118 55 -237 -248 36 46 -103 -49 181 -67 36 -124 117 -290 -96
5324 -96 53 62 137 -130 -11 -53 64 -43 -113 99 37 127 -6 145 19 -3 -30 -30 -214 37 194 -216 36 -163
5348 -163 -38 -37 -96 286 -62 -169 71 264 -142 6 275 58 27 -70 -169 -125 -58 23 310 27 92 -11 -12 -4 -129
5373 -129 152 -100 15 35 297 -141 -208 115 -142 -127 -88 -112 -5 26 86 208 -128 138 116 -40 215 -39 186
5396 186 78 84 67 -140 -85 224 -182 -106 -73 -2 -275 -49 -65 -12 -54 -105 226 56 -103 -38 -98 54 -116 -86 -27
5421 -27 78 -17 -107 -112 52 -172 44 -24 -158 -75 158 228 -41 -299 -157 42 -268 102 4 -183 -172 -25 -69 188
5445 188 -24 83 7 104 82 -150 39 -72 24 -199 51 107 152 124 20 32 103 136 111 35 -151 -62 190 226 -163
5470 -163 73 111 -1 -151 -93 81 -181 -144 -129 -55 2 99 -130 37 216 -104 67 -52 48 -226 174 -50
5492 -50 -61 -63 -170 290 -47 44 -104 97 216 60 47 154 -64 -37 -69 116 -10 -73 -179 -44 -159 183 118
5515 118 134 -36 5 183 -177 287 -41 -273 -191 148 14 -47 176 8 -106 -153 187 -65 57 77 -83 44
5537 44 134 -67 -153 -255 134 -43 -46 -180 -144 -160 -92 -77 -200 -12 285 234 -88 -110 148 122 350 -155 100 108 57
5562 57 136 -217 -246 10 -70 -144 -9 -31 -16 -281 -180 139 -56 -38 -144 28 1 -100 182 -198 -53 78 209
5585 209 8 125 106 -103 -1 -131 -25 153 -113 -137 252 -96 -29 23 -19 0 -42 43 -54 -34 -4 7 -213 -112
5609 -112 -279 -192 149 203 -46 -7 -123 -64 14 -324 58 -133 33 211 -20 -50 -72 -241 -69 191 -68 -211
5631 -211 216 34 -224 -87 -131 -257 15 -97 116 3 -6 7 1 -56 -208 16 305 48 34 -225 4 -75 105
5654 105 -143 -108 4 -115 49 36 110 97 -44 -109 35 145 94 172 -129 -15 18 -135 -114 316 -96 85 84 -81
5678 -81 111 -31 203 -78 27 -210 -146 91 27 116 -72 14 32 69 -271 -1 -34 -102 -180 -195 213 -72 192 -67
5702 -67 -139 -157 27 -63 27 3 -35 -44 -137 91 62 -246 -129 71 10 -54 112 182 -23 -98 127 98 43 103 -209 -60
5728 -60 250 -39 7 -95 -23 -209 -94 93 -222 146 142 -49 -144 -109 -13 8 55 7 -45 -181 -80 -57 146 -53
5752 -53 105 -46 -205 -277 44 34 -162 161 -20 -139 69 2 117 -144 3 -65 -115 -189 -92 162 26 -137 -168
5775 -168 54 -127 123 -97 130 37 66 132 0 109 -11 69 -159 -65 -27 87 16 67 44 -125 -4 144 119
5798 119 58 -99 -123 -100 -19 -43 290 -35 -25 10 -55 -183 11 -46 143 24 -31 241 163 -107 -142 164 -117 -100
5822 -100 97 -1 27 -34 6 -67 174 -91 -103 83 9 119 -298 -167 52 165 -48 -237 -223 -125 96 3 -127
5845 -127 21 -75 -107 -53 -78 146 66 -85 -146 107 -122 59 -159 38 -157 3 -224 121 56 81 -93 83 171
5868 171 163 -169 56 86 5 200 -7 132 104 -31 -99 -58 -79 82 55 111 -65 -74 88 220 -152 -142 40 -9 -69
5893 -69 221 -117 38 6 -102 224 31 3 -43 -90 -142 -46 -168 320 33 13 140 -17 101 -62 103 -15 -106
5916 -106 22 159 185 -166 -10 -79 -137 -194 -170 203 148 -307 49 119 17 -105 -30 -80 45 7 122 -29 -87 92
5940 92 97 54 -111 -163 55 -127 122 79 -40 195 -66 -39 -129 13 -2 98 -60 -205 124 -133 -224 -112 -123 -77
5964 -77 -160 241 21 167 -186 132 -185 -102 90 91 -159 204 -50 51 117 165 -41 -103 -136 -117 -213 38 -141 -17
5988 -17 211 48 15 -50 -27 -42 -138 -121 140 -111 48 246 88 -113 212 -59 -18 -80 149 32 69 88 -14 20
6012 20 77 -7 27 -52 -42 -136 -27 94 52 -152 -135 -47 -33 -67 -154 -139 34 101 192 -101 -64 -158 59 -12 229 -60
6038 -60 147 -131 -95 -77 -46 -59 216 171 -45 -63 29 -50 -125 -129 234 108 224 -219 -89 -165 -186 -48 -169 -57 159
6063 159 -83 -34 -60 -84 -162 -3 46 36 45 75 -4 -185 197 -62 -140 -166 -9 65 -92 48 -150 -57 -26 46 88 -135
6089 -135 -127 111 -75 -30 -127 -33 -16 108 14 -210 -62 -147 -20 -113 30 171 67 -188 -302 13 27 110 -20 50
6113 50 2 100 116 -54 -151 -95 -46 -106 49 -53 -90 25 -256 -404 22 -52 21 119 -98 184 -48 -30 45 -105 77
6138 77 37 103 111 140 127 -206 -51 120 -277 -3 -39 -29 -58 79 62 -53 -36 6 -150 86 -50 115 -35 -20 34
6163 34 -124 -180 -181 -64 32 -119 -2 -136 -3 -224 106 -80 79 182 150 203 69 -149 -10 -133 63 -138
6185 -138 -107 -175 200 -14 143 41 -17 -48 89 25 3 -270 -187 -35 -289 217 -3 -79 92 -16 45 -218 46
6208 46 77 27 -154 -88 95 -32 159 55 -89 -124 24 56 -158 -161 102 199 -104 35 18 -37 -90 -160 100 88 115
6233 115 285 -59 -17 284 38 44 -250 -52 50 8 86 45 139 -163 52 -146 -106 169 -279 -61 42 -441 80
6256 80 94 81 212 73 377 -95 -210 -110 77 73 -124 -220 103 -258 -235 4 87 -92 81 70 9 158 -88
6279 -88 54 97 -168 154 79 40 -18 13 -81 124 80 116 -62 -41 91 91 -70 149 62 -73 303 140 -92 24
6303 24 4 100 99 -213 134 -129 1 -13 40 95 -114 -93 -21 140 46 -205 15 -42 -152 -103 45 -109 13 -235
6327 -235 -135 -21 -179 -62 125 40 82 193 -56 -148 -18 -3 56 -94 -294 92 -146 48 50 -158 -224 97 191
6350 191 -134 96 -138 -61 160 -6 133 -154 20 -73 20 135 -64 70 2 209 142 -263 -54 -18 12 -162
6372 -162 113 47 5 194 116 147 -17 -115 -178 48 -118 282 119 -160 140 25 42 -142 -106 39 104 274 299
6395 299 -220 -116 -42 -126 -126 -149 129 -64 -11 3 -56 -252 33 204 38 35 22 12 -43 -234 -141 16 -254 -152 -100
6420 -100 196 45 -209 45 158 75 199 175 163 150 21 109 -85 25 63 258 -23 33 -114 -73 -45 46 -98
6443 -98 38 -277 -220 -94 -249 197 -84 34 -143 125 -22 9 -107 114 -164 97 211 19 10 -163 62 209
6465 209 317 254 -124 13 138 -112 305 -193 -65 -35 309 -46 -17 62 282 39 -224 95 -128 42 -128
6486 -128 263 85 -145 -63 -99 -105 13 113 -14 -99 -62 -198 32 44 -98 60 -88 102 -38 -101 -33 -33 176 186
6510 186 132 71 -187 96 -134 -50 17 179 -14 -433 -36 25 -182 101 105 -165 -37 142 -118 -50 82 25 -157
6533 -157 205 49 105 -3 72 -273 -7 -239 -212 81 103 144 -2 44 -103 68 32 -79 -47 10 7 8 234 -53
6557 -53 203 28 137 37 -288 -92 -137 -29 -255 -84 -31 -54 -73 105 97 -28 -45 -138 -75 -41 248 145 18 -14
6581 -14 85 49 -115 -124 -120 145 203 126 -22 -167 104 -38 137 -50 -29 102 130 -226 45 -303 -123 151 -179 -154
6605 -154 -173 170 88 25 156 31 156 50 211 68 -11 -95 -116 -268 -345 -192 -218 59 -48 106 14 -235 -136
6628 -136 -142 -76 135 -6 -198 228 -83 -47 185 41 -156 -83 10 -112 -371 96 -237 -48 -181 158 111 -72
6650 -72 -69 272 -25 97 -3 7 -102 -196 -73 112 -7 446 -309 -51 28 -141 0 -134 -61 -194 314 -33
6672 -33 -137 4 42 -66 -85 114 169 -54 -228 -89 54 127 135 151 -207 29 99 236 -88 -198 44 -79 75
6695 75 90 13 -16 -24 164 262 -162 -225 226 -11 120 188 -120 117 3 103 55 177 -87 -87 187 -26 -221 3
6719 3 -75 -20 183 -102 114 43 12 -1 -138 -1 -147 2 -14 85 53 87 163 -161 157 19 47 112 105 -113 -63 -24
6745 -24 117 -267 -137 45 0 97 -200 67 -89 -75 44 76 -201 -70 263 168 10 275 141 -15 -51 -72 27
6768 27 4 65 -8 15 86 53 -19 -118 16 -184 54 -97 258 157 -151 -34 100 257 -93 -141 102 -67 -10 6
6792 6 46 66 56 -72 15 -90 216 31 98 14 -162 26 82 132 60 10 52 101 -210 -137 192 -11 -21 23 -54 99
6818 99 94 222 -93 -2 390 72 -52 -155 18 29 136 162 -54 9 43 124 99 -100 -116 30 102 3 -137 17
6842 17 -11 -67 -159 -323 -166 -170 -62 54 183 91 -79 -117 -21 68 60 292 -67 54 -146 21 19 -18 -170 -271 -31
6867 -31 -102 42 131 -207 -241 -89 11 -13 -69 -151 -172 -201 17 138 -7 -33 -70 -53 187 166 -46 173 6 161
6891 161 -149 -342 -112 -5 -150 -48 -84 -109 -47 -101 -155 -132 241 -87 36 -45 41 -23 183 98 81 216 -12 146
6915 146 23 115 31 10 -325 112 152 -235 -197 138 -221 -103 62 -212 -83 -14 75 280 -54 76 -40 -124 347
6938 347 -74 -84 88 -130 63 -65 -36 -76 16 -107 158 273 -45 34 79 103 9 30 94 111 25 5 -6 84 -13
6963 -13 -62 -95 -121 172 -41 -60 30 -102 96 10 95 -269 -282 201 -40 -243 4 -56 39 274 -150 -21 -73 28
6987 28 23 117 40 34 -2 -150 -21 68 1 234 -197 27 -211 98 251 42 -42 10 -95 183 -152 -111 -1 143
7011 143 47 16 50 -54 -49 -43 -153 217 113 -132 -92 47 -300 -399 139 -290 -270 61 -125 -88 -46 148 60 32 213
7036 213 26 -179 -28 -42 65 146 72 94 238 26 78 -193 89 -73 -127 48 -85 111 420 -29 9 -69 118
7059 118 10 -126 -280 41 -44 31 -72 -182 -178 -82 -14 -65 28 27 39 -16 54 -91 -127 179 -16 4 49 -21 -82 -63
7085 -63 -124 61 114 -149 124 241 88 -37 27 -122 139 170 -24 3 67 -40 117 233 -170 256 -138 -22
7107 -22 120 77 -8 -61 71 -106 38 -97 -18 -32 169 15 -132 123 240 -143 81 -139 34 -104 45 -192
7129 -192 -96 126 -7 41 41 145 24 -207 199 -34 -79 130 -153 202 256 56 173 -75 -112 -44 112 -44 -88
7152 -88 47 -61 -182 -68 261 77 -44 -43 -224 138 -107 -172 106 -223 -38 -114 -137 82 253 -32 -193 246
7174 246 -150 25 -11 68 -104 -27 -16 -30 -45 70 67 -25 91 -125 86 -52 18 -5 -210 100 158 39 -24 -17 -67
7199 -67 199 -74 -299 -364 225 69 97 35 -152 -92 94 -86 -149 -76 -49 77 -17 -187 -50 -82 83 53 -89 163
7223 163 42 20 81 -15 -26 -17 34 159 -18 185 110 -20 -142 200 -182 33 -7 -61 -31 70 -23 120 41 81 18
7248 18 -51 -12 51 -153 32 252 -67 -72 184 -128 -66 39 75 25 -176 -147 129 -70 17 102 103 131 -57 180 136
7273 136 -106 -37 -118 141 -91 -101 -95 -20 -95 -20 120 -106 -185 197 13 -22 -24 234 52 129 93 49 130 12 -144
7298 -144 -102 206 129 47 -298 94 -112 37 2 43 -177 316 -101 -26 51 15 -23 -104 -71 274 -42 -136 -314 86
7322 86 -168 -54 128 66 -40 -48 -107 -15 184 -130 221 -6 118 191 -144 140 -78 -244 -52 -68 -54 71 68 229
7346 229 -48 -119 -15 24 122 -92 -180 -4 157 -153 45 -93 98 -60 -36 -314 268 -71 79 19 -97 -3
7368 -3 -180 69 -16 72 114 -20 154 -98 41 16 -69 17 -149 186 -77 -52 109 67 39 40 -129 -4 65 197 55
7393 55 -57 104 -23 10 72 -2 58 -25 110 82 10 -219 34 83 104 32 -153 87 -60 -153 -61 -81 -145 48 -140
7418 -140 -118 -186 -159 -23 -141 74 23 -62 -77 115 42 180 -47 -172 16 62 -17 -166 5 -243 212 76 -109
7441 -109 21 -166 238 55 43 -62 91 134 37 114 -169 -27 100 -170 -8 -26 -122 -91 279 -81 -36 57 -128
7464 -128 -14 -157 35 -1 0 -85 66 -36 -35 -83 -176 -72 -162 -4 -197 -49 -63 92 -113 248 -43 -59 -135 135
7488 135 93 -222 272 118 -77 -137 -40 -163 220 282 115 -25 123 101 123 111 37 -89 -19 -141 30 -1 306
7511 306 205 -6 -137 72 -50 210 197 76 78 6 -145 -22 181 235 38 -139 203 -56 -24 -12 91 77 304
7534 304 84 -18 -222 -162 -103 -16 -124 -71 120 131 -224 -229 97 29 -15 -26 126 -100 -138 -76 225 -68 190 10
7558 10 -131 404 165 57 51 -122 -39 78 -62 -53 267 83 38 26 40 25 -18 170 -122 -36 -214 70 -256 3
7582 3 -49 -151 -156 -9 -17 -12 178 92 152 139 -50 8 256 133 112 -7 83 -92 -132 -31 -126 -7 -35 149 81 30 -88
7609 -88 49 77 -329 1 35 51 57 -52 165 -75 -96 100 -149 72 8 132 39 51 -79 98 124 202 -78 -16
7633 -16 78 -3 -44 -2 -149 13 51 -100 187 77 -62 191 124 -213 -68 268 -12 -123 -234 155 -57 -13 125
7656 125 -271 61 -72 185 68 -66 3 13 -57 -77 -33 -103 169 68 84 -177 64 -79 50 21 146 -123 -22
7679 -22 142 -88 82 36 -105 8 -372 -47 92 -55 -91 -140 -206 -85 -25 -145 10 -106 -27 91 77 66 145
7702 145 -50 -128 -51 -53 -226 340 217 -65 119 55 112 306 -121 -28 -14 -33 67 11 74 -123 88 134 258 -227
7726 -227 162 -113 193 -209 57 22 -66 101 -340 -114 5 -104 138 61 -243 44 127 31 -85 -143 -133 -69 56
7749 56 13 -51 164 -132 -307 114 306 -69 -75 53 101 147 -42 -60 226 110 -161 -46 19 -150 -64 16 -23 90
7773 90 129 -103 -114 -279 138 -109 83 1 70 21 -40 -320 143 -218 -16 54 -44 -20 8 91 -7 373 -98 -67 78
7798 78 -78 7 -55 -173 -22 8 20 6 106 94 62 -104 101 24 5 -106 -45 -196 -118 -83 -83 125 41 -260 -104
7823 -104 97 133 17 -25 8 31 134 112 -35 -72 8 42 60 -135 -8 188 -143 -153 143 2 -6 302 -90 -175
7847 -175 99 83 13 90 95 -138 8 -101 -42 75 -64 -126 116 -18 -117 18 77 -107 -128 -4 11 -31 96 44
7871 44 -166 -54 -381 99 -223 -103 -100 140 -163 131 255 -38 76 183 324 108 -99 67 -22 14 -85 -2
7893 -2 -123 -268 128 -126 139 197 -60 60 55 -45 79 -48 -63 -123 -18 91 80 193 158 105 -116 -64 209 51
7917 51 -103 -159 -57 28 129 -31 -28 17 15 -43 -111 -41 68 103 164 3 143 -7 251 -124 382 287 -128 -106 -44
7942 -44 156 -57 22 -80 66 -104 137 102 -103 283 -39 -69 -42 28 201 -99 -87 16 145 124 100 -22 -166
7965 -166 -36 -112 76 5 140 107 -2 -107 -161 -208 68 2 -54 -14 -38 146 -140 108 233 -244 -96 -124 -152 227
7989 227 -171 0 -67 -184 -78 -105 181 -262 163 -26 -34 -104 -125 -279 -22 -65 -57 -73 77 -4 -252 2 170 65
8013 65 66 -107 138 -189 -46 -5 106 -2 58 -107 -122 -94 85 114 29 156 -175 107 -227 -94 41 -194 106
8036 106 -221 19 -69 -27 -103 32 135 -109 78 -17 89 -20 -48 -78 -183 -64 -77 -294 -320 -100 -114 -147 -36
8059 -36 141 -91 129 -34 22 -122 -245 -116 65 38 135 81 -30 158 -70 66 154 -33 -225 -6 -50 -62 1
8082 1 -121 -142 57 69 -234 -183 -83 -172 261 54 19 -9 -103 81 198 17 100 157 273 -130 -66 -15 -150 153
8106 153 -10 79 143 89 31 30 -284 80 -258 31 70 202 223 -73 -152 -153 24 49 -298 -117 68 19 16 57 -12 90
8132 90 -165 -123 -6 29 -102 290 218 -58 -44 -25 30 -161 -51 -194 -8 -20 217 71 56 213 170 -3 263
8155 263 138 -55 -110 -116 101 101 280 99 54 144 54 -204 27 -16 -23 254 79 42 21 180 -12 -56 113 83 54
8180 54 77 121 100 248 -26 127 -93 -388 27 80 -151
8191a51
$$ Imaginary data points
##PAGE= N=2
##DATA TABLE= (X++(I..I)), XYDATA
0 0 0 0 0 0 0 0 0 0 0 0 0 0 0 0 0 0 1 -8 8 -8 8 -8 9 -16 16 -16 24 -24 28 -32 37 -41 48 -54 60 -67 76 -84 95
39 95 -104 117 -130 142 -158 176 -194 213 -236 259 -285 314 -347 381 -422 468 -517 578 -644 724
59 724 -817 934 -1076 1260 -1508 1853 -2378 3261 -5016 9822 -50629 -145477 8032 87822
73 87822 -12720 -81473 -5154 48564 26947 8881 7708 -11718 2999 45413 25747 -45183
85 -45183 -42234 27329 35351 -28613 -42528 6457 25942 1477 -6133 -1286 -5148 5989 23639
98 23639 -2941 -37276 -9996 27280 -2307 -36947 -7276 21109 -1228 -9351 16779 14984 -6116
111 -6116 10326 27611 -2829 -21530 10195 19382 -19814 -24488 16168 13041 -27181 -11779 32648
124 32648 11635 -30436 -2515 35731 206 -37847 -4067 25228 -10902 -34827 -335 19379
136 19379 -5465 -13832 9247 14946 3159 6516 9870 -1903 -949 13590 3865 -18994 -9352 15300
150 15300 5059 -17027 -5567 14804 6449 -4894 3350 3979 -7336 -1241 9565 -8130 -25288
163 -25288 -4490 15264 -4500 -22181 -2051 16579 6650 -2249 4100 3958 1676 11309 9668 -12500
177 -12500 -14910 12583 16745 -13097 -19577 9976 19383 -3114 -9373 6706 7917 -3345 -643
190 -643 3216 -8920 -13959 914 5511 -10865 -14746 1866 9306 1036 -2680 1857 3329 5907
204 5907 9144 -72 -10608 -799 13533 2561 -15257 -5325 14083 8161 -6630 -2087 8672
217 8672 5100 -351 810 -1773 -7058 -2364 2011 -6475 -12827 -2799 5264 -1586 -6312 1271 6044
232 6044 1855 749 3437 197 -2489 3197 4400 -4830 -6710 5395 8453 -2921 -4546 7556
246 7556 9462 -249 -2361 3592 2579 -3052 -2912 -2372 -5693 -5209 -398 -2221 -6333 -1849 4394 1274
262 1274 -3223 1376 4476 -409 -2007 1701 952 -3661 -1305 4411 1613 -2886 1840 8024 4034
277 4034 -1162 2132 5501 1467 -2277 -1339 -1606 -3779 -2564 -1674 -4848 -4407 936 1952 -3033 -2552
293 -2552 3278 2759 -2462 -1970 2007 403 -2855 -726 1802 -476 -487 3306 4053 1110 2130 5201
309 5201 3558 -111 467 1938 -792 -3223 -1710 -1794 -3276 -2639 -187 -1313 -2708 79 2007 -697
325 -697 -2782 195 1156 -1855 -3172 -20 779 -1072 -269 2365 2612 1694 2672 4057 2589 1591 2383
342 2383 1460 -704 -938 302 -1556 -3135 -1266 246 -1601 -2098 42 671 -1385 -1719 -31 -817 -2091
359 -2091 -2058 -1038 -1313 -1680 59 1018 997 1277 2776 3264 2119 1901 2515 1760 345 393 609 -857 -1425
378 -1425 -475 -413 -1623 -767 392 -295 -1657 -792 93 -1195 -2804 -2191 -950 -1289 -1844 -1601 -504 629
396 629 1880 1279 753 1915 3340 3048 1090 -170 1138 2028 417 -1297 -1266 151 839 418 -988
413 -988 -1562 72 1178 -389 -2503 -2691 -1134 -833 -1774 -2783 -2836 -825 1142 1035 -633 -709 2410 4504
431 4504 2092 -778 114 2921 2870 180 -1081 -191 916 1588 1439 -1075 -2310 686 3560 623 -4432
448 -4432 -3843 925 1986 -2790 -5806 -2842 1708 1367 -2229 -3008 21 3268 3237 317 -1328 34
464 34 3342 3928 -591 -2852 158 4620 2898 -2282 -2589 2644 4543 -125 -3393 -1239 2066 303
480 303 -2695 -2877 -1822 -2013 -955 -489 -2142 -2894 479 2771 -46 -2529 587 4436 1427 -2479
496 -2479 -200 4073 1722 -2267 -118 4225 2018 -1646 -27 3383 1719 -1326 -951 502 -473 -2518
512 -2518 -1270 -383 -2521 -3477 -399 1482 -1549 -3776 53 3297 745 -2622 -869 2724 1857 -729
528 -729 -518 1565 1420 585 1618 2534 -207 -607 3146 3492 -1439 -3509 1259 3607 -1011 -5052 -2301
545 -2301 941 341 -2356 -2397 -1205 -1053 587 1863 -1263 -4539 -105 5849 2226 -5614 -3429 5351
561 5351 6450 -1379 -4386 1412 6232 3558 -1947 -2093 1442 2850 1137 -1510 -3109 -2023 1188
576 1188 1975 -2584 -5871 -1093 4352 1194 -5275 -4019 2423 4061 -1646 -4650 -804 3452 1817
591 1817 -1501 -1001 1261 2187 2199 1314 -373 358 2618 2649 -880 -2068 397 2018 -660 -2835 -838
608 -838 881 -605 -2394 -1232 856 -592 -2188 -802 716 -614 -1647 -336 696 232 -317 1087
624 1087 1598 1007 415 1735 2357 1110 -15 1107 1782 108 -1016 -1 768 -370 -1308 -628 108
641 108 -717 -1491 -603 -400 -1229 -1593 -961 -156 -445 -1378 -682 354 735 -58 -2 903 2037 1968 535 -147
661 -147 1429 2591 1463 -915 -663 1078 1603 -190 -2122 -1121 1187 660 -1357 -2068 -1026 364
677 364 -319 -1836 -1997 -599 625 -331 -900 -574 349 1043 1299 163 -245 1196 2470 1194 -216 264
695 264 2043 1528 -184 -159 293 429 350 -572 -1055 -559 -44 -841 -1491 -1547 -800 -300 -1397 -1213 -683 -238
715 -238 -505 178 407 136 194 1048 1115 513 393 1256 1280 563 212 416 962 663 332 -128 -42 415 -123 -1076
737 -1076 -1426 -952 -283 -1205 -2129 -1176 -334 -576 -1086 -913 -10 114 151 262 289 333 942 1023 467 552 725 1164
759 1164 901 528 388 672 560 380 -258 -120 -199 -436 -829 -1351 -1084 -720 -771 -1519 -1055 -432 -268 -646 -602
780 -602 391 382 -20 122 691 819 776 549 722 771 1026 744 765 835 885 620 42 -172 140 -198 -788 -895 -652
803 -652 -679 -1197 -944 -678 -405 -879 -616 -446 -356 1 439 161 52 441 623 708 436 710 1124 1067 851 908
825 908 765 307 702 602 -136 -236 -184 -356 -601 -1071 -748 -683 -739 -799 -870 -700 -414 -558 -512 -173 -57 42 400
848 400 447 384 651 874 978 838 670 571 794 639 820 458 100 305 -152 -486 -573 -489 -236 -826 -990 -684
870 -684 -436 -777 -812 -777 -342 -492 -424 -192 -134 239 364 482 472 851 961 1013 782 560 933 815 465 34
892 34 179 5 -146 -182 -598 -928 -565 -268 -607 -1427 -832 -436 -392 -1451 -1098 -23 115 -149 -191 130 347
913 347 491 947 833 283 816 1590 1009 97 28 949 905 152 -146 -26 101 221 -314 -708 -1179 -866 -317
934 -317 -686 -1271 -1522 -312 283 -589 -1027 -437 180 810 336 -95 314 1543 1437 449 331 1155 1045 683
954 683 835 231 -137 406 1130 45 -1171 -877 920 364 -1523 -1910 20 290 -1101 -1367 -571 -104
972 -104 -523 -149 124 -279 -86 798 1524 -62 -616 1031 1881 451 -543 964 1458 696 -250 158 812
991 812 -79 -598 -260 -162 -314 -568 -972 -523 -580 -1007 -788 -52 -231 -926 -201 632 170 -575 482 1507
1011 1507 486 -154 695 1825 787 -607 627 1543 490 -495 456 1096 -559 -826 465 444 -1514
1028 -1514 -1097 369 56 -1966 -1454 299 13 -1137 -1046 264 263 -344 351 650 84 79 1043 984 241 143
1048 143 740 1583 477 130 444 607 812 199 -689 -335 342 -119 -950 -675 -388 -533 -664 -565 -513 -1012
1068 -1012 -316 395 52 -822 -169 1368 1048 -687 -287 1558 1381 -116 294 1229 772 124 838 520
1086 520 -659 -235 1103 322 -1009 -832 89 -50 -1091 -990 -217 -235 -717 -628 -166 -416 -525 192 -16
1105 -16 -171 257 682 284 57 736 719 423 569 853 548 -57 481 530 -165 -286 65 7 -607 -574 -274 -473
1127 -473 -1015 -408 -84 -520 -1017 -303 211 -607 -846 297 458 -312 113 896 703 95 762 1183 598 326
1147 326 1118 506 -95 128 543 95 -530 -236 -38 -421 -661 -486 -331 -431 -997 -465 -393 -823 -738 347
1167 347 -94 -737 380 694 1 104 806 462 154 385 693 380 372 689 593 -301 -81 361 122 -382 -405
1188 -405 58 -191 -752 -523 -295 -561 -629 -534 -209 -733 -707 48 9 14 75 458 362 315 611 915 297 227 629
1211 629 643 299 20 610 190 -314 228 168 -407 -385 -417 -277 -511 -821 -301 -337 -681 -583 118 -436 -646 21
1233 21 173 -218 -165 642 479 5 380 795 533 227 558 520 345 99 353 329 -42 -246 75 -308 -813
1254 -813 -259 -290 -736 -478 -319 -411 -763 -405 -122 -196 -496 -38 318 -75 87 429 472 2 316 910 380
1275 380 369 610 651 361 -94 64 262 -275 -395 -123 -275 -621 -372 -496 -597 -635 -476 -254 -411 -435 -31
1296 -31 202 -123 -102 235 178 177 663 677 180 413 711 752 167 116 523 428 23 -19 155 -417 -515 -328 -361 -492
1320 -492 -373 -489 -487 -627 -670 -303 -345 -276 -150 67 -112 -4 158 265 267 258 540 470 440 336 679 433 210 307
1344 307 148 263 -32 128 -182 -307 -326 -647 -567 -563 -479 -415 -593 -374 -445 -183 -21 -161 -29 230 218 182 448
1367 448 294 269 644 528 297 437 221 383 304 -64 280 6 -37 -132 -195 -247 -487 -355 -578 -397 -282 -167
1389 -167 -421 -459 -253 -156 -342 -78 268 61 107 501 391 615 437 460 625 637 219 418 313 151 -179 499
1411 499 -38 -128 -596 -345 -177 -159 -504 -236 -574 -389 -150 -481 -454 -438 20 -67 4 53 287 461 553 503 178
1434 178 285 919 486 -44 138 86 318 57 -29 -51 -74 -265 -241 -372 -449 -387 -300 -327 -444 -620 -501 127 -425
1457 -425 -202 -236 -38 278 98 126 442 491 289 469 694 176 213 554 497 -14 -420 189 301 -416 -184 -16
1479 -16 -158 -637 -507 -83 -375 -563 -423 -235 -302 -303 -114 88 246 -156 242 731 239 130 327 511 433 110
1501 110 353 497 146 99 212 99 106 48 -167 -95 -528 -572 -590 -136 -342 -627 -305 -407 -315 -406 -458 39 170
1524 170 -43 -156 492 533 0 182 472 466 -89 667 728 235 -253 338 444 -132 -464 12 23 -276 -583 -372
1546 -372 -191 -503 -567 -440 -346 -229 -346 192 -161 -127 151 288 57 349 215 333 423 343 218 447 544 241
1568 241 100 139 238 88 212 -47 -256 -379 -423 -184 -269 -466 -347 -21 -64 -567 -433 -56 113 -4 -109 164
1590 164 391 -55 276 438 228 122 211 395 179 160 555 164 -187 -80 152 90 -426 -347 -295 -185 -666 -158
1612 -158 -388 -519 -605 -169 -191 -433 -48 178 -40 270 106 349 102 139 250 495 288 407 365 253 193 286
1634 286 626 -24 -158 15 52 -231 -512 -279 -577 -446 -185 -336 -484 -318 -156 -182 -264 -131 -247 -6 82
1655 82 135 254 244 23 462 605 418 362 255 391 21 103 313 53 -121 85 66 -219 -505 -151 -458 -672
1677 -672 -184 35 -279 -596 -397 -117 -202 -105 69 269 -100 176 452 343 281 200 467 379 280 154 208 104
1699 104 137 199 78 -264 -290 -73 -120 -225 -402 -432 -286 -399 -199 -190 -499 -204 -384 -160 126 8 113 186 223
1722 223 242 604 -8 297 229 320 216 320 315 87 -40 21 181 -196 -409 -180 -347 -323 -268 -369 -512 -394 -76
1745 -76 -190 -223 -382 133 136 -34 -56 129 177 423 298 420 242 201 538 431 294 -11 187 144 -151 -21 -221
1768 -221 -145 -248 20 -250 -248 -232 -182 -572 -238 -59 -188 -337 -281 -183 23 29 193 290 179 416 307 378 325 414
1792 414 397 288 319 102 257 287 -231 -50 96 -65 -397 -372 -274 -512 -248 -356 -69 -288 -511 -134 -99 -45
1814 -45 91 149 46 302 301 322 57 361 467 454 318 370 157 318 142 -6 253 73 -178 -270 -8 -216 -370
1837 -370 -527 -405 -124 -373 -187 -176 -383 -112 -319 38 -33 -35 34 94 548 199 136 64 300 138 179 320 434
1860 434 260 -46 311 -96 -249 13 -194 -118 -213 -259 -235 -216 -372 -346 -242 -210 -245 -260 77 139 259 217 185 328
1884 328 279 391 326 172 145 398 51 198 229 94 95 20 4 -354 -370 -326 -329 -491 -400 -392 -31 -536 -151 -68 -136 -178
1910 -178 184 -38 30 165 89 563 252 205 237 281 216 307 118 388 319 3 -64 204 -297 -137 -139 -122 -141 -195 -141
1935 -141 -322 -121 -99 -289 -323 -113 -341 -47 -81 181 264 -7 52 376 78 277 237 117 261 120 389 71
1957 71 -189 360 207 130 -229 -277 10 -61 -152 -278 -319 -441 -437 24 -75 -154 -226 -98 176 178 -50 207 297 -48 -160
1982 -160 460 333 283 292 294 62 147 -60 159 167 268 -277 -153 -424 -473 -548 -153 -218 -299 -285 -142 -342 -37 -248
2006 -248 93 206 -20 83 40 44 340 116 247 316 351 258 290 166 6 206 47 -170 -237 -258 -179 -165 -2 -418
2030 -418 -249 -393 -325 -549 45 -79 -134 46 -115 18 -37 95 85 234 -14 226 263 83 117 280 294 84
2052 84 48 366 184 168 -51 74 -61 -188 -188 -330 -397 -587 -56 -91 -441 -406 -27 -127 -246 -175 -129 -136 128 255
2076 255 115 -73 424 128 263 175 352 413 56 56 86 408 -84 -197 -76 -314 -178 85 -225 -298 -160 -401
2098 -401 84 39 -100 -207 -86 130 225 325 -92 157 273 83 236 183 395 410 299 -93 171 141 37 268
2120 268 94 308 -85 -26 -167 -331 -250 -295 -31 -146 -275 60 -93 -86 0 32 12 99 132 350 187 194 243 180 98
2145 98 205 230 100 160 199 175 30 -45 5 -161 -97 -175 -133 -151 -529 -96 -229 -625 -319 -58 -153 -150 18 97 -63
2170 -63 91 195 182 116 260 316 404 3 179 164 166 200 172 0 11 -13 -34 28 -384 -318 -158 -260 -384 -283 -220
2195 -220 -30 -272 -244 -129 -269 -76 27 97 98 -117 256 257 -52 192 277 366 32 318 230 21 139 141 42 -72
2219 -72 -45 137 -353 -135 -196 19 -332 -455 -3 -534 -300 121 254 -86 -30 -4 127 -19 -121 210 -19 72
2241 72 120 251 54 106 234 48 -123 -116 142 -242 -91 144 -106 -251 -68 -85 -279 -429 -31 -231 -198 -253 -165
2264 -165 -86 41 -50 8 430 220 199 230 159 141 249 -40 10 -25 118 119 60 -264 99 136 -396 -111 -367 -131
2288 -131 -375 -165 -45 32 -299 116 -83 -49 19 28 -80 -43 -8 -6 187 111 407 360 400 91 57 83 156 171 217 332
2314 332 91 22 68 -262 -293 -111 -114 -338 -95 -220 -64 -408 -286 -170 -195 -91 253 106 46 -46 345 166 145
2337 145 -73 349 187 20 168 224 185 -74 -27 60 -267 -175 21 -245 -216 14 -24 -196 -424 -59 29 -174 -27
2360 -27 111 -71 100 -11 103 158 88 166 144 -23 -3 -130 -95 271 232 267 214 207 -63 -176 103 -155 -178 -94 25
2385 25 -281 -371 -69 -165 -187 -68 -83 -255 3 -203 129 -105 138 -131 361 200 -87 197 62 200 266 187
2407 187 -79 206 46 123 -109 37 -12 -21 -94 -180 -191 -188 -186 -115 -210 -316 -198 -241 31 -7 -25 -88 -176 -75 112 438
2433 438 234 -34 273 71 -49 74 20 128 -19 -135 -73 -3 -374 -38 -148 -200 -52 -168 -161 0 -221 -241
2455 -241 -97 -149 -91 59 309 314 -12 29 -155 149 128 144 217 186 196 336 188 -115 -58 69 -135 30 -16 -32
2479 -32 -93 -194 -163 -155 -56 -253 -257 -18 -123 -10 56 -82 214 -189 -108 -2 201 240 -163 339 218 -2 41 97
2503 97 334 -29 -6 -161 -19 -166 -41 -52 -138 -321 -300 -101 -305 -127 -126 -81 -163 -43 59 31 49 -53 143 149
2527 149 167 367 98 57 94 139 183 285 190 -4 263 8 194 56 -63 -210 -164 -255 -81 -326 -227 -212 -306 -258
2551 -258 195 -439 -122 241 -402 28 296 299 56 193 263 196 222 50 140 229 312 98 -103 24 64 -145 -147 212
2575 212 -149 -433 -131 -203 -172 -287 -106 -57 -208 34 -76 -39 -217 -67 66 10 224 147 17 161 187 208 109
2598 109 52 350 218 24 9 125 -2 -20 11 -117 -399 -176 -108 114 -110 -145 -184 -153 -233 -108 -250 -10 236
2621 236 -9 129 -13 155 130 72 70 207 132 135 311 -99 89 -80 98 -68 -213 -43 -197 29 -317 -34
2643 -34 -256 -113 -128 -220 -174 -145 -95 -334 160 31 148 84 131 -26 184 97 92 -53 405 -181 115 63 294 161
2667 161 -54 -103 -80 -1 -168 11 236 -263 -130 -171 311 8 -81 104 -40 67 123 39 62 279 30 197 165
2690 165 317 168 240 187 152 176 384 301 136 -223 97 -145 -114 -19 -31 -169 -40 -319 -67 -40 -335 -48 3
2713 3 7 -86 -88 -266 -36 242 45 145 179 165 194 193 388 132 39 359 89 265 -41 10 -178 -142 -89 117 -111
2738 -111 -16 -76 -10 14 82 -58 -180 -239 112 -265 12 -57 36 237 -181 203 -54 21 63 331 224 -95 -266
2761 -266 7 -6 12 150 -15 219 -89 -116 212 -167 0 -159 -269 -356 -157 -91 -26 0 -230 5 -135 -116 -68
2784 -68 -78 -73 156 -54 -238 14 254 203 122 226 -24 29 43 98 64 114 -348 -124 45 -161 -218 -107 -156 -196 -269
2809 -269 -361 0 -216 -146 23 -129 171 -206 -74 -106 268 32 197 -63 -6 400 372 35 31 135 -88 -112 23
2832 23 -3 -85 -160 -208 -76 2 50 -55 -184 -98 -149 -45 18 -23 103 192 -75 122 -247 52 15 153 325 108
2856 108 366 -181 238 116 -68 -125 104 6 210 -31 25 -72 -116 -97 -37 -161 25 -9 -131 -177 -102 153 74 166
2880 166 143 -19 290 214 329 147 50 233 146 -80 101 159 161 111 57 -128 -78 51 -53 -100 -171 -309 -325 107
2904 107 -7 -57 199 37 -160 -50 23 -5 -99 38 260 42 13 -72 143 3 270 189 -162 70 -195 57
2926 57 45 -105 60 -306 18 188 -185 -63 -178 -269 -43 -43 123 -216 -41 253 12 78 10 -100 47 216
2948 216 240 147 217 177 86 146 1 299 -111 99 139 78 -104 -87 -15 -28 203 37 -254 -233 -100 -140 -13 -49 71
2973 71 69 -132 45 87 37 -60 -104 143 -18 -6 312 -45 136 -23 215 -51 125 -159 -115 95 43 -63 -205
2996 -205 -184 142 -194 -183 -84 -158 -209 -185 -122 8 -96 -199 93 31 -126 60 -3 7 36 205 -96 108 -50 -44
3020 -44 311 -170 -131 22 -292 -178 -59 334 -67 -3 -32 -73 99 -243 59 15 -354 53 -136 132 -419 34
3042 34 -49 198 198 164 -142 151 49 87 75 156 -76 -247 -7 135 -1 -152 23 -203 215 -226 -167 -283 -58
3065 -58 -149 128 -40 -11 -73 -43 83 59 169 48 250 -8 191 -217 79 263 200 77 141 103 48 186 -164
3088 -164 -34 -10 8 -137 -69 -8 -68 -18 -249 0 -39 -50 -165 -231 51 85 250 114 64 323 231 -60 92 -52
3112 -52 10 15 -6 -3 -10 23 71 -34 -128 34 28 119 -162 -393 -49 -87 -200 -1 -172 -366 -3 138 -113 -261 93
3137 93 32 249 11 89 119 -4 258 163 -195 49 83 114 131 -82 95 59 1 -59 -107 92 -162 -90 56 228
3161 228 -111 101 80 -256 -247 -60 231 -70 -30 246 -52 180 -40 12 48 193 24 81 4 -103 187 204 156
3184 156 -22 -234 1 50 -254 -64 -93 58 223 -328 150 75 -13 -111 -151 36 17 168 22 -86 36 -56 71
3207 71 -282 56 2 67 130 160 20 19 -183 41 38 18 -135 -183 -377 131 -209 -155 -132 -176 -23 9 -172 -168 -149 -175
3233 -175 165 -20 234 130 186 119 422 167 278 -22 194 -71 431 196 123 282 106 21 8 -199 23 6
3255 6 -404 -187 -125 70 -61 18 39 36 -305 66 230 80 11 -106 132 279 24 158 107 119 208 17 114 -70
3279 -70 289 41 -24 106 1 266 -53 -184 197 5 50 -167 59 -49 -44 97 202 -76 52 -73 -75 44
3301 44 -4 80 205 113 -19 -23 123 37 94 20 130 -13 141 -141 -185 -127 -192 8 50 -176 -21 -162 -359 -160
3325 -160 145 -255 209 -163 -269 -73 -162 36 -5 -18 -63 262 -137 -139 -167 50 -103 -112 94 43 -60 192 -79
3348 -79 36 180 -288 -219 -92 -275 -376 -41 -114 -10 -239 100 -64 90 267 173 -93 57 43 219 194 57
3370 57 117 228 112 147 352 -90 -10 47 -66 -75 145 -142 192 -405 -417 98 -206 -9 -69 -191 85 -220 235
3393 235 181 -123 -135 -53 -69 75 97 121 254 119 6 52 239 65 54 -200 -168 201 -31 101 -63 -152 70
3416 70 -34 -10 25 3 -98 41 -3 184 -46 137 101 -54 65 34 295 -170 -72 22 90 123 45 4 -80 -119 114
3441 114 61 -131 -198 11 -54 3 -82 -186 -327 -89 94 -38 -250 -14 -126 48 -97 -150 65 -108 160 218
3463 218 -152 -52 0 203 78 -15 88 39 204 91 314 183 -99 57 85 -165 -253 -304 -237 -102 41 -72
3485 -72 52 102 109 -11 68 -109 312 215 -67 -4 278 203 60 -106 -60 -29 116 97 -279 249 185 177 68 156 -7
3510 -7 -67 -139 -190 -31 -244 -59 -109 27 -77 -20 -43 -202 -217 -2 65 -237 12 105 331 253 -70 210 17 373
3534 373 -22 248 -52 -370 -4 21 -129 -59 -173 -197 -126 -279 -23 -133 -87 40 28 -350 -209 -80 -18 263
3556 263 42 77 -116 -7 47 24 133 9 46 38 -103 253 54 55 2 60 63 -116 -92 23 -26 -29 -185 -223 145 -202
3582 -202 -61 0 17 -61 -170 -139 -242 100 48 -56 93 7 -37 214 -58 252 83 41 -81 -46 -199 -99 221
3605 221 21 -70 16 -79 11 -12 -55 144 -119 -215 49 128 10 50 -287 119 -95 48 83 59 -185 206 -164 -171
3629 -171 244 301 68 -113 244 129 66 73 112 -56 -278 33 -161 -40 75 83 -86 -151 -147 -110 -80 -121 138 42 104
3654 104 17 199 28 179 212 237 117 -94 -189 -191 327 68 -90 76 163 151 -103 131 175 32 19 -59 -197 132
3678 132 -182 -73 135 -171 -94 -309 19 104 -227 -62 246 -143 -5 -244 -119 113 -82 -1 -94 -92 -27 81
3700 81 127 -182 1 -191 -66 35 -82 143 -39 -23 -90 -507 -64 76 62 -67 -22 0 -155 -51 -53 32 -24 17
3724 17 98 88 -123 149 -90 -141 -64 -26 -98 117 -67 16 -130 83 47 -39 73 -24 3 -96 -125 32 -17 -21 226 -43
3750 -43 145 131 -7 46 146 71 211 199 133 139 -1 9 128 -76 126 64 28 -198 95 244 150 167 256 -94 -32
3775 -32 192 111 -45 37 -210 -99 65 -19 113 91 -118 -40 72 33 46 -132 -299 177 -232 -83 157 218 130
3798 130 85 -102 -47 -65 -6 49 -55 17 -173 -122 -180 54 -10 -170 -17 -109 78 -58 216 -66 60 70 22 -54
3822 -54 12 132 1 -92 52 -99 132 32 32 -74 -118 -10 -143 90 71 215 -71 2 -55 84 -75 251 -6
3845 -6 -60 162 15 138 -21 107 -122 -75 -14 -55 117 -103 -26 58 126 -160 86 -261 -54 -50 -61 -157 -10 -207
3869 -207 -128 -100 138 78 -120 -38 102 -146 83 178 158 -117 177 -92 138 38 -9 174 97 -44 39 -33 291
3892 291 -89 49 -71 -88 111 -108 257 -118 -28 -42 95 114 93 -19 -197 -166 -233 145 36 98 271 -118 -243
3915 -243 117 58 -194 114 -9 191 -127 -197 142 -110 87 121 115 -151 32 84 -134 -34 -60 65 152 193 -65
3938 -65 82 -35 -58 71 -22 68 114 -109 -101 48 298 -6 -80 -3 25 63 -137 -52 164 -13 12 93 -101 163 -28
3963 -28 152 3 -41 -39 -121 -137 -127 -32 -149 52 -51 -85 -153 -112 47 13 304 -3 -207 186 97 17 -24 29 58 24
3989 24 65 -193 -10 -203 -57 29 -50 -67 109 47 48 59 -6 -183 98 -53 191 12 -111 56 105 109 281 92
4013 92 205 93 -155 228 194 -44 40 -86 29 -45 -205 20 35 15 -215 131 -140 -23 -150 -226 -105 -243
4035 -243 -40 -118 -192 -113 225 -30 102 -182 -244 -55 151 129 -177 -86 -88 -146 -223 59 341 -215 126 -68 41
4058 41 133 -8 -31 -28 -102 -205 103 108 -239 116 87 -196 -31 -48 68 -91 103 86 -33 170 -4 -372 164 109
4082 109 -23 14 -27 124 12 -279 124 -71 -14 8 -24 -36 -19 101 -112 137 -148 -75 -49 36 17 -66 76 203
4106 203 19 -59 18 192 -36 14 123 77 302 161 119 -2 -108 -33 84 33 119 45 -55 -119 12 -96 -79 -2
4130 -2 33 -152 175 303 405 -24 37 140 -33 -262 40 -34 209 119 145 279 203 -116 -103 11 49 38 -26 -112
4154 -112 -5 -144 52 67 -179 62 8 145 36 -114 -26 154 -256 208 -227 -229 -2 -25 80 45 253 208 229
4177 229 384 25 -101 93 114 -22 0 -94 46 -41 161 130 72 -43 307 16 -111 -21 -53 131 102 148 -217
4200 -217 85 -17 -34 87 -135 9 140 65 -75 21 48 -83 174 72 -58 -28 293 42 175 0 174 152
4222 152 93 118 -97 -54 -235 93 84 -140 111 -29 139 -207 -96 82 -4 -173 62 228 133 -16 268 159
4244 159 113 111 33 257 75 63 -88 -53 -292 37 -168 -243 -94 -16 319 166 -80 -32 -157 -25 -27 16 47 -126
4268 -126 21 62 -68 359 81 -60 172 189 138 -109 -8 250 43 10 -43 -152 -9 -323 -228 30 11 -4 -191
4291 -191 -104 -281 -13 -38 118 120 191 283 33 85 -83 -20 -8 200 116 -81 -84 265 77 -222 -258 -3 -150 -173 97
4316 97 -24 43 66 -96 27 -259 -144 -44 -172 -114 -79 154 -270 -155 91 -96 26 -57 72 -14 99 66 152
4339 152 173 94 100 71 -14 129 58 -155 24 -91 -13 7 119 83 -71 -70 -84 -162 -83 296 260 37 172 -168 -172 -212
4365 -212 109 92 139 -155 -143 118 -364 148 43 -337 -10 -77 -140 82 -95 40 25 39 30 -135 -16 -60 51
4388 51 4 102 -134 -201 -130 -219 170 12 91 215 129 -89 9 -163 182 110 137 -47 206 23 122 80 69 35 299
4413 299 -172 -218 -46 185 -196 48 -55 -294 -242 -204 -36 -108 -83 -40 207 -334 175 21 -9 -173 59 -120
4435 -120 -27 271 74 299 -138 -14 141 -88 -17 -7 95 -59 -180 -121 -1 -177 56 -117 45 -86 117
4456 117 -32 -62 2 -27 182 -131 -25 37 -117 -116 -141 -120 73 379 57 153 77 122 -6 114 -70 -69 37 71 -161
4481 -161 -26 121 9 51 -109 -102 -154 -93 -274 51 192 -86 -58 -99 -38 341 -77 -8 -14 33 4 246 37 -117
4505 -117 -53 -138 38 95 -23 -60 -109 -238 -472 5 137 -61 -52 -79 -255 -192 161 5 6 9 133 124 168 12 199
4530 199 -56 66 44 -96 3 -50 206 212 -24 -115 -339 23 116 -51 39 -127 104 41 -142 -240 13 -64 -128 248
4554 248 -41 -161 -73 -75 96 283 20 77 -137 82 -158 174 117 -2 47 283 103 -16 -94 9 -97 47
4576 47 69 -50 27 266 -173 137 -141 -135 -115 -204 35 54 -200 -70 -65 156 -154 -57 -75 -115 -47 146 65 -151 188
4601 188 167 76 -14 230 -50 312 -30 22 -86 -9 -42 7 7 -67 -164 -90 -156 210 -31 -11 -107 51 -28 -17 36 135
4627 135 52 39 161 -60 -16 -81 -43 -86 -183 -172 -145 7 -161 41 201 -43 -38 -192 -65 100 48 -17 -17 56 -26 -144
4653 -144 49 60 43 -23 -276 64 -38 -44 35 -5 -245 141 192 -35 232 77 79 -72 64 -44 -206 -60 91
4676 91 50 -123 166 36 41 -320 89 61 68 21 101 27 92 -62 161 108 -66 88 24 -142 -40 161 -111 -40 -39
4701 -39 -116 5 70 15 -223 -180 -225 -64 -215 -11 -228 -10 64 105 -78 -245 252 -72 -132 -172 153 -112 32
4724 32 -236 59 -18 187 -64 -112 137 39 54 85 1 -90 -58 10 -51 26 -52 211 -124 22 94 -194 -51 -125 -275
4749 -275 371 280 -212 -156 10 227 119 29 225 -91 -147 -115 10 135 161 -199 150 100 -144 5 -248 12
4771 12 75 171 132 28 76 238 -58 -22 2 -89 28 32 188 -75 211 -63 54 -63 156 -45 97 46 -467 -104
4795 -104 -88 -150 -183 55 -33 24 -110 -55 -90 -94 -140 -44 -6 -199 -72 -53 -219 -243 -71 -44 51 194 79 62 132 259
4821 259 87 255 345 47 56 150 -134 160 -208 88 39 109 -42 -308 -157 -222 168 2 76 14 53 -25 19 59
4845 59 -46 49 -91 89 -31 37 117 -127 -251 148 -55 4 56 -212 165 -101 -77 -75 -142 -89 -158 74 102 86 -141
4870 -141 278 -138 -86 152 26 110 -70 15 217 235 178 -1 -49 -90 -82 38 -21 -88 143 71 56 144 -20 155 -16
4895 -16 195 257 42 -142 -162 -69 -21 0 -9 3 -191 -24 92 -224 -19 -43 51 -77 -86 170 -8 3 18 -28 178
4920 178 -105 35 20 -48 142 -140 -81 -45 59 126 -117 142 -80 -120 -182 146 72 46 258 17 -132 -120 -21 118
4944 118 25 0 -289 -79 45 -94 87 -144 154 36 139 -141 -99 -33 -22 -62 53 -99 27 -22 -28 -80 2 96
4968 96 175 -79 117 -43 -178 8 118 6 118 -66 26 33 11 -14 -46 54 195 105 108 424 11 80 163 -34
4992 -34 124 89 78 -238 -121 24 -202 -80 77 -169 -192 -152 102 178 -46 -243 182 -55 28 175 100 48 -7
5015 -7 174 154 22 -60 -85 95 -198 -191 -264 -179 -44 19 241 -100 -63 37 -173 -149 124 -187 131 -34 -95 -212
5039 -212 -93 97 45 31 60 33 -189 -122 -14 -27 -33 -65 44 -14 -65 39 58 343 14 -36 -79 -47 -29 -158 143
5064 143 -85 -36 -250 22 -29 -7 121 151 33 -25 55 90 20 -22 -128 -73 -4 85 245 -75 118 15 115 55
5088 55 21 6 -202 142 17 33 -286 210 62 -103 84 -40 -144 1 -18 53 -258 -146 175 105 78 192 -36
5111 -36 23 43 95 97 -212 303 152 251 78 -116 44 -53 -45 5 56 -44 -266 55 161 34 -126 35 -17 199
5135 199 42 27 -49 -104 41 -37 34 189 8 -80 150 242 165 -207 -107 -80 16 -57 24 -205 -233 -230 172 258 217 -6
5161 -6 280 68 198 110 -229 -25 -169 67 -17 18 -123 -27 231 -127 -67 214 58 164 -51 198 -85 -18 -5
5184 -5 120 -4 -129 27 72 -91 71 34 -329 0 394 147 87 268 39 30 -26 -13 114 136 16 78 -233 247
5208 247 -51 -97 4 240 354 -62 -178 -96 -80 221 -287 -77 175 -103 57 -143 -87 36 -144 -148 136 -53
5230 -53 53 9 -239 83 -198 85 -94 63 -214 -74 219 124 198 147 -46 90 42 66 87 -68 -26 21 -62 13
5254 13 -165 -174 60 -161 -190 166 38 -263 -53 87 -75 -27 -161 -66 33 -136 36 -82 22 -147 -124 252 193
5277 193 155 137 -98 127 214 -137 44 8 42 17 89 69 35 113 57 -5 64 148 -164 -140 -39 164 202 237 -243 224
5303 224 17 -9 4 -24 41 -74 -116 -74 58 53 120 81 269 -87 226 97 -111 2 220 -216 -4 15 19 -112
5327 -112 -78 129 -122 6 -22 143 36 9 104 97 -76 -14 120 251 70 67 -104 99 25 -159 -55 76 -22 -42
5351 -42 -27 194 -21 8 -36 -112 -266 -33 45 -31 -120 48 -21 72 -97 50 437 -340 263 143 220 3 -8 -104
5375 -104 109 192 118 -39 -248 87 37 135 77 -15 -165 -139 -36 -87 -295 -49 272 -2 11 -4 -273 218 -184
5398 -184 -42 259 -20 235 50 106 185 -235 30 40 -134 -53 56 -37 -46 4 -47 85 -23 52 -196 317 155
5421 155 -183 271 184 -215 -33 65 -42 -147 -139 -182 -171 112 26 -279 -42 -58 100 -30 123 94 20 62 -81 -41
5445 -41 24 78 227 -181 39 -58 134 135 0 194 -64 89 8 -103 -100 6 -132 -83 -32 -94 -44 -92 140 -24 255
5470 255 77 -132 190 -13 77 -119 -210 -78 14 47 -283 144 2 -115 90 41 -48 122 116 -63 131 131 1
5493 1 -233 40 101 -79 -102 25 -66 -78 140 -361 -161 -113 -134 125 -153 38 -181 153 -94 77 -172 144 -142
5516 -142 -87 -58 55 117 161 -88 -159 -127 140 -21 -217 82 17 -315 -170 41 11 -47 278 144 -85 179 3
5539 3 -47 -76 379 -164 76 12 -80 -128 281 -96 -62 38 -44 65 -85 61 6 -64 73 -179 -4 -138 -203 200
5563 200 -49 -41 -77 22 72 -9 -120 168 -124 62 -42 -34 -1 -260 -89 100 -204 55 -119 141 -11 -162 -23
5586 -23 5 -102 280 -2 27 116 336 61 -137 -211 -113 -11 274 220 248 53 43 160 -84 29 382 -282 89
5609 89 -25 -110 -103 20 25 -124 42 10 51 68 39 -209 80 -61 -109 26 11 -14 254 161 90 -72 -42 123 136 -90
5635 -90 103 150 -215 37 184 -177 -233 244 -82 -41 -88 16 -84 -12 91 153 -172 -16 -69 -199 154 135 -191
5658 -191 -53 -147 74 77 -13 95 -16 -60 204 72 64 1 132 117 -180 -31 -188 -200 -69 -63 -158 1 74 206 -112
5683 -112 34 -57 -57 72 -12 -8 67 240 -7 -58 -157 107 84 -114 -266 -51 60 126 -39 -103 -228 -13 114 59
5707 59 43 -143 13 208 -147 -242 111 98 -111 -424 74 122 8 65 41 -137 -86 -104 85 131 10 67 -11 -96
5731 -96 -92 -49 304 -106 -9 96 -181 147 -85 60 -156 -91 -165 -152 -177 12 272 119 147 108 96 -32 52 228
5755 228 -153 -157 -155 60 -80 -98 130 46 -175 95 -47 21 79 -30 27 -117 -234 -25 -182 39 205 -12 -74
5778 -74 44 -24 -15 -91 -230 -6 -260 75 16 67 93 164 53 -118 -79 78 86 335 -223 62 60 -209 -45 -64 158
5803 158 -282 -14 172 -229 38 131 58 -8 151 -3 6 -97 130 127 -173 57 143 -158 -93 156 3 147 -168
5826 -168 238 -22 48 -65 -56 -277 75 28 -3 -125 41 3 -172 -89 10 -228 312 29 -122 -23 29 295 -125
5849 -125 23 -295 85 -224 63 173 -26 -215 -53 2 128 -108 -9 -284 -147 -69 65 -92 -145 58 -125
5870 -125 -109 30 -164 113 126 202 214 -94 223 -58 111 -28 -175 -56 169 -55 86 132 -25 78 -10 -14 188
5893 188 -100 422 -59 -88 264 -153 -99 169 268 69 63 -126 -67 -76 91 -180 28 111 -17 -167 69 -34 -182
5916 -182 26 143 192 188 -182 208 -97 -10 131 107 17 -176 204 -16 81 -40 -109 -128 -215 -189 69 -99 -82 196
5940 196 4 -202 -265 127 112 28 45 26 -127 1 -144 198 -147 127 -305 -88 158 -141 53 -22 -1 -376
5962 -376 174 -8 42 119 -107 127 38 17 211 -93 62 191 -11 -225 11 71 -42 -61 -81 61 -19 144 34
5985 34 34 309 269 -127 -34 -7 -88 -6 36 82 182 116 89 37 64 -17 -251 -69 124 216 16 -38 14 8 -57 10 -169
6012 -169 -131 -61 80 197 -86 167 -9 -187 -144 -159 34 10 -1 5 131 -252 -65 -218 -141 40 154 92 -69
6035 -69 -88 -54 148 53 -21 -183 27 -78 170 -134 10 -288 26 296 -114 113 -72 -245 230 103 -48 -96
6057 -96 166 -87 -80 -38 -24 -162 26 -75 -42 -272 -172 -169 -31 -27 -141 -55 -55 -171 -150 -147 -51 -115 -22 69 54 86 0 16
6085 16 -120 -96 90 -175 90 58 107 -129 7 -124 -230 -23 108 -207 -150 -286 -35 95 -76 108 -58 150
6107 150 -35 -132 56 9 -38 19 182 -87 143 28 -242 102 -281 33 -111 -38 72 -104 -70 5 56 65 124 -269
6131 -269 137 -88 -189 -125 -129 9 -102 129 75 -36 -48 308 -100 19 -31 357 14 170 256 46 -134 281
6153 281 44 -106 -9 19 -33 -71 148 -54 -98 249 60 -261 -298 103 115 -28 4 70 182 8 -13 -72 19 -267
6177 -267 -58 -25 -24 -108 139 -31 -156 161 -74 45 -109 60 -87 -77 -45 -30 -167 331 -96 32 139 30
6199 30 -48 -183 83 147 99 -102 -78 -121 -118 240 47 -92 192 -124 -102 -31 -52 -99 281 10 -7 -31 34 -33 183
6224 183 82 80 94 132 -131 70 31 -209 86 -45 96 15 -60 276 -179 237 48 -37 -23 -21 197 -252 -81 -158
6248 -158 -49 -49 39 -9 111 -136 38 117 -132 4 128 104 -199 1 115 -65 85 80 -116 130 198 -44 -30
6271 -30 35 68 -246 -74 104 23 50 -225 8 166 122 126 -125 -80 52 -163 -118 197 217 -179 -138 30 50 -286
6295 -286 79 19 -9 77 55 19 -42 -51 -95 -70 84 59 -10 -246 54 -27 1 -55 -228 34 133 55 -82 260 -131 -46
6321 -46 364 -204 122 -79 85 230 -186 -96 175 184 104 91 175 -166 -70 220 13 225 -46 -57 -194 134 -196
6344 -196 40 42 -62 -42 55 156 -50 -152 122 22 -84 -139 -251 -69 22 30 -63 74 -16 -29 -131 -236 -150 -114
6368 -114 -156 -138 145 -143 407 195 -26 130 146 94 32 -26 -16 73 -104 -58 -128 -153 -50 -15 -110 -35 -109 -228 42
6393 42 -190 -199 -150 -203 54 85 56 -42 -115 -162 -177 66 13 -129 54 -7 -131 -85 5 111 233 -13 2 -128 22
6418 22 161 -37 -58 32 -162 -39 196 58 -4 162 64 281 -5 -123 -85 56 36 -31 335 217 -55 -18 -225
6441 -225 70 -21 183 -37 -137 101 203 163 -266 174 116 -106 -116 82 54 -182 141 -207 -112 161 -149 -61
6463 -61 207 65 270 -172 -44 -32 -9 55 174 67 -43 268 6 131 148 28 -96 69 196 79 -155 80
6485 80 -27 259 38 142 -195 113 -12 -256 -211 40 -96 -20 -72 30 240 -81 72 100 0 -161 98 134
6507 134 89 35 30 -48 -166 94 -80 19 54 -16 -21 83 -7 -81 118 -166 177 96 36 170 17 -83 -143 -78 -48 14
6533 14 172 -204 39 217 102 82 92 -114 -115 18 219 -10 62 -33 -193 -206 104 -110 -229 -186 208 21 -115
6556 -115 -94 -77 281 248 -129 149 238 -18 -226 14 -244 115 52 139 107 1 -82 -122 30 0 10 49 -209 -193
6580 -193 163 110 22 65 -149 -213 263 146 -34 365 -128 1 114 -13 111 -46 57 69 15 -194 -110 172
6602 172 0 34 -244 151 -31 -74 115 -61 33 149 -330 -150 95 77 -111 -179 -304 272 164 118 42 10 51
6625 51 131 31 169 130 73 81 30 62 -49 -44 44 184 -65 -172 -67 14 124 62 207 -33 13 -45 8 74 121 147
6651 147 39 196 -46 -150 233 130 25 130 1 192 150 -113 173 29 119 -73 168 -69 55 -58 106
6672 106 114 -78 41 -92 -92 -146 -4 -130 -206 -131 -265 -81 270 234 84 176 -163 193 72 -46 20 13 61 189
6696 189 221 -271 -36 107 271 29 63 -37 -254 -1 -76 -80 -56 32 -255 -14 54 173 49 38 13 -42 -103 -263
6720 -263 -49 -232 -66 181 -1 -126 -134 -179 -24 -3 105 -18 77 -100 143 70 98 -20 139 117 -82 220 -16
6743 -16 -73 168 -135 90 299 -84 -60 225 251 -88 149 184 129 -106 -100 -47 123 159 -199 -42 90 80 92 3
6767 3 -132 42 -98 85 12 231 140 132 -84 87 -3 -48 -28 -33 77 -148 -35 -163 -185 120 83 -151 25 164
6791 164 181 79 -131 82 116 -65 17 -51 -123 150 248 -36 -190 -165 -37 22 -196 151 -148 -165 -133 51 108 95
6815 95 10 -142 7 103 -126 -48 176 -238 285 105 -95 -176 36 145 -54 106 -148 -17 22 71 -68 236
6837 236 -65 0 -18 6 -155 -38 92 16 -57 -27 8 -121 146 -45 49 -53 32 -75 -156 -35 -21 136 -40 182
6861 182 -60 -102 35 19 -143 -162 -343 -202 -81 72 176 -120 -188 3 -102 -15 48 28 13 50 106 33 -241 -150
6885 -150 194 0 30 9 -112 148 -24 99 36 -105 179 -9 86 155 15 9 64 -55 36 87 25 -171 128 -215
6909 -215 -120 -114 -28 118 -170 -124 -257 101 71 197 258 11 56 109 97 40 -96 -23 -43 -5 -3 102 -99 90 48 188
6935 188 -42 -117 10 276 -120 48 -144 -156 -85 -48 -96 76 -52 -10 -229 -122 -183 120 117 71 182 120 108 -254
6959 -254 54 -24 -65 -27 -315 -165 67 193 127 107 -54 62 76 -54 -38 -9 -191 210 -269 154 -196 -5 38
6982 38 142 -80 221 93 273 132 64 199 101 139 76 -35 -106 281 -132 -142 -82 161 45 -49 -29 -37 61 12 -163
7007 -163 111 446 -55 -236 -144 -156 57 53 -11 240 -94 0 230 -13 -45 52 -134 -22 139 57 -85 137 28
7030 28 -186 365 91 229 61 232 -33 -92 239 28 81 -24 -153 -160 -146 -126 19 0 221 -281 -113 246 -16
7053 -16 -5 -69 6 -274 -113 29 31 -119 -284 -134 -31 -60 187 18 -17 102 12 36 177 65 38 -234 -179 204
7077 204 75 76 -22 -252 -78 15 -19 44 2 -301 140 116 -87 -102 -97 28 -85 -209 23 -112 126 -107 -60 101
7101 101 -255 228 231 66 -43 -160 -89 -89 -41 -127 39 151 -362 37 -19 162 -168 108 197 72 98 56 60 7 90
7126 90 -162 12 64 -100 258 -110 -42 261 -152 198 67 -234 35 -54 44 -14 -135 -85 160 -82 -147 -299 305
7149 305 105 -27 201 -73 -130 -118 93 -66 253 -30 -108 164 1 13 -169 -46 -330 -164 40 -137 71
7170 71 -144 -46 -16 -131 -9 -13 158 142 10 -99 -287 -214 138 -208 98 33 -82 -17 12 3 56 -67 140 238 170
7195 170 -8 -126 0 -168 22 40 109 -31 -151 -128 23 -91 66 -95 70 161 104 105 18 229 298 -42 44
7218 44 -70 -65 30 -106 192 29 -197 -252 -112 -54 119 208 67 -17 -5 -146 128 167 25 -159 -90 122 -96 29
7242 29 -27 161 -8 -19 2 69 -79 -219 129 148 34 91 -40 -50 151 126 -157 -6 -254 4 -90 72 77 90
7266 90 -224 42 -166 -59 209 162 10 -77 -48 -94 -95 -139 24 -12 -21 -236 -35 -62 66 19 129 233 -104 43
7290 43 45 -53 -49 82 15 -209 165 -47 48 -170 64 115 -77 -69 -69 -36 -51 -114 -265 122 -115 -105 -30 17 196 -1
7316 -1 -166 96 -95 117 -121 5 70 101 112 -22 37 -6 -21 -49 69 40 -185 -105 -194 339 27 -127 207 245
7340 245 -62 -8 99 188 139 -221 10 11 35 -69 -44 63 10 -321 -4 105 116 171 -236 -291 -116 56 -51 83
7364 83 47 28 -2 75 256 131 58 43 123 48 -278 -153 190 -48 -119 30 77 -93 116 75 -145 72 34 -24 -112
7389 -112 -100 -96 -44 -211 -6 13 0 -36 145 43 -164 46 -215 -36 -113 30 275 37 14 40 77 -22 -153 63
7413 63 -7 187 218 -120 -193 -188 62 215 125 -48 -36 -360 -91 2 107 -121 -57 -28 222 -239 -80 -172 -71 121
7437 121 8 238 -155 -116 76 216 99 -63 -159 -56 -36 83 34 113 17 -135 5 -31 -88 130 59 126 24
7460 24 89 174 0 -41 -148 -27 61 96 68 149 -147 -89 -5 124 131 -114 107 -31 168 192 67 -74 -84 -105 54
7485 54 129 -119 -12 173 38 -104 37 116 -93 162 -40 146 36 -197 12 55 35 -72 -99 -100 58 109 -136
7508 -136 64 -78 -123 67 -57 -63 -5 -54 -151 -300 -121 164 109 409 141 -19 -212 -135 120 -16 -178 -141 -87
7531 -87 -29 -47 87 122 80 88 55 43 42 -132 64 39 -44 -36 0 10 -80 63 -1 137 352 -129 -72 184 68 -58 -254
7558 -254 -218 -69 -61 142 -8 -93 163 2 55 1 -76 -46 132 99 -56 -66 -340 11 -29 171 -76 -53 129 30
7582 30 261 -253 -43 121 12 -171 10 -89 -17 -27 -116 235 187 175 -151 -106 -277 -28 -208 103 150 -36 180
7605 180 -215 10 85 15 -129 -201 54 -193 -204 37 -74 15 5 109 -15 -80 57 44 -55 -59 89 -52 100 155
7629 155 -210 23 90 421 -74 39 314 9 51 92 -137 39 -200 -270 -60 48 151 182 173 321 -122 -100 54
7652 54 -46 -188 -146 68 231 -139 -20 -20 -71 -5 21 66 271 27 -37 87 -61 101 34 -25 -17 112 -52 -99 4
7677 4 143 -88 -45 -139 43 -85 180 10 -93 -82 55 -197 67 26 108 -45 -184 201 54 99 -25 200 -49
7700 -49 46 -104 -14 165 -120 86 100 -116 -10 -350 -11 -57 -1 2 -9 -117 47 21 -55 103 -73 75 -3 313
7724 313 -103 -40 -86 -9 59 -3 -11 -19 83 111 126 105 -120 -33 139 76 -64 64 -113 -54 -85 -112 3 251 -219 -116
7750 -116 111 -32 84 144 -53 -159 -126 23 -130 106 130 -105 -70 44 -113 -101 -181 61 -76 343 -47 -131
7772 -131 54 118 37 -171 116 83 -19 -161 30 13 -53 -264 394 -226 107 -26 -93 -18 10 -69 -194 48 121
7795 121 -59 -38 120 32 -217 -108 -89 57 -56 -136 135 27 -80 -19 -103 202 130 -25 -222 -11 36 -140 -14
7818 -14 -10 18 -65 144 -15 -120 -79 -211 90 320 -147 72 -29 -175 183 -38 -407 -97 -77 -28 197 -20 -1
7841 -1 56 107 -5 101 -108 -19 -16 25 -306 -29 7 -130 10 114 -116 33 110 38 255 -79 -92 -67 -55 -9 140
7866 140 -137 -177 -134 155 -131 230 -5 -28 -23 -190 26 -51 -117 17 -147 344 236 -8 56 -33 -163 -292 -83
7889 -83 37 33 34 -165 -157 -43 -117 -193 2 -27 45 147 -139 -206 4 -68 -10 -190 -161 49 -271 34 24 -418 -10
7914 -10 45 3 144 193 19 -121 -310 115 47 164 -7 -44 -71 85 -93 234 161 -14 -106 -134 123 25 -66 53
7938 53 -122 -104 40 -36 5 -163 -83 -129 -276 48 7 142 -59 -214 14 266 66 -102 58 -64 -49 -1 -195
7961 -195 8 65 -139 24 183 -16 -124 -263 304 92 -8 -134 -107 266 111 -155 -36 17 39 86 -156 131
7983 131 85 140 13 162 197 -98 -145 11 112 -21 78 -30 -125 -5 -111 33 -33 -31 -189 -83 -3 136 -101
8006 -101 107 -138 58 5 -104 73 61 -305 -102 62 -23 288 168 110 66 -86 191 184 200 -256 -219 -115 99
8029 99 203 52 273 171 -173 -70 -96 -299 -130 -171 -163 -10 -43 -139 -192 308 -128 107 38 13 33 47 -8 7 117
8054 117 -102 -137 -85 -135 39 24 -40 -52 -53 231 -83 -9 -125 -528 -39 45 81 -58 103 2 47 5 8 -141 -145 -23
8080 -23 130 -63 -22 -89 3 -262 -222 123 -138 -137 301 -48 -68 -135 -279 -47 -14 231 212 141 -201 -84 10 -162
8104 -162 173 -32 205 145 -20 -269 97 225 -49 58 -184 111 173 -96 80 -195 -148 23 25 -291 -101 -146
8126 -146 -34 269 -141 -84 -26 150 -143 -124 -136 -81 -187 -87 -291 86 -295 83 78 220 99 49 -29 -154 -146 49
8150 49 -71 4 114 94 -165 -163 0 -153 157 44 31 -126 72 -126 42 -37 -77 146 -82 45 -76 165 -184
8173 -184 23 318 174 103 -46 -64 58 -69 3 241 -137 187 -67 -187 -20 -126 -94 167
8191A67
##END NTUPLES=NMR FID
##END=
