##TITLE=1H_Pr Eth-C6
 200.13MHz, CDCl3,
 8 sc
 
 4.2.2025
##JCAMPDX= 6.0         $$ Bruker NMR JCAMP-DX V2.0
##DATA TYPE= NMR FID
##DATA CLASS= NTUPLES
##ORIGIN= UXNMR, Bruker Analytische Messtechnik GmbH
##OWNER= pz
$$ XWIN-NMR		Version 3.5
$$ Tue Feb  4 14:19:23 2025 Russian Standard Time (UT+4h)  she@DPX200
##.OBSERVE FREQUENCY= 200.1313
##.OBSERVE NUCLEUS= ^1H
##.DELAY= (6, 6)
##.ACQUISITION MODE= SIMULTANEOUS
##.ACQUISITION SCHEME= undefined
##.AVERAGES= 8
##.DIGITISER RES= 18
##SPECTROMETER/DATA SYSTEM= spect
##.PULSE SEQUENCE= zg30
##.SOLVENT NAME= D2O
##.SHIFT REFERENCE= (INTERNAL, D2O, 0, 14.3821)
##AUDIT TRAIL= $$ (NUMBER, WHEN, WHO, WHERE, WHAT)
$$ ##TITLE= Audit trail, XWIN-NMR		Version 3.5
$$ ##JCAMPDX= 5.01
$$ ##ORIGIN= Bruker BioSpin GmbH
$$ ##OWNER= she
$$ F:/spectra/data/she/nmr/H-C/1/audita.txt
$$ ##AUDIT TRAIL=  $$ (NUMBER, WHEN, WHO, WHERE, WHAT)
(   1,<2025-02-04 14:17:47.64 +0400>,<she>,<DPX200>,
      <created by zg, POWCHK disabled, PULCHK disabled
       configuration hash MD5:
       00 E9 B6 7A A2 85 ED C7 34 08 36 98 17 FE 4E 26
       data hash MD5: 16K
       67 32 E9 31 C5 47 A6 8E B3 CE 1E EF 6B 0C AE 7E>)
$$ ##END=
$$ 
$$ hash MD5
$$ B7 F8 1C 1E BA AD 88 2C 60 7A B5 FB BA B8 4C 18
##$RELAX= 
##$RELAX= 
##$RELAX= 
##$RELAX= 
##$RELAX= 
##$RELAX= 
$$ Bruker specific parameters
$$ --------------------------
##$DU= <F:/spectra>
##$EXPNO= 1
##$NAME= <H-C>
##$PROCNO= 1
##$TYPE= <nmr>
##$USER= <she>
##$AMP= (0..31)
100 100 100 100 100 100 100 100 100 100 100 100 100 100 100 100 100 100 
100 100 100 100 100 100 100 100 100 100 100 100 100 100 
##$AQSEQ= 0
##$AQ_mod= 1
##$AUNM= <au_zg>
##$AUTOPOS= <>
##$BF1= 200.13
##$BF2= 200.13
##$BF3= 200.13
##$BF4= 200.13
##$BF5= 200.13
##$BF6= 200.13
##$BF7= 200.13
##$BF8= 200.13
##$BYTORDA= 1
##$CFDGTYP= 0
##$CFRGTYP= 5
##$CHEMSTR= <none>
##$CNST= (0..31)
1 1 145 1 1 1 1 1 1 1 1 1 1 1 1 1 1 1 1 1 1 1 1 1 1 1 1 1 1 1 1 1 
##$CPDPRG= <>
##$CPDPRG1= <>
##$CPDPRG2= <>
##$CPDPRG3= <>
##$CPDPRG4= <mlev>
##$CPDPRG5= <mlev>
##$CPDPRG6= <mlev>
##$CPDPRG7= <mlev>
##$CPDPRG8= <mlev>
##$CPDPRGB= <>
##$CPDPRGT= <>
##$D= (0..31)
0 0.7 0 0 0 0 0 0 0 0 0 0.03 0 0 0 0 0 0 0 0 0 0 0 0 0 0 0 0 0 0 0 0 
##$DATE= 1738664267
##$DBL= (0..7)
120 120 120 120 120 120 120 120 
##$DBP= (0..7)
150 150 150 150 150 150 150 150 
##$DBP07= 0
##$DBPNAM0= <>
##$DBPNAM1= <>
##$DBPNAM2= <>
##$DBPNAM3= <>
##$DBPNAM4= <>
##$DBPNAM5= <>
##$DBPNAM6= <>
##$DBPNAM7= <>
##$DBPOAL= (0..7)
0.5 0.5 0.5 0.5 0.5 0.5 0.5 0.5 
##$DBPOFFS= (0..7)
0 0 0 0 0 0 0 0 
##$DE= 6
##$DECBNUC= <off>
##$DECIM= 32
##$DECNUC= <off>
##$DECSTAT= 4
##$DIGMOD= 1
##$DIGTYP= 9
##$DL= (0..7)
0 120 120 120 120 120 120 120 
##$DP= (0..7)
150 150 150 150 150 150 150 150 
##$DP07= 0
##$DPNAME0= <>
##$DPNAME1= <>
##$DPNAME2= <>
##$DPNAME3= <>
##$DPNAME4= <>
##$DPNAME5= <>
##$DPNAME6= <>
##$DPNAME7= <>
##$DPOAL= (0..7)
0.5 0.5 0.5 0.5 0.5 0.5 0.5 0.5 
##$DPOFFS= (0..7)
0 0 0 0 0 0 0 0 
##$DQDMODE= 0
##$DR= 18
##$DS= 0
##$DSLIST= <SSSSSSSSSSSSSSS>
$$ [...]
##$SUBNAM0= <"">
##$SUBNAM1= <"">
##$SUBNAM2= <"">
##$SUBNAM3= <"">
##$SUBNAM4= <"">
##$SUBNAM5= <"">
##$SUBNAM6= <"">
##$SUBNAM7= <"">
##$SUBNAM8= <"">
##$SUBNAM9= <"">
##$SW= 18.0517328524113
##$SWIBOX= (0..15)
0 0 2 0 0 0 0 0 0 0 0 0 0 0 0 0 
##$SW_h= 3612.71676300578
##$TD= 16384
##$TD0= 1
##$TE= 0
##$TE2= 300
##$TE3= 300
##$TEG= 300
##$TL= (0..7)
0 120 120 120 120 120 120 120 
##$TP= (0..7)
150 150 150 150 150 150 150 150 
##$TP07= 0
##$TPNAME0= <>
##$TPNAME1= <>
##$TPNAME2= <>
##$TPNAME3= <>
##$TPNAME4= <>
##$TPNAME5= <>
##$TPNAME6= <>
##$TPNAME7= <>
##$TPOAL= (0..7)
0.5 0.5 0.5 0.5 0.5 0.5 0.5 0.5 
##$TPOFFS= (0..7)
0 0 0 0 0 0 0 0 
##$TUNHIN= 0
##$TUNHOUT= 0
##$TUNXOUT= 0
##$USERA1= <user>
##$USERA2= <user>
##$USERA3= <user>
##$USERA4= <user>
##$USERA5= <user>
##$V9= 5
##$VALIST= <valist>
##$VCLIST= <CCCCCCCCCCCCCCC>
##$VD= 0
##$VDLIST= <DDDDDDDDDDDDDDD>
##$VPLIST= <PPPPPPPPPPPPPPP>
##$VTLIST= <TTTTTTTTTTTTTTT>
##$WBST= 1024
##$WBSW= 4
##$XGAIN= (0..3)
0 0 0 0 
##$XL= 0
##$YL= 0
##$YMAX_a= 348784
##$YMIN_a= -457485
##$ZGOPTNS= <>
##$ZL1= 120
##$ZL2= 120
##$ZL3= 120
##$ZL4= 120
##$ABSF1= 10
##$ABSF2= 0
##$ABSG= 5
##$ABSL= 3
##$ALPHA= 0
##$AQORDER= 0
##$ASSFAC= 0
##$ASSFACI= 0
##$ASSFACX= 0
##$ASSWID= 0
##$AUNMP= <proc_1d>
##$AZFE= 0.1
##$AZFW= 0.1
##$BCFW= 1
##$BC_mod= 2
##$BYTORDP= 1
##$COROFFS= 0
##$CY= -3
##$DATMOD= 1
##$DC= 2
##$DFILT= <>
##$DTYPP= 0
##$F1P= 0
##$F2P= 0
##$FCOR= 0.5
##$FTSIZE= 0
##$FT_mod= 4
##$GAMMA= 1
##$GB= 0.15
##$INTBC= 1
##$INTSCL= 1
##$ISEN= 128
##$LB= 0.25
##$LEV0= 0
##$LPBIN= 0
##$MAXI= 10000
##$MC2= 0
##$MEAN= 0
##$ME_mod= 0
##$MI= 1.114404
##$NCOEF= 0
##$NC_proc= 0
##$NLEV= 6
##$NOISF1= 3.799351
##$NOISF2= 2.8
##$NSP= 1
##$NTH_PI= 0
##$NZP= 0
##$OFFSET= 14.38212
##$PC= 1
##$PHC0= -24.24567
##$PHC1= 17.19222
##$PH_mod= 1
##$PKNL= yes
##$PPARMOD= 0
##$PSCAL= 0
##$PSIGN= 0
##$REVERSE= no
##$SF= 200.129724274929
##$SI= 16384
##$SIGF1= 3
##$SIGF2= 2
##$SINO= 400
##$SIOLD= 16384
##$SREGLST= <1H.CDCl3>
##$SSB= 0
##$STSI= 0
##$STSR= 0
##$SW_p= 3205.1282051282
##$SYMM= 0
##$S_DEV= 0
##$TDeff= 0
##$TDoff= 0
##$TI= <>
##$TILT= no
##$TM1= 0
##$TM2= 0
##$TOPLEV= 0
##$USERP1= <user>
##$USERP2= <user>
##$USERP3= <user>
##$USERP4= <user>
##$USERP5= <user>
##$WDW= 1
##$XDIM= 8192
##$YMAX_p= 0
##$YMIN_p= 0
$$ End of Bruker specific parameters
$$ ---------------------------------
##NTUPLES= NMR FID
##VAR_NAME=  TIME,          FID/REAL,        FID/IMAG
##SYMBOL=    X,             R,               I
##VAR_TYPE=  INDEPENDENT,   DEPENDENT,       DEPENDENT
##VAR_FORM=  AFFN,          ASDF,            ASDF
##VAR_DIM=   8192,          8192,            8192
##UNITS=     SECONDS,       ARBITRARY UNITS, ARBITRARY UNITS
##FACTOR=    0.0002768,     1,               1
##FIRST=     0,             0,               0
##LAST=      2.2672688,     0,               0
##MIN=       0,             -457485,         0
##MAX=       2.2672688,     348784,          0
$$ Real data points
##PAGE= N=1
##DATA TABLE= (X++(R..R)), XYDATA
$$ [...]
413i964J137K1019q989j5693J2937P622j1572R83P238o844j343R154n353p943
427g611J1589L828j4413K703J2523r528p718J3588J516j4432M602J2762j0012
440f03r313J2583L838j1384K359P853n444k601N263k835l264O692l11q040N796
455E89P247j1926m674J5324k56j5415N649J3730q972j0676R315N280p969J311
469a443N885n019j158N568m592m481P280J530o453L368L871q702n23J1509m977
484A663j1483J1366R791j4670o517J3851K027j1106J893P876l062k507K587l355
498a646q22O086l266n855P666L918j0002p43R492l922q103Q375O012r809j407
513d026R158l736p811N609N318m228j217L077j588j974J208k057j84O460o52p773
$$ plain form
413 -9964 -8827 12192 3203 -12490 447 8069 -3503 -2520 4718 -2126 -3469 5685 332 -7611
427 -7611 3978 7806 -6607 -3904 8619 -909 -8627 4961 6477 -7955 -3353 9409 -603
440 -603 -9916 2667 6505 -4879 -2520 5333 -111 -2712 2551 -284 -3548 3144 2833 -5207 589
455 589 7836 -4090 -8764 6560 6304 -9111 -3462 10268 1296 -9380 -65 5215 -2754 -1443
469 -1443 4442 -577 -1735 3833 -759 -5240 2040 3570 -2883 485 4356 -4346 -4869 6640 1663
484 1663 -9820 1546 11337 -3333 -9850 4001 6028 -5078 -3185 4691 1629 -878 1709 -1646
498 -1646 -2468 3618 352 -5503 2163 6081 -3921 -4664 4828 906 -7197 1178 7190 -2619 -4026
513 -4026 5132 1396 -6415 -806 4512 284 -933 2144 556 -1418 -210 -2267 -2451 4009 3357 -4416
529d416K925O484o613n659R068N545q542l079P800o40p635K057N595j460j572
544a42J387j156j345J510o99k220L250K633m553o06N006l285m955O337M002p693
560b529j022R405j827j0445L340Q067m952m106N693J493l443j7j190j821M642
575A288J973o371J515Q302n885r054Q460O087r263l34R750l839q371N436L581
590C275o982J249P304l491m029L931j503l241N115J82o093N173O208r513n081
605g496J1489J456j1299L319R727o211n979O504R01n974K030L659k534L20K213
620B125l806k63N317l760n091P904L952r382j094Q685k784p526N393N329o071
635a072j489N799k271n077K989K672j687P19L69k275J633J980m747j402P564P44
$$ plain form
529 -4416 -1491 4993 -1620 -7279 1789 7334 -1208 -4287 3513 2873 -4762 -2705 2890 1430 -142
544 -142 1245 89 -1256 254 -445 -2665 585 3218 -1335 -1941 3065 -220 -5175 1162 5164 -2529
560 -2529 -3551 5854 4027 -6418 -3078 4989 37 -4069 1624 3117 -326 -343 -1533 -3354 1288
575 1288 3261 -3110 -1595 6707 822 -8232 228 6315 -2948 -3282 6468 2629 -5742 -306 3275
590 3275 -3707 -2458 4846 1355 -2674 1257 -246 -3487 1628 1810 -4283 890 7098 -2415 -7496
605 -7496 3993 5449 -5850 -2531 7196 985 -4994 1510 2411 -3563 -1533 2126 -408 -88 2125
620 2125 -1681 -1944 3373 -387 -5478 2426 6378 -3004 -4098 4587 1803 -5723 -330 4999 -1072
635 -1072 -2561 3238 967 -4110 -1121 1551 -136 583 952 -1323 310 2290 -2457 -3859 3705 4449
651D449q260J251P299l615o250M557M762m133k571L591M17l060K71J316j76Q02
667F50j20j523J556J333l169q02M315l65m855K427M928m714m412N743K667n917
683b258p19N644k73m614N08K535o02m78K44l91J632P32l739m69M699p37m866K538
701f14M684m087m055M745K153m666O7L949j279k493J421P22j187M94N29n67J010
718H26J09k422R74L144k822l171M348K540n282j733N283P40m829J93M014n16k490
735a094M24J147J15m32r94L56J786l88k227Q35K301j841k233K654J598l163o68
752a824L266k02l248Q71L208j211k733J559K147j523j707R66J467j85j380n90
768a119J563J206k139j776K770J848l553j404M085N02m042N95L595j331k576J929
$$ plain form
651 4449 -3811 -2560 4739 1124 -5126 -569 4193 60 -2511 1080 1497 -1563 -1292 24 -152 650
667 650 530 -993 563 1896 -1273 -2075 2240 1875 -2980 -553 4375 -339 -4751 992 3659 -2258
683 -2258 -2977 2667 2394 -2220 -1712 823 221 -257 -13 -404 1228 1960 -1779 -2248 2451 1714 -3152 -614
701 -614 4070 -17 -4072 673 2826 -1840 -1773 2176 897 -1596 -175 547 -640 -146 383 -184 826
718 826 935 -1487 -513 2631 -191 -3362 986 3526 -1756 -3489 1794 2534 -2295 -2102 1912 1396 -1094
735 -1094 -670 477 592 160 -834 -478 1308 920 -1307 -472 1829 -12 -2245 409 2007 -1156 -1824
752 -1824 1442 1240 -2008 -1137 2071 860 -1873 -314 1833 310 -1397 -431 1036 851 -529 -1119
768 -1119 444 1650 -489 -2265 505 2353 -1200 -2604 1481 1983 -2059 -1464 2131 800 -1776 153
784A53J426j992k72J338o55l18P55p96l7J439j184j475K460Q47l641L07M311j779
802H87m088L101L233l633j828L371N99k323N7Q52k95O28l67j761J539K013k776
819g91j427L637J93l664J208L073k327j894K978O08k888O00K204j257j172J100
835A81K02m16K57p77k35J770k87k471J071K877j890k645K628J952k721j200K404
852G00O31j774l73J176K60n74m90J14P62r3j050K22J142n73j029R29R09j118o84
871i13J548M54j818k42K019N3k165J17K163k96k180L44J900l23j498J30J072K78
889F43q53p30Q03J241q77j402J217J414j649j145K019M14k158M48J849j189j301
906a256J516O05j555L2J262l80m52K49l06L44Q35j266p79K241M29k938K03K998
$$ plain form
784 153 1579 -413 -685 653 -2 -320 435 -361 -398 1041 -143 -1618 842 1689 -1952 -1645 2666 887
802 887 -3201 -100 3133 -500 -2328 1043 1642 -681 -624 228 -67 561 194 -1567 -28 1985 -791
819 -791 -2218 1419 1612 -2052 -844 2229 -98 -1992 986 1594 -1294 -694 1510 253 -919 181
835 181 383 -33 224 -553 -788 982 695 -1776 -705 2172 282 -2363 265 2217 -504 -1704 700
852 700 1331 -443 -816 360 620 46 -444 -330 432 339 -711 -489 653 80 -949 -20 889 -229 -913
871 -913 635 1089 -729 -971 1048 1101 -1064 -947 1216 920 -1260 -916 984 661 -837 -707 365 643
889 643 -210 -940 -137 1104 227 -1175 42 1456 -193 -1338 681 1095 -1063 -615 1234 45 -1256
906 -1256 260 865 -690 -658 604 224 -228 21 -285 59 894 -372 -1151 1090 1519 -1419 -1216 1782
924A782r58k756J579K049j774j172J342K50o65L23j14j33Q27k00j273P95J183
941A085j434n67J999l15k076J138J614j930r64K212M07k111R1J634l63j035K15
958d00M83M19j8j011m5J584k68k043O06K204r61j966J279J444j602r37J451M13
976F32r50Q4O04l64l90K49J41P7J29k45J10N22o87r26J096J105j461q89J832N61
996A230k247m55K269K50j832J36J380j62r84j12N54M63j33p78J89J095n32j387
1014a056Q23J204j188p36J568J36j631K96J340p86r35J136P64r03m56M12K19k0
1032A87n02j98J153N09j674p13J831L43k054J76K174k87j911L05J175l38o37K70
1050a91N66K48n31o25M51N47o85k81J129j9j309L01J074q25q52J042Q21q72p16
$$ plain form
924 1782 824 -1932 -353 1696 -78 -1250 92 342 -323 0 -114 -247 580 380 -893 -98 1085
941 1085 -349 -916 1083 768 -1308 -170 1444 -486 -1450 762 1169 -942 -851 783 420 -615 -400
958 -400 83 502 484 -527 -572 1012 744 -1299 -693 1511 550 -1416 -137 1307 -295 -1232 219 632
976 632 -318 -234 370 6 -384 -135 6 83 212 -33 77 599 -88 -1014 82 1187 -274 -1163 669 1230
996 1230 -1017 -1472 797 1047 -785 -649 731 569 -415 -527 27 490 357 -421 -232 863 331 -1056
1014 -1056 -233 971 -217 -953 615 751 -880 -584 756 -30 -965 171 935 32 -424 -12 207 187
1032 187 -315 -513 640 1149 -525 -1238 593 936 -1118 -942 1232 945 -966 -661 514 176 -461 -191
1050 -191 375 623 92 -533 -82 465 -220 -501 628 609 -700 -399 675 -150 -1002 40 861 -11 -727
1069g27P04O70n60r31M20J389k67j556M06J650p81j665P85J478p18r75N50O33
1087E05m29o08L2O89M13o80l49R85q3j398N18J381q39r69J355M74j723k38J495
1106E31o3r65K73N38k9k81p18J58J410k38j704P89J857j334j795J605J339j694
1124c21n89J469Or37J73J87j60L56j20n07P08L12j185R8J327p71j146J584Q38
1143A322j957l54J884l29j637O54J277n32p34R0K07M03j59r67N96J508r98j580
1161a306J283J259j574p62J742L12j466J10Q42m04m03L50J27o0k6k43J22M18m67
1180a46m73R24M98j303k20J532j85j536L70J363l68j119L04R20k00q42j28Q22
1198B13M04q53m98R97M65j091l93J077K97q70m4P01k0p68J07N83o8n55J58N78
$$ plain form
1069 -727 -23 647 87 -844 -424 965 698 -858 -452 1198 417 -1248 -463 1015 297 -678 -128 505
1087 505 76 -532 -500 189 602 -78 -427 558 475 -923 -405 976 137 -832 523 997 -726 -964 531
1106 531 468 -497 -224 314 285 4 -714 -556 854 616 -1088 -299 1558 224 -1571 34 1373 -321
1124 -321 -910 559 565 -372 -199 -12 -172 184 64 -443 265 577 -608 -510 817 46 -1100 484 1322
1143 1322 -635 -989 895 566 -1071 -417 860 328 -406 -316 -109 294 135 -832 -236 1272 274 -1306
1161 -1306 -23 1236 -338 -1100 642 954 -512 -402 440 36 -367 -17 110 50 24 -219 -97 321 -146
1180 -146 -619 305 803 -500 -720 812 627 -909 -539 824 456 -663 -359 561 361 -481 -609 213
1198 213 617 -236 -734 263 728 -363 -756 321 618 -252 -296 405 385 -383 -276 307 239 -316 -158 420
1218D20k84p34L52P78m21p24M91P69m81q11L81Q59k94q18J89Q98o1j059k0J158
1238E88q3j146J41J071k47q62K64O52k39m27K06L25j19k84L7L08L0m96J30O51
1258E00l48p30M86P84p66p18Q68O38r00n14P76M35n75m14M01O02k59p27J96P72
1278E07j55r00K31R14l69p74M05N86m30m23M27K76m00j54L72J18l55j17L60K18
1298C37m22k58N11L08o46l07O57L33o70m29O86M54o97m68O64N01o56m47N96M66
1318E13n57l72M61L16l53k28K13K71k40k07J59K29k42k52L27K59m98j38O38J9
1338C18o67Q8P21j89o75K20N91j99m63L0M20J09l88m09N58M19o38m20P16L46p34
1359b46k06P19pn61J52L98k02j41J04O3n8l9n4J37P2k99n0M74J2o79J61P15l31
$$ plain form
1218 420 136 -598 -246 532 111 -613 -122 647 166 -645 -264 595 301 -517 -328 570 509 -550 -570 588
1238 588 505 -641 -500 571 324 -538 -274 378 139 -288 -82 243 124 -160 -123 185 215 -281 -151 500
1258 500 152 -578 -92 692 -74 -792 76 714 -186 -700 76 511 -64 -478 -77 525 266 -461 -265 507
1278 507 352 -548 -317 597 228 -546 -141 445 15 -408 19 295 -105 -259 113 231 -124 -241 119 337
1298 337 -85 -343 168 476 -170 -477 180 513 -157 -586 100 554 -143 -611 53 554 -102 -549 47 513
1318 513 -44 -416 45 361 8 -220 -7 264 24 -183 -24 205 -37 -289 38 297 -201 -339 299 318
1338 318 -349 -261 460 271 -404 -184 407 208 -255 -225 195 304 -84 -493 65 484 -154 -574 142 488 -246
1359 -246 -452 267 260 -301 -149 249 47 -94 10 73 15 -24 -78 59 131 -168 -218 256 268 -411 -250 465 134
1382A34o61M54N57l97m84L64L82k26l78R2L22R7m31j55M78J64n48o1N26n7m18
1403b46J23L42k10k34K52J51k10j02K07J20k26j67K47K19k94k96L42L04l74l48
1423d00L81L44l30l27L05L55k71l90J97M47k21l51K07L44k13l56K38K09k08j05
1443a45J82M1j52l2R3R3j42l1K10P9k83j64L67K05m91j45N57O0n56m6N31Nl83
1466a47o7L02R7k11j95J52K96j86l04K20L79l13k94L57P9k96m2L20p6k67J62J73
1488A39j85j60J37J89n9j84J7K83l7l82M4M60J8n09J6M70m8m86J09L88m2l52J4
1511a60K72j2k27rK16K6j50m9J44rj22K9J65n1j75R1J65j16k79K14K89k75k83
1534c06L13K78l29k76L30K57k84j83K17J89r1k53k0L18M0l47k1M01m9m87J24M03
$$ plain form
1382 134 -527 -73 484 87 -397 -33 349 123 -255 -163 159 256 -175 -330 148 312 -236 -297 229 172 -246
1403 -246 -123 219 9 -225 27 178 -32 -134 73 193 -33 -200 47 266 -28 -324 18 322 -52 -400
1423 -400 -19 325 -5 -332 -27 328 57 -333 -136 311 90 -261 -54 290 77 -279 -41 168 -40 -145
1443 -145 37 78 -74 -106 -13 80 -62 -93 117 196 -87 -251 116 321 -170 -315 242 302 -254 -300 231 236 -147
1466 -147 -214 88 185 -26 -221 -69 227 41 -263 -43 336 23 -271 86 165 -131 -173 147 71 -196 -34 139
1488 139 -46 -206 -69 120 61 -123 -106 177 140 -242 -198 262 280 -229 -213 257 209 -277 -168 220 178 -174 -160
1511 -160 112 100 -127 -136 80 106 -44 -93 51 42 -80 -51 114 63 -112 -21 144 28 -251 -37 252 -23 -306
1534 -306 7 285 -44 -320 10 267 -17 -200 17 206 115 -138 -158 160 200 -147 -168 233 184 -303 -179 224
1556B24k63j86L18N5k98K8K33q7j23J18O3j8o8j39J02K68j88l83L75L29m54l14
1578d08N55J44m79p8M40J4k93M2M0Q9L7k01j0K99n4l47J27L12k50k19L26J39m18
1601a93N9L34j89k69K09J80j13q1M5Q4K7j84r5K59K12l81k02M69R4n27L6M26k9
1624A71k76k5K02J7j15p6R4J36q4j90J68J51k46p2K75l4k61J23K12j72k18K04
1646a6J40j28j42P6J89j3k72j8L71k3l87O3M14r9l99J26L20j34j88P5J41j9j36
1669e9o8J32J48k18n7K41M8l08L9L15j71k41K44J77l00r0K26Q4k32m1J38J16o8
1692E5k23K7K75ll59J07M02j76l67K14K83k33j91K06J00j01q1J8J05l3p9l7J90
1715I9l7j92Q3K09j70j74K19J78k96q0K93K1k83l5K19R9k21j10J66J30j49j79
$$ plain form
1556 224 -39 -225 93 148 -150 -122 111 24 -99 19 82 64 -4 -143 -41 227 39 -344 31 360 -94 -408
1578 -408 147 291 -188 -266 174 188 -105 -63 -23 66 103 -98 -108 191 137 -210 -83 229 -21 -240 86 225 -193
1601 -193 -134 200 11 -258 -49 131 18 -63 -18 66 93 -91 -186 73 285 -96 -298 171 265 -262 -226 200 171
1624 171 -105 -130 72 89 -26 -102 -8 128 44 -146 22 173 -73 -145 130 96 -165 -42 170 -2 -220 -16
1646 -16 124 -4 -146 -70 119 106 -166 -184 187 164 -223 -160 254 155 -244 -118 202 68 -120 -45 96 77 -59
1669 -59 -127 5 153 -65 -122 119 167 -141 -102 213 42 -199 45 222 -78 -168 58 142 -90 -131 7 123 55
1692 55 -168 -141 134 131 -228 -121 281 105 -262 -48 235 2 -189 17 117 16 -65 -47 58 25 -54 -91 99
1715 99 62 -130 -47 162 -8 -182 37 215 -81 -161 132 153 -130 -165 54 153 -68 -178 -12 118 -31 -210
1737b10J81K28j69k53K26J90k06j55J88J49j39j47J53O9j09p9J21L3r8n1J33M3
1759I8j74k5J91J0j78%J44P6k15m1K07O9k52j04K71P5l05m6K78M0k29j0J78L1
1783H9j58n4J40N9p6o2P6J09j03j35J92M4k21oK47q0k18R2K16j20j95J30J75j30
1807A1r2K9J52K8k56K0K07L4k57m9K94J9l05M7K19m2j90O6J16j1j02J2J03l0o7
1832d4JJ28rj63M5J75j06j54J27J58j63j43J46J28j17j51J30J40j06j52Q2K04
1854A56p5k58J24J75q8j73Q7J57q2j18N1R5k4r0J4J08n8j05Q2J47j36j20J85L7
1878I1j35k8J61J7j62nJ19M4j21q6Q5J15p7j77J20K19k07j33J70J48j87q3J54
1901D2O9j45l6R1L7m1n8j1P2nj45J10R4j22o8J74O4k10l3K27j8j75N5J20J1j56
$$ plain form
1737 -210 -29 199 30 -223 3 193 -13 -168 20 169 30 -117 36 105 -4 -83 38 71 -27 -78 55 98
1759 98 -76 -101 90 100 -78 -78 66 142 -73 -114 93 162 -90 -194 77 152 -153 -199 79 119 -110 -120 58 89
1783 89 -69 -123 17 76 0 -62 14 123 20 -115 77 121 -100 -106 141 61 -157 -65 151 31 -164 -34 141 11
1807 11 -81 -52 100 128 -128 -108 99 133 -124 -173 121 140 -165 -118 101 59 -131 -65 51 40 -62 -50 53 23 -44
1832 -44 -43 85 76 -87 -42 133 27 -127 0 158 -5 -148 -2 126 9 -142 -12 128 22 -130 -48 156
1854 156 81 -177 -53 122 34 -139 -52 105 23 -95 -44 51 27 -63 -49 59 1 -104 -22 125 -11 -131 54 91
1878 91 -44 -72 89 106 -56 -61 58 102 -19 -105 -20 95 18 -159 -39 180 -27 -160 10 158 -29 -112 42
1901 42 111 -34 -70 21 58 17 -41 -52 20 15 -130 -20 74 -48 -116 58 122 -88 -121 106 88 -87 -32 88 99 -57
1927e7OQ9M7j07j12J25J54j90j19J98J15k09p5J73L7j31l4J27Rp9j7O1L0q8J4
1952c3Q1Rj31j0J48k1j53O9J66p4j80Q7J38o5j55P4J41%j61k4J81J0j65m6J69
1977E5J7j51RJ22kj10J5N9j0p2M3O1j5o5J3J34o4j63J03J45j31j13J44J11j63
2002b8q3J04J03o3j11M7J52o6j41%K01m2k08P0J60n5j51P8J12j12m5R4K5q7J3
2027c3M4Loo3M1N1k5q4N1J29j01r6J27J21j91j03K21K6j51p5J14J06p6j18Q4Q7
2053H3q1q0K0J50m6j43P8R2q0p3R3O1r3m9R2jq0KQ5K3j21jR8K1j28K6J39J5j46
2082d4m2J29R5j81o8J49P2j68o6J83M8j80j7J55J5j27K8N4On8j0N4J8o2k6O7L3
2109E7j42J9J06j1j87J01J84r7j29M0J40m3j42M2J58m4r7J6R4K2j25p0J83J7j70
$$ plain form
1927 -57 -51 38 85 -22 -134 -9 145 -45 -164 34 149 -60 -135 38 75 -56 -90 37 46 -33 -50 11 41 -47 -33
1952 -33 48 57 -74 -84 64 43 -110 -41 125 51 -129 -42 96 31 -124 -50 91 91 -70 -94 87 97 -68 -114 55
1977 55 72 -79 -70 52 50 -60 -45 14 4 -68 -25 36 21 -44 -31 103 39 -124 -21 124 -7 -120 24 135 -28
2002 -28 -111 -7 96 33 -78 -31 121 55 -86 -86 115 73 -135 -65 95 40 -111 -33 79 -33 -78 16 41 -46 -33
2027 -33 11 14 8 -55 -14 37 12 -72 -21 108 7 -89 38 159 -32 -135 86 112 -39 -114 0 106 30 -88 -4 83
2053 83 2 -78 -58 92 46 -97 -19 73 -7 -80 13 74 -19 -68 24 23 -57 -55 30 53 -68 -69 29 50 -78 -52 87 102 -44
2082 -44 -86 43 138 -43 -111 38 110 -58 -124 59 107 -73 -90 65 80 -47 -19 35 41 -17 -27 27 45 -17 -43 24 57
2109 57 -85 -66 40 29 -158 -57 127 30 -99 -59 81 38 -104 -62 96 52 -45 -29 65 87 -38 -108 75 92 -78
2134g8J7J15Lj26K0J39o7o2M5N9n6l4K0P2n0j06N6J27q0j11Q1J01o2j42J10J01
2160I2q3j44R8J41q9j00O8J31o0j26J2J22jj13QR5k5j01J04Jl5m2L0P6o4p0Q1
2187FM6n3p4P9Q9r4r2J07J03j57k9J05N0j17q2J14Q0o8j11O8J27q0j18J02J30
2212A31j07j11R0J00j34l5R4L7n5k7M8ol5m0P1L7j10j5Q1O8j35o0J46P0j74l4
2238a05J45Q2j82%O6O3j02m5Q0P2p9p4Q8O8p4j00J31M0r7m0J08Pq6J5Q7k9q7L8
2266a0Q6j8j03j1J21j2j38J7J42j6j21l0J32L0j41k0J66l4j11K0J02J9r0m9J21
2291E2J3j09%R4k7p7K4P3ko7J4R5r3m9M9J10o4j39R8P9l2j34N0J52q6j27M8J18
2319F3m2r5N2R5m4j19L5Q6Nj19N8Q1k2q5K1Q9p8k8Q0M5q2p2P8N2m7l2K3O9o3p7
$$ plain form
2134 -78 -61 54 57 -69 -49 90 23 -39 6 65 9 -25 -5 67 17 -89 -33 94 14 -97 -16 85 23 -119 -9 92
2160 92 9 -135 -37 104 15 -85 -17 114 54 -72 -60 62 61 -52 -44 51 26 -75 29 30 -5 -47 -17 59 -5 -75 6
2187 6 52 -1 -75 4 93 -1 -93 14 117 -40 -69 36 86 -31 -113 1 81 13 -98 -30 97 17 -101 1 131
2212 131 24 -87 3 103 -31 -66 28 65 10 -17 31 25 -10 -50 21 58 -52 -67 14 82 -53 -113 33 103 -71 -105
2238 -105 40 122 -60 -60 6 69 -33 -78 2 74 -5 -79 9 77 3 -97 34 74 -23 -63 45 52 -34 -19 68 39 -48 -10
2266 -10 76 58 -45 -56 65 53 -85 -68 74 58 -63 -93 39 69 -72 -92 74 40 -71 -51 51 70 -20 -69 52
2291 52 65 -44 -44 50 23 -54 -30 43 41 -26 -12 83 -10 -59 -10 100 36 -103 -5 74 42 -92 -42 110 24 -103 -55 63
2319 63 21 -74 -22 73 29 -90 -55 31 36 -83 -25 56 34 -51 -30 59 -19 -47 33 78 -4 -76 2 54 7 -25 -2 67 4 -73
2349g3P2P9p9j03J16P1j23n7J26L6j13o2P3J00q4o3P5Q9p2q1M6J09n9r9O5N9l3
2376A5o0O0M7j01MO0K0o6k9J03K6j05m6J21L0j10n0J49Pj18m1J04K4o8m9P7M6
2403E0j01l5Q1M2o9n2P7O0p0k6Q5Jo6kL9k0l3qP0Lo8K5O1K1j33k1J41K8j56K5
2433e1J25J1j47nJ07L2j41L1N5K2n2l2N1L4r5j3Q7L9j06j2J08nr8N2N9m6q1P6
2461EO1o1k7MO5k5q2K2J24n4q9K2J10k9j43Q1P7oq0PO9lp0MO9k4o6J1M9k0o3L8
2493b4P1o4p1J09L9o0n4Q7K8q2l1N4P6p1o9M3J03p3q5O9O8p6q6R6M8m7o7N8M2
2522C1m2n4N9K9k1o6L6M5k0l9L9M1r3rQ5J0o9J3N5K6r7rP3K8o7k7Q3K9r8l8J05
2553C8P8j15l2M9N9q3p7Q4L4n4qK8J9o4J0O4l6k2j6P9k1l5o7J33j2r3L5P2j8o2
$$ plain form
2349 -73 -1 78 -1 -104 12 83 -40 -97 29 65 -48 -110 -37 63 -21 -84 -9 80 8 -73 -27 82 23 -76 -11 48 15
2376 15 -45 15 62 -39 -35 25 45 -21 -50 53 79 -26 -72 49 79 -31 -81 68 75 -43 -84 20 44 -24 -73 4 50
2403 50 -51 -86 -5 37 -32 -84 -7 53 -17 -43 42 43 -23 -25 14 -6 -39 -47 23 26 -42 -17 44 65 -68 -89 52 80 -76 -51
2433 -51 74 85 -62 -67 40 72 -69 -38 17 39 -13 -45 6 40 -55 -68 19 58 -48 -60 48 43 -55 -3 56 10 -71 5
2461 5 66 5 -22 -18 47 22 -60 -38 86 32 -57 -35 75 46 -97 -16 61 55 -25 -18 51 48 -22 -18 51 27 -39 -28 21 1 -62 -24
2493 -24 47 -17 -88 21 60 0 -54 33 61 -21 -52 2 78 7 -62 -19 84 11 -74 -5 63 -13 -99 -3 45 -2 -69 -11 31
2522 31 -11 -65 -6 23 2 -64 -28 17 -3 -42 -3 38 -55 -64 21 31 -38 -25 30 56 -41 -50 23 51 -16 -43 40 69 -29 -67 38
2553 38 116 1 -31 18 77 -6 -83 1 35 -19 -27 1 20 -44 -34 30 -6 -28 -44 35 14 -21 -88 45 33 -60 -25 47 29 -33
2583c3mR6%j23K1R2Qj09J2Q9l1n5MM6M4o9n1Q2M9j12OR2j6p0k1J00k8n1nQ1p3
2614b9oL3K4k6m9L5O0l3n2l5J39k9j12N0J11l3j29N8J01m6q6N5M0no4J3L5J0o3
2643c3j4Q3j2o3K3N2m2p6Q1J1k8m2N8M5l4o2N0M0n1j5nR6m5j03N8Q8k5j26O2J10
2673H1q1l0L7L2l3n5L6L1K1o8K5K8kp2M5M8l9n1L0M2p6l5Q8K4p7j6P7M7q3k4N4
2704DP1n9p9P7N4p8o5P2O7o5o9Q1K7o0j7M7J6om4L7L4n0k9N4J7o7k7J00Mr7K2
2735b8L9J2q0K9L3K6m8j1L4Q1j13l6Q6J2n4m5R6%n2k5N8J3o0L4KJ1Lm7L8J9m8
2766b1jN7no5J0P0lj01M7R4p3o8K5O8l4n5J4L7L2l9l8R3oq3%J01k2p0K3L8j2n6
2798d3M2J6nj7j9O0k6p2P6K9m0l0J9O6n7n8M7O4m7m8J4Q6n4n0J2P5l1m8RP2j7
$$ plain form
2583 -33 -37 59 59 -64 -43 49 57 -52 -40 49 18 -37 -33 13 57 -12 -63 19 68 -44 -38 54 38 -32 -53 47 19 -32 -37 44 -29
2614 -29 -35 -2 22 -4 -53 -18 42 9 -43 -78 61 32 -80 -30 81 48 -81 -23 78 32 -54 1 41 36 -28 -15 20 30 -33
2643 -33 -47 36 24 -39 -16 36 -6 -82 -1 10 -18 -60 -2 43 9 -53 -3 37 -14 -29 -34 62 17 -86 -28 60 35 -91 -29 81
2673 81 0 -30 7 39 6 -49 -13 18 39 -29 -4 24 22 -50 -5 43 4 -47 -17 25 -51 -86 2 26 -51 -67 10 57 -26 -50 4
2704 4 75 16 -63 14 68 -10 -75 -3 64 -1 -70 11 38 -22 -39 8 24 18 -26 11 45 -5 -34 20 37 -30 -57 43 47 -50 -28
2735 -28 11 23 -57 -28 5 31 -17 -28 6 87 -26 -62 24 36 -18 -63 33 33 -19 -44 14 27 -33 1 3 14 17 -30 8 27 -21
2766 -21 -22 35 30 -35 -25 45 42 -59 -12 82 9 -59 -34 34 0 -55 -41 -4 28 -11 -49 44 38 -45 -45 56 34 -36 -13 25 13 -43
2798 -43 -1 15 10 -7 -26 34 8 -64 12 41 1 -29 -10 56 -1 -59 -12 52 5 -43 -29 57 3 -47 -35 40 9 -39 -30 42 25
2829B5r4L7N0Pp2O8J8k3l2K7J5km5LQ0m0n6M2L9o1qK8L6o3k0P8J7o3m7M8N5j6
2861C1o8M0N5o7k9J8O2n7o7M9N9k7o6O8K8m2j4O5j4ql8M6J3l5k6M2M5j10pR5L
2892D4p7NP4j9m3n2P2M4p0m4O3M2m2k7K7M0m4l0L5L8p0MM1J4o9K0N5pl7nN9Pn7
2925ij0M4J7m9RL9J0p2j7Q1pm2m4Q9j6o3lL5L8k3p0Q1K1l5n4N0J3l8MJ3pj4K4
2958eJ0j4jrK6K0l9jM2J8j05K3O7J1m5J4O6l8p4J8N7Lo9k2Q9l4l5NN3J5p1rN1
2991A7J0m5jM0j6j9mJ7jj0qO9m6k6J6O0m9l8L9O5n5n7L1P2l3n6J6M2j7n7M5N0
3023E1m9j5L6Mj7n8L5J7k6lJ1K0J2k7OK1k7l7N8K5n4n0O2L0m6m0Q2J5l1l1J0Q5
3055F9o0l9L0M6l5m1K2M5k5m6K2J9l7mK3K0j8l2N2j2l1L3J7j9l5K7j4N6p1mN4
$$ plain form
2829 25 -69 -32 18 25 -47 21 39 16 -16 11 26 24 -21 -18 62 22 -34 8 47 -14 -22 6 42 -21 -41 37 54 -9 -56 -8 47 31
2861 31 -37 3 58 -9 -38 -20 42 -15 -82 -33 26 -1 -67 1 29 -13 -27 38 24 16 -22 24 37 2 -24 18 63 -47 -54 41 44
2892 44 -33 -28 46 27 -16 -68 4 48 -22 -66 -3 39 -3 -30 -3 37 -7 -37 -2 36 -34 -30 11 25 -44 -24 31 24 -13 -18 41 48 -9
2925 -9 -19 25 42 -7 2 41 51 -21 -38 43 36 -6 -50 39 23 -40 -43 -8 30 7 -63 18 39 4 -50 0 13 -25 -21 -8 -15 -29 -5
2958 -5 5 -9 -10 -19 7 27 -12 -13 29 47 -58 -35 32 43 -2 12 78 40 -34 -16 41 44 -25 -47 42 8 -27 -22 31 46 -25 -34 17
2991 17 27 -18 -19 21 5 -14 -18 -1 -2 -12 -20 49 3 -23 -7 53 4 -34 5 70 15 -42 -11 61 28 -28 -12 30 13 -44 1 51
3023 51 2 -13 23 27 10 -48 -13 4 -22 -25 -14 6 18 -9 -3 18 -9 -46 12 37 -17 -67 -5 25 -21 -61 21 36 5 -26 -16 69
3055 69 9 -30 0 46 11 -30 -8 37 12 -34 -12 7 -30 -34 -11 9 -9 -41 11 -1 -32 1 18 -1 -36 -9 -23 33 -38 -42 12
3086A2J3l2pK6L1n5j6M9K2o3oP1k6lk5J2L2n0nNL9k7l8O9qm8MJ6kk4K3L2mm6m
3121c3K5J4n2L1O5j9l7K1lKjm8M4J5l9qK9K3k4MJ2K8m4l1L2lqqL5J0n7M3j5pQ
3156DMkk2mJ2J0ln0O2L0J0j03J7P2l3k4L1j8L9n2oJ6J6lj2K2lKl8L5J1l9j8L2
3190eJ0m2L9J2k7j3J8L8l7k6J8M4k3n7M2M8m0p0O0J0lk8K5J8j5j7K6K8Rn9nN4
3222C2j7k8J7J4j5k9J4O2o9K3K0j3j7k2L1J1l0rK5pk0j7L5M2k9o6O9K8l3o0N3
3253eL3k6k2MO2m9j7J9j0J6J1j0K6j6k8oN5n1l0O8l6RkK2Lk6k3L9J8m3l2L3L9
3286B5l2n5L7L3l8jN8Jl6j2L6Lk6j9J2J7J0m3O6ro2K5L5j3m5K0J1Mo0M5K4ll5
3319b7J7KL2l6J0P%l7KL9rnk6N1J2n2K1l6J5lL0J4J5n3RM0rj8l0M7j3j7J9J1n
$$ plain form
3086 12 25 -7 -14 12 43 -12 -28 21 43 -20 -26 45 19 16 -9 3 35 -15 -20 -15 24 -3 -41 28 20 -28 -24 -8 -10 -34 -11 21 17 -29 -33
3121 -33 -8 6 -46 -15 50 31 -6 15 12 14 13 -35 9 24 -15 -23 6 29 5 9 21 49 5 -26 6 3 -5 -13 22 32 -25 18 3 -4 4
3156 4 8 6 -16 -20 -8 2 -1 -51 11 41 51 -52 -35 37 4 -20 11 -7 32 -20 -26 -10 6 3 -9 13 10 12 -26 9 20 -19 -37 -5
3190 -5 5 -37 2 14 -13 -26 -8 30 -7 -33 -15 29 6 -51 -9 39 -1 -71 -11 -1 -4 -32 -7 11 -4 -21 5 33 42 -17 -22 32
3222 32 15 -13 4 18 3 -26 -12 50 -19 4 24 11 -6 -28 3 14 -16 -25 0 -7 -27 -44 -9 33 4 -62 7 35 2 -58 -5
3253 -5 28 2 -20 -16 46 -3 -20 -1 -11 5 16 6 32 16 -12 -18 37 -14 -44 24 -12 -3 -5 17 20 -6 -29 10 28 -15 -47 -14 25
3286 25 -7 -62 -25 8 -30 -31 27 28 -8 -20 16 19 -7 -26 -14 3 13 -30 36 27 -35 -10 25 12 -33 -13 -2 2 -58 -13 11 8 -27
3319 -27 -10 -8 24 -12 -2 5 5 -32 -30 9 0 -5 -31 20 32 -20 1 -35 -20 -23 7 21 36 -17 -8 32 23 5 -25 22 9 -8 11 22 17
3354A7k0K0Pk0l4kM2J4n9J4J8K2n4K3M6m1m0K5N1k3l2RM2k6oQOj0Lj4M6j7l7M2
3388B0Nl6jJN1k8k0K7Kk4Ml5N6l1jJ5N%l1M1j4k4j1K2K8pl0J2k8K2j2lL2MqJ3
3424A6%j6kK2NnJOmm6K1j7L0Pl8L7k4RONopl8M0M8p0nM2mm0K5pM0k6j9Jj4J7q
3463a8L7rlj8J3J2j8pLM2l3J4%Qj0kj5K4k0k2K3J7m3K5Qnj9J3J5j6k0J3K3k7K3
3498Hk6K1J8m4JL0k2KqN1j8k1K7J5j3k7K9J1m0J3j4J8j8K8nlJ6l9J1%L6p2KJ8
3532a5nK6k8K5l1L8Mk3L5m3J1RK1k9J3OKk8L1%j1j2Pj3J7j2JPJ7j4qJ6JJ7j1o
3568A5K1l9l0M6jl1M%J5kJ0k7J8lJ0l4K4pm3O3j5qNL1m2M0j7K4j7j6J9QrNJ9j9
3604A7%k1mJ0j2K5k0L2n3K3j5J9kK7l1kJ1po%lmnM8l1JkJ2pk3K9k0J3oRlK6j6
$$ plain form
3354 17 -3 17 24 4 -30 -32 10 24 -35 -21 -3 19 -35 -12 34 -7 -47 -22 29 6 -26 -17 25 -1 -7 1 7 -3 0 -14 32 15 -22 20
3388 20 25 -11 -12 -11 40 12 -8 19 21 -3 1 -34 22 -9 -10 5 10 10 -21 20 6 -18 -29 -7 21 14 -16 -4 -32 -10 -22 -25 7 11 3 16
3424 16 16 0 -2 20 25 20 21 27 23 -23 -2 -19 11 18 -20 17 -7 2 8 13 7 0 -38 2 50 -20 -25 17 13 -27 -2 -9 31 5 -14 -13 -27 -10 -18
3463 -18 19 10 7 -11 2 14 -4 -11 -8 34 1 15 15 23 13 11 -4 20 0 -22 1 18 -25 0 8 3 -16 -3 12 -4 -24 -11 12 -15 8
3498 8 -18 3 21 -23 -22 8 -14 -12 -20 31 13 -8 19 34 21 -6 23 34 -6 7 -7 11 -7 21 16 13 29 -10 1 1 37 -35 -33 -15
3532 -15 -20 6 -22 3 -28 10 14 -9 26 -17 -6 3 24 -5 8 14 16 -12 19 19 8 -4 3 -10 7 -5 -4 3 20 6 -2 14 15 32 21 15
3568 15 36 -3 -33 13 12 -19 -15 -15 0 -2 8 -19 -1 -4 6 -28 -4 -11 -54 9 -6 -14 -9 22 -20 20 3 27 10 -6 13 21 12 17 36 17
3604 17 17 -4 -8 2 -10 15 -5 27 -26 -3 -18 1 -1 26 -5 -7 4 -3 -9 -9 -12 -16 -21 27 -4 -3 -5 7 0 -23 6 -14 -1 -7 2 -1 25 9
3642Il4M2Ok0j7J2j8K8JpJL1m0ROj7qK4nl0L7j7j0k7M9m2L2RLRk6j6L1K1k8j7
3678a9L1j9J4mj7KJ1LK7m0mjK8j0qk4J1L6l4L6l9L0%n4K5K4j3J5j3Jj2J6qK7j4
3713DQoj3j8j2M1L4k3J1l2nJ6J8k9K9j6j0J7j3Oj2j8RL8l5Oj1lJ2rJ1j0j1ML6
3748A4j3m4L5Pj0j1J9j1KJ3J4pj6loj2L9nlqMQJ8j7rJ1%j5j2K9l5kK6l8M3Rj9
3785ej1pKK4k1K4Pl1l0J5L4m5L8J6k0J3k5J0pK8Rj8J1j4rJ0j3K3k3J3K8m2j0J0
3819a6J0MKoj3JlM7j6Kn7M7%J5pj9L6l6K0m0K1rK9nqOKoKmNk1L5k8j0O5j2kj1
3858B0j0j5P%m7L6qK2j0QQl8K7k6J3pL0Mk7qJ6K4jm1M5l5jL0J0l3j1J5J6qkkj2
3895a1J9l0J5J7pj4L2k1Kmmj6PJ9l9K8kK0j5rj8M0k0pJ7Jk3OM5l2J7kl8K8kQO
$$ plain form
3642 9 -25 17 23 3 -14 -2 -20 8 9 2 3 34 -6 3 9 -8 -16 8 3 -27 10 -7 -17 -44 5 -37 -5 4 7 16 -10 -26 5 26 -2 -19
3678 -19 12 -7 7 3 -14 -12 -1 2 29 -11 -15 -16 12 2 -6 -30 -19 17 -17 19 -20 10 10 -44 -19 5 -8 7 -6 -5 -17 -1 -9 18 4
3713 4 12 6 -7 -25 -37 4 38 15 26 -6 -11 5 23 -6 23 7 -3 14 1 7 -5 -23 -14 24 -11 -5 -16 -19 -7 -16 -5 -15 -26 -22 14
3748 14 1 -43 -8 -1 -11 -22 -3 -14 -12 1 15 8 -8 -11 -17 -29 10 5 2 -6 -2 6 24 7 -2 9 9 -6 -18 11 -24 -26 0 -38 5 14 -5
3785 -5 -16 -23 -21 3 -18 6 13 -18 -48 -33 1 -44 -6 10 -10 3 -22 -12 -19 9 18 0 11 -3 -12 -2 -15 8 -15 -2 26 -16 -26 -16
3819 -16 -6 -2 0 -6 -19 -18 -21 26 10 12 -45 2 2 17 10 -9 27 -9 11 -29 -8 -17 12 7 -1 5 7 1 3 -1 4 -17 18 -10 -20 45 33 31 20
3858 20 10 -5 2 2 -45 -9 -17 5 -5 3 11 -27 0 -26 -13 -20 10 14 -13 -21 -5 19 18 -23 22 -13 -14 16 26 -7 -18 -3 13 5 3 1 -11
3895 -11 8 -22 -7 10 3 -11 21 0 2 -2 -6 -22 -15 4 -35 -7 -9 11 -4 -13 -31 9 -11 -18 -1 0 -23 -17 28 -4 13 11 -27 1 -1 7 13
3932A3%Pk0l1L4LmL8m1NrRoj8J0J9k9L1Pk4k4KL1j2j6nK8nmJ4k9M0n7K4K5Jj8
3969a1K3rMMJkqJ3pRj7n1K4L5k9oPO8n4J2k1K1Ql1L0k4J8l2J7L4l5JK8Rn3J3Q
4006cpQJ3j1LJLj7KK4pj2Pjl4K9KK1k2J5k1M6m6JMRk6K9j5J1pOOm7jJ7L9m1K3
4045Aqj7%K3M3l3j6Nlj4K7k6L4Qj1k1KK1m2J7K1k0j2k3M4Nj5LjK1k1J5nJ6m0J7
4081ePk1L0oj7pK1J4k8pJ4j2J3J4k0J4j8J0oJ4L0l1k4J0K8j4rJ7k2K5rJ9k4Nj3
4116hl4M7j9j6L5j3J8k3noJ3k1K0L2m0%jLJ2j1J8MjpQJJ8k6ML4k6Jk8L3l0k2K9
4153gK0k0j1PJ2Nk1K0Lk0k6K2K2ql4K0nK3l1J0K5l0k9N5J6j4k0L5l5k7J2M3J9
4186C1l2k4QJ7OOkPqj5J2J8j5m2L4K3n3K2pJ1J1m5M7J6p2M8Nj4k2K1pM0k7nnJ4
$$ plain form
3932 13 13 20 0 -31 3 6 2 40 -1 4 -5 4 -2 -20 -10 9 -20 11 18 -6 -30 -28 3 -9 -25 -30 -2 -7 -11 3 -26 14 -43 -19 6 7 -11
3969 -11 12 3 7 11 12 10 2 15 8 17 0 -51 -27 8 -21 -27 -20 48 -6 6 -15 6 14 -17 13 -11 7 -25 -8 26 -9 -8 20 29 -24 -11 -3
4006 -3 -10 -2 11 0 3 4 7 -10 -8 16 9 -3 4 3 -31 -2 0 21 -1 14 -7 39 -7 -6 -2 7 -19 10 -5 6 -1 5 11 -36 -37 -20 19 -22 1
4045 1 -7 -24 -24 -1 42 9 -7 -2 -5 -19 8 -18 16 24 13 -8 -6 15 -27 -10 11 -9 -21 -44 0 5 -10 -7 -8 13 -8 7 2 18 -22 -5
4081 -5 2 -19 11 5 -12 -19 2 16 -12 -19 -5 -17 -4 10 -10 4 -14 -4 -10 4 34 3 -21 -11 17 3 -6 11 -11 14 5 24 0 5 -8
4116 -8 -42 5 -14 -30 5 -8 10 -13 -18 -24 -11 -32 -12 20 -20 -20 -21 -18 -6 -17 1 5 4 -3 5 6 24 -2 2 36 10 11 -17 16 -14 -36 -7
4153 -7 13 -7 -18 -11 1 6 -15 5 8 -12 -38 -16 6 -2 -36 -16 -21 2 -29 -19 6 -24 -53 2 18 4 -16 19 -16 -43 -31 12 31
4186 31 -1 -25 -17 0 6 12 10 17 9 -6 6 24 9 -33 1 24 -29 -7 -14 -3 8 -37 10 26 -46 2 7 -7 -29 -8 -15 25 -2 -7 -12 2
4222BnOrK9l3J1NMJ1l9N8nk9k8J2NJ4mjPo3N2J5k9K3j7K9j8j7rJ7j8j1RK8j5J1
4259brN8l7k3MJ6K8k9J2%mj4K1oj2j8LL9l2qpK9K0n0J1K8%o1J0K2J0k0J1K3mk1
4295a2rJ2J7k5J5Kk8J8MK5J4k5j9K7Jk6j5K6mOj4L9j8l4L0j1mj9K3MNn3O2rkl0
4331b7J5L7m3j6J4L1Mjm7M1k2j2K6J2J3k9olrJ3J2kk6J7MK6n3K2K8j5k5K0Mj9
4365a6J8Rj5pJ5kjj2J6k9j3O5l9j0L5K4p3KL1%qlL7k3pj6J7Oj9K9NJ2j6l1M8L
4401C2l8j1J3K5k1lK9k7j1J7Oj5l3J8KJ6k3LN%j9j6K9J9j5J8Rn5L5J8Oj5J9j9
4435bJ2jj2J8l0MrL0mj9OK8mj2m6K6RL%Qj3j2K1j6L2k1j0PMj7lL9Oj4j7j4J9J2
4473Hj5J0Pkpj4K7j0k3K1K2k2j1M6k0j7jMJ2k2pJ6Mj8j5J0L2j9qK5n2JL8nK2J0
$$ plain form
4222 2 -3 3 -6 23 -10 1 6 10 21 -18 40 35 6 -22 -10 -5 9 5 4 11 -52 0 15 -14 9 -8 21 3 -14 -23 -6 -24 -35 -26 2 -13 -2
4259 -2 -11 47 10 -13 -9 7 35 6 18 18 14 0 21 15 3 -15 -12 27 -5 -13 -20 9 29 -21 -10 18 18 -43 -33 -11 -1 -21 -10 13 9 -12
4295 -12 -21 -9 8 -17 -2 0 -28 -10 -6 19 33 8 -11 16 17 -9 -24 2 -2 4 -10 29 11 -23 7 -4 -8 -27 -4 0 5 -48 14 5 3 -27
4331 -27 -12 25 -18 -34 -20 11 15 14 -33 8 -14 -26 0 12 25 -4 -10 -13 -22 -9 3 1 -25 -8 -4 22 -31 -9 19 4 -21 -1 3 -16
4365 -16 2 11 -4 -11 4 2 1 -11 5 -24 -37 28 -11 -21 14 38 -35 -33 -2 -2 -10 -13 24 1 -6 -22 -5 1 -18 11 16 28 12 -19 29 32
4401 32 -6 -17 -4 21 0 -3 26 -1 -12 5 11 -4 -37 -19 -17 -1 -24 -21 -16 -16 -35 -51 -22 -3 -18 0 9 -46 -11 7 13 -2 17 -2
4435 -2 10 9 -3 15 -15 -11 -20 10 6 -13 -7 21 17 5 -41 -15 -6 -3 -3 5 -8 -20 1 -15 17 -4 -14 -7 -3 -20 -23 16 22 8 -9 -23 -4 8
4473 8 -7 3 10 8 1 -13 14 4 -19 2 24 2 -9 37 17 0 -1 3 15 -7 -14 2 6 -12 -27 -17 15 -4 -12 13 -39 -38 0 -5 17 27
4509B7l6Llk8j3L5J6n3P2j2qMk2L5j6j8PJ2KKONk1Km8L8kj4K0kqpMkJ4Pj9J9j1
4548a3LJ7Jl7J7L8k0J4k1j6L3j6oJ9J1m5kRJOnKkqjL5l2Kj0K0Oj6L1l0%Nk9oO5
4587B0l6%K5j9qj2K9J9j1mjOJ0k5k6N6j0o0N4Nmk4J5K9j8j8j4J0oJ6LJ6n7M0R
4622IrJ8l7j0JL4k9J4Jl2L8j1MJ6kl7M0j1j8M1Lk1k9L3l%k7K3K1k4j7M0k7pJ4
4657aj6J4J1l9L8k6j4jK6Lj4lJ2J6l3J2J0ollK2pMnK8j4Kk6L7Ll2j7J8J2j2Lj1
4694a2M0j6j1L0j7l3K4oJ9k4lJ2Rm2J8Nj8j9N3j7L2n5j0O8l6ON%J5l4kK7Jk3j1
4729b5N2j1m3L6Nj2l1KL0nRl%j1pJ8Ok5%JMPk3K4Oj6j8L5Rj7m2J4L3j1KRQrk0
4768a9RK6k6J6OMPj9nnL0l7L2j6Oj3J0J9l1j9K4Pl8OJ2K9om3K7Qk2qKL2m9K3L2
$$ plain form
4509 27 -9 -6 -9 -37 -50 -15 1 -52 20 8 0 4 -18 17 1 -17 -10 2 4 6 12 17 -4 -2 -50 -12 -14 -28 -8 -10 -18 -25 -21 -23 -9 -2 -21 -2 -13
4548 -13 -10 7 8 -29 -12 26 6 20 -1 -17 16 0 -6 13 24 -21 -23 -14 -13 -7 -12 -10 -12 -20 -21 14 -18 -16 -26 -6 0 -16 15 -15 -15 -10 -39 -45 20
4587 20 -16 -16 9 -10 -18 -30 -1 18 7 3 2 8 18 -7 -33 23 13 -47 7 12 8 -16 -1 28 10 -8 -22 -12 -18 -2 1 17 -40 0 9
4622 9 0 18 -19 -29 -28 6 -23 -9 -8 -40 -2 -13 -9 7 5 -32 8 -3 -21 20 23 2 -27 6 3 3 -24 -1 20 -4 -21 19 -8 -15 -1
4657 -1 -17 -3 8 -31 7 -19 -33 -34 -8 -5 -19 -22 -10 6 -27 -15 -5 -11 -14 -17 5 -2 2 -3 25 11 13 -13 24 27 -5 -22 -4 8 -4 -1 -12
4694 -12 28 12 1 31 14 -19 5 -1 18 -6 -9 3 12 -30 -12 -7 -25 -44 9 -8 24 -31 -41 27 -9 -3 2 2 17 -17 -19 8 9 -14 -25
4729 -25 27 16 -27 9 14 2 -29 -27 3 -2 7 4 4 -7 -14 4 10 -15 -15 -14 -10 -3 -26 -2 4 -12 -30 5 14 -3 -45 -31 2 -9 -7 2 10 1 -19
4768 -19 -10 16 -10 6 12 16 23 4 -1 -6 24 -13 19 3 9 -4 6 25 -6 -25 -1 6 -32 -26 -14 15 9 -34 -7 1 -21 -29 -27 5 -44 -21 11
4805A1Rl5qK1NJj9L5Nn0L4JJ5o2N4k4J0j1j0RL1m5J0J3k6mJ2J9ll9J9K2mj2J0
4840fL0j1n8J9M8k5J7j9jQj5L3l9K7qJ6J2j3l0J9lkJ1j5K0Kqj7%j3qM6J1l2j8
4875b2%K2J9j6qOKql7O2k9jJ3J8l8J2Ro%NJ7j0K8m5J6K0j2%qk4j2K9OJ7k0k0J5
4912@QJj9oJ8On6M0J7l6J1J5J8l4j8L7J5l7jRKJ0roK0MJ1pqQkOj7K2lk0jLm2O7
4952B6l3rPM6o3j0K4QnOOj6J0l9L5J9Oj9k2J3K4j5k0L2j3k4M7%j5nJ2K5j6qm5
4987c1N4k6k0K4Qmn2M5K6j8j8jKKj0J4L5l2j4Rj1j1J4J7k0K4K6l8J6kj7PL5m8
5021a5J2mJ9k1kM1j8k9L5kJ3rl2L5ll3j1K2J9k5j2RJ9j6j0J3Nj4m6K4K4j6PJ9
5055bkJ1l5L5j4lK9k2%kjL5m3OlPllj4MJ8Kl1K9j2Nj1JK4J8qrj1k0K5K0m8K4J
$$ plain form
4805 11 20 -15 -23 -2 3 4 -15 20 25 -25 9 10 25 -37 17 -7 3 -8 -18 -9 22 -23 -13 0 -26 -30 -18 1 -2 -41 -22 0 -4 -16 -6
4840 -6 24 13 -45 -26 22 -3 14 -5 -6 2 -13 20 -19 8 0 16 28 15 -15 4 1 -1 10 -5 15 17 9 -8 -8 -21 -29 17 28 -4 -22
4875 -22 -22 0 19 3 -5 1 3 -5 -42 20 -9 -10 3 21 -17 -5 4 -2 -2 3 20 10 38 -7 9 29 17 17 9 -15 -27 2 8 25 5 -15 0
4912 0 8 9 -10 -16 2 8 -48 -8 9 -27 -16 -1 17 -17 -35 2 17 -20 -21 -12 -10 0 -9 -15 5 9 20 13 5 13 11 17 0 22 19 -1 -2 1 -41 26
4952 26 -7 -16 -9 37 -26 -36 -12 -4 -9 -3 3 -13 -3 -42 -7 12 18 -1 -23 -10 14 -1 -21 11 -2 -26 21 21 6 1 13 38 22 14 -31
4987 -31 23 -3 -23 1 9 5 -47 -2 24 6 -12 -13 -11 -9 -19 -5 30 -2 -16 -7 -18 -29 -15 2 -18 6 32 -6 10 8 -9 -2 33 -15
5021 -15 -3 -7 12 -9 -11 30 12 -17 18 16 29 20 -12 23 20 -13 -24 -2 17 -8 -20 -11 8 -8 -18 -5 0 -14 -60 -36 -12 -28 -21 -2
5055 -2 -4 7 -28 7 -7 -10 19 -3 -3 -5 -6 29 -14 -8 -11 -4 -7 -10 -24 -20 -2 0 -31 -2 -14 -9 -20 -19 5 23 15 6 -5 -25 0 20 -28 -4 -3
5094clJJ0k9J8OpJ2j2MK2k7lJ5j6jNOnJL4lj4lnk4J2K2m1M6m3KK5j2MJPk4L5k
5134A1Nk5J3l7J5nj6J4L4k9J8oK1Ok7K0JK6m9KL2l6K6%j5J0k8J3J7j7J0j0Rm3
5168d0J9MJ0qNL0j1%pNl9KJ6J6J4k0K4Lok7L0noJ6k9QJ5k1j3L1l9K3K0Ml6J8J1
5205A7qk0qOkrPj4K6KoKJ3rmJ6k8J4k1K0j4K1k5L7K9l1mk5LJ1K3j2j8JnM4pk3
5243ak2K9K9n6NK0oK2kk2J6k8K1mrj2LK0j7njJ7K0n1K2JK0k3J1L0j9mk9M8l7L5
5279B1k8L4lm9K1L0Lm3J8J4k7ppM5j2j9l2M8j7RqJ8Kk0j1J9j2J1%j9K0J3l0K7
5313ImJ2m6L6J4l0K9J9l8NRJ1rrrJ8km1RL8km9J0K6j1j2MRlJ7j8j0L9m6L0k9K0
5350dJ3ompmj0J9J6k3pK8O%l5M0rk0J4K7l2k1L9qj6j4j0M1j0k5K2k0PJ8l2PKJ7
$$ plain form
5094 -3 -6 -5 5 -24 -6 0 -7 5 -7 -3 19 -8 -11 4 -12 -13 -8 -2 -7 -6 28 25 11 8 3 -21 -9 13 -28 18 -25 -23 2 -10 -6 -5 2 -22 13 11
5134 11 16 -9 4 -33 -18 -23 -39 -25 9 -20 -2 -8 13 19 -8 12 13 39 -10 -8 24 -12 14 14 -1 9 -19 -6 11 -6 4 -6 3 -40
5168 -40 -21 -17 -7 -15 -10 20 9 9 2 7 -32 -30 -14 2 16 -4 20 23 17 -10 20 15 9 25 -4 4 19 -2 -15 16 -23 0 20 24 -12 6 17
5205 17 9 -11 -19 -13 -15 -24 -17 -31 -5 -3 -9 -7 6 -3 -7 9 -19 -5 -26 -6 -20 1 -24 13 42 11 7 -18 -15 -4 19 7 -11 -10 -15 29 22 -1
5243 -1 -23 6 35 -21 -16 4 -2 20 18 -4 12 -16 5 1 -8 -20 -17 3 -14 -19 -20 -3 17 -34 -12 -11 9 -14 -3 27 8 4 -25 23 -14 21
5279 21 -7 27 24 -25 -4 26 29 -14 4 18 -9 -16 -23 22 10 -9 -41 7 -10 -1 -9 9 11 -9 -20 -1 -13 -2 -2 -21 -1 12 -18 9
5313 9 5 17 -29 7 21 -9 20 39 1 6 15 26 17 8 -1 17 15 -26 -17 21 19 -30 -20 6 -5 -17 -13 -4 -7 10 -8 -18 21 -25 5 -24 -4
5350 -4 9 3 -1 -8 -12 -22 -3 13 -10 -17 11 17 17 -18 22 13 -7 7 34 2 -19 20 12 -4 -18 -28 13 3 -22 0 -20 -13 5 -27 -20 -18 -1
5387aJ4l9J9j3PjRK4Qm1K5qNK6l3MJ6l2K2nJ7k1Oj3K0j1NJ0PJ1m6j7J0rK2nj1
5424a9K3rk0j2K9qK0j0Rk0JJ7L1n4K6lOk2jNK8k3PmlkL2j8J4m0J3K0j5J0j9K3
5460A2j8l1K1N%qJ8J2m2pM0MLJ3l7K5j3J6k7J6Ll8M9k4l2K5K3Nm1J3L1kj4k7M0
5495A3K0m5K1k5M2kk6MK1l1l4N1j2ll0J5J9Kk4L6j7%j5J7K6j5j9jK3j0J0lK0l5
5529gjM6lj6k1kPLlrK0J5l9J1J8l5MOj2K8l5K8k5O%K0J0l8RL2%l5oK6K4k6j2K8
5567A6Ql2K1JNm1J7K6jj3l6PL1lMQJm4K4J1mLl5J5PJ0j3kKOj4L9j3m2K0J8Qj4
5605ArL5Ol7j4K5J1j2j2K4k9Rj1jKOLJ6k8K3k8kM9m0Qj2mRk4K2j9J3K2jQl3L2
5642Hqj4mM1J6m1k4RM7k6j2J7L1l4j1MK1m1K0JpK0l0JL8m1oJ7Ml0L0pJ7K0k6j3
$$ plain form
5387 -1 13 -26 -7 -20 -13 -14 -5 19 27 -14 11 3 8 34 1 5 21 -11 11 6 23 2 8 -5 15 4 9 19 26 37 -9 -26 -16 -25 -3 -8 -19
5424 -19 4 -5 -25 -37 -8 -16 4 -6 3 -17 -16 1 32 -22 4 1 7 -15 -16 -11 17 -6 1 -3 -6 -8 24 6 20 -20 -7 13 -2 8 -11 12
5460 12 -6 -37 -16 -11 -11 -19 -1 11 -31 -38 2 6 9 22 -15 10 -3 13 -14 2 5 -33 16 -8 -40 -15 8 13 -28 -15 16 14 0 -27 13
5495 13 33 -12 9 -16 26 24 -2 2 23 -8 -42 9 -3 -6 -36 -21 -2 0 -24 12 -5 -5 -20 -3 23 8 -11 -12 11 1 11 8 28 -7
5529 -7 -8 38 35 19 -2 -4 3 6 3 -6 14 29 -10 1 19 -16 -12 -6 -18 10 -25 3 -22 -16 -16 4 14 -24 -15 17 17 -18 -24 2 26 0 -12 16
5567 16 24 -8 13 14 19 -22 -5 21 20 7 -29 -22 9 6 10 18 19 -25 -1 10 6 9 -26 -11 -4 6 -7 -9 -7 -1 -15 24 11 -31 -11 7 15 1
5605 1 -8 27 33 -4 -18 7 18 6 -6 18 -11 -2 -13 -14 -12 -6 -3 13 -15 8 -20 -22 27 -13 -5 -17 -21 -12 -36 -14 -33 -20 2 1 9 -24 8
5642 8 0 -14 -18 23 39 -2 -26 -17 30 4 -8 9 40 6 -5 -1 20 -21 -1 0 -7 13 -17 -16 22 -19 -25 -8 -4 -34 -4 -11 6 26 0 -13
5678a3QKoj5K8ok7L4k3K7KMQk6%L6j3l5KJ1K5l7JK1mPpnk1pJ5J2LJ3k7RnnJJ1
5718bL8m9J2j4L1l7j8J4K8Qm7L2J2j2j3L2k0kJ8NKj4nJ4j0j6K6k7J2j0j7N8j6
5751A3k4j3J6pk0L3J9j2j9j6L9j1k7J1N6n8K3JRj6kjpJ9j0J0l%k7NL8Mk7Pj3K1
5787A1mMQm8J2QPj0ooM2jk5L5k4j5mRJ2k3MK2l5Qk4N0kk1kJ7K1k0J0j6L5m2J3
5824@%JnoM2k9KrL0l2J8k1K3l4k1L0Qk2rK4J4Oj9M%J0J2j2JJ3l0K4Jj9K2k4Rj6
5862a4pLJ4J0J1nj3K6k3lOk1j0kM3J5l6Ok0K1klJ8k7L3k1jj1jNJ1j1NMK7k5J0
5899A2j9OMOOk9QoK8mOk4L8pj6k5PJ0J6n7M9J4k0%j3oJ6k4NL5k9noK2j0mJ8Pn
5938Dj3K2j4K9l8K2k1K8k5rK9j2j8K8L1m3j5J4J0k2j1J2JLQj7j1MOKK1Nm4K4K
$$ plain form
5678 -13 -5 -3 -9 -24 4 -2 -29 5 -18 9 11 15 23 -3 -3 33 20 -15 -13 -2 23 -14 -13 8 4 11 4 -1 -22 -29 -14 -2 1 14 -13 -4 -9 -14 -13 -2
5718 -2 36 -13 -1 -15 16 -21 -39 -25 3 11 -36 -4 8 -4 -17 15 -5 -7 11 16 18 4 -1 13 3 -13 13 -14 -2 -12 -29 29 13
5751 13 -11 -24 -8 -15 -35 -2 17 5 -14 -30 9 -2 -29 -18 38 -20 3 4 13 -3 -5 -6 -13 6 -4 6 3 3 -24 -19 19 23 -4 3 -10 11
5787 11 7 11 19 -29 -17 -9 -2 -12 -18 -24 18 17 -8 27 3 -12 -16 -7 5 -18 -14 8 -27 -19 -43 7 5 -16 -18 -1 20 0 10 -6 29 -13 0
5824 0 0 1 -4 -10 32 3 5 -4 26 -6 12 -9 14 -20 -41 -11 -3 -25 -34 -10 4 10 -9 -5 -5 5 17 5 6 19 -11 13 14 -5 17 -7 2 -14
5862 -14 -21 -18 -4 6 17 12 -1 25 2 -1 5 -16 -26 -28 15 30 -6 0 -20 1 -1 -4 14 -13 20 -1 -2 -13 -14 -9 2 -9 -4 0 27 2 12
5899 12 -7 -1 3 9 15 -14 -6 -12 16 12 18 -6 32 25 9 -16 -9 1 17 -40 9 23 3 3 -10 -16 0 -24 -19 16 -13 -18 -24 -2 -12 -16 2 9 4
5938 4 -9 13 -1 28 -10 12 -9 19 -6 -15 14 2 -16 12 43 0 -15 -1 9 -13 -24 -12 -11 -8 0 -17 -28 -24 -18 -16 5 10 -34 -10 -8
5973hMj2J0Lj2k3K6J1oJ9j4J1l1N2k4J3k3K9Rl8J5qrJ4nj7K4j7k0OK2j2Jk1kK3
6009a0k0J3l3M7j4j4L3oLk1J9J2oKK0k7Lj4K3j0jj9L4j2j5j8K2J9l7J9rJ6%k0
6043b1J6J7l8lJ6K4m3L1kj0k8N7j4kkJ2j0k7KJ1NkLQJ7k6K0J0kkm5L5j3J4j6%
6079hK0qJ4l5J8J7oj8OK5m6mL8j2k4QOpK4k9K0J0rqnK0k4QL0k1k4J5J9Lj7pM1
6116C0j9l6K7Pk6K%N6m9k2LK7Rm0J9%J9nqMl8J4J7K0Mk8RJOk4M3k6k8J4L5k4M
6153crL1rl6K6j4J7oQJ9ok8NMJ4pk8%M3m7J1J5J7k9P%k5K0mmJ4Rk9MJ4J1%%J6
6192B1l5MJ9Kk4K2j7M0k4nlK2j6m8M9kj7PM0l5j2K8pNj7qNJ8k0k9N0jn1N0mk0
6228a3k3J5K4j2OOkk8L1k6J0LJ2Rl2N3Kl6NOk0K1lQj5n0O9k6j7J7l2M7k6Jj0J2
$$ plain form
5973 -8 -4 -16 -6 -3 -15 -38 -12 -1 -7 12 -2 9 -22 30 6 19 -4 25 34 -4 11 3 -6 8 3 -14 10 -7 -27 -21 1 -11 -10 -31 -33 -10
6009 -10 -30 -17 -50 -3 -17 -31 2 -4 -1 -22 -3 9 3 5 25 -2 1 -13 10 0 -1 -20 14 2 -13 -31 -9 10 -27 -8 -17 -1 -1 -21
6043 -21 -5 12 -26 -29 -13 11 -32 -1 -3 -13 -41 16 2 0 -2 10 0 -27 -25 -14 -9 -11 -8 0 17 -9 11 21 19 17 -28 7 -6 8 -8 -8
6079 -8 12 4 18 -17 1 18 12 -6 0 25 -21 -25 13 1 -23 -15 -9 -16 8 -21 -1 9 0 -8 -13 7 -17 -9 21 0 -24 -9 10 13 -4 -11 30
6116 30 11 -25 2 9 -17 -15 -15 41 -8 -30 -27 0 9 -31 -12 -12 7 2 -6 -2 -40 -26 -9 11 15 -13 -4 -3 3 -21 22 -4 -32 -18 17 -7 -3
6153 -3 -12 19 10 -26 0 -14 3 -3 5 24 18 -10 -5 -1 13 6 -22 -22 21 -26 -15 0 17 -12 -5 -5 -30 -10 -14 -18 -4 5 -24 -20 -6 5 5 5 21
6192 21 -14 -10 9 11 -13 9 -8 32 8 3 0 22 6 -42 7 5 -12 -5 35 0 -12 16 9 14 -3 -11 -6 12 -8 -37 13 12 -39 11 7 -13
6228 -13 -36 -21 3 -9 -3 3 1 -27 4 -22 -12 -9 3 12 -20 33 35 -1 4 10 -10 11 8 16 1 -49 20 -6 -23 -6 -38 9 -17 -16 -26 -14
6264a4j3%K2k0rK7oNJ4j9Rj0lK2oJ5ql8O8n9K9KkJ1j4J0oonJ2l4J7nJK4nl4K2
6302fOonNJ7j1j7J6K1k7j6J3K4l6oJ1J6lJ7lj2J0J3j6j5qJ5j8L4J4m3K5J4k6J1
6337HJ3j7rj3L6l5mMN6l6j2k3M1%j8L4m0J7j8j7L0L1p6M2LM4n5QJ9Jj9kJ0J7l2
6372a2JrJ5qjK2k4NjJ4rJ4k1L1pn3PJ4M0l6jLKlJ6j4K4k9kM1j0j3QmlJ6j1K3l2
6411gKK1J0l3MmNj7LJ6j4NK3l9J1Oj2L6j6J7l8J1J2Nnl3N3m4QK0j3m0N9j0j2L7
6447B7l0Qj2J5k3LJ5j3%M9m4K0%oNqk1L5m3J1j0K7NMl4K8l8QL3l1ORj8K1rJ7j3
6484gJ7Lj8J0Qll9K0k2L4j7J1KK1l0KJ5J2l7lLMK2m2L5mj3Ok5J1oJ0QMJ0j8J7
6521AQk0QJ2j7L2l1J1ll2K3J0J5j2k7K3J2j6rL8m4M1l3K1J2n2K3K7j6k7KqL8L
$$ plain form
6264 -14 -27 -27 -5 -25 -34 -7 -13 -8 6 -13 -4 -14 -17 5 -1 14 6 -32 36 -23 6 8 6 17 3 13 7 1 -4 8 -26 -9 -14 -13 11 6 -28 -6
6302 -6 0 -6 -11 -6 11 0 -17 -1 20 -7 -23 -10 14 -22 -28 -17 -1 -4 13 10 -2 8 21 5 -10 -18 -3 -21 13 27 -16 9 23 -3 8
6337 8 21 4 -5 -18 18 -17 -21 -17 39 3 -9 -32 9 9 -9 25 -15 2 -16 -33 -3 28 -48 -6 -3 41 -14 -6 13 14 -5 -7 3 20 -12
6372 -12 -11 -20 -5 -13 -14 8 -16 -11 -12 2 -7 7 -14 17 10 -43 -36 -22 18 -18 -19 -16 -14 -17 -1 -15 9 -20 -22 19 9 -4 4 0 -3 13 2 25 -7
6411 -7 -5 16 26 -7 -3 -7 -2 -19 -16 0 -14 -9 14 -25 -14 -8 -20 16 0 17 -21 -10 2 7 2 -31 22 -22 -14 6 -7 -47 12 2 -10 27
6447 27 -3 5 -7 8 -15 -12 3 -10 -10 39 -5 15 15 9 14 6 -15 20 -23 -12 -22 5 10 14 -20 8 -30 -22 11 -20 -14 -5 -23 -2 -11 6 -7
6484 -7 10 13 -5 5 13 10 -29 -9 -31 3 -14 -3 -1 20 -10 -8 7 19 -18 -21 -18 -14 8 -34 1 -3 -16 -10 -35 -24 -30 -20 -12 -8 2 -16 1
6521 1 9 -11 -3 9 -8 24 -7 4 1 -31 -8 2 17 5 -22 1 13 -3 -12 26 -18 23 -10 11 23 -29 -6 21 5 -22 -20 -28 10 13
6555A3j3oK3k3KQrJ2j0Lj6M5o3O1mk5k1J1KqoM3k0k0K6oL8l7Nk9J3j7J0%K1l7
6591c4J4K1j0RnnMJ6j5J8k6J5rKPmj3NJ7j0nMQRLLMj8j1L3l4Lk0M4l4J1j3K8m4
6630c2L3Mk0L0l3J1qJ1j5K1jj9nJ4KJ3k9MNJ6j0OJ1lk2j6N1j0Kj5Oqj0K7Nrk4
6667a7M8j8mk3J8J0Jl2j5J4kM%J0qloL7k0l2RN4l4j2K0nJ6%j7J0PPj7J1J9l9L0
6704B1moj5L8qk2jJ2j9Ll0L7J2jNl6Mmj3N4m9j0NJ6J2j3J0j1J5j4NMJ1j7l3K9
6740a3J8pk2J8J6j5oJ7klj4nJ3L5qn0J8j2jJ2J2k4%k0M8LlnKm1J7J1rNJ5kJ0j4
6778fKpJ2l7K1K3j6L5l6J5LJ4l2L2k2qJ4Rj7j1j5J5Qj9L8l1J2mK0k6L9j4l5Pk
6813a9Pk%lJ4k0L8J3k4j3J6kqK4j0j2lK7lk0j9K4nMj0NmkLJnJ4l5K8j3J0j8L0
$$ plain form
6555 13 0 -6 17 -6 -4 4 -5 7 -3 0 -16 29 -34 27 23 -2 -23 -12 -10 -18 -24 19 -1 -21 5 -1 37 0 5 -24 -11 -28 -18 -18 3 -34
6591 -34 -20 1 -9 0 -5 -10 -6 10 -5 13 -13 2 -7 -5 2 -2 -15 -10 7 -3 -8 -4 4 13 16 19 23 5 -6 27 -7 -4 -24 20 -14 -3 -16 12 -32
6630 -32 1 5 -15 15 -18 -7 -15 -4 -19 2 1 -18 -23 -9 -7 6 -23 -19 -14 2 -8 -2 9 6 -16 -32 19 9 11 -4 2 -6 -16 11 16 7 -17
6667 -17 31 13 9 -14 4 14 15 -17 -32 -18 -20 -16 -16 -6 -14 -17 -23 14 -6 -38 -29 25 -9 -21 -1 -6 10 10 -7 3 10 17 0 11 30 -9 21
6704 21 17 11 -4 34 26 4 3 15 -4 -1 -31 6 18 17 22 -14 -10 -14 -27 27 -22 -32 -27 -11 1 -12 -2 -13 2 -12 -7 -3 8 -9 -42 -13
6740 -13 5 -2 -24 -6 10 -5 -11 6 4 1 -13 -18 -5 30 22 -28 -10 -22 -23 -11 1 -23 -23 -43 5 8 5 0 2 -39 -22 -11 -20 -15 0 -2 8 -6
6778 -6 -4 -11 1 -36 -15 8 -8 27 -9 6 9 23 -9 23 1 -7 7 16 -1 -12 -27 -12 -4 -23 15 -16 -4 -8 12 -14 25 11 -24 -17 -19
6813 -19 -12 -14 -14 -17 -3 -23 15 28 4 -9 7 5 -3 21 11 -1 -4 23 20 0 -19 5 0 4 -6 -1 -5 -7 -4 -3 -8 6 -29 -1 -14 -4 -22 8
6851HLk4lJ3Ll7J6K5k4J6RPpl1L0J3l1L6k3qKj6J9KJ8j1J0l6QL5l6QJ9l0lK7j1
6888dk2J7K9j7oJ6oJ1m3KMK4j4kk7J1J7nL5j2Pj3moJ3mJ1mk7J8L7k6K1l7oL8l6
6925a0qJ4j4J1ojL3l2k0L1km1J0L8j8K8j4nL4l6j3pK0j9K1K6K2l1jL5l6JJ8l4
6959fK4pj6N%j3ML3k3k5j6N7k6RJ9j1ol1L0j7OJ4j1Qj6J3j4%PrJ9K5j2m0M1j3
6995BPj8RJ3Jmj5J6ok5RL8l1nj6M5j9j1J3mJj0L5l7Qjj3N3l2j5J2J3pl3L9k0j
7032iQJ6qj7PQM0k2k8k0J7K4l4J7L0l3k4J0J6mj1J3j2K0j9OL2l3K2k9J0mkJK8
7067A6l3%J0qJ0J7j5KJ9%j2L7l6J8%m0L5oj9J2j0j2RK6m4M2k4NJ8plj1k2kK0J0
7103BQqqJ%ROj3%k1JM3Jk6J3k4J9J4pQk0QK4k4k4K8l8O0j8k5JK1j2K4k0j8L4l1
$$ plain form
6851 8 11 -13 -16 -3 0 -37 -21 4 -20 -4 5 12 5 -26 4 17 -14 22 -1 -9 -7 -23 -4 -2 16 5 15 -21 -13 22 -14 -6 13 -17 -20 7 -4
6888 -4 -26 -9 20 3 -3 13 7 18 -25 -23 -19 5 -9 -11 -38 -27 -10 -15 20 8 15 2 -2 -8 5 1 12 8 -19 -1 36 10 31 -6 -12 26 -10
6925 -10 -18 -4 -18 -7 -13 -14 19 -13 -33 -2 -4 -45 -35 3 -15 13 -1 -6 28 -8 -21 -28 -8 -27 -6 20 42 11 10 45 9 10 28 -6
6959 -6 18 11 -5 0 0 -13 -9 24 1 -24 -40 17 -9 0 19 8 2 -29 1 -16 -10 4 -7 1 -15 -2 -16 -16 -9 -18 1 26 14 -26 15 2
6995 2 9 -9 0 13 14 10 -5 11 5 -20 -11 27 -4 -9 -25 20 1 -10 3 -1 0 -10 25 -12 -4 -5 -18 35 3 -12 0 13 6 -27 12 -8 -9
7032 -9 -1 15 7 -10 -3 5 45 23 -5 -25 -8 16 -18 -1 29 -4 -28 -18 -2 -6 -17 -4 -16 4 -15 -9 23 -10 12 -17 -7 -11 -13 -12 16
7067 16 -17 -17 -7 -15 -5 12 -3 -1 18 18 6 43 7 25 25 -15 20 14 -5 7 -3 -15 -6 20 -24 18 -6 -1 17 10 7 -4 -26 -28 -8 2
7103 2 10 2 -6 -5 -5 4 10 -3 -3 -24 -23 20 21 -5 8 -16 3 17 10 18 -2 6 30 6 -18 10 -28 32 14 -11 -10 11 -1 23 3 -15 19 -12
7141a2Oj3nj4M1Ml7K1mOJ0MNkj5Jj0RK9k1j8ONJ1j8J1mLj8QK1oj2Oj5MK0m0J0
7180b3M4k2nk7L1lqL5j4JOn9L2K%K8l0L1k8kOK0l9L1pL2k6J3k2NPpKlNj3J9J9
7218C1k7o6O7J0j2J1k3K4kj7J1j1%kMj1k8M7m6K2J%mJ2QMPoj1Q%j0L7k1KrJ6r
7256GkK8j2m2K6p%nK2j0k0K1j6K9k6JK3j1j4l5J9K7Qm2L1J5l3K3k5L2Rk1NOkj5
7292fL7j3J4j5j6Mq%J4k3J8mj4K3Kj1j3j5j1K1J7j6qK2j9PJ7j4J0QNk8K7J7l3
7327dqK5j8J6oJ4J1k4Pn0L4j0J1LL1m8k3O7l5Oj6K8k7mORK0k9KrN2m7lkOlj1N4
7365B5k2Rk8J3K4k3%J3k9J1J8K0m0jK2j3j1NM3k5oKl0M0jm6PRK4l1J3K0jLm9J8
7401a7KJ6Pj7j3J7j0nK4QqopMJ4J9j1l0qK3%Okj1rMJ3J3k2J2qj1J0j5j2kL3l6
$$ plain form
7141 -12 -6 -19 -24 -38 3 7 -30 -9 -13 -7 3 7 12 10 -5 -4 -14 -5 24 3 -15 -9 -4 7 -11 0 -4 -1 -19 -11 10 4 -8 -2 -17 -13 7 -33 -23
7180 -23 21 -1 -6 -33 -2 -5 -13 22 8 9 15 -44 -12 -10 -10 18 -12 19 -9 -11 -5 15 -24 7 0 32 6 19 -3 2 9 2 4 1 6 -7 12 31
7218 31 4 -62 5 15 3 14 -9 15 13 -4 7 -4 -4 -6 -2 -13 -41 6 -40 -18 -17 -17 -21 -9 -1 3 10 4 -7 1 1 -9 28 7 9 0 16 7
7256 7 5 33 21 -21 5 -2 -2 -7 15 5 -15 6 -10 19 -7 -6 17 6 -8 -43 -24 3 11 -31 0 15 -18 5 -20 12 21 0 5 11 9 -6
7292 -6 31 18 32 17 1 5 -3 -3 11 -12 6 2 -12 11 13 2 -11 -26 -37 -16 1 -15 -23 -1 -20 -13 4 -10 0 8 13 -15 12 29 -4
7327 -4 -12 13 -5 11 5 19 30 6 13 -37 -3 -13 -2 1 32 -16 -39 28 -7 -1 -17 11 -16 -20 -14 -5 15 -14 -12 -21 31 -16 -19 -21 -15 -18 -29 25
7365 25 3 12 -16 -3 21 -2 -2 11 -18 -7 11 31 -9 -10 12 -1 -12 -7 36 11 5 7 -23 17 16 -30 -23 -14 10 -21 -8 12 11 14 -35 -17
7401 -17 -15 1 8 -9 -22 -5 -15 -20 4 12 4 -2 -9 -5 9 28 17 -13 -21 2 2 8 6 -5 -14 -10 3 16 -6 6 -2 -13 -3 -18 -30 -32 1 -35
7439c5J8L1k0j1K2Pk3Nm2M5NK1mj0j8K2j0NJ1n6J4J9kjRqK1l4M3j5k0j0N3k9N
7474Hk8J6j4j0K8k2J5MJ9qLj4k1OL0l8RL6j6J6l4ROO%Ok7lMN5l6Rl1J2K1k6J7
7511GkPj7j9J8QOpRjn8P2j2qj3JkJj5J3nL1j9K1j9Lj5RrJ3QqJK2l2K9j5nJ1J1
7551B0j0l7MmML5pj4Jj8l4O2qjpJ3LLk9J0NPn%L%rJ8j0NK7k8J0J2mJ0j4Oj3j9
7591a3J5Kj3PLj6%nJ1Ok0K3rj5mJ6J5l2K0j0JJ5k8L9l3Pj0M5k9K2j6J5k1k4L3
7626cJ6k0Mj2K2kk1K1k4lK0j2L4j4j0kK5l8J9k9L9ql2L2k7J2LJJ0J1mqMj1j1K8
7662A0j5j1k1O5rj5j6J4RrJ7rj3L1l5KJ6n0OJ1K2J9k7j3J2L4m2K7%j4j6mL0l0
7696b4L5%m2M8j2k1J6J5k9K6j9J4qK4j7oJ7n2O1Nk2J3j1j8K2Kk0j8K4k0j7KN6
$$ plain form
7439 -35 -17 14 -6 -17 5 12 -11 -6 -48 -3 2 23 19 9 -9 13 3 8 19 -37 -23 -4 -6 -7 2 -6 15 -19 24 9 -11 -21 32 3 8
7474 8 -20 -4 -18 -28 0 -22 -7 -3 16 8 11 -3 -24 -18 12 -26 -17 19 3 19 -15 -6 0 6 6 12 -15 -18 -14 41 5 14 -17 -5 16 -10 7
7511 7 5 12 -5 -24 -6 2 8 1 10 9 -49 23 11 3 -10 -9 -11 -10 -25 -12 -17 14 -5 16 -3 0 -15 -6 -15 -2 6 -2 -1 21 -11 18 3 -2 9 20
7551 20 10 -27 -23 -27 -23 12 5 -9 -8 -26 -60 2 -6 -7 -14 -1 2 5 -24 -14 -9 -2 -7 -7 -4 -4 -13 5 -5 0 27 -1 9 21 17 27 13 19 6 -13
7591 -13 2 4 -9 -2 1 -15 -15 -20 -9 -3 -23 0 -9 -24 -28 -12 3 -29 -9 -19 -18 -3 -31 8 -25 -18 -28 17 -12 10 -6 9 -12 -36 -3
7626 -3 13 -7 -3 -15 7 5 -16 5 -19 -22 -2 -14 20 6 -4 -6 19 -19 0 -29 10 2 -30 2 -25 -13 -10 -9 1 12 8 0 4 -7 -18 10
7662 10 -5 -16 -37 28 19 4 -12 2 11 2 19 10 -3 28 -7 -5 11 -39 -33 -22 0 19 -8 -21 -9 25 -17 10 10 -4 -20 -24 6 -24
7696 -24 11 11 -31 17 5 -16 0 15 -14 12 -7 7 -1 23 6 0 17 -35 26 31 9 22 11 -7 15 17 -3 -21 3 -17 -34 -32 24
7729B4m4lK9jk4Rk1L1K4mj6pj2L0j4j4L3J0l0oJ2qmK0k7L1k3J6j0MJj7oL8l5j7
7765c1K7OppOKj0kM2k1k5J9k5M9l7j5L9J2Kn1L2QJ2k5k1M0Ll4J1rj3J9MnL3k5
7801Cj4J6k3NJ8Pj8J9j6J4Mmk3pJ7jMj0j7J5J6LNk3NlJ8Lk2J4J8pMj4l0K1J1l
7839EJ6opk0jJ8J3j8K5l1qJ3J0j1J3k1j8J3J7j1k0L9k5mL8k4jJ5j5K7k9mK3k1
7873a0N1l4k3J1J9j1oLmj5Oj0N3o2PJ1%j2L1Rj4KqkOj6J7j6j4J8J6lJ6rk9J4n
7910a3QjPoj9M0k7OJ1j9J3MK1m9j7M8k8K8NKOk0Kj2oJ6Nj9LqJ9l3PL9k1j1Ml0
7948d5J8LoK3qJ2plJ3Jkj0%%J9k2jL0j2Pk7%K0l0L9l0OJ3pQlJ6m6J2j2J2lRj7
7987c0LJ5k6M2k7MjL4k5J8J7j0k8J4j5RJ0kKM0m7k2M4k9J7j8nJ6Ql8L1LqkROl
$$ plain form
7729 24 -20 -23 6 5 -19 -10 -31 0 24 20 4 -3 -15 15 1 -13 20 30 0 -6 6 -2 -6 14 -13 18 -5 11 1 5 6 -11 -17 21 -14 -31
7765 -31 -4 2 -5 -12 -6 -4 -14 -16 26 5 -20 -1 -26 23 -14 -29 10 22 24 -27 5 13 25 0 -21 19 22 -12 -1 -10 -23 -4 0 -5 28 3
7801 3 -11 5 -18 -13 5 12 -6 13 -3 11 15 11 -12 -19 -2 -3 1 -9 -26 -11 5 8 13 -10 -5 -8 10 13 -9 5 23 16 20 6 -24 -3 8 5
7839 5 21 15 8 -12 -13 5 18 0 25 -6 -14 -1 9 -2 11 -10 -28 -15 2 -9 -29 10 -15 -19 19 -5 -6 9 -6 21 -8 -12 11 -10
7873 -10 41 7 -16 -5 14 3 -3 0 -4 -19 -13 -23 30 -32 -25 -14 -14 -26 5 14 0 2 -6 -8 -2 -18 -1 -17 -31 -13 3 0 16 7 -22 -8 -13
7910 -13 -5 -6 1 -5 -24 16 -11 -5 6 -13 0 4 25 -24 -41 7 -21 7 12 14 20 0 2 -10 -16 0 5 -14 -11 -19 0 -33 -26 13 -8 -19 -15 -45
7948 -45 -27 -24 -30 -7 -15 -3 -10 -13 0 1 -1 -11 -11 -11 8 -14 -15 15 3 10 -17 -17 3 -27 12 -18 -12 1 -6 2 -1 15 -31 -19 -31 -19 -22 -13 -30
7987 -30 -27 -12 -38 4 -23 -19 -20 14 -11 7 24 14 -14 0 -15 -6 4 2 4 44 -3 -25 19 -10 7 -11 -16 0 8 -30 1 4 -4 -6 3 9 6
8024Fm2jJ7K5jl3M7j4j3PmkJ0Ql4K8j8M2k4rK6k1j8QJ4j8L3j8K4l2J7j4JkJ0j
8060Dk1PJJ2moQk2lJ8J0nK6k1m0K7K2Pk0L8n6M5m2L3l8O3l1j6QQj7Qj1K6ml0N2
8097C6m2PrJ0j5M0l8k8K9jJ0Qk3K2k7%oJ8J5k9K9Pm6K7K6j5J8k3J5j9K5k4M2l6
8131CqoPKk2K9P%k8lK0pJ3j5L0nm6N1mj5l4K2J3k5K6l8J0jN2m0K6mkRj5JL1l4
8169@j2J9olj5OJ0Mj2J8j1J3ol1K2JKk4J5j6rJ7
$$ plain form
8024 6 -36 -37 -20 5 4 -29 18 4 -9 -2 -6 -8 2 10 -24 4 -14 28 4 -5 21 0 -18 -10 4 -14 19 1 25 -7 10 -4 -3 -5 5 4
8060 4 -17 -10 -9 3 -1 -7 1 -21 -24 -6 4 -1 25 4 -36 -9 13 20 0 38 -18 27 -15 18 -20 43 12 -4 4 12 -5 3 -8 18 14 -16 36
8097 36 -6 1 -8 2 -13 27 -11 -39 -10 -11 -1 7 -16 6 -21 -21 -27 -9 6 -23 6 13 -33 -6 20 5 23 0 15 -4 21 -3 39 3
8131 3 -5 -11 -4 -2 -24 5 12 12 -16 -19 1 -6 7 -8 22 17 -29 22 18 3 -31 -9 4 -21 5 -33 -23 -24 28 -12 14 10 8 17 2 3 34 0
8169 0 -12 7 1 -2 -17 -11 -1 3 -9 9 -2 11 5 -26 -4 -3 -1 -25 -10 -26 -35 -18
8191a8
$$ Imaginary data points
##PAGE= N=2
##DATA TABLE= (X++(I..I)), XYDATA
0@%%%%%%%%%%%%%%%qJ6j6J6j6K4l2L2l6M4m8N6o8P6q6R8j12J28j44J60j77J99
37A06k22K46k75L06l38L72m09M52n01N52o06O66p33Q08q92R83j086J204j338J493
57G88j674J889k147K466k869L392m109N138o720R420j4824K9343j34057l43521
71d57485N16317K89952m16836j30513K60478j3980o6996J27702q8590j87600J86235
82A8684J73852k16189j34249J65132P8900o3184m6315n3010L8662J64603k9893
93I6993k19030K2957J94731m5247j29437N3222L4758l1465P1524M315j30130L2322
105d4487J29227p9294q9858J16313K7260j26578M5078R8556j14303m2502J69204
116H8616j600j73938L9715J45628p3297j17268P6593P1494o4613r725O3540l1042
$$ plain form
0 0 0 0 0 0 0 0 0 0 0 0 0 0 0 0 0 -8 8 -8 8 -8 16 -16 16 -20 24 -24 32 -36 40 -46 52 -60 68 -76 84 -93 106
37 106 -116 130 -145 161 -177 195 -214 238 -263 289 -317 349 -384 424 -468 515 -571 633 -705 788
57 788 -886 1003 -1144 1322 -1547 1845 -2264 2874 -3846 5574 -9250 20093 -113964 -457485
71 -457485 58832 348784 -68052 -198565 61913 47933 -19063 108639 20049 -167551 18684
82 18684 192536 -23653 -157902 7230 86130 22946 -23369 -76379 -37717 126886 96993
93 96993 -122037 -99080 95651 50404 -79033 -25811 8947 -22518 49006 53321 -76809 -44487
105 -44487 84740 5446 -84412 31901 59161 -67417 -22339 76217 -38086 -80588 88616
116 88616 87016 -86922 -47207 98421 25124 -92144 -15551 55943 -8670 -18395 45145 14103
128A4103o5341L9761N9530l7327n5934L1831N2735k8048n5317J3125N5253R182
140C3553m4378j7404L6839K3149k5956l6264k020L6725K8511j8433l7867k558
152b6103M4034K3629m9628l9261N0417M4026m6502l6732M1238J7576l4930J0471
164a765K1003l8250Q940O3930m2112q0327N8539O9903o8211m4945O9615J5583
176C1903n3262J8101K4030m5608O906N1907l2044l5438M8616Q308n3987J8248
188a2320M5714l6909j9064N0430j2871m9219L6712K7017n0875K54M8579k1328
200F120k9216L6000L108l9821K2015K8074m0638k548M6199k7563l7371M8962J6579
213B9900n7073R087N3677l2103l9399M8667J5896n6910O658M9494k1786k7802
$$ plain form
128 14103 -51238 -11477 48053 10726 -45208 -13377 39358 11310 -44007 -30882 24371 33553
140 33553 -10825 -28229 8610 31759 5803 -30461 -32481 4244 32755 14322 -23545 -26103
152 -26103 17931 41560 -8068 -47329 3088 47114 612 -36120 5118 22694 -12236 -1765
164 -1765 19238 -19012 -10072 53858 11746 -68581 -10042 59861 -8350 -53295 16320 31903
176 31903 -21359 -3258 20772 -24836 -17930 33977 1933 -33505 15111 23419 -30568 -12320
188 -12320 33394 -3515 -22579 27851 14980 -34239 2473 29490 -21385 -21131 27448 6120
200 6120 -23096 12904 16012 -23809 -1794 26280 -14358 -16906 29293 1730 -35641 13321 29900
213 29900 -27173 -18086 35591 3488 -35911 12756 28652 -28258 -21600 27894 6108 -21694
225b1694K7992L979k2369J6902Q945l1462R049L7416k7217l1481L9636J4437m2039
238a7906N861L3128k1963j6313L1861l144l6206J9082L1394k9478j7474L1565
250A0407N32k2502J3579O238k0740J1443K0422k6854j3426L7300n06m0682J7329
263g460L3684l1156j7959L7297m85l4361J6106K4908k5674j0215K8357n652k1541
276a4151J9095O881k4701J0041K0010k3598q605K9684o367k8666K0718K0034l1715
289a1340n330L5171j1282k9173K4015J6710k8077k374K4374r178j4199J6199L26
302E842j6959J4043J0029k4756K128K7115j4918k1861K3608J1832k6672o6K4470
315A3835j1042j6885J9228N727k1068N951J6594j3509q269J5356p33j2851Q074
$$ plain form
225 -21694 6298 10277 -12092 4810 13755 -17707 -8658 28758 1541 -29940 9696 24133 -17906
238 -17906 -12045 21083 -880 -17193 14668 11524 -24682 -5600 25794 -3684 -21158 10407
250 10407 10939 -11563 2016 8254 -12486 -1043 19379 -7475 -20901 16399 15893 -24789 -7460
263 -7460 26224 -4932 -22891 14406 13921 -20440 -4334 20574 -5100 -15315 13042 7390 -14151
276 -14151 4944 11825 -12876 -2835 17175 -6423 -15028 14656 8289 -20377 341 20375 -11340
289 -11340 -16670 18501 7219 -21954 2061 18771 -9306 -11680 12694 3516 -10683 5516 5842
302 5842 -11117 2926 12955 -11801 -9673 17442 2524 -19337 4271 16103 -10569 -10635 13835
315 13835 2793 -14092 5136 10863 -10205 -4254 12340 -1169 -9438 5918 5185 -7666 408
328D08O585j3472K179J4612j2151j0585J9689L076k2282N208K0761j1682j6228
341a3882J6214R564j7491j220J4588o039p793R343q82q601P980M538j2719J224
355e176J4439q269j2207J5020N734j8257L868J6976j2626j1479J8255M115k0200
368i807L788J8346j0934j2422J4194L089j2500N617N617j0729L600J1288j2282
381c135p872J8996J356k1622P693J9433j5714j1923J9620J719j8075P312J2317
394A0105j3121m461J4539m458j2037J1215N156j3451M252J0418j1843l002J5118
407H430o057j3835J4776R699k0716k857K2118n410j8919J1620J1791j2989l209
420e558R613m357m438Q511j834q906Q777O374j3524o61J4054o252j0345J1952
$$ plain form
328 408 6993 -6479 -4300 10312 -1839 -12424 7265 10341 -11941 -6733 14028 2346 -13882
341 -13882 2332 11896 -5595 -6815 7773 1734 -6059 3284 2402 -6199 1781 6319 -6400 -5176
355 -5176 9263 994 -11213 3807 9541 -8716 -4848 12128 -498 -11977 6278 10393 -9807
368 -9807 -6019 12327 1393 -11029 3165 6254 -6246 -629 4988 -5741 -2141 9147 -3135
381 -3135 -11007 7989 9345 -12277 -4584 14849 -865 -12788 6832 8551 -9524 -2212 10105
394 10105 -3016 -7477 7062 2604 -9433 1782 6938 -6513 -2261 8157 -3686 -6688 8430
407 8430 2373 -11462 3314 13013 -7703 -10560 11558 6148 -12771 -1151 10640 -2349 -5558
420 -5558 4055 -302 -4740 3771 1937 -6969 1808 8182 -5342 -6003 8051 1799 -8546 3406
434C406M629j4449J525J3748p654j1358J1703O768j2430n87R862m385n330N752
448A200j17m324N107J839p598K839P921r005o268J4065K337j5773K959J4644p777
463B049j2515R371Q262q689j867P209l583l836N696j763n085O586L317p176P45
478a279N238o270k413J0393j993j1858Q151J0747j3658q463J4695M356j2521L12
492d563R726k737n390L029n04j935N277r75o204N578M951r262k621R938j528q889
508f109O304P236r554m000R652j315q505N310O897n029l251L552n17k733J653
523d09K76o29M380k36p661J435P209m803n932Q152N738r036m663Q106J185p672
539d560J802P089j748l615J331q9j599J428M69j845K048K542m191k018M783j310
$$ plain form
434 3406 8035 -6414 -4889 8859 1205 -10153 1550 8318 -4112 -4699 5163 778 -4552 1200
448 1200 1083 -3241 1866 3705 -3893 -1054 6867 -2138 -8406 5659 7996 -7777 -4818 9826 2049
463 2049 -10466 -1095 7167 -1522 -3389 3820 237 -3599 2097 334 -4751 1835 5152 -2024 -1279
478 -1279 3959 -2311 -4724 5669 3676 -8182 -31 10716 -2942 -11405 3290 7646 -4875 -4563
492 -4563 5163 2426 -2964 65 -439 -2374 2903 1928 -4276 1302 6253 -3009 -5630 4308 2780 -6109
508 -6109 195 7431 -2123 -6123 3529 2214 -6291 -981 5916 887 -2364 1188 671 -2062 -409
523 -409 -133 -762 3618 3382 -4279 -2844 4365 -438 -6370 1782 7520 -1516 -6179 1927 3112 -4560
539 -4560 -2758 4331 2583 -1032 299 210 -1389 39 508 -1337 711 3253 -938 -2956 1827 517
555E17m996N028M707p006k625Q524n06j0142K713R783m060o012N557K537n082
570a063p94J094j025L171K255n647o43P273l813r002P519Q136q879l229R663k097
586B919r408M891O284o132r71P467k750o221L747J177l836L651K012n825K383
601f12O235p573n870J0841L704j1547J052J0815n153q104O544L363o359Q87N062
616C285k538j829K398k350j528M824j558n352O074M734r003k700R269q03q084
631e161M395O651n865l675N969o38n652K978M100k494r86R72j856M43K264l060
647a615j639O436J190q136J45P969k492o773M390N577m444l787L772J323l460
662a544OK285k75j44R5j392P20J509k390j052L897L85m594J383M934l641m774
$$ plain form
555 517 -4479 549 5256 -1750 -4375 4149 3643 -6499 -3786 5997 1937 -4075 1482 4019 -1063
570 -1063 -1857 -763 -1788 1383 3638 -2009 -2652 4621 808 -8194 -675 7461 -1418 -4647 5016 2919
586 2919 -6489 -1598 4686 -1446 -2417 5050 2300 -3921 -174 1003 -2833 818 2830 -2995 -612
601 -612 5623 -1950 -7820 3021 6725 -4822 -3770 7045 1892 -6212 332 3695 -2664 -1777 3285
616 3285 747 -1082 1316 -1034 -2562 2262 704 -4648 1426 6160 -2843 -5543 3726 2923 -5161
631 -5161 -766 5885 20 -3655 2314 1676 -3976 -998 3102 608 -378 594 -1262 -819 1445 -1615
647 -1615 -3254 3182 4372 -3764 -3619 4350 1858 -4915 -525 5052 608 -3179 593 1916 -1544
662 -1544 -1538 747 472 328 423 -969 -249 1260 -1130 -2182 1715 2100 -2494 -1111 3823 182 -4592
679d592N425L646n909j707N797N0n365L74L658o01j427O30p1N69O29k768o32M395
697B101Q4m822J641M823l430m479M508L207m840j063M349q70l340J447J546j365
713e03Q0R39n46J98M98j776L37K930j833l251L670K904m943k189N321J244n196
730b116k47M481m48l355M93J775j37o88n26M16J487l27k008N59K326j299k334
747a948K268J943k980j196L213J63l315N78L222j093k965J388K434j562j834J384
763c00J541m88j386j77J450Q52j794j568K377J898l205j784L883R98m196P6L846
780B023j016l074J689K023k014p81J783k67p90Q09k77m10J139n79j565J833J116
797A642l071l40M011j027m339K498L812l493k524L636J199k879j50J617k65n9
$$ plain form
679 -4592 833 4479 -1430 -3137 2660 2710 -2655 -2281 1377 776 -651 -21 -92 477 1106 -1662 -2294 2101
697 2101 2185 -2637 -996 3827 397 -4082 426 3633 -1207 -2270 2079 1209 -2131 -684 862 -503
713 -503 -423 516 -30 168 666 -1110 -773 2157 324 -2927 743 3647 -1296 -3485 1836 3080 -2116
730 -2116 -2363 2118 1670 -1685 -1192 583 446 -242 -768 -352 1135 808 -1200 -641 1685 386 -1948
747 -1948 320 2263 -717 -1913 1300 1463 -1852 -1274 1948 855 -2110 -722 1712 150 -1684 -300
763 -300 1241 753 -633 -810 640 1492 -302 -1870 507 2405 -800 -2584 1299 2297 -1899 -1823 2023
780 2023 1007 -2067 -378 1645 -369 -1150 633 366 -424 385 108 -302 837 258 -1307 526 1642
797 1642 -1429 -1769 2242 1215 -3124 -626 3186 -307 -2831 805 2004 -875 -1025 592 327 268
813B68L5j290Q97K027k194j923L247Q60l841N65L412j809k515K718J324k985N8
830a146K658j014j663J304N86p88J04j89l20J221L4k197O31K721j510k835K283
847a20K328k723j552K652R20k052m54J499K75q50k96L00O15q4r55P7J103m32j100
866h49P25R71j059p76J293O19j649m11K034J72k066O8K172j55k266L43K083l94
884H55j782K76J256or71n43Q49J014q42j300J044J469j418j311J875Q20k057K3
902g49K010q46j601J355R81j626k81J407k87q86L36K1L5O31p04q66J769O79k591
921a213j44L016n22k899J279K403j743j654J623O04j003O9K69k87M71j1j111M78
939c75J358j055r56J762K32k111P01J935j561j342K119P07k262j87J905l27j375
$$ plain form
813 268 303 -987 -90 1937 -257 -2180 1067 1927 -1914 -1349 2063 254 -2261 457 1781 -1204 -1146
830 -1146 1512 498 -1165 139 725 -63 41 -148 -468 753 787 -1410 -779 1942 432 -2403 -120
847 -120 2208 -515 -2067 585 1505 -547 -1001 498 773 -77 -373 -73 542 458 -497 -420 683 251 -849
866 -849 -124 847 -212 -988 305 924 -725 -1136 898 1070 -996 -928 1244 1089 -1177 -834 1249 855
884 855 -927 -651 605 599 -372 -915 -66 948 106 -1194 -150 1319 -99 -1410 465 1285 -772 -749
902 -749 1261 415 -1186 169 1150 -476 -757 650 363 -523 -187 -166 -131 500 -204 -1070 699 1378 -1213
921 -1213 -1357 1659 1137 -1762 -483 1920 177 -1477 146 750 -253 -184 85 -202 269 258 -853 -375
939 -375 983 -72 -1028 734 966 -1145 -444 1491 -70 -1412 707 1414 -848 -1035 870 543 -832
956h32L78P71j3j71o53j08J339o0j806M49K221p37k180J113J708j457j229J581
974C14P10j257j79P27l29m94L86K58o5N2j24j08L57l12p42R88J038j276j059J645
994E30P29k102n39K311L05k071m9J619k41j177Q5P56L41l04o03J41R43l40j244
1013i10O73J359j036r44J361L65j639O8J510n73j116R95Q05j059o30O61L58k25
1031B3k32k0P61L90j459o47J760N77j961n8K131l19k150L12J525l31p90L12N87
1050D11l8n61m23M70O67n42l54Q97J40j269J13J208n92r12R54P91j022p79P75
1069f6O46o52p10N20J162l28j475L24J614n84j663Q68J619q27j192N61P54n32
1087C9n87K38O90J81p19m25Q00R9j140L73J464o49j191J058P11j546l54J667Q8
$$ plain form
956 -832 -454 317 304 133 -520 -628 711 651 -1155 -706 1515 778 -1402 -289 1419 -38 -1267 314
974 314 1024 -233 -412 315 -14 -508 -122 136 71 123 -1 -109 248 -64 -806 182 1220 -56 -1115 530
994 530 1259 -843 -1382 929 1234 -837 -886 733 492 -685 -600 156 497 193 -410 -269 674 334 -910
1013 -910 -237 1122 86 -858 503 868 -771 -703 807 234 -882 113 918 -141 -771 -110 248 23
1031 23 -209 -229 532 922 -537 -1184 576 1153 -808 -866 1265 946 -1204 -892 633 302 -488 -176 411
1050 411 373 -188 -611 -141 526 -16 -370 527 667 -602 -489 719 127 -785 169 960 -62 -841 -66
1069 -66 580 -72 -782 -262 900 572 -903 -579 1035 451 -1212 -344 1275 448 -744 -183 571 39
1087 39 -548 -310 380 561 -158 -583 217 316 -824 -451 1013 364 -827 231 942 -604 -958 709 797
1106G97j238J99O70k31m01l21J96J059j05j620M57J821j045j867J501J660j650
1123a18r67J598K62j219J13N57j88J05%m53L35M45r53k23J369m06j290J281J027
1142A275j863n53J952%j780N60J486o47j036L30M28J51j45p41L60J267q25j629
1160a410J190J468j433j009J720N59j645q1J142k55o19M49K20k28o9j60N6L37
1178B32k64m42O66N29j144l67J393N2j541L01J483l52j248L58J006k42q83J2Q31
1197C80K36q12m75Q37M99j013m70J126L54r60k04Q35op19O5P05q8n44J69N12k79
1218A48o12K91P48l89p65M67P33n39p74M68Q45l25q40K47Q22q5r95N0J093lj116
1239e31J05J072k22r57K32P50k77n20K26L46j78k59J4L47L7m33J06N59k04p37
$$ plain form
1106 797 -441 -242 428 197 -204 -525 -329 730 625 -995 -538 1283 238 -1629 -128 1532 -118
1123 -118 -1085 513 775 -444 -331 226 38 143 143 -310 25 470 -483 -706 663 257 -1033 248 1275
1142 1275 -588 -1141 811 811 -969 -409 1077 430 -606 -276 152 303 158 -583 -223 1044 219 -1410
1160 -1410 -220 1248 -185 -1194 526 1085 -560 -641 501 246 -373 76 296 68 -1 -161 -105 232
1178 232 -32 -474 192 721 -423 -790 603 655 -886 -585 898 546 -702 -344 662 420 -463 -451 380
1197 380 616 -196 -671 166 665 -348 -818 308 662 -298 -502 333 327 -392 -327 378 290 -254 -85 427 148
1218 148 -464 -173 575 186 -579 -112 621 82 -692 -224 621 296 -544 -297 525 440 -555 -505 588 585 -531
1239 -531 -426 646 424 -533 -301 449 172 -348 -122 224 46 -213 -199 148 185 -248 -142 417 213 -524
1259e24M12P65n96p56Q18O58r24n36Q04M41o45m25M38N37l33o47K06P81j32q42
1279e00J96R06k80q53M04O55m54m83M20K91l60k18L20J60l54j22L37J95l76k34
1299c50M83K90o05k76O56L42o46m42P39M02p24m08O60M32o28m87O26M61n94m21
1319d90N16L25l93k36K68K51k20k01J98K17k27k32K79K54m60j93N78N3o72O3P14
1340C92j59o70J93O39k35m86J39M13Q1l87k92M80L84n86m55O91L97p45k94P56
1360B56O5o52J08M70k06k46K04J02p7q5J7J27J7k03o0L87L2n86P2O98k92o87M18
1383a21O14m05n74L99M58l06l18J23L40L9l95j06M46J54n27r5M91N6n13P3L91
1404B24k01k55K36J56k14q0J90J02j97j32K11K31k85k62L34K93l96l54M08L42
$$ plain form
1259 -524 -112 653 57 -699 119 777 -147 -683 121 562 -83 -508 -70 467 134 -513 -307 474 342 -500
1279 -500 -304 602 322 -531 -127 528 74 -409 11 302 -58 -276 44 204 -150 -272 65 260 -116 -350
1299 -350 133 423 -182 -458 198 540 -106 -548 191 593 -131 -539 121 553 -75 -562 64 525 -69 -490
1319 -490 26 351 -42 -278 -10 241 21 -180 18 235 8 -224 55 309 -151 -344 234 287 -385 -322 392
1340 392 233 -437 -244 395 160 -326 -187 226 307 -80 -372 108 492 -94 -549 142 539 -206 -500 256
1360 256 321 -331 -223 247 41 -205 -1 101 24 -61 -44 83 100 -103 -163 224 256 -330 -258 440 148 -539 -121
1383 -121 493 88 -486 -87 371 65 -253 -130 210 249 -146 -252 194 348 -179 -274 217 273 -240 -167 224
1404 224 23 -232 4 160 -54 -134 56 158 -39 -171 40 271 -14 -276 58 351 -45 -399 9 351
1424C51l60l35L29L07k32l95K12M25j99l86K35L19j86l36K19L17k45j70K10M0
1444A20j92l7J60Kp7q9J54P4j82j64K85K11l80j85N11J37n73o4N23K7m68pL57
1467A43O8k80j80K14K44j77k81J85L52k56k82K85K26l58m5L38o8k73J00K26j70
1488A1j67J96J18j23j83O3J98k4l09K2M22L8m92l3N43p3m60R4M49p9l69qL21k6
1512A29k52J6K19j1j68q4J97Nj46L6J87p4j60R9J45r2k37J93K65k41k93K91K70
1535B94l38k91L63K59l25k04K35J88j69j97J5L22N3l35k6L81n5m11Q5M37j82l19
1557b20K83J46l47j7K62o7j37J09N2n0m4n2L3K60j36l28K91L30m33l34N34K35
1579C70n39j14M37N6l73oK01K9m8p5n9K79j6l25P6L29j44k91K99J80l65o4L63
$$ plain form
1424 351 -9 -344 -15 292 60 -335 -123 302 103 -283 -48 271 85 -251 -32 285 40 -130 80 120
1444 120 -72 -109 51 53 -24 -113 41 115 -67 -231 54 265 -115 -300 211 348 -225 -289 234 261 -207 -214 143
1467 143 211 -69 -249 -35 209 32 -249 -64 288 32 -250 35 261 -97 -142 196 128 -145 -45 181 11
1488 11 -156 40 158 35 -148 -85 113 89 -220 -198 224 262 -230 -263 280 207 -253 -159 290 211 -158 -166 155 129
1512 129 -123 -107 112 101 -67 -151 46 51 -95 -59 128 54 -106 -7 138 46 -191 2 267 26 -267 24 294
1535 294 -44 -335 28 287 -38 -242 -7 181 12 -185 -170 152 205 -130 -156 225 170 -241 -156 281 99 -220
1557 -220 63 209 -138 -155 107 40 -97 12 64 14 -30 -82 -49 211 75 -253 38 368 -65 -399 135 370
1579 370 -169 -283 154 210 -163 -169 32 61 13 -62 -121 158 142 -183 -107 222 78 -213 86 266 -99 -163 200
1602B00j40k71K05K09j76j45O6J12j2j28o3K46K09m03j79M36J36m87n6M72k4l57
1624a50J4K25oj83LJ13J22j08j89J34J79k08r8K53L3k87P4K90j84k05J89J73j61
1647B3j15R3J34p1j92n0L58kl71J5M32j12m30J49L62j11k79J43J50q3j20m9J47
1670B1J10j42j31K01O4k51k1K78n2k88K23K21k82j50K98P6k27l8J37P3q7j37j
1693a05K46kl17L3M23j79l65K03L05k02k62K31J75k03q5R2N1%r7j8J28J6j91K7
1717i6K31j72j47J84J92k35j65L15O8k82j8K51L3k01j04J78J17j48j40J31K06
1738A98j75k05J63K19j86k05J80J72j52j64J82J10j49j39J89P0j57j7J15L8j77
1759i0%J83Mj89nJ49M0k01l0K13Q0k17q9K71R4k72r2K74M8k47o4K47j5j80pJ26
$$ plain form
1602 200 60 -211 -6 203 27 -118 -52 60 48 -80 -143 103 312 -91 -270 166 302 -185 -241 231 207 -150
1624 -150 -136 89 83 -100 -97 16 138 30 -159 -25 154 -54 -152 101 134 -153 -79 211 27 -178 11 184 23
1647 23 -92 1 135 64 -128 -178 180 178 -193 -178 254 142 -288 -139 223 112 -167 -24 126 43 -77 -126 21
1670 21 131 -11 -142 59 123 -128 -149 129 77 -211 12 233 -49 -199 99 175 -52 -90 47 120 33 -104 -105
1693 -105 141 139 -178 -145 278 99 -266 -63 242 40 -222 9 184 -19 -104 -12 39 39 -58 -76 52 68 -123 -96
1717 -96 135 -37 -184 0 192 -43 -208 107 175 -107 -125 126 159 -42 -146 32 149 1 -139 -8 198
1738 198 23 -182 -19 200 14 -191 -11 161 9 -155 27 137 -12 -151 38 108 -49 -66 49 87 -90
1759 -90 -90 93 97 -92 -97 52 92 -109 -139 74 154 -63 -152 119 213 -59 -151 123 171 -76 -140 107 92 -88 -95 31
1785C1L2o9r6R7J19j26j20J79J08k54nK28m0k22O5K12j13j71J16J66j19j20M8
1808e4J19L1j70m6K53K1k64LK78k0k89L0K55m4j90M6J20j0j11l3P5M3r3oP4K7
1834D5j19RJ59n2j58J08J51j23j57J32J26j10j35J02J54j02j58P3K24j05j79M2
1856g3K35r9k09J02J88n5j80P0J22n2j21M4J06k1j26J7J48q0j50J48Q1j49p4K00
1880G2L5j77k6J36N2j14p3J18J14j04j71J38J74j61j97J83J55j72j48K10P1j61
1902d6l0J06M4kr2J0Q1m0r7M3J24j03j10J52J00k03p0K48l6k18N5J66l2j39RJ38
1928E8K1q9n6R3J03j43j31J57J52k43o5K10L0j04l7J00K0j12M2LL0m0l7O3L8j01
1954c8l3J71k8j63K5J85o7j82P4J61o5j18MJ45qj56oJ78Kj47qJ29J02k01l7J80
$$ plain form
1785 31 63 -6 -102 -5 114 -12 -132 47 155 -99 -104 124 84 -138 -73 139 26 -145 -29 137 18 -102 -54
1808 -54 65 96 -74 -120 133 154 -110 -107 171 151 -138 -108 147 103 -87 -41 79 69 -42 -75 0 43 -50 -56 18 45
1834 45 -74 -65 94 42 -116 -8 143 20 -137 -5 121 11 -124 -22 132 30 -128 -55 169 64 -115 -73
1856 -73 162 63 -146 -44 144 89 -91 -21 101 49 -72 -28 78 57 -69 -52 96 16 -134 14 95 -54 -128 72
1880 72 107 -70 -96 40 92 -22 -95 23 137 33 -138 0 174 13 -184 -1 154 -18 -166 44 115 -46
1902 -46 -76 30 74 72 -20 -10 71 31 -66 -23 101 -2 -112 40 140 -63 -133 115 79 -139 -84 82 50 -89 -80 58
1928 58 79 -10 -66 27 130 -13 -144 13 165 -78 -143 67 97 -7 -44 56 76 -36 6 9 39 -1 -38 25 63 -38
1954 -38 -71 100 72 -91 -66 119 52 -130 -56 105 40 -78 -74 71 63 -93 -99 79 81 -66 -74 55 157 -44 -81 99
1980I9nj27k8J10k0o3J9P1l3p5M0P9m8r6M8J40q6j33J43Q7j41j09J26J18j25q1
2006i0P1J07n4j24J3J56Mj85L2J74k8j94R2J35r1q5J03N5r7k9N4J6m9rL1K7j1
2033B4j05Q9J07j11j06J05J28j38j06J33J04j38r8J46N5r7q8P7J14p5j03N7J06
2056H0l0j22N3J30j07q3J35L9p1r3J14M7j64J8J14K9j22nR4jj48M3J60Oj59l1
2082g4J22O2j70l0J54O0j81n6J83Oj18l8J19K7j08L2K4L2q0j0O8J9o1J1L9M9j30
2109d9j7J76m0j61M0J76o9j84Q2J41k6j62O3J36m9j24j2J39L7j50j7J47M3j70
2133e0k9J46J6j46kJ29l6r6M3J00r6j4O0M3k8r8L5J34l1j57O4J48n7j85J21J30
2159A44j38j12Q0J36q4j16O2J05m2j06K1J16nj54L9J31l8q8M7P2m4o3M7N3p2m8
$$ plain form
1980 99 94 -33 -61 49 29 -34 -15 56 23 -52 -12 67 19 -77 -29 111 25 -108 35 122 -19 -128 -2 116 -9 -90
2006 -90 -19 88 34 -90 -77 79 83 -102 -70 104 76 -118 -26 109 18 -67 36 91 -6 -35 19 35 -14 -23 8 35 24
2033 24 -81 8 115 4 -102 3 131 -7 -113 20 124 -14 -112 34 89 -8 -96 -19 95 20 -83 -26 80
2056 80 50 -72 -19 111 4 -79 56 95 24 -69 45 92 -72 -54 60 89 -33 -38 56 55 -93 -50 110 116 -43 -74
2082 -74 48 110 -60 -90 64 124 -57 -113 70 76 -42 -80 39 66 -42 -10 14 46 -34 -44 24 43 -18 -7 32 81 -49
2109 -49 -66 110 70 -91 -51 125 56 -128 -46 95 69 -93 -30 106 57 -67 -79 60 97 -53 -70 77 120 -50
2133 -50 -79 67 83 -63 -65 64 28 -68 -25 75 -21 -35 25 68 40 -58 -23 111 80 -77 -13 135 78 -107 14 144
2159 144 6 -106 -26 110 26 -90 -28 77 35 -71 -50 66 61 -93 -54 77 39 -49 -2 70 26 -37 10 63 -9 -57
2185e7O1M6m6p9O2J07r4r6J32Q5j54n0J53N8j22j06J07Q4q4q5N3J05o9j19N4J62
2211A08j19p6P2P8n5r5J07K8q2k8Q8rp5K1N7L7q3n0J13J6r4n0J60N6j75q1K02
2238G1J2j15o7J56O0j70k7J05M3n7r6J06L5n9n7M6Q8j17k3M7Q9j12k8J06J2q9
2264d1K0Q1k3q7MJ32l6j17K0J20Pj43j4J59oj33jJ42Rj58nJ32L0j15j4R0Nj26
2292f8K9J01n3m0K4O6m1j00L2R8k5p6M9Q8o1j07P0J07n6j23N5J50j07r2N8J15
2318I3o2j14P8P9l5q6J5R6j2j14J9J09pr8J8R6n9q7P1O6q3n9Q3J8l6k8N1L1n9
2347a6o0N0R6m6j22J10J02j23j00J41P6j00r3J03P0p9r4Q4O5j8j12N2R0p1m4O5
2373B6J5m4m6Q3L2j07mQ4mq4mQ0N4j37mJ10Jj03j7J12M6j24l3J05M1r2n4Q6P4
$$ plain form
2185 -57 4 50 4 -75 -13 94 0 -96 36 121 -33 -83 70 128 6 -100 7 91 7 -78 -25 80 11 -108 -54 108
2211 108 -11 -87 -15 63 8 -87 20 48 -34 -62 26 17 -58 -37 20 57 -26 -76 37 53 -41 -91 69 125 -50 -131 71
2238 71 83 -32 -99 57 117 -53 -80 25 68 11 -85 21 56 -3 -60 -14 74 -43 -66 -19 70 -42 -70 36 48 -41
2264 -41 -21 60 37 -50 -46 86 50 -67 -47 73 80 -63 -77 82 76 -57 -58 84 93 -65 -70 62 92 -23 -37 53 58 -68
2292 -68 -39 62 9 -31 -7 59 18 -82 -50 48 23 -53 -4 84 23 -84 -14 93 37 -86 -31 119 12 -80 -22 93
2318 93 31 -83 -5 74 39 -47 -32 64 52 -62 -43 66 59 -39 -21 75 16 -71 0 66 -17 -76 7 25 -11 -39 12 43 -16
2347 -16 -76 -26 70 24 -98 12 114 -9 -109 32 108 8 -85 18 88 9 -85 -1 64 46 -66 -14 76 5 -39 26
2373 26 41 -3 -49 34 66 -41 -45 39 35 -49 -53 27 81 -56 -60 50 51 -52 -69 43 89 -35 -68 37 78 -14 -68 18 92
2402I2p7q7P2J16j22m0N2L9o1n2J00J1j02L1Q0k1p0QP7l5m2j1P2M5j49J7J06P
2430E6j30k3J82j5j35j7J33J4j14K3O0K8p0j7N3L8o5l7Q0Pq3j6R7%j09J2Q3op1
2459d2N0N5o0o3K2R0nq9K7R1l1r7KJ16m0q9L2R3m2j00M9R2n2o4M8L4J7q4L3L7
2489C0rq3M7N8k3q2O5O1p1n6L3R7o6m9Q4Mp2l2P0O6o1r9J14J6n1n2O3O4l4j30
2519i8O6P9k2p6M4N0l4l5J7O8m5n9O6J2m0m1P4L8r7j2Q9J1j10NN7M1m7p6N8P7
2549F0n7r0R4P0q8n5P3Q6j11k0N5K8n6l2O7Qk1m3P8lm3l9J02m2q1K0O5K6q0K1
2579hO0kp7PQ2j8p1j5O7M4j21PJ04l1p8J3N1M3p5j9O4K0n7l1O0K5p6lR3l5n1K3
2611eM9l4m9M3O7n2n4M8M2k4o7K7Q3k0j00qJ14j8j11K2J36j06p5O1N9Jn9j6L4
$$ plain form
2402 92 15 -72 0 116 -6 -46 6 45 -16 -68 32 43 -59 -28 52 31 -39 -31 46 11 -31 -42 30 75 -74 -57 49 56
2430 56 -74 -97 85 70 -65 -82 51 65 -49 -26 34 62 -8 -25 28 66 1 -36 44 51 -32 -48 49 49 -60 -48 35 29 -42
2459 -42 8 63 3 -60 -38 52 47 -42 -15 76 45 -52 -50 66 26 -63 -31 62 20 -80 -31 61 9 -55 -7 27 44 -40 -7 30
2489 30 21 -62 -15 43 20 -62 3 64 -7 -63 -30 67 1 -48 36 40 -32 -64 6 72 11 -88 26 42 -9 -61 2 66 32 -98
2519 -98 -32 47 25 -51 -7 43 9 -26 -9 59 14 -45 21 33 -7 -48 26 64 -33 -45 44 55 -55 -50 7 48 1 -75 -17 60
2549 60 3 -87 7 77 -11 -66 7 93 -18 -38 17 45 -11 -43 24 32 11 -32 46 43 0 -39 63 21 -60 -40 25 51 -29 -8
2579 -8 52 50 -27 -20 62 44 -27 -42 25 69 -52 -45 59 28 -50 -37 14 57 -18 -37 27 47 -10 -41 19 44 -32 -35 58 23 -28 -5
2611 -5 44 10 -39 4 71 19 -35 13 55 31 -36 -9 74 54 -46 -54 60 42 -69 -47 89 -17 -92 -31 28 29 -30 -46 -12
2640a2P2j04K3N3k0n5K1P6l0p2L6O8n8j8P3j0m8l1M9K7j8m5L1Q2o9o9J4J07m4
2669B9j16O3J13r6n3P6J1l9m0L0L4pmj5M9k4m1K9Q4n3p6R6Qo1m5R7K1j06K2N2
2699C8J0n6m2M5M9o5m3P2M5m9m0N1P0j05l4Q1J6l6o3Q1k4m2mK3O1m4o1R3J3n7
2729a7j6O7Km6k0Q0j1r2K3R2k7q4K2L0O8o6k4M1L0o6m5P3K2o7nQ8mr3L8K0L0l4
2761In8M6J5Km5P8k5k7j7N9j7p4L0Q6j5p9L4Q0l8q4L8N3k7m1j0N8J8r2JN8M1r0
2793c3NO3j6l6oO6n0j3M0Qj5m4lO9k4o7O7K5k6m0M7M7l7l4nN5pp6L3Q8n6p7K0
2826c2P9k6m8J5O2o0m6N5K2k5j4j1O5n3J8jL1j8n7M1L3k3m5L6N3o8m4M5P5p9l4
2857e4P7K4k7o4L8O2rj12N1N9l6m3N0L1k6k5K2J0n8j2M2Qj1mQJ1l7k6P8pm1m3
$$ plain form
2640 -12 60 -44 -21 32 12 -43 -22 54 24 -48 -12 56 -2 -20 53 43 -5 -36 13 40 22 -23 8 90 21 -48 -34 73 29
2669 29 -87 -24 89 -7 -60 16 27 -12 -52 -22 12 5 1 -14 35 11 -30 -1 83 30 -46 50 58 -3 -48 49 70 -36 -14 38
2699 38 48 -8 -50 -5 44 -21 -64 8 53 4 -36 15 85 -20 -54 27 43 7 -56 25 1 -41 -45 -22 39 -5 -66 27 40 -17
2729 -17 -33 34 36 -10 -30 50 39 -53 -30 62 35 -49 -27 3 71 5 -19 22 52 -14 -59 14 36 -31 -36 52 48 -45 -7 13 43 9
2761 9 -49 -3 12 14 -31 47 22 -5 -22 37 20 -54 -24 62 47 -32 2 82 44 -40 -2 51 24 -17 -27 31 49 -43 -42 16 57 -33
2793 -33 -28 35 19 -17 -23 43 -7 -20 20 28 13 -31 -34 35 11 -56 11 36 10 -30 17 64 27 -7 -12 43 36 -40 -7 81 25 -52 -32
2826 -32 47 21 -27 -12 50 -10 -56 -1 21 -4 -18 -29 36 -17 1 0 31 13 -44 -3 30 7 -38 -2 51 -17 -61 -16 59 -20 -54
2857 -54 23 47 20 -44 -6 56 47 -65 -14 45 9 -34 16 47 21 -4 18 28 -30 -42 0 8 -3 -7 1 12 -25 -51 27 20 -21 -64
2889f4J05K6j03K0M9J5r0QL6L7m3j7K0L8j3p3J14Mq4j4L0L5m6oM7kj3m3J1K3j4
2920gqL9om6k1O1Rm6pQ1J2j05L4L1Jn8NL4K0m7RL1J5m6l3O6O6r5j6O6j8j6j2M6
2954C9J4o3j3M2j8j0NJM3q5K3O9j1q5lQ1l9k9J8L1K2m2k9O6k3pk4P1Mo6j0P4J3
2987E9p2j7L3J2l3kN1Qj06P1RNk6J7L8o3l2L6N5l3o5K4N7Jr6O3N4k2n3J2L2j8
3019alrQ9m9p5L7O0l2l7M0L0n0k8K1N6m7j2QL5l8k6J6M1j7n6P1K8m6n6L1O6o4
3051a7k4K5N0o4j3J6O3k6o9N9L0Ml8j3L5J1l8J5J1KqJ2K2k8j9JL2ko2N9ql0OM4
3085C8J1m0m6O2L5p3k9O4J9m0l5N3mk0j6j7J03r6kK9J1ll4J8O8n3lK3J9p7L9J4
3117A8Kk4j7M7j5m7K2J9J9m4oN1j5m5K6N4j3p2J0O2j3k7k9O1j5j3nJ7km6J7L7
$$ plain form
2889 -64 41 67 -36 -16 33 48 -42 -34 2 39 -4 -21 -1 37 24 -49 65 69 -15 -29 1 36 -10 -16 31 29 16 -27 -16 7 -7
2920 -7 -15 24 18 -28 -49 12 21 -25 -32 49 61 -44 -10 21 22 -36 -31 3 23 -24 -15 16 31 -15 -48 18 84 -11 -27 39 21 5 -7 39
2954 39 53 -10 -23 19 1 -9 -4 -3 40 -45 -22 47 36 -49 -52 29 -10 -39 -21 10 32 -10 -39 27 4 -3 -27 44 48 -18 -28 46 59
2987 59 -13 -30 3 15 -18 -20 31 39 -67 4 13 18 -8 9 47 -16 -48 -12 43 10 -55 -31 26 27 -69 -6 48 26 -27 -15 17 -1
3019 -1 -4 -13 76 27 -48 -11 49 17 -20 20 50 0 -28 -7 49 2 -10 -2 33 -5 -31 -15 26 9 -47 24 52 6 -50 -19 47 -17
3051 -17 -41 -16 34 -30 -43 -27 36 10 -59 0 30 34 -4 -17 18 29 -9 6 17 19 11 23 45 17 -2 -1 31 29 -33 26 18 -12 -6 38
3085 38 49 9 -37 25 60 -13 -42 22 41 1 -34 19 15 -5 -21 -38 65 -31 -33 -4 7 4 -30 -12 56 3 0 23 42 -35 4 18
3117 18 20 -4 -21 26 11 -36 -14 5 24 -20 -26 25 10 -35 -9 45 32 -40 -30 32 19 -8 -37 24 9 -4 -9 8 6 -40 -23 14
3149A4qj9ON5Kp9K2L6l5l6M4L1k2j1k1P3k0m9k0Q2n8qRJ4J6m5nN9Ko2qL8Prk7
3184c2RM5o3M0RK7o8M3Jk5nN8k4jk2LL4k4m1M7L4l8n9O2K2l9m1O8Rm5l4M8M5k2
3218B1l3%k4N7l5%L5k2m6L7K2JpJ9K4n8%K9J2m4MK5Ok7jL1K0o8j2K1L1k0n3N6
3252AJ3l9QJ1K0rm4MQ0k5l2L7Mm7l4O9nm2LL4j2k4K3J7j5J0j0K6Pl5nM7l1nj7
3287a7K7N1n4j9N1j8k5l3L2K1jm5QL1l1JJ9Oj3lJ5K5n4%J8j6L7k1M8m5l0O3j6
3320A2J1n2J9M9l2k8OK9Qk3j0%N9l0m0N8l9%nRLj6qMJ1l5J8J6Jj2NK8j4l3K6K5
3356B0j7rJ7K4k3l0K1j%j9j8O9l0Nj8L4Jk6Qj1J1j0J5j0Qj8K1L5p6j1M2j5k8K2
3390a7j2L6m2J0K4J6On8K7oKj1J1L0L0n3L1Pj0j9J3j2nloJ0J1lk2NPj3RKK5l2
$$ plain form
3149 14 6 -13 -7 48 50 -29 -7 29 -6 -42 2 33 11 0 -21 52 32 -17 -37 45 -13 -21 -12 2 18 -27 -32 27 29 -33 -41 -3 4 -5 -32
3184 -32 -23 22 -41 -1 8 35 -33 10 11 -14 -19 39 15 14 -8 -5 29 5 -36 11 45 7 -52 10 32 -7 -48 20 29 -16 -50 -2 43 21
3218 21 -12 -12 -36 21 -14 -14 21 -1 -47 -10 12 13 6 25 49 -9 -9 20 32 -12 -8 17 23 -4 -5 26 46 -22 -34 -13 18 -2 -55 1
3252 1 14 -25 -17 -6 14 5 -39 -35 45 20 -12 25 29 -18 -52 17 12 -30 -27 7 -5 -29 -6 11 -4 6 -4 22 29 -6 -11 36 5 0 -17
3287 -17 10 61 7 -12 39 21 -4 -37 -5 16 15 -30 -22 9 -22 -21 -2 4 -9 -12 3 28 -26 -26 -8 -24 13 -8 40 -5 -35 28 12
3320 12 23 -29 -10 39 7 -21 -15 14 22 -1 -11 -11 48 18 -22 36 -3 -3 -8 1 4 -12 -20 -16 -5 -40 -22 -6 -5 -17 -12 16 2 -31 -5 20
3356 20 3 -6 11 35 12 -18 3 2 2 -17 -35 34 4 9 -9 25 26 0 8 -3 8 -2 13 3 11 -7 14 49 -27 -38 4 -11 -39 -17
3390 -17 -29 7 -35 -25 -1 15 21 -37 -10 -16 -14 -25 -14 16 46 -7 24 31 21 2 15 3 -2 -5 -11 -1 10 7 -15 -10 -3 -16 -7 -5 20 -12
3426a2J9K0m5k1K7J8n0mP3n0J8l1K9L3j8l6J4K4L3n0K5K9l4rJN3rl8K2m4kJ3j5
3459a7L8l3j3K8J3k8J7Ok2J1JjrnmjJ8rkJ1K3k2rK3J6m5OPL0l5lJ3JK7j2Pk2J9
3497B3j8j4RkPQJ6j2qlMj8K8l0K9o3K2M6m4J5j2L0k3L3p5Q2m2N3m2J2L3m1l1L6
3531Hj6qK4K5k4rK3l2%K2j1Qj1j7J0oK8k4K0j9L5j6k7L6Jl8j6M4j6plL9n0K9l8
3566c6N9lk2L7l5j4J9J4qJ0j0l8M4j8MlM6l0l2K8pk2RrK0j8k1K6L1k5oKj3N3k8
3601Dk8L3k3J2j5K7kOomJ1j8Rk1N2n5JK2M7k2m2J8qJ3kj1j7L3j6J8k2oJOJ2l0
3637b3K7J8l8pK4j4J2rj2L9oj2JMrjP%K7m6RQnJ2NK1k4JK5l5Rk3J7Pk8Nj2M7n3
3676c2OJ0OJ2l9K6rk3L8K4j5jk5J5J4j7jmJ5mLLKJ9m6L1L2n3J6j4J2K0k1pLk7
$$ plain form
3426 -12 7 27 -18 -39 -12 6 -44 -48 25 -25 -7 -38 -9 24 6 -30 -16 8 41 -9 16 45 11 2 3 56 47 9 31 -13 -15 -2 -17
3459 -17 21 -12 -25 3 16 -12 5 11 -11 0 1 0 -9 -14 -18 -19 -1 -10 -12 -1 22 0 -9 14 30 -15 -9 -2 28 -7 -10 3 4 31 19 26 4 23
3497 23 5 -9 0 -2 5 13 29 17 9 6 10 -8 20 -10 19 -44 -22 24 -20 -5 -17 13 -10 23 -52 30 -12 41 -1 11 44 3 -28 8
3531 8 -8 -16 8 33 9 0 23 -9 -9 13 2 10 -1 -18 -8 -14 14 -10 10 -9 26 10 -17 19 20 -18 -34 10 -6 -13 -16 23 -27 2 -36
3566 -36 23 20 -2 35 0 -14 5 19 11 21 11 -27 17 -1 3 0 46 16 -16 12 5 -17 -8 -17 3 -15 -36 -10 21 -4 -10 -8 -21 32 4
3601 4 -24 9 -14 -2 -17 10 8 14 8 4 15 -3 6 -15 37 -18 -17 5 52 30 -12 6 -2 11 9 -2 -19 14 -2 16 -6 -12 -11 -5 7 -23
3637 -23 4 22 -16 -23 1 -13 -1 -10 -22 17 11 -1 0 4 -5 -6 1 1 28 -18 -9 -1 -6 6 11 32 8 9 34 -1 8 -15 2 9 -19 -14 -26 21 -32
3676 -32 -26 -16 -10 2 -37 -11 -20 -43 -5 19 4 3 -22 -7 7 -10 -11 -15 0 -4 -1 2 4 23 -23 8 40 -13 3 -11 1 21 0 -7 -4 -31
3712c1J1L1j3LJ4k6J7j5k8M3JLj2j8J2J7jl1K9ok3K0MK4%j6pK1j8J4J4J7n7M4
3746C7rj9l5K4J8J8m8K7kk0nj4L3m7M3j0J5qk1pM4l6J1K4j7j7OJmM2l2K5rj9J1
3781@J1Lk0J0RJ7Nk1k2J8kRJ5k0k5J0J7j0M0m9j4OK4k1pRRj1L1pk3MJj5RM6l3
3818CJ0k9J4lL3l8NJ1J2j6k0L9mk9L1pk1k5M6k0K7qj2PmOk2RnjJj8K4j8K8j8m
3855a6PjJ3J9j9j9JK3j1jJ9j0j5kL6k2k9K3K6j7k7J1J4K5m5%K4mj1j2J4k3K9r
3889ik7Pj2J1K0J0l0J0K5%k6M2k2J1j1j4L4Lm0nM0rj2K6k9NK2m0L7k1qJJ4Ok3
3924a4j8K9MmpL0l1J8k8L1j9kJ2L3l7j9OK1j0j9J7J6L7p0L4oJ4l6M5k1k0L2k3
3957eK4m0M3k7OJ4k6kK0j5k7K5pK0kl2L4Rl2RK0k5j1K2K6l2j0rRJ7J4j3J9j2k1
$$ plain form
3712 -31 -20 11 -2 1 15 -11 6 -9 -37 6 7 10 -2 -20 -8 9 8 -23 6 0 -23 -3 1 25 25 9 2 23 5 19 33 50 -7 37
3746 37 28 9 -26 -2 16 34 -14 13 11 -9 -14 -28 5 -42 1 -9 6 -2 -23 -30 14 -22 -11 13 -4 -21 -15 -14 -18 24 -8 17 8 -11 0
3781 0 11 14 -6 4 13 30 35 14 -8 10 8 17 32 12 -13 -3 14 4 44 -5 -19 -13 11 -10 -17 -8 1 -10 21 14 -9 -5 -4 -19 -10 36 3
3818 3 13 -16 -2 -5 28 -10 -5 6 18 2 -18 21 17 -12 19 12 -9 -34 12 -8 19 11 -1 6 2 8 -14 -5 -10 -11 -10 -28 -4 -22 6 -12 -16
3855 -16 -9 -10 3 22 3 -16 -15 8 -3 -4 15 5 -10 -12 24 2 -27 -4 22 5 -22 -11 3 28 -17 -17 7 3 -8 -20 -6 -29 0 -9
3889 -9 -36 -29 -41 -30 -10 0 -30 -20 5 5 -21 21 -1 10 -1 -15 19 22 -18 -23 17 8 -4 22 -7 -2 20 -20 17 -4 -12 -11 3 9 -14
3924 -14 -32 -3 1 -3 -10 20 -11 7 -21 10 -9 -11 1 34 -3 -22 -16 5 -5 -24 -7 9 46 -24 10 4 18 -18 27 6 -14 18 -5
3957 -5 19 -21 22 -5 1 15 -11 -13 7 -8 -35 -10 -17 3 1 -31 3 12 -20 -11 9 -16 -27 -5 21 -11 -21 -30 -21 -4 10 -3 16 4 -17
3992a7QJ6%PPm0L4Mj0JqmJ9Lk3j5L4L6l9k6ljJ8l4N6j6l9LJ5J6J0l3L1Ll9L8j7
4029eK2J1m5L4pRJjjk0k2L7J8l9L4Kl4j4MJ7Lj0j4J7J7l3NL6j8m1K0M6km2rL1
4065Gj2l3M8K9k8k2L5k6M1m7K8J7l9rQK2k7kqL7j5kk0M9k7j6jJ7%m2L9j1pj8j4
4100d9N6Kk7J8J8J5l9J8%OMl3L4Mj7mj7K1rKK9k7MoJ9kj8JK4k0k0M5j6m1MJ9k2
4137b4L3l5PJ9l1m2Q1J0ml5K8J9k6k1K4Kmj9J7J8l0pL7K1l2pL3j4j0J9l9J1nN
4171amJ0j9k1L4L0j4n3L0J7j1ml0M2k6MJ9J4j1kJ6qm5L7pK4k8lJ3NKjJ4J8n3K8
4207A6Kj4%k0L7oj2m1N8K2p9L7J8j1k7k2L6K6l8j8M9m6N0m5J5L3k2k5J4K2m3K4
4239a0K1nj5L2Kk3j8ML2Jj0j5K4j6j0k8P1l5jJ4L7k7m6%J9j8jj3L8j4kL3m4K1
$$ plain form
3992 -17 -9 7 7 14 21 -19 15 19 9 10 2 -2 17 20 -3 -18 16 52 13 -13 -16 -17 1 -33 23 7 -32 -29 -14 2 12 -21 10 13 -26 12 -5
4029 -5 17 28 -17 17 10 19 20 19 18 -2 -24 13 31 -8 26 28 -6 -20 -16 1 4 -6 -20 -3 14 -19 -14 22 4 -37 -17 29 27 -15 -24 7
4065 7 -5 -38 10 39 11 -11 24 -2 39 -8 20 37 -2 -11 -3 19 -8 -10 -18 19 4 2 -18 31 4 -12 -13 4 4 -38 1 -10 -17 -35 -49
4100 -49 7 9 -18 0 18 33 -6 12 12 18 22 -11 23 27 10 6 -11 10 1 3 32 5 9 3 22 20 2 3 27 7 -13 32 16 -25 -21 -2 -24
4137 -24 9 -26 -19 0 -31 -73 8 18 14 -21 7 26 0 -21 3 5 1 -18 -1 17 -13 -20 17 38 6 -1 32 18 8 27 -12 -1 -6 -1
4171 -1 -5 5 -14 -35 -1 29 15 -38 -8 9 -2 -6 -36 6 -20 -16 3 17 6 4 20 12 -33 4 -3 21 -7 -10 3 8 10 9 23 41 -12 16
4207 16 18 4 4 -16 21 15 3 -38 20 42 -37 0 18 7 -20 -42 -6 20 -18 -36 13 -33 17 -28 -13 20 -2 -27 -13 9 -34 -10
4239 -10 11 6 -9 23 25 2 -16 -12 20 21 11 -4 20 4 -6 -34 37 2 1 15 52 25 -21 -21 -2 -20 -21 -34 4 -10 -12 21 -23 -2
4273bomK3k2k0J4%J3j2K8J5k4k0M6j7j3j4NK2nm0N6J2j6l5k2N0j8Nj4K8Kk1JJ3
4308Hm0NL7j5n0L7%L4l2nL6j6OJkJ4j3m0K6L0km2L6K7l4j7J4K5k8l8N7k7Mk1K6
4343AMpJ3Mj5klj0K3j3k5M7j0j1k5L9nJk5K6Pl8nM9K8l1qKPm1%K9J6k3MLNl9j9
4382d7L4lK5n1O0k4J0k2N8m9K1k8J8j6J7k2oM8k4j9K4mKj5J5L0l3l4K5N3l4k6
4414a7K5OJkJ1j7j8J1K9k3l0J7J2J3l6J2L2k6j9%K5j6L%L3k5nJ2K5k9j7J9NJ5
4448B6m5J9qJ3Kk6L0k3L3j9L3k0k6K2Kj6L2k7PKl8L6jj5J3j2J7%l5rK9j5k7O2
4482A6j7j4J8Rj2k4OJ5J2Lk7N9j9m3J0N%k1PL0rj8J9pL3k5mK%l0J4Rjk6K4lK1
4519A2k1Kjjk1rM9k9QJ5j0j7N4n1L2j3rmK7Ql5J5KkloNL3m8K2%mMk5K5K1m5L4
$$ plain form
4273 -2 -8 -12 11 -11 -31 -17 -17 -4 -16 12 27 3 -17 29 12 -1 -15 -10 12 7 -33 23 35 19 -16 -38 12 -6 -1 -15 13 15 -6 -5 8
4308 8 -32 -27 10 -5 -55 -18 -18 16 -16 -21 15 -1 5 6 4 18 5 -35 -9 21 19 -23 13 40 6 -11 3 28 0 -38 19 -8 -4 -25 1
4343 1 5 -2 11 15 0 -2 -5 -15 8 -5 -30 17 7 -4 -29 10 5 6 -19 7 14 -24 -29 20 48 17 9 11 18 -23 -23 6 22 -1 3 6 11 -28 -47
4382 -47 -13 -16 9 -42 18 -6 4 -18 40 -9 12 -16 2 -14 3 -19 -25 23 -1 -20 4 0 2 -13 2 32 -1 -35 -10 43 9 -17
4414 -17 8 14 15 13 24 7 -11 0 29 6 -24 -7 5 18 -18 -6 26 0 -19 -19 6 -10 -7 -7 26 1 -4 8 33 4 -13 6 11 26
4448 26 -19 0 -8 5 7 -19 11 -12 21 2 35 15 -11 11 13 -3 29 2 9 11 -27 9 8 -7 6 -6 11 11 -24 -33 -4 -19 -46 16
4482 16 -1 -15 3 12 0 -24 -18 -3 9 12 -15 44 25 -18 -8 -3 -3 -24 -17 13 4 -14 5 -2 31 6 2 4 4 -26 -12 -3 -4 -30 -6 -9 12
4519 12 -9 -7 -8 -9 -30 -39 10 -19 -11 4 -6 -23 31 -20 12 -1 -10 -14 13 21 -14 1 3 1 -2 -8 -3 30 -18 4 4 0 4 -21 4 25 -20 14
4557A4j6j2LKK9l7k1L0J7j9j0MK2J6m7PK1j0QnjJ1j6J7Pj5MlkLkJ1Pm8J8LK8m5
4595b7LJ3L5l5pPJ5k0K1qk0J1l2M9jk6L1l1J7K2j7J7jj3J2lnQJK1Ml7kMMql4N7
4633B5k3Mk8K6J0lj9mL1j9j2J7lm0J9J3pnOj4M1l2L6j2j1j3J2J5K0m7K7pK0l2
4667iQlk9J3J5J0j2rkM0j6nl0K9K9l6m6K5%J5Jj6OL3k1jj0OJ9%j6k2OM2pj2J8
4704A3K4j9j9K9k2j6pL3K1l1k9K3J1%j5prK3k1NKj8JK4%j3plQJ8lM4m1jMJ4L0
4741D6n6PJ8k3LK9j5qL2k7jOL0n3L9j2j4J5j1K1n0lJ8qJ7rj0L1j9j4KL7j0j7K
4776gJ6nl4L4Rk0j3K9Qmk6J6L2j5j7J0J7j9l3M5k7PJ6qj6L9l5j5K0j3j0j5P4m6
4810fk9N0j1l8K3J6j2k4L4j6qLJ4K4k1J5j7mnqK6Ql0MJ8PJ2k4j5K3j8J5k6L0j0
$$ plain form
4557 14 -2 -14 -11 -9 20 -17 -38 -8 9 -10 -20 -16 6 22 -25 -18 3 -7 1 -4 -5 6 -10 7 14 -1 3 0 -2 1 -1 10 17 -31 -13 -10 18 -27
4595 -27 -24 -11 24 -11 -18 -11 4 -16 5 -3 -23 -12 -44 5 4 -22 9 -22 -5 17 0 17 16 3 15 12 7 15 16 37 41 4 2 6 10 2 -32 25
4633 25 2 6 -22 4 14 11 -8 -12 19 0 -12 5 2 -38 -19 -6 -13 -18 -12 -26 15 -17 19 7 -4 -17 -5 10 30 -17 10 3 23 -9
4667 -9 -1 -4 -33 -20 -5 5 -7 -16 -18 22 6 1 -29 0 29 -7 -53 -28 -28 -13 -12 -28 -22 11 -10 -11 -21 -15 4 4 -12 -34 -28 14 7 -5 13
4704 13 37 18 -1 28 6 -10 -17 16 37 6 -23 0 11 11 -4 -11 -20 3 -18 -13 -11 -29 -28 -4 -4 -17 -24 -27 -19 -1 -4 40 -1 -2 2 16 46
4741 46 -10 -3 15 -8 -5 24 9 1 33 6 5 11 41 -12 27 15 1 16 5 26 -24 -27 -9 -17 0 -9 -19 12 -7 -21 -19 18 8 -9 -7
4776 -7 9 4 -30 4 13 -7 -20 9 17 13 -13 3 35 20 3 13 30 11 -22 23 -4 3 19 11 -5 34 -1 -16 4 -9 -19 -34 40 -6
4810 -6 -35 15 4 -34 -11 5 -7 -31 3 -13 -21 -18 -4 20 -1 14 -3 -7 -12 -20 6 14 -16 -12 6 13 25 1 -14 9 -9 6 -20 10 0
4845@j2j1%K7j3pM8j5m9L4J9j6k0LOJ0rlKJ8oJ3k5K2J6k2nL2m7lJ2jmJ3Nk0Oj3
4883a5J0jj1J5mKl3J6K4j1j0K9r%j3rN8m2JL0m0%JmL3m0L4k9N1k4k2Pk6N0k2J5
4919A1j3K8l9J9J1J3k9K0Pj6Jl8J2JOj3mK8lj6k%J5K4j4m0L1NrJ4j6J1l1QK2J1
4955A5K1m0J8J6kk5l1RJ3PJ9j0k5J9Pk2K3l2L0Nm2jJ3lQn%J7kK9m3Rk%R%k0OO
4994fNjkqJ3K7k9J4PKl9L2k4j5%K3J8j8%Klnj4K3J7Kl4J6K%%J2k4j7K4j8JKJ1
5033dJ6jl5OJ5J7MPj1k5L6j8LJ1mlqK%MJ4l3k7L4j4rQkMJ1j8qJ4J6oj4L5l8L5
5072A4jjk4j2LJ3qRJ3J6k5j5L4Qj2l0K5k3QJ0nJ3Nl0J0LOlj6J4k2MK1J3n9K3J
5109b0L8j5k5J2J4Ok1j0M9l0k6N0l0jJ0lLOnk5L9j7QMjl0K4OKl0J1j2K2rLMJ0
$$ plain form
4845 0 -12 -23 -23 4 -9 -16 32 17 -32 2 21 5 -15 -12 -6 4 -5 -8 -6 12 6 19 -6 16 32 10 5 37 -10 -13 -1 -2 -6 7 12 -8 -2 -15
4883 -15 -5 -6 -17 -2 -6 -4 -37 -21 3 -8 -18 11 2 2 -11 -20 38 -4 -3 27 -13 -13 -12 -16 17 -23 11 -18 33 9 -13 -6 -32 18 -4 11
4919 11 -2 26 -13 6 17 30 1 21 28 12 13 -25 -13 -12 -6 -19 -23 5 2 -14 -16 -16 -1 23 9 -31 0 5 -4 10 -6 5 -26 -18 4 15
4955 15 36 -4 14 30 28 3 -28 -19 -6 1 20 10 -15 4 11 -11 12 -20 10 15 -27 -28 -15 -18 -10 -15 -15 2 0 29 -14 -5 -7 -7 2 2 -18 -12 -6
4994 -6 -1 -2 -4 -12 1 28 -1 13 20 22 -17 15 -9 -24 -24 -1 17 -1 -1 1 -2 -7 -21 2 19 21 -13 3 5 5 5 17 -7 -24 0 -18 -17 -15 -4
5033 -4 12 11 -24 -18 -3 14 18 25 14 -11 25 7 10 21 17 14 6 8 8 12 26 -7 -34 0 -14 -23 -15 -17 -13 -2 -20 -28 -14 2 -4 -18 17 -21 14
5072 14 13 12 -12 -24 -21 -8 -16 -7 6 22 -3 -18 16 24 12 -18 7 -16 -8 2 -3 10 15 -15 -5 -2 4 1 -15 -1 -23 -19 2 15 -44 -21 -20
5109 -20 18 3 -22 -10 4 10 -11 -21 28 -2 -28 22 -8 -9 1 -2 1 7 2 -23 16 -1 7 11 10 -20 4 10 12 -18 -7 -19 3 -6 -3 1 11
5146A1jl7J1PJ1m2J4L0j5L1k7OjlQqj0oJ1NlKL9j7Kk1j%Nj7K3M0o4J4j0J0l4L7
5184@mJ2Kk6L6l5j7J1K8j1k2J1j2NK0rrM6j8%k1j0L1jJ7l0J2jj4K0Lj6RJ1j2L
5220IKj6j2kK5k2j1LPJ1k5QL5k0j5Jk7O7m2J7qK8Jk1kJ0%J9l5l8L6J3Rj0K2Mo
5257A5j3qJ3lk0JmK3k7MK3K8n4K7k7L2rqkJ5j6k0L1j3Nj3L0k6j2M5j8oRRl6O2
5293C7m4rK0pJj5N0k9jJ7j7J9j7j8J1j0rJ2J9qJ2k0l7J6J6k3K6J8Qj9qK0qk1N
5328a3K1jnKnJ0j7L5j0l5J9j1M4jo2M3l1J1j7K2J2l0JJ7lk0K0J5j1j7J1K4j2K
5362Hk4J8jpJ5Qk3QLLJ5l3K6oj1pJ1Pk3K7rK1k3k8J1QJ8l3L1j5jK1l4K5rk1J9
5399ej7K3%Lmr%%J0K2k3K1j3qj5J8Lk1J7J0LJ1l1j1L8j7k2K6J1m3M1j3Mlm3L5
$$ plain form
5146 11 10 -27 -16 -9 2 -40 -26 4 -11 20 -7 -1 -2 -5 3 -5 -15 -21 -10 -5 -8 -6 33 16 18 -3 -4 -4 1 -16 7 47 -17 -3 -13 -3 -37 0
5184 0 -4 8 10 -16 20 -15 -32 -21 7 -4 -26 -15 -27 -22 -2 -11 -20 26 8 8 -13 -23 8 7 24 -6 6 5 -9 11 14 -2 7 18 6 9
5220 9 11 -5 -17 -19 6 -16 -27 -24 -17 -6 -31 -23 12 -8 -23 -22 -49 18 -24 -7 -15 13 14 -7 -9 1 1 20 -15 -53 -17 -4 5 -5 17 21 15
5257 15 2 -6 7 4 -16 -15 -19 4 -23 -19 4 32 -22 5 -22 10 1 -7 -9 6 -10 -30 1 -12 -7 -20 10 -16 -28 17 -1 -7 2 11 -25 37
5293 37 -7 -16 4 -3 -2 -17 33 4 3 20 3 22 5 -13 -2 -12 -21 -9 10 2 14 -6 -43 -27 -11 -34 -8 10 18 -1 -9 11 3 -18 -13
5328 -13 8 7 2 4 -1 9 -8 27 17 -18 1 -10 34 33 -29 14 -17 -6 -23 -1 11 -19 -18 -1 -4 -24 -4 11 0 -17 -6 18 6 8
5362 8 -16 2 1 -6 9 17 -6 2 5 8 23 -10 16 10 -1 -8 3 10 -13 14 5 26 3 -25 -14 -6 12 -21 10 -5 -6 15 -19 6 -3 -24 -5
5399 -5 -22 1 1 4 0 -9 -9 -9 1 23 0 21 8 0 -15 3 6 -15 2 12 15 26 -5 -16 22 5 -17 9 20 -23 18 5 9 6 -37 -2
5435bMj6nRj3M3k4k9K8j6KJ6Rk3k2M3j9kj7M8k6j3K0K6k7kK0k2J6J8noj3JM%p
5472bj7KJ2J3k9POJ6l1K0j1j7lN1j1j8kj4L3j2j2K1l0J7j2L8Krk0KL1K2k9j2Q
5507A0pJ4k5K9j9j0J7J5m2J9J0J2l4kk8K6L4k3J2j8lLJ1j4j2oM3Kk5oJ0K7%j9
5541ANj1Oj3L1qpJ5k6mJ7j3K4pk4j0M4rrk8L0j0K2l7PK1j8OQk7l4L1K8j1rK4J
5578Fj1k5K9j6L6j9k4M4lk0jK8j0%j7J0lMj3J9kl1L1K4l0j1J0mrJj1N1l0l4K5
5613fqL1l5qL8k9L5j3K0j9Oj2QK1l8%L6l6J2Pj1nL1k7M1o6K4RK4l0j5L6J7n4K0
5648Dlj6J3kJ5Jk7J4J3J0om0J9LJ3%l0L2N%rK6n1J6pL3l9MM0k4k2J6LNj8LOoj
5687gJ1j8MOrmlK9l7nM4l3J2K0MQm4NK6j0J4prLkL8j2j5pJ4j0l6L6KRl1MK7j9
$$ plain form
5435 -2 2 -14 -19 -10 -23 20 -4 -33 -5 -21 -19 -3 6 -17 -39 4 -15 -17 -34 14 -12 -25 -5 21 -6 -8 12 -10 6 24 19 13 0 1 5 5 -2
5472 -2 -19 -17 -5 8 -21 -14 -8 8 -23 -3 -14 -31 -34 17 6 -12 -14 -28 5 -7 -19 2 -28 -11 -23 15 17 8 -12 -10 21 43 14 2 10
5507 10 3 17 -8 21 2 -8 9 24 -18 1 11 23 -11 -13 -41 -15 19 -4 8 -10 -13 -10 1 -13 -25 -31 12 14 -11 -17 -7 20 20 1
5541 1 6 -5 1 -12 19 11 4 19 -7 -11 6 -7 17 10 -14 -24 20 11 2 -26 4 -6 16 -21 -14 7 -11 -5 3 -24 -58 -27 1 -10 -19 5 6
5578 6 -5 -30 -1 -17 19 0 -24 20 17 -3 -4 24 14 14 -3 7 4 8 -5 14 12 -19 12 36 6 -5 5 1 -8 -7 -18 33 3 -31 -6
5613 -6 -14 17 -18 -26 12 -17 18 5 25 6 12 0 8 29 -9 -9 27 -9 3 10 -1 -6 25 -2 39 -27 -3 6 30 0 -15 21 38 -16 4
5648 4 1 -15 -2 -4 11 12 -15 -1 12 22 16 -24 -5 -2 11 11 -19 13 18 18 9 35 -16 0 -7 26 -13 -9 31 7 -15 1 4 9 -9 -6 0 -6 -7
5687 -7 4 -14 -10 -4 -13 -17 -20 9 -28 -33 11 -22 -10 10 14 22 -22 -17 9 -1 13 6 -3 0 -2 36 24 9 2 16 6 -30 6 8 17 -14 -10 17 -2
5726bPrJ0Kk2J4jK0l7j7L1J3l2rL4Nj9OmJ0pJpL0j1k3KLj4K2Qnj3KL6j2mk5L8
5765B1j7kj9J1J6k8K2joQk4J1K6j4k7L2kl0PJ6J1l4L4jJ3l3OL4m4L3j1J7m4J9
5799@L%j2K2Mj6K1m4L1J9m7J5nJ6J1l0J6J3k5J0Lj2j3K6qjorM3l6J1j9M7k6j6
5834a4K4l9M0k0J5j2K9j6LK6l4Nn3L3J4Nk4K4l5J7OJ9k8K0k2J9J7m6J0PJ6j5L2
5867B3k1%Nj6J1M4m5pNPNr%K2l7K5LMl5%L1oj8j7L5Nj9Qk6L3j2k5J1J8n4L4J2
5904fkLj9L3k0J3RL6l7k8J7RPl5K9%J1j3j3nK6l1qL8k6J0j4J6JMnqnM6l4J9j6
5941Bl4J7OqKJ9pmqJ8Lj7j1L1J5l7j2OL5J8l7M3k6L4n5kK0k7L1j5kK3o4J9KL2
5977A0k3oL5j4mnjPj4j0K0k1OK4Mj9J3KNj8J5mJ4l2j4L9L2m7JPjRNmj5mKmP%J2
$$ plain form
5726 -2 5 -4 6 8 -14 0 -1 19 -18 -35 -4 9 -23 -32 2 7 -12 -6 -10 0 -7 -6 -13 17 6 -17 -15 -12 -26 -4 4 -1 -14 -12 24 12 8 -17 21
5765 21 4 2 -17 -6 10 -18 4 3 -3 5 -19 -8 18 4 -23 9 7 -23 -16 0 11 -23 11 10 23 -10 -4 30 -14 19 8 25 -19 0
5799 0 3 3 -9 13 17 1 22 -22 9 28 -19 -4 -9 7 18 -12 4 17 -8 2 5 -7 -20 6 -2 -3 -9 -18 25 -11 0 -19 28 2 -14
5834 -14 10 -29 11 -9 6 -6 23 7 10 36 2 7 -46 -13 1 6 -18 6 -29 -12 -6 13 -15 5 -17 2 19 -27 -17 -10 6 -9 23
5867 23 2 2 7 -9 2 46 1 -6 -1 6 11 2 2 24 -13 12 15 19 -16 -16 15 9 -9 -26 9 14 -5 3 -23 10 -2 -27 -16 2 -52 -18 -6
5904 -6 -8 -5 -24 9 -11 2 11 47 10 -18 -1 8 15 -20 9 9 20 7 -6 -11 15 -16 -24 14 -12 -2 -16 0 1 5 0 -8 -13 33 -1 18 2
5941 2 -32 -15 -9 -17 -15 4 -3 -7 -15 3 6 -11 -22 9 24 -13 -25 -19 16 34 -3 40 14 48 -7 -9 11 -16 15 0 -2 21 -43 -24 -22 10
5977 10 -13 -19 16 2 -2 -7 -8 -1 -15 -25 -5 -26 -20 4 8 -11 2 4 9 -9 6 2 16 -16 -30 9 41 -6 -5 2 1 10 15 11 -4 -8 -6 -10 -3 -3 9
6018Ikk3NK5k1J4J3rmj0k2J9j4L3j9j2J9J8jm6M8Mm9OL3Jj9Rj5J6j2K0J2k4mJ3
6054A1oLNl4kL6k6OmK6k0J7j4J2j2JKj0j6PK6l5L0JJ1ol9J5M7k7j4J2Rj8J1J0
6090A5jRk2Pj7J3j%K2l5J5j0K6l6LrJ6Ql2K6K2k5J5JlrOj0L9p8K3K3qJ2j9L6o
6127A6j7k3J1PJ3k9L2j3oJ1rL4m1LJ6j9j2jN1k3J0k5oK7j2l9N8k1k7L7k3J9kK1
6161A8l0KNk4L8Oj1OpJ3j2k8L4J7k0mj1J2nK1J8l7Lk5L2k3nok4L2nJ4J4lk7LK8
6198Iknk0K0J0j5PKJ4nk7N6n0k3rO9k3J0pmoJ8j2nL3k8nK1J2k6olOlk1ML5k7l4
6237d0L3l0K0l2L9J6j0Oj2K5j9j2nMK2jQj3J1jj7NLJ1J4%k2LJ0NQk8k7L7j5RN
6274A0j4J3o2O3j3l1L3nnK2k4j1J0l0M4nkjJ1K0jj0j7K6n5M5J4qom5K0L6k6rK9
$$ plain form
6018 9 7 -16 -11 14 -7 7 20 11 7 -3 -25 -6 -20 13 -6 -18 1 19 18 -28 20 24 -25 -19 14 15 -4 5 -10 6 -6 14 26 2 -2 11
6054 11 5 8 13 -21 -23 13 -13 -7 -11 15 -5 12 -2 10 -2 -1 1 -9 -25 -18 8 -27 3 4 15 9 -30 -15 32 5 -9 3 12 -6 5 15
6090 15 14 23 1 8 -9 4 3 3 25 -10 5 -5 21 -15 -12 -21 -5 3 -29 -3 19 -6 9 10 7 -2 4 -6 33 -45 -22 1 -7 5 -14 22 16
6127 16 -1 -24 -13 -6 7 -22 10 -3 -9 2 -7 27 -14 -11 5 -14 -26 -27 24 1 11 -14 -20 7 -5 -44 14 -7 -34 3 -20 -1 -3 18
6161 18 -12 -10 -5 -29 9 15 4 10 3 16 4 -24 10 27 7 3 -8 4 -1 20 38 1 4 -21 11 -12 -17 -23 -47 -15 -20 -6 8 5 -22 -19 9
6198 9 7 2 -18 2 12 -3 4 6 20 15 -12 44 -6 -29 -38 31 8 18 11 7 1 19 7 2 35 7 2 23 35 9 3 0 6 3 -18 -14 21 -6 -40
6237 -40 -7 -37 -17 -49 -10 6 -4 2 -10 15 -4 -16 -21 -17 5 4 12 -1 10 9 -8 -3 0 11 25 25 3 6 16 21 29 1 -26 11 -4 5 10
6274 10 -4 9 -53 10 -3 -34 -1 -6 -11 11 -13 -24 -14 -44 0 -5 -7 -8 3 23 22 12 -5 21 -34 11 25 17 11 -34 -14 22 -4 -13 16
6309A6j2Jl7M5j8rJ1j6J9k2K8jjk2jl1N8qj3kJ2Kmk6K3Rj4K8KoQk7L5j0l2J4J0
6346IqjL5l7Nj5LrM4k7mK2l1PQjk3M7l8J6J6l2J9k0K5LQpj7nJ1J1j1j8PMJ1nJ5
6385A7Jjk8K9kk4J4J%m1K6%RKMj1Jj1K8k1J8j8J4m8M3rl3P2k4k5RP%k1kK0J7j3
6423@qJ7qJ3m6N0Ll3KK3l4K0j0K1k3k0L0Nj1kMK3l4J1rRk2PK9qQj6J0K5l7J7n
6460AK4j0j2J6k2J8j9QK1k2j7K3lJ2pJ1k1K5l0KK1m1K8Rj5jJ6j1kKrPK3n7J0K3
6496ARrk5J4j2L2qK5k1Oj0K5lk6rJM6qn2K5Ql4j0K1J4j4J5j6J5kj7k6M6k2J5j2
6532a8J5k7mN6l2pJ5mok7N8j9K3k1j6J2J0jj0J5%Ol7K3jK4j7nm7K7mK2J0k3Nl
6568hK6l5JQl3J8J3pJ9J0l3J0Qn2L6Q1m3%l1K5J0k8J6j6J8n7M9k1N3k9J2Pj1l5
$$ plain form
6309 16 4 5 -32 13 -5 -14 -3 -19 0 -22 6 5 4 -18 -19 -50 8 0 -13 -15 -3 -1 -5 -31 -8 1 -13 15 17 11 19 -8 27 17 -15 -1 9
6346 9 1 0 35 -2 3 -12 -9 -18 26 -1 -5 17 -14 -7 1 0 -23 24 -14 2 18 -14 5 -15 10 13 21 14 -3 -8 3 14 3 -15 -8 -4 7 2 17
6385 17 18 17 -11 18 16 -8 6 7 7 -34 -8 -8 1 3 7 -4 -3 -14 14 -7 11 -7 7 -41 2 -7 -40 32 8 -17 -8 -1 -1 -22 -24 -4 13 0
6423 0 -8 9 1 14 -32 18 21 -12 -10 13 -21 -1 -11 10 -13 -33 -3 2 -9 -11 -7 16 -18 -7 -16 -7 -29 -22 7 -1 7 -9 1 26 -11 6 1
6460 1 25 15 3 19 -3 15 -4 4 25 3 -14 9 6 18 11 22 1 26 -4 -2 19 -22 6 15 0 -1 15 4 2 4 -5 2 25 -32 -22 1
6496 1 10 1 -24 -10 -22 10 2 27 6 12 2 27 24 -2 -11 -10 36 28 -24 1 9 -25 -35 -14 0 -14 1 -15 0 -2 -19 -45 1 -21 -6 -18
6532 -18 -3 -30 -34 22 -10 -17 -2 -6 -12 -39 19 0 23 2 -14 -2 8 7 -3 12 12 18 -19 4 3 27 10 5 -42 -15 -19 3 13 -10 -5 -8
6568 -8 18 -17 -16 -8 -41 -23 -10 -17 2 12 -21 -11 -3 -55 -19 62 19 19 -12 13 23 -5 11 -5 13 -44 5 -16 37 8 20 27 16 -19
6602a9M1j1opjK0j7nl3J3K5J8l9L9m8J9K5j4j8J6RNj6k0J4K6j2J2j9J4j1j0J5
6635EMJ4k5j4nK5j7POPk8K2k8K4k1K0jkJKL0k5m5O1oj2k6MK5k4J7qJ3Rl6K4J8
6672A5Rj0k7MN1m0lL8o1K8N2o9K9k0KJ9k2l7J5L3j4J2l4L3l2JlNJ3%J6KpmLK9
6708B6j5j5k8M4Okm0M4l2j4J5K3k3J3J8mj3j2K2lk2K6j8kNj6K6lk5J8Plj5mLM0
6744B7j3k1j2RPjMJ3m3PK7%J5J2j1Kl1J6onKK8k9M3l5j6PKj2qJ0L4n4J9lM7j9
6781A2J5rjo3M8j8J0j1oJ5K4j6j4LQK1k1OkJqnK8j1jPk7lJ3J8k4k5J9OlK7m0%
6819b7%J9j1L5j9k6J4nK2l7K2nK6k1K2jk0mK4j8J6j6pL5k0oK2opOKj3kLoL3k2
6856BNKl7K7j0j2J6nJ1m%j0J5j8K1J2l8K8Lj8L0j1njj8J4J4Ll8J4K6moRp%lJL
$$ plain form
6602 -19 22 11 5 -2 -3 17 0 -5 -38 -25 0 18 -21 18 -30 -11 14 0 -18 -2 7 12 -4 -24 -10 16 4 16 -3 11 0 -10 5
6635 5 9 23 -2 -16 -21 4 -13 -6 0 7 -21 1 -27 -3 -24 -4 -5 -7 -6 -4 26 1 -44 17 11 -1 -27 -23 2 -22 -5 -13 0 9 -27 -3 15
6672 15 24 14 -13 -9 42 2 -1 37 -24 4 56 -13 16 -4 -2 17 -5 -42 -27 6 -8 4 -30 3 -29 -28 -31 -26 -13 -13 3 5 -2 -6 -3 26
6708 26 11 -4 -32 12 18 16 -24 20 -12 -26 -11 12 -11 2 20 16 3 -9 13 10 -12 14 -4 -6 -1 -17 9 6 -19 -1 6 3 -12 -16 -13 27
6744 27 14 -7 -19 -10 -3 -4 0 13 -30 -23 4 4 19 31 20 22 -9 7 1 -4 -2 26 -3 40 5 -11 -4 -2 -14 -22 -12 22 -32 -13 -16 31 12
6781 12 27 18 17 -46 2 -16 -6 -17 -23 -8 16 0 -14 -11 -3 18 -3 3 1 2 -6 -11 17 6 5 12 -15 -18 -5 13 -11 -36 -17 -11 -14 13 -27 -27
6819 -27 -27 -8 -19 16 -3 -29 -15 -20 2 -35 -13 -18 8 -13 9 8 -12 -16 8 -10 6 -10 -17 18 -2 -8 14 8 1 7 9 -4 -6 -3 -9 24 2
6856 2 7 9 -28 -1 -11 -23 -7 -12 -1 -5 -5 -15 0 -18 3 15 -23 5 8 -10 20 9 4 3 -15 -1 13 16 -22 -8 18 14 8 17 10 10 7 8 11
6895A1Rk5M8m2m8N4j6N7n6j2J6lj1k8M6K1rj1lK5l2J3K2k9J1k1J1K0l4mJ0Kj0
6928a8M7k2J8k7j9L7K4m2lPK5m1jJ6j4J6j1L3n1J3K1j4Lm3M9J3k3j9J3J4j0LJ5
6961Il1K3Nj0K1rk%ooJ6Rj4Jj7oL1Pk3MK1k6KJ6l1J8jOJ4k0J6Ml8nL5l1K0Roj1
7001flMmqN3l7Oj2L4j6kj7M9k1j4K3j5j6%MJ6pk1J8l3J4ORLk1K6l5jK4j0K0j0
7038@J3l6L9k3L7o3L4OKPJ0KNqm8M7j7qRJ0Mm1PJ1k4J8J7j3%rL9k2k7jJ1LJ8Q
7076A7l2L2j9k2K2l2M5l4K2K0k4J7j0mK3l5K5k2OK4k5K3l4M0Kj1r%JOj7J6Nj7
7110aj1K6k7QJ2jK1j2l7L4j3k5L5m0K7ookK9l4J7j1L8J2l6pL4qQnJ3j5j3jKQm1
7147b8J8K8j9lJ0j1lJ1J0l5J5j0jM0lk5jK7k6L2k0qj2Jj4K9j4K2MMl6LM2lRl6
$$ plain form
6895 11 20 -5 43 1 -47 7 -9 48 -8 -20 -4 -7 -18 -46 0 21 12 1 -2 23 -9 4 26 -3 8 -13 -2 18 -16 -20 -10 -8 -18
6928 -18 29 7 25 -2 -21 16 40 -2 -5 2 27 -14 -15 1 -13 3 -8 25 -26 -13 8 -6 -3 -46 3 16 -7 -26 -13 1 -9 -6 9
6961 9 -22 1 6 -4 17 8 6 6 0 -6 10 19 5 6 -11 -17 14 21 -2 2 23 -3 -1 15 -16 2 1 7 21 1 17 21 -17 -22 13 -18 2 11 5 -6
7001 -6 -9 -5 -9 -17 36 -1 5 -7 27 11 9 -8 41 20 6 29 14 -2 -2 2 18 11 -10 8 -25 -11 -5 4 7 -14 12 -23 -24 0 -10 10 0
7038 0 13 -23 16 -7 30 -33 1 7 9 16 26 28 33 25 -23 24 7 -1 8 18 22 -19 -12 -1 -25 -7 10 -3 -3 -12 27 5 -22 -23 -12 -9 9 17
7076 17 -15 17 -2 -24 -2 -34 11 -23 -1 19 -5 12 2 -2 21 -14 11 -11 -5 19 -6 17 -17 23 25 14 5 5 6 12 -5 11 16 -1
7110 -1 -12 14 -13 -5 7 6 27 15 -22 12 -1 -26 9 -31 -4 -10 -16 -18 11 -23 -6 -17 21 33 -3 -10 24 16 24 19 32 17 4 3 5 13 -28
7147 -28 -10 18 -1 -4 6 -5 -8 3 13 -22 -7 -17 -18 22 19 -6 -7 20 -6 26 6 -2 -14 -13 -27 2 -12 10 14 18 -18 -15 27 24 33 -3
7183cOJ0J5k5qK8qj7JMk3L7j8lJ4j9K1J7l5rK9J6l6qoK9j1LJ5l4J4mK4oJ1l4R
7220dKL0jJm6L3k9J1L2k2Rj2L4j3j0k1K1rj2J1k5L2l4mOk4P2k7j3J0MK0l9K0J1
7255A4kj2l5K9J0L1k8LJ1pk4lK2K3l4oK3j3Kk0J9rj1K2j4J1j7mM7j4j8jk1L0l
7290Aj9NJNJj5J8Nl7K2J9J1m4L3K6m2lJ8%j1j5L5k6j2J2K9npkJ6nL2p6N9j5j5
7326apQk5J9LpJ8Mj7J7Kn0M0k3L5j3k6L5Lmk6QOJ5j5K9j4JJ1k9J9oJ4j9oQj2J5
7364A0k6nJ7kJ3nj0jK5l5JJ6J2koRj6J5Jj3jjJ6Pk9pj0K5J7j7j4J3Rl8M3j1j7
7401a7lK0J6m9mK2J5jQk0K4n1K2J4J4l8J5lPjk2O1j0n0K9QrRK0j6k7M2l2J1J4
7436A8j9j3K6k2J1k3K7j0J0k8J9jk2K2j9L2j7J1kK3k7rL5j6k0K1k5K3l7J3L1l
$$ plain form
7183 -3 3 13 28 3 -5 23 15 -2 -1 3 -20 17 -1 -4 10 -9 12 29 -6 -15 14 30 -6 -14 -20 9 -2 1 16 -18 -4 -8 16 10 21 -13 -4
7220 -4 -2 28 27 28 -18 15 -14 -3 29 7 16 4 38 25 15 -6 15 6 -6 5 -20 12 -22 -26 -20 -44 28 1 -12 -2 2 22 -17 3 14
7255 14 12 0 -35 -6 4 35 7 10 21 14 -10 -13 9 32 -2 -8 15 2 4 -16 3 -6 -17 5 -9 2 -15 -19 28 14 -4 -5 -26 4 1
7290 1 -18 -13 -12 -7 -6 -21 -3 2 -35 -13 6 17 -27 6 32 -10 -13 5 5 -6 -21 14 -12 -24 -12 17 12 5 3 19 14 46 -30 29 14 -1
7326 -1 -8 0 -25 -6 -3 -10 8 12 -5 12 14 -36 4 -19 16 3 -23 12 15 11 -15 -7 -1 14 -1 28 14 15 26 -3 16 10 24 5 -1 7 -5 10
7364 10 -16 -21 -4 -6 7 2 -8 -9 16 -19 -18 -2 10 8 2 11 -5 10 11 -2 -3 -4 12 19 -10 -17 -27 -2 15 -2 -16 -3 6 -32 11 0 -17
7401 -17 -20 0 16 -33 -37 -15 0 -1 7 -13 11 -40 -18 -4 10 -28 -13 -16 -9 -10 -32 29 19 -31 -2 6 -3 6 26 10 -17 25 -7 4 18
7436 18 -1 -14 12 -10 1 -22 5 -5 5 -23 -4 -5 -27 -5 -24 8 -9 2 0 23 -4 -13 22 6 -14 7 -18 5 -32 -19 12 9
$$ [...]
8191B6
##END NTUPLES=NMR FID
##END=
