##TITLE=1H_EtOH
 
 8 sc, 
 1.4.2024
##JCAMPDX= 6.0         $$ Bruker NMR JCAMP-DX V2.0
##DATA TYPE= NMR FID
##DATA CLASS= NTUPLES
##ORIGIN= UXNMR, Bruker Analytische Messtechnik GmbH
##OWNER= root
$$ XWIN-NMR		Version 3.5
$$ Mon Apr  1 16:32:26 2024 Russian Standard Time (UT+4h)  she@DPX200
##.OBSERVE FREQUENCY= 200.1311
##.OBSERVE NUCLEUS= ^1H
##.DELAY= (6, 6)
##.ACQUISITION MODE= SIMULTANEOUS
##.ACQUISITION SCHEME= undefined
##.AVERAGES= 8
##.DIGITISER RES= 18
##SPECTROMETER/DATA SYSTEM= spect
##.PULSE SEQUENCE= zg30
##.SOLVENT NAME= D2O
##.SHIFT REFERENCE= (INTERNAL, D2O, 0, 15.7039)
##AUDIT TRAIL= $$ (NUMBER, WHEN, WHO, WHERE, WHAT)
$$ ##TITLE= Audit trail, XWIN-NMR		Version 3.5
$$ ##JCAMPDX= 5.01
$$ ##ORIGIN= Bruker BioSpin GmbH
$$ ##OWNER= she
$$ F:/spectra/data/she/nmr/H-F/1/audita.txt
$$ ##AUDIT TRAIL=  $$ (NUMBER, WHEN, WHO, WHERE, WHAT)
(   1,<2024-04-01 16:30:40.35 +0400>,<she>,<DPX200>,
      <created by zg, POWCHK disabled, PULCHK disabled
       configuration hash MD5:
       00 E9 B6 7A A2 85 ED C7 34 08 36 98 17 FE 4E 26
       data hash MD5: 16K
       71 A7 1E D7 63 EB AC 0E E3 49 38 3D 84 CB 45 3E>)
$$ ##END=
$$ 
$$ hash MD5
$$ D7 25 43 01 D4 25 D7 63 2D DD BB 8B AF BB 76 8A
##$RELAX= 
##$RELAX= 
##$RELAX= 
##$RELAX= 
##$RELAX= 
##$RELAX= 
$$ Bruker specific parameters
$$ --------------------------
##$DU= <F:/spectra>
##$EXPNO= 1
##$NAME= <H-F>
##$PROCNO= 1
##$TYPE= <nmr>
##$USER= <she>
##$AMP= (0..31)
100 100 100 100 100 100 100 100 100 100 100 100 100 100 100 100 100 100 
100 100 100 100 100 100 100 100 100 100 100 100 100 100 
##$AQSEQ= 0
##$AQ_mod= 1
##$AUNM= <au_zg>
##$AUTOPOS= <>
##$BF1= 200.13
##$BF2= 200.13
##$BF3= 200.13
##$BF4= 200.13
##$BF5= 200.13
##$BF6= 200.13
##$BF7= 200.13
##$BF8= 200.13
##$BYTORDA= 1
##$CFDGTYP= 0
##$CFRGTYP= 5
##$CHEMSTR= <none>
##$CNST= (0..31)
1 1 145 1 1 1 1 1 1 1 1 1 1 1 1 1 1 1 1 1 1 1 1 1 1 1 1 1 1 1 1 1 
##$CPDPRG= <>
##$CPDPRG1= <>
##$CPDPRG2= <>
##$CPDPRG3= <>
##$CPDPRG4= <mlev>
##$CPDPRG5= <mlev>
##$CPDPRG6= <mlev>
##$CPDPRG7= <mlev>
##$CPDPRG8= <mlev>
##$CPDPRGB= <>
##$CPDPRGT= <>
##$D= (0..31)
0 1.2 0 0 0 0 0 0 0 0.06 0 0.03 0 0 0 0 0.0002 0 0 0 0 0 0 0 0 0 0 0 0 
0 0 0 
##$DATE= 1711974639
##$DBL= (0..7)
120 120 120 120 120 120 120 120 
##$DBP= (0..7)
150 150 150 150 150 150 150 150 
##$DBP07= 0
##$DBPNAM0= <>
##$DBPNAM1= <>
##$DBPNAM2= <>
##$DBPNAM3= <>
##$DBPNAM4= <>
##$DBPNAM5= <>
##$DBPNAM6= <>
##$DBPNAM7= <>
##$DBPOAL= (0..7)
0.5 0.5 0.5 0.5 0.5 0.5 0.5 0.5 
##$DBPOFFS= (0..7)
0 0 0 0 0 0 0 0 
##$DE= 6
##$DECBNUC= <off>
##$DECIM= 32
##$DECNUC= <off>
##$DECSTAT= 4
##$DIGMOD= 1
##$DIGTYP= 9
##$DL= (0..7)
0 120 120 120 120 120 120 120 
##$DP= (0..7)
150 150 150 150 150 150 150 150 
##$DP07= 0
##$DPNAME0= <>
##$DPNAME1= <>
##$DPNAME2= <>
##$DPNAME3= <>
##$DPNAME4= <>
##$DPNAME5= <>
##$DPNAME6= <>
##$DPNAME7= <>
##$DPOAL= (0..7)
0.5 0.5 0.5 0.5 0.5 0.5 0.5 0.5 
##$DPOFFS= (0..7)
0 0 0 0 0 0 0 0 
##$DQDMODE= 0
##$DR= 18
##$DS= 0
##$DSLIST= <SSSSSSSSSSSSSSS>
##$DSPFIRM= 0
$$ [...]
##$SUBNAM2= <"">
##$SUBNAM3= <"">
##$SUBNAM4= <"">
##$SUBNAM5= <"">
##$SUBNAM6= <"">
##$SUBNAM7= <"">
##$SUBNAM8= <"">
##$SUBNAM9= <"">
##$SW= 18.051750892319
##$SWIBOX= (0..15)
0 0 2 0 0 0 0 0 0 0 0 0 0 0 0 0 
##$SW_h= 3612.71676300578
##$TD= 16384
##$TD0= 1
##$TE= 0
##$TE2= 300
##$TE3= 300
##$TEG= 300
##$TL= (0..7)
0 120 120 120 120 120 120 120 
##$TP= (0..7)
150 150 150 150 150 150 150 150 
##$TP07= 0
##$TPNAME0= <>
##$TPNAME1= <>
##$TPNAME2= <>
##$TPNAME3= <>
##$TPNAME4= <>
##$TPNAME5= <>
##$TPNAME6= <>
##$TPNAME7= <>
##$TPOAL= (0..7)
0.5 0.5 0.5 0.5 0.5 0.5 0.5 0.5 
##$TPOFFS= (0..7)
0 0 0 0 0 0 0 0 
##$TUNHIN= 0
##$TUNHOUT= 0
##$TUNXOUT= 0
##$USERA1= <user>
##$USERA2= <user>
##$USERA3= <user>
##$USERA4= <user>
##$USERA5= <user>
##$V9= 5
##$VALIST= <valist>
##$VCLIST= <CCCCCCCCCCCCCCC>
##$VD= 0
##$VDLIST= <DDDDDDDDDDDDDDD>
##$VPLIST= <PPPPPPPPPPPPPPP>
##$VTLIST= <TTTTTTTTTTTTTTT>
##$WBST= 1024
##$WBSW= 4
##$XGAIN= (0..3)
0 0 0 0 
##$XL= 0
##$YL= 0
##$YMAX_a= 274424
##$YMIN_a= -236855
##$ZGOPTNS= <>
##$ZL1= 120
##$ZL2= 120
##$ZL3= 120
##$ZL4= 120
##$ABSF1= 10
##$ABSF2= 0
##$ABSG= 5
##$ABSL= 3
##$ALPHA= 0
##$AQORDER= 0
##$ASSFAC= 0
##$ASSFACI= 0
##$ASSFACX= 0
##$ASSWID= 0
##$AUNMP= <proc_1d>
##$AZFE= 0.1
##$AZFW= 0.1
##$BCFW= 1
##$BC_mod= 2
##$BYTORDP= 1
##$COROFFS= 0
##$CY= 11.3945322036743
##$DATMOD= 1
##$DC= 2
##$DFILT= <>
##$DTYPP= 0
##$F1P= 15.7292609196834
##$F2P= 12.9074282941183
##$FCOR= 0.5
##$FTSIZE= 0
##$FT_mod= 4
##$GAMMA= 1
##$GB= 0.15
##$INTBC= 1
##$INTSCL= 1
##$ISEN= 128
##$LB= 0.24
##$LEV0= 0
##$LPBIN= 0
##$MAXI= 10000
##$MC2= 0
##$MEAN= 0
##$ME_mod= 0
##$MI= 1.114404
##$NCOEF= 0
##$NC_proc= 0
##$NLEV= 6
##$NOISF1= 3.799351
##$NOISF2= 2.8
##$NSP= 1
##$NTH_PI= 0
##$NZP= 0
##$OFFSET= 15.70392
##$PC= 1
##$PHC0= -25377.8
##$PHC1= 8.587309
##$PH_mod= 1
##$PKNL= yes
##$PPARMOD= 0
##$PSCAL= 0
##$PSIGN= 0
##$REVERSE= no
##$SF= 200.130013532006
##$SI= 16384
##$SIGF1= 3
##$SIGF2= 2
##$SINO= 400
##$SIOLD= 16384
##$SREGLST= <1H.CDCl3>
##$SSB= 0
##$STSI= 0
##$STSR= 0
##$SW_p= 3612.71676300578
##$SYMM= 0
##$S_DEV= 0
##$TDeff= 0
##$TDoff= 0
##$TI= <>
##$TILT= no
##$TM1= 0
##$TM2= 0
##$TOPLEV= 0
##$USERP1= <user>
##$USERP2= <user>
##$USERP3= <user>
##$USERP4= <user>
##$USERP5= <user>
##$WDW= 1
##$XDIM= 8192
##$YMAX_p= 0
##$YMIN_p= 0
$$ End of Bruker specific parameters
$$ ---------------------------------
##NTUPLES= NMR FID
##VAR_NAME=  TIME,          FID/REAL,        FID/IMAG
##SYMBOL=    X,             R,               I
##VAR_TYPE=  INDEPENDENT,   DEPENDENT,       DEPENDENT
##VAR_FORM=  AFFN,          ASDF,            ASDF
##VAR_DIM=   8192,          8192,            8192
##UNITS=     SECONDS,       ARBITRARY UNITS, ARBITRARY UNITS
##FACTOR=    0.0002768,     1,               1
##FIRST=     0,             0,               0
##LAST=      2.2672688,     0,               0
##MIN=       0,             -236855,         0
##MAX=       2.2672688,     274424,          0
$$ Real data points
##PAGE= N=1
##DATA TABLE= (X++(R..R)), XYDATA
0 0 0 0 0 0 0 0 0 0 0 0 8 -8 8 -8 16 -16 17 -24 32 -40 42 -50 64 -72 88 -97 114 -136 152 -176 201 -229 261
33 261 -296 333 -374 418 -470 526 -587 654 -724 803 -890 983 -1087 1200 -1321 1457 -1605
50 -1605 1769 -1947 2146 -2368 2617 -2897 3218 -3585 4010 -4516 5121 -5863 6800 -8023 9689
65 9689 -12107 15948 -22984 40058 -167050 -118951 175452 -35241 126480 51419 -167556
76 -167556 113925 147142 -211021 -47143 23786 -79903 150835 55509 -216327 96589 177570
87 177570 -48654 21110 -112771 -236855 138178 145653 -85482 76907 42651 -72754 110128
98 110128 -63792 -232273 83067 108171 -31858 82804 -60295 -104527 190508 58410
108 58410 -160181 -16223 -64798 -47241 177206 5700 -94639 135218 29181 -93214
118 -93214 3084 -129347 -68541 205259 46192 -82458 45498 -43763 -9026 124581 -95270
129 -95270 -128242 80985 -1431 -5211 93284 -53691 -1952 133650 -77539 -129088 5058
140 5058 -40212 63705 150408 -62591 -58415 66992 -42216 -19756 29684 -94269 6680
151 6680 111283 -42095 -19836 57492 -27362 34529 34396 -137365 -53018 71059 10340 62678
163 62678 52151 -79602 2056 37503 -83384 -18479 33636 -20805 61351 41512 -79782
174 -79782 10023 52642 -30437 6847 -23707 -85920 40457 69042 -12308 36315 13076 -55593
186 -55593 8170 -19331 -69948 39239 55125 -1767 31777 -16802 -55361 35456 16471 -42180
198 -42180 5993 -11455 -21320 53163 20036 -18772 31548 -8161 -48901 -6513 -23895 -8123
210 -8123 67923 29455 -16794 3556 -29363 -25863 25672 -7782 -17326 25007 -1753 -5614 27075
223 27075 -4040 -5191 18241 -28367 -36298 3918 1597 25068 46722 -3876 -21337 -7890 -28854
236 -28854 -10344 19774 1707 9774 19196 -12820 -7387 10657 -5438 562 1189 -25219 -10535
249 -10535 14400 11881 22902 17235 -16071 -20026 -15838 -17735 7661 23502 12343 9071 -2082
262 -2082 -17618 -6407 3222 -381 2933 -2254 -9920 1097 10138 11001 12160 -337 -17273 -18749
276 -18749 -11705 1922 18541 20228 8705 -4190 -14441 -14258 -4480 4540 8493 5220 -1742 -4304
290 -4304 -1444 5151 9072 2816 -7006 -13019 -12618 -689 13220 15914 11455 290 -14388 -16129
304 -16129 -7522 1265 11796 12861 1308 -4938 -5823 -4544 4494 7138 -1386 -5428 -7331 -6607 5428
319 5428 13250 9275 3818 -7062 -16858 -10450 758 8539 14568 8178 -4892 -8623 -7428 -2857
333 -2857 6128 6730 -160 -3773 -5553 -3026 5753 9620 5179 -2214 -9967 -11840 -3920 6859 12248
348 12248 9528 978 -8348 -11365 -4959 2989 6765 7327 975 -6908 -5010 -395 2895 8429 3935
363 3935 -7262 -7570 -5432 -1602 11073 11256 211 -2225 -8632 -12263 2264 7548 4060 8790 -1239
378 -1239 -12799 -1703 1254 524 11695 1289 -12104 -1313 -2286 -2294 14753 5449 -7434 1437
392 1437 -9130 -12051 11309 7041 571 11037 -8751 -16653 6889 1019 -280 15733 -6153
405 -6153 -13521 7932 -5402 -3657 19107 -2624 -8896 7638 -14866 -8834 21394 996 -1730
418 -1730 11601 -18968 -11748 17683 -5251 368 18318 -15036 -8456 13519 -14708 685 24041
431 24041 -11948 -5979 9284 -21879 2353 26846 -11320 -851 10873 -25304 463 20404
443 20404 -15977 7355 19047 -24016 -933 12048 -21634 13711 22924 -24622 836 8743
455 8743 -24712 16722 21074 -24769 8730 9188 -30154 12999 14791 -22324 21185 11714 -34170
468 -34170 10251 8087 -22497 27417 10241 -33529 15271 4544 -25697 27592 7287 -28225
480 -28225 22914 -1194 -32153 25871 5790 -20242 30615 -5970 -34818 24970 -200 -19116
492 -19116 34209 -6700 -28747 28114 -8422 -22144 35181 -6806 -21731 29684 -17272 -23294
504 -23294 37202 -7199 -14902 32160 -23053 -22950 34600 -14395 -10775 37653 -21767 -17276 31650
517 31650 -24193 -9637 39276 -22403 -11120 30500 -30136 -6225 39254 -24022 -4212 29947
529 29947 -35905 -5793 34384 -26546 5063 33323 -35911 -2659 27298 -33338 8028 32198
541 32198 -33825 5375 24359 -37201 10638 29301 -32695 10913 18777 -41341 13104 26437
553 26437 -30052 18628 17435 -40837 14293 16279 -34971 22882 18900 -33970 19986 8763 -37981
566 -37981 25868 15610 -33074 21625 3001 -35607 30882 11475 -30926 27004 876 -34985
578 -34985 26892 -434 -29061 36679 4273 -30122 25441 -8958 -27401 37511 -2491 -28540
590 -28540 28615 -8660 -21395 36087 -9381 -23257 32774 -12905 -24321 28687 -12822 -11370
602 -11370 40071 -14681 -23436 24742 -17432 -9992 34439 -18840 -13909 31299 -17276 -10244 27579
615 27579 -20908 -5905 29641 -25369 -11794 27387 -15045 4058 27331 -30000 -9275 23837
627 23837 -21062 1880 24201 -23249 4634 23873 -28110 -1338 20608 -20919 7903 16471
639 16471 -30811 5970 24288 -18013 8691 10602 -30383 8065 15644 -23699 11716 16612 -18991
652 -18991 12314 5756 -29540 11629 14376 -18059 11828 3722 -21813 18327 10842 -20466 10385
665 10385 1635 -19923 14464 2781 -16800 20125 7897 -16671 8596 -6440 -17247 19699
677 19699 4296 -14262 13191 -1566 -11278 16466 -4001 -14877 14204 -3010 -12070 13082
689 13082 -3185 -4902 19860 -4962 -15143 6966 -7667 -4509 17814 -4134 -6345 13262 -6640
702 -6640 -7341 9497 -8342 -3572 13062 -7696 -5438 11202 -3418 1251 9840 -12191 -7674 6917
716 6917 -5433 2273 11583 -4867 139 6037 -10670 -3870 5929 -4290 3087 6520 -7514 534
730 534 7118 -3901 901 1552 -9361 -455 4653 -2727 5154 6556 -3844 -405 -1848 -8627 1207
745 1207 5020 -459 3938 1631 -4597 1652 1447 -3747 743 -471 -3935 1940 2430 591 4706 1469
761 1469 -4158 -2933 -3719 -2493 3776 4097 1923 1879 -1374 -3120 -1034 -877 -459 882 43 -143 1042
778 1042 1722 1996 622 -1707 -3225 -3578 -1079 2233 3345 3864 1948 -2233 -3032 -2545 -2246 1269 2415
795 2415 258 1234 874 -1063 1199 733 -2434 -1089 -1573 -2621 2228 3673 1801 2945 -819 -5260
811 -5260 -2192 -1297 -891 4085 2815 -537 1488 -905 -2917 1120 -354 -2283 1068 -701 -1107 3984
827 3984 2292 -165 1143 -3350 -4915 201 186 1316 5161 1261 -1539 69 -3014 -2505 1897 -163
843 -163 -418 2102 -649 -51 3097 -55 -1244 -334 -3544 -2285 1895 1463 2663 3507 -1009 -2568 -1702
860 -1702 -2811 -315 2523 946 808 1041 -880 -208 790 -792 -1098 -911 -1444 5 1968 2317 1885
877 1885 387 -1938 -3199 -2204 50 1536 2357 2050 -230 -1008 -368 -1318 -663 806 -822 -516 1176
894 1176 -286 1041 2990 -589 -1752 -1080 -3601 -578 3641 839 1463 2401 -2864 -1718 756 -3063
910 -3063 337 3626 -1727 165 2233 -2723 1494 3468 -4195 -1424 1059 -3808 2556 4825 -2806
925 -2806 1877 2498 -6030 -400 1497 -4248 4375 4583 -5252 1382 2032 -4869 3832 1892 -7385 2631
941 2631 2731 -4927 4890 2559 -5529 4937 539 -9058 3049 2042 -3642 7886 715 -8418 5058
956 5058 920 -6255 5863 -1016 -6593 8243 171 -7164 7164 -80 -5239 7377 -4545 -8745
970 -8745 9343 859 -3917 8431 -4897 -6760 9839 -3813 -6840 9127 -3102 -3241 10234
983 10234 -7049 -6007 11655 -3837 -4553 7651 -8969 -2658 13851 -5721 -4161 9215 -8077
996 -8077 -1871 9990 -10573 -2122 13154 -6618 -1429 7682 -11565 1161 12859 -10486 -2326
1009 -2326 8306 -9481 3784 10482 -12795 926 10322 -10831 1267 6448 -12140 6735 11425
1022 11425 -13169 1029 6141 -11038 7650 7063 -15325 5183 8497 -11166 6437 3971 -13501
1035 -13501 9797 6208 -15385 5765 4534 -9731 12298 2337 -16586 8860 4409 -11135 10131
1048 10131 -175 -12585 13693 1983 -13983 9756 302 -9237 13524 -3359 -14261 13187
1060 13187 1431 -8545 11741 -5603 -10903 14943 -2584 -10700 12080 -3439 -6393 14026 -7665
1073 -7665 -10341 14479 -3179 -6327 11335 -9292 -5972 16347 -6107 -7143 11426 -8120 -3317
1086 -3317 13407 -10600 -4808 14747 -7150 -3086 9986 -12264 -968 15070 -10034 -3122 10171
1099 10171 -10484 1727 11932 -13038 -446 11690 -10626 1005 8379 -12651 4295 11804
1111 11804 -12591 588 7244 -11245 5925 8631 -13586 3564 8161 -10961 4890 5352 -12252
1124 -12252 7002 6928 -12597 4437 4813 -9622 8550 3976 -13146 6009 4402 -9460 7692
1137 7692 2029 -10598 8768 2544 -10851 7126 1516 -8110 9414 -334 -10667 8584 1305
1150 1305 -7301 8634 -2096 -8678 9536 -894 -7584 8794 -1735 -6066 9131 -3721 -7221
1163 -7221 9359 -1833 -4884 8192 -4732 -5229 9446 -3220 -4490 7779 -4529 -3574 8086
1176 8086 -4884 -3216 8370 -4085 -2770 6332 -5794 -1852 7986 -4442 -1885 5892 -5410
1189 -5410 -836 6409 -5235 -685 5880 -5195 -503 4916 -5225 859 5569 -5332 -225 3814
1203 3814 -5139 1542 4609 -5003 1038 3399 -5149 1436 3252 -4586 2146 2903 -5008 1586 2420
1218 2420 -3960 2681 2107 -4626 1745 1507 -3699 2794 1697 -3572 2216 672 -3723 2340 1102
1233 1102 -2647 2520 314 -3160 2084 505 -2113 2379 5 -2534 1760 -92 -1639 2388 131
1248 131 -1726 1412 -746 -1597 1904 93 -879 1501 -699 -1282 1266 -290 -504 1349 -633 -903
1264 -903 851 -382 -97 1240 -394 -617 269 -692 -139 918 66 88 232 -682 -341 202 37 302 190
1283 190 -274 -202 -103 200 345 -4 30 -282 -598 171 274 69 715 -8 -780 47 -275 -343 931 134 -492
1304 -492 516 -399 -596 938 -84 -515 716 -628 -735 1035 -63 -164 1103 -753 -931 698 -617
1321 -617 -155 1466 -471 -473 849 -995 -398 1262 -655 -249 984 -1057 -223 1303 -645 55 961
1338 961 -1356 -397 918 -843 453 1377 -1012 -135 602 -1318 198 1105 -906 285 712 -1203 332
1355 332 889 -916 384 465 -1376 220 702 -656 836 682 -1140 74 71 -996 665 656 -605 520
1373 520 141 -925 445 304 -596 424 -11 -770 412 379 -146 564 -2 -721 -88 -128 -201 562 408 -54
1393 -54 35 -227 -366 -2 192 54 -79 -11 -31 -77 355 250 -311 -16 -181 -616 277 458 -96 622 144 -961
1415 -961 98 71 -633 780 348 -857 652 210 -924 867 167 -1137 817 -77 -1233 1306 426
1432 426 -891 1330 -410 -1738 1286 -79 -1137 1876 -199 -1379 1789 -608 -1583 1982 -569
1447 -569 -1394 2064 -1014 -1354 2696 -686 -1352 2175 -1642 -1496 2734 -1251 -1042 2984 -1492 -1169 2590
1464 2590 -2224 -1085 3218 -1863 -916 2850 -2357 -446 3416 -2549 -867 2869 -2800 -270 3248
1479 3248 -2888 115 3492 -3190 -314 2675 -3544 714 3517 -3653 360 3009 -3632 1103 2838
1494 2838 -4399 1097 2993 -4166 1433 2645 -4141 2354 2599 -5118 1603 2264 -4237 2993 2098 -5046
1510 -5046 2862 2108 -4807 2857 1268 -4785 3893 1430 -5215 3571 1337 -4335 4132 109 -5488
1525 -5488 4307 941 -4374 4434 -160 -4531 5038 -385 -5068 4661 -295 -3786 5288 -1469 -4537
1540 -4537 5724 -773 -3986 4901 -2301 -3594 6259 -1918 -3751 5659 -2237 -2872 5620 -3679 -3177
1555 -3177 6549 -2609 -2513 5419 -4067 -1818 6537 -4158 -2448 5575 -4035 -863 5876 -5102 -1094
1570 -1094 6232 -4628 -1043 4764 -5415 454 6184 -5423 -479 4909 -5169 960 4741 -6286
1584 -6286 788 5262 -5315 1054 3928 -5873 2217 4514 -6456 1167 3776 -5221 3003 3392 -6565
1599 -6565 2515 3593 -5738 2619 2311 -5827 4032 2831 -6310 3074 2158 -5178 4219 1139 -6393
1614 -6393 4241 1981 -5049 4222 387 -5358 5071 553 -5649 4424 411 -4199 5238 -771
1628 -771 -5241 5185 -26 -4194 4638 -1461 -3955 5763 -976 -4134 4796 -1386 -3146 5052 -2352
1643 -2352 -3545 5499 -1351 -2763 4470 -2760 -2447 5372 -2413 -2686 4505 -2459 -1480 4719 -3289 -1852
1659 -1852 4804 -2758 -1490 3842 -3441 -542 4793 -3315 -1128 3648 -3369 -34 3783 -3892 -126
1674 -126 3897 -3336 141 2970 -3794 810 3356 -3858 323 2711 -3284 1408 2571 -3942 954
1689 954 2413 -3376 1255 1884 -3371 1813 2024 -3505 1263 1546 -2919 1902 1209 -3330 1735 1420
1705 1420 -2650 1787 717 -2841 1973 755 -2738 1823 700 -2122 2047 129 -2540 1925 390
1720 390 -1944 1896 -152 -1920 2120 -42 -1806 1812 -280 -1515 1837 -542 -1450 1968 -252
1735 -252 -1162 1546 -817 -1129 1755 -567 -908 1516 -680 -732 1430 -800 -680 1383 -675 -576 1093
1752 1093 -750 -290 1259 -666 -426 831 -748 -213 919 -584 -100 791 -603 -193 572 -534 20
1769 20 603 -510 -80 432 -372 112 414 -409 -50 212 -362 61 295 -146 90 104 -280 -46 70 -55
1789 -55 91 52 -71 -20 -9 47 34 -6 68 -122 -112 143 -37 32 283 -168 -168 178 -233 -38 383 -192 -39 310
1813 310 -357 -65 395 -321 -2 358 -479 -2 456 -389 106 422 -554 6 357 -534 187 498 -525 143
1833 143 320 -653 212 435 -584 251 334 -677 287 369 -594 369 294 -715 314 239 -620 507 288 -656
1853 -656 388 114 -673 490 196 -594 486 69 -645 491 90 -540 546 -17 -599 495 -5 -445
1871 -445 607 -35 -512 461 -140 -432 553 -51 -344 487 -189 -374 477 -128 -253 459 -213 -287 412 -146
1891 -146 -161 419 -185 -218 267 -214 -112 350 -109 -99 196 -206 -95 199 -81 -21 130 -123 -65 73 -10 20
1913 20 43 -27 -76 -55 50 29 4 137 -56 -172 112 -44 -100 274 -63 -193 265 -136 -219 379 -112 -232 407
1936 407 -223 -290 509 -187 -224 568 -360 -343 599 -348 -228 729 -453 -266 723 -576 -229 834 -597 -170
1956 -170 826 -777 -135 950 -778 -52 902 -997 -11 991 -999 114 1022 -1135 154 956 -1280
1973 -1280 285 1057 -1297 342 943 -1457 500 1033 -1488 559 919 -1602 690 935 -1648 836
1989 836 902 -1738 842 750 -1798 1100 801 -1852 1117 616 -1900 1335 574 -1942 1432 466 -1972
2006 -1972 1563 339 -1921 1787 207 -2016 1801 43 -1899 2068 -101 -1952 2114 -288 -1877
2021 -1877 2248 -449 -1790 2380 -640 -1778 2452 -764 -1600 2556 -1046 -1628 2593 -1122 -1398 2690
2037 2690 -1318 -1349 2692 -1508 -1223 2744 -1597 -1023 2747 -1835 -959 2781 -1903 -767 2726 -2136
2053 -2136 -645 2759 -2178 -414 2725 -2350 -297 2602 -2523 -73 2638 -2588 120 2485 -2766
2068 -2766 317 2440 -2832 536 2298 -2959 728 2185 -2994 979 2029 -3113 1137 1858 -3136
2083 -3136 1401 1755 -3138 1568 1524 -3210 1722 1389 -3131 1913 1172 -3165 2045 1048 -3079 2191
2099 2191 807 -3072 2302 653 -2976 2472 525 -2884 2520 212 -2863 2659 137 -2710 2702
2114 2702 -131 -2614 2832 -303 -2508 2853 -501 -2352 2908 -743 -2172 3033 -865 -2046 2919
2129 2919 -1178 -1818 3075 -1264 -1667 3004 -1469 -1443 2989 -1682 -1275 2994 -1761 -1094 2844 -1918
2145 -1918 -805 2882 -2064 -784 2685 -2107 -445 2664 -2227 -338 2569 -2271 -220 2369 -2310
2160 -2310 53 2348 -2384 84 2159 -2321 345 2009 -2472 404 1938 -2362 590 1753 -2373
2175 -2373 749 1611 -2437 795 1481 -2254 1036 1270 -2361 1106 1196 -2227 1183 918 -2200 1350
2191 1350 826 -2146 1380 689 -1989 1460 414 -2024 1546 425 -1789 1535 163 -1759 1602
2206 1602 106 -1668 1556 4 -1486 1576 -155 -1417 1595 -162 -1310 1464 -354 -1162 1571
2221 1571 -330 -1084 1431 -448 -969 1397 -517 -867 1405 -500 -759 1265 -608 -609 1283 -647 -614
2238 -614 1140 -653 -405 1137 -699 -374 1038 -712 -311 922 -698 -140 917 -723 -149 777 -679
2255 -679 -22 728 -704 -15 663 -640 53 574 -604 78 474 -618 86 446 -462 169 370 -516 120
2274 120 310 -413 141 265 -379 132 220 -327 122 181 -254 81 107 -257 93 137 -157 71 67 -161 27 52
2296 52 -85 38 68 -42 -10 31 -3 -23 40 11 -84 20 53 -72 76 93 -144 31 69 -189 76 140 -176 104
2320 104 130 -245 101 131 -252 146 119 -295 182 134 -296 222 104 -363 200 80 -351 293 114 -345 297
2341 297 38 -390 312 51 -360 360 22 -384 375 12 -357 396 -42 -384 393 -57 -331 453 -69 -335
2361 -335 429 -149 -329 443 -140 -268 458 -185 -285 447 -205 -245 454 -235 -233 437 -220 -176 450 -258 -160 387
2383 387 -313 -128 417 -278 -79 380 -305 -81 349 -293 -42 320 -309 -13 288 -279 30 257 -298 16
2403 16 207 -274 58 212 -230 63 137 -235 55 115 -193 86 101 -168 77 53 -124 75 46 -102 39 13
2425 13 -42 64 10 -1 6 -43 11 -15 -42 87 -26 -31 90 -78 -50 159 -111 -43 177 -161 -34 255 -182 -35 263
2450 263 -274 -37 278 -320 15 337 -349 24 306 -427 86 383 -486 105 380 -522 180 385 -595 235
2470 235 391 -655 293 346 -684 408 360 -775 425 314 -795 544 269 -856 620 262 -881
2487 -881 671 164 -901 801 114 -970 835 76 -899 958 -51 -990 1023 -63 -960 1082 -173
2504 -173 -935 1204 -266 -991 1213 -313 -892 1317 -471 -929 1410 -466 -849 1415 -653 -796 1525
2521 1525 -748 -782 1545 -819 -637 1566 -1040 -614 1654 -1059 -502 1591 -1247 -346 1686 -1340
2537 -1340 -306 1617 -1418 -118 1594 -1602 -19 1656 -1622 88 1494 -1779 294 1569 -1859
2552 -1859 326 1455 -1879 536 1375 -2025 635 1375 -2009 738 1185 -2074 971 1214 -2156 956
2568 956 1061 -2087 1190 944 -2226 1284 902 -2160 1365 667 -2174 1586 603 -2225 1603 458
2584 458 -2063 1809 236 -2158 1886 177 -2019 1955 -68 -1943 2141 -210 -1933 2123 -359
2599 -359 -1718 2263 -608 -1726 2319 -635 -1548 2296 -905 -1433 2422 -994 -1363 2351 -1094 -1148
2615 -1148 2385 -1324 -1112 2400 -1325 -935 2294 -1542 -775 2373 -1613 -712 2253 -1680 -473 2213
2631 2213 -1862 -387 2227 -1847 -233 2038 -1993 -10 2060 -2035 54 1887 -2067 308 1792
2646 1792 -2188 430 1721 -2145 578 1488 -2214 793 1450 -2232 826 1258 -2163 1054 1104 -2211
2662 -2211 1142 1009 -2136 1235 790 -2110 1386 712 -2078 1373 548 -1955 1503 409 -1960 1551
2678 1551 328 -1833 1587 163 -1752 1662 67 -1715 1639 -42 -1547 1708 -206 -1515 1702
2693 1702 -266 -1365 1685 -427 -1267 1716 -506 -1177 1670 -606 -1016 1659 -735 -928 1627 -772
2709 -772 -759 1561 -899 -641 1533 -942 -546 1461 -987 -407 1392 -1056 -304 1341 -1044 -204 1222
2726 1222 -1095 -99 1186 -1073 -31 1081 -1078 51 1010 -1064 119 948 -1043 161 838 -1019
2742 -1019 245 780 -1002 268 668 -968 321 614 -930 358 529 -905 394 450 -831 434
2758 434 390 -797 437 306 -722 468 229 -683 465 182 -625 465 117 -567 458 66 -515 444
2776 444 36 -425 437 -13 -392 401 -38 -333 383 -53 -290 338 -74 -246 305 -63 -202 256 -85 -168
2796 -168 228 -59 -142 186 -66 -121 144 -57 -84 138 -31 -64 84 -19 -53 51 1 -35 13 9 -20 -5 35 -15 -34
2821 -34 56 -15 -61 88 -14 -74 106 -34 -104 135 -33 -106 166 -52 -116 175 -70 -115 210 -96 -134 207 -113
2844 -113 -125 253 -122 -117 264 -157 -120 276 -174 -77 290 -194 -79 281 -228 -58 293 -252 -51 289 -262 -19
2866 -19 301 -276 -8 285 -303 15 271 -310 49 256 -310 64 245 -332 86 233 -338 98 212 -325
2886 -325 124 188 -319 140 166 -315 156 158 -294 165 113 -300 170 105 -288 186 85 -269 188 61 -237 191
2908 191 35 -231 179 4 -203 195 -4 -184 166 -22 -166 154 -29 -121 136 -30 -107 120 -45 -76 110
2929 110 -47 -69 81 -35 -37 73 -27 -8 34 -27 -14 -8 6 16 -31 14 13 -67 56 22 -89 80 20 -129 101 30
2955 30 -146 134 14 -196 158 8 -208 198 0 -241 233 -32 -261 274 -43 -270 331 -74 -298 374
2975 374 -95 -301 424 -141 -311 464 -174 -301 507 -230 -295 545 -287 -283 602 -331 -258 636 -400 -235 672
2996 672 -460 -201 675 -531 -152 717 -595 -95 719 -653 -56 708 -735 11 748 -782 54 727
3014 727 -843 135 718 -910 185 725 -955 273 696 -1023 359 696 -1058 401 645 -1096 506
3031 506 621 -1149 560 569 -1174 660 504 -1225 751 462 -1231 814 367 -1244 929 292 -1268
3048 -1268 991 220 -1224 1095 89 -1244 1166 11 -1212 1241 -92 -1161 1336 -209 -1150
3063 -1150 1368 -285 -1057 1419 -426 -1034 1502 -490 -960 1521 -617 -871 1579 -732 -856 1588
3079 1588 -803 -742 1597 -938 -683 1631 -985 -600 1599 -1086 -485 1631 -1186 -417 1602 -1254
3095 -1254 -288 1576 -1356 -177 1577 -1407 -82 1478 -1496 70 1460 -1575 156 1380 -1589
3110 -1589 319 1295 -1675 434 1248 -1690 538 1101 -1711 691 1046 -1752 759 935 -1730 877
3126 877 799 -1761 984 751 -1724 1043 604 -1706 1162 511 -1704 1207 420 -1628 1302 284 -1630
3143 -1630 1386 224 -1565 1396 90 -1496 1491 -12 -1470 1497 -105 -1349 1552 -266 -1303
3158 -1303 1592 -340 -1212 1580 -477 -1090 1623 -577 -1024 1596 -655 -870 1579 -811 -790 1579
3174 1579 -852 -660 1522 -955 -537 1502 -1036 -471 1448 -1060 -328 1389 -1138 -238 1363 -1144
3190 -1144 -154 1262 -1191 -28 1242 -1218 10 1164 -1221 116 1086 -1251 186 1034 -1233 257
3206 257 930 -1235 360 878 -1248 398 791 -1209 484 692 -1200 546 629 -1165 577 515 -1122
3223 -1122 650 436 -1100 672 358 -1033 728 239 -998 754 186 -936 757 112 -858 789
3239 789 38 -811 769 -15 -730 779 -100 -697 782 -117 -623 745 -184 -576 735 -219 -535 706
3257 706 -230 -452 685 -283 -405 655 -285 -356 626 -312 -292 599 -323 -255 559 -321 -190 518 -347 -156
3277 -156 484 -340 -112 427 -352 -68 397 -328 -35 350 -312 0 307 -303 31 254 -287 36 211 -265
3297 -265 51 186 -244 56 146 -228 56 123 -200 60 100 -167 65 80 -136 68 79 -114 50 48 -85 44
3319 44 44 -76 31 26 -51 15 28 -21 2 11 -4 -14 16 8 -30 13 36 -50 14 45 -65 22 50 -87 15 59 -93 26 58
3348 58 -104 40 69 -127 67 79 -138 71 79 -156 91 75 -156 91 73 -165 116 64 -175 124 44 -175 139
3371 139 43 -177 158 13 -190 157 5 -178 176 -7 -178 180 -14 -169 194 -44 -168 214 -48 -162
3391 -162 209 -65 -147 200 -66 -138 203 -76 -117 199 -96 -106 207 -94 -86 200 -101 -74 197 -103 -66 182 -117
3414 -117 -54 164 -115 -50 147 -127 -30 121 -129 -20 112 -119 -14 116 -109 12 103 -101 10 76 -85 18
3436 18 69 -77 21 52 -73 10 37 -50 16 22 -45 12 16 -22 3 1 -6 -6 -7 14 -15 -7 37 -27 -9 39 -52 -11 63 -59 -22 72
3468 72 -83 -7 109 -111 -13 113 -126 -3 126 -149 13 137 -176 41 148 -187 46 159 -227 57 171
3489 171 -251 79 165 -278 101 171 -303 134 173 -331 161 170 -359 192 154 -382 233 135 -396 263 122 -408
3511 -408 299 83 -420 330 60 -417 377 30 -434 414 -8 -430 448 -31 -426 492 -64 -412 527 -108
3531 -108 -416 552 -163 -402 580 -202 -380 610 -234 -377 632 -290 -351 655 -328 -343 679 -387 -313 692
3551 692 -443 -271 712 -469 -242 720 -510 -204 721 -570 -156 715 -610 -97 696 -660 -44 697
3569 697 -702 17 691 -728 83 658 -773 133 632 -804 193 588 -825 244 556 -850 313
3586 313 527 -875 372 481 -886 415 435 -906 475 398 -898 530 359 -913 581 311 -900
3603 -900 625 266 -897 674 206 -893 723 141 -884 753 97 -862 794 22 -828 836 -39
3620 -39 -793 872 -101 -766 901 -165 -720 916 -228 -665 918 -310 -620 928 -367 -554 937
3637 937 -432 -515 928 -485 -454 934 -536 -387 934 -584 -326 911 -627 -275 893 -664 -219
3654 -219 886 -697 -169 855 -723 -107 823 -764 -59 804 -783 6 773 -813 59 731 -830
3671 -830 119 681 -838 182 654 -857 227 594 -855 277 540 -849 333 487 -843 374 430
3688 430 -826 422 359 -801 455 314 -783 498 260 -761 519 197 -741 556 150 -708 579
3705 579 94 -678 590 55 -643 594 7 -620 616 -38 -579 608 -77 -537 624 -107 -513 616
3723 616 -141 -468 614 -186 -433 607 -215 -397 592 -247 -350 576 -280 -309 560 -299 -261 544 -298 -218
3743 -218 519 -325 -179 482 -345 -130 467 -361 -99 441 -366 -56 396 -369 -35 359 -367 4 341 -369
3763 -369 28 314 -360 49 283 -334 58 263 -323 83 234 -325 85 211 -309 110 193 -298 121 162 -276
3784 -276 126 138 -266 126 113 -241 126 87 -230 136 70 -202 132 62 -187 124 37 -181 123 20 -145 108
3806 108 9 -128 104 -1 -110 88 -9 -91 84 -18 -80 65 -9 -59 62 -9 -53 54 -11 -41 30 -7 -34 31 4
3831 4 -29 10 -1 -27 0 2 -27 1 20 -13 -3 29 -8 -17 29 -13 -28 36 -13 -40 36 -16 -43 48 -26 -44 52 -24 -46 78 -25
3862 -25 -47 74 -31 -48 88 -36 -57 89 -51 -53 92 -47 -54 102 -69 -56 88 -74 -41 97 -85 -42 98 -82
3886 -82 -27 111 -91 -33 105 -99 -14 101 -99 -15 106 -108 -11 99 -110 1 81 -115 7 85 -106 27 88
3909 88 -113 30 81 -113 35 72 -124 44 61 -115 41 51 -115 41 36 -109 48 35 -104 54 25 -95 60
3932 60 17 -95 62 18 -78 75 3 -77 58 4 -62 55 -2 -53 47 -3 -45 44 -12 -46 44 -21 -28 38 -15 -15 34 -15
3960 -15 -17 32 -15 2 12 -21 4 2 -11 3 -16 -19 13 -27 -15 18 -28 3 23 -33 10 17 -49 32 25 -52 31 19 -60 50 23 -71
3992 -71 65 32 -76 70 11 -92 75 7 -106 99 5 -98 116 -7 -111 127 -10 -110 135 -24 -127 158
4014 158 -44 -126 160 -52 -126 180 -61 -121 198 -91 -110 215 -108 -114 226 -129 -96 231 -144 -86 247 -158 -68
4037 -68 244 -176 -50 243 -205 -37 253 -229 -25 257 -260 -14 252 -273 8 252 -277 34 247 -310
4057 -310 66 257 -317 89 251 -331 106 235 -356 130 229 -368 154 209 -379 184 213 -386 207 191 -398
4078 -398 242 171 -406 262 149 -407 280 110 -412 303 88 -407 333 57 -403 360 26 -395 372 -1
4098 -1 -381 391 -30 -363 410 -50 -345 434 -87 -332 449 -125 -321 454 -159 -300 456 -179 -284 471 -211
4119 -211 -265 482 -237 -239 500 -275 -223 495 -299 -180 485 -326 -159 496 -351 -135 485 -385 -96 471 -404
4140 -404 -71 459 -423 -34 439 -430 8 424 -449 38 405 -471 80 378 -453 103 369 -465 145 331
4160 331 -485 186 311 -487 198 283 -479 232 251 -480 250 235 -480 281 197 -486 297 178 -465 325 150
4181 150 -467 341 115 -465 372 85 -446 378 60 -442 396 23 -417 402 -10 -395 414 -31 -364 416
4201 416 -60 -334 427 -81 -315 416 -106 -296 418 -145 -259 410 -174 -241 404 -199 -210 400 -217 -173 388
4222 388 -230 -147 377 -243 -124 367 -243 -102 348 -261 -67 342 -276 -60 336 -285 -29 309 -285 -6
4242 -6 300 -284 11 289 -276 30 270 -293 44 247 -277 70 229 -286 87 206 -276 91 185 -266 114
4263 114 158 -257 116 127 -253 124 101 -244 140 85 -230 140 82 -208 149 64 -194 153 47 -189 149 31
4285 31 -175 135 15 -154 132 16 -144 142 -3 -133 139 -4 -127 139 -13 -115 128 -18 -109 116 -22
4306 -22 -96 111 -38 -85 105 -35 -79 93 -42 -67 91 -36 -53 79 -40 -34 77 -33 -27 64 -30 -22 65 -23 -25 49
4332 49 -24 -16 30 -24 -12 31 -5 -4 28 -8 -2 23 -1 -6 21 4 -4 18 0 -8 17 5 -20 -1 13 -12 7 20 -27 0 30 -28 6
4365 6 26 -24 3 36 -33 4 49 -39 8 41 -40 11 32 -41 9 37 -51 5 38 -60 6 39 -63 7 43 -66 17 39 -67
4394 -67 20 40 -64 32 38 -63 33 30 -74 40 27 -77 50 26 -65 49 15 -69 53 26 -59 53 8 -66 55 20
4420 20 -68 60 7 -55 62 7 -55 71 -5 -48 61 -16 -59 65 -3 -53 65 -16 -44 66 -28 -42 74 -23 -28 69 -30
4447 -30 -19 53 -21 -21 47 -31 -8 40 -33 -10 41 -31 -8 33 -29 12 24 -27 0 25 -16 16 20 -21 10 2 -23 22 -1 -15 16 -16
4479 -16 -6 16 -4 -13 14 -18 0 22 -19 7 9 -19 15 10 -32 32 12 -30 38 -2 -34 33 -5 -49 59 -17 -45 47 -15 -28 63
4510 63 -30 -44 65 -39 -36 88 -33 -42 80 -62 -38 92 -65 -26 103 -77 -20 96 -87 -18 110 -104 -13 114
4534 114 -111 0 123 -115 17 123 -129 21 125 -142 34 118 -168 43 115 -166 57 107 -184 68 94
4555 94 -180 83 91 -186 108 77 -199 119 82 -209 123 75 -202 137 55 -202 147 37 -209 178 27 -217
4577 -217 194 13 -212 208 5 -223 227 -17 -219 236 -38 -211 245 -46 -208 259 -66 -196 271 -89
4597 -89 -197 282 -117 -186 289 -133 -166 297 -157 -161 310 -170 -130 317 -183 -112 301 -201 -102 306 -219 -69 301
4620 301 -239 -55 292 -255 -41 292 -265 -10 283 -284 0 269 -297 30 274 -304 40 264 -317 75
4640 75 252 -324 86 228 -338 109 223 -362 129 206 -357 137 192 -355 174 169 -357 190 155 -360 207 128
4662 128 -353 232 109 -349 243 91 -334 257 55 -330 276 43 -316 287 15 -296 301 -4 -279 313
4682 313 -30 -268 309 -52 -262 310 -63 -250 313 -92 -231 324 -123 -217 324 -124 -196 334 -154 -173 330
4703 330 -173 -157 336 -189 -132 334 -199 -119 322 -220 -101 311 -225 -85 308 -238 -57 282 -251 -38 266
4724 266 -250 -19 263 -252 0 247 -267 10 222 -256 30 213 -252 57 192 -252 78 183 -262 92
4744 92 147 -250 95 140 -235 114 140 -244 114 114 -240 139 99 -227 138 90 -239 146 66 -202 151 49 -212
4767 -212 151 30 -197 155 26 -194 165 13 -179 157 9 -161 171 6 -154 157 -18 -135 159 -23
4787 -23 -130 155 -34 -116 139 -51 -102 132 -49 -89 134 -53 -83 124 -52 -69 114 -57 -60 108 -59 -55 102
4810 102 -48 -47 110 -51 -44 100 -59 -37 79 -66 -29 85 -57 -30 79 -58 -18 70 -59 -19 68 -53 -14 56
4834 56 -41 -10 53 -38 -8 51 -38 -12 37 -39 -10 32 -28 -12 30 -28 -13 13 -13 -3 30 -12 -9 20 -10 -4 23 -15 -23 18 -12 -21
4866 -21 25 -5 -21 21 -1 -24 20 5 -19 21 -2 -30 24 -2 -34 28 -5 -43 33 -1 -44 30 -3 -44 37 -1 -38 38 1 -46
4896 -46 44 -3 -39 53 -8 -51 50 -12 -40 54 -12 -44 50 -21 -57 47 -23 -42 53 -39 -47 47 -34 -43 60 -36 -19 54 -37 -24
4926 -24 49 -37 -20 44 -55 -33 47 -51 -21 34 -52 -22 34 -55 -11 43 -50 0 43 -46 -1 35 -50 -1 42 -44 3 25 -58 9
4956 9 13 -56 4 30 -52 23 22 -50 14 14 -58 28 4 -52 25 7 -37 35 2 -35 31 -5 -32 31 -16 -36 26 -13 -32 19 -21 -16 11
4989 11 -27 -21 17 -24 -7 17 -28 -4 6 -28 13 15 -35 13 4 -38 16 -4 -33 28 -16 -27 33 -21 -33 50 -22 -34 42 -30 -21 46
5021 46 -37 -22 45 -40 -23 43 -51 -14 50 -59 -13 50 -65 0 49 -81 9 55 -85 21 66 -84 35 48 -100 41
5047 41 52 -97 46 51 -112 50 43 -129 65 36 -125 84 25 -136 87 14 -137 100 16 -133 108 0 -128
5070 -128 122 -1 -126 133 -22 -121 139 -23 -130 139 -41 -116 144 -58 -109 153 -70 -106 158 -77 -101 171
5092 171 -88 -97 177 -110 -72 183 -123 -77 193 -130 -73 199 -147 -59 193 -165 -49 198 -169 -36 194 -175
5114 -175 -11 196 -200 5 194 -198 13 193 -210 21 168 -214 39 172 -229 67 163 -224 92 149 -240
5135 -240 90 140 -235 107 111 -239 128 115 -242 141 111 -235 155 79 -242 164 67 -250 177 52 -252 195
5157 195 43 -229 200 28 -238 209 15 -223 233 -12 -219 240 -29 -215 239 -49 -214 255 -60 -192
5177 -192 251 -79 -176 252 -90 -162 268 -103 -147 259 -123 -142 259 -125 -114 246 -140 -113 243 -150 -84 241
5199 241 -166 -73 228 -193 -55 226 -189 -34 218 -199 -28 213 -211 -8 211 -207 10 200 -222 15
5219 15 181 -226 36 170 -233 39 168 -242 50 152 -238 72 143 -224 85 130 -232 98 118 -215 112
5240 112 107 -216 118 93 -224 133 73 -200 134 63 -196 140 49 -190 137 30 -197 158 22 -175 152 12
5262 12 -159 154 -1 -153 156 -25 -151 156 -22 -137 148 -39 -129 148 -41 -115 158 -56 -107 158 -56
5283 -56 -105 160 -51 -80 145 -72 -72 138 -78 -69 133 -80 -61 120 -76 -57 127 -79 -48 105 -76 -40 113 -88
5307 -88 -33 113 -75 -7 98 -84 -14 96 -82 -17 87 -79 -6 69 -87 -7 62 -75 3 60 -64 1 64 -71
5331 -71 17 55 -56 6 45 -58 14 52 -68 3 29 -55 7 35 -57 0 32 -56 9 39 -54 4 35 -47 7 32 -38 6 27
5360 27 -33 5 26 -37 6 29 -31 -1 33 -24 -11 21 -32 -1 31 -22 -3 31 -25 -1 39 -36 -4 30 -13 -3 36 -37 -6 35
5390 35 -36 -12 32 -25 -12 33 -33 0 36 -36 -4 43 -34 -5 43 -27 2 41 -29 6 44 -48 -4 34 -36 8 37 -48 3 25
5420 25 -48 12 36 -51 4 31 -57 2 33 -50 11 36 -59 5 25 -55 20 24 -58 18 20 -66 23 19 -58 35 22 -50 35 11 -49 35
5452 35 11 -45 28 5 -48 38 1 -47 47 -4 -50 39 -13 -35 38 -17 -32 39 -23 -35 48 -15 -24 35 -17 -26 44 -21 -16 36 -29 -12
5484 -12 33 -27 -7 31 -26 -5 32 -32 -2 20 -31 6 21 -29 7 22 -33 17 17 -21 23 8 -31 24 0 -42 27 -10 -31 28 -9
5515 -9 -28 30 -20 -18 35 -18 -20 44 -30 -18 43 -37 -14 44 -37 6 49 -46 8 41 -48 16 46 -71 21 41 -52 23 28 -61 30 42
5547 42 -68 43 32 -70 43 29 -71 50 15 -80 65 15 -88 78 7 -84 80 -7 -86 85 -15 -81 91 -22
5571 -22 -74 98 -33 -75 109 -47 -63 115 -48 -68 120 -61 -61 126 -86 -46 121 -85 -44 133 -91 -38 129
5594 129 -99 -34 140 -112 -22 134 -123 -6 120 -138 1 118 -140 9 122 -150 19 114 -145 35 103
5615 103 -158 47 113 -170 67 105 -174 82 110 -166 96 97 -186 102 71 -191 116 54 -191 128 44 -184 141
5638 141 46 -186 143 32 -174 166 13 -177 168 -1 -162 179 -17 -158 186 -20 -157 197 -39 -153
5658 -153 193 -45 -140 198 -49 -124 199 -78 -111 201 -96 -114 204 -114 -104 201 -113 -87 203 -122 -75 207
5680 207 -149 -74 197 -158 -59 193 -176 -36 193 -176 -16 203 -179 -7 196 -203 19 188 -209 19 164
5701 164 -206 34 158 -206 40 149 -219 60 137 -212 72 126 -219 79 119 -220 97 104 -202 106 92 -216
5723 -216 116 90 -213 126 60 -191 123 57 -199 147 40 -193 151 27 -185 159 15 -170 169 3 -165
5744 -165 174 -12 -151 174 -29 -147 174 -34 -137 181 -51 -137 165 -68 -119 172 -70 -113 171 -83 -101
5765 -101 170 -86 -82 161 -87 -78 154 -95 -69 140 -95 -60 139 -115 -47 137 -103 -38 131 -109 -30 133 -107
5788 -107 -22 126 -110 -6 122 -113 2 116 -118 19 105 -119 11 95 -127 21 87 -119 30 81 -113 34
5810 34 84 -117 42 67 -105 42 53 -100 41 46 -108 41 41 -101 47 39 -90 37 30 -84 40 20 -80 49
5834 49 15 -76 48 17 -63 52 22 -53 48 9 -60 53 16 -66 42 2 -50 33 2 -51 49 -3 -55 39 0 -51 41
5861 41 0 -46 43 0 -41 44 5 -33 34 4 -31 35 5 -26 32 -2 -39 26 3 -28 38 -1 -22 21 2 -28 15 7 -14 24 4
5892 4 -34 29 3 -41 11 7 -42 11 0 -33 20 -11 -34 23 2 -34 30 11 -30 24 12 -25 30 10 -28 18 10 -27 24 -2 -43 30
5924 30 -1 -27 30 -7 -34 34 -14 -36 21 3 -29 32 -10 -27 42 -16 -30 42 -19 -33 41 -16 -18 35 -17 -32 41 -15 -26 35 -32
5955 -32 -29 34 -23 -20 47 -25 -15 43 -20 -16 33 -23 -23 39 -33 -17 26 -28 -17 27 -37 -9 23 -37 -6 20 -35 5 32 -26 7 21
5987 21 -34 3 13 -37 16 14 -29 11 11 -27 22 4 -27 24 13 -33 19 -3 -26 22 -6 -26 22 -4 -15 28 -14 -20 31 -19 -11 26
6019 26 -30 -14 19 -26 -11 25 -28 4 26 -28 15 25 -27 20 38 -30 16 21 -41 27 20 -34 33 4 -53 32 5 -38 43 -7 -37
6050 -37 42 -10 -46 46 -12 -30 52 -17 -37 53 -21 -30 49 -28 -47 58 -33 -29 63 -45 -16 64 -50 -17 64 -61 -3 68 -58
6079 -58 -10 76 -63 -2 69 -72 13 63 -79 18 69 -83 18 65 -93 35 65 -94 46 73 -96 54 54 -97 54
6104 54 49 -99 63 42 -104 79 37 -111 80 34 -114 93 29 -106 87 14 -117 116 13 -95 114 6 -93
6127 -93 123 5 -97 118 -25 -96 126 -22 -87 129 -34 -100 135 -45 -85 145 -60 -82 144 -67 -85 151
6149 151 -74 -50 147 -84 -48 149 -100 -48 147 -100 -30 146 -116 -25 131 -120 -18 135 -137 -8 139 -139
6171 -139 0 131 -139 18 131 -143 25 119 -138 33 111 -150 45 107 -162 55 90 -161 68 90 -164 76
6193 76 75 -160 85 71 -163 102 63 -160 102 57 -151 115 45 -153 133 34 -145 127 23 -148 130 4 -139
6216 -139 141 2 -131 142 -18 -121 152 -17 -137 156 -22 -112 158 -38 -101 147 -51 -99 140 -55 -92
6237 -92 139 -64 -88 150 -74 -67 149 -74 -59 137 -88 -64 144 -86 -42 143 -101 -17 136 -112 -18 134 -112
6260 -112 -17 136 -118 -14 123 -114 1 118 -113 4 108 -122 19 104 -124 31 96 -134 24 80 -126
6281 -126 38 80 -125 40 72 -120 41 67 -114 47 67 -111 51 53 -106 59 48 -100 65 42 -94 75 38
6304 38 -94 69 28 -102 69 14 -103 79 17 -81 66 8 -74 69 8 -76 80 -14 -77 71 -13 -65 71 -14 -63
6329 -63 73 -20 -57 67 -12 -54 61 -26 -53 67 -27 -47 59 -19 -31 68 -15 -34 58 -21 -38 48 -28 -35 46 -21 -38 39
6357 39 -22 -24 45 -27 -20 49 -30 -36 35 -15 -25 38 -20 -14 41 -10 -14 34 -31 -16 24 -17 -16 28 -26 -24 25 -25 -17 27 -32 -7 21 -28
6391 -28 -7 24 -21 -12 11 -32 -9 22 -21 -25 22 -19 -25 21 -17 -14 23 -24 -10 30 -17 -19 30 -14 -23 21 -23 -14 25 -16 -14 26 -22 -19 22
6426 22 -35 -21 26 -25 -15 26 -26 -19 25 -22 -16 29 -24 -12 32 -32 -10 29 -22 0 29 -30 -3 25 -26 -4 21 -34 -4 23 -32
6457 -32 -3 15 -28 7 28 -39 7 22 -32 9 27 -34 20 19 -34 14 15 -48 12 15 -42 12 8 -40 11 13 -27 28 13 -43 26 -3 -31
6490 -31 16 11 -22 24 -1 -34 32 1 -25 22 -11 -27 28 -6 -15 37 -12 -22 21 -18 -5 25 -14 -5 33 -32 -10 28 -23 -9 17 -31
6522 -31 -8 15 -27 -1 15 -30 -1 14 -34 9 10 -35 12 8 -30 10 17 -27 25 13 -24 34 -2 -34 34 -4 -34 27 -2 -25 19 -19
6554 -19 -23 38 -22 -10 38 -24 -10 38 -28 -17 39 -37 -23 39 -33 -21 33 -40 -5 43 -39 6 33 -44 14 45 -38 4 34 -54 5
6585 5 35 -49 30 32 -45 26 26 -56 35 14 -58 31 24 -57 50 16 -60 41 2 -60 48 10 -69 66 1 -63 69 -3 -68 68
6615 68 -10 -61 62 -23 -46 76 -25 -49 83 -29 -51 87 -31 -43 87 -35 -35 82 -49 -45 83 -44 -32 83
6639 83 -54 -34 88 -69 -33 89 -75 -14 76 -62 -14 71 -86 -18 84 -95 -2 72 -92 10 75 -90 20 76
6663 76 -104 30 72 -95 23 61 -104 31 59 -104 45 55 -103 51 47 -114 64 44 -114 57 37 -100 70
6686 70 34 -115 62 21 -106 79 16 -106 84 6 -103 82 9 -89 95 10 -98 87 -8 -85 93 -22 -84 98
6710 98 -18 -83 113 -34 -76 107 -35 -76 97 -46 -65 99 -46 -63 111 -63 -61 99 -67 -49 96 -64 -36
6733 -36 107 -70 -34 100 -81 -34 88 -88 -17 96 -89 -29 92 -90 -8 93 -82 -3 86 -79 15 88 -75
6756 -75 2 78 -88 22 78 -92 20 80 -94 23 64 -89 25 49 -95 38 48 -96 38 42 -90 47 31 -80
6780 -80 57 43 -95 57 26 -78 58 26 -85 51 27 -80 66 19 -80 66 23 -68 68 12 -75 70 1 -73
6804 -73 67 8 -58 57 3 -66 57 -13 -63 69 -11 -57 49 -21 -42 54 -20 -46 64 -24 -38 73 -14 -33 52 -27 -27
6831 -27 63 -42 -28 61 -33 -14 59 -27 -23 44 -35 -14 62 -38 -18 58 -34 -8 46 -31 -21 43 -36 -14 40 -35 -1 38 -20 -21
6861 -21 33 -30 -9 34 -28 -2 36 -26 -6 30 -29 -6 35 -19 4 46 -8 3 29 -19 -10 19 -34 0 21 -25 6 25 -20 -10 28
6892 28 -26 3 33 -30 -2 36 -30 -7 25 -35 7 24 -17 5 20 -21 6 12 -16 7 18 -27 6 26 -23 0 26 -14 1 28 -13
6923 -13 16 33 -20 10 25 -34 2 15 -31 -7 25 -23 7 25 -23 -6 17 -21 3 19 -25 21 22 -24 15 15 -22 18 17 -26 16 18
6955 18 -24 18 11 -36 25 9 -29 22 8 -23 28 7 -29 26 18 -22 28 19 -26 25 7 -27 11 5 -30 28 -4 -30 27 1 -18 36
6987 36 -5 -21 30 -7 -14 39 -17 -15 40 -11 -11 24 -13 -21 33 -19 -12 31 -24 -14 32 -16 -7 25 -26 -10 36 -17 10 20 -13 -4 16 -19
7021 -19 12 13 -23 9 17 -22 1 9 -31 11 13 -22 16 15 -28 13 7 -22 26 7 -21 22 5 -11 14 -1 -22 21 13 -29 26 -8 -19 16
7055 16 -6 -26 20 -15 -16 27 -20 -7 28 -21 -10 36 -10 -3 27 -29 -13 24 -18 0 20 -24 -2 19 -35 12 14 -25 10 25 -38 21
7087 21 16 -35 30 25 -36 23 23 -34 21 16 -36 20 12 -38 17 7 -45 25 -4 -42 30 -11 -40 39 -3 -31 30 -12 -31 41 -7 -26 50
7120 50 -16 -33 52 -7 -32 48 -22 -27 54 -23 -21 46 -24 -20 53 -45 -9 61 -35 -1 51 -39 -8 55 -38 -13 50 -49 -5 46 -46 1
7152 1 52 -49 1 42 -54 13 42 -73 23 39 -55 27 44 -56 22 39 -63 36 30 -61 42 32 -67 49 21 -63 38 14
7180 14 -60 56 18 -50 63 17 -61 54 6 -52 60 7 -47 64 -13 -63 67 -5 -51 60 -9 -55 65 -16 -62 65
7206 65 -21 -42 68 -26 -44 77 -27 -33 80 -16 -26 73 -33 -28 76 -37 -27 73 -48 -22 72 -51 -15 64 -55 -10
7232 -10 67 -52 -4 64 -58 -3 54 -63 3 50 -53 8 55 -68 7 43 -61 15 40 -57 21 37 -61 23 52 -65 31
7259 31 43 -65 42 32 -63 40 32 -63 36 21 -72 30 24 -63 38 15 -62 50 18 -63 42 9 -68 46 3 -61 55
7286 55 9 -54 51 -14 -52 49 -6 -42 56 -10 -56 61 -2 -41 53 -12 -34 55 -17 -40 54 -12 -39 62 -14 -26 44 -25
7314 -25 -31 43 -30 -17 49 -27 -27 42 -36 -29 51 -31 -21 43 -28 -14 42 -27 -15 49 -22 -7 44 -34 4 35 -34 -2 38 -26 -4 35
7346 35 -32 -9 46 -27 0 42 -28 8 34 -33 0 25 -35 5 23 -35 11 29 -27 5 15 -28 8 12 -32 -2 24 -28 11 15 -25
7377 -25 18 13 -19 23 13 -25 17 26 -25 18 18 -24 15 13 -24 12 2 -28 6 15 -25 10 21 -23 17 11 -16 18 16 -24 7 2 -22 15
7411 15 9 -24 3 3 -22 11 4 -22 12 7 -22 22 7 -22 19 8 -11 24 11 -20 26 9 -25 20 2 -27 16 6 -13 19 -7 -14 13
7444 13 5 -15 17 3 -15 23 7 -14 14 4 -29 9 -1 -16 12 -2 -15 14 -5 -16 25 -7 -10 26 -9 -6 29 -1 -19 33 -5 -5
7476 -5 36 -13 -24 35 -4 -8 29 -19 -17 25 -8 -2 16 -31 -10 15 -17 0 11 -24 1 19 -14 -6 22 -14 0 19 -11 2 24 -20 8
7509 8 11 -26 7 17 -28 7 15 -20 5 2 -16 13 13 -19 6 11 -16 6 8 -25 15 -2 -19 6 3 -15 15 -4 -22 15 3 -28 19 0
7543 0 -16 14 -6 -17 23 -7 5 20 -3 -4 20 4 1 25 -4 -19 22 -13 -11 22 -16 -10 16 -25 -8 22 -28 -6 24 -15 -5 9 -18
7576 -18 -3 16 -27 5 15 -28 10 11 -17 8 4 -21 11 3 -18 11 17 -30 23 6 -18 21 15 -15 26 -9 -17 21 -6 -18 30 -4 -19
7609 -19 12 -8 -14 25 -5 -34 29 -6 -16 23 -11 -26 23 -23 -16 28 -25 -11 18 -28 -9 33 -26 -9 25 -26 5 24 -33 3 31
7640 31 -30 10 33 -34 4 39 -24 20 28 -41 15 16 -39 13 9 -45 10 19 -37 19 8 -50 15 10 -42 20 2 -50 29 15 -41 31 5
7673 5 -44 32 5 -47 34 -2 -46 40 -5 -50 32 -7 -33 49 -14 -40 48 -17 -21 38 -15 -25 42 -25 -29 50 -28 -31 46 -37 -24 32
7705 32 -40 -34 36 -39 -27 35 -43 -16 35 -38 -4 45 -40 -5 41 -43 -2 43 -47 -5 49 -51 1 43 -46 -1 49 -50 0 29
7735 29 -52 17 36 -49 10 28 -46 15 26 -54 13 27 -54 20 22 -49 19 20 -50 19 13 -58 42 20 -51 35 12 -46 42 6 -35
7766 -35 39 9 -46 41 0 -45 31 2 -42 38 -1 -31 39 -12 -56 32 -7 -46 29 -10 -35 39 -10 -34 35 -6 -38 42 -29 -32 51
7797 51 -26 -26 45 -15 -25 52 -19 -7 45 -28 -22 39 -23 -12 42 -37 -20 55 -17 -2 27 -31 -7 40 -31 -5 26 -34 -2 26 -31
7828 -31 -5 39 -23 4 31 -31 -8 28 -26 4 37 -30 6 32 -29 12 27 -30 7 18 -27 10 23 -27 9 18 -36 8 17 -38 18
7859 18 14 -22 6 24 -34 17 13 -31 9 -3 -34 19 11 -41 17 12 -40 13 7 -23 18 6 -28 17 11 -22 18 9 -26 26 5 -17 22 15
7893 15 -19 26 0 -25 21 -6 -27 5 5 -33 11 1 -24 15 -8 -12 24 2 -22 27 -9 -26 18 -10 -20 3 0 -25 14 -12 -10 18
7925 18 -7 -18 17 -11 -12 19 -2 -4 17 -2 -8 24 -13 -17 22 -3 -10 23 -15 -11 5 -16 -21 11 -25 -14 16 -18 -6 22 -19 -17 19 -18
7959 -18 -7 20 -12 -13 18 -10 -5 26 -10 -17 24 -20 -3 19 -24 -2 23 -17 0 24 -15 8 15 -14 -1 22 -18 3 26 -21 1 9 -21
7992 -21 9 11 -26 6 14 -19 -1 16 -30 14 13 -24 9 8 -20 9 14 -11 11 9 -13 8 6 -26 23 -2 -23 22 3 -18 10 1 -23 17
8026 17 3 -23 16 -2 -20 16 -4 -16 25 -5 -13 18 -7 -12 14 -9 -22 24 -11 -26 24 -11 -12 22 -3 8 27 -28 1 22 -2 -3
8058 -3 32 -12 12 20 -12 -3 18 -20 4 14 -28 -2 9 -33 3 9 -27 8 12 -24 13 17 -16 10 10 -22 19 6 -33 9 12 -23 14 6 -31
8093 -31 22 5 -27 24 1 -15 24 -6 -25 28 0 -21 30 -10 -13 20 -16 -18 19 -11 -21 20 -4 -11 24 -13 -15 24 -20 -14 24 -20 -9
8126 -9 22 -21 -9 23 -21 0 32 -32 10 32 -23 9 31 -33 2 17 -15 19 27 -41 16 21 -26 16 26 -30 13 15 -34 10 12 -24 13
8159 13 8 -32 27 9 -44 27 -6 -38 24 -1 -36 35 -3 -35 29 -1 -28 37 2 -31 45 -12 -35 45 -7 -27 40 -23 -28 62 -13
8190 -13 -24
8191b4
$$ Imaginary data points
##PAGE= N=2
##DATA TABLE= (X++(I..I)), XYDATA
0 0 0 0 0 0 0 0 0 0 0 0 0 0 0 0 0 0 0 0 0 -4 8 -8 8 -8 12 -15 16 -20 24 -25 29 -36 40 -44 52 -60 68 -76 85 -96
40 -96 107 -120 134 -148 165 -184 203 -225 247 -273 300 -331 365 -401 441 -484 532 -585 645 -711
60 -711 782 -864 952 -1046 1135 -1196 1143 -663 -1849 27239 274424 54679 -5373 73804
74 73804 -171644 17079 159687 -197224 -109696 139062 -23228 80017 96843 -194447 26929
85 26929 213373 -105279 -99066 -38444 -151745 146605 233413 -109270 -21868 70486 -109495
96 -109495 19450 -225 -194932 90445 199570 -59923 1160 -5328 -114098 129778 79866
107 79866 -208206 -40445 55586 -17491 151859 48447 -147495 68694 51222 -149885 -17224
118 -17224 -15649 -36698 200022 75282 -155940 4655 12337 -48378 88725 -49959 -142700
129 -142700 105096 75212 -41566 68539 -23642 -64595 92767 -56325 -153502 54123 56548
140 56548 40427 120561 -66247 -122362 64018 -5580 -56323 45948 -37912 -9787 122905
151 122905 -22797 -68936 58693 -14242 -25454 29506 -99484 -45627 126755 42451 3117
162 3117 29229 -87495 -40807 56920 -53261 -27034 75206 2542 19599 40128 -80375
173 -80375 -21044 68831 -31983 -28715 6649 -50117 42085 95297 -25728 -16799 9352 -64214
185 -64214 -10642 20054 -40449 41429 77587 -21212 -11686 -10400 -56204 24176 37420 -44924
197 -44924 -1999 21499 -12884 41373 26567 -42474 1904 -1803 -52236 1617 19074 5028
209 5028 58545 23943 -49854 -18353 -13402 -22279 30895 12746 -20851 22818 10877 -16536 17356
222 17356 -1181 -22961 8400 -16412 -30649 22974 26612 16231 28032 -18680 -43951 -7559
234 -7559 -8153 -1072 31908 11096 -2612 11372 -13915 -16931 11287 -1971 -7909 3422 -13808
247 -13808 -3734 26519 15469 5791 1216 -26929 -25777 -2041 2151 17398 28095 5237 -7810
260 -7810 -10100 -18444 -4936 10503 3140 946 530 -5618 3973 12871 5594 -424 -9603 -20067 -11797
275 -11797 4272 14967 21205 12760 -5850 -16317 -16666 -8292 5194 11836 9329 2204 -4833 -5001
289 -5001 168 4723 4772 -2961 -10884 -9722 -2301 9238 17575 11314 -1332 -11180 -17853 -11605 3742
304 3742 11564 13384 8515 -5398 -10769 -5155 -876 5119 6270 -3695 -7263 -2878 497 8901 12529
319 12529 1992 -6986 -11650 -13634 -2056 11580 13102 9700 248 -12144 -11235 -2783 2780 8121
333 8121 6112 -3182 -5678 -2829 894 7057 7193 -1154 -8088 -9938 -5764 4510 12428 10814 2038
348 2038 -7386 -11881 -8422 1442 8910 7913 3245 -3070 -8391 -3825 3759 4632 4830 165 -9649 -7027
364 -7027 1539 4469 10508 7996 -6753 -9131 -6261 -6318 6718 12753 2029 866 -3420 -13217 -803
379 -803 8212 1451 6045 487 -14030 -1678 6101 -38 10294 4603 -13705 -3475 -1383 -7559
393 -7559 12768 12190 -6019 1856 -5965 -16794 8821 10634 -3850 8855 -3233 -17476 7859
406 7859 5050 -6377 14509 449 -17181 5356 -3204 -9056 21787 6191 -13773 5685 -10502
419 -10502 -14193 21393 4515 -9543 13970 -9270 -16391 16494 -3100 -7146 22613 -7702 -18056
432 -18056 12405 -8843 -3811 28759 -7737 -16456 12480 -14798 -6433 27284 -8625 -7372 20121
445 20121 -18961 -12184 21343 -11599 940 25960 -22468 -13100 19556 -14858 4668 27196
457 27196 -24015 -7792 19205 -23023 2488 27237 -20081 3338 19354 -32737 -1009 24970
469 24970 -18972 11311 19417 -35558 2573 22032 -23932 13789 19725 -32871 8376 15466 -31912
482 -31912 16475 22759 -27037 14037 8013 -38518 17947 20428 -25419 20516 7482 -37165 19778
495 19778 11781 -29103 25811 9005 -33710 20976 2797 -30573 32180 9580 -30708 22606
507 22606 -5091 -32566 33778 5622 -25959 30667 -6632 -32764 30852 -3917 -23943 37296
519 37296 -7420 -29625 30928 -10938 -21343 40737 -10420 -25791 31119 -18794 -20817 41644
531 41644 -11490 -16853 34853 -24487 -21618 36682 -17846 -10858 38735 -24349 -15793 33875 -24906
544 -24906 -7900 38845 -25662 -11097 29971 -30375 -2883 40062 -24977 -4538 27342 -35525
556 -35525 -2413 33420 -28198 4645 31836 -33460 319 24833 -33963 9849 31078 -34573
568 -34573 3763 21418 -33280 16455 27745 -36057 8774 17792 -37037 15248 21017 -31801
580 -31801 22102 19229 -39490 12153 12069 -31285 27025 14786 -38008 18684 11492 -29444 26301
593 26301 7141 -34918 23939 5259 -33232 25328 7574 -23083 30698 -2452 -37439 22649
605 22649 2860 -20368 31029 -4310 -27748 29073 -2590 -24347 26416 -6533 -20178 29114
617 29114 -11139 -23187 31634 -1915 -13910 24485 -20367 -21988 30842 -6959 -11809 27696
629 27696 -14330 -11905 26817 -19521 -14642 28295 -12001 -7444 22485 -21848 -5606 32019 -14497
642 -14497 -9229 16402 -23585 -1970 27085 -17519 -935 23859 -18663 -3232 13945 -24703
654 -24703 3383 25451 -17108 -504 13378 -19662 8208 18547 -22922 -360 12284 -18168
666 -18168 8013 14314 -17215 10450 13625 -22399 -11 5590 -15282 15548 13187 -18902 5870
679 5870 7054 -15041 10099 3986 -18449 10452 6715 -14834 10502 5860 -10530 12870 -924
692 -924 -20997 6724 4181 -6280 15888 1066 -13744 9732 -1199 -12617 9324 -700 -7549
705 -7549 12800 -1949 -10015 11462 797 -6393 7118 -8453 -10427 11278 1753 -1674 10792
718 10792 -4175 -7253 5433 -7102 -5857 9876 -3 -1040 6922 -5862 -3422 8075 -3283
731 -3283 -4031 2886 -6149 -833 8819 -561 944 5312 -6027 -4896 467 -5016 2170 8567 -316
746 -316 -14 1317 -5387 -530 2909 -3542 -395 2038 -2369 2091 4237 -547 1179 -196 -5997 -3059
762 -3059 124 684 5199 4555 -700 -1378 -2556 -3641 -291 1077 532 1499 753 -93 938 1001 193 -1211
780 -1211 -2843 -2620 -1024 1726 4163 3254 1163 -1113 -4204 -3679 -658 436 2559 3341 -3 -413
796 -413 376 -1620 -305 558 -2507 -1231 743 -345 2862 4170 -160 -862 -2211 -5476 -1206 2454
812 2454 1311 3820 2718 -2541 -1032 -698 -3096 798 1349 -1896 1158 1422 -811 3015 1919 -2857
828 -2857 -1298 -2433 -3780 2278 3563 1363 3409 -3 -4301 -1287 -1412 -1778 2935 1671 -909 1755
844 1755 111 -1235 1970 -442 -3001 -503 -1449 -870 3730 2731 830 1139 -2619 -4120 -883 -335
860 -335 1057 3575 1202 -638 119 -1215 -1051 585 -704 -1214 8 73 1018 2404 1511 -170 -1617
877 -1617 -2816 -2431 -225 2174 2733 1827 518 -1547 -2158 -551 -456 -328 1290 179 -492 1469 447
894 447 -69 1664 -1314 -3211 -523 -980 572 4655 1285 -1123 741 -2898 -2901 1866 -702 -65 4173
911 4173 -904 -1876 2405 -1740 -785 3286 -3497 -2967 3206 -1100 1163 5393 -2948 -2010 2639 -5015
927 -5015 -1918 4573 -1913 1886 5413 -5439 -1947 4054 -3981 737 3954 -6397 507 6097 -4183
942 -4183 1463 4512 -6319 843 3234 -8198 1659 6825 -3711 3513 2719 -9617 2150 5100
956 5100 -6780 2993 3361 -7164 5379 4101 -8822 4096 3919 -7698 4082 577 -9190 8260
970 8260 5776 -7630 4527 -599 -9324 8166 1741 -9457 7872 2318 -7352 7805 -1993 -9531
984 -9531 10628 971 -9568 6941 -2285 -6033 13332 -1566 -10394 8592 -2700 -6902 10608
997 10608 -4635 -6796 13854 -2740 -8524 8491 -5955 -4179 14009 -6676 -8575 11153 -4261
1010 -4261 -2769 11843 -9451 -5730 13074 -7181 -5179 10567 -7552 33 13649 -11559 -5991
1023 -5991 11176 -7392 675 10870 -13036 -1052 13727 -9698 -1069 9098 -11789 2943
1035 2943 11331 -14501 103 11806 -9243 4379 7209 -16803 3584 11917 -11778 3703 6801
1048 6801 -13307 7789 8390 -16017 4730 8198 -11459 7617 3712 -15943 9676 8966 -12768
1061 -12768 6209 1792 -13484 11689 4862 -14602 8929 4165 -11110 10109 -562 -14101
1073 -14101 12806 3919 -12166 8788 -1513 -10244 14764 -89 -13532 10327 -844 -8921
1085 -8921 12670 -3891 -10424 14702 -1644 -10489 10203 -5303 -6591 15836 -5197 -10349 11938
1098 11938 -4524 -5144 13190 -8428 -7202 14233 -6189 -6137 11432 -7850 -2509 14105 -9909
1111 -9909 -6402 11580 -7114 -826 11770 -11190 -2890 12488 -8695 -1801 9701 -10023 811
1124 811 11063 -11378 -1195 10206 -8394 2090 7963 -12615 1178 10081 -9105 2152 6900
1137 6900 -10730 3765 7534 -11410 2868 7220 -9044 4605 4631 -11636 5247 6874 -9348
1150 -9348 4411 3073 -10205 6717 4527 -9840 5843 3345 -8846 6287 1373 -9475 7691
1163 7691 3055 -8307 5982 94 -7876 8243 1107 -8051 6502 -157 -6703 7421 -705 -6483
1177 -6483 7740 -676 -6547 6113 -1791 -4753 8070 -1524 -5662 6065 -2184 -3981 6936 -2546
1191 -2546 -4084 6466 -2729 -3662 5997 -2753 -2367 6256 -3701 -3357 5342 -2911 -1267 5752 -3830
1206 -3830 -2079 4840 -3716 -1109 4946 -3528 -617 4347 -4200 -712 4328 -3291 163 3503 -4319
1221 -4319 -183 3561 -3173 856 3151 -3738 296 2383 -3495 1061 2823 -2888 881 1693 -3325
1236 -3325 1079 2102 -2450 1136 1186 -2879 1076 1419 -1929 1505 979 -2447 727 515 -1741 1615
1252 1615 1009 -1589 848 28 -1646 1152 553 -998 979 -110 -1300 894 293 -517 968 -240
1268 -240 -1118 383 -81 -175 1018 135 -468 73 -523 -348 517 229 118 108 -360 -203 106 198 275 -140 -245
1289 -245 -171 -358 281 581 -19 217 -82 -932 -33 303 -211 729 338 -825 199 41 -662 754 301
1308 301 -846 453 -34 -806 999 425 -709 648 -387 -1231 842 236 -452 1260 -143 -1151 723
1325 723 -342 -762 1317 -119 -864 973 -447 -679 1391 -261 -775 894 -859 -821 1372 -196 -222
1342 -222 1305 -886 -941 878 -713 -218 1444 -606 -431 958 -877 -219 1204 -760 -325 783 -1021
1359 -1021 -101 1258 -470 115 745 -1220 -403 673 -611 410 997 -716 -66 400 -893 159 663
1376 663 -631 80 342 -666 300 670 -320 91 8 -807 -67 346 -18 475 374 -365 -244 -168 -271 120
1396 120 316 61 -109 -8 60 -17 193 174 -414 -224 73 -308 298 700 -176 75 118 -978 -111 602 -403
1417 -403 443 638 -924 143 609 -947 322 624 -1183 324 669 -1121 832 1012 -1310 439 250
1434 250 -1822 945 1024 -1358 1174 608 -1925 1085 438 -1982 1482 623 -1967 1552 309 -1975
1450 -1975 2145 384 -2418 1610 -173 -2177 2569 236 -2156 2476 -276 -2502 2324 -611 -2171
1465 -2171 3161 -409 -2390 2779 -817 -1983 3324 -1213 -2543 3137 -1113 -1825 3611 -1442 -1837
1480 -1837 3673 -1978 -2290 3432 -1851 -1139 4171 -2476 -1828 3886 -2385 -1194 3785 -3199 -1047 4330
1496 4330 -3023 -873 4057 -3267 -276 3894 -4388 -607 4333 -3397 431 3795 -4659 376 4120
1511 4120 -4542 431 3595 -4480 1496 3697 -5239 1273 3813 -4693 1575 2627 -5601 2434 3779
1526 3779 -5016 2108 2508 -5317 2919 2404 -5890 2985 2795 -4956 3290 1442 -5739 4126 2135 -5710
1542 -5710 3349 1019 -5009 4984 1059 -5802 4438 798 -5114 4571 -396 -5122 5958 325
1556 325 -5263 4758 -916 -4343 6120 -1358 -5213 5727 -953 -3792 5872 -2386 -4089 6541
1570 6541 -2144 -4246 5585 -2509 -2551 6783 -3377 -3844 6003 -2863 -2386 5839 -4150 -2294 6710 -3588
1586 -3588 -2395 5468 -4088 -1110 6000 -5055 -1885 5997 -3766 -438 5107 -5555 -583 5829
1600 5829 -4866 -502 4799 -4931 965 5062 -5995 189 4919 -4932 1160 3755 -6148 1825
1614 1825 4862 -5427 1387 3207 -5687 2641 3437 -6197 2361 3547 -5084 2828 2034 -6117 3449
1629 3449 2956 -5496 2803 1639 -5044 4201 1754 -5736 3399 1509 -4733 3779 529 -4952 4596
1644 4596 1234 -4809 3447 -19 -4105 4717 27 -4624 4093 95 -3528 4223 -1016 -3843 4666
1659 4666 -600 -3652 3944 -1118 -2582 4807 -1630 -3425 4064 -1392 -2182 4223 -2207 -2253 4522 -1939
1675 -1939 -2175 3709 -2344 -1305 4146 -2724 -1702 3853 -2148 -759 3422 -3135 -943 3670 -2568
1690 -2568 -610 3127 -2694 -41 3118 -3115 -419 2930 -2482 237 2436 -3031 335 2736 -2586
1705 -2586 251 1948 -2756 714 2072 -2722 683 2000 -2343 793 1295 -2716 1046 1679 -2256
1720 -2256 934 1057 -2235 1314 1068 -2285 1108 856 -1972 1260 582 -1888 1493 664 -1850 1062
1736 1062 170 -1568 1513 321 -1515 1241 103 -1318 1238 -58 -1228 1274 -36 -1133 1051
1751 1051 -109 -799 1167 -256 -990 848 -229 -596 988 -208 -581 805 -326 -589 681 -229
1767 -229 -318 671 -311 -371 564 -178 -171 451 -321 -264 350 -186 -54 401 -118 -100 125 -235 -86 205 -12 39
1789 39 59 -102 -30 20 33 23 -45 6 -53 -109 159 68 -70 161 -117 -273 192 -31 -128 354 -66 -249 275 -167
1813 -167 -216 440 -136 -232 395 -259 -217 540 -216 -214 465 -386 -259 544 -302 -107 614 -401 -210 486 -489
1834 -489 -78 631 -470 -102 537 -560 -29 608 -533 -20 505 -636 7 553 -537 137 515 -674
1852 -674 40 427 -630 230 516 -620 177 384 -660 247 425 -601 272 302 -650 305 350 -545 357
1871 357 221 -661 278 199 -524 411 225 -529 302 69 -510 381 134 -429 341 30 -434 353 84 -328
1891 -328 339 -37 -373 272 5 -207 327 -7 -256 169 -80 -160 245 6 -117 135 -55 -105 127 26 -22
1912 -22 34 -30 -60 -26 69 67 -28 47 -31 -203 67 67 -125 172 41 -290 153 51 -276 288 69 -375 292 21
1936 21 -415 427 79 -437 419 -76 -525 552 12 -486 631 -126 -602 676 -173 -568 821 -199 -600
1955 -600 831 -339 -579 1016 -367 -606 977 -549 -561 1167 -561 -525 1173 -731 -540 1209 -824
1972 -824 -408 1355 -921 -444 1299 -1042 -281 1454 -1144 -292 1422 -1244 -139 1498 -1345 -57
1988 -57 1496 -1502 -46 1467 -1538 193 1520 -1719 173 1449 -1759 394 1452 -1917 468
2003 468 1410 -1990 628 1359 -2045 811 1239 -2241 899 1211 -2174 1170 1054 -2364 1267 972 -2343
2020 -2343 1469 849 -2373 1644 699 -2436 1790 601 -2373 1946 345 -2451 2117 307 -2336
2035 -2336 2241 57 -2371 2335 -90 -2297 2480 -205 -2222 2526 -456 -2171 2680 -546 -2088
2050 -2088 2709 -791 -1973 2844 -896 -1880 2864 -1124 -1775 2898 -1285 -1574 3010 -1461 -1471 2967
2066 2967 -1701 -1287 3046 -1832 -1114 3011 -2039 -912 3026 -2179 -708 2938 -2407 -540 2917
2081 2917 -2486 -256 2860 -2645 -119 2707 -2793 112 2675 -2840 310 2521 -2962 501 2454
2096 2454 -2993 662 2256 -3084 868 2178 -3084 1060 2037 -3130 1159 1808 -3140 1433 1763 -3115
2112 -3115 1502 1504 -3113 1732 1355 -3123 1851 1157 -3051 2016 947 -2986 2194 756 -2971 2229
2128 2229 520 -2784 2488 309 -2784 2500 87 -2622 2602 -151 -2497 2732 -300 -2401 2711
2143 2711 -481 -2141 2807 -747 -2131 2785 -776 -1824 2811 -1037 -1745 2792 -1144 -1612 2716
2158 2716 -1234 -1344 2721 -1428 -1313 2657 -1411 -1064 2523 -1654 -937 2568 -1627 -791 2403 -1746
2174 -1746 -590 2318 -1883 -475 2286 -1788 -248 2058 -2002 -99 2058 -1966 14 1846 -1992
2189 -1992 252 1773 -2041 328 1634 -1984 454 1412 -2021 680 1429 -1942 674 1130 -1928 847
2205 847 1062 -1906 865 969 -1782 934 762 -1755 1023 705 -1707 952 541 -1542 1129 481 -1552
2222 -1552 1035 360 -1414 1066 251 -1318 1136 202 -1256 1039 84 -1095 1090 -26 -1096 1055
2238 1055 -25 -901 1062 -171 -876 1011 -229 -779 976 -233 -624 970 -345 -621 875 -328
2254 -328 -477 818 -413 -424 787 -377 -352 691 -406 -300 633 -409 -223 621 -332 -163 488 -400
2272 -400 -153 470 -321 -101 403 -294 -57 349 -277 -41 293 -236 -62 217 -192 7 229 -146 -34 113
2292 113 -153 -26 122 -75 -14 83 -45 -42 25 -18 -35 14 10 -69 2 81 -49 -3 85 -120 -48 109 -123 6 200
2317 200 -136 -37 179 -197 -6 224 -206 10 228 -252 26 257 -264 39 242 -344 36 255 -324 122
2337 122 273 -382 79 228 -416 145 258 -404 178 222 -439 186 215 -440 224 168 -473 244 199 -437 304
2358 304 158 -464 283 104 -439 357 128 -420 348 55 -431 368 52 -405 382 -5 -398 394 2 -355
2378 -355 395 -57 -363 360 -91 -304 428 -79 -290 370 -140 -273 379 -133 -215 364 -165 -188 353 -167 -159
2399 -159 316 -202 -147 291 -172 -68 298 -172 -72 226 -181 -37 207 -140 -8 175 -150 -9 130 -127
2419 -127 6 91 -111 7 53 -64 36 25 -54 -3 -46 -13 22 -28 58 15 -85 59 -23 -97 133 -26 -124 172 -54
2444 -54 -122 241 -81 -169 257 -126 -180 315 -137 -146 372 -210 -205 399 -257 -146 481 -325 -167 508 -360 -135 529
2467 529 -448 -100 576 -530 -74 596 -563 18 606 -698 15 638 -721 123 647 -816 199 665
2485 665 -881 243 624 -911 366 609 -1032 423 633 -1014 514 525 -1145 618 558 -1144 658
2502 658 477 -1187 790 403 -1279 859 406 -1241 940 258 -1323 1092 270 -1340 1091 117 -1311
2519 -1311 1262 34 -1348 1351 -22 -1291 1386 -223 -1286 1586 -251 -1254 1561 -418 -1146
2534 -1146 1714 -565 -1176 1749 -632 -1026 1787 -861 -943 1905 -943 -930 1829 -1099 -716 1949 -1254
2551 -1254 -738 1926 -1288 -552 1892 -1507 -437 1985 -1536 -388 1872 -1636 -145 1917 -1819
2566 -1819 -156 1902 -1788 72 1781 -1985 196 1820 -2010 278 1669 -2054 538 1637 -2220
2581 -2220 573 1571 -2146 791 1365 -2326 961 1358 -2289 1032 1137 -2293 1296 1008 -2397 1359
2597 1359 919 -2255 1521 655 -2339 1701 648 -2269 1717 385 -2174 1944 269 -2206 1969
2612 1969 153 -2036 2037 -101 -2029 2194 -127 -1945 2127 -344 -1791 2271 -484 -1789 2262
2627 2262 -563 -1599 2285 -796 -1520 2385 -857 -1434 2275 -1041 -1202 2372 -1183 -1166 2297 -1262
2643 -1262 -929 2251 -1472 -791 2288 -1529 -658 2147 -1629 -400 2155 -1764 -347 2043 -1757 -101
2659 -101 1934 -1913 36 1885 -1913 141 1715 -1953 353 1644 -2042 397 1538 -1959 567
2674 567 1377 -2035 667 1312 -1979 729 1149 -1954 874 1049 -1975 917 955 -1881 1014 778 -1881
2691 -1881 1105 717 -1796 1156 538 -1726 1263 445 -1681 1281 316 -1567 1332 150 -1503 1399
2707 1399 83 -1394 1376 -89 -1296 1427 -186 -1220 1408 -287 -1091 1382 -390 -995 1392
2722 1392 -440 -903 1330 -526 -761 1327 -586 -707 1259 -623 -586 1211 -671 -509 1179 -686
2738 -686 -435 1084 -705 -344 1053 -728 -287 976 -725 -185 924 -738 -132 862 -735 -68 795
2755 795 -719 -14 710 -736 36 629 -692 92 556 -679 128 477 -642 171 424 -621 204 361
2773 361 -575 239 316 -524 237 242 -482 239 199 -436 254 152 -401 228 122 -349 217 98 -291 192 71
2794 71 -250 174 58 -206 150 26 -185 125 21 -141 99 15 -126 59 21 -79 47 11 -58 6 8 -23 -10
2817 -10 23 4 -47 27 16 -66 59 36 -94 75 28 -125 101 48 -143 110 44 -157 126 39 -175 151 21 -203
2841 -203 173 8 -199 208 -9 -217 210 -31 -217 246 -35 -227 257 -68 -223 275 -78 -213 304 -120
2861 -120 -200 315 -128 -175 324 -155 -181 336 -161 -146 349 -174 -127 334 -213 -112 337 -231 -97 322 -232 -79
2883 -79 308 -251 -53 300 -280 -42 273 -279 -11 275 -282 -5 243 -281 33 232 -264 51 215 -271
2903 -271 68 182 -259 87 158 -247 80 145 -221 117 122 -212 111 97 -200 102 87 -161 106 43 -162 89
2925 89 37 -123 77 8 -111 70 2 -72 55 -6 -43 21 -11 -13 1 3 19 -25 -8 30 -41 8 69 -80 25 74 -103
2952 -103 37 98 -146 52 98 -192 75 119 -217 109 122 -249 130 125 -294 179 136 -321 209 127 -372 259 123
2975 123 -396 289 88 -432 347 78 -459 391 46 -484 442 2 -489 512 -23 -484 560 -80 -505
2994 -505 618 -122 -514 660 -188 -484 721 -253 -473 770 -329 -462 794 -400 -422 870 -458
3011 -458 -410 880 -527 -360 906 -600 -330 944 -672 -277 956 -748 -224 993 -822 -171 982
3028 982 -862 -83 1010 -967 -42 1001 -1015 44 992 -1082 140 993 -1160 208 952 -1203
3044 -1203 323 902 -1278 407 872 -1296 496 784 -1366 619 734 -1413 702 653 -1409 827
3060 827 565 -1460 915 499 -1432 1004 379 -1440 1120 316 -1433 1172 206 -1410 1273 97
3076 97 -1412 1354 30 -1356 1403 -100 -1330 1491 -162 -1288 1518 -271 -1232 1586 -408 -1201
3092 -1201 1636 -483 -1121 1632 -633 -1047 1705 -714 -993 1675 -831 -832 1731 -960 -773 1731 -1038
3109 -1038 -625 1687 -1167 -501 1713 -1236 -410 1641 -1301 -240 1609 -1419 -164 1569 -1445 -14
3125 -14 1481 -1539 114 1458 -1589 182 1361 -1601 333 1292 -1688 405 1244 -1672 514 1113
3141 1113 -1720 613 1075 -1721 684 952 -1697 821 849 -1744 893 787 -1662 982 638 -1675
3157 -1675 1093 572 -1635 1133 429 -1554 1237 299 -1546 1283 207 -1430 1315 31 -1388 1407
3173 1407 -47 -1322 1389 -168 -1203 1443 -294 -1160 1443 -357 -1045 1428 -482 -956 1461 -531
3189 -531 -884 1409 -616 -763 1412 -697 -710 1392 -726 -610 1348 -808 -515 1345 -839 -443 1267
3206 1267 -878 -320 1228 -931 -269 1186 -932 -161 1102 -984 -81 1060 -1005 -25 960 -1000
3222 -1000 89 904 -1032 141 826 -999 221 742 -1015 297 690 -984 338 604 -944 411
3238 411 508 -935 431 456 -875 472 380 -853 519 322 -820 519 262 -761 545 206 -726 551
3256 551 164 -670 536 101 -638 547 60 -584 525 4 -545 526 -28 -497 515 -53 -443 475
3274 475 -105 -386 476 -117 -336 445 -147 -289 434 -164 -233 408 -169 -192 367 -173 -144 341 -186 -128 291
3295 291 -193 -92 264 -183 -73 232 -173 -47 190 -160 -39 160 -156 -24 139 -130 -21 108 -117 -2
3315 -2 92 -95 -8 61 -71 -12 44 -32 -2 34 -19 -9 14 -2 0 18 26 -14 -11 32 -22 -13 44 -42 -19 66 -62 -30 83 -77
3345 -77 -29 92 -85 -28 95 -101 -13 119 -110 -11 119 -129 -11 134 -145 12 134 -165 20 134 -170 27
3367 27 134 -180 47 131 -190 78 129 -195 84 122 -199 98 115 -209 112 93 -204 118 84 -207 128 65 -209
3390 -209 143 52 -206 157 42 -207 143 35 -194 169 16 -182 164 11 -171 177 -6 -158 174 -19
3410 -19 -147 175 -17 -134 162 -37 -118 161 -44 -87 163 -48 -88 140 -64 -71 133 -62 -61 118 -78 -51 112
3433 112 -65 -43 92 -68 -30 75 -62 -14 60 -38 -11 38 -28 6 26 -18 -4 3 0 8 5 20 -3 -18 27 0 -24 41 -21
3462 -21 -48 74 -32 -39 89 -39 -58 101 -53 -66 128 -59 -75 143 -92 -68 155 -116 -73 186 -137 -71 199
3485 199 -167 -56 228 -181 -69 247 -197 -39 259 -238 -20 283 -259 1 301 -298 19 293 -332 46
3505 46 304 -363 71 301 -388 99 282 -422 120 277 -452 167 265 -483 213 244 -501 262 226 -525 290
3526 290 202 -541 344 178 -549 383 151 -559 428 121 -564 472 92 -571 513 59 -568 553 24
3545 24 -565 592 -21 -569 622 -70 -562 658 -119 -555 682 -173 -540 715 -228 -520 736 -271
3563 -271 -494 763 -328 -450 787 -388 -413 805 -430 -366 813 -486 -309 819 -542 -247 813
3580 813 -600 -191 805 -637 -134 807 -674 -83 787 -720 -22 772 -765 26 755 -807 64 725
3598 725 -831 130 697 -867 175 671 -891 238 650 -919 284 609 -933 355 577 -939 413
3615 413 514 -943 481 476 -940 537 417 -945 585 359 -931 630 283 -922 683 231 -901
3632 -901 726 154 -876 767 83 -842 793 16 -811 823 -49 -779 841 -116 -742 868 -170
3649 -170 -697 879 -225 -650 901 -297 -602 916 -334 -553 908 -379 -501 921 -422 -454 916
3666 916 -465 -404 912 -509 -342 899 -553 -304 877 -594 -233 840 -636 -177 808 -661 -120
3683 -120 776 -690 -70 743 -711 -11 706 -727 56 655 -724 114 603 -738 152 549 -747 203
3701 203 520 -736 255 467 -723 291 424 -706 331 379 -703 364 336 -694 380 299 -668 401
3719 401 251 -653 434 207 -635 433 149 -615 442 115 -586 472 76 -546 481 37 -517 485
3737 485 14 -472 490 -42 -441 480 -67 -391 490 -99 -361 481 -129 -329 467 -152 -277 438 -173 -239
3757 -239 433 -194 -217 414 -200 -176 385 -215 -163 377 -229 -136 344 -244 -112 325 -246 -83 295 -243 -54
3778 -54 277 -245 -53 256 -234 -19 238 -228 -3 227 -207 17 202 -195 32 189 -190 53 169 -177
3798 -177 45 136 -174 50 100 -160 62 93 -141 53 72 -123 53 50 -115 47 36 -97 42 26 -90 44 22
3821 22 -70 31 18 -53 22 23 -40 21 25 -21 21 26 -10 10 25 6 4 37 7 -8 37 14 -22 31 11 -30 34 11 -40 30 1 -47
3853 -47 37 15 -52 38 11 -58 49 11 -76 60 24 -82 64 17 -76 77 14 -70 90 7 -82 96 6 -75 106 -2
3879 -2 -74 113 -7 -83 111 -12 -62 116 -30 -78 104 -59 -78 111 -57 -72 122 -55 -67 112 -76 -65 111
3902 111 -80 -50 112 -77 -35 119 -77 -35 118 -89 -24 112 -85 -18 106 -85 -12 102 -91 1 95 -98 13
3925 13 98 -86 20 79 -92 16 74 -92 17 68 -80 31 49 -83 33 39 -79 32 34 -79 34 27 -51 38 25
3950 25 -50 39 26 -41 43 15 -28 40 5 -22 37 4 -8 13 2 -5 17 -5 3 0 -15 17 -2 -10 25 -15 -19 20 -29 -5 31 -35 -6
3983 -6 38 -41 -5 42 -58 -10 40 -74 27 57 -80 36 65 -87 40 72 -102 61 74 -111 74 73 -114 84 69
4008 69 -133 89 57 -150 116 56 -159 111 42 -162 138 38 -176 152 14 -202 164 15 -189 193 -10
4029 -10 -180 206 -24 -187 221 -42 -186 243 -57 -174 263 -78 -170 277 -102 -164 286 -111 -144 306 -145
4050 -145 -139 313 -166 -121 323 -192 -109 329 -217 -103 322 -252 -81 332 -267 -75 328 -301 -62 342 -302
4071 -302 -26 343 -332 7 336 -342 32 327 -375 60 331 -374 90 312 -395 111 311 -412 142 273
4091 273 -419 176 263 -436 200 234 -435 224 195 -442 252 188 -444 288 152 -458 298 127 -448 331 95
4112 95 -442 347 67 -445 385 39 -426 402 15 -423 429 -9 -415 447 -41 -385 468 -78 -375 469
4132 469 -104 -363 484 -136 -342 495 -181 -325 502 -208 -284 505 -242 -259 498 -270 -232 493 -299 -198 491
4153 491 -326 -162 492 -332 -129 473 -366 -97 462 -383 -61 443 -397 -21 436 -406 10 425 -416 32
4173 32 410 -430 68 389 -445 87 372 -451 111 346 -468 133 316 -465 167 291 -467 187 276 -476 203
4194 203 240 -471 234 204 -458 254 185 -448 282 156 -436 302 125 -414 315 87 -381 332 62 -365 334
4215 334 31 -348 356 4 -321 356 -25 -309 356 -54 -299 357 -73 -285 354 -96 -255 341 -118 -242
4235 -242 347 -130 -225 338 -153 -200 337 -155 -170 325 -162 -142 320 -178 -121 311 -191 -97 294 -203 -75 286
4257 286 -204 -57 267 -207 -33 249 -227 -26 229 -199 -3 213 -212 11 187 -216 34 169 -204 30
4277 30 155 -209 39 135 -194 56 127 -177 58 117 -164 76 109 -161 87 94 -150 86 91 -144 98 64 -125
4300 -125 105 56 -125 100 51 -133 95 41 -112 78 18 -104 70 18 -94 80 17 -87 63 -8 -75 61 -13
4323 -13 -67 50 -4 -55 46 -11 -48 49 1 -22 40 2 -16 42 5 -11 36 5 -9 27 11 -9 19 4 -5 12 27 -13 -3 16
4353 16 -19 -10 10 -23 -6 19 -27 -18 18 -23 -19 35 -24 -18 40 -28 -12 33 -20 -12 55 -20 -13 56 -22 -15 55 -31 -7 58 -33 3 72 -35
4387 -35 -4 60 -40 -8 56 -49 -9 64 -56 -4 56 -62 -11 49 -79 0 56 -78 3 56 -77 7 45 -71 18 47
4413 47 -63 20 47 -63 33 55 -65 45 45 -69 43 41 -61 46 38 -63 52 36 -66 53 9 -65 48 9 -61
4438 -61 40 6 -65 39 -3 -59 38 4 -61 36 -7 -53 39 -16 -50 41 -14 -33 42 -16 -20 39 -15 -15 47 -13 -11 36 -14 -16 19
4469 19 -15 8 22 -20 -2 17 -17 14 6 -23 0 -16 -27 12 -7 -4 25 -13 -6 20 -33 -2 8 -32 -4 18 -41 8 23 -44 23 16
4501 16 -42 32 22 -47 34 17 -51 54 14 -52 68 12 -59 63 -8 -70 72 -13 -65 82 -19 -86 87 -29 -73 100
4527 100 -40 -82 112 -47 -82 121 -54 -84 131 -70 -66 134 -92 -63 157 -91 -49 164 -96 -43 167 -110 -31
4550 -31 174 -124 -20 167 -135 -13 163 -150 5 175 -163 10 166 -184 22 151 -200 38 140 -211
4570 -211 48 144 -222 66 144 -228 92 129 -235 107 130 -246 120 123 -256 157 115 -255 172 95 -257 180 98
4593 98 -264 197 67 -270 215 52 -275 228 39 -262 237 0 -259 258 -7 -263 277 -29 -248 275
4613 275 -64 -241 283 -76 -229 296 -94 -219 307 -100 -199 317 -127 -169 317 -152 -159 332 -166 -143 336 -190
4635 -190 -134 333 -204 -114 338 -216 -85 329 -240 -69 330 -261 -54 336 -285 -30 316 -307 -17 306 -324
4656 -324 -1 301 -311 30 292 -330 53 274 -349 83 258 -332 105 245 -335 127 228 -336 163 210
4676 210 -329 171 184 -330 200 156 -330 203 135 -331 214 114 -329 227 92 -318 235 70 -324 249 42
4697 42 -309 271 30 -301 282 20 -285 286 -10 -263 292 -41 -250 300 -60 -238 316 -62 -221 313
4717 313 -81 -193 313 -94 -174 307 -118 -161 295 -142 -134 298 -159 -124 273 -168 -105 261 -191 -100 253 -196
4739 -196 -82 244 -182 -54 238 -205 -40 231 -201 -13 227 -205 -4 221 -194 23 208 -207 26 192
4759 192 -201 41 179 -205 45 170 -209 58 147 -218 69 135 -218 80 104 -198 85 108 -191 86 84 -185
4781 -185 97 65 -184 97 49 -170 103 45 -156 102 27 -142 112 35 -130 108 22 -111 109 35 -107 97
4803 97 12 -97 106 9 -91 97 0 -95 97 -7 -84 84 -16 -80 88 -24 -80 87 -27 -73 54 -21 -59 70
4827 70 -22 -51 76 -20 -41 57 -9 -34 51 -21 -24 57 -10 -16 51 -9 -21 57 -13 -12 47 -5 -18 26 -8 -24 16 -14 -26 8 -8
4858 -8 -36 14 -2 -32 1 -5 -34 14 10 -39 -1 7 -39 15 8 -26 6 17 -31 15 7 -24 26 14 -31 20 17 -42 34 16 -39 19 39 -38
4892 -38 23 31 -36 22 23 -42 28 18 -52 11 15 -71 27 23 -75 29 3 -71 27 0 -63 29 -1 -54 38 -3 -46 46 3 -49 46 -1
4924 -1 -45 54 -2 -48 51 -6 -42 58 -13 -36 57 -25 -42 50 -19 -32 38 -34 -24 60 -22 -32 46 -43 -39 55 -44 -21 43 -42 -18
4955 -18 47 -37 -14 38 -31 -2 51 -29 9 38 -34 11 30 -24 16 36 -28 24 19 -35 20 19 -27 15 11 -26 15 -5 -32 14 -8 -25
4987 -25 14 -8 -19 18 -15 -29 20 -26 -7 18 -24 -6 16 -23 -3 16 -35 10 13 -30 27 21 -35 33 19 -29 46 11 -43 39 0
5018 0 -37 37 -2 -35 43 -18 -39 52 -28 -38 46 -37 -52 63 -43 -49 67 -47 -31 67 -54 -33 75 -66 -10 95 -75
5045 -75 1 88 -82 -7 103 -94 5 80 -91 18 101 -110 29 99 -116 34 93 -125 41 95 -139 58 75 -143
5069 -143 69 57 -153 70 56 -150 73 50 -158 97 39 -165 106 36 -157 117 28 -157 131 32 -152 149
5091 149 15 -153 162 5 -143 167 -17 -147 166 -30 -146 185 -53 -144 198 -53 -148 195 -73 -143 206
5112 206 -86 -131 211 -109 -114 215 -127 -112 212 -138 -95 220 -146 -82 229 -166 -58 228 -167 -37 219 -169
5134 -169 -23 230 -187 -4 210 -190 2 215 -204 20 201 -212 25 187 -230 32 181 -242 48 171
5154 171 -255 68 159 -253 92 144 -262 111 138 -264 128 133 -265 146 119 -278 149 101 -267 166 76 -262 202
5177 202 83 -254 212 62 -245 211 40 -238 217 22 -229 212 -4 -220 220 -30 -219 221 -40 -207
5197 -207 223 -53 -187 235 -85 -176 233 -89 -164 242 -98 -154 245 -103 -134 247 -107 -118 239 -128 -104 243
5219 243 -149 -95 233 -146 -76 238 -167 -54 236 -183 -52 223 -183 -37 203 -185 -26 195 -202 -7 185
5240 185 -201 -11 171 -196 6 152 -207 36 148 -201 40 142 -197 60 121 -195 61 117 -187 74 102
5261 102 -177 86 94 -179 89 83 -172 103 72 -175 112 60 -162 104 40 -164 105 31 -162 121 17 -158 114
5284 114 14 -147 113 2 -135 111 -4 -120 118 -8 -123 118 -19 -101 125 -2 -82 126 -22 -78 119
5305 119 -16 -62 97 -19 -56 101 -34 -70 93 -34 -67 89 -37 -42 80 -42 -54 71 -36 -36 73 -43 -39 69
5329 69 -49 -36 63 -52 -31 62 -49 -24 61 -37 -18 67 -29 -11 63 -36 -9 48 -35 -5 61 -33 -1 55 -27 0 41 -33 -15
5358 -15 31 -30 -25 36 -27 -21 23 -24 -28 32 -23 -21 37 -13 -22 32 -24 -15 30 -6 -9 28 -2 -20 36 -3 -15 39 -5 -22 42 -14 -13 47
5392 47 -9 -15 44 -16 -19 47 -14 -22 40 -29 -20 39 -22 -34 21 -29 -36 43 -26 -33 38 -18 -25 42 -26 -32 39 -32 -20 55 -21 -2 61 -22
5426 -22 -8 58 -33 -11 62 -40 0 50 -35 -4 53 -39 -7 45 -47 2 45 -46 -3 44 -59 -1 35 -56 3 33 -59 5 25
5455 25 -43 21 30 -50 16 16 -59 27 12 -35 35 10 -46 30 17 -45 36 14 -32 44 11 -26 43 5 -31 37 0 -24 47 -14 -36
5486 -36 38 -13 -24 33 -29 -25 39 -28 -14 35 -26 0 30 -31 6 28 -25 13 27 -41 18 24 -27 19 17 -29 35 24 -38 30 19 -34
5518 -34 49 9 -25 42 -1 -30 47 -18 -42 47 -19 -25 48 -32 -36 42 -45 -25 51 -54 -19 47 -39 -1 63 -43 -10 61 -61 -3
5548 -3 58 -68 16 61 -62 20 64 -72 31 59 -77 43 56 -84 34 45 -85 57 39 -92 66 38 -106 71
5572 71 19 -105 89 15 -106 92 8 -108 97 -8 -114 101 -17 -112 109 -23 -93 126 -21 -90 130 -45
5594 -45 -86 141 -46 -80 142 -50 -74 146 -70 -78 152 -83 -71 160 -94 -56 154 -107 -49 154 -120 -47 142
5617 142 -130 -42 153 -131 -24 154 -150 -9 149 -167 0 146 -168 10 153 -167 42 138 -194 62 142
5638 142 -180 76 133 -178 90 124 -190 95 117 -191 98 99 -198 106 91 -208 110 70 -210 130 58 -195 145
5661 145 37 -201 144 28 -188 162 20 -194 180 0 -183 186 -5 -166 199 -13 -177 197 -34 -159
5681 -159 214 -50 -152 220 -52 -128 224 -80 -136 227 -90 -115 220 -97 -111 221 -125 -108 205 -141 -84 203
5703 203 -144 -76 199 -153 -48 198 -151 -40 201 -162 -31 192 -162 -10 191 -160 15 180 -178 27
5723 27 170 -183 26 167 -194 44 148 -185 52 143 -198 62 125 -188 87 114 -197 86 93 -206 104 92
5745 92 -195 107 77 -199 99 70 -179 126 53 -185 134 56 -164 143 35 -160 146 27 -147 146 14 -142
5767 -142 151 -2 -132 146 -10 -130 146 -11 -119 144 -21 -117 137 -34 -115 140 -48 -100 141 -53 -82
5788 -82 128 -65 -88 123 -62 -71 132 -80 -67 123 -75 -55 127 -83 -40 123 -77 -25 123 -74 -15 117 -76
5811 -76 -4 108 -82 -3 96 -82 0 97 -85 -7 73 -80 -12 72 -85 9 64 -71 17 63 -83 5 60 -86 12 39
5837 39 -76 6 45 -72 7 49 -64 18 46 -64 25 41 -56 24 45 -52 29 39 -51 33 36 -43 25 28 -48 19 17 -58 18 8
5867 8 -49 10 17 -49 19 7 -45 14 10 -47 13 19 -41 4 22 -29 9 25 -28 14 10 -28 13 27 -25 10 25 -34 9 15 -32 8 27
5900 27 -34 11 23 -30 7 16 -31 0 18 -45 13 23 -38 3 12 -48 -2 6 -36 11 15 -36 13 19 -36 19 24 -29 15 35 -24 28 32 -29
5934 -29 33 30 -32 29 17 -32 30 21 -37 32 13 -43 28 6 -29 45 15 -37 30 -11 -49 35 -10 -27 34 -11 -37 31 -7 -33 40
5965 40 -10 -36 33 -19 -15 41 -10 -19 46 -2 -9 36 -21 7 44 -17 -9 44 -23 3 33 -25 1 28 -31 -4 32 -33 -2 28 -33 1
5997 1 7 -33 4 20 -36 10 22 -29 17 16 -37 24 11 -22 27 1 -15 32 12 -16 45 8 -15 26 0 -10 42 -17 -4 33 -14 -5
6029 -5 37 -25 -10 32 -33 0 31 -38 8 23 -41 -3 33 -46 20 19 -38 29 27 -37 30 27 -45 42 33 -45 41 15 -57 43 14 -36
6061 -36 45 5 -39 59 -3 -50 57 2 -53 67 -20 -47 74 -18 -43 70 -30 -63 76 -46 -51 78 -49 -44 77 -55
6087 -55 -36 82 -73 -32 82 -60 -28 89 -78 -12 98 -74 4 110 -77 3 99 -81 21 98 -102 18 93
6110 93 -102 27 79 -105 26 79 -114 35 73 -112 45 70 -125 55 58 -127 63 54 -133 67 45 -129 90
6133 90 47 -122 87 35 -118 118 37 -112 113 19 -115 119 10 -115 137 -2 -118 134 -11 -115 145 -24
6155 -24 -113 136 -50 -117 149 -48 -101 150 -68 -98 150 -72 -88 148 -79 -85 146 -77 -80 158 -90 -46 163 -99
6179 -99 -39 162 -123 -35 146 -103 -25 148 -122 -11 151 -123 1 151 -123 8 138 -144 18 128 -149
6200 -149 19 106 -165 31 112 -168 37 97 -166 56 96 -178 64 94 -163 81 85 -165 87 74 -153 90 64
6223 64 -146 107 61 -144 105 49 -147 116 49 -139 123 22 -146 116 28 -136 134 4 -132 121 -6 -123
6245 -123 133 -14 -123 132 -23 -101 131 -41 -100 127 -49 -98 146 -46 -89 144 -54 -76 146 -57 -54 138
6267 138 -59 -49 144 -66 -37 136 -78 -46 135 -76 -31 122 -91 -30 105 -100 -17 108 -97 -27 105 -95
6289 -95 -16 105 -85 -5 86 -92 12 95 -92 18 84 -89 17 77 -90 30 76 -81 30 69 -90 51 69
6312 69 -79 37 52 -84 39 48 -81 48 46 -78 46 36 -89 44 20 -85 43 21 -75 42 19 -81 39 13
6336 13 -70 49 8 -70 44 12 -48 54 19 -49 40 13 -49 51 10 -46 47 5 -39 52 12 -44 52 5 -35 50 5 -22
6364 -22 52 4 -33 38 -9 -38 34 -12 -32 34 -16 -32 18 -17 -39 31 -9 -23 33 -11 -24 27 -5 -21 39 2 -8 31 7 -9
6394 -9 41 6 -13 36 1 -15 16 -5 -26 34 -5 -17 28 2 -25 20 -17 -27 17 -7 -27 17 -8 -28 16 -14 -33 18 -11 -33 20
6425 20 -4 -24 29 -7 -21 33 -2 -12 28 -7 -21 45 5 -20 31 -2 -19 35 -9 -19 32 -8 -19 28 -11 -20 24 -16 -28 30 -13
6456 -13 -24 25 -36 -15 26 -27 -18 18 -36 -16 27 -26 -4 27 -32 -18 22 -26 5 22 -22 11 41 -29 10 29 -28 4 23 -23 25
6487 25 30 -35 18 21 -32 11 14 -25 11 -3 -34 7 4 -38 -2 5 -28 17 3 -31 28 5 -32 28 -2 -23 24 -3 -10 25 4 -5 34 -14
6521 -14 -11 35 -15 -3 31 -13 -6 29 -19 -12 25 -20 -2 27 -32 0 20 -28 4 10 -36 2 12 -39 5 0 -34 16 19 -32 25 9 -35
6554 -35 41 12 -26 39 -1 -20 35 5 -30 42 0 -26 39 -10 -28 37 -18 -19 47 -30 -21 48 -28 -25 46 -37 -16 39 -43 -18 38 -54
6586 -54 -5 43 -54 -21 39 -49 -4 49 -53 5 48 -60 9 49 -44 19 48 -62 28 44 -49 43 52 -63 40 40 -68 41
6614 41 25 -70 48 18 -75 57 14 -79 53 6 -77 50 9 -66 61 -4 -69 74 -10 -80 63 -9 -80 83 -18 -73
6640 -73 88 -10 -61 98 -24 -49 99 -17 -46 104 -38 -52 91 -39 -36 98 -50 -48 94 -77 -27 83 -76 -27
6664 -27 79 -76 -32 95 -76 -24 86 -89 -20 89 -92 -11 95 -93 4 90 -94 10 98 -97 20 81 -99
6687 -99 25 74 -94 37 78 -93 36 67 -99 39 65 -100 51 63 -109 52 44 -112 56 40 -111 51 28
6710 28 -112 58 23 -122 76 11 -105 75 4 -100 88 11 -101 91 7 -82 97 14 -85 101 -8 -75 104
6733 104 -24 -76 109 -17 -70 102 -31 -69 112 -36 -58 89 -42 -66 101 -50 -71 94 -74 -46 97 -60
6755 -60 -57 94 -60 -39 95 -60 -32 87 -65 -21 92 -66 -12 90 -71 2 96 -64 2 88 -67 10 89 -82
6779 -82 3 74 -80 12 68 -86 1 59 -85 22 50 -88 9 42 -85 25 40 -78 33 41 -82 42 37 -74 36
6804 36 32 -77 39 44 -69 48 25 -60 37 30 -53 55 33 -62 48 24 -56 46 22 -56 48 13 -63 51 4 -49 53
6831 53 -8 -54 43 -12 -53 34 -1 -54 45 -11 -40 47 -1 -44 50 -4 -34 46 -3 -34 46 -3 -27 51 -8 -26 38 -5 -27 47
6861 47 -14 -14 42 -20 -24 32 -14 -25 34 -20 -31 33 -16 -29 25 -23 -28 30 -19 -14 26 -20 -18 20 -9 -17 29 -4 -4 38 -11 -7 30 -11
6895 -11 -4 38 -1 6 42 -8 1 36 -8 -7 18 -13 -12 37 -12 -16 22 -25 -13 26 -20 -20 14 -25 -29 15 -25 -22 27 -23 -16 22 -22 -13 27 -22
6931 -22 -2 26 -19 -13 28 -19 -7 45 -4 -1 38 -17 -4 26 -16 -1 27 -22 2 24 -25 4 22 -20 0 24 -27 -7 14 -33 -3
6962 -3 23 -33 6 9 -23 7 16 -41 4 17 -35 19 29 -27 25 21 -27 20 14 -21 27 24 -26 22 14 -7 10 13 -26 25 12 -22 16 -6
6996 -6 -32 23 -2 -24 21 -11 -27 13 -8 -37 7 -10 -26 23 -13 -34 33 -10 -15 20 -5 -5 38 -12 -10 36 -3 -2 29 -17 -9 32 -11
7029 -11 6 41 -11 -1 21 -25 -3 8 -26 4 16 -20 -2 17 -31 12 12 -27 16 1 -31 1 0 -25 24 9 -31 20 -3 -22 21
7060 21 11 -21 23 -4 -11 38 -5 -16 32 -6 -20 36 -19 -13 24 -14 -21 26 -12 -19 34 -18 -9 24 -22 -13 28 -27 -10 32 -50 1 36
7093 36 -37 0 31 -30 2 28 -34 13 41 -34 25 35 -34 24 29 -33 33 22 -31 37 23 -42 39 22 -42 32 13 -44 39 -1 -62
7124 -62 27 -10 -40 37 -5 -37 58 -16 -41 42 -16 -41 55 -16 -39 52 -30 -34 62 -18 -30 56 -31 -27 66 -21 -14 69 -27 -14 65 -26
7156 -26 -14 66 -37 -15 68 -43 -11 56 -44 -21 50 -58 -15 61 -62 1 51 -64 5 51 -56 11 45 -66 26 45
7182 45 -67 21 53 -68 24 44 -62 38 39 -59 49 32 -68 53 32 -62 44 21 -60 48 18 -67 56 12 -77 51
7208 51 8 -68 50 -4 -66 46 -5 -69 61 -2 -69 61 -14 -60 65 -19 -56 74 -4 -40 82 -8 -34 77 -12 -40
7234 -40 82 -29 -41 86 -36 -33 72 -46 -25 69 -44 -29 65 -45 -13 74 -54 -17 63 -59 -21 67 -52 -11 65
7259 65 -59 -4 57 -54 -4 57 -61 -4 55 -47 11 62 -61 9 49 -53 25 53 -54 22 47 -55 32 46 -59 22
7285 22 42 -63 21 33 -65 17 18 -68 29 27 -64 32 8 -59 33 5 -53 35 14 -50 36 8 -53 47 7 -50 48 6 -38 38
7315 38 11 -38 47 17 -35 56 1 -30 53 -1 -38 43 -4 -33 43 -10 -36 37 -10 -37 38 -27 -42 35 -27 -46 34 -22 -30 35 -20
7346 -20 -32 39 -17 -17 39 -16 -19 47 -15 -17 33 -25 -17 42 -15 -11 36 -30 -16 26 -22 -10 33 -21 -7 30 -15 -1 29 -21 -13 21 -33
7379 -33 -14 16 -31 -14 12 -27 -6 1 -20 -10 12 -27 2 22 -24 0 23 -22 9 36 -18 12 23 -15 4 27 -17 3 15 -22 0
7410 0 18 -22 -10 12 -25 3 5 -29 -6 8 -27 -2 12 -26 -1 7 -31 -2 19 -29 4 15 -28 -6 6 -19 3 5 -19 7 23 -21
7442 -21 15 25 -17 27 17 -11 14 14 -24 9 9 -19 11 10 -23 1 15 -29 10 -4 -26 6 1 -27 21 12 -19 9 10 -21 15 0 -23
7475 -23 25 2 -17 20 0 -15 23 4 -15 19 2 -10 26 -3 -26 23 8 -7 25 1 -11 11 2 -16 21 -18 -21 8 -22 -16 17 -34
7507 -34 -18 13 -21 -10 18 -23 -20 29 -24 -2 43 -16 -5 22 -15 4 25 -20 9 24 -25 12 18 -11 15 20 -15 17 21 -25 6 11 -37
7540 -37 1 7 -22 -1 0 -22 12 -4 -35 16 -1 -13 12 -13 -26 10 -3 -26 10 -14 -8 17 -8 -12 25 -4 0 18 -10 -4 37 -10 -15 28
7574 28 -11 -3 27 -22 -14 18 -22 -8 12 -22 -1 16 -30 1 10 -27 -7 8 -20 4 13 -35 2 -4 -28 9 14 -17 24 5 -19 16 2
7607 2 -12 31 16 -19 22 9 -18 31 6 -31 27 3 -23 30 -2 -31 22 -7 -31 21 -9 -29 18 -19 -25 19 -14 -22 28 -15 -17 35
7639 35 -18 -11 38 -26 -6 31 -25 -18 39 -23 3 42 -16 2 44 -28 5 31 -23 -2 37 -27 11 42 -38 7 33 -45 14 41 -45
7670 -45 3 32 -38 5 20 -52 13 29 -40 22 25 -48 20 20 -44 27 24 -40 28 23 -38 39 15 -39 47 15 -37 43 8 -35 48 2
7702 2 -36 40 -12 -34 48 -2 -43 41 -20 -29 33 -20 -44 35 -26 -41 34 -25 -23 42 -27 -37 42 -28 -32 53 -23 -22 43 -22 -4 51 -22
7735 -22 -12 50 -28 -9 49 -27 -13 53 -32 14 52 -34 -2 44 -51 5 40 -44 1 41 -56 -7 30 -59 5 26 -49 11 27 -44
7765 -44 15 39 -45 15 19 -40 18 28 -39 24 28 -41 33 25 -42 35 30 -48 30 25 -45 35 12 -44 32 9 -54 39 0 -54 24 -3 -49
7798 -49 40 3 -52 24 -5 -50 21 -4 -34 30 -7 -30 42 -5 -21 42 -6 -17 50 -11 -14 37 -14 -12 42 -21 -24 49 -7 -19 47 -22
7830 -22 -20 29 -17 -17 21 -31 -21 30 -21 -22 29 -33 -25 17 -40 -22 28 -30 -17 22 -19 -8 38 -19 4 34 -16 8 40 -31 0 38
7862 38 -27 6 37 -23 5 30 -29 0 31 -25 2 23 -34 4 21 -36 -3 9 -25 4 7 -30 1 18 -28 7 10 -33 9 11 -29 9
7894 9 25 -22 8 21 -20 20 20 -11 26 19 -17 15 25 -28 23 25 -13 15 9 -19 14 4 -36 14 2 -31 7 -7 -24 4 -2 -27 6
7927 6 -12 -29 -2 1 -25 8 3 -26 16 -1 -24 11 -4 -7 20 11 -7 24 3 -18 34 0 -12 26 11 -12 34 3 -20 18 -2 -12 14
7960 14 -18 -27 15 -9 -24 9 -20 -27 4 -15 -17 15 -9 -10 17 -4 -21 15 -11 -11 19 1 3 31 -10 6 30 -16 -7 22 -12 -11 21 -15
7994 -15 2 25 -12 -2 16 -23 -8 15 -33 -3 21 -15 -15 10 -19 -16 5 -26 -9 8 -32 -4 9 -20 6 3 -26 10 21 -18 16 21
8026 21 -20 17 14 -17 10 18 -14 16 11 -29 14 11 -24 17 0 -26 13 5 -21 3 -5 -26 9 -11 -35 15 -12 -22 20 -9 -11 17 -11 -15
8060 -15 8 -7 -9 16 -16 -16 16 -14 -5 28 -6 -6 33 -14 9 18 -11 -1 23 -20 7 15 -18 4 11 -24 -2 -1 -25 2 7 -35 6 14 -36
8095 -36 2 9 -28 13 13 -25 14 6 -33 26 8 -29 19 12 -31 9 1 -16 21 1 -26 28 -1 -14 38 -2 -21 28 1 -21 34 -4 -19
8128 -19 27 -20 -17 27 -21 -32 21 -27 -24 17 -27 -16 25 -21 -9 33 -21 -7 48 -27 3 44 -27 0 33 -27 11 37 -21 12 34
8159 34 -29 18 30 -42 17 23 -31 16 37 -26 27 22 -42 13 16 -47 18 10 -61 11 1 -40 24 7 -44 17 5 -40 41 9 -28 51
8191E1
##END NTUPLES=NMR FID
##END=
